{
    "vod": [
        {
            "id": "BjM2I3YzE6ffG9JnS_01xEG_-6CDW6Xs",
            "contentId": 928798,
            "title": "Rd 22: Sea Eagles v Roosters (Hls)",
            "description": "Highlights of the Round 22 clash between the Sea Eagles & Roosters",
            "publishDate": "2017-08-06T16:03:00+10:00",
            "publisher": "NRL Chief",
            "thumbnailUrl": "http://bpvideos.telstra.insnw.net/web/images/20170806160238a_89x50.jpg",
            "largeThumbnailUrl": "http://bpvideos.telstra.insnw.net/web/images/20170806160238a_326x184.jpg",
            "programType": "Highlights",
            "programCategory": "Match",
            "priority": null,
            "lastUpdateDate": "2017-08-06T16:09:35+10:00",
            "isPremium": false,
            "club": [
                500002,
                500001
            ]
        },
        {
            "id": "FjZGI3YzE6TCHUo1j_KQAOuQfin9V5ix",
            "contentId": 928801,
            "title": "Rd 22 Press Conference: Roosters",
            "description": "Roosters coach Trent Robinson speaks with the media following his side's Round 22 clash",
            "publishDate": "2017-08-06T16:46:00+10:00",
            "publisher": "NRL Chief",
            "thumbnailUrl": "http://bpvideos.telstra.insnw.net/web/images/20170806163202a_89x50.jpg",
            "largeThumbnailUrl": "http://bpvideos.telstra.insnw.net/web/images/20170806163202a_326x184.jpg",
            "programType": "Press Conference",
            "programCategory": null,
            "priority": null,
            "lastUpdateDate": "2017-08-06T16:51:44+10:00",
            "isPremium": false,
            "club": [
                500002,
                500001
            ]
        },
        {
            "id": "BxYmI3YzE6JJvQ9K3Ot6fdX3tga8nLOj",
            "contentId": 928800,
            "title": "Rd 22 Press Conference: Sea Eagles",
            "description": "Sea Eagles coach Trent Barrett speaks with the media following his side's Round 22 clash",
            "publishDate": "2017-08-06T16:38:00+10:00",
            "publisher": "NRL Chief",
            "thumbnailUrl": "http://bpvideos.telstra.insnw.net/web/images/20170806162934a_89x50.jpg",
            "largeThumbnailUrl": "http://bpvideos.telstra.insnw.net/web/images/20170806162934a_326x184.jpg",
            "programType": "Press Conference",
            "programCategory": null,
            "priority": null,
            "lastUpdateDate": "2017-08-06T16:43:42+10:00",
            "isPremium": false,
            "club": [
                500002,
                500001
            ]
        },
        {
            "id": "FkMmI3YzE6Oz85NZRfckNdgJKIYbcuVP",
            "contentId": 930226,
            "title": "Rd 22: GOAL Daly Cherry-Evans (80th min)",
            "description": "Daly Cherry-Evans adds a final two points after the siren",
            "publishDate": "2017-08-06T16:00:35+10:00",
            "publisher": "NRL Chief",
            "thumbnailUrl": "http://bpvideos.telstra.insnw.net/web/images/20170806155954a_89x50.jpg",
            "largeThumbnailUrl": "http://bpvideos.telstra.insnw.net/web/images/20170806155954a_326x184.jpg",
            "programType": "Instant Replay",
            "programCategory": "Score",
            "priority": null,
            "lastUpdateDate": "2017-08-06T16:04:34+10:00",
            "isPremium": true,
            "club": [
                500002,
                500001
            ]
        },
        {
            "id": "05MmI3YzE6GypRL2QU9xyYn6fPzlVenq",
            "contentId": 930225,
            "title": "Rd 22: TRY Daly Cherry-Evans (80th min)",
            "description": "Daly Cherry-Evans scores a spectacular try as the siren blows",
            "publishDate": "2017-08-06T15:59:08+10:00",
            "publisher": "NRL Chief",
            "thumbnailUrl": "http://bpvideos.telstra.insnw.net/web/images/20170806155913a_89x50.jpg",
            "largeThumbnailUrl": "http://bpvideos.telstra.insnw.net/web/images/20170806155913a_326x184.jpg",
            "programType": "Instant Replay",
            "programCategory": "Score",
            "priority": null,
            "lastUpdateDate": "2017-08-06T16:03:34+10:00",
            "isPremium": true,
            "club": [
                500002,
                500001
            ]
        },
        {
            "id": "E3MGI3YzE62yJoUeBrlnwsYpJC2Yy6Mj",
            "contentId": 930220,
            "title": "Rd 22: PENALTY GOAL Daly Cherry-Evans (74th min)",
            "description": "Daly Cherry-Evans extends the lead to two converted tries",
            "publishDate": "2017-08-06T15:50:08+10:00",
            "publisher": "NRL Chief",
            "thumbnailUrl": "http://bpvideos.telstra.insnw.net/web/images/20170806154938a_89x50.jpg",
            "largeThumbnailUrl": "http://bpvideos.telstra.insnw.net/web/images/20170806154938a_326x184.jpg",
            "programType": "Instant Replay",
            "programCategory": "Score",
            "priority": null,
            "lastUpdateDate": "2017-08-06T15:54:32+10:00",
            "isPremium": true,
            "club": [
                500002,
                500001
            ]
        },
        {
            "id": "w0eWE3YzE6wSOWYwof8CqGFcLH-vmxvF",
            "contentId": 930214,
            "title": "Rd 22: GOAL Matthew Wright (70th min)",
            "description": "Matthew Wright converts Parker's try",
            "publishDate": "2017-08-06T15:46:01+10:00",
            "publisher": "NRL Chief",
            "thumbnailUrl": "http://bpvideos.telstra.insnw.net/web/images/20170806154529a_89x50.jpg",
            "largeThumbnailUrl": "http://bpvideos.telstra.insnw.net/web/images/20170806154529a_326x184.jpg",
            "programType": "Instant Replay",
            "programCategory": "Score",
            "priority": null,
            "lastUpdateDate": "2017-08-06T15:49:30+10:00",
            "isPremium": true,
            "club": [
                500002,
                500001
            ]
        },
        {
            "id": "gweWE3YzE6bJgPsyEP1_6yPoiOWH1A5_",
            "contentId": 930213,
            "title": "Rd 22: TRY Brad Parker (69th min)",
            "description": "Brad Parker extends Manly's lead heading into the final ten minutes",
            "publishDate": "2017-08-06T15:44:35+10:00",
            "publisher": "NRL Chief",
            "thumbnailUrl": "http://bpvideos.telstra.insnw.net/web/images/20170806154337a_89x50.jpg",
            "largeThumbnailUrl": "http://bpvideos.telstra.insnw.net/web/images/20170806154337a_326x184.jpg",
            "programType": "Instant Replay",
            "programCategory": "Score",
            "priority": null,
            "lastUpdateDate": "2017-08-06T15:49:30+10:00",
            "isPremium": true,
            "club": [
                500002,
                500001
            ]
        },
        {
            "id": "Rrc2E3YzE6_3Y79QIQAW5b4rI9TEJQDE",
            "contentId": 930211,
            "title": "Rd 22: GOAL Matthew Wright (55th min)",
            "description": "Matthew Wright converts Brown's try from in front",
            "publishDate": "2017-08-06T15:25:21+10:00",
            "publisher": "NRL Chief",
            "thumbnailUrl": "http://bpvideos.telstra.insnw.net/web/images/20170806152441a_89x50.jpg",
            "largeThumbnailUrl": "http://bpvideos.telstra.insnw.net/web/images/20170806152441a_326x184.jpg",
            "programType": "Instant Replay",
            "programCategory": "Score",
            "priority": null,
            "lastUpdateDate": "2017-08-06T15:29:25+10:00",
            "isPremium": true,
            "club": [
                500002,
                500001
            ]
        },
        {
            "id": "Njc2E3YzE61uEAITEEHH94N437ObF27r",
            "contentId": 930210,
            "title": "Rd 22: TRY Lewis Brown (55th min)",
            "description": "Lewis Brown puts the ball down under the posts",
            "publishDate": "2017-08-06T15:24:18+10:00",
            "publisher": "NRL Chief",
            "thumbnailUrl": "http://bpvideos.telstra.insnw.net/web/images/20170806152355a_89x50.jpg",
            "largeThumbnailUrl": "http://bpvideos.telstra.insnw.net/web/images/20170806152355a_326x184.jpg",
            "programType": "Instant Replay",
            "programCategory": "Score",
            "priority": null,
            "lastUpdateDate": "2017-08-06T15:28:25+10:00",
            "isPremium": true,
            "club": [
                500002,
                500001
            ]
        },
        {
            "id": "Ntb2E3YzE6vAyMxJYlK6n6KE-Fal33fa",
            "contentId": 930205,
            "title": "Rd 22: GOAL Matthew Wright (49th min)",
            "description": "Matthew Wright reduces the Manly deficit to two",
            "publishDate": "2017-08-06T15:16:14+10:00",
            "publisher": "NRL Chief",
            "thumbnailUrl": "http://bpvideos.telstra.insnw.net/web/images/20170806151605a_89x50.jpg",
            "largeThumbnailUrl": "http://bpvideos.telstra.insnw.net/web/images/20170806151605a_326x184.jpg",
            "programType": "Instant Replay",
            "programCategory": "Score",
            "priority": null,
            "lastUpdateDate": "2017-08-06T15:20:23+10:00",
            "isPremium": true,
            "club": [
                500002,
                500001
            ]
        },
        {
            "id": "Brb2E3YzE6R35dnhXHIVgPDPnQKZz4qa",
            "contentId": 930203,
            "title": "Rd 22: TRY Tom Trbojevic (47th min)",
            "description": "Tom Trbojevic gives Manly first points of the second half",
            "publishDate": "2017-08-06T15:15:13+10:00",
            "publisher": "NRL Chief",
            "thumbnailUrl": "http://bpvideos.telstra.insnw.net/web/images/20170806151544a_89x50.jpg",
            "largeThumbnailUrl": "http://bpvideos.telstra.insnw.net/web/images/20170806151544a_326x184.jpg",
            "programType": "Instant Replay",
            "programCategory": "Score",
            "priority": null,
            "lastUpdateDate": "2017-08-06T15:19:23+10:00",
            "isPremium": true,
            "club": [
                500002,
                500001
            ]
        },
        {
            "id": "ptaWE3YzE6p4pDBwALYGTeTpS2VvS0N6",
            "contentId": 930201,
            "title": "Rd 22: GOAL Matthew Wright (39th min)",
            "description": "Matthew Wright converts Manly's first goal of the afternoon",
            "publishDate": "2017-08-06T14:52:57+10:00",
            "publisher": "NRL Chief",
            "thumbnailUrl": "http://bpvideos.telstra.insnw.net/web/images/20170806145142a_89x50.jpg",
            "largeThumbnailUrl": "http://bpvideos.telstra.insnw.net/web/images/20170806145142a_326x184.jpg",
            "programType": "Instant Replay",
            "programCategory": "Score",
            "priority": null,
            "lastUpdateDate": "2017-08-06T14:56:18+10:00",
            "isPremium": true,
            "club": [
                500002,
                500001
            ]
        },
        {
            "id": "U4aWE3YzE6-nqBAbDef2pRciXs_UpFZL",
            "contentId": 930199,
            "title": "Rd 22: TRY Tom Trbojevic (38th min)",
            "description": "Tom Trbojevic puts it down under the posts and reduces Manly's deficit",
            "publishDate": "2017-08-06T14:49:52+10:00",
            "publisher": "NRL Chief",
            "thumbnailUrl": "http://bpvideos.telstra.insnw.net/web/images/20170806144955a_89x50.jpg",
            "largeThumbnailUrl": "http://bpvideos.telstra.insnw.net/web/images/20170806144955a_326x184.jpg",
            "programType": "Instant Replay",
            "programCategory": "Score",
            "priority": null,
            "lastUpdateDate": "2017-08-06T14:54:18+10:00",
            "isPremium": true,
            "club": [
                500002,
                500001
            ]
        },
        {
            "id": "gyZ2E3YzE6O1xEKztU1Rc8igprLZ5X0X",
            "contentId": 930196,
            "title": "Rd 22: GOAL Latrell Mitchell (32nd min)",
            "description": "Latrell Mitchell converts his third two pointer",
            "publishDate": "2017-08-06T14:42:22+10:00",
            "publisher": "NRL Chief",
            "thumbnailUrl": "http://bpvideos.telstra.insnw.net/web/images/20170806144243a_89x50.jpg",
            "largeThumbnailUrl": "http://bpvideos.telstra.insnw.net/web/images/20170806144243a_326x184.jpg",
            "programType": "Instant Replay",
            "programCategory": "Score",
            "priority": null,
            "lastUpdateDate": "2017-08-06T14:46:16+10:00",
            "isPremium": true,
            "club": [
                500002,
                500001
            ]
        },
        {
            "id": "ZyZmE3YzE6j6NPShlqvx-GP7q17pTHSS",
            "contentId": 930195,
            "title": "Rd 22: TRY Luke Keary (30th min)",
            "description": "Luke Keary collects a perfect pass to streak away for a try",
            "publishDate": "2017-08-06T14:41:54+10:00",
            "publisher": "NRL Chief",
            "thumbnailUrl": "http://bpvideos.telstra.insnw.net/web/images/20170806144134a_89x50.jpg",
            "largeThumbnailUrl": "http://bpvideos.telstra.insnw.net/web/images/20170806144134a_326x184.jpg",
            "programType": "Instant Replay",
            "programCategory": "Score",
            "priority": null,
            "lastUpdateDate": "2017-08-06T14:45:16+10:00",
            "isPremium": true,
            "club": [
                500002,
                500001
            ]
        },
        {
            "id": "x2ZGE3YzE6JJ-NNh3UDXN_cbdtfWOie_",
            "contentId": 930193,
            "title": "Rd 22: GOAL Latrell Mitchell (22nd min)",
            "description": "Latrell Mitchell converts his own try from in front",
            "publishDate": "2017-08-06T14:35:10+10:00",
            "publisher": "NRL Chief",
            "thumbnailUrl": "http://bpvideos.telstra.insnw.net/web/images/20170806143347a_89x50.jpg",
            "largeThumbnailUrl": "http://bpvideos.telstra.insnw.net/web/images/20170806143347a_326x184.jpg",
            "programType": "Instant Replay",
            "programCategory": "Score",
            "priority": null,
            "lastUpdateDate": "2017-08-06T14:38:14+10:00",
            "isPremium": true,
            "club": [
                500002,
                500001
            ]
        },
        {
            "id": "RqZGE3YzE6nymT010LT8BkEiH4-Vlbgb",
            "contentId": 930192,
            "title": "Rd 22: TRY Latrell Mitchell (21st min)",
            "description": "Latrell Mitchell strips the ball one on one for a try under the posts",
            "publishDate": "2017-08-06T14:34:32+10:00",
            "publisher": "NRL Chief",
            "thumbnailUrl": "http://bpvideos.telstra.insnw.net/web/images/20170806143301a_89x50.jpg",
            "largeThumbnailUrl": "http://bpvideos.telstra.insnw.net/web/images/20170806143301a_326x184.jpg",
            "programType": "Instant Replay",
            "programCategory": "Score",
            "priority": null,
            "lastUpdateDate": "2017-08-06T14:38:14+10:00",
            "isPremium": true,
            "club": [
                500002,
                500001
            ]
        },
        {
            "id": "JlY2E3YzE6T6FX5j8tgPBzgP49FAC67G",
            "contentId": 930188,
            "title": "Rd 22: GOAL Latrell Mitchell (19th min)",
            "description": "Latrell Mitchell converts the first Roosters try of the match",
            "publishDate": "2017-08-06T14:30:24+10:00",
            "publisher": "NRL Chief",
            "thumbnailUrl": "http://bpvideos.telstra.insnw.net/web/images/20170806143034a_89x50.jpg",
            "largeThumbnailUrl": "http://bpvideos.telstra.insnw.net/web/images/20170806143034a_326x184.jpg",
            "programType": "Instant Replay",
            "programCategory": "Score",
            "priority": null,
            "lastUpdateDate": "2017-08-06T14:34:13+10:00",
            "isPremium": true,
            "club": [
                500002,
                500001
            ]
        },
        {
            "id": "B5YWE3YzE6y1B3qZ20A9hWf21kYkAs97",
            "contentId": 930185,
            "title": "Rd 22: TRY Daniel Tupou (18th min)",
            "description": "Daniel Tupou flirts with the dead ball line and scores the first Roosters try",
            "publishDate": "2017-08-06T14:28:07+10:00",
            "publisher": "NRL Chief",
            "thumbnailUrl": "http://bpvideos.telstra.insnw.net/web/images/20170806142816a_89x50.jpg",
            "largeThumbnailUrl": "http://bpvideos.telstra.insnw.net/web/images/20170806142816a_326x184.jpg",
            "programType": "Instant Replay",
            "programCategory": "Score",
            "priority": null,
            "lastUpdateDate": "2017-08-06T14:32:12+10:00",
            "isPremium": true,
            "club": [
                500002,
                500001
            ]
        },
        {
            "id": "c4OGE3YzE6Sre8ovTAsCD8wUJILu11od",
            "contentId": 930184,
            "title": "Rd 22: TRY Matthew Wright (9th min)",
            "description": "Matthew Wright makes the most of repeat sets to give Manly first points",
            "publishDate": "2017-08-06T14:18:07+10:00",
            "publisher": "NRL Chief",
            "thumbnailUrl": "http://bpvideos.telstra.insnw.net/web/images/20170806141801a_89x50.jpg",
            "largeThumbnailUrl": "http://bpvideos.telstra.insnw.net/web/images/20170806141801a_326x184.jpg",
            "programType": "Instant Replay",
            "programCategory": "Score",
            "priority": null,
            "lastUpdateDate": "2017-08-06T14:23:10+10:00",
            "isPremium": true,
            "club": [
                500002,
                500001
            ]
        }
    ],
    "scores": [
        {
            "gameState": "First Half",
            "gameStateId": 3,
            "gameTime": "0:07:56",
            "gameSeconds": 476,
            "GameMinutes": "07:56",
            "playerId": 501025,
            "playerName": "Matthew Wright",
            "scoreMethod": "Try",
            "statEvent": "Try",
            "statId": 38,
            "statValue": 4,
            "vidRef": 16230,
            "homeScore": 4,
            "commentary": "Try by Matthew Wright",
            "tackleNum": 3,
            "teamId": 500002,
            "teamName": "Manly-Warringah Sea Eagles",
            "homeTeamAbbrv": "MAN",
            "awayTeamAbbrv": "SYD"
        },
        {
            "gameState": "First Half",
            "gameStateId": 3,
            "gameTime": "0:37:05",
            "gameSeconds": 2225,
            "GameMinutes": "37:05",
            "playerId": 501505,
            "playerName": "Tom Trbojevic",
            "scoreMethod": "Try",
            "statEvent": "Try",
            "statId": 38,
            "statValue": 4,
            "vidRef": 64069,
            "homeScore": 8,
            "awayScore": 18,
            "commentary": "Try by Tom Trbojevic",
            "tackleNum": 4,
            "teamId": 500002,
            "teamName": "Manly-Warringah Sea Eagles",
            "homeTeamAbbrv": "MAN",
            "awayTeamAbbrv": "SYD"
        },
        {
            "gameState": "First Half",
            "gameStateId": 3,
            "gameTime": "0:38:37",
            "gameSeconds": 2317,
            "GameMinutes": "38:37",
            "playerId": 501025,
            "playerName": "Matthew Wright",
            "scoreMethod": "Conversion",
            "statEvent": "Conversion-Made",
            "statId": 1,
            "statValue": 2,
            "vidRef": 66563,
            "homeScore": 10,
            "awayScore": 18,
            "commentary": "Conversion-Made by Matthew Wright",
            "tackleNum": -1,
            "teamId": 500002,
            "teamName": "Manly-Warringah Sea Eagles",
            "homeTeamAbbrv": "MAN",
            "awayTeamAbbrv": "SYD"
        },
        {
            "gameState": "Second Half",
            "gameStateId": 5,
            "gameTime": "0:46:42",
            "gameSeconds": 2802,
            "GameMinutes": "46:42",
            "playerId": 501505,
            "playerName": "Tom Trbojevic",
            "scoreMethod": "Try",
            "statEvent": "Try",
            "statId": 38,
            "statValue": 4,
            "vidRef": 80625,
            "homeScore": 14,
            "awayScore": 18,
            "commentary": "Try by Tom Trbojevic",
            "tackleNum": 5,
            "teamId": 500002,
            "teamName": "Manly-Warringah Sea Eagles",
            "homeTeamAbbrv": "MAN",
            "awayTeamAbbrv": "SYD"
        },
        {
            "gameState": "Second Half",
            "gameStateId": 5,
            "gameTime": "0:47:58",
            "gameSeconds": 2878,
            "GameMinutes": "47:58",
            "playerId": 501025,
            "playerName": "Matthew Wright",
            "scoreMethod": "Conversion",
            "statEvent": "Conversion-Made",
            "statId": 1,
            "statValue": 2,
            "vidRef": 82522,
            "homeScore": 16,
            "awayScore": 18,
            "commentary": "Conversion-Made by Matthew Wright",
            "tackleNum": -1,
            "teamId": 500002,
            "teamName": "Manly-Warringah Sea Eagles",
            "homeTeamAbbrv": "MAN",
            "awayTeamAbbrv": "SYD"
        },
        {
            "gameState": "Second Half",
            "gameStateId": 5,
            "gameTime": "0:53:44",
            "gameSeconds": 3224,
            "GameMinutes": "53:44",
            "playerId": 500341,
            "playerName": "Lewis Brown",
            "scoreMethod": "Try",
            "statEvent": "Try",
            "statId": 38,
            "statValue": 4,
            "vidRef": 92350,
            "homeScore": 20,
            "awayScore": 18,
            "commentary": "Try by Lewis Brown",
            "tackleNum": 4,
            "teamId": 500002,
            "teamName": "Manly-Warringah Sea Eagles",
            "homeTeamAbbrv": "MAN",
            "awayTeamAbbrv": "SYD"
        },
        {
            "gameState": "Second Half",
            "gameStateId": 5,
            "gameTime": "0:54:33",
            "gameSeconds": 3273,
            "GameMinutes": "54:33",
            "playerId": 501025,
            "playerName": "Matthew Wright",
            "scoreMethod": "Conversion",
            "statEvent": "Conversion-Made",
            "statId": 1,
            "statValue": 2,
            "vidRef": 96111,
            "homeScore": 22,
            "awayScore": 18,
            "commentary": "Conversion-Made by Matthew Wright",
            "tackleNum": -1,
            "teamId": 500002,
            "teamName": "Manly-Warringah Sea Eagles",
            "homeTeamAbbrv": "MAN",
            "awayTeamAbbrv": "SYD"
        },
        {
            "gameState": "Second Half",
            "gameStateId": 5,
            "gameTime": "1:08:13",
            "gameSeconds": 4093,
            "GameMinutes": "68:13",
            "playerId": 504226,
            "playerName": "Brad Parker",
            "scoreMethod": "Try",
            "statEvent": "Try",
            "statId": 38,
            "statValue": 4,
            "vidRef": 123748,
            "homeScore": 26,
            "awayScore": 18,
            "commentary": "Try by Brad Parker",
            "tackleNum": 4,
            "teamId": 500002,
            "teamName": "Manly-Warringah Sea Eagles",
            "homeTeamAbbrv": "MAN",
            "awayTeamAbbrv": "SYD"
        },
        {
            "gameState": "Second Half",
            "gameStateId": 5,
            "gameTime": "1:09:50",
            "gameSeconds": 4190,
            "GameMinutes": "69:50",
            "playerId": 501025,
            "playerName": "Matthew Wright",
            "scoreMethod": "Conversion",
            "statEvent": "Conversion-Made",
            "statId": 1,
            "statValue": 2,
            "vidRef": 126520,
            "homeScore": 28,
            "awayScore": 18,
            "commentary": "Conversion-Made by Matthew Wright",
            "tackleNum": -1,
            "teamId": 500002,
            "teamName": "Manly-Warringah Sea Eagles",
            "homeTeamAbbrv": "MAN",
            "awayTeamAbbrv": "SYD"
        },
        {
            "gameState": "Second Half",
            "gameStateId": 5,
            "gameTime": "1:13:41",
            "gameSeconds": 4421,
            "GameMinutes": "73:41",
            "playerId": 500024,
            "playerName": "Daly Cherry-Evans",
            "scoreMethod": "Penalty Goal",
            "statEvent": "Penalty Shot-Made",
            "statId": 67,
            "statValue": 2,
            "vidRef": 133188,
            "homeScore": 30,
            "awayScore": 18,
            "commentary": "Penalty Shot-Made by Daly Cherry-Evans",
            "tackleNum": -1,
            "teamId": 500002,
            "teamName": "Manly-Warringah Sea Eagles",
            "homeTeamAbbrv": "MAN",
            "awayTeamAbbrv": "SYD"
        },
        {
            "gameState": "Second Half",
            "gameStateId": 5,
            "gameTime": "1:19:40",
            "gameSeconds": 4780,
            "GameMinutes": "79:40",
            "playerId": 500024,
            "playerName": "Daly Cherry-Evans",
            "scoreMethod": "Try",
            "statEvent": "Try",
            "statId": 38,
            "statValue": 4,
            "vidRef": 144080,
            "homeScore": 34,
            "awayScore": 18,
            "commentary": "Try by Daly Cherry-Evans",
            "tackleNum": 1,
            "teamId": 500002,
            "teamName": "Manly-Warringah Sea Eagles",
            "homeTeamAbbrv": "MAN",
            "awayTeamAbbrv": "SYD"
        },
        {
            "gameState": "Second Half",
            "gameStateId": 5,
            "gameTime": "1:19:59",
            "gameSeconds": 4799,
            "GameMinutes": "79:59",
            "playerId": 500024,
            "playerName": "Daly Cherry-Evans",
            "scoreMethod": "Conversion",
            "statEvent": "Conversion-Made",
            "statId": 1,
            "statValue": 2,
            "vidRef": 145611,
            "homeScore": 36,
            "awayScore": 18,
            "commentary": "Conversion-Made by Daly Cherry-Evans",
            "tackleNum": -1,
            "teamId": 500002,
            "teamName": "Manly-Warringah Sea Eagles",
            "homeTeamAbbrv": "MAN",
            "awayTeamAbbrv": "SYD"
        },
        {
            "gameState": "First Half",
            "gameStateId": 3,
            "gameTime": "0:17:21",
            "gameSeconds": 1041,
            "GameMinutes": "17:21",
            "playerId": 500002,
            "playerName": "Daniel Tupou",
            "scoreMethod": "Try",
            "statEvent": "Try",
            "statId": 38,
            "statValue": 4,
            "vidRef": 31136,
            "homeScore": 4,
            "awayScore": 4,
            "commentary": "Try by Daniel Tupou",
            "tackleNum": 6,
            "teamId": 500001,
            "teamName": "Sydney Roosters",
            "homeTeamAbbrv": "MAN",
            "awayTeamAbbrv": "SYD"
        },
        {
            "gameState": "First Half",
            "gameStateId": 3,
            "gameTime": "0:18:25",
            "gameSeconds": 1105,
            "GameMinutes": "18:25",
            "playerId": 502502,
            "playerName": "Latrell Mitchell",
            "scoreMethod": "Conversion",
            "statEvent": "Conversion-Made",
            "statId": 1,
            "statValue": 2,
            "vidRef": 33613,
            "homeScore": 4,
            "awayScore": 6,
            "commentary": "Conversion-Made by Latrell Mitchell",
            "tackleNum": -1,
            "teamId": 500001,
            "teamName": "Sydney Roosters",
            "homeTeamAbbrv": "MAN",
            "awayTeamAbbrv": "SYD"
        },
        {
            "gameState": "First Half",
            "gameStateId": 3,
            "gameTime": "0:20:50",
            "gameSeconds": 1250,
            "GameMinutes": "20:50",
            "playerId": 502502,
            "playerName": "Latrell Mitchell",
            "scoreMethod": "Try",
            "statEvent": "Try",
            "statId": 38,
            "statValue": 4,
            "vidRef": 37228,
            "homeScore": 4,
            "awayScore": 10,
            "commentary": "Try by Latrell Mitchell",
            "tackleNum": 1,
            "teamId": 500001,
            "teamName": "Sydney Roosters",
            "homeTeamAbbrv": "MAN",
            "awayTeamAbbrv": "SYD"
        },
        {
            "gameState": "First Half",
            "gameStateId": 3,
            "gameTime": "0:21:48",
            "gameSeconds": 1308,
            "GameMinutes": "21:48",
            "playerId": 502502,
            "playerName": "Latrell Mitchell",
            "scoreMethod": "Conversion",
            "statEvent": "Conversion-Made",
            "statId": 1,
            "statValue": 2,
            "vidRef": 40507,
            "homeScore": 4,
            "awayScore": 12,
            "commentary": "Conversion-Made by Latrell Mitchell",
            "tackleNum": -1,
            "teamId": 500001,
            "teamName": "Sydney Roosters",
            "homeTeamAbbrv": "MAN",
            "awayTeamAbbrv": "SYD"
        },
        {
            "gameState": "First Half",
            "gameStateId": 3,
            "gameTime": "0:29:27",
            "gameSeconds": 1767,
            "GameMinutes": "29:27",
            "playerId": 500093,
            "playerName": "Luke Keary",
            "scoreMethod": "Try",
            "statEvent": "Try",
            "statId": 38,
            "statValue": 4,
            "vidRef": 51969,
            "homeScore": 4,
            "awayScore": 16,
            "commentary": "Try by Luke Keary",
            "tackleNum": 5,
            "teamId": 500001,
            "teamName": "Sydney Roosters",
            "homeTeamAbbrv": "MAN",
            "awayTeamAbbrv": "SYD"
        },
        {
            "gameState": "First Half",
            "gameStateId": 3,
            "gameTime": "0:30:57",
            "gameSeconds": 1857,
            "GameMinutes": "30:57",
            "playerId": 502502,
            "playerName": "Latrell Mitchell",
            "scoreMethod": "Conversion",
            "statEvent": "Conversion-Made",
            "statId": 1,
            "statValue": 2,
            "vidRef": 54875,
            "homeScore": 4,
            "awayScore": 18,
            "commentary": "Conversion-Made by Latrell Mitchell",
            "tackleNum": -1,
            "teamId": 500001,
            "teamName": "Sydney Roosters",
            "homeTeamAbbrv": "MAN",
            "awayTeamAbbrv": "SYD"
        }
    ],
    "twitter": [
        {
            "id": "894073174790258688",
            "gameSeconds": 4500
        },
        {
            "id": "894072935018668032",
            "gameSeconds": 4500
        },
        {
            "id": "894070263721017344",
            "gameSeconds": 3900
        },
        {
            "id": "894070069306601472",
            "gameSeconds": 3900
        },
        {
            "id": "894066774873853952",
            "gameSeconds": 3180
        },
        {
            "id": "894066562289684480",
            "gameSeconds": 3180
        },
        {
            "id": "894065050876493824",
            "gameSeconds": 3120
        },
        {
            "id": "894064842943864833",
            "gameSeconds": 3120
        },
        {
            "id": "894055627701407744",
            "gameSeconds": 1200
        },
        {
            "id": "894055511905058817",
            "gameSeconds": 1020
        },
        {
            "id": "894055167380684800",
            "gameSeconds": 1200
        },
        {
            "id": "894054867257380864",
            "gameSeconds": 1200
        },
        {
            "id": "894053278123798528",
            "gameSeconds": 1020
        },
        {
            "id": "894049479858339841",
            "gameSeconds": 480
        },
        {
            "id": "894049386740592640",
            "gameSeconds": 480
        }
    ]
}