{
    "vod": [
        {
            "id": "40dGJmdTp8LDTarJsVHrHJOzslmsac_I",
            "contentId": 755371,
            "title": "Rd 12: GOAL Dane Gagai (76th min)",
            "description": "Conversion sees the Knights trail 24-20",
            "publishDate": "2015-05-31T15:49:00+10:00",
            "publisher": "NRL Chief",
            "thumbnailUrl": "http://bigpondvideo.com/Web/Images/Content/20150531154923a_89x50.jpg",
            "largeThumbnailUrl": "http://bigpondvideo.com/Web/Images/Content/20150531154923a_326x184.jpg",
            "programType": "Instant Replay",
            "programCategory": "Score",
            "priority": 1,
            "lastUpdateDate": "2015-05-31T16:02:55+10:00",
            "isPremium": true,
            "club": [
                500003,
                500032
            ]
        },
        {
            "id": "t2c2JmdTpBzBsV3mkAoMMl0fzHa2BOqE",
            "contentId": 755372,
            "title": "Rd 12: TRY Akuila Uate (75th min)",
            "description": "Knights set up a grandstand finish as Akuila Uate bags a double",
            "publishDate": "2015-05-31T15:48:00+10:00",
            "publisher": "NRL Chief",
            "thumbnailUrl": "http://bigpondvideo.com/Web/Images/Content/20150531154750a_89x50.jpg",
            "largeThumbnailUrl": "http://bigpondvideo.com/Web/Images/Content/20150531154750a_326x184.jpg",
            "programType": "Instant Replay",
            "programCategory": "Score",
            "priority": 2,
            "lastUpdateDate": "2015-05-31T16:01:54+10:00",
            "isPremium": true,
            "club": [
                500003,
                500032
            ]
        },
        {
            "id": "B3cmJmdTp0Ze72WFdafHHOgZh4evAPjy",
            "contentId": 755373,
            "title": "Rd 12: TRY Jonathan Wright (69th min)",
            "description": "Great grubber by Shaun Johnson and Jonathan Wright is in the right place to score for the Warriors",
            "publishDate": "2015-05-31T15:41:10+10:00",
            "publisher": "NRL Chief",
            "thumbnailUrl": "http://bigpondvideo.com/Web/Images/Content/20150531154007a_89x50.jpg",
            "largeThumbnailUrl": "http://bigpondvideo.com/Web/Images/Content/20150531154007a_326x184.jpg",
            "programType": "Instant Replay",
            "programCategory": "Score",
            "priority": 3,
            "lastUpdateDate": "2015-05-31T16:01:54+10:00",
            "isPremium": true,
            "club": [
                500003,
                500032
            ]
        },
        {
            "id": "llcGJmdTo3EubxvhM9DkB8IWu5N-txqG",
            "contentId": 755369,
            "title": "Rd 12: GOAL Tyler Randell (63rd min)",
            "description": "Conversion from touch sees the Knights trail by 6",
            "publishDate": "2015-05-31T15:35:00+10:00",
            "publisher": "NRL Chief",
            "thumbnailUrl": "http://bigpondvideo.com/Web/Images/Content/20150531153424a_89x50.jpg",
            "largeThumbnailUrl": "http://bigpondvideo.com/Web/Images/Content/20150531153424a_326x184.jpg",
            "programType": "Instant Replay",
            "programCategory": "Score",
            "priority": null,
            "lastUpdateDate": "2015-05-31T15:39:43+10:00",
            "isPremium": true,
            "club": [
                500003,
                500032
            ]
        },
        {
            "id": "Fib2JmdTpMttH8qSHoK8YnY9lOm4CiLr",
            "contentId": 755368,
            "title": "Rd 12: TRY James McManus (62nd min)",
            "description": "Knights strike back through a try to James McManus",
            "publishDate": "2015-05-31T15:32:00+10:00",
            "publisher": "NRL Chief",
            "thumbnailUrl": "http://bigpondvideo.com/Web/Images/Content/20150531153258a_89x50.jpg",
            "largeThumbnailUrl": "http://bigpondvideo.com/Web/Images/Content/20150531153258a_326x184.jpg",
            "programType": "Instant Replay",
            "programCategory": "Score",
            "priority": 4,
            "lastUpdateDate": "2015-05-31T16:00:53+10:00",
            "isPremium": true,
            "club": [
                500003,
                500032
            ]
        },
        {
            "id": "tsaWJmdTqSd5VjthlogAb8o4ihvpjDq4",
            "contentId": 755367,
            "title": "Rd 12: GOAL Shaun Johnson (44th min)",
            "description": "Conversion sees the home side lead 20-8",
            "publishDate": "2015-05-31T15:15:00+10:00",
            "publisher": "NRL Chief",
            "thumbnailUrl": "http://bigpondvideo.com/Web/Images/Content/20150531151411a_89x50.jpg",
            "largeThumbnailUrl": "http://bigpondvideo.com/Web/Images/Content/20150531151411a_326x184.jpg",
            "programType": "Instant Replay",
            "programCategory": "Score",
            "priority": null,
            "lastUpdateDate": "2015-05-31T15:18:31+10:00",
            "isPremium": true,
            "club": [
                500003,
                500032
            ]
        },
        {
            "id": "liaWJmdTovHyay1z5-LqmT5yNGzJwTiI",
            "contentId": 755361,
            "title": "Rd 12: TRY Solomone Kata (43rd min)",
            "description": "Young, strong & fast Solomone Kata scores a fantastic try for the Warriors",
            "publishDate": "2015-05-31T15:14:00+10:00",
            "publisher": "NRL Chief",
            "thumbnailUrl": "http://bigpondvideo.com/Web/Images/Content/20150531151357a_89x50.jpg",
            "largeThumbnailUrl": "http://bigpondvideo.com/Web/Images/Content/20150531151357a_326x184.jpg",
            "programType": "Instant Replay",
            "programCategory": "Score",
            "priority": 5,
            "lastUpdateDate": "2015-05-31T15:59:53+10:00",
            "isPremium": true,
            "club": [
                500003,
                500032
            ]
        },
        {
            "id": "5xN2JmdTr6Waq66a7VSbVDaQusNzZBsf",
            "contentId": 755363,
            "title": "Rd 12: TRY Akuila Uate (34th min)",
            "description": "Akuila Uate stands up Manu Vatuvei and crosses in the corner for the Knights",
            "publishDate": "2015-05-31T14:47:00+10:00",
            "publisher": "NRL Chief",
            "thumbnailUrl": "http://bigpondvideo.com/Web/Images/Content/20150531144729a_89x50.jpg",
            "largeThumbnailUrl": "http://bigpondvideo.com/Web/Images/Content/20150531144729a_326x184.jpg",
            "programType": "Instant Replay",
            "programCategory": "Score",
            "priority": 6,
            "lastUpdateDate": "2015-05-31T15:59:53+10:00",
            "isPremium": true,
            "club": [
                500003,
                500032
            ]
        },
        {
            "id": "g1NGJmdTrTk7qnp5orT0ficOoBokZOco",
            "contentId": 755366,
            "title": "Rd 12: TRY Ben Matulino (25th min)",
            "description": "Warriors extend their lead as Ben Matulino crashes over from close range",
            "publishDate": "2015-05-31T14:37:00+10:00",
            "publisher": "NRL Chief",
            "thumbnailUrl": "http://bigpondvideo.com/Web/Images/Content/20150531143751a_89x50.jpg",
            "largeThumbnailUrl": "http://bigpondvideo.com/Web/Images/Content/20150531143751a_326x184.jpg",
            "programType": "Instant Replay",
            "programCategory": "Score",
            "priority": 7,
            "lastUpdateDate": "2015-05-31T15:57:52+10:00",
            "isPremium": true,
            "club": [
                500003,
                500032
            ]
        },
        {
            "id": "04MWJmdTpWKgTOxWcJYBP6VJMLiabtLZ",
            "contentId": 755365,
            "title": "Rd 12: TRY Dane Gagai (18th min)",
            "description": "Given half a chance Dane Gagai takes full advantage to punish the Warriors",
            "publishDate": "2015-05-31T14:30:00+10:00",
            "publisher": "NRL Chief",
            "thumbnailUrl": "http://bigpondvideo.com/Web/Images/Content/20150531143001a_89x50.jpg",
            "largeThumbnailUrl": "http://bigpondvideo.com/Web/Images/Content/20150531143001a_326x184.jpg",
            "programType": "Instant Replay",
            "programCategory": "Score",
            "priority": 8,
            "lastUpdateDate": "2015-05-31T15:57:52+10:00",
            "isPremium": true,
            "club": [
                500003,
                500032
            ]
        },
        {
            "id": "ZyeGFmdTpLfCQOdUe392YkvzEgC8I6I4",
            "contentId": 755364,
            "title": "Rd 12: TRY Manu Vatuvei (13th min)",
            "description": "Showing some amazing skill Manu Vatuvei leaps high to take a Chad Townsend bomb to score the 2nd try for the Warriors",
            "publishDate": "2015-05-31T14:25:00+10:00",
            "publisher": "NRL Chief",
            "thumbnailUrl": "http://bigpondvideo.com/Web/Images/Content/20150531142500a_89x50.jpg",
            "largeThumbnailUrl": "http://bigpondvideo.com/Web/Images/Content/20150531142500a_326x184.jpg",
            "programType": "Instant Replay",
            "programCategory": "Score",
            "priority": 9,
            "lastUpdateDate": "2015-05-31T15:56:51+10:00",
            "isPremium": true,
            "club": [
                500003,
                500032
            ]
        },
        {
            "id": "gwd2FmdTogxZXp0zxvq_an8xuKYOozVr",
            "contentId": 755360,
            "title": "Rd 12: GOAL Shaun Johnson (8th min)",
            "description": "Conversion sees the Warriors lead 6-0",
            "publishDate": "2015-05-31T14:19:00+10:00",
            "publisher": "NRL Chief",
            "thumbnailUrl": "http://bigpondvideo.com/Web/Images/Content/20150531141903a_89x50.jpg",
            "largeThumbnailUrl": "http://bigpondvideo.com/Web/Images/Content/20150531141903a_326x184.jpg",
            "programType": "Instant Replay",
            "programCategory": "Score",
            "priority": null,
            "lastUpdateDate": "2015-05-31T14:23:00+10:00",
            "isPremium": true,
            "club": [
                500003,
                500032
            ]
        },
        {
            "id": "xudmFmdTrQ8kwasR-fZtuBbrd22Y9nVU",
            "contentId": 755359,
            "title": "Rd 12: TRY Tuimoala Lolohea (7th min)",
            "description": "Shaun Johnson makes the break and Tuimoala Lolohea is in support to score the first try for the afternoon for the Warriors",
            "publishDate": "2015-05-31T14:18:00+10:00",
            "publisher": "NRL Chief",
            "thumbnailUrl": "http://bigpondvideo.com/Web/Images/Content/20150531141851a_89x50.jpg",
            "largeThumbnailUrl": "http://bigpondvideo.com/Web/Images/Content/20150531141851a_326x184.jpg",
            "programType": "Instant Replay",
            "programCategory": "Score",
            "priority": 10,
            "lastUpdateDate": "2015-05-31T15:55:51+10:00",
            "isPremium": true,
            "club": [
                500003,
                500032
            ]
        }
    ],
    "scores": [
        {
            "gameState": "First Half",
            "gameStateId": 3,
            "gameTime": "0:06:10",
            "gameSeconds": 370,
            "playerId": 500927,
            "playerName": "Tuimoala Lolohea",
            "scoreMethod": "Try",
            "statEvent": "Try",
            "statId": 38,
            "statValue": 4,
            "vidRef": 14039,
            "homeScore": 4,
            "teamId": 500032,
            "teamName": "New Zealand Warriors",
            "homeTeamAbbrv": "WAR",
            "awayTeamAbbrv": "NEW"
        },
        {
            "gameState": "First Half",
            "gameStateId": 3,
            "gameTime": "0:07:35",
            "gameSeconds": 455,
            "playerId": 500705,
            "playerName": "Shaun Johnson",
            "scoreMethod": "Conversion",
            "statEvent": "Conversion-Made",
            "statId": 1,
            "statValue": 2,
            "vidRef": 16606,
            "homeScore": 6,
            "teamId": 500032,
            "teamName": "New Zealand Warriors",
            "homeTeamAbbrv": "WAR",
            "awayTeamAbbrv": "NEW"
        },
        {
            "gameState": "First Half",
            "gameStateId": 3,
            "gameTime": "0:12:16",
            "gameSeconds": 736,
            "playerId": 500722,
            "playerName": "Manu Vatuvei",
            "scoreMethod": "Try",
            "statEvent": "Try",
            "statId": 38,
            "statValue": 4,
            "vidRef": 23625,
            "homeScore": 10,
            "teamId": 500032,
            "teamName": "New Zealand Warriors",
            "homeTeamAbbrv": "WAR",
            "awayTeamAbbrv": "NEW"
        },
        {
            "gameState": "First Half",
            "gameStateId": 3,
            "gameTime": "0:23:49",
            "gameSeconds": 1429,
            "playerId": 500715,
            "playerName": "Ben Matulino",
            "scoreMethod": "Try",
            "statEvent": "Try",
            "statId": 38,
            "statValue": 4,
            "vidRef": 45297,
            "homeScore": 14,
            "awayScore": 4,
            "teamId": 500032,
            "teamName": "New Zealand Warriors",
            "homeTeamAbbrv": "WAR",
            "awayTeamAbbrv": "NEW"
        },
        {
            "gameState": "Second Half",
            "gameStateId": 5,
            "gameTime": "0:42:26",
            "gameSeconds": 2546,
            "playerId": 500921,
            "playerName": "Solomone Kata",
            "scoreMethod": "Try",
            "statEvent": "Try",
            "statId": 38,
            "statValue": 4,
            "vidRef": 78675,
            "homeScore": 18,
            "awayScore": 8,
            "teamId": 500032,
            "teamName": "New Zealand Warriors",
            "homeTeamAbbrv": "WAR",
            "awayTeamAbbrv": "NEW"
        },
        {
            "gameState": "Second Half",
            "gameStateId": 5,
            "gameTime": "0:43:54",
            "gameSeconds": 2634,
            "playerId": 500705,
            "playerName": "Shaun Johnson",
            "scoreMethod": "Conversion",
            "statEvent": "Conversion-Made",
            "statId": 1,
            "statValue": 2,
            "vidRef": 80873,
            "homeScore": 20,
            "awayScore": 8,
            "teamId": 500032,
            "teamName": "New Zealand Warriors",
            "homeTeamAbbrv": "WAR",
            "awayTeamAbbrv": "NEW"
        },
        {
            "gameState": "Second Half",
            "gameStateId": 5,
            "gameTime": "1:08:07",
            "gameSeconds": 4087,
            "playerId": 500815,
            "playerName": "Jonathan Wright",
            "scoreMethod": "Try",
            "statEvent": "Try",
            "statId": 38,
            "statValue": 4,
            "vidRef": 120055,
            "homeScore": 24,
            "awayScore": 14,
            "teamId": 500032,
            "teamName": "New Zealand Warriors",
            "homeTeamAbbrv": "WAR",
            "awayTeamAbbrv": "NEW"
        },
        {
            "gameState": "First Half",
            "gameStateId": 3,
            "gameTime": "0:17:27",
            "gameSeconds": 1047,
            "playerId": 500043,
            "playerName": "Dane Gagai",
            "scoreMethod": "Try",
            "statEvent": "Try",
            "statId": 38,
            "statValue": 4,
            "vidRef": 31397,
            "homeScore": 10,
            "awayScore": 4,
            "teamId": 500003,
            "teamName": "Newcastle Knights",
            "homeTeamAbbrv": "WAR",
            "awayTeamAbbrv": "NEW"
        },
        {
            "gameState": "First Half",
            "gameStateId": 3,
            "gameTime": "0:32:50",
            "gameSeconds": 1970,
            "playerId": 500044,
            "playerName": "Akuila Uate",
            "scoreMethod": "Try",
            "statEvent": "Try",
            "statId": 38,
            "statValue": 4,
            "vidRef": 60055,
            "homeScore": 14,
            "awayScore": 8,
            "teamId": 500003,
            "teamName": "Newcastle Knights",
            "homeTeamAbbrv": "WAR",
            "awayTeamAbbrv": "NEW"
        },
        {
            "gameState": "Second Half",
            "gameStateId": 5,
            "gameTime": "1:01:30",
            "gameSeconds": 3690,
            "playerId": 500378,
            "playerName": "James McManus",
            "scoreMethod": "Try",
            "statEvent": "Try",
            "statId": 38,
            "statValue": 4,
            "vidRef": 108023,
            "homeScore": 20,
            "awayScore": 12,
            "teamId": 500003,
            "teamName": "Newcastle Knights",
            "homeTeamAbbrv": "WAR",
            "awayTeamAbbrv": "NEW"
        },
        {
            "gameState": "Second Half",
            "gameStateId": 5,
            "gameTime": "1:02:51",
            "gameSeconds": 3771,
            "playerId": 500380,
            "playerName": "Tyler Randell",
            "scoreMethod": "Conversion",
            "statEvent": "Conversion-Made",
            "statId": 1,
            "statValue": 2,
            "vidRef": 110064,
            "homeScore": 20,
            "awayScore": 14,
            "teamId": 500003,
            "teamName": "Newcastle Knights",
            "homeTeamAbbrv": "WAR",
            "awayTeamAbbrv": "NEW"
        },
        {
            "gameState": "Second Half",
            "gameStateId": 5,
            "gameTime": "1:14:47",
            "gameSeconds": 4487,
            "playerId": 500044,
            "playerName": "Akuila Uate",
            "scoreMethod": "Try",
            "statEvent": "Try",
            "statId": 38,
            "statValue": 4,
            "vidRef": 131337,
            "homeScore": 24,
            "awayScore": 18,
            "teamId": 500003,
            "teamName": "Newcastle Knights",
            "homeTeamAbbrv": "WAR",
            "awayTeamAbbrv": "NEW"
        },
        {
            "gameState": "Second Half",
            "gameStateId": 5,
            "gameTime": "1:15:29",
            "gameSeconds": 4529,
            "playerId": 500043,
            "playerName": "Dane Gagai",
            "scoreMethod": "Conversion",
            "statEvent": "Conversion-Made",
            "statId": 1,
            "statValue": 2,
            "vidRef": 132399,
            "homeScore": 24,
            "awayScore": 20,
            "teamId": 500003,
            "teamName": "Newcastle Knights",
            "homeTeamAbbrv": "WAR",
            "awayTeamAbbrv": "NEW"
        }
    ]
}