{
    "competitionId": 111,
    "competitionName": "NRL Telstra Premiership",
    "gameId": 20161110880,
    "gameInfo": {
        "assistantReferee1Id": 500013,
        "numberOfPeriods": 2,
        "assistantReferee1Name": "Brett Suttor",
        "assistantReferee2Id": 500034,
        "assistantReferee2Name": "Dave Munro",
        "gameDate": "2016-04-25",
        "gameHashTag": "#NRLStormWarriors",
        "gameNumber": 8,
        "gameSeconds": 4800,
        "gameMinutes": "80:00",
        "gameTime": "1:20:00",
        "groundConditionId": 1,
        "groundConditionName": "N/A",
        "referee1Id": 500002,
        "referee1Name": "Matt Cecchin",
        "referee2Id": 500005,
        "referee2Name": "Gavin Reynolds",
        "startTime": "2016-04-25T19:00:00",
        "startTimeUTC": "2016-04-25T09:00:00Z",
        "venueId": 500023,
        "venueName": "AAMI Park",
        "videoReferee1Id": 500039,
        "videoReferee1Name": "Ashley Klein",
        "videoReferee2Id": 500203,
        "videoReferee2Name": "Ben Galea",
        "weatherId": 2,
        "weatherName": "Fine",
        "broadcastChannel": null,
        "venueLatitude": -37.8253,
        "venueLongitude": 144.9839,
        "broadcastInfo": {
            "radioNetwork": []
        }
    },
    "gameState": "Final",
    "gameStateId": 8,
    "roundId": 8,
    "roundName": "Round 8",
    "seasonId": 2016,
    "teams": {
        "teamsMatch": [
            {
                "isHomeTeam": true,
                "score": {
                    "conversions": 5,
                    "points": 42,
                    "tries": 8
                },
                "team1stHalfScore": 28,
                "team2ndHalfScore": 14,
                "teamAbbr": "MEL",
                "teamFinalScore": 42,
                "teamFullTimeScore": 42,
                "teamHalfTimeScore": 28,
                "teamId": 500021,
                "teamLineup": {
                    "teamLineUpStatusID": 4,
                    "teamLineUpStatus": "Final",
                    "injuriesAndSuspensions": {
                        "injury": [],
                        "suspension": []
                    },
                    "insAndOuts": {
                        "inOut": [
                            {
                                "inOut": "Out",
                                "playerFirstName": "Felise",
                                "playerId": "500598",
                                "playerLastName": "Kaufusi",
                                "playerName": "Felise Kaufusi"
                            },
                            {
                                "inOut": "In",
                                "playerFirstName": "Young",
                                "playerId": "500610",
                                "playerLastName": "Tonumaipea",
                                "playerName": "Young Tonumaipea"
                            }
                        ]
                    },
                    "teamPlayer": [
                        {
                            "playerFirstName": "Cameron",
                            "playerId": 501459,
                            "playerLastName": "Munster",
                            "playerName": "Cameron Munster",
                            "playerPosition": "Fullback",
                            "playerPositionId": 500001,
                            "playerStats": {
                                "allRunMetres": 212,
                                "allRuns": 21,
                                "bombKicksDefused": 1,
                                "decoys": 3,
                                "fantasyPointsTotal": 73,
                                "hitUps": 1,
                                "kickReturnMetres": 98,
                                "kickReturns": 7,
                                "kicksDefused": 3,
                                "linebreakAssists": 1,
                                "linebreaks": 2,
                                "mins": 80,
                                "missedTackles": 2,
                                "passes": 14,
                                "passesPerRun": 0.67,
                                "points": 4,
                                "supports": 9,
                                "tackleBreaks": 6,
                                "tackles": 7,
                                "tries": 1,
                                "tryAssists": 1,
                                "trySaves": 1,
                                "hitupRunMeters": 9,
                                "evasionRuns": 13,
                                "evasionRunMetres": 105,
                                "ptbAll": 15,
                                "receipts": 30,
                                "postContactMetres": 74,
                                "dummyPasses": 2,
                                "lineEngagedRuns": 2,
                                "ptbOneToTwo": 1,
                                "ptbTwoToThree": 2,
                                "ptbThreeToFour": 4,
                                "ptbFourToFive": 7,
                                "ptbFivePlus": 1,
                                "doubles": 1,
                                "effectiveTacklePercentage": 77.8
                            },
                            "playerTookTheField": true,
                            "shirtNum": 1,
                            "playerFirstInitial": "C",
                            "playerPositionAbbrev": "FB",
                            "fantasyPrice": 390000,
                            "fantasySeasonPriceChange": 7000,
                            "fantasyRoundPriceChange": 3000
                        },
                        {
                            "playerFirstName": "Young",
                            "playerId": 500610,
                            "playerLastName": "Tonumaipea",
                            "playerName": "Young Tonumaipea",
                            "playerPosition": "Winger 1",
                            "playerPositionId": 500002,
                            "playerStats": {
                                "allRunMetres": 82,
                                "allRuns": 9,
                                "bombKicksDefused": 1,
                                "decoys": 1,
                                "dummyHalfRuns": 2,
                                "errors": 2,
                                "fantasyPointsTotal": 20,
                                "ineffectiveTackles": 1,
                                "kicksDefused": 1,
                                "linebreakAssists": 1,
                                "mins": 67,
                                "missedTackles": 1,
                                "offloads": 1,
                                "passes": 6,
                                "passesPerRun": 0.67,
                                "oneOnOneTackles": 1,
                                "supports": 6,
                                "tackles": 8,
                                "tryAssists": 1,
                                "evasionRuns": 7,
                                "evasionRunMetres": 74,
                                "dummyHalfRunMetres": 8,
                                "ptbAll": 5,
                                "receipts": 15,
                                "postContactMetres": 33,
                                "lineEngagedRuns": 1,
                                "ptbThreeToFour": 1,
                                "ptbFourToFive": 4,
                                "effectiveTacklePercentage": 80
                            },
                            "playerTookTheField": true,
                            "shirtNum": 2,
                            "playerFirstInitial": "Y",
                            "playerPositionAbbrev": "WG",
                            "fantasyPrice": 225000,
                            "fantasySeasonPriceChange": 45000
                        },
                        {
                            "playerFirstName": "Richard",
                            "playerId": 500599,
                            "playerLastName": "Kennar",
                            "playerName": "Richard Kennar",
                            "playerPosition": "Centre 1",
                            "playerPositionId": 500003,
                            "playerStats": {
                                "allRunMetres": 113,
                                "allRuns": 9,
                                "decoys": 3,
                                "fantasyPointsTotal": 29,
                                "ineffectiveTackles": 1,
                                "kickMetres": 26,
                                "kicks": 2,
                                "linebreaks": 1,
                                "mins": 80,
                                "missedTackles": 4,
                                "passes": 2,
                                "passesPerRun": 0.22,
                                "oneOnOneTackles": 1,
                                "supports": 10,
                                "tackleBreaks": 1,
                                "tackles": 13,
                                "tryAssists": 1,
                                "evasionRuns": 9,
                                "evasionRunMetres": 113,
                                "ptbAll": 8,
                                "receipts": 12,
                                "forcedDropOutKicker": 1,
                                "grubberKick": 2,
                                "postContactMetres": 24,
                                "ptbOneToTwo": 1,
                                "ptbTwoToThree": 3,
                                "ptbThreeToFour": 3,
                                "ptbFourToFive": 1,
                                "doubles": 3,
                                "effectiveTacklePercentage": 72.2
                            },
                            "playerTookTheField": true,
                            "shirtNum": 3,
                            "playerFirstInitial": "R",
                            "playerPositionAbbrev": "CT",
                            "fantasyPrice": 172000,
                            "fantasySeasonPriceChange": 37000,
                            "fantasyRoundPriceChange": 17000
                        },
                        {
                            "playerFirstName": "Suliasi",
                            "playerId": 502107,
                            "playerLastName": "Vunivalu",
                            "playerName": "Suliasi Vunivalu",
                            "playerPosition": "Centre 2",
                            "playerPositionId": 500004,
                            "playerStats": {
                                "allRunMetres": 83,
                                "allRuns": 7,
                                "bombKicksDefused": 1,
                                "bombKicksNotDefused": 1,
                                "errors": 1,
                                "fantasyPointsTotal": 32,
                                "hitUps": 1,
                                "ineffectiveTackles": 2,
                                "kicksDefused": 1,
                                "kicksNotDefused": 2,
                                "linebreaks": 1,
                                "mins": 80,
                                "passes": 2,
                                "passesPerRun": 0.29,
                                "points": 8,
                                "supports": 3,
                                "tackles": 5,
                                "tries": 2,
                                "hitupRunMeters": 13,
                                "evasionRuns": 6,
                                "evasionRunMetres": 70,
                                "ptbAll": 7,
                                "receipts": 14,
                                "postContactMetres": 15,
                                "ptbOneToTwo": 1,
                                "ptbTwoToThree": 1,
                                "ptbThreeToFour": 1,
                                "ptbFourToFive": 1,
                                "ptbFivePlus": 3,
                                "effectiveTacklePercentage": 71.4
                            },
                            "playerTookTheField": true,
                            "shirtNum": 18,
                            "playerFirstInitial": "S",
                            "playerPositionAbbrev": "CT",
                            "fantasyPrice": 150000
                        },
                        {
                            "playerFirstName": "Marika",
                            "playerId": 500653,
                            "playerLastName": "Koroibete",
                            "playerName": "Marika Koroibete",
                            "playerPosition": "Winger 2",
                            "playerPositionId": 500005,
                            "playerStats": {
                                "allRunMetres": 183,
                                "allRuns": 15,
                                "errors": 2,
                                "fantasyPointsTotal": 44,
                                "ineffectiveTackles": 1,
                                "kickReturnMetres": 7,
                                "kickReturns": 1,
                                "linebreaks": 1,
                                "mins": 80,
                                "offloads": 1,
                                "passes": 3,
                                "passesPerRun": 0.2,
                                "oneOnOneTackles": 3,
                                "points": 4,
                                "supports": 9,
                                "tackleBreaks": 1,
                                "tackles": 8,
                                "tries": 1,
                                "trySaves": 1,
                                "evasionRuns": 14,
                                "evasionRunMetres": 176,
                                "ptbAll": 11,
                                "receipts": 18,
                                "postContactMetres": 50,
                                "kickPressures": 1,
                                "ptbOneToTwo": 1,
                                "ptbTwoToThree": 3,
                                "ptbThreeToFour": 6,
                                "ptbFivePlus": 1,
                                "effectiveTacklePercentage": 88.9
                            },
                            "playerTookTheField": true,
                            "shirtNum": 5,
                            "playerFirstInitial": "M",
                            "playerPositionAbbrev": "WG",
                            "fantasyPrice": 285000,
                            "fantasySeasonPriceChange": -44000,
                            "fantasyRoundPriceChange": -13000
                        },
                        {
                            "playerFirstName": "Blake",
                            "playerId": 502209,
                            "playerLastName": "Green",
                            "playerName": "Blake Green",
                            "playerPosition": "Five-Eighth",
                            "playerPositionId": 500006,
                            "playerStats": {
                                "allRunMetres": 71,
                                "allRuns": 6,
                                "bombKicks": 3,
                                "bombKickMetres": 91,
                                "chargedDown": 1,
                                "decoys": 2,
                                "fantasyPointsTotal": 34,
                                "ineffectiveTackles": 1,
                                "kickMetres": 193,
                                "kicks": 7,
                                "linebreaks": 1,
                                "mins": 80,
                                "missedTackles": 1,
                                "passes": 31,
                                "passesPerRun": 5.17,
                                "oneOnOneTackles": 2,
                                "penalties": 1,
                                "supports": 26,
                                "tackles": 18,
                                "evasionRuns": 6,
                                "evasionRunMetres": 71,
                                "ptbAll": 2,
                                "receipts": 40,
                                "chipKick": 1,
                                "grubberKick": 1,
                                "postContactMetres": 13,
                                "dummyPasses": 5,
                                "kickPressures": 1,
                                "lineEngagedRuns": 3,
                                "ptbTwoToThree": 1,
                                "ptbThreeToFour": 1,
                                "doubles": 1,
                                "effectiveTacklePercentage": 90,
                                "ptbPenalties": 1
                            },
                            "playerTookTheField": true,
                            "shirtNum": 6,
                            "playerFirstInitial": "B",
                            "playerPositionAbbrev": "FE",
                            "fantasyPrice": 290000,
                            "fantasySeasonPriceChange": -68000,
                            "fantasyRoundPriceChange": -10000
                        },
                        {
                            "playerFirstName": "Cooper",
                            "playerId": 500587,
                            "playerLastName": "Cronk",
                            "playerName": "Cooper Cronk",
                            "playerPosition": "Halfback",
                            "playerPositionId": 500007,
                            "playerStats": {
                                "allRunMetres": 48,
                                "allRuns": 6,
                                "fantasyPointsTotal": 48,
                                "kickMetres": 132,
                                "kicks": 5,
                                "linebreaks": 1,
                                "mins": 80,
                                "missedTackles": 2,
                                "offloads": 1,
                                "passes": 38,
                                "passesPerRun": 6.33,
                                "oneOnOneTackles": 1,
                                "penalties": 1,
                                "points": 4,
                                "supports": 8,
                                "tackleBreaks": 2,
                                "tackles": 19,
                                "tries": 1,
                                "trySaves": 1,
                                "evasionRuns": 6,
                                "evasionRunMetres": 48,
                                "receipts": 45,
                                "grubberKick": 1,
                                "postContactMetres": 2,
                                "dummyPasses": 2,
                                "lineEngagedRuns": 3,
                                "doubles": 4,
                                "effectiveTacklePercentage": 90.5,
                                "ptbPenalties": 1
                            },
                            "playerTookTheField": true,
                            "shirtNum": 7,
                            "playerFirstInitial": "C",
                            "playerPositionAbbrev": "HB",
                            "fantasyPrice": 355000,
                            "fantasySeasonPriceChange": -35000,
                            "fantasyRoundPriceChange": 5000
                        },
                        {
                            "playerFirstName": "Jesse",
                            "playerId": 500584,
                            "playerLastName": "Bromwich",
                            "playerName": "Jesse Bromwich",
                            "playerPosition": "Prop 1",
                            "playerPositionId": 500008,
                            "playerStats": {
                                "allRunMetres": 142,
                                "allRuns": 15,
                                "decoys": 14,
                                "fantasyPointsTotal": 69,
                                "hitUps": 11,
                                "kickReturnMetres": 17,
                                "kickReturns": 1,
                                "linebreakAssists": 1,
                                "linebreaks": 1,
                                "mins": 47,
                                "offloads": 2,
                                "passes": 7,
                                "passesPerRun": 0.47,
                                "oneOnOneTackles": 1,
                                "points": 4,
                                "supports": 2,
                                "tackleBreaks": 1,
                                "tackles": 24,
                                "tries": 1,
                                "tryAssists": 1,
                                "trySaves": 1,
                                "hitupRunMeters": 110,
                                "evasionRuns": 3,
                                "evasionRunMetres": 15,
                                "ptbAll": 9,
                                "receipts": 19,
                                "postContactMetres": 44,
                                "dummyPasses": 1,
                                "kickPressures": 1,
                                "lineEngagedRuns": 3,
                                "ptbTwoToThree": 2,
                                "ptbThreeToFour": 6,
                                "ptbFourToFive": 1,
                                "doubles": 2,
                                "effectiveTacklePercentage": 100
                            },
                            "playerTookTheField": true,
                            "shirtNum": 8,
                            "playerFirstInitial": "J",
                            "playerPositionAbbrev": "PR",
                            "fantasyPrice": 476000,
                            "fantasySeasonPriceChange": 6000,
                            "fantasyRoundPriceChange": 11000
                        },
                        {
                            "playerFirstName": "Cameron",
                            "playerId": 500609,
                            "playerLastName": "Smith",
                            "playerName": "Cameron Smith",
                            "playerPosition": "Hooker",
                            "playerPositionId": 500009,
                            "playerStats": {
                                "allRunMetres": 45,
                                "allRuns": 7,
                                "conversions": 5,
                                "conversionsAttempts": 8,
                                "conversionsMissed": 3,
                                "dummyHalfRuns": 5,
                                "fantasyPointsTotal": 81,
                                "goalConversionRate": 62.5,
                                "allGoals": 5,
                                "allGoalsMissed": 3,
                                "allGoalsAttempted": 8,
                                "hitUps": 1,
                                "ineffectiveTackles": 1,
                                "kickMetres": 169,
                                "kickReturnMetres": 1,
                                "kickReturns": 1,
                                "kicks": 6,
                                "kicksDefused": 2,
                                "lineDropouts": 2,
                                "linebreakAssists": 3,
                                "mins": 80,
                                "missedTackles": 3,
                                "passes": 129,
                                "passesPerRun": 18.43,
                                "oneOnOneTackles": 2,
                                "points": 10,
                                "supports": 3,
                                "tackleBreaks": 2,
                                "tackles": 36,
                                "tryAssists": 3,
                                "hitupRunMeters": 7,
                                "dummyHalfRunMetres": 37,
                                "ptbAll": 3,
                                "receipts": 130,
                                "forcedDropOutKicker": 2,
                                "grubberKick": 3,
                                "postContactMetres": 14,
                                "dummyPasses": 13,
                                "kickPressures": 2,
                                "lineEngagedRuns": 3,
                                "ptbOneToTwo": 1,
                                "ptbThreeToFour": 2,
                                "doubles": 3,
                                "longKicksSpace": 3,
                                "effectiveTacklePercentage": 90
                            },
                            "playerTookTheField": true,
                            "shirtNum": 9,
                            "playerFirstInitial": "C",
                            "playerPositionAbbrev": "HK",
                            "fantasyPrice": 555000,
                            "fantasySeasonPriceChange": 7000,
                            "fantasyRoundPriceChange": 16000
                        },
                        {
                            "playerFirstName": "Tim",
                            "playerId": 500591,
                            "playerLastName": "Glasby",
                            "playerName": "Tim Glasby",
                            "playerPosition": "Prop 2",
                            "playerPositionId": 500010,
                            "playerStats": {
                                "allRunMetres": 147,
                                "allRuns": 16,
                                "decoys": 2,
                                "fantasyPointsTotal": 49,
                                "hitUps": 12,
                                "ineffectiveTackles": 2,
                                "kickReturnMetres": 24,
                                "kickReturns": 2,
                                "linebreaks": 1,
                                "mins": 37,
                                "passes": 2,
                                "passesPerRun": 0.12,
                                "points": 4,
                                "supports": 3,
                                "tackleBreaks": 4,
                                "tackles": 11,
                                "tries": 1,
                                "hitupRunMeters": 113,
                                "evasionRuns": 2,
                                "evasionRunMetres": 10,
                                "ptbAll": 12,
                                "receipts": 16,
                                "postContactMetres": 37,
                                "kickPressures": 2,
                                "lineEngagedRuns": 2,
                                "ptbTwoToThree": 2,
                                "ptbThreeToFour": 6,
                                "ptbFourToFive": 4,
                                "doubles": 1,
                                "effectiveTacklePercentage": 84.6
                            },
                            "playerTookTheField": true,
                            "shirtNum": 15,
                            "playerFirstInitial": "T",
                            "playerPositionAbbrev": "PR",
                            "fantasyPrice": 264000,
                            "fantasySeasonPriceChange": -12000,
                            "fantasyRoundPriceChange": -20000
                        },
                        {
                            "playerFirstName": "Kevin",
                            "playerId": 500606,
                            "playerLastName": "Proctor",
                            "playerName": "Kevin Proctor",
                            "playerPosition": "2nd Row 1",
                            "playerPositionId": 500011,
                            "playerStats": {
                                "allRunMetres": 127,
                                "allRuns": 14,
                                "decoys": 6,
                                "fantasyPointsTotal": 49,
                                "hitUps": 13,
                                "ineffectiveTackles": 1,
                                "kickReturns": 1,
                                "mins": 65,
                                "penalties": 1,
                                "supports": 3,
                                "tackleBreaks": 3,
                                "tackles": 30,
                                "hitupRunMeters": 127,
                                "ptbAll": 15,
                                "receipts": 15,
                                "postContactMetres": 49,
                                "kickPressures": 1,
                                "ptbTwoToThree": 1,
                                "ptbThreeToFour": 7,
                                "ptbFourToFive": 5,
                                "ptbFivePlus": 2,
                                "doubles": 3,
                                "effectiveTacklePercentage": 96.8,
                                "generalPlayPenalties": 1,
                                "foulPlayPenalties": 1
                            },
                            "playerTookTheField": true,
                            "shirtNum": 11,
                            "playerFirstInitial": "K",
                            "playerPositionAbbrev": "2R",
                            "fantasyPrice": 393000,
                            "fantasySeasonPriceChange": -4000,
                            "fantasyRoundPriceChange": 6000
                        },
                        {
                            "playerFirstName": "Tohu",
                            "playerId": 500594,
                            "playerLastName": "Harris",
                            "playerName": "Tohu Harris",
                            "playerPosition": "2nd Row 2",
                            "playerPositionId": 500012,
                            "playerStats": {
                                "allRunMetres": 228,
                                "allRuns": 22,
                                "decoys": 3,
                                "errors": 1,
                                "fantasyPointsTotal": 66,
                                "hitUps": 19,
                                "linebreaks": 1,
                                "mins": 80,
                                "offloads": 2,
                                "passes": 5,
                                "passesPerRun": 0.23,
                                "penalties": 1,
                                "points": 4,
                                "supports": 5,
                                "tackleBreaks": 2,
                                "tackles": 26,
                                "tries": 1,
                                "hitupRunMeters": 211,
                                "evasionRuns": 3,
                                "evasionRunMetres": 17,
                                "ptbAll": 16,
                                "receipts": 26,
                                "postContactMetres": 72,
                                "kickPressures": 4,
                                "lineEngagedRuns": 3,
                                "ptbTwoToThree": 5,
                                "ptbThreeToFour": 8,
                                "ptbFourToFive": 1,
                                "ptbFivePlus": 2,
                                "doubles": 6,
                                "effectiveTacklePercentage": 100,
                                "ptbPenalties": 1
                            },
                            "playerTookTheField": true,
                            "shirtNum": 12,
                            "playerFirstInitial": "T",
                            "playerPositionAbbrev": "2R",
                            "fantasyPrice": 438000,
                            "fantasySeasonPriceChange": 10000,
                            "fantasyRoundPriceChange": 36000
                        },
                        {
                            "playerFirstName": "Dale",
                            "playerId": 500222,
                            "playerLastName": "Finucane",
                            "playerName": "Dale Finucane",
                            "playerPosition": "Lock",
                            "playerPositionId": 500013,
                            "playerStats": {
                                "allRunMetres": 161,
                                "allRuns": 14,
                                "decoys": 15,
                                "fantasyPointsTotal": 50,
                                "hitUps": 10,
                                "ineffectiveTackles": 1,
                                "kickReturnMetres": 47,
                                "kickReturns": 3,
                                "mins": 60,
                                "missedTackles": 1,
                                "passes": 3,
                                "passesPerRun": 0.21,
                                "oneOnOneTackles": 1,
                                "supports": 8,
                                "tackles": 31,
                                "trySaves": 1,
                                "hitupRunMeters": 107,
                                "evasionRuns": 1,
                                "evasionRunMetres": 7,
                                "ptbAll": 13,
                                "receipts": 16,
                                "postContactMetres": 56,
                                "kickPressures": 2,
                                "lineEngagedRuns": 1,
                                "ptbThreeToFour": 7,
                                "ptbFourToFive": 5,
                                "ptbFivePlus": 1,
                                "doubles": 5,
                                "effectiveTacklePercentage": 93.9
                            },
                            "playerTookTheField": true,
                            "shirtNum": 13,
                            "playerFirstInitial": "D",
                            "playerPositionAbbrev": "LK",
                            "fantasyPrice": 422000,
                            "fantasySeasonPriceChange": 53000,
                            "fantasyRoundPriceChange": 24000
                        },
                        {
                            "playerFirstName": "Ben",
                            "playerId": 500593,
                            "playerLastName": "Hampton",
                            "playerName": "Ben Hampton",
                            "playerPosition": "Interchange",
                            "playerPositionId": 500014,
                            "playerStats": {
                                "allRunMetres": 37,
                                "allRuns": 4,
                                "decoys": 2,
                                "dummyHalfRuns": 1,
                                "errors": 1,
                                "fantasyPointsTotal": 14,
                                "hitUps": 2,
                                "kickReturnMetres": 20,
                                "kickReturns": 1,
                                "mins": 19,
                                "passes": 1,
                                "passesPerRun": 0.25,
                                "oneOnOneTackles": 4,
                                "supports": 2,
                                "tackles": 13,
                                "hitupRunMeters": 7,
                                "dummyHalfRunMetres": 10,
                                "ptbAll": 5,
                                "receipts": 7,
                                "postContactMetres": 9,
                                "ptbTwoToThree": 1,
                                "ptbThreeToFour": 2,
                                "ptbFourToFive": 2,
                                "doubles": 5,
                                "effectiveTacklePercentage": 100
                            },
                            "playerTookTheField": true,
                            "shirtNum": 4,
                            "playerFirstInitial": "B",
                            "playerPositionAbbrev": "INT",
                            "fantasyPrice": 186000,
                            "fantasySeasonPriceChange": -96000,
                            "fantasyRoundPriceChange": 3000
                        },
                        {
                            "playerFirstName": "Jordan",
                            "playerId": 500602,
                            "playerLastName": "McLean",
                            "playerName": "Jordan McLean",
                            "playerPosition": "Interchange",
                            "playerPositionId": 500014,
                            "playerStats": {
                                "allRunMetres": 102,
                                "allRuns": 10,
                                "decoys": 3,
                                "fantasyPointsTotal": 35,
                                "hitUps": 9,
                                "ineffectiveTackles": 1,
                                "kickReturnMetres": 14,
                                "kickReturns": 1,
                                "mins": 37,
                                "supports": 2,
                                "tackleBreaks": 1,
                                "tackles": 22,
                                "hitupRunMeters": 88,
                                "ptbAll": 10,
                                "receipts": 10,
                                "postContactMetres": 34,
                                "ptbOneToTwo": 1,
                                "ptbTwoToThree": 3,
                                "ptbThreeToFour": 4,
                                "ptbFourToFive": 2,
                                "doubles": 7,
                                "effectiveTacklePercentage": 95.7
                            },
                            "playerTookTheField": true,
                            "shirtNum": 10,
                            "playerFirstInitial": "J",
                            "playerPositionAbbrev": "INT",
                            "fantasyPrice": 276000,
                            "fantasySeasonPriceChange": 1000,
                            "fantasyRoundPriceChange": 7000
                        },
                        {
                            "playerFirstName": "Kenneath",
                            "playerId": 500585,
                            "playerLastName": "Bromwich",
                            "playerName": "Kenneath Bromwich",
                            "playerPosition": "Interchange",
                            "playerPositionId": 500014,
                            "playerStats": {
                                "allRunMetres": 141,
                                "allRuns": 14,
                                "decoys": 7,
                                "fantasyPointsTotal": 37,
                                "hitUps": 13,
                                "kickReturnMetres": 12,
                                "kickReturns": 1,
                                "linebreakAssists": 1,
                                "mins": 39,
                                "offloads": 1,
                                "passes": 4,
                                "passesPerRun": 0.29,
                                "supports": 6,
                                "tackleBreaks": 1,
                                "tackles": 16,
                                "hitupRunMeters": 129,
                                "ptbAll": 12,
                                "receipts": 17,
                                "postContactMetres": 52,
                                "lineEngagedRuns": 1,
                                "ptbTwoToThree": 6,
                                "ptbThreeToFour": 4,
                                "ptbFourToFive": 2,
                                "doubles": 2,
                                "effectiveTacklePercentage": 100
                            },
                            "playerTookTheField": true,
                            "shirtNum": 14,
                            "playerFirstInitial": "K",
                            "playerPositionAbbrev": "INT",
                            "fantasyPrice": 285000,
                            "fantasySeasonPriceChange": 20000,
                            "fantasyRoundPriceChange": -15000
                        },
                        {
                            "playerFirstName": "Nelson",
                            "playerId": 501281,
                            "playerLastName": "Asofa-Solomona",
                            "playerName": "Nelson Asofa-Solomona",
                            "playerPosition": "Interchange",
                            "playerPositionId": 500014,
                            "playerStats": {
                                "allRunMetres": 120,
                                "allRuns": 9,
                                "decoys": 8,
                                "fantasyPointsTotal": 25,
                                "hitUps": 6,
                                "ineffectiveTackles": 1,
                                "kickReturnMetres": 53,
                                "kickReturns": 3,
                                "mins": 27,
                                "missedTackles": 2,
                                "oneOnOneTackles": 1,
                                "supports": 1,
                                "tackleBreaks": 2,
                                "tackles": 11,
                                "hitupRunMeters": 67,
                                "ptbAll": 8,
                                "receipts": 9,
                                "postContactMetres": 43,
                                "ptbTwoToThree": 2,
                                "ptbThreeToFour": 3,
                                "ptbFourToFive": 3,
                                "effectiveTacklePercentage": 78.6
                            },
                            "playerTookTheField": true,
                            "shirtNum": 17,
                            "playerFirstInitial": "N",
                            "playerPositionAbbrev": "INT",
                            "fantasyPrice": 226000,
                            "fantasySeasonPriceChange": 8000,
                            "fantasyRoundPriceChange": 9000
                        }
                    ]
                },
                "teamName": "Melbourne Storm",
                "teamNickName": "Storm",
                "teamStats": {
                    "allRunMetres": 2042,
                    "allRuns": 198,
                    "bombKicks": 3,
                    "bombKickMetres": 91,
                    "bombKicksDefused": 3,
                    "bombKicksNotDefused": 1,
                    "chargedDown": 1,
                    "completeSets": 36,
                    "completionPercentage": 82,
                    "conversions": 5,
                    "conversionsAttempts": 8,
                    "conversionsMissed": 3,
                    "decoys": 69,
                    "dummyHalfRuns": 8,
                    "errors": 7,
                    "goalConversionRate": 62.5,
                    "allGoals": 5,
                    "allGoalsAttempted": 8,
                    "allGoalsMissed": 3,
                    "hitUps": 98,
                    "incompleteSets": 8,
                    "ineffectiveTackles": 13,
                    "kickMetres": 520,
                    "kickReturnMetres": 292,
                    "kickReturns": 22,
                    "kicks": 20,
                    "kicksDefused": 7,
                    "kicksNotDefused": 2,
                    "lineDropouts": 2,
                    "linebreakAssists": 7,
                    "linebreaks": 10,
                    "missedTackles": 16,
                    "offloads": 8,
                    "oneOnOneTackles": 17,
                    "passes": 247,
                    "passesPerRun": 1.25,
                    "penalties": 4,
                    "points": 42,
                    "possession": 56,
                    "scrumWins": 4,
                    "supports": 106,
                    "tackleBreaks": 26,
                    "tackles": 298,
                    "sets": 44,
                    "tries": 8,
                    "tryAssists": 7,
                    "trySaves": 5,
                    "hitupRunMeters": 989,
                    "evasionRuns": 70,
                    "evasionRunMetres": 706,
                    "dummyHalfRunMetres": 55,
                    "ptbTotal": 151,
                    "twoManTackles": 72,
                    "threeManTackles": 66,
                    "fourManPlusTackles": 1,
                    "tryScoringPercentage": 22.22,
                    "shiftsLeft": 15,
                    "shiftsRight": 17,
                    "receipts": 439,
                    "forcedDropOutKicker": 3,
                    "chipKick": 1,
                    "grubberKick": 7,
                    "postContactMetres": 623,
                    "dummyPasses": 23,
                    "kickPressures": 14,
                    "lineEngagedRuns": 22,
                    "ptbOneToTwo": 6,
                    "ptbTwoToThree": 32,
                    "ptbThreeToFour": 65,
                    "ptbFourToFive": 38,
                    "ptbFivePlus": 10,
                    "interchangeUsed": 8,
                    "doubles": 43,
                    "longKicksSpace": 3,
                    "effectiveTacklePercentage": 91.1,
                    "ptbPenalties": 3,
                    "generalPlayPenalties": 1,
                    "foulPlayPenalties": 1,
                    "averageSetDistance": 46.4,
                    "completeSets1stHalf": 19,
                    "completeSets2ndHalf": 17,
                    "completionPercentage1stHalf": 82.61,
                    "completionPercentage2ndHalf": 80.95,
                    "incompleteSets1stHalf": 4,
                    "incompleteSets2ndHalf": 4,
                    "incompletionPercentage1stHalf": 17.39,
                    "incompletionPercentage2ndHalf": 19.05
                },
                "teamHexColour": "782b90",
                "teamHexColour2": "3C1648"
            },
            {
                "score": [],
                "team1stHalfScore": 0,
                "team2ndHalfScore": 0,
                "teamAbbr": "WAR",
                "teamFinalScore": 0,
                "teamFullTimeScore": 0,
                "teamHalfTimeScore": 0,
                "teamId": 500032,
                "teamLineup": {
                    "teamLineUpStatusID": 4,
                    "teamLineUpStatus": "Final",
                    "injuriesAndSuspensions": {
                        "injury": [],
                        "suspension": []
                    },
                    "insAndOuts": {
                        "inOut": [
                            {
                                "inOut": "In",
                                "playerFirstName": "Manu",
                                "playerId": "500722",
                                "playerLastName": "Vatuvei",
                                "playerName": "Manu Vatuvei"
                            },
                            {
                                "inOut": "Out",
                                "playerFirstName": "Roger",
                                "playerId": "500005",
                                "playerLastName": "Tuivasa-Sheck",
                                "playerName": "Roger Tuivasa-Sheck"
                            }
                        ]
                    },
                    "teamPlayer": [
                        {
                            "playerFirstName": "Tuimoala",
                            "playerId": 500927,
                            "playerLastName": "Lolohea",
                            "playerName": "Tuimoala Lolohea",
                            "playerPosition": "Fullback",
                            "playerPositionId": 500001,
                            "playerStats": {
                                "allRunMetres": 27,
                                "allRuns": 3,
                                "bombKicksDefused": 2,
                                "errors": 1,
                                "fantasyPointsTotal": 1,
                                "kickMetres": 12,
                                "kickReturnMetres": 19,
                                "kickReturns": 2,
                                "kicks": 1,
                                "kicksDefused": 2,
                                "mins": 26,
                                "missedTackles": 1,
                                "passes": 1,
                                "passesPerRun": 0.33,
                                "supports": 2,
                                "tackles": 1,
                                "evasionRuns": 1,
                                "evasionRunMetres": 8,
                                "ptbAll": 3,
                                "receipts": 7,
                                "grubberKick": 1,
                                "postContactMetres": 8,
                                "dummyPasses": 1,
                                "ptbTwoToThree": 1,
                                "ptbThreeToFour": 1,
                                "ptbFivePlus": 1,
                                "effectiveTacklePercentage": 50
                            },
                            "playerTookTheField": true,
                            "shirtNum": 1,
                            "playerFirstInitial": "T",
                            "playerPositionAbbrev": "FB",
                            "fantasyPrice": 283000,
                            "fantasySeasonPriceChange": -41000,
                            "fantasyRoundPriceChange": 23000
                        },
                        {
                            "playerFirstName": "David",
                            "playerId": 500919,
                            "playerLastName": "Fusitua",
                            "playerName": "David Fusitua",
                            "playerPosition": "Winger 1",
                            "playerPositionId": 500002,
                            "playerStats": {
                                "allRunMetres": 164,
                                "allRuns": 15,
                                "bombKicksDefused": 1,
                                "decoys": 1,
                                "errors": 2,
                                "fantasyPointsTotal": 24,
                                "ineffectiveTackles": 2,
                                "kickReturnMetres": 38,
                                "kickReturns": 4,
                                "kicksDefused": 1,
                                "kicksNotDefused": 1,
                                "linebreaks": 1,
                                "mins": 80,
                                "missedTackles": 2,
                                "passes": 4,
                                "passesPerRun": 0.27,
                                "oneOnOneTackles": 1,
                                "supports": 7,
                                "tackleBreaks": 2,
                                "tackles": 5,
                                "tryCause": 2,
                                "evasionRuns": 11,
                                "evasionRunMetres": 126,
                                "ptbAll": 14,
                                "receipts": 21,
                                "postContactMetres": 52,
                                "dummyPasses": 1,
                                "ptbTwoToThree": 4,
                                "ptbThreeToFour": 6,
                                "ptbFourToFive": 4,
                                "doubles": 1,
                                "effectiveTacklePercentage": 55.6
                            },
                            "playerTookTheField": true,
                            "shirtNum": 2,
                            "playerFirstInitial": "D",
                            "playerPositionAbbrev": "WG",
                            "fantasyPrice": 268000,
                            "fantasySeasonPriceChange": 7000,
                            "fantasyRoundPriceChange": 7000
                        },
                        {
                            "playerFirstName": "Blake",
                            "playerId": 500787,
                            "playerLastName": "Ayshford",
                            "playerName": "Blake Ayshford",
                            "playerPosition": "Centre 1",
                            "playerPositionId": 500003,
                            "playerStats": {
                                "allRunMetres": 77,
                                "allRuns": 8,
                                "decoys": 5,
                                "fantasyPointsTotal": 30,
                                "ineffectiveTackles": 2,
                                "kicksDefused": 1,
                                "mins": 70,
                                "offloads": 1,
                                "passes": 6,
                                "passesPerRun": 0.75,
                                "oneOnOneTackles": 1,
                                "penalties": 1,
                                "sinBins": 1,
                                "supports": 6,
                                "tackles": 27,
                                "evasionRuns": 8,
                                "evasionRunMetres": 77,
                                "ptbAll": 7,
                                "receipts": 15,
                                "postContactMetres": 34,
                                "ptbTwoToThree": 1,
                                "ptbThreeToFour": 4,
                                "ptbFourToFive": 1,
                                "ptbFivePlus": 1,
                                "doubles": 3,
                                "effectiveTacklePercentage": 93.1,
                                "generalPlayPenalties": 1
                            },
                            "playerTookTheField": true,
                            "shirtNum": 3,
                            "playerFirstInitial": "B",
                            "playerPositionAbbrev": "CT",
                            "fantasyPrice": 262000,
                            "fantasySeasonPriceChange": 66000,
                            "fantasyRoundPriceChange": 27000
                        },
                        {
                            "playerFirstName": "Solomone",
                            "playerId": 500921,
                            "playerLastName": "Kata",
                            "playerName": "Solomone Kata",
                            "playerPosition": "Centre 2",
                            "playerPositionId": 500004,
                            "playerStats": {
                                "allRunMetres": 93,
                                "allRuns": 9,
                                "decoys": 1,
                                "fantasyPointsTotal": 31,
                                "mins": 80,
                                "missedTackles": 1,
                                "offloads": 1,
                                "passes": 4,
                                "passesPerRun": 0.44,
                                "oneOnOneTackles": 3,
                                "supports": 2,
                                "tackleBreaks": 4,
                                "tackles": 10,
                                "tryCause": 2,
                                "evasionRuns": 9,
                                "evasionRunMetres": 93,
                                "ptbAll": 9,
                                "receipts": 14,
                                "postContactMetres": 36,
                                "dummyPasses": 1,
                                "ptbTwoToThree": 1,
                                "ptbThreeToFour": 3,
                                "ptbFourToFive": 4,
                                "ptbFivePlus": 1,
                                "doubles": 2,
                                "effectiveTacklePercentage": 90.9
                            },
                            "playerTookTheField": true,
                            "shirtNum": 4,
                            "playerFirstInitial": "S",
                            "playerPositionAbbrev": "CT",
                            "fantasyPrice": 351000,
                            "fantasySeasonPriceChange": 63000,
                            "fantasyRoundPriceChange": 2000
                        },
                        {
                            "playerFirstName": "Manu",
                            "playerId": 500722,
                            "playerLastName": "Vatuvei",
                            "playerName": "Manu Vatuvei",
                            "playerPosition": "Winger 2",
                            "playerPositionId": 500005,
                            "playerStats": {
                                "allRunMetres": 145,
                                "allRuns": 12,
                                "decoys": 3,
                                "fantasyPointsTotal": 32,
                                "hitUps": 1,
                                "kickMetres": 14,
                                "kickReturnMetres": 72,
                                "kickReturns": 5,
                                "kicks": 1,
                                "kicksDefused": 3,
                                "kicksNotDefused": 1,
                                "mins": 80,
                                "missedTackles": 1,
                                "offloads": 1,
                                "passes": 3,
                                "passesPerRun": 0.25,
                                "supports": 1,
                                "tackleBreaks": 2,
                                "tackles": 4,
                                "tryCause": 3,
                                "trySaves": 1,
                                "hitupRunMeters": 11,
                                "evasionRuns": 6,
                                "evasionRunMetres": 62,
                                "ptbAll": 12,
                                "receipts": 17,
                                "forcedDropOutKicker": 1,
                                "grubberKick": 1,
                                "postContactMetres": 41,
                                "ptbOneToTwo": 2,
                                "ptbTwoToThree": 3,
                                "ptbThreeToFour": 5,
                                "ptbFourToFive": 1,
                                "ptbFivePlus": 1,
                                "effectiveTacklePercentage": 80
                            },
                            "playerTookTheField": true,
                            "shirtNum": 5,
                            "playerFirstInitial": "M",
                            "playerPositionAbbrev": "WG",
                            "fantasyPrice": 294000,
                            "fantasySeasonPriceChange": -32000
                        },
                        {
                            "playerFirstName": "Thomas",
                            "playerId": 500707,
                            "playerLastName": "Leuluai",
                            "playerName": "Thomas Leuluai",
                            "playerPosition": "Five-Eighth",
                            "playerPositionId": 500006,
                            "playerStats": {
                                "allRunMetres": 85,
                                "allRuns": 13,
                                "decoys": 1,
                                "dummyHalfRuns": 1,
                                "fantasyPointsTotal": 28,
                                "ineffectiveTackles": 1,
                                "kickMetres": 38,
                                "kicks": 2,
                                "mins": 80,
                                "missedTackles": 1,
                                "passes": 35,
                                "passesPerRun": 2.69,
                                "supports": 11,
                                "tackleBreaks": 2,
                                "tackles": 15,
                                "tryCause": 1,
                                "evasionRuns": 12,
                                "evasionRunMetres": 79,
                                "dummyHalfRunMetres": 6,
                                "ptbAll": 4,
                                "receipts": 40,
                                "grubberKick": 1,
                                "postContactMetres": 13,
                                "dummyPasses": 3,
                                "lineEngagedRuns": 8,
                                "ptbTwoToThree": 2,
                                "ptbThreeToFour": 2,
                                "doubles": 3,
                                "longKicksSpace": 1,
                                "effectiveTacklePercentage": 88.2
                            },
                            "playerTookTheField": true,
                            "shirtNum": 6,
                            "playerFirstInitial": "T",
                            "playerPositionAbbrev": "FE",
                            "fantasyPrice": 257000,
                            "fantasySeasonPriceChange": -22000,
                            "fantasyRoundPriceChange": -19000
                        },
                        {
                            "playerFirstName": "Shaun",
                            "playerId": 500705,
                            "playerLastName": "Johnson",
                            "playerName": "Shaun Johnson",
                            "playerPosition": "Halfback",
                            "playerPositionId": 500007,
                            "playerStats": {
                                "allRunMetres": 59,
                                "allRuns": 12,
                                "bombKicks": 4,
                                "bombKickMetres": 97,
                                "chargeDowns": 1,
                                "decoys": 1,
                                "fantasyPointsTotal": 35,
                                "ineffectiveTackles": 2,
                                "kickDead": 1,
                                "kickMetres": 334,
                                "kicks": 14,
                                "lineDropouts": 4,
                                "mins": 80,
                                "missedTackles": 4,
                                "passes": 48,
                                "passesPerRun": 4,
                                "oneOnOneTackles": 3,
                                "penalties": 1,
                                "supports": 10,
                                "tackleBreaks": 1,
                                "tackles": 21,
                                "tryCause": 2,
                                "evasionRuns": 12,
                                "evasionRunMetres": 59,
                                "ptbAll": 1,
                                "receipts": 61,
                                "forcedDropOutKicker": 1,
                                "chipKick": 1,
                                "grubberKick": 2,
                                "crossFieldKick": 1,
                                "postContactMetres": 2,
                                "dummyPasses": 4,
                                "kickPressures": 1,
                                "lineEngagedRuns": 10,
                                "ptbTwoToThree": 1,
                                "doubles": 3,
                                "longKicksSpace": 3,
                                "effectiveTacklePercentage": 77.8,
                                "ptbPenalties": 1
                            },
                            "playerTookTheField": true,
                            "shirtNum": 7,
                            "playerFirstInitial": "S",
                            "playerPositionAbbrev": "HB",
                            "fantasyPrice": 476000,
                            "fantasySeasonPriceChange": -1000,
                            "fantasyRoundPriceChange": 1000
                        },
                        {
                            "playerFirstName": "Sam",
                            "playerId": 500926,
                            "playerLastName": "Lisone",
                            "playerName": "Sam Lisone",
                            "playerPosition": "Prop 1",
                            "playerPositionId": 500008,
                            "playerStats": {
                                "allRunMetres": 76,
                                "allRuns": 10,
                                "decoys": 3,
                                "dummyHalfRuns": 1,
                                "fantasyPointsTotal": 29,
                                "hitUps": 8,
                                "ineffectiveTackles": 1,
                                "mins": 38,
                                "missedTackles": 1,
                                "passes": 3,
                                "passesPerRun": 0.3,
                                "oneOnOneTackles": 1,
                                "supports": 2,
                                "tackles": 24,
                                "tryCause": 1,
                                "hitupRunMeters": 64,
                                "evasionRuns": 1,
                                "evasionRunMetres": 6,
                                "dummyHalfRunMetres": 6,
                                "ptbAll": 8,
                                "receipts": 12,
                                "postContactMetres": 24,
                                "dummyPasses": 2,
                                "kickPressures": 1,
                                "lineEngagedRuns": 1,
                                "ptbThreeToFour": 5,
                                "ptbFourToFive": 3,
                                "doubles": 4,
                                "effectiveTacklePercentage": 92.3
                            },
                            "playerTookTheField": true,
                            "shirtNum": 8,
                            "playerFirstInitial": "S",
                            "playerPositionAbbrev": "PR",
                            "fantasyPrice": 194000,
                            "fantasySeasonPriceChange": -33000,
                            "fantasyRoundPriceChange": 1000
                        },
                        {
                            "playerFirstName": "Issac",
                            "playerId": 500088,
                            "playerLastName": "Luke",
                            "playerName": "Issac Luke",
                            "playerPosition": "Hooker",
                            "playerPositionId": 500009,
                            "playerStats": {
                                "allRunMetres": 57,
                                "allRuns": 7,
                                "dummyHalfRuns": 2,
                                "errors": 1,
                                "fantasyPointsTotal": 47,
                                "hitUps": 3,
                                "ineffectiveTackles": 1,
                                "mins": 80,
                                "missedTackles": 2,
                                "offloads": 1,
                                "passes": 83,
                                "passesPerRun": 11.86,
                                "penalties": 2,
                                "supports": 6,
                                "tackleBreaks": 1,
                                "tackles": 47,
                                "tryCause": 1,
                                "hitupRunMeters": 17,
                                "evasionRuns": 2,
                                "evasionRunMetres": 16,
                                "dummyHalfRunMetres": 24,
                                "ptbAll": 4,
                                "receipts": 87,
                                "postContactMetres": 5,
                                "dummyPasses": 1,
                                "lineEngagedRuns": 2,
                                "ptbTwoToThree": 1,
                                "ptbThreeToFour": 3,
                                "doubles": 8,
                                "effectiveTacklePercentage": 94,
                                "ptbPenalties": 1,
                                "foulPlayPenalties": 1
                            },
                            "playerTookTheField": true,
                            "shirtNum": 9,
                            "playerFirstInitial": "I",
                            "playerPositionAbbrev": "HK",
                            "fantasyPrice": 430000,
                            "fantasySeasonPriceChange": -7000,
                            "fantasyRoundPriceChange": 3000
                        },
                        {
                            "playerFirstName": "Ben",
                            "playerId": 500715,
                            "playerLastName": "Matulino",
                            "playerName": "Ben Matulino",
                            "playerPosition": "Prop 2",
                            "playerPositionId": 500010,
                            "playerStats": {
                                "allRunMetres": 109,
                                "allRuns": 13,
                                "decoys": 5,
                                "errors": 1,
                                "fantasyPointsTotal": 42,
                                "hitUps": 10,
                                "ineffectiveTackles": 1,
                                "mins": 58,
                                "missedTackles": 1,
                                "passes": 4,
                                "passesPerRun": 0.31,
                                "oneOnOneTackles": 1,
                                "penalties": 1,
                                "supports": 2,
                                "tackleBreaks": 1,
                                "tackles": 35,
                                "tryCause": 1,
                                "hitupRunMeters": 91,
                                "evasionRuns": 3,
                                "evasionRunMetres": 18,
                                "ptbAll": 9,
                                "receipts": 14,
                                "postContactMetres": 36,
                                "dummyPasses": 1,
                                "kickPressures": 2,
                                "lineEngagedRuns": 3,
                                "ptbOneToTwo": 2,
                                "ptbTwoToThree": 2,
                                "ptbThreeToFour": 3,
                                "ptbFourToFive": 2,
                                "doubles": 4,
                                "effectiveTacklePercentage": 94.6,
                                "foulPlayPenalties": 1
                            },
                            "playerTookTheField": true,
                            "shirtNum": 10,
                            "playerFirstInitial": "B",
                            "playerPositionAbbrev": "PR",
                            "fantasyPrice": 410000,
                            "fantasySeasonPriceChange": -15000,
                            "fantasyRoundPriceChange": -16000
                        },
                        {
                            "playerFirstName": "Bodene",
                            "playerId": 500664,
                            "playerLastName": "Thompson",
                            "playerName": "Bodene Thompson",
                            "playerPosition": "2nd Row 1",
                            "playerPositionId": 500011,
                            "playerStats": {
                                "allRunMetres": 123,
                                "allRuns": 11,
                                "decoys": 7,
                                "errors": 1,
                                "fantasyPointsTotal": 52,
                                "hitUps": 11,
                                "ineffectiveTackles": 2,
                                "kickMetres": 26,
                                "kicks": 1,
                                "mins": 80,
                                "missedTackles": 4,
                                "offloads": 1,
                                "passes": 5,
                                "passesPerRun": 0.45,
                                "oneOnOneTackles": 5,
                                "penalties": 1,
                                "supports": 3,
                                "tackles": 49,
                                "tryCause": 2,
                                "hitupRunMeters": 123,
                                "ptbAll": 7,
                                "receipts": 17,
                                "postContactMetres": 52,
                                "kickPressures": 3,
                                "ptbThreeToFour": 5,
                                "ptbFourToFive": 2,
                                "doubles": 9,
                                "longKicksSpace": 1,
                                "effectiveTacklePercentage": 89.1,
                                "ptbPenalties": 1
                            },
                            "playerTookTheField": true,
                            "shirtNum": 11,
                            "playerFirstInitial": "B",
                            "playerPositionAbbrev": "2R",
                            "fantasyPrice": 464000,
                            "fantasySeasonPriceChange": 14000,
                            "fantasyRoundPriceChange": 4000
                        },
                        {
                            "playerFirstName": "Ryan",
                            "playerId": 500596,
                            "playerLastName": "Hoffman",
                            "playerName": "Ryan Hoffman",
                            "playerPosition": "2nd Row 2",
                            "playerPositionId": 500012,
                            "playerStats": {
                                "allRunMetres": 105,
                                "allRuns": 11,
                                "decoys": 5,
                                "dummyHalfRuns": 1,
                                "fantasyPointsTotal": 36,
                                "hitUps": 9,
                                "kickReturnMetres": 12,
                                "kickReturns": 1,
                                "kicksDefused": 1,
                                "mins": 80,
                                "missedTackles": 3,
                                "offloads": 1,
                                "passes": 1,
                                "passesPerRun": 0.09,
                                "supports": 2,
                                "tackles": 29,
                                "tryCause": 1,
                                "hitupRunMeters": 88,
                                "dummyHalfRunMetres": 5,
                                "ptbAll": 11,
                                "receipts": 13,
                                "postContactMetres": 34,
                                "dummyPasses": 1,
                                "kickPressures": 1,
                                "ptbTwoToThree": 4,
                                "ptbThreeToFour": 3,
                                "ptbFourToFive": 2,
                                "ptbFivePlus": 2,
                                "doubles": 2,
                                "effectiveTacklePercentage": 90.6
                            },
                            "playerTookTheField": true,
                            "shirtNum": 12,
                            "playerFirstInitial": "R",
                            "playerPositionAbbrev": "2R",
                            "fantasyPrice": 252000,
                            "fantasySeasonPriceChange": -49000
                        },
                        {
                            "playerFirstName": "Simon",
                            "playerId": 500712,
                            "playerLastName": "Mannering",
                            "playerName": "Simon Mannering",
                            "playerPosition": "Lock",
                            "playerPositionId": 500013,
                            "playerStats": {
                                "allRunMetres": 39,
                                "allRuns": 4,
                                "decoys": 9,
                                "errors": 1,
                                "fantasyPointsTotal": 30,
                                "hitUps": 4,
                                "mins": 44,
                                "missedTackles": 1,
                                "supports": 3,
                                "tackles": 31,
                                "hitupRunMeters": 39,
                                "ptbAll": 3,
                                "receipts": 4,
                                "postContactMetres": 17,
                                "dummyPasses": 2,
                                "kickPressures": 2,
                                "ptbThreeToFour": 3,
                                "doubles": 5,
                                "effectiveTacklePercentage": 96.9
                            },
                            "playerTookTheField": true,
                            "shirtNum": 13,
                            "playerFirstInitial": "S",
                            "playerPositionAbbrev": "LK",
                            "fantasyPrice": 462000,
                            "fantasySeasonPriceChange": -73000,
                            "fantasyRoundPriceChange": -13000
                        },
                        {
                            "playerFirstName": "Jonathan",
                            "playerId": 500815,
                            "playerLastName": "Wright",
                            "playerName": "Jonathan Wright",
                            "playerPosition": "Interchange",
                            "playerPositionId": 500014,
                            "playerStats": {
                                "allRunMetres": 84,
                                "allRuns": 10,
                                "decoys": 1,
                                "errors": 1,
                                "fantasyPointsTotal": 22,
                                "hitUps": 3,
                                "kickReturnMetres": 3,
                                "kickReturns": 2,
                                "mins": 55,
                                "offloads": 1,
                                "passes": 2,
                                "passesPerRun": 0.2,
                                "oneOnOneTackles": 1,
                                "supports": 4,
                                "tackleBreaks": 2,
                                "tackles": 3,
                                "tryCause": 1,
                                "trySaves": 1,
                                "hitupRunMeters": 31,
                                "evasionRuns": 5,
                                "evasionRunMetres": 50,
                                "ptbAll": 8,
                                "receipts": 12,
                                "postContactMetres": 33,
                                "ptbTwoToThree": 1,
                                "ptbThreeToFour": 6,
                                "ptbFourToFive": 1,
                                "effectiveTacklePercentage": 100
                            },
                            "playerTookTheField": true,
                            "shirtNum": 14,
                            "playerFirstInitial": "J",
                            "playerPositionAbbrev": "INT",
                            "fantasyPrice": 205000,
                            "fantasySeasonPriceChange": -8000,
                            "fantasyRoundPriceChange": -4000
                        },
                        {
                            "playerFirstName": "Jacob",
                            "playerId": 500708,
                            "playerLastName": "Lillyman",
                            "playerName": "Jacob Lillyman",
                            "playerPosition": "Interchange",
                            "playerPositionId": 500014,
                            "playerStats": {
                                "allRunMetres": 113,
                                "allRuns": 14,
                                "decoys": 9,
                                "fantasyPointsTotal": 45,
                                "hitUps": 12,
                                "ineffectiveTackles": 1,
                                "mins": 50,
                                "missedTackles": 1,
                                "passes": 2,
                                "passesPerRun": 0.14,
                                "oneOnOneTackles": 1,
                                "supports": 4,
                                "tackles": 36,
                                "tryCause": 1,
                                "hitupRunMeters": 103,
                                "evasionRuns": 2,
                                "evasionRunMetres": 10,
                                "ptbAll": 13,
                                "receipts": 15,
                                "postContactMetres": 31,
                                "lineEngagedRuns": 2,
                                "ptbTwoToThree": 2,
                                "ptbThreeToFour": 8,
                                "ptbFourToFive": 3,
                                "doubles": 8,
                                "effectiveTacklePercentage": 94.7
                            },
                            "playerTookTheField": true,
                            "shirtNum": 15,
                            "playerFirstInitial": "J",
                            "playerPositionAbbrev": "INT",
                            "fantasyPrice": 302000,
                            "fantasySeasonPriceChange": 3000,
                            "fantasyRoundPriceChange": 8000
                        },
                        {
                            "playerFirstName": "Charlie",
                            "playerId": 500701,
                            "playerLastName": "Gubb",
                            "playerName": "Charlie Gubb",
                            "playerPosition": "Interchange",
                            "playerPositionId": 500014,
                            "playerStats": {
                                "allRunMetres": 87,
                                "allRuns": 9,
                                "decoys": 7,
                                "fantasyPointsTotal": 28,
                                "hitUps": 8,
                                "kicksDefused": 1,
                                "mins": 36,
                                "missedTackles": 3,
                                "offloads": 1,
                                "passes": 1,
                                "passesPerRun": 0.11,
                                "supports": 6,
                                "tackleBreaks": 1,
                                "tackles": 20,
                                "hitupRunMeters": 82,
                                "evasionRuns": 1,
                                "evasionRunMetres": 5,
                                "ptbAll": 7,
                                "receipts": 9,
                                "postContactMetres": 31,
                                "lineEngagedRuns": 1,
                                "ptbTwoToThree": 2,
                                "ptbThreeToFour": 3,
                                "ptbFourToFive": 2,
                                "doubles": 2,
                                "effectiveTacklePercentage": 87
                            },
                            "playerTookTheField": true,
                            "shirtNum": 16,
                            "playerFirstInitial": "C",
                            "playerPositionAbbrev": "INT",
                            "fantasyPrice": 187000,
                            "fantasySeasonPriceChange": -40000,
                            "fantasyRoundPriceChange": -10000
                        },
                        {
                            "playerFirstName": "Ligi",
                            "playerId": 500582,
                            "playerLastName": "Sao",
                            "playerName": "Ligi Sao",
                            "playerPosition": "Interchange",
                            "playerPositionId": 500014,
                            "playerStats": {
                                "allRunMetres": 39,
                                "allRuns": 4,
                                "decoys": 2,
                                "fantasyPointsTotal": 11,
                                "hitUps": 4,
                                "mins": 14,
                                "supports": 2,
                                "tackles": 8,
                                "hitupRunMeters": 39,
                                "ptbAll": 4,
                                "receipts": 4,
                                "postContactMetres": 17,
                                "ptbThreeToFour": 2,
                                "ptbFourToFive": 2,
                                "effectiveTacklePercentage": 100
                            },
                            "playerTookTheField": true,
                            "shirtNum": 17,
                            "playerFirstInitial": "L",
                            "playerPositionAbbrev": "INT",
                            "fantasyPrice": 256000,
                            "fantasySeasonPriceChange": -14000,
                            "fantasyRoundPriceChange": -14000
                        }
                    ]
                },
                "teamName": "New Zealand Warriors",
                "teamNickName": "Warriors",
                "teamStats": {
                    "allRunMetres": 1483,
                    "allRuns": 165,
                    "bombKicks": 4,
                    "bombKickMetres": 97,
                    "bombKicksDefused": 3,
                    "chargeDowns": 1,
                    "completeSets": 21,
                    "completionPercentage": 70,
                    "decoys": 60,
                    "dummyHalfRuns": 5,
                    "errors": 8,
                    "hitUps": 73,
                    "incompleteSets": 9,
                    "ineffectiveTackles": 13,
                    "kickDead": 1,
                    "kickMetres": 424,
                    "kickReturnMetres": 145,
                    "kickReturns": 14,
                    "kicks": 19,
                    "kicksDefused": 9,
                    "kicksNotDefused": 2,
                    "lineDropouts": 4,
                    "linebreaks": 1,
                    "missedTackles": 26,
                    "offloads": 8,
                    "oneOnOneTackles": 17,
                    "passes": 202,
                    "passesPerRun": 1.22,
                    "penalties": 6,
                    "pointsConceded": 42,
                    "possession": 44,
                    "scrumWins": 5,
                    "sinBins": 1,
                    "supports": 73,
                    "tackleBreaks": 16,
                    "tackles": 365,
                    "sets": 30,
                    "triesConceded": 8,
                    "tryCause": 18,
                    "trySaves": 2,
                    "hitupRunMeters": 688,
                    "evasionRuns": 73,
                    "evasionRunMetres": 608,
                    "dummyHalfRunMetres": 42,
                    "ptbTotal": 124,
                    "twoManTackles": 64,
                    "threeManTackles": 44,
                    "fourManPlusTackles": 4,
                    "shiftsLeft": 10,
                    "shiftsRight": 21,
                    "receipts": 362,
                    "forcedDropOutKicker": 2,
                    "chipKick": 1,
                    "grubberKick": 5,
                    "crossFieldKick": 1,
                    "postContactMetres": 464,
                    "dummyPasses": 17,
                    "kickPressures": 10,
                    "lineEngagedRuns": 27,
                    "ptbOneToTwo": 4,
                    "ptbTwoToThree": 25,
                    "ptbThreeToFour": 62,
                    "ptbFourToFive": 27,
                    "ptbFivePlus": 6,
                    "interchangeUsed": 6,
                    "interchangeLeft": 2,
                    "doubles": 54,
                    "longKicksSpace": 5,
                    "effectiveTacklePercentage": 90.3,
                    "ptbPenalties": 3,
                    "generalPlayPenalties": 1,
                    "foulPlayPenalties": 2,
                    "averageSetDistance": 49.4,
                    "completeSets1stHalf": 9,
                    "completeSets2ndHalf": 12,
                    "completionPercentage1stHalf": 69.23,
                    "completionPercentage2ndHalf": 70.59,
                    "incompleteSets1stHalf": 4,
                    "incompleteSets2ndHalf": 5,
                    "incompletionPercentage1stHalf": 30.77,
                    "incompletionPercentage2ndHalf": 29.41
                },
                "teamHexColour": "878a8f",
                "teamHexColour2": "444548"
            }
        ]
    }
}