{
    "vod": [
        {
            "id": "p3YXg5YTE6W-BRbbJMPTcDi8tBDppVeD",
            "contentId": 896462,
            "title": "Rd 2: Wests Tigers v Panthers (Hls)",
            "description": "Highlights from the Round 2 clash between Wests Tigers and Penrith Panthers",
            "publishDate": "2017-03-12T18:05:46+11:00",
            "publisher": "NRL Chief",
            "thumbnailUrl": "http://bpvideos.telstra.insnw.net/web/images/20170312180749a_89x50.png",
            "largeThumbnailUrl": "http://bpvideos.telstra.insnw.net/web/images/20170312180749a_326x184.png",
            "programType": "Highlights",
            "programCategory": "Match",
            "priority": null,
            "lastUpdateDate": "2017-03-12T18:14:42+11:00",
            "isPremium": false,
            "club": [
                500014,
                500023
            ]
        },
        {
            "id": "8wbXg5YTE6dM6N8NmOuxJ6Blw3ootnsQ",
            "contentId": 896465,
            "title": "Rd 2 Press Conference: Wests Tigers",
            "description": "Wests Tigers coach Jason Taylor and captain Aaron Woods chat to the media after their Round Two loss",
            "publishDate": "2017-03-12T18:43:26+11:00",
            "publisher": "NRL Chief",
            "thumbnailUrl": "http://bpvideos.telstra.insnw.net/web/images/20170312183550a_89x50.jpg",
            "largeThumbnailUrl": "http://bpvideos.telstra.insnw.net/web/images/20170312183550a_326x184.jpg",
            "programType": "Press Conference",
            "programCategory": null,
            "priority": null,
            "lastUpdateDate": "2017-03-12T18:51:52+11:00",
            "isPremium": false,
            "club": [
                500023
            ]
        },
        {
            "id": "V2aHg5YTE6yVfrc45zhzDk1njpvvHIRD",
            "contentId": 896463,
            "title": "Rd 2 Press Conference: Panthers",
            "description": "Panthers coach Anthony Griffin and captain Matt Moylan face the media",
            "publishDate": "2017-03-12T18:30:06+11:00",
            "publisher": "NRL Chief",
            "thumbnailUrl": "http://bpvideos.telstra.insnw.net/web/images/20170312183058a_89x50.jpg",
            "largeThumbnailUrl": "http://bpvideos.telstra.insnw.net/web/images/20170312183058a_326x184.jpg",
            "programType": "Press Conference",
            "programCategory": null,
            "priority": null,
            "lastUpdateDate": "2017-03-12T18:39:48+11:00",
            "isPremium": false,
            "club": [
                500014
            ]
        },
        {
            "id": "xhNHg5YTE6_kFeoNpvw4NqKhl3ux5EvY",
            "contentId": 897534,
            "title": "Rd 2: GOAL Nathan Cleary (73rd min)",
            "description": "Nathan Cleary converts his own try",
            "publishDate": "2017-03-12T17:51:59+11:00",
            "publisher": "NRL Chief",
            "thumbnailUrl": "http://bpvideos.telstra.insnw.net/web/images/20170312175132a_89x50.jpg",
            "largeThumbnailUrl": "http://bpvideos.telstra.insnw.net/web/images/20170312175132a_326x184.jpg",
            "programType": "Instant Replay",
            "programCategory": "Score",
            "priority": 10,
            "lastUpdateDate": "2017-03-12T17:56:37+11:00",
            "isPremium": true,
            "club": [
                500014,
                500023
            ]
        },
        {
            "id": "44NHg5YTE6MxxLbdnkkuzz50OfUfXJv3",
            "contentId": 897532,
            "title": "Rd 2: TRY Nathan Cleary (72nd min)",
            "description": "Nathan Cleary adds a try to his haul of points",
            "publishDate": "2017-03-12T17:51:58+11:00",
            "publisher": "NRL Chief",
            "thumbnailUrl": "http://bpvideos.telstra.insnw.net/web/images/20170312174851a_89x50.jpg",
            "largeThumbnailUrl": "http://bpvideos.telstra.insnw.net/web/images/20170312174851a_326x184.jpg",
            "programType": "Instant Replay",
            "programCategory": "Score",
            "priority": 10,
            "lastUpdateDate": "2017-03-12T17:55:37+11:00",
            "isPremium": true,
            "club": [
                500014,
                500023
            ]
        },
        {
            "id": "E0Mng5YTE6OrKk64vVs9eKWj9Ik1Ismz",
            "contentId": 897531,
            "title": "Rd 2: GOAL Nathan Cleary (66th min)",
            "description": "Nathan Cleary adds another two points for the Panthers",
            "publishDate": "2017-03-12T17:45:21+11:00",
            "publisher": "NRL Chief",
            "thumbnailUrl": "http://bpvideos.telstra.insnw.net/web/images/20170312174516a_89x50.jpg",
            "largeThumbnailUrl": "http://bpvideos.telstra.insnw.net/web/images/20170312174516a_326x184.jpg",
            "programType": "Instant Replay",
            "programCategory": "Score",
            "priority": 10,
            "lastUpdateDate": "2017-03-12T17:49:35+11:00",
            "isPremium": true,
            "club": [
                500014,
                500023
            ]
        },
        {
            "id": "NqMXg5YTE6yT3FAmtEn_Mwgw-NUrmiBe",
            "contentId": 897530,
            "title": "Rd 2: TRY Dean Whare (65th min)",
            "description": "Dean Whare crosses for his second try of the afternoon",
            "publishDate": "2017-03-12T17:43:30+11:00",
            "publisher": "NRL Chief",
            "thumbnailUrl": "http://bpvideos.telstra.insnw.net/web/images/20170312174227a_89x50.jpg",
            "largeThumbnailUrl": "http://bpvideos.telstra.insnw.net/web/images/20170312174227a_326x184.jpg",
            "programType": "Instant Replay",
            "programCategory": "Score",
            "priority": 10,
            "lastUpdateDate": "2017-03-12T17:47:35+11:00",
            "isPremium": true,
            "club": [
                500014,
                500023
            ]
        },
        {
            "id": "05d3c5YTE6vsWKabUwqoqzv0P4_27XQC",
            "contentId": 897524,
            "title": "Rd 2: GOAL Nathan Cleary (51st min)",
            "description": "Nathan Cleary adds the extras for the Panthers",
            "publishDate": "2017-03-12T17:31:20+11:00",
            "publisher": "NRL Chief",
            "thumbnailUrl": "http://bpvideos.telstra.insnw.net/web/images/20170312173101a_89x50.jpg",
            "largeThumbnailUrl": "http://bpvideos.telstra.insnw.net/web/images/20170312173101a_326x184.jpg",
            "programType": "Instant Replay",
            "programCategory": "Score",
            "priority": 9,
            "lastUpdateDate": "2017-03-12T17:35:31+11:00",
            "isPremium": true,
            "club": [
                500014,
                500023
            ]
        },
        {
            "id": "pkd3c5YTE6VPgInV0byZZ1g9sn8X3LAV",
            "contentId": 897525,
            "title": "Rd 2: TRY Leilani Latu (49th min)",
            "description": "Leilani Latu crosses for the first points of the second half",
            "publishDate": "2017-03-12T17:30:20+11:00",
            "publisher": "NRL Chief",
            "thumbnailUrl": "http://bpvideos.telstra.insnw.net/web/images/20170312172810a_89x50.jpg",
            "largeThumbnailUrl": "http://bpvideos.telstra.insnw.net/web/images/20170312172810a_326x184.jpg",
            "programType": "Instant Replay",
            "programCategory": "Score",
            "priority": 8,
            "lastUpdateDate": "2017-03-12T17:35:31+11:00",
            "isPremium": true,
            "club": [
                500014,
                500023
            ]
        },
        {
            "id": "84bnc5YTE6k0YPKmXbhOyuKva8IXk6Ap",
            "contentId": 897518,
            "title": "Rd 2: GOAL Nathan Cleary (40th min)",
            "description": "Nathan Cleary adds another two right on halftime",
            "publishDate": "2017-03-12T17:05:48+11:00",
            "publisher": "NRL Chief",
            "thumbnailUrl": "http://bpvideos.telstra.insnw.net/web/images/20170312170612a_89x50.jpg",
            "largeThumbnailUrl": "http://bpvideos.telstra.insnw.net/web/images/20170312170612a_326x184.jpg",
            "programType": "Instant Replay",
            "programCategory": "Score",
            "priority": 7,
            "lastUpdateDate": "2017-03-12T17:12:25+11:00",
            "isPremium": true,
            "club": [
                500014,
                500023
            ]
        },
        {
            "id": "B3bHc5YTE6tLpyUjwNejs9pbHGfjih26",
            "contentId": 897515,
            "title": "Rd 2: TRY Dylan Edwards (40th min)",
            "description": "Dylan Edwards crosses in the shadows of halftime",
            "publishDate": "2017-03-12T17:03:16+11:00",
            "publisher": "NRL Chief",
            "thumbnailUrl": "http://bpvideos.telstra.insnw.net/web/images/20170312170348a_89x50.jpg",
            "largeThumbnailUrl": "http://bpvideos.telstra.insnw.net/web/images/20170312170348a_326x184.jpg",
            "programType": "Instant Replay",
            "programCategory": "Score",
            "priority": 6,
            "lastUpdateDate": "2017-03-12T17:09:24+11:00",
            "isPremium": true,
            "club": [
                500014,
                500023
            ]
        },
        {
            "id": "htbHc5YTE6Ph98zQ1PiM00I8SpaKR7XT",
            "contentId": 897513,
            "title": "Rd 2: GOAL Nathan Cleary (39th min)",
            "description": "Nathan Cleary adds the extras",
            "publishDate": "2017-03-12T17:00:49+11:00",
            "publisher": "NRL Chief",
            "thumbnailUrl": "http://bpvideos.telstra.insnw.net/web/images/20170312170221a_89x50.jpg",
            "largeThumbnailUrl": "http://bpvideos.telstra.insnw.net/web/images/20170312170221a_326x184.jpg",
            "programType": "Instant Replay",
            "programCategory": "Score",
            "priority": 5,
            "lastUpdateDate": "2017-03-12T17:07:23+11:00",
            "isPremium": true,
            "club": [
                500014,
                500023
            ]
        },
        {
            "id": "10a3c5YTE6lkCqtQo5m7tosTA_uqK51G",
            "contentId": 897514,
            "title": "Rd 2: TRY Viliame Kikau (37th min)",
            "description": "Viliame Kikau kicks the Panthers out to a healthy lead",
            "publishDate": "2017-03-12T16:59:53+11:00",
            "publisher": "NRL Chief",
            "thumbnailUrl": "http://bpvideos.telstra.insnw.net/web/images/20170312170042a_89x50.jpg",
            "largeThumbnailUrl": "http://bpvideos.telstra.insnw.net/web/images/20170312170042a_326x184.jpg",
            "programType": "Instant Replay",
            "programCategory": "Score",
            "priority": 4,
            "lastUpdateDate": "2017-03-12T17:36:31+11:00",
            "isPremium": true,
            "club": [
                500014,
                500023
            ]
        },
        {
            "id": "w0aHc5YTE6CddJzykUfe-D8QsafzZ8to",
            "contentId": 897511,
            "title": "Rd 2: TRY Dean Whare (32nd min)",
            "description": "Dean Whare scores the first try of the afternoon",
            "publishDate": "2017-03-12T16:51:46+11:00",
            "publisher": "NRL Chief",
            "thumbnailUrl": "http://bpvideos.telstra.insnw.net/web/images/20170312165158a_89x50.jpg",
            "largeThumbnailUrl": "http://bpvideos.telstra.insnw.net/web/images/20170312165158a_326x184.jpg",
            "programType": "Instant Replay",
            "programCategory": "Score",
            "priority": 3,
            "lastUpdateDate": "2017-03-12T16:56:20+11:00",
            "isPremium": true,
            "club": [
                500014,
                500023
            ]
        },
        {
            "id": "U2Znc5YTE6NBiaQbPMZPY8NIFgB3qXd0",
            "contentId": 897502,
            "title": "Rd 2: PENALTY GOAL Mitchell Moses (29th min)",
            "description": "Mitchell Moses claims the long-awaited first points for the Wests Tigers",
            "publishDate": "2017-03-12T16:47:20+11:00",
            "publisher": "NRL Chief",
            "thumbnailUrl": "http://bpvideos.telstra.insnw.net/web/images/20170312164644a_89x50.jpg",
            "largeThumbnailUrl": "http://bpvideos.telstra.insnw.net/web/images/20170312164644a_326x184.jpg",
            "programType": "Instant Replay",
            "programCategory": "Score",
            "priority": 2,
            "lastUpdateDate": "2017-03-12T16:52:19+11:00",
            "isPremium": true,
            "club": [
                500014,
                500023
            ]
        },
        {
            "id": "c3OHc5YTE6eCbwQUAmdgXUklDVSSIFEt",
            "contentId": 897491,
            "title": "Rd 2: PENALTY GOAL Nathan Cleary (11th min)",
            "description": "Nathan Cleary opens the scoring for the Panthers from a penalty goal",
            "publishDate": "2017-03-12T16:27:43+11:00",
            "publisher": "NRL Chief",
            "thumbnailUrl": "http://bpvideos.telstra.insnw.net/web/images/20170312162748a_89x50.jpg",
            "largeThumbnailUrl": "http://bpvideos.telstra.insnw.net/web/images/20170312162748a_326x184.jpg",
            "programType": "Instant Replay",
            "programCategory": "Score",
            "priority": 1,
            "lastUpdateDate": "2017-03-12T16:32:14+11:00",
            "isPremium": true,
            "club": [
                500014,
                500023
            ]
        }
    ],
    "scores": [
        {
            "gameState": "First Half",
            "gameStateId": 3,
            "gameTime": "0:28:09",
            "gameSeconds": 1689,
            "GameMinutes": "28:09",
            "playerId": 500485,
            "playerName": "Mitchell Moses",
            "scoreMethod": "Penalty Goal",
            "statEvent": "Penalty Shot-Made",
            "statId": 67,
            "statValue": 2,
            "vidRef": 46381,
            "homeScore": 2,
            "awayScore": 2,
            "commentary": "Penalty Shot-Made by Mitchell Moses",
            "tackleNum": -1,
            "teamId": 500023,
            "teamName": "Wests Tigers",
            "homeTeamAbbrv": "WST",
            "awayTeamAbbrv": "PEN"
        },
        {
            "gameState": "First Half",
            "gameStateId": 3,
            "gameTime": "0:10:23",
            "gameSeconds": 623,
            "GameMinutes": "10:23",
            "playerId": 504120,
            "playerName": "Nathan Cleary",
            "scoreMethod": "Penalty Goal",
            "statEvent": "Penalty Shot-Made",
            "statId": 67,
            "statValue": 2,
            "vidRef": 16399,
            "awayScore": 2,
            "commentary": "Penalty Shot-Made by Nathan Cleary",
            "tackleNum": -1,
            "teamId": 500014,
            "teamName": "Penrith Panthers",
            "homeTeamAbbrv": "WST",
            "awayTeamAbbrv": "PEN"
        },
        {
            "gameState": "First Half",
            "gameStateId": 3,
            "gameTime": "0:31:04",
            "gameSeconds": 1864,
            "GameMinutes": "31:04",
            "playerId": 500368,
            "playerName": "Dean Whare",
            "scoreMethod": "Try",
            "statEvent": "Try",
            "statId": 38,
            "statValue": 4,
            "vidRef": 50760,
            "homeScore": 2,
            "awayScore": 6,
            "commentary": "Try by Dean Whare",
            "tackleNum": 5,
            "teamId": 500014,
            "teamName": "Penrith Panthers",
            "homeTeamAbbrv": "WST",
            "awayTeamAbbrv": "PEN"
        },
        {
            "gameState": "First Half",
            "gameStateId": 3,
            "gameTime": "0:37:00",
            "gameSeconds": 2220,
            "GameMinutes": "37:00",
            "playerId": 500408,
            "playerName": "Viliame Kikau",
            "scoreMethod": "Try",
            "statEvent": "Try",
            "statId": 38,
            "statValue": 4,
            "vidRef": 60029,
            "homeScore": 2,
            "awayScore": 10,
            "commentary": "Try by Viliame Kikau",
            "tackleNum": 3,
            "teamId": 500014,
            "teamName": "Penrith Panthers",
            "homeTeamAbbrv": "WST",
            "awayTeamAbbrv": "PEN"
        },
        {
            "gameState": "First Half",
            "gameStateId": 3,
            "gameTime": "0:38:24",
            "gameSeconds": 2304,
            "GameMinutes": "38:24",
            "playerId": 504120,
            "playerName": "Nathan Cleary",
            "scoreMethod": "Conversion",
            "statEvent": "Conversion-Made",
            "statId": 1,
            "statValue": 2,
            "vidRef": 62318,
            "homeScore": 2,
            "awayScore": 12,
            "commentary": "Conversion-Made by Nathan Cleary",
            "tackleNum": -1,
            "teamId": 500014,
            "teamName": "Penrith Panthers",
            "homeTeamAbbrv": "WST",
            "awayTeamAbbrv": "PEN"
        },
        {
            "gameState": "First Half",
            "gameStateId": 3,
            "gameTime": "0:39:55",
            "gameSeconds": 2395,
            "GameMinutes": "39:55",
            "playerId": 503340,
            "playerName": "Dylan Edwards",
            "scoreMethod": "Try",
            "statEvent": "Try",
            "statId": 38,
            "statValue": 4,
            "vidRef": 64886,
            "homeScore": 2,
            "awayScore": 16,
            "commentary": "Try by Dylan Edwards",
            "tackleNum": 4,
            "teamId": 500014,
            "teamName": "Penrith Panthers",
            "homeTeamAbbrv": "WST",
            "awayTeamAbbrv": "PEN"
        },
        {
            "gameState": "First Half",
            "gameStateId": 3,
            "gameTime": "0:40:00",
            "gameSeconds": 2400,
            "GameMinutes": "40:00",
            "playerId": 504120,
            "playerName": "Nathan Cleary",
            "scoreMethod": "Conversion",
            "statEvent": "Conversion-Made",
            "statId": 1,
            "statValue": 2,
            "vidRef": 67129,
            "homeScore": 2,
            "awayScore": 18,
            "commentary": "Conversion-Made by Nathan Cleary",
            "tackleNum": -1,
            "teamId": 500014,
            "teamName": "Penrith Panthers",
            "homeTeamAbbrv": "WST",
            "awayTeamAbbrv": "PEN"
        },
        {
            "gameState": "Second Half",
            "gameStateId": 5,
            "gameTime": "0:48:51",
            "gameSeconds": 2931,
            "GameMinutes": "48:51",
            "playerId": 501254,
            "playerName": "Leilani Latu",
            "scoreMethod": "Try",
            "statEvent": "Try",
            "statId": 38,
            "statValue": 4,
            "vidRef": 84780,
            "homeScore": 2,
            "awayScore": 22,
            "commentary": "Try by Leilani Latu",
            "tackleNum": 6,
            "teamId": 500014,
            "teamName": "Penrith Panthers",
            "homeTeamAbbrv": "WST",
            "awayTeamAbbrv": "PEN"
        },
        {
            "gameState": "Second Half",
            "gameStateId": 5,
            "gameTime": "0:50:11",
            "gameSeconds": 3011,
            "GameMinutes": "50:11",
            "playerId": 504120,
            "playerName": "Nathan Cleary",
            "scoreMethod": "Conversion",
            "statEvent": "Conversion-Made",
            "statId": 1,
            "statValue": 2,
            "vidRef": 86922,
            "homeScore": 2,
            "awayScore": 24,
            "commentary": "Conversion-Made by Nathan Cleary",
            "tackleNum": -1,
            "teamId": 500014,
            "teamName": "Penrith Panthers",
            "homeTeamAbbrv": "WST",
            "awayTeamAbbrv": "PEN"
        },
        {
            "gameState": "Second Half",
            "gameStateId": 5,
            "gameTime": "1:04:02",
            "gameSeconds": 3842,
            "GameMinutes": "64:02",
            "playerId": 500368,
            "playerName": "Dean Whare",
            "scoreMethod": "Try",
            "statEvent": "Try",
            "statId": 38,
            "statValue": 4,
            "vidRef": 107735,
            "homeScore": 2,
            "awayScore": 28,
            "commentary": "Try by Dean Whare",
            "tackleNum": 2,
            "teamId": 500014,
            "teamName": "Penrith Panthers",
            "homeTeamAbbrv": "WST",
            "awayTeamAbbrv": "PEN"
        },
        {
            "gameState": "Second Half",
            "gameStateId": 5,
            "gameTime": "1:05:24",
            "gameSeconds": 3924,
            "GameMinutes": "65:24",
            "playerId": 504120,
            "playerName": "Nathan Cleary",
            "scoreMethod": "Conversion",
            "statEvent": "Conversion-Made",
            "statId": 1,
            "statValue": 2,
            "vidRef": 109936,
            "homeScore": 2,
            "awayScore": 30,
            "commentary": "Conversion-Made by Nathan Cleary",
            "tackleNum": -1,
            "teamId": 500014,
            "teamName": "Penrith Panthers",
            "homeTeamAbbrv": "WST",
            "awayTeamAbbrv": "PEN"
        },
        {
            "gameState": "Second Half",
            "gameStateId": 5,
            "gameTime": "1:11:26",
            "gameSeconds": 4286,
            "GameMinutes": "71:26",
            "playerId": 504120,
            "playerName": "Nathan Cleary",
            "scoreMethod": "Try",
            "statEvent": "Try",
            "statId": 38,
            "statValue": 4,
            "vidRef": 118977,
            "homeScore": 2,
            "awayScore": 34,
            "commentary": "Try by Nathan Cleary",
            "tackleNum": 5,
            "teamId": 500014,
            "teamName": "Penrith Panthers",
            "homeTeamAbbrv": "WST",
            "awayTeamAbbrv": "PEN"
        },
        {
            "gameState": "Second Half",
            "gameStateId": 5,
            "gameTime": "1:12:49",
            "gameSeconds": 4369,
            "GameMinutes": "72:49",
            "playerId": 504120,
            "playerName": "Nathan Cleary",
            "scoreMethod": "Conversion",
            "statEvent": "Conversion-Made",
            "statId": 1,
            "statValue": 2,
            "vidRef": 121633,
            "homeScore": 2,
            "awayScore": 36,
            "commentary": "Conversion-Made by Nathan Cleary",
            "tackleNum": -1,
            "teamId": 500014,
            "teamName": "Penrith Panthers",
            "homeTeamAbbrv": "WST",
            "awayTeamAbbrv": "PEN"
        }
    ],
    "twitter": [
        {
            "id": "840811455754588161",
            "gameSeconds": 2820
        },
        {
            "id": "840810452921733120",
            "gameSeconds": 2820
        },
        {
            "id": "840799084202024961",
            "gameSeconds": 1200
        },
        {
            "id": "840798680751923200",
            "gameSeconds": 1200
        },
        {
            "id": "840797338776006656",
            "gameSeconds": 840
        },
        {
            "id": "840797232966197248",
            "gameSeconds": 840
        }
    ]
}