{
    "competitionId": 111,
    "competitionName": "NRL Telstra Premiership",
    "gameId": 20161112220,
    "gameInfo": {
        "assistantReferee1Id": 500020,
        "numberOfPeriods": 2,
        "assistantReferee1Name": "Jason Walsh",
        "assistantReferee2Id": 500114,
        "assistantReferee2Name": "Clayton Sharpe",
        "gameDate": "2016-08-07",
        "gameHashTag": "#NRLTitansWarriors",
        "gameNumber": 2,
        "gameSeconds": 4800,
        "gameMinutes": "80:00",
        "gameTime": "1:20:00",
        "groundConditionId": 1,
        "groundConditionName": "N/A",
        "referee1Id": 500022,
        "referee1Name": "Jared Maxwell",
        "referee2Id": 500005,
        "referee2Name": "Gavin Reynolds",
        "startTime": "2016-08-07T14:00:00",
        "startTimeUTC": "2016-08-07T04:00:00Z",
        "venueId": 500046,
        "venueName": "Cbus Super Stadium",
        "videoReferee1Id": 500036,
        "videoReferee1Name": "Jason Robinson",
        "videoReferee2Id": 500203,
        "videoReferee2Name": "Ben Galea",
        "weatherId": 2,
        "weatherName": "Fine",
        "broadcastChannel": null,
        "venueLatitude": -28.0669,
        "venueLongitude": 153.3789,
        "broadcastInfo": {
            "radioNetwork": []
        }
    },
    "gameState": "Final",
    "gameStateId": 8,
    "roundId": 22,
    "roundName": "Round 22",
    "seasonId": 2016,
    "teams": {
        "teamsMatch": [
            {
                "isHomeTeam": true,
                "score": {
                    "conversions": 1,
                    "points": 14,
                    "tries": 3
                },
                "team1stHalfScore": 10,
                "team2ndHalfScore": 4,
                "teamAbbr": "GLD",
                "teamFinalScore": 14,
                "teamFullTimeScore": 14,
                "teamHalfTimeScore": 10,
                "teamId": 500004,
                "teamLineup": {
                    "teamLineUpStatusID": 4,
                    "teamLineUpStatus": "Final",
                    "injuriesAndSuspensions": {
                        "injury": [],
                        "suspension": []
                    },
                    "insAndOuts": {
                        "inOut": [
                            {
                                "inOut": "In",
                                "playerFirstName": "David",
                                "playerId": "500334",
                                "playerLastName": "Shillington",
                                "playerName": "David Shillington"
                            },
                            {
                                "inOut": "Out",
                                "playerFirstName": "Eddy",
                                "playerId": "502632",
                                "playerLastName": "Pettybourne",
                                "playerName": "Eddy Pettybourne"
                            },
                            {
                                "inOut": "In",
                                "playerFirstName": "Jarryd",
                                "playerId": "500671",
                                "playerLastName": "Hayne",
                                "playerName": "Jarryd Hayne"
                            },
                            {
                                "inOut": "In",
                                "playerFirstName": "Nathan",
                                "playerId": "500688",
                                "playerLastName": "Peats",
                                "playerName": "Nathan Peats"
                            },
                            {
                                "inOut": "Out",
                                "playerFirstName": "Ryan",
                                "playerId": "500364",
                                "playerLastName": "Simpkins",
                                "playerName": "Ryan Simpkins"
                            },
                            {
                                "inOut": "Out",
                                "playerFirstName": "Tyrone",
                                "playerId": "500046",
                                "playerLastName": "Roberts",
                                "playerName": "Tyrone Roberts"
                            }
                        ]
                    },
                    "teamPlayer": [
                        {
                            "playerFirstName": "David",
                            "playerId": 500831,
                            "playerLastName": "Mead",
                            "playerName": "David Mead",
                            "playerPosition": "Fullback",
                            "playerPositionId": 500001,
                            "playerStats": {
                                "allRunMetres": 142,
                                "allRuns": 18,
                                "bombKicksDefused": 1,
                                "dummyHalfRuns": 2,
                                "errors": 1,
                                "fantasyPointsTotal": 34,
                                "kickReturnMetres": 24,
                                "kickReturns": 3,
                                "kicksDefused": 2,
                                "linebreakAssists": 1,
                                "mins": 80,
                                "missedTackles": 3,
                                "offloads": 1,
                                "passes": 6,
                                "passesPerRun": 0.33,
                                "supports": 5,
                                "tackleBreaks": 3,
                                "tackles": 3,
                                "tryAssists": 1,
                                "tryCause": 2,
                                "trySaves": 1,
                                "evasionRuns": 13,
                                "evasionRunMetres": 100,
                                "dummyHalfRunMetres": 18,
                                "ptbAll": 16,
                                "receipts": 26,
                                "postContactMetres": 48,
                                "ptbOneToTwo": 1,
                                "ptbTwoToThree": 5,
                                "ptbThreeToFour": 6,
                                "ptbFourToFive": 3,
                                "ptbFivePlus": 1,
                                "effectiveTacklePercentage": 50,
                                "stint1": 4800
                            },
                            "playerTookTheField": true,
                            "shirtNum": 1,
                            "playerFirstInitial": "D",
                            "playerPositionAbbrev": "FB",
                            "onTheField": true,
                            "fantasyPrice": 307000,
                            "fantasySeasonPriceChange": 101000,
                            "fantasyRoundPriceChange": 21000
                        },
                        {
                            "playerFirstName": "Anthony",
                            "playerId": 500067,
                            "playerLastName": "Don",
                            "playerName": "Anthony Don",
                            "playerPosition": "Winger 1",
                            "playerPositionId": 500002,
                            "playerStats": {
                                "allRunMetres": 67,
                                "allRuns": 10,
                                "bombKicksDefused": 1,
                                "bombKicksNotDefused": 1,
                                "dummyHalfRuns": 1,
                                "fantasyPointsTotal": 15,
                                "kickMetres": 7,
                                "kickReturnMetres": 17,
                                "kickReturns": 3,
                                "kicks": 2,
                                "kicksDefused": 1,
                                "kicksNotDefused": 1,
                                "mins": 80,
                                "missedTackles": 1,
                                "passes": 8,
                                "passesPerRun": 0.8,
                                "oneOnOneTackles": 1,
                                "points": 4,
                                "supports": 5,
                                "tackles": 2,
                                "tries": 1,
                                "evasionRuns": 6,
                                "evasionRunMetres": 42,
                                "dummyHalfRunMetres": 8,
                                "ptbAll": 9,
                                "receipts": 18,
                                "grubberKick": 2,
                                "postContactMetres": 19,
                                "ptbOneToTwo": 3,
                                "ptbTwoToThree": 1,
                                "ptbThreeToFour": 3,
                                "ptbFourToFive": 2,
                                "effectiveTacklePercentage": 66.7,
                                "stint1": 4800
                            },
                            "playerTookTheField": true,
                            "shirtNum": 2,
                            "playerFirstInitial": "A",
                            "playerPositionAbbrev": "WG",
                            "onTheField": true,
                            "fantasyPrice": 175000,
                            "fantasySeasonPriceChange": -30000,
                            "fantasyRoundPriceChange": 1000
                        },
                        {
                            "playerFirstName": "Josh",
                            "playerId": 500256,
                            "playerLastName": "Hoffman",
                            "playerName": "Josh Hoffman",
                            "playerPosition": "Centre 1",
                            "playerPositionId": 500003,
                            "playerStats": {
                                "allRunMetres": 66,
                                "allRuns": 10,
                                "dummyHalfRuns": 2,
                                "errors": 1,
                                "fantasyPointsTotal": 14,
                                "mins": 59,
                                "missedTackles": 3,
                                "passes": 4,
                                "passesPerRun": 0.4,
                                "supports": 5,
                                "tackleBreaks": 2,
                                "tackles": 10,
                                "tryCause": 2,
                                "evasionRuns": 8,
                                "evasionRunMetres": 48,
                                "dummyHalfRunMetres": 18,
                                "ptbAll": 7,
                                "receipts": 12,
                                "postContactMetres": 26,
                                "ptbTwoToThree": 1,
                                "ptbThreeToFour": 3,
                                "ptbFourToFive": 1,
                                "ptbFivePlus": 2,
                                "effectiveTacklePercentage": 76.9,
                                "stint1": 1635,
                                "stint2": 1868
                            },
                            "playerTookTheField": true,
                            "shirtNum": 3,
                            "playerFirstInitial": "J",
                            "playerPositionAbbrev": "CT",
                            "fantasyPrice": 302000,
                            "fantasySeasonPriceChange": 57000
                        },
                        {
                            "playerFirstName": "Konrad",
                            "playerId": 500703,
                            "playerLastName": "Hurrell",
                            "playerName": "Konrad Hurrell",
                            "playerPosition": "Centre 2",
                            "playerPositionId": 500004,
                            "playerStats": {
                                "allRunMetres": 92,
                                "allRuns": 9,
                                "decoys": 2,
                                "errors": 3,
                                "fantasyPointsTotal": 36,
                                "linebreaks": 1,
                                "mins": 80,
                                "missedTackles": 3,
                                "passes": 2,
                                "passesPerRun": 0.22,
                                "oneOnOneTackles": 1,
                                "points": 4,
                                "supports": 3,
                                "tackleBreaks": 1,
                                "tackles": 9,
                                "tries": 1,
                                "trySaves": 3,
                                "evasionRuns": 9,
                                "evasionRunMetres": 92,
                                "ptbAll": 7,
                                "receipts": 13,
                                "postContactMetres": 34,
                                "dummyPasses": 1,
                                "ptbTwoToThree": 1,
                                "ptbThreeToFour": 4,
                                "ptbFourToFive": 1,
                                "ptbFivePlus": 1,
                                "doubles": 1,
                                "effectiveTacklePercentage": 75,
                                "stint1": 4800
                            },
                            "playerTookTheField": true,
                            "shirtNum": 4,
                            "playerFirstInitial": "K",
                            "playerPositionAbbrev": "CT",
                            "onTheField": true,
                            "fantasyPrice": 249000,
                            "fantasySeasonPriceChange": 18000,
                            "fantasyRoundPriceChange": 52000
                        },
                        {
                            "playerFirstName": "Nene",
                            "playerId": 500206,
                            "playerLastName": "Macdonald",
                            "playerName": "Nene Macdonald",
                            "playerPosition": "Winger 2",
                            "playerPositionId": 500005,
                            "playerStats": {
                                "allRunMetres": 122,
                                "allRuns": 13,
                                "bombKicks": 1,
                                "bombKickMetres": 24,
                                "bombKicksDefused": 2,
                                "dummyHalfRuns": 3,
                                "fantasyPointsTotal": 25,
                                "ineffectiveTackles": 2,
                                "kickMetres": 24,
                                "kickReturnMetres": 17,
                                "kickReturns": 2,
                                "kicks": 1,
                                "kicksDefused": 2,
                                "mins": 80,
                                "passes": 9,
                                "passesPerRun": 0.69,
                                "supports": 5,
                                "tackleBreaks": 2,
                                "tackles": 4,
                                "tryCause": 1,
                                "evasionRuns": 8,
                                "evasionRunMetres": 77,
                                "dummyHalfRunMetres": 28,
                                "ptbAll": 12,
                                "receipts": 24,
                                "postContactMetres": 37,
                                "dummyPasses": 1,
                                "lineEngagedRuns": 1,
                                "ptbOneToTwo": 2,
                                "ptbTwoToThree": 5,
                                "ptbThreeToFour": 3,
                                "ptbFourToFive": 2,
                                "effectiveTacklePercentage": 66.7,
                                "stint1": 4800
                            },
                            "playerTookTheField": true,
                            "shirtNum": 5,
                            "playerFirstInitial": "N",
                            "playerPositionAbbrev": "WG",
                            "onTheField": true,
                            "fantasyPrice": 306000,
                            "fantasySeasonPriceChange": 34000,
                            "fantasyRoundPriceChange": 1000
                        },
                        {
                            "playerFirstName": "Cameron",
                            "playerId": 500246,
                            "playerLastName": "Cullen",
                            "playerName": "Cameron Cullen",
                            "playerPosition": "Five-Eighth",
                            "playerPositionId": 500006,
                            "playerStats": {
                                "allRunMetres": 59,
                                "allRuns": 6,
                                "dummyHalfRuns": 2,
                                "fantasyPointsTotal": 8,
                                "hitUps": 1,
                                "mins": 48,
                                "missedTackles": 2,
                                "passes": 24,
                                "passesPerRun": 4,
                                "supports": 1,
                                "tackleBreaks": 1,
                                "tackles": 4,
                                "tryCause": 2,
                                "hitupRunMeters": 9,
                                "evasionRuns": 3,
                                "evasionRunMetres": 27,
                                "dummyHalfRunMetres": 23,
                                "ptbAll": 5,
                                "receipts": 28,
                                "postContactMetres": 23,
                                "dummyPasses": 6,
                                "lineEngagedRuns": 1,
                                "ptbTwoToThree": 2,
                                "ptbThreeToFour": 3,
                                "doubles": 1,
                                "effectiveTacklePercentage": 66.7,
                                "stint1": 2402,
                                "stint2": 464
                            },
                            "playerTookTheField": true,
                            "shirtNum": 17,
                            "playerFirstInitial": "C",
                            "playerPositionAbbrev": "FE",
                            "onTheField": true,
                            "fantasyPrice": 228000
                        },
                        {
                            "playerFirstName": "Ashley",
                            "playerId": 500272,
                            "playerLastName": "Taylor",
                            "playerName": "Ashley Taylor",
                            "playerPosition": "Halfback",
                            "playerPositionId": 500007,
                            "playerStats": {
                                "allRunMetres": 43,
                                "allRuns": 7,
                                "bombKicks": 3,
                                "bombKickMetres": 40,
                                "conversions": 1,
                                "conversionsAttempts": 3,
                                "conversionsMissed": 2,
                                "errors": 2,
                                "fantasyPointsTotal": 47,
                                "goalConversionRate": 33.33,
                                "allGoals": 1,
                                "allGoalsMissed": 2,
                                "allGoalsAttempted": 3,
                                "interceptedPass": 1,
                                "kickMetres": 229,
                                "kicks": 12,
                                "kicksDefused": 1,
                                "lineDropouts": 3,
                                "mins": 80,
                                "missedTackles": 3,
                                "offloads": 1,
                                "passes": 39,
                                "passesPerRun": 5.57,
                                "oneOnOneSteal": 1,
                                "oneOnOneTackles": 2,
                                "points": 2,
                                "supports": 1,
                                "tackleBreaks": 1,
                                "tackles": 24,
                                "tryCause": 1,
                                "trySaves": 2,
                                "evasionRuns": 7,
                                "evasionRunMetres": 43,
                                "ptbAll": 2,
                                "receipts": 55,
                                "forcedDropOutKicker": 2,
                                "grubberKick": 3,
                                "crossFieldKick": 2,
                                "postContactMetres": 4,
                                "dummyPasses": 6,
                                "lineEngagedRuns": 4,
                                "ptbTwoToThree": 1,
                                "ptbThreeToFour": 1,
                                "doubles": 4,
                                "effectiveTacklePercentage": 88.9,
                                "stint1": 4800
                            },
                            "playerTookTheField": true,
                            "shirtNum": 7,
                            "playerFirstInitial": "A",
                            "playerPositionAbbrev": "HB",
                            "onTheField": true,
                            "fantasyPrice": 323000,
                            "fantasySeasonPriceChange": 189000,
                            "fantasyRoundPriceChange": 4000
                        },
                        {
                            "playerFirstName": "Luke",
                            "playerId": 500070,
                            "playerLastName": "Douglas",
                            "playerName": "Luke Douglas",
                            "playerPosition": "Prop 1",
                            "playerPositionId": 500008,
                            "playerStats": {
                                "allRunMetres": 139,
                                "allRuns": 16,
                                "decoys": 7,
                                "fantasyPointsTotal": 33,
                                "hitUps": 14,
                                "kickReturnMetres": 24,
                                "kickReturns": 2,
                                "mins": 49,
                                "missedTackles": 4,
                                "passes": 5,
                                "passesPerRun": 0.31,
                                "supports": 1,
                                "tackles": 28,
                                "tryCause": 1,
                                "hitupRunMeters": 115,
                                "ptbAll": 16,
                                "receipts": 21,
                                "postContactMetres": 44,
                                "ptbZeroToOne": 1,
                                "ptbTwoToThree": 7,
                                "ptbThreeToFour": 8,
                                "doubles": 9,
                                "effectiveTacklePercentage": 87.5,
                                "stint1": 1392,
                                "stint2": 1555
                            },
                            "playerTookTheField": true,
                            "shirtNum": 8,
                            "playerFirstInitial": "L",
                            "playerPositionAbbrev": "PR",
                            "onTheField": true,
                            "fantasyPrice": 341000,
                            "fantasySeasonPriceChange": -37000,
                            "fantasyRoundPriceChange": -10000
                        },
                        {
                            "playerFirstName": "Nathan",
                            "playerId": 500688,
                            "playerLastName": "Peats",
                            "playerName": "Nathan Peats",
                            "playerPosition": "Hooker",
                            "playerPositionId": 500009,
                            "playerStats": {
                                "allRunMetres": 32,
                                "allRuns": 6,
                                "dummyHalfRuns": 6,
                                "fantasyPointsTotal": 50,
                                "ineffectiveTackles": 1,
                                "kickMetres": 12,
                                "kicks": 1,
                                "linebreakAssists": 1,
                                "mins": 72,
                                "missedTackles": 3,
                                "passes": 86,
                                "passesPerRun": 14.33,
                                "tackles": 46,
                                "tryAssists": 1,
                                "dummyHalfRunMetres": 32,
                                "ptbAll": 3,
                                "receipts": 91,
                                "crossFieldKick": 1,
                                "postContactMetres": 6,
                                "dummyPasses": 5,
                                "kickPressures": 1,
                                "lineEngagedRuns": 2,
                                "ptbOneToTwo": 1,
                                "ptbTwoToThree": 2,
                                "doubles": 7,
                                "effectiveTacklePercentage": 92,
                                "stint1": 4336
                            },
                            "playerTookTheField": true,
                            "shirtNum": 9,
                            "playerFirstInitial": "N",
                            "playerPositionAbbrev": "HK",
                            "fantasyPrice": 386000,
                            "fantasySeasonPriceChange": -92000
                        },
                        {
                            "playerFirstName": "Ryan",
                            "playerId": 500072,
                            "playerLastName": "James",
                            "playerName": "Ryan James",
                            "playerPosition": "Prop 2",
                            "playerPositionId": 500010,
                            "playerStats": {
                                "allRunMetres": 118,
                                "allRuns": 14,
                                "decoys": 8,
                                "fantasyPointsTotal": 76,
                                "hitUps": 12,
                                "kickReturnMetres": 26,
                                "kickReturns": 2,
                                "linebreaks": 1,
                                "mins": 61,
                                "missedTackles": 1,
                                "passes": 2,
                                "passesPerRun": 0.14,
                                "oneOnOneTackles": 3,
                                "penalties": 1,
                                "points": 4,
                                "supports": 6,
                                "tackleBreaks": 3,
                                "tackles": 48,
                                "tries": 1,
                                "tryCause": 1,
                                "hitupRunMeters": 92,
                                "ptbAll": 12,
                                "receipts": 16,
                                "postContactMetres": 32,
                                "kickPressures": 1,
                                "ptbOneToTwo": 3,
                                "ptbTwoToThree": 4,
                                "ptbThreeToFour": 3,
                                "ptbFourToFive": 2,
                                "doubles": 15,
                                "effectiveTacklePercentage": 98,
                                "ptbPenalties": 1,
                                "stint1": 1680,
                                "stint2": 1995
                            },
                            "playerTookTheField": true,
                            "shirtNum": 10,
                            "playerFirstInitial": "R",
                            "playerPositionAbbrev": "PR",
                            "onTheField": true,
                            "fantasyPrice": 499000,
                            "fantasySeasonPriceChange": 150000,
                            "fantasyRoundPriceChange": -25000
                        },
                        {
                            "playerFirstName": "Zeb",
                            "playerId": 502133,
                            "playerLastName": "Taia",
                            "playerName": "Zeb Taia",
                            "playerPosition": "2nd Row 1",
                            "playerPositionId": 500011,
                            "playerStats": {
                                "allRunMetres": 97,
                                "allRuns": 14,
                                "decoys": 4,
                                "dummyHalfRuns": 1,
                                "errors": 1,
                                "fantasyPointsTotal": 27,
                                "hitUps": 13,
                                "mins": 80,
                                "missedTackles": 2,
                                "offloads": 1,
                                "passes": 7,
                                "passesPerRun": 0.5,
                                "supports": 9,
                                "tackleBreaks": 2,
                                "tackles": 16,
                                "tryCause": 1,
                                "hitupRunMeters": 91,
                                "dummyHalfRunMetres": 6,
                                "ptbAll": 11,
                                "receipts": 20,
                                "postContactMetres": 37,
                                "kickPressures": 2,
                                "ptbTwoToThree": 1,
                                "ptbThreeToFour": 8,
                                "ptbFourToFive": 1,
                                "ptbFivePlus": 1,
                                "effectiveTacklePercentage": 88.9,
                                "stint1": 4800
                            },
                            "playerTookTheField": true,
                            "shirtNum": 11,
                            "playerFirstInitial": "Z",
                            "playerPositionAbbrev": "2R",
                            "onTheField": true,
                            "fantasyPrice": 328000,
                            "fantasySeasonPriceChange": -30000,
                            "fantasyRoundPriceChange": 14000
                        },
                        {
                            "playerFirstName": "Chris",
                            "playerId": 500090,
                            "playerLastName": "McQueen",
                            "playerName": "Chris McQueen",
                            "playerPosition": "2nd Row 2",
                            "playerPositionId": 500012,
                            "playerStats": {
                                "allRunMetres": 29,
                                "allRuns": 4,
                                "decoys": 4,
                                "fantasyPointsTotal": 39,
                                "hitUps": 4,
                                "mins": 76,
                                "passes": 7,
                                "passesPerRun": 1.75,
                                "oneOnOneTackles": 2,
                                "penalties": 1,
                                "supports": 4,
                                "tackles": 34,
                                "trySaves": 1,
                                "hitupRunMeters": 29,
                                "ptbAll": 4,
                                "receipts": 11,
                                "postContactMetres": 12,
                                "ptbTwoToThree": 2,
                                "ptbThreeToFour": 1,
                                "ptbFourToFive": 1,
                                "doubles": 9,
                                "effectiveTacklePercentage": 100,
                                "ptbPenalties": 1,
                                "stint1": 4056,
                                "stint2": 529
                            },
                            "playerTookTheField": true,
                            "shirtNum": 12,
                            "playerFirstInitial": "C",
                            "playerPositionAbbrev": "2R",
                            "onTheField": true,
                            "fantasyPrice": 308000,
                            "fantasySeasonPriceChange": 2000,
                            "fantasyRoundPriceChange": 21000
                        },
                        {
                            "playerFirstName": "Greg",
                            "playerId": 500073,
                            "playerLastName": "Bird",
                            "playerName": "Greg Bird",
                            "playerPosition": "Lock",
                            "playerPositionId": 500013,
                            "playerStats": {
                                "allRunMetres": 157,
                                "allRuns": 19,
                                "decoys": 4,
                                "errors": 1,
                                "fantasyPointsTotal": 31,
                                "hitUps": 18,
                                "ineffectiveTackles": 1,
                                "mins": 66,
                                "missedTackles": 3,
                                "offloads": 1,
                                "passes": 7,
                                "passesPerRun": 0.37,
                                "penalties": 1,
                                "supports": 1,
                                "tackles": 24,
                                "hitupRunMeters": 148,
                                "evasionRuns": 1,
                                "evasionRunMetres": 9,
                                "ptbAll": 15,
                                "receipts": 25,
                                "postContactMetres": 59,
                                "dummyPasses": 1,
                                "lineEngagedRuns": 1,
                                "ptbOneToTwo": 2,
                                "ptbTwoToThree": 5,
                                "ptbThreeToFour": 8,
                                "doubles": 3,
                                "effectiveTacklePercentage": 85.7,
                                "ptbPenalties": 1,
                                "stint1": 3223,
                                "stint2": 744
                            },
                            "playerTookTheField": true,
                            "shirtNum": 13,
                            "playerFirstInitial": "G",
                            "playerPositionAbbrev": "LK",
                            "onTheField": true,
                            "fantasyPrice": 295000,
                            "fantasySeasonPriceChange": -51000,
                            "fantasyRoundPriceChange": 23000
                        },
                        {
                            "playerFirstName": "Leivaha",
                            "playerId": 502104,
                            "playerLastName": "Pulu",
                            "playerName": "Leivaha Pulu",
                            "playerPosition": "Interchange",
                            "playerPositionId": 500014,
                            "playerStats": {
                                "allRunMetres": 37,
                                "allRuns": 4,
                                "decoys": 1,
                                "fantasyPointsTotal": 10,
                                "hitUps": 4,
                                "mins": 19,
                                "missedTackles": 1,
                                "passes": 1,
                                "passesPerRun": 0.25,
                                "tackles": 9,
                                "hitupRunMeters": 37,
                                "ptbAll": 4,
                                "receipts": 5,
                                "postContactMetres": 11,
                                "ptbTwoToThree": 1,
                                "ptbThreeToFour": 3,
                                "doubles": 1,
                                "effectiveTacklePercentage": 90,
                                "stint1": 1121
                            },
                            "playerTookTheField": true,
                            "shirtNum": 15,
                            "playerFirstInitial": "L",
                            "playerPositionAbbrev": "INT",
                            "fantasyPrice": 219000,
                            "fantasySeasonPriceChange": 89000,
                            "fantasyRoundPriceChange": 8000
                        },
                        {
                            "playerFirstName": "Agnatius",
                            "playerId": 501393,
                            "playerLastName": "Paasi",
                            "playerName": "Agnatius Paasi",
                            "playerPosition": "Interchange",
                            "playerPositionId": 500014,
                            "playerStats": {
                                "allRunMetres": 83,
                                "allRuns": 7,
                                "decoys": 1,
                                "fantasyPointsTotal": 17,
                                "hitUps": 4,
                                "kickReturnMetres": 52,
                                "kickReturns": 3,
                                "mins": 37,
                                "missedTackles": 4,
                                "offloads": 1,
                                "passes": 1,
                                "passesPerRun": 0.14,
                                "supports": 2,
                                "tackles": 15,
                                "tryCause": 1,
                                "hitupRunMeters": 31,
                                "ptbAll": 6,
                                "receipts": 8,
                                "postContactMetres": 27,
                                "ptbTwoToThree": 1,
                                "ptbThreeToFour": 3,
                                "ptbFourToFive": 2,
                                "doubles": 2,
                                "effectiveTacklePercentage": 78.9,
                                "stint1": 1831,
                                "stint2": 385
                            },
                            "playerTookTheField": true,
                            "shirtNum": 16,
                            "playerFirstInitial": "A",
                            "playerPositionAbbrev": "INT",
                            "onTheField": true,
                            "fantasyPrice": 284000,
                            "fantasySeasonPriceChange": 17000,
                            "fantasyRoundPriceChange": -5000
                        },
                        {
                            "playerFirstName": "David",
                            "playerId": 500334,
                            "playerLastName": "Shillington",
                            "playerName": "David Shillington",
                            "playerPosition": "Interchange",
                            "playerPositionId": 500014,
                            "playerStats": {
                                "allRunMetres": 61,
                                "allRuns": 6,
                                "decoys": 3,
                                "fantasyPointsTotal": 13,
                                "hitUps": 5,
                                "kickReturnMetres": 15,
                                "kickReturns": 1,
                                "mins": 20,
                                "passes": 2,
                                "passesPerRun": 0.33,
                                "oneOnOneTackles": 1,
                                "supports": 1,
                                "tackles": 7,
                                "hitupRunMeters": 46,
                                "ptbAll": 6,
                                "receipts": 8,
                                "postContactMetres": 26,
                                "ptbOneToTwo": 1,
                                "ptbTwoToThree": 3,
                                "ptbThreeToFour": 2,
                                "doubles": 1,
                                "effectiveTacklePercentage": 100,
                                "stint1": 1183
                            },
                            "playerTookTheField": true,
                            "shirtNum": 19,
                            "playerFirstInitial": "D",
                            "playerPositionAbbrev": "INT",
                            "fantasyPrice": 298000,
                            "fantasySeasonPriceChange": -94000
                        },
                        {
                            "playerFirstName": "Jarryd",
                            "playerId": 500671,
                            "playerLastName": "Hayne",
                            "playerName": "Jarryd Hayne",
                            "playerPosition": "Interchange",
                            "playerPositionId": 500014,
                            "playerStats": {
                                "allRunMetres": 82,
                                "allRuns": 10,
                                "bombKicks": 1,
                                "bombKickMetres": 32,
                                "dummyHalfRuns": 1,
                                "errors": 2,
                                "fantasyPointsTotal": 23,
                                "interceptedPass": 1,
                                "kickDead": 1,
                                "kickMetres": 109,
                                "kicks": 5,
                                "mins": 52,
                                "offloads": 1,
                                "passes": 17,
                                "passesPerRun": 1.7,
                                "oneOnOneTackles": 4,
                                "supports": 4,
                                "tackleBreaks": 1,
                                "tackles": 9,
                                "evasionRuns": 9,
                                "evasionRunMetres": 80,
                                "dummyHalfRunMetres": 2,
                                "ptbAll": 5,
                                "receipts": 28,
                                "grubberKick": 2,
                                "postContactMetres": 11,
                                "dummyPasses": 1,
                                "lineEngagedRuns": 3,
                                "ptbOneToTwo": 1,
                                "ptbThreeToFour": 3,
                                "ptbFourToFive": 1,
                                "effectiveTacklePercentage": 100,
                                "stint1": 3165
                            },
                            "playerTookTheField": true,
                            "shirtNum": 21,
                            "playerFirstInitial": "J",
                            "playerPositionAbbrev": "INT",
                            "onTheField": true,
                            "fantasyPrice": 380000
                        }
                    ]
                },
                "teamName": "Gold Coast Titans",
                "teamNickName": "Titans",
                "teamStats": {
                    "allRunMetres": 1428,
                    "allRuns": 173,
                    "bombKicks": 5,
                    "bombKickMetres": 95,
                    "bombKicksDefused": 4,
                    "bombKicksNotDefused": 1,
                    "completeSets": 25,
                    "completionPercentage": 76,
                    "conversions": 1,
                    "conversionsAttempts": 3,
                    "conversionsMissed": 2,
                    "decoys": 34,
                    "dummyHalfRuns": 18,
                    "errors": 11,
                    "goalConversionRate": 33.33,
                    "allGoals": 1,
                    "allGoalsAttempted": 3,
                    "allGoalsMissed": 2,
                    "hitUps": 75,
                    "incompleteSets": 8,
                    "ineffectiveTackles": 4,
                    "interceptedPass": 2,
                    "kickDead": 1,
                    "kickMetres": 380,
                    "kickReturnMetres": 174,
                    "kickReturns": 16,
                    "kicks": 21,
                    "kicksDefused": 6,
                    "kicksNotDefused": 1,
                    "lineDropouts": 3,
                    "linebreakAssists": 2,
                    "linebreaks": 2,
                    "missedTackles": 33,
                    "offloads": 6,
                    "oneOnOneSteal": 1,
                    "oneOnOneTackles": 14,
                    "passes": 227,
                    "passesPerRun": 1.31,
                    "penalties": 3,
                    "points": 14,
                    "pointsConceded": 24,
                    "possession": 54,
                    "scrumWins": 7,
                    "supports": 53,
                    "tackleBreaks": 16,
                    "tackles": 292,
                    "sets": 33,
                    "tries": 3,
                    "triesConceded": 5,
                    "tryAssists": 2,
                    "tryCause": 12,
                    "trySaves": 7,
                    "hitupRunMeters": 598,
                    "evasionRuns": 64,
                    "evasionRunMetres": 519,
                    "dummyHalfRunMetres": 137,
                    "ptbTotal": 140,
                    "twoManTackles": 81,
                    "threeManTackles": 43,
                    "tryScoringPercentage": 12,
                    "shiftsLeft": 8,
                    "shiftsRight": 10,
                    "receipts": 409,
                    "forcedDropOutKicker": 2,
                    "grubberKick": 7,
                    "crossFieldKick": 3,
                    "postContactMetres": 456,
                    "dummyPasses": 21,
                    "kickPressures": 4,
                    "lineEngagedRuns": 12,
                    "ptbZeroToOne": 1,
                    "ptbOneToTwo": 14,
                    "ptbTwoToThree": 42,
                    "ptbThreeToFour": 62,
                    "ptbFourToFive": 16,
                    "ptbFivePlus": 5,
                    "interchangeUsed": 8,
                    "doubles": 53,
                    "effectiveTacklePercentage": 88.8,
                    "ptbPenalties": 3,
                    "averageSetDistance": 43.3,
                    "completeSets1stHalf": 11,
                    "completeSets2ndHalf": 14,
                    "completionPercentage1stHalf": 78.57,
                    "completionPercentage2ndHalf": 73.68,
                    "incompleteSets1stHalf": 3,
                    "incompleteSets2ndHalf": 5,
                    "incompletionPercentage1stHalf": 21.43,
                    "incompletionPercentage2ndHalf": 26.32
                },
                "teamHexColour": "ffa71f",
                "teamHexColour2": "2f8fbf"
            },
            {
                "score": {
                    "conversions": 2,
                    "points": 24,
                    "tries": 5
                },
                "team1stHalfScore": 10,
                "team2ndHalfScore": 14,
                "teamAbbr": "WAR",
                "teamFinalScore": 24,
                "teamFullTimeScore": 24,
                "teamHalfTimeScore": 10,
                "teamId": 500032,
                "teamLineup": {
                    "teamLineUpStatusID": 4,
                    "teamLineUpStatus": "Final",
                    "injuriesAndSuspensions": {
                        "injury": [],
                        "suspension": []
                    },
                    "insAndOuts": {
                        "inOut": [
                            {
                                "inOut": "Out",
                                "playerFirstName": "Issac",
                                "playerId": "500088",
                                "playerLastName": "Luke",
                                "playerName": "Issac Luke"
                            },
                            {
                                "inOut": "In",
                                "playerFirstName": "Nathaniel",
                                "playerId": "501319",
                                "playerLastName": "Roache",
                                "playerName": "Nathaniel Roache"
                            }
                        ]
                    },
                    "teamPlayer": [
                        {
                            "playerFirstName": "Tuimoala",
                            "playerId": 500927,
                            "playerLastName": "Lolohea",
                            "playerName": "Tuimoala Lolohea",
                            "playerPosition": "Fullback",
                            "playerPositionId": 500001,
                            "playerStats": {
                                "allRunMetres": 100,
                                "allRuns": 15,
                                "bombKicksNotDefused": 1,
                                "conversions": 2,
                                "conversionsAttempts": 4,
                                "conversionsMissed": 2,
                                "dummyHalfRuns": 2,
                                "errors": 1,
                                "fantasyPointsTotal": 35,
                                "goalConversionRate": 50,
                                "allGoals": 2,
                                "allGoalsMissed": 2,
                                "allGoalsAttempted": 4,
                                "hitUps": 1,
                                "ineffectiveTackles": 1,
                                "kickMetres": 31,
                                "kickReturnMetres": 8,
                                "kickReturns": 3,
                                "kicks": 2,
                                "kicksDefused": 2,
                                "kicksNotDefused": 3,
                                "lineDropouts": 4,
                                "linebreakAssists": 1,
                                "mins": 80,
                                "missedTackles": 2,
                                "passes": 13,
                                "passesPerRun": 0.87,
                                "oneOnOneTackles": 1,
                                "points": 4,
                                "supports": 1,
                                "tackleBreaks": 1,
                                "tackles": 9,
                                "tryAssists": 1,
                                "tryCause": 2,
                                "trySaves": 1,
                                "hitupRunMeters": 6,
                                "evasionRuns": 9,
                                "evasionRunMetres": 74,
                                "dummyHalfRunMetres": 12,
                                "ptbAll": 11,
                                "receipts": 30,
                                "forcedDropOutKicker": 2,
                                "grubberKick": 2,
                                "postContactMetres": 21,
                                "lineEngagedRuns": 1,
                                "ptbTwoToThree": 5,
                                "ptbThreeToFour": 6,
                                "effectiveTacklePercentage": 75,
                                "stint1": 4800
                            },
                            "playerTookTheField": true,
                            "shirtNum": 1,
                            "playerFirstInitial": "T",
                            "playerPositionAbbrev": "FB",
                            "onTheField": true,
                            "fantasyPrice": 224000,
                            "fantasySeasonPriceChange": -100000,
                            "fantasyRoundPriceChange": -6000
                        },
                        {
                            "playerFirstName": "Ken",
                            "playerId": 500928,
                            "playerLastName": "Maumalo",
                            "playerName": "Ken Maumalo",
                            "playerPosition": "Winger 1",
                            "playerPositionId": 500002,
                            "playerStats": {
                                "allRunMetres": 95,
                                "allRuns": 11,
                                "bombKicksDefused": 1,
                                "bombKicksNotDefused": 1,
                                "dummyHalfRuns": 1,
                                "errors": 2,
                                "fantasyPointsTotal": 17,
                                "kickReturnMetres": 12,
                                "kickReturns": 2,
                                "kicksDefused": 2,
                                "kicksNotDefused": 1,
                                "mins": 80,
                                "missedTackles": 1,
                                "passes": 1,
                                "passesPerRun": 0.09,
                                "oneOnOneTackles": 1,
                                "supports": 5,
                                "tackleBreaks": 1,
                                "tackles": 4,
                                "trySaves": 1,
                                "evasionRuns": 8,
                                "evasionRunMetres": 67,
                                "dummyHalfRunMetres": 16,
                                "ptbAll": 11,
                                "receipts": 15,
                                "postContactMetres": 36,
                                "ptbOneToTwo": 3,
                                "ptbTwoToThree": 5,
                                "ptbThreeToFour": 2,
                                "ptbFourToFive": 1,
                                "effectiveTacklePercentage": 80,
                                "stint1": 4800
                            },
                            "playerTookTheField": true,
                            "shirtNum": 2,
                            "playerFirstInitial": "K",
                            "playerPositionAbbrev": "WG",
                            "onTheField": true,
                            "fantasyPrice": 203000,
                            "fantasySeasonPriceChange": 53000,
                            "fantasyRoundPriceChange": 7000
                        },
                        {
                            "playerFirstName": "David",
                            "playerId": 500919,
                            "playerLastName": "Fusitua",
                            "playerName": "David Fusitua",
                            "playerPosition": "Centre 1",
                            "playerPositionId": 500003,
                            "playerStats": {
                                "allRunMetres": 164,
                                "allRuns": 8,
                                "bombKicksNotDefused": 1,
                                "decoys": 1,
                                "dummyHalfRuns": 1,
                                "fantasyPointsTotal": 41,
                                "ineffectiveTackles": 1,
                                "intercepts": 1,
                                "kicksNotDefused": 1,
                                "linebreaks": 1,
                                "mins": 71,
                                "missedTackles": 2,
                                "oneOnOneTackles": 2,
                                "penalties": 1,
                                "points": 4,
                                "supports": 4,
                                "tackleBreaks": 3,
                                "tackles": 10,
                                "tries": 1,
                                "evasionRuns": 7,
                                "evasionRunMetres": 150,
                                "dummyHalfRunMetres": 14,
                                "ptbAll": 7,
                                "receipts": 8,
                                "postContactMetres": 29,
                                "ptbOneToTwo": 2,
                                "ptbTwoToThree": 1,
                                "ptbThreeToFour": 3,
                                "ptbFivePlus": 1,
                                "doubles": 1,
                                "effectiveTacklePercentage": 76.9,
                                "ptbPenalties": 1,
                                "stint1": 4246
                            },
                            "playerTookTheField": true,
                            "shirtNum": 3,
                            "playerFirstInitial": "D",
                            "playerPositionAbbrev": "CT",
                            "fantasyPrice": 314000,
                            "fantasySeasonPriceChange": 53000,
                            "fantasyRoundPriceChange": 12000
                        },
                        {
                            "playerFirstName": "Solomone",
                            "playerId": 500921,
                            "playerLastName": "Kata",
                            "playerName": "Solomone Kata",
                            "playerPosition": "Centre 2",
                            "playerPositionId": 500004,
                            "playerStats": {
                                "allRunMetres": 172,
                                "allRuns": 10,
                                "dummyHalfRuns": 1,
                                "errors": 1,
                                "fantasyPointsTotal": 59,
                                "hitUps": 1,
                                "intercepts": 1,
                                "kickReturns": 1,
                                "kicksDefused": 2,
                                "linebreaks": 1,
                                "mins": 80,
                                "missedTackles": 2,
                                "passes": 3,
                                "passesPerRun": 0.3,
                                "oneOnOneTackles": 3,
                                "points": 8,
                                "supports": 9,
                                "tackleBreaks": 7,
                                "tackles": 5,
                                "tries": 2,
                                "tryCause": 1,
                                "hitupRunMeters": 6,
                                "evasionRuns": 7,
                                "evasionRunMetres": 166,
                                "ptbAll": 6,
                                "receipts": 14,
                                "postContactMetres": 22,
                                "ptbOneToTwo": 1,
                                "ptbTwoToThree": 4,
                                "ptbFourToFive": 1,
                                "doubles": 1,
                                "effectiveTacklePercentage": 71.4,
                                "stint1": 4800
                            },
                            "playerTookTheField": true,
                            "shirtNum": 4,
                            "playerFirstInitial": "S",
                            "playerPositionAbbrev": "CT",
                            "onTheField": true,
                            "fantasyPrice": 272000,
                            "fantasySeasonPriceChange": -16000,
                            "fantasyRoundPriceChange": -16000
                        },
                        {
                            "playerFirstName": "Manu",
                            "playerId": 500722,
                            "playerLastName": "Vatuvei",
                            "playerName": "Manu Vatuvei",
                            "playerPosition": "Winger 2",
                            "playerPositionId": 500005,
                            "playerStats": {
                                "allRunMetres": 87,
                                "allRuns": 11,
                                "errors": 1,
                                "fantasyPointsTotal": 13,
                                "hitUps": 1,
                                "kickReturnMetres": 5,
                                "kickReturns": 2,
                                "kicksDefused": 2,
                                "kicksNotDefused": 1,
                                "mins": 80,
                                "passes": 2,
                                "passesPerRun": 0.18,
                                "supports": 11,
                                "tackleBreaks": 1,
                                "tackles": 2,
                                "tryCause": 2,
                                "hitupRunMeters": 5,
                                "evasionRuns": 8,
                                "evasionRunMetres": 77,
                                "ptbAll": 9,
                                "receipts": 14,
                                "postContactMetres": 43,
                                "ptbOneToTwo": 3,
                                "ptbTwoToThree": 4,
                                "ptbThreeToFour": 2,
                                "effectiveTacklePercentage": 100,
                                "stint1": 4800
                            },
                            "playerTookTheField": true,
                            "shirtNum": 5,
                            "playerFirstInitial": "M",
                            "playerPositionAbbrev": "WG",
                            "onTheField": true,
                            "fantasyPrice": 242000,
                            "fantasySeasonPriceChange": -84000,
                            "fantasyRoundPriceChange": -4000
                        },
                        {
                            "playerFirstName": "Thomas",
                            "playerId": 500707,
                            "playerLastName": "Leuluai",
                            "playerName": "Thomas Leuluai",
                            "playerPosition": "Five-Eighth",
                            "playerPositionId": 500006,
                            "playerStats": {
                                "allRunMetres": 134,
                                "allRuns": 17,
                                "bombKicks": 1,
                                "bombKickMetres": 25,
                                "dummyHalfRuns": 4,
                                "fantasyPointsTotal": 36,
                                "ineffectiveTackles": 1,
                                "kickMetres": 66,
                                "kicks": 2,
                                "mins": 80,
                                "missedTackles": 2,
                                "offloads": 2,
                                "passes": 38,
                                "passesPerRun": 2.24,
                                "oneOnOneTackles": 5,
                                "supports": 3,
                                "tackleBreaks": 1,
                                "tackles": 17,
                                "tryCause": 1,
                                "evasionRuns": 13,
                                "evasionRunMetres": 106,
                                "dummyHalfRunMetres": 28,
                                "ptbAll": 6,
                                "receipts": 47,
                                "postContactMetres": 32,
                                "dummyPasses": 4,
                                "lineEngagedRuns": 8,
                                "ptbOneToTwo": 2,
                                "ptbTwoToThree": 2,
                                "ptbThreeToFour": 2,
                                "doubles": 3,
                                "effectiveTacklePercentage": 85,
                                "stint1": 4800
                            },
                            "playerTookTheField": true,
                            "shirtNum": 6,
                            "playerFirstInitial": "T",
                            "playerPositionAbbrev": "FE",
                            "onTheField": true,
                            "fantasyPrice": 260000,
                            "fantasySeasonPriceChange": -19000,
                            "fantasyRoundPriceChange": 27000
                        },
                        {
                            "playerFirstName": "Shaun",
                            "playerId": 500705,
                            "playerLastName": "Johnson",
                            "playerName": "Shaun Johnson",
                            "playerPosition": "Halfback",
                            "playerPositionId": 500007,
                            "playerStats": {
                                "allRunMetres": 34,
                                "allRuns": 6,
                                "bombKicks": 4,
                                "bombKickMetres": 97,
                                "conversionsAttempts": 1,
                                "conversionsMissed": 1,
                                "errors": 1,
                                "fantasyPointsTotal": 40,
                                "allGoalsMissed": 1,
                                "allGoalsAttempted": 1,
                                "ineffectiveTackles": 2,
                                "kickMetres": 227,
                                "kicks": 9,
                                "linebreakAssists": 2,
                                "mins": 80,
                                "missedTackles": 2,
                                "offloads": 1,
                                "passes": 46,
                                "passesPerRun": 7.67,
                                "oneOnOneTackles": 2,
                                "supports": 2,
                                "tackles": 16,
                                "tryAssists": 2,
                                "evasionRuns": 6,
                                "evasionRunMetres": 34,
                                "ptbAll": 1,
                                "receipts": 56,
                                "forcedDropOutKicker": 1,
                                "grubberKick": 2,
                                "postContactMetres": 6,
                                "dummyPasses": 1,
                                "kickPressures": 1,
                                "lineEngagedRuns": 3,
                                "ptbTwoToThree": 1,
                                "effectiveTacklePercentage": 80,
                                "stint1": 4800
                            },
                            "playerTookTheField": true,
                            "shirtNum": 7,
                            "playerFirstInitial": "S",
                            "playerPositionAbbrev": "HB",
                            "onTheField": true,
                            "fantasyPrice": 522000,
                            "fantasySeasonPriceChange": 45000,
                            "fantasyRoundPriceChange": 5000
                        },
                        {
                            "playerFirstName": "Jacob",
                            "playerId": 500708,
                            "playerLastName": "Lillyman",
                            "playerName": "Jacob Lillyman",
                            "playerPosition": "Prop 1",
                            "playerPositionId": 500008,
                            "playerStats": {
                                "allRunMetres": 93,
                                "allRuns": 9,
                                "decoys": 4,
                                "fantasyPointsTotal": 40,
                                "hitUps": 8,
                                "ineffectiveTackles": 1,
                                "kickReturnMetres": 17,
                                "kickReturns": 1,
                                "mins": 46,
                                "missedTackles": 2,
                                "passes": 1,
                                "passesPerRun": 0.11,
                                "supports": 4,
                                "tackleBreaks": 1,
                                "tackles": 32,
                                "tryCause": 1,
                                "hitupRunMeters": 76,
                                "ptbAll": 9,
                                "receipts": 11,
                                "postContactMetres": 18,
                                "dummyPasses": 1,
                                "ptbOneToTwo": 3,
                                "ptbTwoToThree": 5,
                                "ptbThreeToFour": 1,
                                "doubles": 4,
                                "effectiveTacklePercentage": 91.4,
                                "stint1": 1542,
                                "stint2": 1218
                            },
                            "playerTookTheField": true,
                            "shirtNum": 8,
                            "playerFirstInitial": "J",
                            "playerPositionAbbrev": "PR",
                            "fantasyPrice": 292000,
                            "fantasySeasonPriceChange": -7000,
                            "fantasyRoundPriceChange": -6000
                        },
                        {
                            "playerFirstName": "Jazz",
                            "playerId": 501451,
                            "playerLastName": "Tevaga",
                            "playerName": "Jazz Tevaga",
                            "playerPosition": "Hooker",
                            "playerPositionId": 500009,
                            "playerStats": {
                                "allRunMetres": 33,
                                "allRuns": 5,
                                "decoys": 1,
                                "dummyHalfRuns": 2,
                                "fantasyPointsTotal": 31,
                                "hitUps": 3,
                                "mins": 40,
                                "passes": 45,
                                "passesPerRun": 9,
                                "oneOnOneTackles": 2,
                                "penalties": 1,
                                "supports": 1,
                                "tackles": 30,
                                "hitupRunMeters": 20,
                                "dummyHalfRunMetres": 13,
                                "ptbAll": 5,
                                "receipts": 50,
                                "postContactMetres": 10,
                                "ptbOneToTwo": 2,
                                "ptbTwoToThree": 1,
                                "ptbThreeToFour": 2,
                                "doubles": 7,
                                "effectiveTacklePercentage": 100,
                                "ptbPenalties": 1,
                                "stint1": 1452,
                                "stint2": 978
                            },
                            "playerTookTheField": true,
                            "shirtNum": 21,
                            "playerFirstInitial": "J",
                            "playerPositionAbbrev": "HK",
                            "fantasyPrice": 221000
                        },
                        {
                            "playerFirstName": "Albert",
                            "playerId": 500937,
                            "playerLastName": "Vete",
                            "playerName": "Albert Vete",
                            "playerPosition": "Prop 2",
                            "playerPositionId": 500010,
                            "playerStats": {
                                "allRunMetres": 94,
                                "allRuns": 10,
                                "decoys": 3,
                                "fantasyPointsTotal": 35,
                                "hitUps": 7,
                                "kickReturnMetres": 21,
                                "kickReturns": 3,
                                "mins": 31,
                                "passes": 1,
                                "passesPerRun": 0.1,
                                "oneOnOneTackles": 1,
                                "supports": 1,
                                "tackleBreaks": 2,
                                "tackles": 20,
                                "hitupRunMeters": 73,
                                "ptbAll": 10,
                                "receipts": 11,
                                "postContactMetres": 37,
                                "kickPressures": 1,
                                "ptbTwoToThree": 5,
                                "ptbThreeToFour": 3,
                                "ptbFourToFive": 2,
                                "doubles": 2,
                                "effectiveTacklePercentage": 100,
                                "stint1": 1057,
                                "stint2": 760
                            },
                            "playerTookTheField": true,
                            "shirtNum": 10,
                            "playerFirstInitial": "A",
                            "playerPositionAbbrev": "PR",
                            "fantasyPrice": 280000,
                            "fantasySeasonPriceChange": 26000,
                            "fantasyRoundPriceChange": 15000
                        },
                        {
                            "playerFirstName": "Bodene",
                            "playerId": 500664,
                            "playerLastName": "Thompson",
                            "playerName": "Bodene Thompson",
                            "playerPosition": "2nd Row 1",
                            "playerPositionId": 500011,
                            "playerStats": {
                                "allRunMetres": 89,
                                "allRuns": 13,
                                "bombKicksNotDefused": 1,
                                "decoys": 3,
                                "fantasyPointsTotal": 74,
                                "hitUps": 13,
                                "ineffectiveTackles": 3,
                                "kicksNotDefused": 1,
                                "linebreaks": 1,
                                "mins": 80,
                                "missedTackles": 2,
                                "offloads": 1,
                                "passes": 4,
                                "passesPerRun": 0.31,
                                "oneOnOneTackles": 2,
                                "points": 4,
                                "supports": 1,
                                "tackleBreaks": 7,
                                "tackles": 35,
                                "tries": 1,
                                "hitupRunMeters": 89,
                                "ptbAll": 9,
                                "receipts": 16,
                                "postContactMetres": 30,
                                "ptbTwoToThree": 6,
                                "ptbThreeToFour": 2,
                                "ptbFourToFive": 1,
                                "doubles": 6,
                                "effectiveTacklePercentage": 87.5,
                                "stint1": 4800
                            },
                            "playerTookTheField": true,
                            "shirtNum": 11,
                            "playerFirstInitial": "B",
                            "playerPositionAbbrev": "2R",
                            "onTheField": true,
                            "fantasyPrice": 508000,
                            "fantasySeasonPriceChange": 58000,
                            "fantasyRoundPriceChange": 6000
                        },
                        {
                            "playerFirstName": "Ryan",
                            "playerId": 500596,
                            "playerLastName": "Hoffman",
                            "playerName": "Ryan Hoffman",
                            "playerPosition": "2nd Row 2",
                            "playerPositionId": 500012,
                            "playerStats": {
                                "allRunMetres": 109,
                                "allRuns": 11,
                                "decoys": 2,
                                "dummyHalfRuns": 1,
                                "errors": 1,
                                "fantasyPointsTotal": 28,
                                "hitUps": 10,
                                "kickMetres": 2,
                                "kicks": 1,
                                "kicksDefused": 1,
                                "mins": 80,
                                "missedTackles": 1,
                                "passes": 2,
                                "passesPerRun": 0.18,
                                "supports": 7,
                                "tackleBreaks": 2,
                                "tackles": 15,
                                "hitupRunMeters": 94,
                                "dummyHalfRunMetres": 15,
                                "ptbAll": 10,
                                "receipts": 17,
                                "grubberKick": 1,
                                "postContactMetres": 57,
                                "dummyPasses": 1,
                                "kickPressures": 2,
                                "ptbZeroToOne": 1,
                                "ptbOneToTwo": 1,
                                "ptbTwoToThree": 4,
                                "ptbThreeToFour": 4,
                                "doubles": 3,
                                "effectiveTacklePercentage": 93.8,
                                "stint1": 4800
                            },
                            "playerTookTheField": true,
                            "shirtNum": 12,
                            "playerFirstInitial": "R",
                            "playerPositionAbbrev": "2R",
                            "onTheField": true,
                            "fantasyPrice": 301000,
                            "fantasyRoundPriceChange": 3000
                        },
                        {
                            "playerFirstName": "Simon",
                            "playerId": 500712,
                            "playerLastName": "Mannering",
                            "playerName": "Simon Mannering",
                            "playerPosition": "Lock",
                            "playerPositionId": 500013,
                            "playerStats": {
                                "allRunMetres": 113,
                                "allRuns": 13,
                                "decoys": 7,
                                "errors": 1,
                                "fantasyPointsTotal": 72,
                                "hitUps": 9,
                                "linebreaks": 1,
                                "mins": 80,
                                "passes": 18,
                                "passesPerRun": 1.38,
                                "points": 4,
                                "supports": 3,
                                "tackleBreaks": 3,
                                "tackles": 42,
                                "tries": 1,
                                "hitupRunMeters": 86,
                                "evasionRuns": 4,
                                "evasionRunMetres": 27,
                                "ptbAll": 7,
                                "receipts": 27,
                                "postContactMetres": 29,
                                "dummyPasses": 3,
                                "kickPressures": 2,
                                "lineEngagedRuns": 4,
                                "ptbTwoToThree": 4,
                                "ptbThreeToFour": 1,
                                "ptbFourToFive": 2,
                                "doubles": 8,
                                "effectiveTacklePercentage": 100,
                                "stint1": 4800
                            },
                            "playerTookTheField": true,
                            "shirtNum": 13,
                            "playerFirstInitial": "S",
                            "playerPositionAbbrev": "LK",
                            "onTheField": true,
                            "fantasyPrice": 487000,
                            "fantasySeasonPriceChange": -48000,
                            "fantasyRoundPriceChange": 10000
                        },
                        {
                            "playerFirstName": "Nathaniel",
                            "playerId": 501319,
                            "playerLastName": "Roache",
                            "playerName": "Nathaniel Roache",
                            "playerPosition": "Interchange",
                            "playerPositionId": 500014,
                            "playerStats": {
                                "allRunMetres": 66,
                                "allRuns": 3,
                                "dummyHalfRuns": 3,
                                "fantasyPointsTotal": 45,
                                "linebreaks": 1,
                                "mins": 40,
                                "passes": 31,
                                "passesPerRun": 10.33,
                                "oneOnOneTackles": 1,
                                "supports": 2,
                                "tackleBreaks": 2,
                                "tackles": 29,
                                "dummyHalfRunMetres": 66,
                                "ptbAll": 1,
                                "receipts": 33,
                                "postContactMetres": 6,
                                "dummyPasses": 2,
                                "ptbFivePlus": 1,
                                "doubles": 9,
                                "effectiveTacklePercentage": 100,
                                "stint1": 1085,
                                "stint2": 1284
                            },
                            "playerTookTheField": true,
                            "shirtNum": 14,
                            "playerFirstInitial": "N",
                            "playerPositionAbbrev": "INT",
                            "onTheField": true,
                            "fantasyPrice": 128000,
                            "fantasySeasonPriceChange": -2000
                        },
                        {
                            "playerFirstName": "Sam",
                            "playerId": 500926,
                            "playerLastName": "Lisone",
                            "playerName": "Sam Lisone",
                            "playerPosition": "Interchange",
                            "playerPositionId": 500014,
                            "playerStats": {
                                "allRunMetres": 76,
                                "allRuns": 7,
                                "decoys": 7,
                                "fantasyPointsTotal": 29,
                                "hitUps": 5,
                                "ineffectiveTackles": 2,
                                "kickReturnMetres": 15,
                                "kickReturns": 2,
                                "mins": 28,
                                "passes": 3,
                                "passesPerRun": 0.43,
                                "penalties": 1,
                                "supports": 2,
                                "tackleBreaks": 2,
                                "tackles": 18,
                                "hitupRunMeters": 61,
                                "ptbAll": 7,
                                "receipts": 10,
                                "postContactMetres": 20,
                                "dummyPasses": 1,
                                "ptbZeroToOne": 1,
                                "ptbOneToTwo": 1,
                                "ptbTwoToThree": 3,
                                "ptbThreeToFour": 2,
                                "doubles": 5,
                                "effectiveTacklePercentage": 90,
                                "ptbPenalties": 1,
                                "stint1": 1429,
                                "stint2": 262
                            },
                            "playerTookTheField": true,
                            "shirtNum": 15,
                            "playerFirstInitial": "S",
                            "playerPositionAbbrev": "INT",
                            "onTheField": true,
                            "fantasyPrice": 238000,
                            "fantasySeasonPriceChange": 11000,
                            "fantasyRoundPriceChange": 1000
                        },
                        {
                            "playerFirstName": "Ben",
                            "playerId": 500715,
                            "playerLastName": "Matulino",
                            "playerName": "Ben Matulino",
                            "playerPosition": "Interchange",
                            "playerPositionId": 500014,
                            "playerStats": {
                                "allRunMetres": 117,
                                "allRuns": 12,
                                "decoys": 3,
                                "fantasyPointsTotal": 38,
                                "hitUps": 9,
                                "kickReturnMetres": 24,
                                "kickReturns": 2,
                                "mins": 47,
                                "passes": 4,
                                "passesPerRun": 0.33,
                                "oneOnOneTackles": 2,
                                "supports": 1,
                                "tackles": 27,
                                "hitupRunMeters": 89,
                                "evasionRuns": 1,
                                "evasionRunMetres": 4,
                                "ptbAll": 11,
                                "receipts": 16,
                                "postContactMetres": 47,
                                "lineEngagedRuns": 1,
                                "ptbZeroToOne": 1,
                                "ptbOneToTwo": 2,
                                "ptbTwoToThree": 2,
                                "ptbThreeToFour": 5,
                                "ptbFivePlus": 1,
                                "doubles": 6,
                                "effectiveTacklePercentage": 100,
                                "stint1": 2263,
                                "stint2": 554
                            },
                            "playerTookTheField": true,
                            "shirtNum": 16,
                            "playerFirstInitial": "B",
                            "playerPositionAbbrev": "INT",
                            "onTheField": true,
                            "fantasyPrice": 359000,
                            "fantasySeasonPriceChange": -66000,
                            "fantasyRoundPriceChange": 1000
                        },
                        {
                            "playerFirstName": "Blake",
                            "playerId": 500787,
                            "playerLastName": "Ayshford",
                            "playerName": "Blake Ayshford",
                            "playerPosition": "Interchange",
                            "playerPositionId": 500014,
                            "playerStats": {
                                "allRunMetres": 16,
                                "allRuns": 2,
                                "fantasyPointsTotal": 8,
                                "mins": 18,
                                "oneOnOneTackles": 3,
                                "penalties": 1,
                                "tackles": 9,
                                "evasionRuns": 2,
                                "evasionRunMetres": 16,
                                "ptbAll": 2,
                                "receipts": 2,
                                "postContactMetres": 4,
                                "ptbOneToTwo": 1,
                                "ptbFourToFive": 1,
                                "doubles": 2,
                                "effectiveTacklePercentage": 100,
                                "ptbPenalties": 1,
                                "stint1": 1068
                            },
                            "playerTookTheField": true,
                            "shirtNum": 18,
                            "playerFirstInitial": "B",
                            "playerPositionAbbrev": "INT",
                            "onTheField": true,
                            "fantasyPrice": 278000,
                            "fantasySeasonPriceChange": 82000
                        }
                    ]
                },
                "teamName": "New Zealand Warriors",
                "teamNickName": "Warriors",
                "teamStats": {
                    "allRunMetres": 1594,
                    "allRuns": 163,
                    "bombKicks": 5,
                    "bombKickMetres": 122,
                    "bombKicksDefused": 1,
                    "bombKicksNotDefused": 4,
                    "completeSets": 28,
                    "completionPercentage": 78,
                    "conversions": 2,
                    "conversionsAttempts": 5,
                    "conversionsMissed": 3,
                    "decoys": 31,
                    "dummyHalfRuns": 15,
                    "errors": 9,
                    "goalConversionRate": 40,
                    "allGoals": 2,
                    "allGoalsAttempted": 5,
                    "allGoalsMissed": 3,
                    "hitUps": 67,
                    "incompleteSets": 8,
                    "ineffectiveTackles": 11,
                    "intercepts": 2,
                    "kickMetres": 325,
                    "kickReturnMetres": 102,
                    "kickReturns": 16,
                    "kicks": 14,
                    "kicksDefused": 9,
                    "kicksNotDefused": 7,
                    "lineDropouts": 4,
                    "linebreakAssists": 3,
                    "linebreaks": 5,
                    "missedTackles": 16,
                    "offloads": 4,
                    "oneOnOneTackles": 25,
                    "passes": 212,
                    "passesPerRun": 1.3,
                    "penalties": 4,
                    "points": 24,
                    "pointsConceded": 14,
                    "possession": 46,
                    "scrumWins": 5,
                    "supports": 57,
                    "tackleBreaks": 33,
                    "tackles": 320,
                    "sets": 36,
                    "tries": 5,
                    "triesConceded": 3,
                    "tryAssists": 3,
                    "tryCause": 7,
                    "trySaves": 2,
                    "hitupRunMeters": 606,
                    "evasionRuns": 65,
                    "evasionRunMetres": 722,
                    "dummyHalfRunMetres": 164,
                    "ptbTotal": 122,
                    "twoManTackles": 70,
                    "threeManTackles": 40,
                    "fourManPlusTackles": 2,
                    "tryScoringPercentage": 17.86,
                    "shiftsLeft": 18,
                    "shiftsRight": 11,
                    "receipts": 377,
                    "forcedDropOutKicker": 3,
                    "grubberKick": 5,
                    "postContactMetres": 446,
                    "dummyPasses": 13,
                    "kickPressures": 6,
                    "lineEngagedRuns": 17,
                    "ptbZeroToOne": 3,
                    "ptbOneToTwo": 21,
                    "ptbTwoToThree": 52,
                    "ptbThreeToFour": 35,
                    "ptbFourToFive": 8,
                    "ptbFivePlus": 3,
                    "interchangeUsed": 8,
                    "doubles": 57,
                    "effectiveTacklePercentage": 92.2,
                    "ptbPenalties": 4,
                    "averageSetDistance": 44.3,
                    "completeSets1stHalf": 13,
                    "completeSets2ndHalf": 15,
                    "completionPercentage1stHalf": 76.47,
                    "completionPercentage2ndHalf": 78.95,
                    "incompleteSets1stHalf": 4,
                    "incompleteSets2ndHalf": 4,
                    "incompletionPercentage1stHalf": 23.53,
                    "incompletionPercentage2ndHalf": 21.05
                },
                "teamHexColour": "cccccc",
                "teamHexColour2": "000000"
            }
        ]
    }
}