{
    "competitionId": 111,
    "competitionName": "NRL Telstra Premiership",
    "gameId": 20161110670,
    "gameInfo": {
        "assistantReferee1Id": 500038,
        "numberOfPeriods": 2,
        "assistantReferee1Name": "Michael Wise",
        "assistantReferee2Id": 500024,
        "assistantReferee2Name": "Rickey MacFarlane",
        "gameDate": "2016-04-10",
        "gameHashTag": "#NRLKnightsTigers",
        "gameNumber": 7,
        "gameSeconds": 4800,
        "gameMinutes": "80:00",
        "gameTime": "1:20:00",
        "groundConditionId": 1,
        "groundConditionName": "N/A",
        "referee1Id": 500008,
        "referee1Name": "Gavin Badger",
        "referee2Id": 500029,
        "referee2Name": "Chris Butler",
        "startTime": "2016-04-10T16:00:00",
        "startTimeUTC": "2016-04-10T06:00:00Z",
        "venueId": 500024,
        "venueName": "Hunter Stadium",
        "videoReferee1Id": 500203,
        "videoReferee1Name": "Ben Galea",
        "videoReferee2Id": 500036,
        "videoReferee2Name": "Jason Robinson",
        "weatherId": 2,
        "weatherName": "Fine",
        "broadcastChannel": null,
        "venueLatitude": -32.9189,
        "venueLongitude": 151.7267,
        "broadcastInfo": {
            "radioNetwork": []
        }
    },
    "gameState": "Final",
    "gameStateId": 8,
    "roundId": 6,
    "roundName": "Round 6",
    "seasonId": 2016,
    "teams": {
        "teamsMatch": [
            {
                "isHomeTeam": true,
                "score": {
                    "conversions": 3,
                    "points": 18,
                    "tries": 3
                },
                "team1stHalfScore": 12,
                "team2ndHalfScore": 6,
                "teamAbbr": "NEW",
                "teamFinalScore": 18,
                "teamFullTimeScore": 18,
                "teamHalfTimeScore": 12,
                "teamId": 500003,
                "teamLineup": {
                    "teamLineUpStatusID": 4,
                    "teamLineUpStatus": "Final",
                    "injuriesAndSuspensions": {
                        "injury": [],
                        "suspension": []
                    },
                    "insAndOuts": {
                        "inOut": [
                            {
                                "inOut": "In",
                                "playerFirstName": "Daniel",
                                "playerId": "503571",
                                "playerLastName": "Saifiti",
                                "playerName": "Daniel Saifiti"
                            },
                            {
                                "inOut": "Out",
                                "playerFirstName": "Danny",
                                "playerId": "500567",
                                "playerLastName": "Levi",
                                "playerName": "Danny Levi"
                            },
                            {
                                "inOut": "In",
                                "playerFirstName": "Jaelen",
                                "playerId": "500130",
                                "playerLastName": "Feeney",
                                "playerName": "Jaelen Feeney"
                            },
                            {
                                "inOut": "Out",
                                "playerFirstName": "Mickey",
                                "playerId": "502195",
                                "playerLastName": "Paea",
                                "playerName": "Mickey Paea"
                            },
                            {
                                "inOut": "Out",
                                "playerFirstName": "Robbie",
                                "playerId": "500050",
                                "playerLastName": "Rochow",
                                "playerName": "Robbie Rochow"
                            },
                            {
                                "inOut": "Out",
                                "playerFirstName": "Sione",
                                "playerId": "500571",
                                "playerLastName": "Mata'utia",
                                "playerName": "Sione Mata'utia"
                            },
                            {
                                "inOut": "In",
                                "playerFirstName": "Tariq",
                                "playerId": "500298",
                                "playerLastName": "Sims",
                                "playerName": "Tariq Sims"
                            },
                            {
                                "inOut": "In",
                                "playerFirstName": "Will",
                                "playerId": "500744",
                                "playerLastName": "Pearsall",
                                "playerName": "Will Pearsall"
                            }
                        ]
                    },
                    "teamPlayer": [
                        {
                            "playerFirstName": "Dane",
                            "playerId": 500043,
                            "playerLastName": "Gagai",
                            "playerName": "Dane Gagai",
                            "playerPosition": "Fullback",
                            "playerPositionId": 500001,
                            "playerStats": {
                                "allRunMetres": 218,
                                "allRuns": 16,
                                "bombKicksDefused": 1,
                                "chargedDown": 1,
                                "decoys": 5,
                                "dummyHalfRuns": 1,
                                "errors": 1,
                                "fantasyPointsTotal": 41,
                                "hitUps": 2,
                                "kickReturnMetres": 98,
                                "kickReturns": 6,
                                "kicks": 1,
                                "kicksDefused": 4,
                                "mins": 80,
                                "missedTackles": 1,
                                "passes": 8,
                                "passesPerRun": 0.5,
                                "oneOnOneTackles": 1,
                                "supports": 6,
                                "tackleBreaks": 5,
                                "tackles": 5,
                                "hitupRunMeters": 24,
                                "evasionRuns": 7,
                                "evasionRunMetres": 89,
                                "dummyHalfRunMetres": 7,
                                "ptbAll": 17,
                                "receipts": 25,
                                "grubberKick": 1,
                                "postContactMetres": 29,
                                "dummyPasses": 1,
                                "ptbTwoToThree": 4,
                                "ptbThreeToFour": 5,
                                "ptbFourToFive": 8,
                                "doubles": 1,
                                "effectiveTacklePercentage": 83.3
                            },
                            "playerTookTheField": true,
                            "shirtNum": 1,
                            "playerFirstInitial": "D",
                            "playerPositionAbbrev": "FB"
                        },
                        {
                            "playerFirstName": "Nathan",
                            "playerId": 501693,
                            "playerLastName": "Ross",
                            "playerName": "Nathan Ross",
                            "playerPosition": "Winger 1",
                            "playerPositionId": 500002,
                            "playerStats": {
                                "allRunMetres": 108,
                                "allRuns": 11,
                                "bombKicksDefused": 1,
                                "bombKicksNotDefused": 1,
                                "dummyHalfRuns": 4,
                                "fantasyPointsTotal": 30,
                                "ineffectiveTackles": 1,
                                "kickReturnMetres": 10,
                                "kickReturns": 1,
                                "kicksDefused": 1,
                                "kicksNotDefused": 1,
                                "mins": 80,
                                "missedTackles": 2,
                                "oneOnOneTackles": 1,
                                "points": 4,
                                "supports": 3,
                                "tackleBreaks": 3,
                                "tackles": 6,
                                "tries": 1,
                                "tryCause": 1,
                                "evasionRuns": 6,
                                "evasionRunMetres": 56,
                                "dummyHalfRunMetres": 42,
                                "ptbAll": 9,
                                "receipts": 13,
                                "postContactMetres": 15,
                                "ptbTwoToThree": 2,
                                "ptbThreeToFour": 5,
                                "ptbFourToFive": 1,
                                "ptbFivePlus": 1,
                                "doubles": 1,
                                "effectiveTacklePercentage": 66.7
                            },
                            "playerTookTheField": true,
                            "shirtNum": 2,
                            "playerFirstInitial": "N",
                            "playerPositionAbbrev": "WG"
                        },
                        {
                            "playerFirstName": "Jaelen",
                            "playerId": 500130,
                            "playerLastName": "Feeney",
                            "playerName": "Jaelen Feeney",
                            "playerPosition": "Centre 1",
                            "playerPositionId": 500003,
                            "playerStats": {
                                "allRunMetres": 75,
                                "allRuns": 7,
                                "decoys": 2,
                                "dummyHalfRuns": 2,
                                "fantasyPointsTotal": 19,
                                "mins": 80,
                                "missedTackles": 2,
                                "passes": 7,
                                "passesPerRun": 1,
                                "oneOnOneTackles": 3,
                                "supports": 9,
                                "tackles": 16,
                                "tryCause": 2,
                                "evasionRuns": 5,
                                "evasionRunMetres": 31,
                                "dummyHalfRunMetres": 44,
                                "ptbAll": 7,
                                "receipts": 14,
                                "postContactMetres": 9,
                                "dummyPasses": 1,
                                "kickPressures": 1,
                                "ptbOneToTwo": 2,
                                "ptbTwoToThree": 1,
                                "ptbThreeToFour": 2,
                                "ptbFourToFive": 2,
                                "doubles": 1,
                                "effectiveTacklePercentage": 88.9
                            },
                            "playerTookTheField": true,
                            "shirtNum": 21,
                            "playerFirstInitial": "J",
                            "playerPositionAbbrev": "CT"
                        },
                        {
                            "playerFirstName": "Pat",
                            "playerId": 500377,
                            "playerLastName": "Mata'utia",
                            "playerName": "Pat Mata'utia",
                            "playerPosition": "Centre 2",
                            "playerPositionId": 500004,
                            "playerStats": {
                                "allRunMetres": 104,
                                "allRuns": 14,
                                "bombKicksDefused": 1,
                                "dummyHalfRuns": 2,
                                "errors": 2,
                                "fantasyPointsTotal": 22,
                                "ineffectiveTackles": 1,
                                "kicksDefused": 2,
                                "mins": 80,
                                "missedTackles": 3,
                                "offloads": 1,
                                "passes": 4,
                                "passesPerRun": 0.29,
                                "oneOnOneTackles": 1,
                                "supports": 6,
                                "tackleBreaks": 3,
                                "tackles": 9,
                                "evasionRuns": 12,
                                "evasionRunMetres": 91,
                                "dummyHalfRunMetres": 13,
                                "ptbAll": 11,
                                "receipts": 19,
                                "postContactMetres": 14,
                                "ptbOneToTwo": 1,
                                "ptbTwoToThree": 6,
                                "ptbThreeToFour": 2,
                                "ptbFourToFive": 1,
                                "ptbFivePlus": 1,
                                "doubles": 1,
                                "effectiveTacklePercentage": 69.2
                            },
                            "playerTookTheField": true,
                            "shirtNum": 4,
                            "playerFirstInitial": "P",
                            "playerPositionAbbrev": "CT"
                        },
                        {
                            "playerFirstName": "Akuila",
                            "playerId": 500044,
                            "playerLastName": "Uate",
                            "playerName": "Akuila Uate",
                            "playerPosition": "Winger 2",
                            "playerPositionId": 500005,
                            "playerStats": {
                                "allRunMetres": 105,
                                "allRuns": 12,
                                "bombKicksDefused": 3,
                                "decoys": 1,
                                "dummyHalfRuns": 2,
                                "errors": 2,
                                "fantasyPointsTotal": 33,
                                "kickReturnMetres": 13,
                                "kickReturns": 3,
                                "kicksDefused": 3,
                                "linebreaks": 1,
                                "mins": 80,
                                "missedTackles": 1,
                                "oneOnOneTackles": 1,
                                "points": 4,
                                "supports": 3,
                                "tackleBreaks": 2,
                                "tackles": 8,
                                "tries": 1,
                                "tryCause": 2,
                                "evasionRuns": 7,
                                "evasionRunMetres": 62,
                                "dummyHalfRunMetres": 30,
                                "ptbAll": 10,
                                "receipts": 14,
                                "postContactMetres": 8,
                                "ptbOneToTwo": 1,
                                "ptbTwoToThree": 1,
                                "ptbThreeToFour": 5,
                                "ptbFourToFive": 2,
                                "ptbFivePlus": 1,
                                "doubles": 1,
                                "effectiveTacklePercentage": 88.9
                            },
                            "playerTookTheField": true,
                            "shirtNum": 5,
                            "playerFirstInitial": "A",
                            "playerPositionAbbrev": "WG"
                        },
                        {
                            "playerFirstName": "Jarrod",
                            "playerId": 500045,
                            "playerLastName": "Mullen",
                            "playerName": "Jarrod Mullen",
                            "playerPosition": "Five-Eighth",
                            "playerPositionId": 500006,
                            "playerStats": {
                                "allRunMetres": 79,
                                "allRuns": 7,
                                "dummyHalfRuns": 1,
                                "errors": 3,
                                "fantasyPointsTotal": 45,
                                "ineffectiveTackles": 1,
                                "kickDead": 2,
                                "kickMetres": 129,
                                "kicks": 8,
                                "lineDropouts": 3,
                                "linebreakAssists": 1,
                                "mins": 80,
                                "missedTackles": 4,
                                "passes": 26,
                                "passesPerRun": 3.71,
                                "oneOnOneTackles": 1,
                                "supports": 6,
                                "tackleBreaks": 3,
                                "tackles": 25,
                                "tryAssists": 2,
                                "tryCause": 1,
                                "evasionRuns": 6,
                                "evasionRunMetres": 76,
                                "dummyHalfRunMetres": 3,
                                "ptbAll": 3,
                                "receipts": 37,
                                "chipKick": 1,
                                "grubberKick": 1,
                                "crossFieldKick": 2,
                                "postContactMetres": 4,
                                "dummyPasses": 1,
                                "kickPressures": 2,
                                "lineEngagedRuns": 2,
                                "ptbTwoToThree": 2,
                                "ptbThreeToFour": 1,
                                "doubles": 3,
                                "longKicksSpace": 1,
                                "effectiveTacklePercentage": 83.3
                            },
                            "playerTookTheField": true,
                            "shirtNum": 6,
                            "playerFirstInitial": "J",
                            "playerPositionAbbrev": "FE"
                        },
                        {
                            "playerFirstName": "Trent",
                            "playerId": 500224,
                            "playerLastName": "Hodkinson",
                            "playerName": "Trent Hodkinson",
                            "playerPosition": "Halfback",
                            "playerPositionId": 500007,
                            "playerStats": {
                                "allRunMetres": 37,
                                "allRuns": 3,
                                "bombKicks": 4,
                                "bombKickMetres": 124,
                                "conversions": 3,
                                "conversionsAttempts": 3,
                                "fantasyPointsTotal": 47,
                                "goalConversionRate": 100,
                                "allGoals": 3,
                                "allGoalsAttempted": 3,
                                "ineffectiveTackles": 1,
                                "kickMetres": 224,
                                "kicks": 8,
                                "linebreaks": 1,
                                "mins": 80,
                                "missedTackles": 3,
                                "passes": 28,
                                "passesPerRun": 9.33,
                                "oneOnOneTackles": 1,
                                "points": 6,
                                "supports": 9,
                                "tackleBreaks": 2,
                                "tackles": 18,
                                "tryAssists": 1,
                                "tryCause": 1,
                                "evasionRuns": 3,
                                "evasionRunMetres": 37,
                                "ptbAll": 2,
                                "receipts": 38,
                                "grubberKick": 1,
                                "crossFieldKick": 1,
                                "postContactMetres": 3,
                                "dummyPasses": 7,
                                "kickPressures": 1,
                                "ptbThreeToFour": 1,
                                "ptbFivePlus": 1,
                                "doubles": 2,
                                "longKicksSpace": 2,
                                "effectiveTacklePercentage": 81.8
                            },
                            "playerTookTheField": true,
                            "shirtNum": 7,
                            "playerFirstInitial": "T",
                            "playerPositionAbbrev": "HB"
                        },
                        {
                            "playerFirstName": "Sam",
                            "playerId": 500324,
                            "playerLastName": "Mataora",
                            "playerName": "Sam Mataora",
                            "playerPosition": "Prop 1",
                            "playerPositionId": 500008,
                            "playerStats": {
                                "allRunMetres": 70,
                                "allRuns": 8,
                                "errors": 1,
                                "fantasyPointsTotal": 36,
                                "hitUps": 8,
                                "ineffectiveTackles": 2,
                                "kicksDefused": 1,
                                "mins": 42,
                                "missedTackles": 1,
                                "oneOnOneTackles": 1,
                                "penalties": 1,
                                "supports": 2,
                                "tackleBreaks": 1,
                                "tackles": 31,
                                "hitupRunMeters": 70,
                                "ptbAll": 7,
                                "receipts": 9,
                                "postContactMetres": 8,
                                "dummyPasses": 1,
                                "kickPressures": 3,
                                "ptbOneToTwo": 3,
                                "ptbTwoToThree": 2,
                                "ptbThreeToFour": 2,
                                "doubles": 8,
                                "effectiveTacklePercentage": 91.2,
                                "foulPlayPenalties": 1
                            },
                            "playerTookTheField": true,
                            "shirtNum": 8,
                            "playerFirstInitial": "S",
                            "playerPositionAbbrev": "PR"
                        },
                        {
                            "playerFirstName": "Tyler",
                            "playerId": 500380,
                            "playerLastName": "Randell",
                            "playerName": "Tyler Randell",
                            "playerPosition": "Hooker",
                            "playerPositionId": 500009,
                            "playerStats": {
                                "allRunMetres": 56,
                                "allRuns": 7,
                                "dummyHalfRuns": 6,
                                "fantasyPointsTotal": 50,
                                "hitUps": 1,
                                "kickMetres": 3,
                                "kicks": 1,
                                "mins": 62,
                                "missedTackles": 1,
                                "passes": 74,
                                "passesPerRun": 10.57,
                                "supports": 1,
                                "tackleBreaks": 2,
                                "tackles": 41,
                                "hitupRunMeters": 10,
                                "dummyHalfRunMetres": 46,
                                "ptbAll": 7,
                                "receipts": 75,
                                "forcedDropOutKicker": 1,
                                "grubberKick": 1,
                                "postContactMetres": 16,
                                "dummyPasses": 3,
                                "kickPressures": 4,
                                "ptbTwoToThree": 1,
                                "ptbThreeToFour": 3,
                                "ptbFourToFive": 2,
                                "ptbFivePlus": 1,
                                "doubles": 9,
                                "effectiveTacklePercentage": 97.6
                            },
                            "playerTookTheField": true,
                            "shirtNum": 14,
                            "playerFirstInitial": "T",
                            "playerPositionAbbrev": "HK"
                        },
                        {
                            "playerFirstName": "Korbin",
                            "playerId": 500384,
                            "playerLastName": "Sims",
                            "playerName": "Korbin Sims",
                            "playerPosition": "Prop 2",
                            "playerPositionId": 500010,
                            "playerStats": {
                                "allRunMetres": 93,
                                "allRuns": 11,
                                "decoys": 3,
                                "errors": 1,
                                "fantasyPointsTotal": 46,
                                "hitUps": 10,
                                "ineffectiveTackles": 2,
                                "mins": 80,
                                "missedTackles": 2,
                                "passes": 1,
                                "passesPerRun": 0.09,
                                "oneOnOneTackles": 3,
                                "penalties": 2,
                                "points": 4,
                                "supports": 2,
                                "tackleBreaks": 3,
                                "tackles": 30,
                                "tries": 1,
                                "hitupRunMeters": 77,
                                "evasionRuns": 1,
                                "evasionRunMetres": 16,
                                "ptbAll": 9,
                                "receipts": 13,
                                "postContactMetres": 13,
                                "ptbOneToTwo": 1,
                                "ptbTwoToThree": 3,
                                "ptbThreeToFour": 2,
                                "ptbFourToFive": 1,
                                "ptbFivePlus": 2,
                                "doubles": 2,
                                "effectiveTacklePercentage": 88.2,
                                "ptbPenalties": 1,
                                "foulPlayPenalties": 1
                            },
                            "playerTookTheField": true,
                            "shirtNum": 10,
                            "playerFirstInitial": "K",
                            "playerPositionAbbrev": "PR"
                        },
                        {
                            "playerFirstName": "Tariq",
                            "playerId": 500298,
                            "playerLastName": "Sims",
                            "playerName": "Tariq Sims",
                            "playerPosition": "2nd Row 1",
                            "playerPositionId": 500011,
                            "playerStats": {
                                "allRunMetres": 80,
                                "allRuns": 11,
                                "decoys": 3,
                                "errors": 1,
                                "fantasyPointsTotal": 30,
                                "hitUps": 11,
                                "mins": 80,
                                "missedTackles": 4,
                                "supports": 3,
                                "tackleBreaks": 2,
                                "tackles": 26,
                                "tryCause": 1,
                                "hitupRunMeters": 80,
                                "ptbAll": 10,
                                "receipts": 12,
                                "postContactMetres": 10,
                                "kickPressures": 1,
                                "ptbOneToTwo": 3,
                                "ptbTwoToThree": 1,
                                "ptbThreeToFour": 5,
                                "ptbFourToFive": 1,
                                "doubles": 5,
                                "effectiveTacklePercentage": 86.7
                            },
                            "playerTookTheField": true,
                            "shirtNum": 11,
                            "playerFirstInitial": "T",
                            "playerPositionAbbrev": "2R"
                        },
                        {
                            "playerFirstName": "Pauli",
                            "playerId": 500685,
                            "playerLastName": "Pauli",
                            "playerName": "Pauli Pauli",
                            "playerPosition": "2nd Row 2",
                            "playerPositionId": 500012,
                            "playerStats": {
                                "allRunMetres": 69,
                                "allRuns": 7,
                                "decoys": 3,
                                "dummyHalfRuns": 1,
                                "fantasyPointsTotal": 14,
                                "hitUps": 5,
                                "kickReturnMetres": 13,
                                "kickReturns": 1,
                                "mins": 28,
                                "missedTackles": 4,
                                "oneOnOneTackles": 2,
                                "supports": 2,
                                "tackles": 16,
                                "tryCause": 1,
                                "hitupRunMeters": 52,
                                "dummyHalfRunMetres": 4,
                                "ptbAll": 6,
                                "receipts": 7,
                                "postContactMetres": 24,
                                "ptbThreeToFour": 3,
                                "ptbFourToFive": 2,
                                "ptbFivePlus": 1,
                                "doubles": 4,
                                "effectiveTacklePercentage": 80
                            },
                            "playerTookTheField": true,
                            "shirtNum": 17,
                            "playerFirstInitial": "P",
                            "playerPositionAbbrev": "2R"
                        },
                        {
                            "playerFirstName": "Jeremy",
                            "playerId": 500052,
                            "playerLastName": "Smith",
                            "playerName": "Jeremy Smith",
                            "playerPosition": "Lock",
                            "playerPositionId": 500013,
                            "playerStats": {
                                "allRunMetres": 121,
                                "allRuns": 10,
                                "decoys": 6,
                                "fantasyPointsTotal": 30,
                                "hitUps": 10,
                                "mins": 51,
                                "missedTackles": 4,
                                "passes": 3,
                                "passesPerRun": 0.3,
                                "penalties": 1,
                                "supports": 5,
                                "tackleBreaks": 1,
                                "tackles": 25,
                                "hitupRunMeters": 121,
                                "ptbAll": 9,
                                "receipts": 12,
                                "postContactMetres": 15,
                                "ptbThreeToFour": 6,
                                "ptbFourToFive": 2,
                                "ptbFivePlus": 1,
                                "doubles": 4,
                                "effectiveTacklePercentage": 86.2,
                                "foulPlayPenalties": 1
                            },
                            "playerTookTheField": true,
                            "shirtNum": 13,
                            "playerFirstInitial": "J",
                            "playerPositionAbbrev": "LK"
                        },
                        {
                            "playerFirstName": "Jack",
                            "playerId": 500639,
                            "playerLastName": "Stockwell",
                            "playerName": "Jack Stockwell",
                            "playerPosition": "Interchange",
                            "playerPositionId": 500014,
                            "playerStats": {
                                "allRunMetres": 102,
                                "allRuns": 9,
                                "decoys": 3,
                                "fantasyPointsTotal": 36,
                                "hitUps": 7,
                                "ineffectiveTackles": 1,
                                "kickReturnMetres": 30,
                                "kickReturns": 2,
                                "mins": 46,
                                "missedTackles": 3,
                                "passes": 2,
                                "passesPerRun": 0.22,
                                "oneOnOneTackles": 2,
                                "supports": 1,
                                "tackles": 32,
                                "hitupRunMeters": 72,
                                "ptbAll": 8,
                                "receipts": 11,
                                "postContactMetres": 10,
                                "ptbTwoToThree": 1,
                                "ptbThreeToFour": 3,
                                "ptbFourToFive": 2,
                                "ptbFivePlus": 2,
                                "doubles": 7,
                                "effectiveTacklePercentage": 88.9
                            },
                            "playerTookTheField": true,
                            "shirtNum": 15,
                            "playerFirstInitial": "J",
                            "playerPositionAbbrev": "INT"
                        },
                        {
                            "playerFirstName": "Jacob",
                            "playerId": 503523,
                            "playerLastName": "Saifiti",
                            "playerName": "Jacob Saifiti",
                            "playerPosition": "Interchange",
                            "playerPositionId": 500014,
                            "playerStats": {
                                "allRunMetres": 85,
                                "allRuns": 9,
                                "decoys": 4,
                                "fantasyPointsTotal": 27,
                                "hitUps": 7,
                                "kickReturnMetres": 26,
                                "kickReturns": 2,
                                "mins": 42,
                                "missedTackles": 1,
                                "oneOnOneTackles": 1,
                                "supports": 5,
                                "tackleBreaks": 1,
                                "tackles": 18,
                                "hitupRunMeters": 59,
                                "ptbAll": 7,
                                "receipts": 9,
                                "postContactMetres": 19,
                                "kickPressures": 1,
                                "ptbTwoToThree": 2,
                                "ptbThreeToFour": 2,
                                "ptbFivePlus": 3,
                                "doubles": 4,
                                "effectiveTacklePercentage": 94.7
                            },
                            "playerTookTheField": true,
                            "shirtNum": 16,
                            "playerFirstInitial": "J",
                            "playerPositionAbbrev": "INT"
                        },
                        {
                            "playerFirstName": "Daniel",
                            "playerId": 503571,
                            "playerLastName": "Saifiti",
                            "playerName": "Daniel Saifiti",
                            "playerPosition": "Interchange",
                            "playerPositionId": 500014,
                            "playerStats": {
                                "allRunMetres": 80,
                                "allRuns": 10,
                                "decoys": 2,
                                "fantasyPointsTotal": 20,
                                "hitUps": 9,
                                "ineffectiveTackles": 1,
                                "kickReturnMetres": 19,
                                "kickReturns": 1,
                                "mins": 31,
                                "missedTackles": 3,
                                "passes": 1,
                                "passesPerRun": 0.1,
                                "oneOnOneTackles": 2,
                                "supports": 3,
                                "tackles": 18,
                                "hitupRunMeters": 61,
                                "ptbAll": 10,
                                "receipts": 11,
                                "postContactMetres": 11,
                                "kickPressures": 1,
                                "ptbTwoToThree": 1,
                                "ptbThreeToFour": 5,
                                "ptbFourToFive": 2,
                                "ptbFivePlus": 2,
                                "doubles": 2,
                                "effectiveTacklePercentage": 81.8
                            },
                            "playerTookTheField": true,
                            "shirtNum": 18,
                            "playerFirstInitial": "D",
                            "playerPositionAbbrev": "INT"
                        },
                        {
                            "playerFirstName": "Will",
                            "playerId": 500744,
                            "playerLastName": "Pearsall",
                            "playerName": "Will Pearsall",
                            "playerPosition": "Interchange",
                            "playerPositionId": 500014,
                            "playerStats": {
                                "allRunMetres": 11,
                                "allRuns": 1,
                                "dummyHalfRuns": 1,
                                "errors": 1,
                                "fantasyPointsTotal": 9,
                                "mins": 16,
                                "missedTackles": 1,
                                "passes": 22,
                                "passesPerRun": 22,
                                "supports": 1,
                                "tackles": 12,
                                "dummyHalfRunMetres": 11,
                                "ptbAll": 1,
                                "receipts": 23,
                                "ptbThreeToFour": 1,
                                "doubles": 1,
                                "effectiveTacklePercentage": 92.3
                            },
                            "playerTookTheField": true,
                            "shirtNum": 20,
                            "playerFirstInitial": "W",
                            "playerPositionAbbrev": "INT"
                        }
                    ]
                },
                "teamName": "Newcastle Knights",
                "teamNickName": "Knights",
                "teamStats": {
                    "allRunMetres": 1492,
                    "allRuns": 153,
                    "bombKicks": 4,
                    "bombKickMetres": 124,
                    "bombKicksDefused": 6,
                    "bombKicksNotDefused": 1,
                    "chargedDown": 1,
                    "completeSets": 29,
                    "completionPercentage": 72,
                    "conversions": 3,
                    "conversionsAttempts": 3,
                    "decoys": 32,
                    "dummyHalfRuns": 20,
                    "errors": 12,
                    "goalConversionRate": 100,
                    "allGoals": 3,
                    "allGoalsAttempted": 3,
                    "hitUps": 70,
                    "incompleteSets": 11,
                    "ineffectiveTackles": 10,
                    "kickDead": 2,
                    "kickMetres": 356,
                    "kickReturnMetres": 208,
                    "kickReturns": 16,
                    "kicks": 18,
                    "kicksDefused": 11,
                    "kicksNotDefused": 1,
                    "lineDropouts": 3,
                    "linebreakAssists": 1,
                    "linebreaks": 2,
                    "missedTackles": 40,
                    "offloads": 1,
                    "oneOnOneTackles": 20,
                    "passes": 176,
                    "passesPerRun": 1.15,
                    "penalties": 4,
                    "points": 18,
                    "pointsConceded": 16,
                    "possession": 51,
                    "scrumWins": 6,
                    "supports": 67,
                    "tackleBreaks": 28,
                    "tackles": 336,
                    "sets": 40,
                    "tries": 3,
                    "triesConceded": 3,
                    "tryAssists": 3,
                    "tryCause": 9,
                    "hitupRunMeters": 625,
                    "evasionRuns": 47,
                    "evasionRunMetres": 459,
                    "dummyHalfRunMetres": 200,
                    "ptbTotal": 133,
                    "twoManTackles": 71,
                    "threeManTackles": 50,
                    "fourManPlusTackles": 5,
                    "tryScoringPercentage": 10.34,
                    "shiftsLeft": 8,
                    "shiftsRight": 5,
                    "receipts": 342,
                    "forcedDropOutKicker": 1,
                    "chipKick": 1,
                    "grubberKick": 4,
                    "crossFieldKick": 3,
                    "postContactMetres": 208,
                    "dummyPasses": 14,
                    "kickPressures": 14,
                    "lineEngagedRuns": 2,
                    "ptbOneToTwo": 11,
                    "ptbTwoToThree": 27,
                    "ptbThreeToFour": 53,
                    "ptbFourToFive": 26,
                    "ptbFivePlus": 16,
                    "interchangeUsed": 7,
                    "interchangeLeft": 1,
                    "doubles": 56,
                    "longKicksSpace": 3,
                    "effectiveTacklePercentage": 87,
                    "ptbPenalties": 1,
                    "foulPlayPenalties": 3,
                    "averageSetDistance": 37.3,
                    "completeSets1stHalf": 15,
                    "completeSets2ndHalf": 14,
                    "completionPercentage1stHalf": 71.43,
                    "completionPercentage2ndHalf": 73.68,
                    "incompleteSets1stHalf": 6,
                    "incompleteSets2ndHalf": 5,
                    "incompletionPercentage1stHalf": 28.57,
                    "incompletionPercentage2ndHalf": 26.32
                },
                "teamHexColour": "0054a6",
                "teamHexColour2": "002242"
            },
            {
                "score": {
                    "conversions": 2,
                    "points": 16,
                    "tries": 3
                },
                "team1stHalfScore": 10,
                "team2ndHalfScore": 6,
                "teamAbbr": "WST",
                "teamFinalScore": 16,
                "teamFullTimeScore": 16,
                "teamHalfTimeScore": 10,
                "teamId": 500023,
                "teamLineup": {
                    "teamLineUpStatusID": 4,
                    "teamLineUpStatus": "Final",
                    "injuriesAndSuspensions": {
                        "injury": [],
                        "suspension": []
                    },
                    "insAndOuts": {
                        "inOut": [
                            {
                                "inOut": "In",
                                "playerFirstName": "Curtis",
                                "playerId": "500661",
                                "playerLastName": "Sironen",
                                "playerName": "Curtis Sironen"
                            },
                            {
                                "inOut": "Out",
                                "playerFirstName": "Manaia",
                                "playerId": "500472",
                                "playerLastName": "Cherrington",
                                "playerName": "Manaia Cherrington"
                            },
                            {
                                "inOut": "In",
                                "playerFirstName": "Nathan",
                                "playerId": "500484",
                                "playerLastName": "Milone",
                                "playerName": "Nathan Milone"
                            },
                            {
                                "inOut": "Out",
                                "playerFirstName": "Tim",
                                "playerId": "500660",
                                "playerLastName": "Simona",
                                "playerName": "Tim Simona"
                            }
                        ]
                    },
                    "teamPlayer": [
                        {
                            "playerFirstName": "James",
                            "playerId": 500663,
                            "playerLastName": "Tedesco",
                            "playerName": "James Tedesco",
                            "playerPosition": "Fullback",
                            "playerPositionId": 500001,
                            "playerStats": {
                                "allRunMetres": 136,
                                "allRuns": 12,
                                "decoys": 2,
                                "dummyHalfRuns": 2,
                                "errors": 1,
                                "fantasyPointsTotal": 61,
                                "hitUps": 1,
                                "kickReturnMetres": 8,
                                "kickReturns": 1,
                                "kicksDefused": 1,
                                "linebreakAssists": 1,
                                "linebreaks": 2,
                                "mins": 80,
                                "missedTackles": 1,
                                "passes": 8,
                                "passesPerRun": 0.67,
                                "points": 4,
                                "supports": 8,
                                "tackleBreaks": 6,
                                "tackles": 5,
                                "tries": 1,
                                "tryAssists": 1,
                                "tryCause": 1,
                                "trySaves": 1,
                                "hitupRunMeters": 8,
                                "evasionRuns": 8,
                                "evasionRunMetres": 100,
                                "dummyHalfRunMetres": 20,
                                "ptbAll": 9,
                                "receipts": 20,
                                "postContactMetres": 41,
                                "dummyPasses": 2,
                                "lineEngagedRuns": 1,
                                "ptbTwoToThree": 3,
                                "ptbThreeToFour": 4,
                                "ptbFivePlus": 2,
                                "doubles": 1,
                                "effectiveTacklePercentage": 83.3
                            },
                            "playerTookTheField": true,
                            "shirtNum": 1,
                            "playerFirstInitial": "J",
                            "playerPositionAbbrev": "FB"
                        },
                        {
                            "playerFirstName": "David",
                            "playerId": 500658,
                            "playerLastName": "Nofoaluma",
                            "playerName": "David Nofoaluma",
                            "playerPosition": "Winger 1",
                            "playerPositionId": 500002,
                            "playerStats": {
                                "allRunMetres": 170,
                                "allRuns": 18,
                                "dummyHalfRuns": 3,
                                "errors": 3,
                                "fantasyPointsTotal": 39,
                                "kickReturnMetres": 1,
                                "kickReturns": 2,
                                "kicksDefused": 2,
                                "mins": 80,
                                "missedTackles": 3,
                                "offloads": 2,
                                "passes": 3,
                                "passesPerRun": 0.17,
                                "oneOnOneTackles": 1,
                                "supports": 7,
                                "tackleBreaks": 7,
                                "tackles": 7,
                                "tryCause": 1,
                                "evasionRuns": 13,
                                "evasionRunMetres": 148,
                                "dummyHalfRunMetres": 21,
                                "ptbAll": 16,
                                "receipts": 26,
                                "postContactMetres": 45,
                                "ptbOneToTwo": 1,
                                "ptbTwoToThree": 2,
                                "ptbThreeToFour": 7,
                                "ptbFourToFive": 4,
                                "ptbFivePlus": 2,
                                "doubles": 2,
                                "effectiveTacklePercentage": 70
                            },
                            "playerTookTheField": true,
                            "shirtNum": 2,
                            "playerFirstInitial": "D",
                            "playerPositionAbbrev": "WG"
                        },
                        {
                            "playerFirstName": "Nathan",
                            "playerId": 500484,
                            "playerLastName": "Milone",
                            "playerName": "Nathan Milone",
                            "playerPosition": "Centre 1",
                            "playerPositionId": 500003,
                            "playerStats": {
                                "allRunMetres": 66,
                                "allRuns": 10,
                                "decoys": 3,
                                "dummyHalfRuns": 1,
                                "errors": 2,
                                "fantasyPointsTotal": 16,
                                "hitUps": 1,
                                "mins": 80,
                                "missedTackles": 3,
                                "passes": 3,
                                "passesPerRun": 0.3,
                                "oneOnOneTackles": 4,
                                "penalties": 1,
                                "supports": 7,
                                "tackleBreaks": 3,
                                "tackles": 13,
                                "tryCause": 1,
                                "hitupRunMeters": 9,
                                "evasionRuns": 8,
                                "evasionRunMetres": 52,
                                "dummyHalfRunMetres": 5,
                                "ptbAll": 9,
                                "receipts": 13,
                                "postContactMetres": 15,
                                "lineEngagedRuns": 1,
                                "ptbTwoToThree": 3,
                                "ptbThreeToFour": 5,
                                "ptbFourToFive": 1,
                                "doubles": 2,
                                "effectiveTacklePercentage": 81.2,
                                "ptbPenalties": 1
                            },
                            "playerTookTheField": true,
                            "shirtNum": 18,
                            "playerFirstInitial": "N",
                            "playerPositionAbbrev": "CT"
                        },
                        {
                            "playerFirstName": "Kevin",
                            "playerId": 500041,
                            "playerLastName": "Naiqama",
                            "playerName": "Kevin Naiqama",
                            "playerPosition": "Centre 2",
                            "playerPositionId": 500004,
                            "playerStats": {
                                "allRunMetres": 137,
                                "allRuns": 15,
                                "dummyHalfRuns": 2,
                                "fantasyPointsTotal": 47,
                                "hitUps": 1,
                                "ineffectiveTackles": 1,
                                "kicksNotDefused": 1,
                                "mins": 80,
                                "missedTackles": 1,
                                "offloads": 1,
                                "passes": 5,
                                "passesPerRun": 0.33,
                                "oneOnOneTackles": 1,
                                "supports": 8,
                                "tackleBreaks": 4,
                                "tackles": 22,
                                "hitupRunMeters": 4,
                                "evasionRuns": 12,
                                "evasionRunMetres": 121,
                                "dummyHalfRunMetres": 12,
                                "ptbAll": 13,
                                "receipts": 19,
                                "postContactMetres": 45,
                                "lineEngagedRuns": 1,
                                "ptbTwoToThree": 6,
                                "ptbThreeToFour": 4,
                                "ptbFourToFive": 3,
                                "doubles": 4,
                                "effectiveTacklePercentage": 91.7
                            },
                            "playerTookTheField": true,
                            "shirtNum": 4,
                            "playerFirstInitial": "K",
                            "playerPositionAbbrev": "CT"
                        },
                        {
                            "playerFirstName": "Jordan",
                            "playerId": 502193,
                            "playerLastName": "Rankin",
                            "playerName": "Jordan Rankin",
                            "playerPosition": "Winger 2",
                            "playerPositionId": 500005,
                            "playerStats": {
                                "allRunMetres": 92,
                                "allRuns": 12,
                                "bombKicksDefused": 4,
                                "conversions": 2,
                                "conversionsAttempts": 3,
                                "conversionsMissed": 1,
                                "errors": 2,
                                "fantasyPointsTotal": 42,
                                "goalConversionRate": 66.67,
                                "allGoals": 2,
                                "allGoalsMissed": 1,
                                "allGoalsAttempted": 3,
                                "kickReturnMetres": 20,
                                "kickReturns": 4,
                                "kicksDefused": 5,
                                "linebreaks": 2,
                                "mins": 80,
                                "missedTackles": 1,
                                "passes": 5,
                                "passesPerRun": 0.42,
                                "oneOnOneTackles": 1,
                                "points": 12,
                                "supports": 5,
                                "tackleBreaks": 1,
                                "tackles": 3,
                                "tries": 2,
                                "tryCause": 1,
                                "evasionRuns": 8,
                                "evasionRunMetres": 72,
                                "ptbAll": 11,
                                "receipts": 21,
                                "postContactMetres": 13,
                                "ptbOneToTwo": 2,
                                "ptbTwoToThree": 3,
                                "ptbThreeToFour": 5,
                                "ptbFourToFive": 1,
                                "effectiveTacklePercentage": 75
                            },
                            "playerTookTheField": true,
                            "shirtNum": 5,
                            "playerFirstInitial": "J",
                            "playerPositionAbbrev": "WG"
                        },
                        {
                            "playerFirstName": "Mitchell",
                            "playerId": 500485,
                            "playerLastName": "Moses",
                            "playerName": "Mitchell Moses",
                            "playerPosition": "Five-Eighth",
                            "playerPositionId": 500006,
                            "playerStats": {
                                "allRunMetres": 38,
                                "allRuns": 4,
                                "bombKicks": 2,
                                "bombKickMetres": 58,
                                "decoys": 1,
                                "dummyHalfRuns": 1,
                                "errors": 1,
                                "fantasyPointsTotal": 25,
                                "kickMetres": 107,
                                "kickReturnMetres": 3,
                                "kickReturns": 1,
                                "kicks": 6,
                                "linebreakAssists": 1,
                                "mins": 80,
                                "missedTackles": 4,
                                "offloads": 1,
                                "passes": 32,
                                "passesPerRun": 8,
                                "oneOnOneTackles": 1,
                                "penalties": 1,
                                "supports": 6,
                                "tackleBreaks": 2,
                                "tackles": 14,
                                "tryAssists": 1,
                                "evasionRuns": 2,
                                "evasionRunMetres": 26,
                                "dummyHalfRunMetres": 9,
                                "ptbAll": 1,
                                "receipts": 41,
                                "forcedDropOutKicker": 2,
                                "grubberKick": 3,
                                "crossFieldKick": 1,
                                "postContactMetres": 9,
                                "dummyPasses": 1,
                                "lineEngagedRuns": 2,
                                "ptbFivePlus": 1,
                                "doubles": 3,
                                "effectiveTacklePercentage": 77.8,
                                "offsidePenalties": 1
                            },
                            "playerTookTheField": true,
                            "shirtNum": 6,
                            "playerFirstInitial": "M",
                            "playerPositionAbbrev": "FE"
                        },
                        {
                            "playerFirstName": "Luke",
                            "playerId": 500646,
                            "playerLastName": "Brooks",
                            "playerName": "Luke Brooks",
                            "playerPosition": "Halfback",
                            "playerPositionId": 500007,
                            "playerStats": {
                                "allRunMetres": 66,
                                "allRuns": 10,
                                "bombKicks": 4,
                                "bombKickMetres": 104,
                                "chargeDowns": 1,
                                "errors": 2,
                                "fantasyPointsTotal": 29,
                                "kickDead": 2,
                                "kickMetres": 246,
                                "kicks": 9,
                                "kicksNotDefused": 1,
                                "lineDropouts": 2,
                                "linebreakAssists": 2,
                                "mins": 80,
                                "missedTackles": 6,
                                "passes": 42,
                                "passesPerRun": 4.2,
                                "supports": 3,
                                "tackleBreaks": 4,
                                "tackles": 6,
                                "tryAssists": 1,
                                "evasionRuns": 10,
                                "evasionRunMetres": 66,
                                "ptbAll": 1,
                                "receipts": 55,
                                "grubberKick": 2,
                                "postContactMetres": 10,
                                "dummyPasses": 2,
                                "kickPressures": 1,
                                "lineEngagedRuns": 6,
                                "ptbFourToFive": 1,
                                "longKicksSpace": 1,
                                "effectiveTacklePercentage": 50
                            },
                            "playerTookTheField": true,
                            "shirtNum": 7,
                            "playerFirstInitial": "L",
                            "playerPositionAbbrev": "HB"
                        },
                        {
                            "playerFirstName": "Aaron",
                            "playerId": 500665,
                            "playerLastName": "Woods",
                            "playerName": "Aaron Woods",
                            "playerPosition": "Prop 1",
                            "playerPositionId": 500008,
                            "playerStats": {
                                "allRunMetres": 118,
                                "allRuns": 15,
                                "fantasyPointsTotal": 31,
                                "hitUps": 10,
                                "kickReturnMetres": 16,
                                "kickReturns": 1,
                                "mins": 42,
                                "missedTackles": 1,
                                "passes": 5,
                                "passesPerRun": 0.33,
                                "oneOnOneTackles": 1,
                                "supports": 3,
                                "tackles": 17,
                                "trySaves": 1,
                                "hitupRunMeters": 82,
                                "evasionRuns": 4,
                                "evasionRunMetres": 20,
                                "ptbAll": 11,
                                "receipts": 16,
                                "postContactMetres": 14,
                                "kickPressures": 2,
                                "lineEngagedRuns": 4,
                                "ptbTwoToThree": 1,
                                "ptbThreeToFour": 6,
                                "ptbFourToFive": 2,
                                "ptbFivePlus": 2,
                                "doubles": 1,
                                "effectiveTacklePercentage": 94.4
                            },
                            "playerTookTheField": true,
                            "shirtNum": 8,
                            "playerFirstInitial": "A",
                            "playerPositionAbbrev": "PR"
                        },
                        {
                            "playerFirstName": "Robbie",
                            "playerId": 500649,
                            "playerLastName": "Farah",
                            "playerName": "Robbie Farah",
                            "playerPosition": "Hooker",
                            "playerPositionId": 500009,
                            "playerStats": {
                                "allRunMetres": 99,
                                "allRuns": 10,
                                "dummyHalfRuns": 8,
                                "fantasyPointsTotal": 72,
                                "kickDead": 1,
                                "kickMetres": 92,
                                "kickReturnMetres": 12,
                                "kickReturns": 1,
                                "kicks": 4,
                                "kicksDefused": 1,
                                "linebreakAssists": 1,
                                "mins": 80,
                                "offloads": 4,
                                "passes": 112,
                                "passesPerRun": 11.2,
                                "oneOnOneTackles": 3,
                                "tackleBreaks": 2,
                                "tackles": 42,
                                "evasionRuns": 1,
                                "evasionRunMetres": 10,
                                "dummyHalfRunMetres": 77,
                                "ptbAll": 3,
                                "receipts": 117,
                                "forcedDropOutKicker": 1,
                                "grubberKick": 2,
                                "postContactMetres": 16,
                                "dummyPasses": 11,
                                "kickPressures": 2,
                                "lineEngagedRuns": 3,
                                "ptbTwoToThree": 1,
                                "ptbThreeToFour": 2,
                                "doubles": 10,
                                "longKicksSpace": 1,
                                "effectiveTacklePercentage": 100
                            },
                            "playerTookTheField": true,
                            "shirtNum": 9,
                            "playerFirstInitial": "R",
                            "playerPositionAbbrev": "HK"
                        },
                        {
                            "playerFirstName": "Tim",
                            "playerId": 500347,
                            "playerLastName": "Grant",
                            "playerName": "Tim Grant",
                            "playerPosition": "Prop 2",
                            "playerPositionId": 500010,
                            "playerStats": {
                                "allRunMetres": 158,
                                "allRuns": 17,
                                "decoys": 1,
                                "fantasyPointsTotal": 51,
                                "hitUps": 15,
                                "kickReturnMetres": 34,
                                "kickReturns": 2,
                                "mins": 59,
                                "missedTackles": 1,
                                "passes": 1,
                                "passesPerRun": 0.06,
                                "supports": 3,
                                "tackleBreaks": 1,
                                "tackles": 35,
                                "hitupRunMeters": 124,
                                "ptbAll": 17,
                                "receipts": 18,
                                "postContactMetres": 23,
                                "ptbTwoToThree": 10,
                                "ptbThreeToFour": 6,
                                "ptbFivePlus": 1,
                                "doubles": 9,
                                "effectiveTacklePercentage": 97.2
                            },
                            "playerTookTheField": true,
                            "shirtNum": 10,
                            "playerFirstInitial": "T",
                            "playerPositionAbbrev": "PR"
                        },
                        {
                            "playerFirstName": "Dene",
                            "playerId": 500959,
                            "playerLastName": "Halatau",
                            "playerName": "Dene Halatau",
                            "playerPosition": "2nd Row 1",
                            "playerPositionId": 500011,
                            "playerStats": {
                                "allRunMetres": 70,
                                "allRuns": 10,
                                "decoys": 3,
                                "errors": 1,
                                "fantasyPointsTotal": 33,
                                "hitUps": 10,
                                "mins": 61,
                                "passes": 3,
                                "passesPerRun": 0.3,
                                "oneOnOneTackles": 2,
                                "penalties": 1,
                                "supports": 4,
                                "tackles": 30,
                                "hitupRunMeters": 70,
                                "ptbAll": 9,
                                "receipts": 13,
                                "postContactMetres": 17,
                                "kickPressures": 2,
                                "ptbThreeToFour": 6,
                                "ptbFourToFive": 3,
                                "doubles": 9,
                                "effectiveTacklePercentage": 100,
                                "foulPlayPenalties": 1
                            },
                            "playerTookTheField": true,
                            "shirtNum": 11,
                            "playerFirstInitial": "D",
                            "playerPositionAbbrev": "2R"
                        },
                        {
                            "playerFirstName": "Chris",
                            "playerId": 500654,
                            "playerLastName": "Lawrence",
                            "playerName": "Chris Lawrence",
                            "playerPosition": "2nd Row 2",
                            "playerPositionId": 500012,
                            "playerStats": {
                                "allRunMetres": 105,
                                "allRuns": 14,
                                "decoys": 10,
                                "dummyHalfRuns": 1,
                                "fantasyPointsTotal": 59,
                                "hitUps": 13,
                                "linebreaks": 1,
                                "mins": 80,
                                "missedTackles": 3,
                                "passes": 3,
                                "passesPerRun": 0.21,
                                "oneOnOneTackles": 3,
                                "supports": 2,
                                "tackleBreaks": 6,
                                "tackles": 33,
                                "tryCause": 1,
                                "hitupRunMeters": 101,
                                "dummyHalfRunMetres": 4,
                                "ptbAll": 13,
                                "receipts": 16,
                                "postContactMetres": 25,
                                "kickPressures": 1,
                                "ptbTwoToThree": 4,
                                "ptbThreeToFour": 8,
                                "ptbFourToFive": 1,
                                "doubles": 7,
                                "effectiveTacklePercentage": 91.7
                            },
                            "playerTookTheField": true,
                            "shirtNum": 12,
                            "playerFirstInitial": "C",
                            "playerPositionAbbrev": "2R"
                        },
                        {
                            "playerFirstName": "Sauaso",
                            "playerId": 500662,
                            "playerLastName": "Sue",
                            "playerName": "Sauaso Sue",
                            "playerPosition": "Lock",
                            "playerPositionId": 500013,
                            "playerStats": {
                                "allRunMetres": 21,
                                "allRuns": 3,
                                "decoys": 2,
                                "fantasyPointsTotal": 26,
                                "hitUps": 3,
                                "mins": 20,
                                "missedTackles": 1,
                                "penalties": 1,
                                "supports": 1,
                                "tackleBreaks": 1,
                                "tackles": 20,
                                "tryCause": 1,
                                "trySaves": 1,
                                "hitupRunMeters": 21,
                                "ptbAll": 3,
                                "receipts": 3,
                                "postContactMetres": 11,
                                "kickPressures": 1,
                                "ptbTwoToThree": 1,
                                "ptbThreeToFour": 2,
                                "doubles": 5,
                                "effectiveTacklePercentage": 95.2,
                                "foulPlayPenalties": 1
                            },
                            "playerTookTheField": true,
                            "shirtNum": 13,
                            "playerFirstInitial": "S",
                            "playerPositionAbbrev": "LK"
                        },
                        {
                            "playerFirstName": "Curtis",
                            "playerId": 500661,
                            "playerLastName": "Sironen",
                            "playerName": "Curtis Sironen",
                            "playerPosition": "Interchange",
                            "playerPositionId": 500014,
                            "playerStats": {
                                "allRunMetres": 60,
                                "allRuns": 8,
                                "decoys": 2,
                                "fantasyPointsTotal": 28,
                                "hitUps": 8,
                                "mins": 48,
                                "missedTackles": 2,
                                "onReport": 1,
                                "passes": 3,
                                "passesPerRun": 0.38,
                                "oneOnOneTackles": 1,
                                "penalties": 2,
                                "supports": 5,
                                "tackleBreaks": 3,
                                "tackles": 21,
                                "hitupRunMeters": 60,
                                "ptbAll": 8,
                                "receipts": 11,
                                "postContactMetres": 27,
                                "ptbOneToTwo": 1,
                                "ptbTwoToThree": 1,
                                "ptbThreeToFour": 5,
                                "ptbFourToFive": 1,
                                "doubles": 4,
                                "effectiveTacklePercentage": 91.3,
                                "ptbPenalties": 1,
                                "foulPlayPenalties": 1
                            },
                            "playerTookTheField": true,
                            "shirtNum": 14,
                            "playerFirstInitial": "C",
                            "playerPositionAbbrev": "INT"
                        },
                        {
                            "playerFirstName": "Ava",
                            "playerId": 500659,
                            "playerLastName": "Seumanufagai",
                            "playerName": "Ava Seumanufagai",
                            "playerPosition": "Interchange",
                            "playerPositionId": 500014,
                            "playerStats": {
                                "allRunMetres": 125,
                                "allRuns": 14,
                                "decoys": 5,
                                "fantasyPointsTotal": 36,
                                "hitUps": 12,
                                "kickReturnMetres": 35,
                                "kickReturns": 2,
                                "mins": 47,
                                "passes": 2,
                                "passesPerRun": 0.14,
                                "oneOnOneTackles": 1,
                                "supports": 5,
                                "tackles": 24,
                                "hitupRunMeters": 90,
                                "ptbAll": 13,
                                "receipts": 16,
                                "postContactMetres": 13,
                                "ptbTwoToThree": 4,
                                "ptbThreeToFour": 6,
                                "ptbFourToFive": 3,
                                "doubles": 5,
                                "effectiveTacklePercentage": 100
                            },
                            "playerTookTheField": true,
                            "shirtNum": 15,
                            "playerFirstInitial": "A",
                            "playerPositionAbbrev": "INT"
                        },
                        {
                            "playerFirstName": "Josh",
                            "playerId": 500882,
                            "playerLastName": "Aloiai",
                            "playerName": "Josh Aloiai",
                            "playerPosition": "Interchange",
                            "playerPositionId": 500014,
                            "playerStats": {
                                "allRunMetres": 73,
                                "allRuns": 9,
                                "decoys": 3,
                                "fantasyPointsTotal": 25,
                                "hitUps": 7,
                                "kickReturnMetres": 8,
                                "kickReturns": 1,
                                "mins": 29,
                                "missedTackles": 1,
                                "passes": 1,
                                "passesPerRun": 0.11,
                                "penalties": 2,
                                "tackles": 24,
                                "hitupRunMeters": 61,
                                "evasionRuns": 1,
                                "evasionRunMetres": 4,
                                "ptbAll": 8,
                                "receipts": 9,
                                "postContactMetres": 17,
                                "lineEngagedRuns": 1,
                                "ptbTwoToThree": 3,
                                "ptbThreeToFour": 5,
                                "doubles": 6,
                                "effectiveTacklePercentage": 96,
                                "ptbPenalties": 1,
                                "foulPlayPenalties": 1
                            },
                            "playerTookTheField": true,
                            "shirtNum": 16,
                            "playerFirstInitial": "J",
                            "playerPositionAbbrev": "INT"
                        },
                        {
                            "playerFirstName": "Kyle",
                            "playerId": 500480,
                            "playerLastName": "Lovett",
                            "playerName": "Kyle Lovett",
                            "playerPosition": "Interchange",
                            "playerPositionId": 500014,
                            "playerStats": {
                                "allRunMetres": 21,
                                "allRuns": 2,
                                "decoys": 1,
                                "fantasyPointsTotal": 15,
                                "hitUps": 2,
                                "mins": 12,
                                "supports": 1,
                                "tackles": 13,
                                "hitupRunMeters": 21,
                                "ptbAll": 2,
                                "receipts": 2,
                                "postContactMetres": 9,
                                "ptbTwoToThree": 1,
                                "ptbFourToFive": 1,
                                "doubles": 7,
                                "effectiveTacklePercentage": 100
                            },
                            "playerTookTheField": true,
                            "shirtNum": 17,
                            "playerFirstInitial": "K",
                            "playerPositionAbbrev": "INT"
                        }
                    ]
                },
                "teamName": "Wests Tigers",
                "teamNickName": "Wests Tigers",
                "teamStats": {
                    "allRunMetres": 1552,
                    "allRuns": 183,
                    "bombKicks": 6,
                    "bombKickMetres": 163,
                    "bombKicksDefused": 4,
                    "chargeDowns": 1,
                    "completeSets": 27,
                    "completionPercentage": 73,
                    "conversions": 2,
                    "conversionsAttempts": 3,
                    "conversionsMissed": 1,
                    "decoys": 33,
                    "dummyHalfRuns": 18,
                    "errors": 12,
                    "goalConversionRate": 66.67,
                    "allGoals": 2,
                    "allGoalsAttempted": 3,
                    "allGoalsMissed": 1,
                    "hitUps": 83,
                    "incompleteSets": 10,
                    "ineffectiveTackles": 1,
                    "kickDead": 3,
                    "kickMetres": 446,
                    "kickReturnMetres": 137,
                    "kickReturns": 15,
                    "kicks": 19,
                    "kicksDefused": 9,
                    "kicksNotDefused": 2,
                    "lineDropouts": 2,
                    "linebreakAssists": 5,
                    "linebreaks": 5,
                    "missedTackles": 28,
                    "offloads": 8,
                    "onReports": 1,
                    "oneOnOneTackles": 19,
                    "passes": 228,
                    "passesPerRun": 1.25,
                    "penalties": 8,
                    "points": 16,
                    "pointsConceded": 18,
                    "possession": 49,
                    "scrumWins": 7,
                    "supports": 68,
                    "tackleBreaks": 40,
                    "tackles": 329,
                    "sets": 37,
                    "tries": 3,
                    "triesConceded": 3,
                    "tryAssists": 3,
                    "tryCause": 6,
                    "trySaves": 3,
                    "hitupRunMeters": 649,
                    "evasionRuns": 67,
                    "evasionRunMetres": 618,
                    "dummyHalfRunMetres": 148,
                    "ptbTotal": 147,
                    "twoManTackles": 61,
                    "threeManTackles": 57,
                    "fourManPlusTackles": 4,
                    "tryScoringPercentage": 11.11,
                    "shiftsLeft": 13,
                    "shiftsRight": 12,
                    "receipts": 416,
                    "forcedDropOutKicker": 3,
                    "grubberKick": 7,
                    "crossFieldKick": 1,
                    "postContactMetres": 348,
                    "dummyPasses": 16,
                    "kickPressures": 9,
                    "lineEngagedRuns": 19,
                    "ptbOneToTwo": 4,
                    "ptbTwoToThree": 43,
                    "ptbThreeToFour": 71,
                    "ptbFourToFive": 21,
                    "ptbFivePlus": 8,
                    "interchangeUsed": 8,
                    "doubles": 75,
                    "longKicksSpace": 2,
                    "effectiveTacklePercentage": 91.9,
                    "ptbPenalties": 3,
                    "foulPlayPenalties": 4,
                    "offsidePenalties": 1,
                    "averageSetDistance": 41.9,
                    "completeSets1stHalf": 13,
                    "completeSets2ndHalf": 14,
                    "completionPercentage1stHalf": 76.47,
                    "completionPercentage2ndHalf": 70,
                    "incompleteSets1stHalf": 4,
                    "incompleteSets2ndHalf": 6,
                    "incompletionPercentage1stHalf": 23.53,
                    "incompletionPercentage2ndHalf": 30
                },
                "teamHexColour": "f58220",
                "teamHexColour2": "AC5B16"
            }
        ]
    }
}