{
    "vod": [
        {
            "id": "pqYmdtdDoTVOjcMoyjD4RoCK2QQv7mz_",
            "contentId": 740213,
            "title": "Rd 7: Sharks v Rabbitohs (2)",
            "description": "2nd half replay of the match between the Sharks & Rabbitohs",
            "publishDate": "2015-04-21T09:00:00+10:00",
            "publisher": "NRL Chief",
            "thumbnailUrl": "http://bigpondvideo.com/Web/Images/Content/20150420205934a_89x50.jpg",
            "largeThumbnailUrl": "http://bigpondvideo.com/Web/Images/Content/20150420205934a_326x184.jpg",
            "programType": "Matches",
            "programCategory": "Replay: 2nd Half",
            "priority": null,
            "lastUpdateDate": "2015-04-20T22:55:23+10:00",
            "isPremium": true,
            "club": [
                500028,
                500005
            ]
        },
        {
            "id": "0zYmdtdDq_xQLRkmqk6D2z30tFgfINE8",
            "contentId": 740212,
            "title": "Rd 7: Sharks v Rabbitohs (1)",
            "description": "1st half replay of the match between the Sharks & Rabbitohs",
            "publishDate": "2015-04-21T09:00:00+10:00",
            "publisher": "NRL Chief",
            "thumbnailUrl": "http://bigpondvideo.com/Web/Images/Content/20150420205840a_89x50.jpg",
            "largeThumbnailUrl": "http://bigpondvideo.com/Web/Images/Content/20150420205840a_326x184.jpg",
            "programType": "Matches",
            "programCategory": "Replay: 1st Half",
            "priority": null,
            "lastUpdateDate": "2015-04-20T22:54:23+10:00",
            "isPremium": true,
            "club": [
                500028,
                500005
            ]
        },
        {
            "id": "52MGZtdDqv55_BGMrafAS25Ydj2i_KvV",
            "contentId": 740134,
            "title": "Rd 7: Sharks v Rabbitohs (Hls)",
            "description": "Highlights of the match between the Sharks & Rabbitohs from Remondis Stadium.",
            "publishDate": "2015-04-20T21:01:00+10:00",
            "publisher": "NRL Chief",
            "thumbnailUrl": "http://bigpondvideo.com/Web/Images/Content/20150420205751a_89x50.jpg",
            "largeThumbnailUrl": "http://bigpondvideo.com/Web/Images/Content/20150420205751a_326x184.jpg",
            "programType": "Highlights",
            "programCategory": "Match",
            "priority": null,
            "lastUpdateDate": "2015-04-20T21:06:23+10:00",
            "isPremium": false,
            "club": [
                500028,
                500005
            ]
        },
        {
            "id": "5mbWZtdDpC8zPJF0cayABrcN_H6Sbdno",
            "contentId": 740185,
            "title": "Rd 7 Press Conference: Rabbitohs",
            "description": "The Rabbitohs coach faces the media following the match",
            "publishDate": "2015-04-20T21:39:00+10:00",
            "publisher": "NRL Chief",
            "thumbnailUrl": "http://bigpondvideo.com/Web/Images/Content/20150420213013a_89x50.jpg",
            "largeThumbnailUrl": "http://bigpondvideo.com/Web/Images/Content/20150420213013a_326x184.jpg",
            "programType": "Press Conference",
            "programCategory": null,
            "priority": null,
            "lastUpdateDate": "2015-04-20T21:53:47+10:00",
            "isPremium": false,
            "club": [
                500028,
                500005
            ]
        },
        {
            "id": "4zaWZtdDq-mBUgKgC-IkZXJGiXW8yHUg",
            "contentId": 740182,
            "title": "Rd 7 Press Conference: Sharks",
            "description": "The Sharks coach faces the media following the match",
            "publishDate": "2015-04-20T21:31:00+10:00",
            "publisher": "NRL Chief",
            "thumbnailUrl": "http://bigpondvideo.com/Web/Images/Content/20150420211222a_89x50.jpg",
            "largeThumbnailUrl": "http://bigpondvideo.com/Web/Images/Content/20150420211222a_326x184.jpg",
            "programType": "Press Conference",
            "programCategory": null,
            "priority": null,
            "lastUpdateDate": "2015-04-20T21:39:39+10:00",
            "isPremium": false,
            "club": [
                500028,
                500005
            ]
        },
        {
            "id": "B2cmVtdDpAG9W2Co9a0I3VrHM7ceTZTr",
            "contentId": 740936,
            "title": "Rd 7: GOAL Valentine Holmes (75th min)",
            "description": "Conversion sees Cronulla lead by 8",
            "publishDate": "2015-04-20T20:43:00+10:00",
            "publisher": "NRL Chief",
            "thumbnailUrl": "http://bigpondvideo.com/Web/Images/Content/20150420204148a_89x50.jpg",
            "largeThumbnailUrl": "http://bigpondvideo.com/Web/Images/Content/20150420204148a_326x184.jpg",
            "programType": "Instant Replay",
            "programCategory": "Score",
            "priority": 1,
            "lastUpdateDate": "2015-04-20T20:51:17+10:00",
            "isPremium": true,
            "club": [
                500028,
                500005
            ]
        },
        {
            "id": "NkcmVtdDrGy9o1uxq6SBRcpVJ-hs6vNF",
            "contentId": 740938,
            "title": "Rd 7: TRY Jason Bukuya (74th min)",
            "description": "Another Michael Ennis grubber comes up trumps as Jason Bukuya dives over to score for the Sharks",
            "publishDate": "2015-04-20T20:41:00+10:00",
            "publisher": "NRL Chief",
            "thumbnailUrl": "http://bigpondvideo.com/Web/Images/Content/20150420204044a_89x50.jpg",
            "largeThumbnailUrl": "http://bigpondvideo.com/Web/Images/Content/20150420204044a_326x184.jpg",
            "programType": "Instant Replay",
            "programCategory": "Score",
            "priority": 2,
            "lastUpdateDate": "2015-04-20T20:52:15+10:00",
            "isPremium": true,
            "club": [
                500028,
                500005
            ]
        },
        {
            "id": "x3Z2VtdDp5czjPSkZafN3UfLCO5rixjl",
            "contentId": 740937,
            "title": "Rd 7: GOAL Issac Luke (55th min)",
            "description": "Conversion sees the Rabbitohs trail by 2",
            "publishDate": "2015-04-20T20:17:00+10:00",
            "publisher": "NRL Chief",
            "thumbnailUrl": "http://bigpondvideo.com/Web/Images/Content/20150420201653a_89x50.jpg",
            "largeThumbnailUrl": "http://bigpondvideo.com/Web/Images/Content/20150420201653a_326x184.jpg",
            "programType": "Instant Replay",
            "programCategory": "Score",
            "priority": 3,
            "lastUpdateDate": "2015-04-20T20:50:22+10:00",
            "isPremium": true,
            "club": [
                500028,
                500005
            ]
        },
        {
            "id": "1yZmVtdDo2-qd-Bsig9RmoFbU4g1oFua",
            "contentId": 740934,
            "title": "Rd 7: TRY Chris McQueen (54th min)",
            "description": "Neat Luke Keary kick sends Chris McQueen over to score for South Sydney",
            "publishDate": "2015-04-20T20:16:00+10:00",
            "publisher": "NRL Chief",
            "thumbnailUrl": "http://bigpondvideo.com/Web/Images/Content/20150420201643a_89x50.jpg",
            "largeThumbnailUrl": "http://bigpondvideo.com/Web/Images/Content/20150420201643a_326x184.jpg",
            "programType": "Instant Replay",
            "programCategory": "Score",
            "priority": 4,
            "lastUpdateDate": "2015-04-20T20:50:22+10:00",
            "isPremium": true,
            "club": [
                500028,
                500005
            ]
        },
        {
            "id": "ZlZWVtdDp32vqbfD3dUfS3OJGg8lwqt7",
            "contentId": 740928,
            "title": "Rd 7: PENALTY GOAL Valentine Holmes (51st min)",
            "description": "Penalty goal to the Sharks takes them out to a 12-4 lead",
            "publishDate": "2015-04-20T20:14:00+10:00",
            "publisher": "NRL Chief",
            "thumbnailUrl": "http://bigpondvideo.com/Web/Images/Content/20150420201441a_89x50.jpg",
            "largeThumbnailUrl": "http://bigpondvideo.com/Web/Images/Content/20150420201441a_326x184.jpg",
            "programType": "Instant Replay",
            "programCategory": "Score",
            "priority": 5,
            "lastUpdateDate": "2015-04-20T20:49:39+10:00",
            "isPremium": true,
            "club": [
                500028,
                500005
            ]
        },
        {
            "id": "02eGRtdDonL3ogImu1qVAuhl035qQ7r_",
            "contentId": 740929,
            "title": "Rd 7: TRY Alex Johnston (31st min)",
            "description": "Rabbitohs strike back as Alex Johnston crosses out wide to score his 6th try for the season",
            "publishDate": "2015-04-20T19:36:00+10:00",
            "publisher": "NRL Chief",
            "thumbnailUrl": "http://bigpondvideo.com/Web/Images/Content/20150420193708a_89x50.jpg",
            "largeThumbnailUrl": "http://bigpondvideo.com/Web/Images/Content/20150420193708a_326x184.jpg",
            "programType": "Instant Replay",
            "programCategory": "Score",
            "priority": 6,
            "lastUpdateDate": "2015-04-20T20:49:39+10:00",
            "isPremium": true,
            "club": [
                500028,
                500005
            ]
        },
        {
            "id": "xmdWRtdDoUPcrs23-92iEHo4DSlSpcMw",
            "contentId": 740930,
            "title": "Rd 7: GOAL Michael Gordon (24th min)",
            "description": "Conversion sees the Sharks lead 10-0",
            "publishDate": "2015-04-20T19:29:00+10:00",
            "publisher": "NRL Chief",
            "thumbnailUrl": "http://bigpondvideo.com/Web/Images/Content/20150420193023a_89x50.jpg",
            "largeThumbnailUrl": "http://bigpondvideo.com/Web/Images/Content/20150420193023a_326x184.jpg",
            "programType": "Instant Replay",
            "programCategory": "Score",
            "priority": 7,
            "lastUpdateDate": "2015-04-20T20:48:20+10:00",
            "isPremium": true,
            "club": [
                500028,
                500005
            ]
        },
        {
            "id": "NidWRtdDpPQ_qVUDEYeSjYQSV1Dn7BvT",
            "contentId": 740926,
            "title": "Rd 7: TRY Luke Lewis (23rd min)",
            "description": "Michael Ennis grubber sees Luke Lewis come up with another try for the Sharks",
            "publishDate": "2015-04-20T19:27:00+10:00",
            "publisher": "NRL Chief",
            "thumbnailUrl": "http://bigpondvideo.com/Web/Images/Content/20150420192944a_89x50.jpg",
            "largeThumbnailUrl": "http://bigpondvideo.com/Web/Images/Content/20150420192944a_326x184.jpg",
            "programType": "Instant Replay",
            "programCategory": "Score",
            "priority": 8,
            "lastUpdateDate": "2015-04-20T20:48:20+10:00",
            "isPremium": true,
            "club": [
                500028,
                500005
            ]
        },
        {
            "id": "5pbmRtdDp1ywjh55ImdlehctdyMi47gz",
            "contentId": 740924,
            "title": "Rd 7: TRY Michael Gordon (7th min)",
            "description": "Sharks open the scoring in this match through a try to Michael Gordon who crosses in the corner",
            "publishDate": "2015-04-20T19:11:00+10:00",
            "publisher": "NRL Chief",
            "thumbnailUrl": "http://bigpondvideo.com/Web/Images/Content/20150420191214a_89x50.jpg",
            "largeThumbnailUrl": "http://bigpondvideo.com/Web/Images/Content/20150420191214a_326x184.jpg",
            "programType": "Instant Replay",
            "programCategory": "Score",
            "priority": 9,
            "lastUpdateDate": "2015-04-20T20:47:13+10:00",
            "isPremium": true,
            "club": [
                500028,
                500005
            ]
        }
    ],
    "scores": [
        {
            "gameState": "First Half",
            "gameStateId": 3,
            "gameTime": "0:06:13",
            "gameSeconds": 373,
            "playerId": 500797,
            "playerName": "Michael Gordon",
            "scoreMethod": "Try",
            "statId": 38,
            "statValue": 4,
            "vidRef": 11426,
            "homeScore": 4,
            "teamId": 500028,
            "teamName": "Cronulla-Sutherland Sharks",
            "homeTeamAbbrv": "CRO",
            "awayTeamAbbrv": "SOU"
        },
        {
            "gameState": "First Half",
            "gameStateId": 3,
            "gameTime": "0:22:46",
            "gameSeconds": 1366,
            "playerId": 500802,
            "playerName": "Luke Lewis",
            "scoreMethod": "Try",
            "statId": 38,
            "statValue": 4,
            "vidRef": 36265,
            "homeScore": 8,
            "teamId": 500028,
            "teamName": "Cronulla-Sutherland Sharks",
            "homeTeamAbbrv": "CRO",
            "awayTeamAbbrv": "SOU"
        },
        {
            "gameState": "First Half",
            "gameStateId": 3,
            "gameTime": "0:23:23",
            "gameSeconds": 1403,
            "playerId": 500797,
            "playerName": "Michael Gordon",
            "scoreMethod": "Conversion",
            "statId": 1,
            "statValue": 2,
            "vidRef": 38983,
            "homeScore": 10,
            "teamId": 500028,
            "teamName": "Cronulla-Sutherland Sharks",
            "homeTeamAbbrv": "CRO",
            "awayTeamAbbrv": "SOU"
        },
        {
            "gameState": "Second Half",
            "gameStateId": 5,
            "gameTime": "0:50:46",
            "gameSeconds": 3046,
            "playerId": 500845,
            "playerName": "Valentine Holmes",
            "scoreMethod": "Penalty Goal",
            "statId": 67,
            "statValue": 2,
            "vidRef": 87530,
            "homeScore": 12,
            "awayScore": 4,
            "teamId": 500028,
            "teamName": "Cronulla-Sutherland Sharks",
            "homeTeamAbbrv": "CRO",
            "awayTeamAbbrv": "SOU"
        },
        {
            "gameState": "Second Half",
            "gameStateId": 5,
            "gameTime": "1:13:12",
            "gameSeconds": 4392,
            "playerId": 500977,
            "playerName": "Jayson Bukuya",
            "scoreMethod": "Try",
            "statId": 38,
            "statValue": 4,
            "vidRef": 127576,
            "homeScore": 16,
            "awayScore": 10,
            "teamId": 500028,
            "teamName": "Cronulla-Sutherland Sharks",
            "homeTeamAbbrv": "CRO",
            "awayTeamAbbrv": "SOU"
        },
        {
            "gameState": "Second Half",
            "gameStateId": 5,
            "gameTime": "1:14:19",
            "gameSeconds": 4459,
            "playerId": 500845,
            "playerName": "Valentine Holmes",
            "scoreMethod": "Conversion",
            "statId": 1,
            "statValue": 2,
            "vidRef": 130608,
            "homeScore": 18,
            "awayScore": 10,
            "teamId": 500028,
            "teamName": "Cronulla-Sutherland Sharks",
            "homeTeamAbbrv": "CRO",
            "awayTeamAbbrv": "SOU"
        },
        {
            "gameState": "First Half",
            "gameStateId": 3,
            "gameTime": "0:30:31",
            "gameSeconds": 1831,
            "playerId": 500108,
            "playerName": "Alex Johnston",
            "scoreMethod": "Try",
            "statId": 38,
            "statValue": 4,
            "vidRef": 51154,
            "homeScore": 10,
            "awayScore": 4,
            "teamId": 500005,
            "teamName": "South Sydney Rabbitohs",
            "homeTeamAbbrv": "CRO",
            "awayTeamAbbrv": "SOU"
        },
        {
            "gameState": "Second Half",
            "gameStateId": 5,
            "gameTime": "0:52:56",
            "gameSeconds": 3176,
            "playerId": 500090,
            "playerName": "Chris McQueen",
            "scoreMethod": "Try",
            "statId": 38,
            "statValue": 4,
            "vidRef": 91027,
            "homeScore": 12,
            "awayScore": 8,
            "teamId": 500005,
            "teamName": "South Sydney Rabbitohs",
            "homeTeamAbbrv": "CRO",
            "awayTeamAbbrv": "SOU"
        },
        {
            "gameState": "Second Half",
            "gameStateId": 5,
            "gameTime": "0:53:49",
            "gameSeconds": 3229,
            "playerId": 500088,
            "playerName": "Issac Luke",
            "scoreMethod": "Conversion",
            "statId": 1,
            "statValue": 2,
            "vidRef": 93477,
            "homeScore": 12,
            "awayScore": 10,
            "teamId": 500005,
            "teamName": "South Sydney Rabbitohs",
            "homeTeamAbbrv": "CRO",
            "awayTeamAbbrv": "SOU"
        }
    ]
}