{
    "vod": [
        {
            "id": "IzcmllNDE6j5N3xMRii2SjOSDwoMgIW3",
            "contentId": 858091,
            "title": "Rd 16: Cowboys v Sea Eagles (Hls)",
            "description": "Highlights of the match between the Cowboys and Sea Eagles from 1300Smiles Stadium",
            "publishDate": "2016-06-27T21:08:00+10:00",
            "publisher": "NRL Chief",
            "thumbnailUrl": "http://bigpondvideo.com/web/images/content/20160627210901a_89x50.jpg",
            "largeThumbnailUrl": "http://bigpondvideo.com/web/images/content/20160627210901a_326x184.jpg",
            "programType": "Highlights",
            "programCategory": "Match",
            "priority": null,
            "lastUpdateDate": "2016-06-27T21:12:23+10:00",
            "isPremium": false,
            "club": [
                500002,
                500012
            ]
        },
        {
            "id": "UxOGplNDE62RYqPmiciUg3R10-xPfGa6",
            "contentId": 858105,
            "title": "Rd 16 Press Conference: Sea Eagles",
            "description": "The Sea Eagles coach faces the media following the match",
            "publishDate": "2016-06-27T21:36:00+10:00",
            "publisher": "NRL Chief",
            "thumbnailUrl": "http://bigpondvideo.com/web/images/content/20160627212237a_89x50.jpg",
            "largeThumbnailUrl": "http://bigpondvideo.com/web/images/content/20160627212237a_326x184.jpg",
            "programType": "Press Conference",
            "programCategory": null,
            "priority": null,
            "lastUpdateDate": "2016-06-27T21:40:30+10:00",
            "isPremium": false,
            "club": [
                500002,
                500012
            ]
        },
        {
            "id": "AwNWplNDE65Sx6zs61copmFTdmJ01MWH",
            "contentId": 858104,
            "title": "Rd 16 Press Conference: Cowboys",
            "description": "The Cowboys coach faces the media following the match",
            "publishDate": "2016-06-27T21:29:00+10:00",
            "publisher": "NRL Chief",
            "thumbnailUrl": "http://bigpondvideo.com/web/images/content/20160627212251a_89x50.jpg",
            "largeThumbnailUrl": "http://bigpondvideo.com/web/images/content/20160627212251a_326x184.jpg",
            "programType": "Press Conference",
            "programCategory": null,
            "priority": null,
            "lastUpdateDate": "2016-06-27T21:34:28+10:00",
            "isPremium": false,
            "club": [
                500002,
                500012
            ]
        },
        {
            "id": "piZGllNDE61S-7XBerYAjQ7vOVTinIZT",
            "contentId": 858072,
            "title": "Rd 16: TRY Lewis Brown (75th min)",
            "description": "Lewis Brown scores a try for the Sea Eagles",
            "publishDate": "2016-06-27T20:33:00+10:00",
            "publisher": "NRL Chief",
            "thumbnailUrl": "http://bigpondvideo.com/web/images/content/20160627203732a_89x50.jpg",
            "largeThumbnailUrl": "http://bigpondvideo.com/web/images/content/20160627203732a_326x184.jpg",
            "programType": "Instant Replay",
            "programCategory": "Score",
            "priority": null,
            "lastUpdateDate": "2016-06-27T20:40:16+10:00",
            "isPremium": true,
            "club": [
                500002,
                500012
            ]
        },
        {
            "id": "9rYWllNDE6SiFCr1o-iK-yORAWkyNyhM",
            "contentId": 858071,
            "title": "Rd 16: GOAL Johnathan Thurston (69th min)",
            "description": "Johnathan Thurston converts the Jason Taumalolo try",
            "publishDate": "2016-06-27T20:28:00+10:00",
            "publisher": "NRL Chief",
            "thumbnailUrl": "http://bigpondvideo.com/web/images/content/20160627203026a_89x50.jpg",
            "largeThumbnailUrl": "http://bigpondvideo.com/web/images/content/20160627203026a_326x184.jpg",
            "programType": "Instant Replay",
            "programCategory": "Score",
            "priority": null,
            "lastUpdateDate": "2016-06-27T20:33:14+10:00",
            "isPremium": true,
            "club": [
                500002,
                500012
            ]
        },
        {
            "id": "I4YWllNDE6uPXOsGsBfNNs9X-PjxNk0x",
            "contentId": 858070,
            "title": "Rd 16: TRY Jason Taumalolo (68th min)",
            "description": "Jason Taumalolo scores a try for the Cowboys",
            "publishDate": "2016-06-27T20:27:00+10:00",
            "publisher": "NRL Chief",
            "thumbnailUrl": "http://bigpondvideo.com/web/images/content/20160627202915a_89x50.jpg",
            "largeThumbnailUrl": "http://bigpondvideo.com/web/images/content/20160627202915a_326x184.jpg",
            "programType": "Instant Replay",
            "programCategory": "Score",
            "priority": null,
            "lastUpdateDate": "2016-06-27T20:32:14+10:00",
            "isPremium": true,
            "club": [
                500002,
                500012
            ]
        },
        {
            "id": "BkOWllNDE6vq9vV0sj9Tynk8rqB6TaBB",
            "contentId": 858067,
            "title": "Rd 16: GOAL Johnathan Thurston (66th min)",
            "description": "Johnathan Thurston converts the James Tamou try",
            "publishDate": "2016-06-27T20:26:00+10:00",
            "publisher": "NRL Chief",
            "thumbnailUrl": "http://bigpondvideo.com/web/images/content/20160627202757a_89x50.jpg",
            "largeThumbnailUrl": "http://bigpondvideo.com/web/images/content/20160627202757a_326x184.jpg",
            "programType": "Instant Replay",
            "programCategory": "Score",
            "priority": null,
            "lastUpdateDate": "2016-06-27T20:31:14+10:00",
            "isPremium": true,
            "club": [
                500002,
                500012
            ]
        },
        {
            "id": "15OGllNDE6XcSlW_HDeZNaak28l6dsJr",
            "contentId": 858066,
            "title": "Rd 16: TRY James Tamou (65th min)",
            "description": "James Tamou scores a try for the Cowboys",
            "publishDate": "2016-06-27T20:25:00+10:00",
            "publisher": "NRL Chief",
            "thumbnailUrl": "http://bigpondvideo.com/web/images/content/20160627202629a_89x50.jpg",
            "largeThumbnailUrl": "http://bigpondvideo.com/web/images/content/20160627202629a_326x184.jpg",
            "programType": "Instant Replay",
            "programCategory": "Score",
            "priority": null,
            "lastUpdateDate": "2016-06-27T20:29:13+10:00",
            "isPremium": true,
            "club": [
                500002,
                500012
            ]
        },
        {
            "id": "1nOGllNDE6GUuHXEr0XFv6mWVDOFIX_r",
            "contentId": 858065,
            "title": "Rd 16: GOAL Jamie Lyon (61st min)",
            "description": "Jamie Lyon converts the Addin Fonua-Blake try",
            "publishDate": "2016-06-27T20:18:00+10:00",
            "publisher": "NRL Chief",
            "thumbnailUrl": "http://bigpondvideo.com/web/images/content/20160627202321a_89x50.jpg",
            "largeThumbnailUrl": "http://bigpondvideo.com/web/images/content/20160627202321a_326x184.jpg",
            "programType": "Instant Replay",
            "programCategory": "Score",
            "priority": null,
            "lastUpdateDate": "2016-06-27T20:27:13+10:00",
            "isPremium": true,
            "club": [
                500002,
                500012
            ]
        },
        {
            "id": "ZxNmllNDE63AT3qzz32k-fMk1y8cPISB",
            "contentId": 858064,
            "title": "Rd 16: TRY Addin Fonua-Blake (59th min)",
            "description": "Addin Fonua-Blake scores a try for the Sea Eagles",
            "publishDate": "2016-06-27T20:16:00+10:00",
            "publisher": "NRL Chief",
            "thumbnailUrl": "http://bigpondvideo.com/web/images/content/20160627202119a_89x50.jpg",
            "largeThumbnailUrl": "http://bigpondvideo.com/web/images/content/20160627202119a_326x184.jpg",
            "programType": "Instant Replay",
            "programCategory": "Score",
            "priority": null,
            "lastUpdateDate": "2016-06-27T20:24:12+10:00",
            "isPremium": true,
            "club": [
                500002,
                500012
            ]
        },
        {
            "id": "91NGllNDE6OOaErcGzxuA_6OgabXN3XT",
            "contentId": 858063,
            "title": "Rd 16: GOAL Jamie Lyon (55th min)",
            "description": "Jamie Lyon converts the Addin Fonua-Blake try",
            "publishDate": "2016-06-27T20:13:00+10:00",
            "publisher": "NRL Chief",
            "thumbnailUrl": "http://bigpondvideo.com/web/images/content/20160627201728a_89x50.jpg",
            "largeThumbnailUrl": "http://bigpondvideo.com/web/images/content/20160627201728a_326x184.jpg",
            "programType": "Instant Replay",
            "programCategory": "Score",
            "priority": null,
            "lastUpdateDate": "2016-06-27T20:20:11+10:00",
            "isPremium": true,
            "club": [
                500002,
                500012
            ]
        },
        {
            "id": "M4NGllNDE6aVLE9xGF5Ugbox355kaGtw",
            "contentId": 858062,
            "title": "Rd 16: TRY Addin Fonua-Blake (54th min)",
            "description": "Addin Fonua-Blake scores a try for the Sea Eagles",
            "publishDate": "2016-06-27T20:12:00+10:00",
            "publisher": "NRL Chief",
            "thumbnailUrl": "http://bigpondvideo.com/web/images/content/20160627201542a_89x50.jpg",
            "largeThumbnailUrl": "http://bigpondvideo.com/web/images/content/20160627201542a_326x184.jpg",
            "programType": "Instant Replay",
            "programCategory": "Score",
            "priority": null,
            "lastUpdateDate": "2016-06-27T20:19:10+10:00",
            "isPremium": true,
            "club": [
                500002,
                500012
            ]
        },
        {
            "id": "h5MGllNDE6fg37ma8wG82Hu6Q8tpXrlY",
            "contentId": 858061,
            "title": "Rd 16: GOAL Jamie Lyon (47th min)",
            "description": "Jamie Lyon converts the Lachlan Coote try",
            "publishDate": "2016-06-27T20:07:00+10:00",
            "publisher": "NRL Chief",
            "thumbnailUrl": "http://bigpondvideo.com/web/images/content/20160627200902a_89x50.jpg",
            "largeThumbnailUrl": "http://bigpondvideo.com/web/images/content/20160627200902a_326x184.jpg",
            "programType": "Instant Replay",
            "programCategory": "Score",
            "priority": null,
            "lastUpdateDate": "2016-06-27T20:12:08+10:00",
            "isPremium": true,
            "club": [
                500002,
                500012
            ]
        },
        {
            "id": "dxMGllNDE6XaG0ofbFpDBVjEMbbapinx",
            "contentId": 858060,
            "title": "Rd 16: TRY Siosaia Vave (46th min)",
            "description": "Siosaia Vave scores a try for the Sea Eagles",
            "publishDate": "2016-06-27T20:06:00+10:00",
            "publisher": "NRL Chief",
            "thumbnailUrl": "http://bigpondvideo.com/web/images/content/20160627200818a_89x50.jpg",
            "largeThumbnailUrl": "http://bigpondvideo.com/web/images/content/20160627200818a_326x184.jpg",
            "programType": "Instant Replay",
            "programCategory": "Score",
            "priority": null,
            "lastUpdateDate": "2016-06-27T20:11:08+10:00",
            "isPremium": true,
            "club": [
                500002,
                500012
            ]
        },
        {
            "id": "BpcGhlNDE6YaH7DOe5iG9RMMUTQqPjUk",
            "contentId": 858059,
            "title": "Rd 16: GOAL Johnathan Thurston (38th min)",
            "description": "Johnathan Thurston converts the Lachlan Coote",
            "publishDate": "2016-06-27T19:41:00+10:00",
            "publisher": "NRL Chief",
            "thumbnailUrl": "http://bigpondvideo.com/web/images/content/20160627194342a_89x50.jpg",
            "largeThumbnailUrl": "http://bigpondvideo.com/web/images/content/20160627194342a_326x184.jpg",
            "programType": "Instant Replay",
            "programCategory": "Score",
            "priority": null,
            "lastUpdateDate": "2016-06-27T19:47:03+10:00",
            "isPremium": true,
            "club": [
                500002,
                500012
            ]
        },
        {
            "id": "90b2hlNDE6sSupoVWJ2SfeJQZfGRArYM",
            "contentId": 858058,
            "title": "Rd 16: TRY Lachlan Coote (37th min)",
            "description": "Lachlan Coote scores a try for the Cowboys",
            "publishDate": "2016-06-27T19:39:00+10:00",
            "publisher": "NRL Chief",
            "thumbnailUrl": "http://bigpondvideo.com/web/images/content/20160627194240a_89x50.jpg",
            "largeThumbnailUrl": "http://bigpondvideo.com/web/images/content/20160627194240a_326x184.jpg",
            "programType": "Instant Replay",
            "programCategory": "Score",
            "priority": null,
            "lastUpdateDate": "2016-06-27T19:46:03+10:00",
            "isPremium": true,
            "club": [
                500002,
                500012
            ]
        },
        {
            "id": "B4bWhlNDE6ML6JQDuVCCVhY_v2uSrz86",
            "contentId": 858057,
            "title": "Rd 16: GOAL Johnathan Thurston (32nd min)",
            "description": "Johnathan Thurston converts the Antonio Winterstein",
            "publishDate": "2016-06-27T19:33:00+10:00",
            "publisher": "NRL Chief",
            "thumbnailUrl": "http://bigpondvideo.com/web/images/content/20160627193655a_89x50.jpg",
            "largeThumbnailUrl": "http://bigpondvideo.com/web/images/content/20160627193655a_326x184.jpg",
            "programType": "Instant Replay",
            "programCategory": "Score",
            "priority": null,
            "lastUpdateDate": "2016-06-27T19:40:01+10:00",
            "isPremium": true,
            "club": [
                500002,
                500012
            ]
        },
        {
            "id": "dsbWhlNDE6r3_f2uVrnkmPDORnLA-_iz",
            "contentId": 858056,
            "title": "Rd 16: TRY Antonio Winterstein (30th min)",
            "description": "Antonio Winterstein scores a try for the Cowboys",
            "publishDate": "2016-06-27T19:32:00+10:00",
            "publisher": "NRL Chief",
            "thumbnailUrl": "http://bigpondvideo.com/web/images/content/20160627193540a_89x50.jpg",
            "largeThumbnailUrl": "http://bigpondvideo.com/web/images/content/20160627193540a_326x184.jpg",
            "programType": "Instant Replay",
            "programCategory": "Score",
            "priority": null,
            "lastUpdateDate": "2016-06-27T19:39:01+10:00",
            "isPremium": true,
            "club": [
                500002,
                500012
            ]
        },
        {
            "id": "5ka2hlNDE6xfJnmq5B9pV5XkiqTs1wD0",
            "contentId": 858055,
            "title": "Rd 16: TRY Daly Cherry-Evans (23rd min)",
            "description": "Daly Cherry-Evans scores a try for the Sea Eagles",
            "publishDate": "2016-06-27T19:26:00+10:00",
            "publisher": "NRL Chief",
            "thumbnailUrl": "http://bigpondvideo.com/web/images/content/20160627192826a_89x50.jpg",
            "largeThumbnailUrl": "http://bigpondvideo.com/web/images/content/20160627192826a_326x184.jpg",
            "programType": "Instant Replay",
            "programCategory": "Score",
            "priority": null,
            "lastUpdateDate": "2016-06-27T19:31:59+10:00",
            "isPremium": true,
            "club": [
                500002,
                500012
            ]
        },
        {
            "id": "l0Z2hlNDE6hekvYDmrsr3fuNTIut_8Pd",
            "contentId": 858054,
            "title": "Rd 16: GOAL Johnathan Thurston (12th min)",
            "description": "Johnathan Thurston converts the Jason Taumalolo",
            "publishDate": "2016-06-27T19:13:00+10:00",
            "publisher": "NRL Chief",
            "thumbnailUrl": "http://bigpondvideo.com/web/images/content/20160627191733a_89x50.jpg",
            "largeThumbnailUrl": "http://bigpondvideo.com/web/images/content/20160627191733a_326x184.jpg",
            "programType": "Instant Replay",
            "programCategory": "Score",
            "priority": null,
            "lastUpdateDate": "2016-06-27T19:20:56+10:00",
            "isPremium": true,
            "club": [
                500002,
                500012
            ]
        },
        {
            "id": "lqZ2hlNDE6g8pb4qlzYIkbX5TbyZIJuF",
            "contentId": 858053,
            "title": "Rd 16: TRY Jason Taumalolo (11th min)",
            "description": "Jason Taumalolo scores a try for the Cowboys",
            "publishDate": "2016-06-27T19:12:00+10:00",
            "publisher": "NRL Chief",
            "thumbnailUrl": "http://bigpondvideo.com/web/images/content/20160627191553a_89x50.jpg",
            "largeThumbnailUrl": "http://bigpondvideo.com/web/images/content/20160627191553a_326x184.jpg",
            "programType": "Instant Replay",
            "programCategory": "Score",
            "priority": null,
            "lastUpdateDate": "2016-06-27T19:18:56+10:00",
            "isPremium": true,
            "club": [
                500002,
                500012
            ]
        }
    ],
    "scores": [
        {
            "gameState": "First Half",
            "gameStateId": 3,
            "gameTime": "0:10:16",
            "gameSeconds": 616,
            "GameMinutes": "10:16",
            "playerId": 500301,
            "playerName": "Jason Taumalolo",
            "scoreMethod": "Try",
            "statEvent": "Try",
            "statId": 38,
            "statValue": 4,
            "vidRef": 16746,
            "homeScore": 4,
            "commentary": "Try by Jason Taumalolo",
            "tackleNum": 4,
            "teamId": 500012,
            "teamName": "North Queensland Cowboys",
            "homeTeamAbbrv": "NQL",
            "awayTeamAbbrv": "MAN"
        },
        {
            "gameState": "First Half",
            "gameStateId": 3,
            "gameTime": "0:11:39",
            "gameSeconds": 699,
            "GameMinutes": "11:39",
            "playerId": 500304,
            "playerName": "Johnathan Thurston",
            "scoreMethod": "Conversion",
            "statEvent": "Conversion-Made",
            "statId": 1,
            "statValue": 2,
            "vidRef": 18828,
            "homeScore": 6,
            "commentary": "Conversion-Made by Johnathan Thurston",
            "tackleNum": -1,
            "teamId": 500012,
            "teamName": "North Queensland Cowboys",
            "homeTeamAbbrv": "NQL",
            "awayTeamAbbrv": "MAN"
        },
        {
            "gameState": "First Half",
            "gameStateId": 3,
            "gameTime": "0:29:26",
            "gameSeconds": 1766,
            "GameMinutes": "29:26",
            "playerId": 500305,
            "playerName": "Antonio Winterstein",
            "scoreMethod": "Try",
            "statEvent": "Try",
            "statId": 38,
            "statValue": 4,
            "vidRef": 45924,
            "homeScore": 10,
            "awayScore": 4,
            "commentary": "Try by Antonio Winterstein",
            "tackleNum": 5,
            "teamId": 500012,
            "teamName": "North Queensland Cowboys",
            "homeTeamAbbrv": "NQL",
            "awayTeamAbbrv": "MAN"
        },
        {
            "gameState": "First Half",
            "gameStateId": 3,
            "gameTime": "0:31:14",
            "gameSeconds": 1874,
            "GameMinutes": "31:14",
            "playerId": 500304,
            "playerName": "Johnathan Thurston",
            "scoreMethod": "Conversion",
            "statEvent": "Conversion-Made",
            "statId": 1,
            "statValue": 2,
            "vidRef": 48631,
            "homeScore": 12,
            "awayScore": 4,
            "commentary": "Conversion-Made by Johnathan Thurston",
            "tackleNum": -1,
            "teamId": 500012,
            "teamName": "North Queensland Cowboys",
            "homeTeamAbbrv": "NQL",
            "awayTeamAbbrv": "MAN"
        },
        {
            "gameState": "First Half",
            "gameStateId": 3,
            "gameTime": "0:36:35",
            "gameSeconds": 2195,
            "GameMinutes": "36:35",
            "playerId": 500281,
            "playerName": "Lachlan Coote",
            "scoreMethod": "Try",
            "statEvent": "Try",
            "statId": 38,
            "statValue": 4,
            "vidRef": 56661,
            "homeScore": 16,
            "awayScore": 4,
            "commentary": "Try by Lachlan Coote",
            "tackleNum": 6,
            "teamId": 500012,
            "teamName": "North Queensland Cowboys",
            "homeTeamAbbrv": "NQL",
            "awayTeamAbbrv": "MAN"
        },
        {
            "gameState": "First Half",
            "gameStateId": 3,
            "gameTime": "0:37:45",
            "gameSeconds": 2265,
            "GameMinutes": "37:45",
            "playerId": 500304,
            "playerName": "Johnathan Thurston",
            "scoreMethod": "Conversion",
            "statEvent": "Conversion-Made",
            "statId": 1,
            "statValue": 2,
            "vidRef": 58400,
            "homeScore": 18,
            "awayScore": 4,
            "commentary": "Conversion-Made by Johnathan Thurston",
            "tackleNum": -1,
            "teamId": 500012,
            "teamName": "North Queensland Cowboys",
            "homeTeamAbbrv": "NQL",
            "awayTeamAbbrv": "MAN"
        },
        {
            "gameState": "Second Half",
            "gameStateId": 5,
            "gameTime": "1:04:29",
            "gameSeconds": 3869,
            "GameMinutes": "64:29",
            "playerId": 500299,
            "playerName": "James Tamou",
            "scoreMethod": "Try",
            "statEvent": "Try",
            "statId": 38,
            "statValue": 4,
            "vidRef": 100925,
            "homeScore": 22,
            "awayScore": 22,
            "commentary": "Try by James Tamou",
            "teamId": 500012,
            "teamName": "North Queensland Cowboys",
            "homeTeamAbbrv": "NQL",
            "awayTeamAbbrv": "MAN"
        },
        {
            "gameState": "Second Half",
            "gameStateId": 5,
            "gameTime": "1:05:30",
            "gameSeconds": 3930,
            "GameMinutes": "65:30",
            "playerId": 500304,
            "playerName": "Johnathan Thurston",
            "scoreMethod": "Conversion",
            "statEvent": "Conversion-Made",
            "statId": 1,
            "statValue": 2,
            "vidRef": 102438,
            "homeScore": 24,
            "awayScore": 22,
            "commentary": "Conversion-Made by Johnathan Thurston",
            "tackleNum": -1,
            "teamId": 500012,
            "teamName": "North Queensland Cowboys",
            "homeTeamAbbrv": "NQL",
            "awayTeamAbbrv": "MAN"
        },
        {
            "gameState": "Second Half",
            "gameStateId": 5,
            "gameTime": "1:07:07",
            "gameSeconds": 4027,
            "GameMinutes": "67:07",
            "playerId": 500301,
            "playerName": "Jason Taumalolo",
            "scoreMethod": "Try",
            "statEvent": "Try",
            "statId": 38,
            "statValue": 4,
            "vidRef": 104878,
            "homeScore": 28,
            "awayScore": 22,
            "commentary": "Try by Jason Taumalolo",
            "tackleNum": 5,
            "teamId": 500012,
            "teamName": "North Queensland Cowboys",
            "homeTeamAbbrv": "NQL",
            "awayTeamAbbrv": "MAN"
        },
        {
            "gameState": "Second Half",
            "gameStateId": 5,
            "gameTime": "1:08:30",
            "gameSeconds": 4110,
            "GameMinutes": "68:30",
            "playerId": 500304,
            "playerName": "Johnathan Thurston",
            "scoreMethod": "Conversion",
            "statEvent": "Conversion-Made",
            "statId": 1,
            "statValue": 2,
            "vidRef": 106938,
            "homeScore": 30,
            "awayScore": 22,
            "commentary": "Conversion-Made by Johnathan Thurston",
            "tackleNum": -1,
            "teamId": 500012,
            "teamName": "North Queensland Cowboys",
            "homeTeamAbbrv": "NQL",
            "awayTeamAbbrv": "MAN"
        },
        {
            "gameState": "First Half",
            "gameStateId": 3,
            "gameTime": "0:22:59",
            "gameSeconds": 1379,
            "GameMinutes": "22:59",
            "playerId": 500024,
            "playerName": "Daly Cherry-Evans",
            "scoreMethod": "Try",
            "statEvent": "Try",
            "statId": 38,
            "statValue": 4,
            "vidRef": 35832,
            "homeScore": 6,
            "awayScore": 4,
            "commentary": "Try by Daly Cherry-Evans",
            "tackleNum": 3,
            "teamId": 500002,
            "teamName": "Manly-Warringah Sea Eagles",
            "homeTeamAbbrv": "NQL",
            "awayTeamAbbrv": "MAN"
        },
        {
            "gameState": "Second Half",
            "gameStateId": 5,
            "gameTime": "0:45:17",
            "gameSeconds": 2717,
            "GameMinutes": "45:17",
            "playerId": 501337,
            "playerName": "Siosaia Vave",
            "scoreMethod": "Try",
            "statEvent": "Try",
            "statId": 38,
            "statValue": 4,
            "vidRef": 72118,
            "homeScore": 18,
            "awayScore": 8,
            "commentary": "Try by Siosaia Vave",
            "tackleNum": 4,
            "teamId": 500002,
            "teamName": "Manly-Warringah Sea Eagles",
            "homeTeamAbbrv": "NQL",
            "awayTeamAbbrv": "MAN"
        },
        {
            "gameState": "Second Half",
            "gameStateId": 5,
            "gameTime": "0:46:29",
            "gameSeconds": 2789,
            "GameMinutes": "46:29",
            "playerId": 500020,
            "playerName": "Jamie Lyon",
            "scoreMethod": "Conversion",
            "statEvent": "Conversion-Made",
            "statId": 1,
            "statValue": 2,
            "vidRef": 73917,
            "homeScore": 18,
            "awayScore": 10,
            "commentary": "Conversion-Made by Jamie Lyon",
            "tackleNum": -1,
            "teamId": 500002,
            "teamName": "Manly-Warringah Sea Eagles",
            "homeTeamAbbrv": "NQL",
            "awayTeamAbbrv": "MAN"
        },
        {
            "gameState": "Second Half",
            "gameStateId": 5,
            "gameTime": "0:53:35",
            "gameSeconds": 3215,
            "GameMinutes": "53:35",
            "playerId": 500449,
            "playerName": "Addin Fonua-Blake",
            "scoreMethod": "Try",
            "statEvent": "Try",
            "statId": 38,
            "statValue": 4,
            "vidRef": 84562,
            "homeScore": 18,
            "awayScore": 14,
            "commentary": "Try by Addin Fonua-Blake",
            "tackleNum": 3,
            "teamId": 500002,
            "teamName": "Manly-Warringah Sea Eagles",
            "homeTeamAbbrv": "NQL",
            "awayTeamAbbrv": "MAN"
        },
        {
            "gameState": "Second Half",
            "gameStateId": 5,
            "gameTime": "0:54:50",
            "gameSeconds": 3290,
            "GameMinutes": "54:50",
            "playerId": 500020,
            "playerName": "Jamie Lyon",
            "scoreMethod": "Conversion",
            "statEvent": "Conversion-Made",
            "statId": 1,
            "statValue": 2,
            "vidRef": 86441,
            "homeScore": 18,
            "awayScore": 16,
            "commentary": "Conversion-Made by Jamie Lyon",
            "tackleNum": -1,
            "teamId": 500002,
            "teamName": "Manly-Warringah Sea Eagles",
            "homeTeamAbbrv": "NQL",
            "awayTeamAbbrv": "MAN"
        },
        {
            "gameState": "Second Half",
            "gameStateId": 5,
            "gameTime": "0:58:45",
            "gameSeconds": 3525,
            "GameMinutes": "58:45",
            "playerId": 500449,
            "playerName": "Addin Fonua-Blake",
            "scoreMethod": "Try",
            "statEvent": "Try",
            "statId": 38,
            "statValue": 4,
            "vidRef": 92328,
            "homeScore": 18,
            "awayScore": 20,
            "commentary": "Try by Addin Fonua-Blake",
            "tackleNum": 5,
            "teamId": 500002,
            "teamName": "Manly-Warringah Sea Eagles",
            "homeTeamAbbrv": "NQL",
            "awayTeamAbbrv": "MAN"
        },
        {
            "gameState": "Second Half",
            "gameStateId": 5,
            "gameTime": "1:00:10",
            "gameSeconds": 3610,
            "GameMinutes": "60:10",
            "playerId": 500020,
            "playerName": "Jamie Lyon",
            "scoreMethod": "Conversion",
            "statEvent": "Conversion-Made",
            "statId": 1,
            "statValue": 2,
            "vidRef": 94437,
            "homeScore": 18,
            "awayScore": 22,
            "commentary": "Conversion-Made by Jamie Lyon",
            "tackleNum": -1,
            "teamId": 500002,
            "teamName": "Manly-Warringah Sea Eagles",
            "homeTeamAbbrv": "NQL",
            "awayTeamAbbrv": "MAN"
        },
        {
            "gameState": "Second Half",
            "gameStateId": 5,
            "gameTime": "1:14:29",
            "gameSeconds": 4469,
            "GameMinutes": "74:29",
            "playerId": 500341,
            "playerName": "Lewis Brown",
            "scoreMethod": "Try",
            "statEvent": "Try",
            "statId": 38,
            "statValue": 4,
            "vidRef": 117571,
            "homeScore": 30,
            "awayScore": 26,
            "commentary": "Try by Lewis Brown",
            "tackleNum": 6,
            "teamId": 500002,
            "teamName": "Manly-Warringah Sea Eagles",
            "homeTeamAbbrv": "NQL",
            "awayTeamAbbrv": "MAN"
        }
    ]
}