{
    "vod": [
        {
            "id": "hqZmRwYjE6CgBa_ISZhr8CG2cZ7AUjlx",
            "contentId": 920845,
            "title": "Rd 16: Sharks v Sea Eagles (Hls)",
            "description": "Highlights of the big Round 16 clash between the Sharks & Sea Eagles",
            "publishDate": "2017-06-25T18:12:35+10:00",
            "publisher": "NRL Chief",
            "thumbnailUrl": "http://bpvideos.telstra.insnw.net/web/images/20170625181325a_89x50.jpg",
            "largeThumbnailUrl": "http://bpvideos.telstra.insnw.net/web/images/20170625181325a_326x184.jpg",
            "programType": "Highlights",
            "programCategory": "Match",
            "priority": null,
            "lastUpdateDate": "2017-06-25T18:18:22+10:00",
            "isPremium": false,
            "club": [
                500028,
                500002
            ]
        },
        {
            "id": "BweGRwYjE6JsPJI1mq6A-z-xTNFwwIlp",
            "contentId": 920265,
            "title": "Rd 16 Press Conference: Sharks",
            "description": "Sharks coach Shane Flanagan speaks with the media following their Round 16 clash",
            "publishDate": "2017-06-25T18:45:40+10:00",
            "publisher": "NRL Chief",
            "thumbnailUrl": "http://bpvideos.telstra.insnw.net/web/images/20170625184536a_89x50.jpg",
            "largeThumbnailUrl": "http://bpvideos.telstra.insnw.net/web/images/20170625184536a_326x184.jpg",
            "programType": "Press Conference",
            "programCategory": null,
            "priority": null,
            "lastUpdateDate": "2017-06-25T18:50:30+10:00",
            "isPremium": false,
            "club": [
                500028,
                500002
            ]
        },
        {
            "id": "RwdmRwYjE6qtjmmK9u1ovnoGn5yLRegs",
            "contentId": 920264,
            "title": "Rd 16 Press Conference: Sea Eagles",
            "description": "Sea Eagles coach Trent Barrett speaks with the media following their Round 16 clash",
            "publishDate": "2017-06-25T18:36:00+10:00",
            "publisher": "NRL Chief",
            "thumbnailUrl": "http://bpvideos.telstra.insnw.net/web/images/20170625183639a_89x50.jpg",
            "largeThumbnailUrl": "http://bpvideos.telstra.insnw.net/web/images/20170625183639a_326x184.jpg",
            "programType": "Press Conference",
            "programCategory": null,
            "priority": null,
            "lastUpdateDate": "2017-06-25T18:42:27+10:00",
            "isPremium": false,
            "club": [
                500028,
                500002
            ]
        },
        {
            "id": "lpOGRwYjE6ZdM-8I-AOE04O9s8pz2A0y",
            "contentId": 920837,
            "title": "Rd 16: TRY Dylan Walker (77th min)",
            "description": "Dylan Walker scores late to seal a Manly victory",
            "publishDate": "2017-06-25T17:51:25+10:00",
            "publisher": "NRL Chief",
            "thumbnailUrl": "http://bpvideos.telstra.insnw.net/web/images/20170625175123a_89x50.jpg",
            "largeThumbnailUrl": "http://bpvideos.telstra.insnw.net/web/images/20170625175123a_326x184.jpg",
            "programType": "Instant Replay",
            "programCategory": "Score",
            "priority": 10,
            "lastUpdateDate": "2017-06-25T17:56:17+10:00",
            "isPremium": true,
            "club": [
                500028,
                500002
            ]
        },
        {
            "id": "t0N2RwYjE6VzgUQ3XvhK2sYK06-0RA8c",
            "contentId": 920833,
            "title": "Rd 16: TRY Wade Graham (73rd min)",
            "description": "Wade Graham scores to give the Sharks a glimmer of hope",
            "publishDate": "2017-06-25T17:47:37+10:00",
            "publisher": "NRL Chief",
            "thumbnailUrl": "http://bpvideos.telstra.insnw.net/web/images/20170625174735a_89x50.jpg",
            "largeThumbnailUrl": "http://bpvideos.telstra.insnw.net/web/images/20170625174735a_326x184.jpg",
            "programType": "Instant Replay",
            "programCategory": "Score",
            "priority": 9,
            "lastUpdateDate": "2017-06-25T17:56:17+10:00",
            "isPremium": true,
            "club": [
                500028,
                500002
            ]
        },
        {
            "id": "FhNGRwYjE6If2TvEpGJcUH2oY5ON2QoY",
            "contentId": 920830,
            "title": "Rd 16: GOAL Matthew Wright (65th min)",
            "description": "Matthew Wright converts the try of Blake Green",
            "publishDate": "2017-06-25T17:37:07+10:00",
            "publisher": "NRL Chief",
            "thumbnailUrl": "http://bpvideos.telstra.insnw.net/web/images/20170625173717a_89x50.jpg",
            "largeThumbnailUrl": "http://bpvideos.telstra.insnw.net/web/images/20170625173717a_326x184.jpg",
            "programType": "Instant Replay",
            "programCategory": "Score",
            "priority": null,
            "lastUpdateDate": "2017-06-25T17:41:13+10:00",
            "isPremium": true,
            "club": [
                500028,
                500002
            ]
        },
        {
            "id": "tlNGRwYjE6GNCVzCr-ud75EApN3ztOXs",
            "contentId": 920829,
            "title": "Rd 16: TRY Blake Green (63rd min)",
            "description": "Blake Green scores to increase Manly's lead",
            "publishDate": "2017-06-25T17:36:55+10:00",
            "publisher": "NRL Chief",
            "thumbnailUrl": "http://bpvideos.telstra.insnw.net/web/images/20170625173556a_89x50.jpg",
            "largeThumbnailUrl": "http://bpvideos.telstra.insnw.net/web/images/20170625173556a_326x184.jpg",
            "programType": "Instant Replay",
            "programCategory": "Score",
            "priority": 8,
            "lastUpdateDate": "2017-06-25T17:56:17+10:00",
            "isPremium": true,
            "club": [
                500028,
                500002
            ]
        },
        {
            "id": "VtMmRwYjE635_wIFfSBnizSTtTCfG0uE",
            "contentId": 920822,
            "title": "Rd 16: GOAL Matthew Wright (55th min)",
            "description": "Matthew Wright converts his second try",
            "publishDate": "2017-06-25T17:28:47+10:00",
            "publisher": "NRL Chief",
            "thumbnailUrl": "http://bpvideos.telstra.insnw.net/web/images/20170625172829a_89x50.jpg",
            "largeThumbnailUrl": "http://bpvideos.telstra.insnw.net/web/images/20170625172829a_326x184.jpg",
            "programType": "Instant Replay",
            "programCategory": "Score",
            "priority": null,
            "lastUpdateDate": "2017-06-25T17:32:11+10:00",
            "isPremium": true,
            "club": [
                500028,
                500002
            ]
        },
        {
            "id": "8zM2RwYjE6GzykVvc0TfrT2r-fjOwU9U",
            "contentId": 920821,
            "title": "Rd 16: TRY Matthew Wright (54th min)",
            "description": "Matthew Wright scores his second try of the afternoon",
            "publishDate": "2017-06-25T17:28:22+10:00",
            "publisher": "NRL Chief",
            "thumbnailUrl": "http://bpvideos.telstra.insnw.net/web/images/20170625172615a_89x50.jpg",
            "largeThumbnailUrl": "http://bpvideos.telstra.insnw.net/web/images/20170625172615a_326x184.jpg",
            "programType": "Instant Replay",
            "programCategory": "Score",
            "priority": 7,
            "lastUpdateDate": "2017-06-25T17:56:17+10:00",
            "isPremium": true,
            "club": [
                500028,
                500002
            ]
        },
        {
            "id": "xhdmNwYjE6ekyYb-kSZlw-CBjkeTKHtO",
            "contentId": 920801,
            "title": "Rd 16: FIELD GOAL Daly Cherry-Evans (40th min)",
            "description": "Manly's captain sends the visitors to the break up by seven points",
            "publishDate": "2017-06-25T16:58:44+10:00",
            "publisher": "NRL Chief",
            "thumbnailUrl": "http://bpvideos.telstra.insnw.net/web/images/20170625165825a_89x50.jpg",
            "largeThumbnailUrl": "http://bpvideos.telstra.insnw.net/web/images/20170625165825a_326x184.jpg",
            "programType": "Instant Replay",
            "programCategory": "Score",
            "priority": 6,
            "lastUpdateDate": "2017-06-25T17:55:16+10:00",
            "isPremium": true,
            "club": [
                500028,
                500002
            ]
        },
        {
            "id": "dsdWNwYjE61F5cO9NPvOpLYMaPUD1xyn",
            "contentId": 920799,
            "title": "Rd 16: GOAL James Maloney (36th min)",
            "description": "James Maloney converts from out wide",
            "publishDate": "2017-06-25T16:54:03+10:00",
            "publisher": "NRL Chief",
            "thumbnailUrl": "http://bpvideos.telstra.insnw.net/web/images/20170625165350a_89x50.jpg",
            "largeThumbnailUrl": "http://bpvideos.telstra.insnw.net/web/images/20170625165350a_326x184.jpg",
            "programType": "Instant Replay",
            "programCategory": "Score",
            "priority": null,
            "lastUpdateDate": "2017-06-25T16:58:04+10:00",
            "isPremium": true,
            "club": [
                500028,
                500002
            ]
        },
        {
            "id": "l5dGNwYjE67RiMCEJnCfgccq_SkOEq5h",
            "contentId": 920798,
            "title": "Rd 16: TRY Sosaia Feki (35th min)",
            "description": "Sosais Feki scores the Sharks' second try",
            "publishDate": "2017-06-25T16:52:20+10:00",
            "publisher": "NRL Chief",
            "thumbnailUrl": "http://bpvideos.telstra.insnw.net/web/images/20170625165205a_89x50.jpg",
            "largeThumbnailUrl": "http://bpvideos.telstra.insnw.net/web/images/20170625165205a_326x184.jpg",
            "programType": "Instant Replay",
            "programCategory": "Score",
            "priority": 5,
            "lastUpdateDate": "2017-06-25T17:55:16+10:00",
            "isPremium": true,
            "club": [
                500028,
                500002
            ]
        },
        {
            "id": "k4dGNwYjE653VAF6u8avrKHIa9B6DMvU",
            "contentId": 920796,
            "title": "Rd 16: GOAL James Maloney (31st min)",
            "description": "James Maloney converts the try of Luke Lewis",
            "publishDate": "2017-06-25T16:49:04+10:00",
            "publisher": "NRL Chief",
            "thumbnailUrl": "http://bpvideos.telstra.insnw.net/web/images/20170625164902a_89x50.jpg",
            "largeThumbnailUrl": "http://bpvideos.telstra.insnw.net/web/images/20170625164902a_326x184.jpg",
            "programType": "Instant Replay",
            "programCategory": "Score",
            "priority": null,
            "lastUpdateDate": "2017-06-25T16:53:02+10:00",
            "isPremium": true,
            "club": [
                500028,
                500002
            ]
        },
        {
            "id": "M0dGNwYjE6l4zCrNQ0A_TUnB-axMH7-n",
            "contentId": 920793,
            "title": "Rd 16: TRY Luke Lewis (30th min)",
            "description": "Luke Lewis turns back the clock to score the Sharks' first",
            "publishDate": "2017-06-25T16:47:31+10:00",
            "publisher": "NRL Chief",
            "thumbnailUrl": "http://bpvideos.telstra.insnw.net/web/images/20170625164738a_89x50.jpg",
            "largeThumbnailUrl": "http://bpvideos.telstra.insnw.net/web/images/20170625164738a_326x184.jpg",
            "programType": "Instant Replay",
            "programCategory": "Score",
            "priority": 4,
            "lastUpdateDate": "2017-06-25T17:55:16+10:00",
            "isPremium": true,
            "club": [
                500028,
                500002
            ]
        },
        {
            "id": "1mc2NwYjE6bh9t1qCCp1BWJ6_SQPsnhP",
            "contentId": 920791,
            "title": "Rd 16: GOAL Matthew Wright (24th min)",
            "description": "Matthew Wright converts the try of Curtis Sironen",
            "publishDate": "2017-06-25T16:43:07+10:00",
            "publisher": "NRL Chief",
            "thumbnailUrl": "http://bpvideos.telstra.insnw.net/web/images/20170625164206a_89x50.jpg",
            "largeThumbnailUrl": "http://bpvideos.telstra.insnw.net/web/images/20170625164206a_326x184.jpg",
            "programType": "Instant Replay",
            "programCategory": "Score",
            "priority": null,
            "lastUpdateDate": "2017-06-25T16:47:01+10:00",
            "isPremium": true,
            "club": [
                500028,
                500002
            ]
        },
        {
            "id": "oxc2NwYjE6Ecn2VZfxjRIhXhGFjPBqgb",
            "contentId": 920790,
            "title": "Rd 16: TRY Curtis Sironen (23rd min)",
            "description": "Curtis Sironen crosses for his second try",
            "publishDate": "2017-06-25T16:41:07+10:00",
            "publisher": "NRL Chief",
            "thumbnailUrl": "http://bpvideos.telstra.insnw.net/web/images/20170625164032a_89x50.jpg",
            "largeThumbnailUrl": "http://bpvideos.telstra.insnw.net/web/images/20170625164032a_326x184.jpg",
            "programType": "Instant Replay",
            "programCategory": "Score",
            "priority": 3,
            "lastUpdateDate": "2017-06-25T17:55:16+10:00",
            "isPremium": true,
            "club": [
                500028,
                500002
            ]
        },
        {
            "id": "50cWNwYjE6dy4ceDDKyI7BlBy1uC9R-Z",
            "contentId": 920789,
            "title": "Rd 16: GOAL Matthew Wright (21st min)",
            "description": "Matthew Wright converts his own try from the touchline",
            "publishDate": "2017-06-25T16:37:40+10:00",
            "publisher": "NRL Chief",
            "thumbnailUrl": "http://bpvideos.telstra.insnw.net/web/images/20170625163706a_89x50.jpg",
            "largeThumbnailUrl": "http://bpvideos.telstra.insnw.net/web/images/20170625163706a_326x184.jpg",
            "programType": "Instant Replay",
            "programCategory": "Score",
            "priority": null,
            "lastUpdateDate": "2017-06-25T16:42:00+10:00",
            "isPremium": true,
            "club": [
                500028,
                500002
            ]
        },
        {
            "id": "g5cWNwYjE6x6U9FV6vOidy4VV9ph_yvl",
            "contentId": 920788,
            "title": "Rd 16: TRY Matthew Wright (20th min)",
            "description": "Matthew Wright crosses for Manly's second try",
            "publishDate": "2017-06-25T16:35:39+10:00",
            "publisher": "NRL Chief",
            "thumbnailUrl": "http://bpvideos.telstra.insnw.net/web/images/20170625163546a_89x50.jpg",
            "largeThumbnailUrl": "http://bpvideos.telstra.insnw.net/web/images/20170625163546a_326x184.jpg",
            "programType": "Instant Replay",
            "programCategory": "Score",
            "priority": 2,
            "lastUpdateDate": "2017-06-25T17:55:16+10:00",
            "isPremium": true,
            "club": [
                500028,
                500002
            ]
        },
        {
            "id": "F0bWNwYjE6bDZEmnIlc3y77Qz7n-4GYK",
            "contentId": 920777,
            "title": "Rd 16: GOAL Matthew Wright (4th min)",
            "description": "Matthew Wright converts the try of Curtis Sironen",
            "publishDate": "2017-06-25T16:20:08+10:00",
            "publisher": "NRL Chief",
            "thumbnailUrl": "http://bpvideos.telstra.insnw.net/web/images/20170625161931a_89x50.jpg",
            "largeThumbnailUrl": "http://bpvideos.telstra.insnw.net/web/images/20170625161931a_326x184.jpg",
            "programType": "Instant Replay",
            "programCategory": "Score",
            "priority": null,
            "lastUpdateDate": "2017-06-25T16:23:56+10:00",
            "isPremium": true,
            "club": [
                500028,
                500002
            ]
        },
        {
            "id": "VmbWNwYjE62w7BE2Gu-Nv4Ra6H1Qg_Wf",
            "contentId": 920776,
            "title": "Rd 16: TRY Curtis Sironen (2nd min)",
            "description": "Curtis Sironen opens the scoring for the Sea Eagles against the Sharks",
            "publishDate": "2017-06-25T16:19:36+10:00",
            "publisher": "NRL Chief",
            "thumbnailUrl": "http://bpvideos.telstra.insnw.net/web/images/20170625161910a_89x50.jpg",
            "largeThumbnailUrl": "http://bpvideos.telstra.insnw.net/web/images/20170625161910a_326x184.jpg",
            "programType": "Instant Replay",
            "programCategory": "Score",
            "priority": 1,
            "lastUpdateDate": "2017-06-25T17:54:16+10:00",
            "isPremium": true,
            "club": [
                500028,
                500002
            ]
        }
    ],
    "scores": [
        {
            "gameState": "First Half",
            "gameStateId": 3,
            "gameTime": "0:29:25",
            "gameSeconds": 1765,
            "GameMinutes": "29:25",
            "playerId": 500802,
            "playerName": "Luke Lewis",
            "scoreMethod": "Try",
            "statEvent": "Try",
            "statId": 38,
            "statValue": 4,
            "vidRef": 47841,
            "homeScore": 4,
            "awayScore": 18,
            "commentary": "Try by Luke Lewis",
            "tackleNum": 1,
            "teamId": 500028,
            "teamName": "Cronulla-Sutherland Sharks",
            "homeTeamAbbrv": "CRO",
            "awayTeamAbbrv": "MAN"
        },
        {
            "gameState": "First Half",
            "gameStateId": 3,
            "gameTime": "0:30:58",
            "gameSeconds": 1858,
            "GameMinutes": "30:58",
            "playerId": 500006,
            "playerName": "James Maloney",
            "scoreMethod": "Conversion",
            "statEvent": "Conversion-Made",
            "statId": 1,
            "statValue": 2,
            "vidRef": 50234,
            "homeScore": 6,
            "awayScore": 18,
            "commentary": "Conversion-Made by James Maloney",
            "tackleNum": -1,
            "teamId": 500028,
            "teamName": "Cronulla-Sutherland Sharks",
            "homeTeamAbbrv": "CRO",
            "awayTeamAbbrv": "MAN"
        },
        {
            "gameState": "First Half",
            "gameStateId": 3,
            "gameTime": "0:34:07",
            "gameSeconds": 2047,
            "GameMinutes": "34:07",
            "playerId": 500790,
            "playerName": "Sosaia Feki",
            "scoreMethod": "Try",
            "statEvent": "Try",
            "statId": 38,
            "statValue": 4,
            "vidRef": 54979,
            "homeScore": 10,
            "awayScore": 18,
            "commentary": "Try by Sosaia Feki",
            "tackleNum": 1,
            "teamId": 500028,
            "teamName": "Cronulla-Sutherland Sharks",
            "homeTeamAbbrv": "CRO",
            "awayTeamAbbrv": "MAN"
        },
        {
            "gameState": "First Half",
            "gameStateId": 3,
            "gameTime": "0:35:36",
            "gameSeconds": 2136,
            "GameMinutes": "35:36",
            "playerId": 500006,
            "playerName": "James Maloney",
            "scoreMethod": "Conversion",
            "statEvent": "Conversion-Made",
            "statId": 1,
            "statValue": 2,
            "vidRef": 57201,
            "homeScore": 12,
            "awayScore": 18,
            "commentary": "Conversion-Made by James Maloney",
            "tackleNum": -1,
            "teamId": 500028,
            "teamName": "Cronulla-Sutherland Sharks",
            "homeTeamAbbrv": "CRO",
            "awayTeamAbbrv": "MAN"
        },
        {
            "gameState": "Second Half",
            "gameStateId": 5,
            "gameTime": "1:12:39",
            "gameSeconds": 4359,
            "GameMinutes": "72:39",
            "playerId": 500798,
            "playerName": "Wade Graham",
            "scoreMethod": "Try",
            "statEvent": "Try",
            "statId": 38,
            "statValue": 4,
            "vidRef": 116604,
            "homeScore": 16,
            "awayScore": 31,
            "commentary": "Try by Wade Graham",
            "tackleNum": 3,
            "teamId": 500028,
            "teamName": "Cronulla-Sutherland Sharks",
            "homeTeamAbbrv": "CRO",
            "awayTeamAbbrv": "MAN"
        },
        {
            "gameState": "Second Half",
            "gameStateId": 5,
            "gameTime": "1:13:02",
            "gameSeconds": 4382,
            "GameMinutes": "73:02",
            "playerId": 500006,
            "playerName": "James Maloney",
            "scoreMethod": "Conversion",
            "statEvent": "Conversion-Made",
            "statId": 1,
            "statValue": 2,
            "vidRef": 117173,
            "homeScore": 18,
            "awayScore": 31,
            "commentary": "Conversion-Made by James Maloney",
            "tackleNum": -1,
            "teamId": 500028,
            "teamName": "Cronulla-Sutherland Sharks",
            "homeTeamAbbrv": "CRO",
            "awayTeamAbbrv": "MAN"
        },
        {
            "gameState": "First Half",
            "gameStateId": 3,
            "gameTime": "0:01:51",
            "gameSeconds": 111,
            "GameMinutes": "01:51",
            "playerId": 500661,
            "playerName": "Curtis Sironen",
            "scoreMethod": "Try",
            "statEvent": "Try",
            "statId": 38,
            "statValue": 4,
            "vidRef": 5451,
            "awayScore": 4,
            "commentary": "Try by Curtis Sironen",
            "tackleNum": 5,
            "teamId": 500002,
            "teamName": "Manly-Warringah Sea Eagles",
            "homeTeamAbbrv": "CRO",
            "awayTeamAbbrv": "MAN"
        },
        {
            "gameState": "First Half",
            "gameStateId": 3,
            "gameTime": "0:03:05",
            "gameSeconds": 185,
            "GameMinutes": "03:05",
            "playerId": 501025,
            "playerName": "Matthew Wright",
            "scoreMethod": "Conversion",
            "statEvent": "Conversion-Made",
            "statId": 1,
            "statValue": 2,
            "vidRef": 7299,
            "awayScore": 6,
            "commentary": "Conversion-Made by Matthew Wright",
            "tackleNum": -1,
            "teamId": 500002,
            "teamName": "Manly-Warringah Sea Eagles",
            "homeTeamAbbrv": "CRO",
            "awayTeamAbbrv": "MAN"
        },
        {
            "gameState": "First Half",
            "gameStateId": 3,
            "gameTime": "0:19:25",
            "gameSeconds": 1165,
            "GameMinutes": "19:25",
            "playerId": 501025,
            "playerName": "Matthew Wright",
            "scoreMethod": "Try",
            "statEvent": "Try",
            "statId": 38,
            "statValue": 4,
            "vidRef": 32069,
            "awayScore": 10,
            "commentary": "Try by Matthew Wright",
            "tackleNum": 2,
            "teamId": 500002,
            "teamName": "Manly-Warringah Sea Eagles",
            "homeTeamAbbrv": "CRO",
            "awayTeamAbbrv": "MAN"
        },
        {
            "gameState": "First Half",
            "gameStateId": 3,
            "gameTime": "0:20:40",
            "gameSeconds": 1240,
            "GameMinutes": "20:40",
            "playerId": 501025,
            "playerName": "Matthew Wright",
            "scoreMethod": "Conversion",
            "statEvent": "Conversion-Made",
            "statId": 1,
            "statValue": 2,
            "vidRef": 34535,
            "awayScore": 12,
            "commentary": "Conversion-Made by Matthew Wright",
            "tackleNum": -1,
            "teamId": 500002,
            "teamName": "Manly-Warringah Sea Eagles",
            "homeTeamAbbrv": "CRO",
            "awayTeamAbbrv": "MAN"
        },
        {
            "gameState": "First Half",
            "gameStateId": 3,
            "gameTime": "0:22:17",
            "gameSeconds": 1337,
            "GameMinutes": "22:17",
            "playerId": 500661,
            "playerName": "Curtis Sironen",
            "scoreMethod": "Try",
            "statEvent": "Try",
            "statId": 38,
            "statValue": 4,
            "vidRef": 36974,
            "awayScore": 16,
            "commentary": "Try by Curtis Sironen",
            "tackleNum": 5,
            "teamId": 500002,
            "teamName": "Manly-Warringah Sea Eagles",
            "homeTeamAbbrv": "CRO",
            "awayTeamAbbrv": "MAN"
        },
        {
            "gameState": "First Half",
            "gameStateId": 3,
            "gameTime": "0:23:47",
            "gameSeconds": 1427,
            "GameMinutes": "23:47",
            "playerId": 501025,
            "playerName": "Matthew Wright",
            "scoreMethod": "Conversion",
            "statEvent": "Conversion-Made",
            "statId": 1,
            "statValue": 2,
            "vidRef": 39205,
            "awayScore": 18,
            "commentary": "Conversion-Made by Matthew Wright",
            "tackleNum": -1,
            "teamId": 500002,
            "teamName": "Manly-Warringah Sea Eagles",
            "homeTeamAbbrv": "CRO",
            "awayTeamAbbrv": "MAN"
        },
        {
            "gameState": "First Half",
            "gameStateId": 3,
            "gameTime": "0:39:58",
            "gameSeconds": 2398,
            "GameMinutes": "39:58",
            "playerId": 500024,
            "playerName": "Daly Cherry-Evans",
            "scoreMethod": "Field Goal",
            "statEvent": "Drop Goal-Made",
            "statId": 69,
            "statValue": 1,
            "vidRef": 64728,
            "homeScore": 12,
            "awayScore": 19,
            "commentary": "Drop Goal-Made by Daly Cherry-Evans",
            "tackleNum": 6,
            "teamId": 500002,
            "teamName": "Manly-Warringah Sea Eagles",
            "homeTeamAbbrv": "CRO",
            "awayTeamAbbrv": "MAN"
        },
        {
            "gameState": "Second Half",
            "gameStateId": 5,
            "gameTime": "0:53:07",
            "gameSeconds": 3187,
            "GameMinutes": "53:07",
            "playerId": 501025,
            "playerName": "Matthew Wright",
            "scoreMethod": "Try",
            "statEvent": "Try",
            "statId": 38,
            "statValue": 4,
            "vidRef": 85820,
            "homeScore": 12,
            "awayScore": 23,
            "commentary": "Try by Matthew Wright",
            "tackleNum": 3,
            "teamId": 500002,
            "teamName": "Manly-Warringah Sea Eagles",
            "homeTeamAbbrv": "CRO",
            "awayTeamAbbrv": "MAN"
        },
        {
            "gameState": "Second Half",
            "gameStateId": 5,
            "gameTime": "0:54:40",
            "gameSeconds": 3280,
            "GameMinutes": "54:40",
            "playerId": 501025,
            "playerName": "Matthew Wright",
            "scoreMethod": "Conversion",
            "statEvent": "Conversion-Made",
            "statId": 1,
            "statValue": 2,
            "vidRef": 88135,
            "homeScore": 12,
            "awayScore": 25,
            "commentary": "Conversion-Made by Matthew Wright",
            "tackleNum": -1,
            "teamId": 500002,
            "teamName": "Manly-Warringah Sea Eagles",
            "homeTeamAbbrv": "CRO",
            "awayTeamAbbrv": "MAN"
        },
        {
            "gameState": "Second Half",
            "gameStateId": 5,
            "gameTime": "1:02:55",
            "gameSeconds": 3775,
            "GameMinutes": "62:55",
            "playerId": 502209,
            "playerName": "Blake Green",
            "scoreMethod": "Try",
            "statEvent": "Try",
            "statId": 38,
            "statValue": 4,
            "vidRef": 100520,
            "homeScore": 12,
            "awayScore": 29,
            "commentary": "Try by Blake Green",
            "tackleNum": 4,
            "teamId": 500002,
            "teamName": "Manly-Warringah Sea Eagles",
            "homeTeamAbbrv": "CRO",
            "awayTeamAbbrv": "MAN"
        },
        {
            "gameState": "Second Half",
            "gameStateId": 5,
            "gameTime": "1:04:17",
            "gameSeconds": 3857,
            "GameMinutes": "64:17",
            "playerId": 501025,
            "playerName": "Matthew Wright",
            "scoreMethod": "Conversion",
            "statEvent": "Conversion-Made",
            "statId": 1,
            "statValue": 2,
            "vidRef": 102559,
            "homeScore": 12,
            "awayScore": 31,
            "commentary": "Conversion-Made by Matthew Wright",
            "tackleNum": -1,
            "teamId": 500002,
            "teamName": "Manly-Warringah Sea Eagles",
            "homeTeamAbbrv": "CRO",
            "awayTeamAbbrv": "MAN"
        },
        {
            "gameState": "Second Half",
            "gameStateId": 5,
            "gameTime": "1:15:58",
            "gameSeconds": 4558,
            "GameMinutes": "75:58",
            "playerId": 500083,
            "playerName": "Dylan Walker",
            "scoreMethod": "Try",
            "statEvent": "Try",
            "statId": 38,
            "statValue": 4,
            "vidRef": 122729,
            "homeScore": 18,
            "awayScore": 35,
            "commentary": "Try by Dylan Walker",
            "tackleNum": 1,
            "teamId": 500002,
            "teamName": "Manly-Warringah Sea Eagles",
            "homeTeamAbbrv": "CRO",
            "awayTeamAbbrv": "MAN"
        }
    ],
    "twitter": [
        {
            "id": "878886383443558404",
            "gameSeconds": 4620
        },
        {
            "id": "878886235971895298",
            "gameSeconds": 4620
        },
        {
            "id": "878864189225287680",
            "gameSeconds": 1200
        },
        {
            "id": "878863965433901056",
            "gameSeconds": 1200
        }
    ]
}