{
    "competitionId": 111,
    "competitionName": "NRL Telstra Premiership",
    "gameId": 20161112070,
    "gameInfo": {
        "assistantReferee1Id": 500020,
        "numberOfPeriods": 2,
        "assistantReferee1Name": "Jason Walsh",
        "assistantReferee2Id": 500021,
        "assistantReferee2Name": "Dave Ryan",
        "gameDate": "2016-07-24",
        "gameHashTag": "#NRLDragonsTigers",
        "gameNumber": 7,
        "gameSeconds": 4800,
        "gameMinutes": "80:00",
        "gameTime": "1:20:00",
        "groundConditionId": 1,
        "groundConditionName": "N/A",
        "referee1Id": 500039,
        "referee1Name": "Ashley Klein",
        "referee2Id": 500019,
        "referee2Name": "Adam Gee",
        "startTime": "2016-07-24T16:00:00",
        "startTimeUTC": "2016-07-24T06:00:00Z",
        "venueId": 500002,
        "venueName": "ANZ Stadium",
        "videoReferee1Id": 500203,
        "videoReferee1Name": "Ben Galea",
        "videoReferee2Id": 500002,
        "videoReferee2Name": "Matt Cecchin",
        "weatherId": 9,
        "weatherName": "Light Rain",
        "broadcastChannel": null,
        "venueLatitude": -33.8472,
        "venueLongitude": 151.0633,
        "broadcastInfo": {
            "radioNetwork": []
        }
    },
    "gameState": "Final",
    "gameStateId": 8,
    "roundId": 20,
    "roundName": "Round 20",
    "seasonId": 2016,
    "teams": {
        "teamsMatch": [
            {
                "isHomeTeam": true,
                "score": {
                    "conversions": 1,
                    "points": 12,
                    "penaltyGoals": 1,
                    "tries": 2
                },
                "team1stHalfScore": 8,
                "team2ndHalfScore": 4,
                "teamAbbr": "SGI",
                "teamFinalScore": 12,
                "teamFullTimeScore": 12,
                "teamHalfTimeScore": 8,
                "teamId": 500022,
                "teamLineup": {
                    "teamLineUpStatusID": 4,
                    "teamLineUpStatus": "Final",
                    "injuriesAndSuspensions": {
                        "injury": [],
                        "suspension": []
                    },
                    "insAndOuts": {
                        "inOut": [
                            {
                                "inOut": "In",
                                "playerFirstName": "Adam",
                                "playerId": "500635",
                                "playerLastName": "Quinlan",
                                "playerName": "Adam Quinlan"
                            },
                            {
                                "inOut": "In",
                                "playerFirstName": "Benji",
                                "playerId": "500948",
                                "playerLastName": "Marshall",
                                "playerName": "Benji Marshall"
                            },
                            {
                                "inOut": "Out",
                                "playerFirstName": "Jacob",
                                "playerId": "500453",
                                "playerLastName": "Host",
                                "playerName": "Jacob Host"
                            },
                            {
                                "inOut": "Out",
                                "playerFirstName": "Josh",
                                "playerId": "500972",
                                "playerLastName": "McCrone",
                                "playerName": "Josh McCrone"
                            },
                            {
                                "inOut": "Out",
                                "playerFirstName": "Kalifa",
                                "playerId": "500822",
                                "playerLastName": "Faifai Loa",
                                "playerName": "Kalifa Faifai Loa"
                            },
                            {
                                "inOut": "In",
                                "playerFirstName": "Taane",
                                "playerId": "500209",
                                "playerLastName": "Milne",
                                "playerName": "Taane Milne"
                            },
                            {
                                "inOut": "Out",
                                "playerFirstName": "Timoteo",
                                "playerId": "500229",
                                "playerLastName": "Lafai",
                                "playerName": "Timoteo Lafai"
                            },
                            {
                                "inOut": "In",
                                "playerFirstName": "Tyrone",
                                "playerId": "501033",
                                "playerLastName": "McCarthy",
                                "playerName": "Tyrone McCarthy"
                            }
                        ]
                    },
                    "teamPlayer": [
                        {
                            "playerFirstName": "Adam",
                            "playerId": 500635,
                            "playerLastName": "Quinlan",
                            "playerName": "Adam Quinlan",
                            "playerPosition": "Fullback",
                            "playerPositionId": 500001,
                            "playerStats": {
                                "allRunMetres": 71,
                                "allRuns": 9,
                                "decoys": 1,
                                "dummyHalfRuns": 1,
                                "errors": 1,
                                "fantasyPointsTotal": 35,
                                "kickMetres": 16,
                                "kickReturnMetres": 9,
                                "kickReturns": 2,
                                "kicks": 1,
                                "kicksDefused": 3,
                                "linebreakAssists": 1,
                                "linebreaks": 1,
                                "mins": 80,
                                "missedTackles": 2,
                                "offloads": 1,
                                "passes": 16,
                                "passesPerRun": 1.78,
                                "oneOnOneTackles": 1,
                                "penalties": 1,
                                "points": 4,
                                "supports": 10,
                                "tackleBreaks": 3,
                                "tackles": 3,
                                "tries": 1,
                                "tryAssists": 1,
                                "evasionRuns": 6,
                                "evasionRunMetres": 54,
                                "dummyHalfRunMetres": 8,
                                "ptbAll": 7,
                                "receipts": 27,
                                "forcedDropOutKicker": 1,
                                "grubberKick": 1,
                                "postContactMetres": 17,
                                "ptbTwoToThree": 3,
                                "ptbThreeToFour": 4,
                                "effectiveTacklePercentage": 60,
                                "ptbPenalties": 1,
                                "stint1": 4800
                            },
                            "playerTookTheField": true,
                            "shirtNum": 1,
                            "playerFirstInitial": "A",
                            "playerPositionAbbrev": "FB",
                            "onTheField": true,
                            "fantasyPrice": 184000,
                            "fantasySeasonPriceChange": -13000
                        },
                        {
                            "playerFirstName": "Kurt",
                            "playerId": 500601,
                            "playerLastName": "Mann",
                            "playerName": "Kurt Mann",
                            "playerPosition": "Winger 1",
                            "playerPositionId": 500002,
                            "playerStats": {
                                "allRunMetres": 121,
                                "allRuns": 14,
                                "dummyHalfRuns": 1,
                                "fantasyPointsTotal": 55,
                                "kickReturnMetres": 21,
                                "kickReturns": 4,
                                "linebreakAssists": 1,
                                "linebreaks": 1,
                                "mins": 80,
                                "missedTackles": 1,
                                "offloads": 2,
                                "passes": 3,
                                "passesPerRun": 0.21,
                                "points": 4,
                                "supports": 10,
                                "tackleBreaks": 8,
                                "tackles": 3,
                                "tries": 1,
                                "tryCause": 2,
                                "evasionRuns": 9,
                                "evasionRunMetres": 92,
                                "dummyHalfRunMetres": 8,
                                "ptbAll": 10,
                                "receipts": 18,
                                "postContactMetres": 34,
                                "kickPressures": 1,
                                "ptbTwoToThree": 4,
                                "ptbThreeToFour": 5,
                                "ptbFourToFive": 1,
                                "effectiveTacklePercentage": 75,
                                "stint1": 4800
                            },
                            "playerTookTheField": true,
                            "shirtNum": 2,
                            "playerFirstInitial": "K",
                            "playerPositionAbbrev": "WG",
                            "onTheField": true,
                            "fantasyPrice": 278000,
                            "fantasySeasonPriceChange": 9000,
                            "fantasyRoundPriceChange": 21000
                        },
                        {
                            "playerFirstName": "Euan",
                            "playerId": 500441,
                            "playerLastName": "Aitken",
                            "playerName": "Euan Aitken",
                            "playerPosition": "Centre 1",
                            "playerPositionId": 500003,
                            "playerStats": {
                                "allRunMetres": 112,
                                "allRuns": 13,
                                "decoys": 1,
                                "errors": 1,
                                "fantasyPointsTotal": 55,
                                "ineffectiveTackles": 1,
                                "linebreaks": 1,
                                "mins": 80,
                                "missedTackles": 2,
                                "offloads": 5,
                                "passes": 2,
                                "passesPerRun": 0.15,
                                "oneOnOneSteal": 1,
                                "oneOnOneTackles": 3,
                                "supports": 9,
                                "tackleBreaks": 5,
                                "tackles": 21,
                                "tryCause": 2,
                                "evasionRuns": 13,
                                "evasionRunMetres": 112,
                                "ptbAll": 8,
                                "receipts": 16,
                                "postContactMetres": 36,
                                "ptbOneToTwo": 1,
                                "ptbTwoToThree": 6,
                                "ptbFourToFive": 1,
                                "doubles": 4,
                                "effectiveTacklePercentage": 87.5,
                                "stint1": 4800
                            },
                            "playerTookTheField": true,
                            "shirtNum": 3,
                            "playerFirstInitial": "E",
                            "playerPositionAbbrev": "CT",
                            "onTheField": true,
                            "fantasyPrice": 401000,
                            "fantasySeasonPriceChange": 24000,
                            "fantasyRoundPriceChange": 7000
                        },
                        {
                            "playerFirstName": "Taane",
                            "playerId": 500209,
                            "playerLastName": "Milne",
                            "playerName": "Taane Milne",
                            "playerPosition": "Centre 2",
                            "playerPositionId": 500004,
                            "playerStats": {
                                "allRunMetres": 162,
                                "allRuns": 16,
                                "decoys": 1,
                                "dummyHalfRuns": 1,
                                "errors": 3,
                                "fantasyPointsTotal": 60,
                                "ineffectiveTackles": 2,
                                "interceptedPass": 1,
                                "linebreakAssists": 1,
                                "linebreaks": 1,
                                "mins": 80,
                                "missedTackles": 1,
                                "offloads": 7,
                                "passes": 7,
                                "passesPerRun": 0.44,
                                "oneOnOneTackles": 2,
                                "penalties": 2,
                                "supports": 3,
                                "tackleBreaks": 5,
                                "tackles": 16,
                                "tryAssists": 1,
                                "evasionRuns": 15,
                                "evasionRunMetres": 162,
                                "ptbAll": 7,
                                "receipts": 25,
                                "postContactMetres": 40,
                                "ptbOneToTwo": 3,
                                "ptbThreeToFour": 2,
                                "ptbFourToFive": 1,
                                "ptbFivePlus": 1,
                                "doubles": 2,
                                "effectiveTacklePercentage": 84.2,
                                "ptbPenalties": 1,
                                "foulPlayPenalties": 1,
                                "stint1": 4800
                            },
                            "playerTookTheField": true,
                            "shirtNum": 4,
                            "playerFirstInitial": "T",
                            "playerPositionAbbrev": "CT",
                            "onTheField": true,
                            "fantasyPrice": 130000
                        },
                        {
                            "playerFirstName": "Jason",
                            "playerId": 500634,
                            "playerLastName": "Nightingale",
                            "playerName": "Jason Nightingale",
                            "playerPosition": "Winger 2",
                            "playerPositionId": 500005,
                            "playerStats": {
                                "allRunMetres": 117,
                                "allRuns": 14,
                                "bombKicksDefused": 1,
                                "decoys": 1,
                                "dummyHalfRuns": 3,
                                "fantasyPointsTotal": 48,
                                "intercepts": 1,
                                "kickMetres": 1,
                                "kickReturnMetres": 51,
                                "kickReturns": 4,
                                "kicks": 1,
                                "kicksDefused": 1,
                                "mins": 80,
                                "missedTackles": 1,
                                "offloads": 2,
                                "passes": 3,
                                "passesPerRun": 0.21,
                                "oneOnOneTackles": 1,
                                "supports": 11,
                                "tackleBreaks": 7,
                                "tackles": 8,
                                "trySaves": 1,
                                "evasionRuns": 7,
                                "evasionRunMetres": 44,
                                "dummyHalfRunMetres": 22,
                                "ptbAll": 11,
                                "receipts": 17,
                                "chipKick": 1,
                                "postContactMetres": 36,
                                "ptbTwoToThree": 4,
                                "ptbThreeToFour": 5,
                                "ptbFourToFive": 2,
                                "effectiveTacklePercentage": 88.9,
                                "stint1": 4800
                            },
                            "playerTookTheField": true,
                            "shirtNum": 5,
                            "playerFirstInitial": "J",
                            "playerPositionAbbrev": "WG",
                            "onTheField": true,
                            "fantasyPrice": 292000,
                            "fantasySeasonPriceChange": 10000,
                            "fantasyRoundPriceChange": -8000
                        },
                        {
                            "playerFirstName": "Gareth",
                            "playerId": 500641,
                            "playerLastName": "Widdop",
                            "playerName": "Gareth Widdop",
                            "playerPosition": "Five-Eighth",
                            "playerPositionId": 500006,
                            "playerStats": {
                                "allRunMetres": 31,
                                "allRuns": 7,
                                "bombKicks": 1,
                                "bombKickMetres": 25,
                                "conversions": 1,
                                "conversionsAttempts": 2,
                                "conversionsMissed": 1,
                                "fantasyPointsTotal": 34,
                                "goalConversionRate": 66.67,
                                "allGoals": 2,
                                "allGoalsMissed": 1,
                                "allGoalsAttempted": 3,
                                "ineffectiveTackles": 3,
                                "kickMetres": 187,
                                "kicks": 7,
                                "mins": 80,
                                "missedTackles": 3,
                                "passes": 34,
                                "passesPerRun": 4.86,
                                "oneOnOneTackles": 1,
                                "penaltyGoals": 1,
                                "penaltyGoalsAttempts": 1,
                                "points": 4,
                                "supports": 4,
                                "tackleBreaks": 4,
                                "tackles": 12,
                                "tryCause": 2,
                                "evasionRuns": 7,
                                "evasionRunMetres": 31,
                                "ptbAll": 5,
                                "receipts": 47,
                                "forcedDropOutKicker": 2,
                                "chipKick": 1,
                                "grubberKick": 2,
                                "postContactMetres": 7,
                                "dummyPasses": 2,
                                "kickPressures": 1,
                                "ptbThreeToFour": 2,
                                "ptbFourToFive": 2,
                                "ptbFivePlus": 1,
                                "doubles": 1,
                                "effectiveTacklePercentage": 66.7,
                                "stint1": 4800
                            },
                            "playerTookTheField": true,
                            "shirtNum": 6,
                            "playerFirstInitial": "G",
                            "playerPositionAbbrev": "FE",
                            "onTheField": true,
                            "fantasyPrice": 355000,
                            "fantasySeasonPriceChange": -27000,
                            "fantasyRoundPriceChange": -8000
                        },
                        {
                            "playerFirstName": "Benji",
                            "playerId": 500948,
                            "playerLastName": "Marshall",
                            "playerName": "Benji Marshall",
                            "playerPosition": "Halfback",
                            "playerPositionId": 500007,
                            "playerStats": {
                                "allRunMetres": 96,
                                "allRuns": 11,
                                "bombKicks": 3,
                                "bombKickMetres": 69,
                                "errors": 2,
                                "fantasyPointsTotal": 32,
                                "ineffectiveTackles": 1,
                                "kickDead": 1,
                                "kickMetres": 238,
                                "kicks": 9,
                                "lineDropouts": 1,
                                "mins": 80,
                                "missedTackles": 1,
                                "passes": 43,
                                "passesPerRun": 3.91,
                                "oneOnOneTackles": 2,
                                "penalties": 1,
                                "supports": 1,
                                "tackleBreaks": 3,
                                "tackles": 11,
                                "tryCause": 1,
                                "evasionRuns": 11,
                                "evasionRunMetres": 96,
                                "ptbAll": 6,
                                "receipts": 59,
                                "chipKick": 1,
                                "grubberKick": 1,
                                "postContactMetres": 22,
                                "dummyPasses": 5,
                                "lineEngagedRuns": 2,
                                "ptbTwoToThree": 1,
                                "ptbThreeToFour": 2,
                                "ptbFourToFive": 2,
                                "ptbFivePlus": 1,
                                "longKicksSpace": 4,
                                "effectiveTacklePercentage": 84.6,
                                "foulPlayPenalties": 1,
                                "stint1": 4800
                            },
                            "playerTookTheField": true,
                            "shirtNum": 7,
                            "playerFirstInitial": "B",
                            "playerPositionAbbrev": "HB",
                            "onTheField": true,
                            "fantasyPrice": 295000,
                            "fantasySeasonPriceChange": -5000
                        },
                        {
                            "playerFirstName": "Russell",
                            "playerId": 502631,
                            "playerLastName": "Packer",
                            "playerName": "Russell Packer",
                            "playerPosition": "Prop 1",
                            "playerPositionId": 500008,
                            "playerStats": {
                                "allRunMetres": 133,
                                "allRuns": 11,
                                "decoys": 6,
                                "fantasyPointsTotal": 35,
                                "hitUps": 7,
                                "ineffectiveTackles": 2,
                                "kickReturnMetres": 76,
                                "kickReturns": 4,
                                "mins": 38,
                                "missedTackles": 3,
                                "offloads": 2,
                                "passes": 1,
                                "passesPerRun": 0.09,
                                "tackleBreaks": 2,
                                "tackles": 18,
                                "hitupRunMeters": 57,
                                "ptbAll": 9,
                                "receipts": 12,
                                "postContactMetres": 33,
                                "kickPressures": 1,
                                "ptbTwoToThree": 7,
                                "ptbThreeToFour": 1,
                                "ptbFourToFive": 1,
                                "doubles": 2,
                                "effectiveTacklePercentage": 78.3,
                                "stint1": 1159,
                                "stint2": 1112
                            },
                            "playerTookTheField": true,
                            "shirtNum": 8,
                            "playerFirstInitial": "R",
                            "playerPositionAbbrev": "PR",
                            "fantasyPrice": 301000,
                            "fantasySeasonPriceChange": 90000,
                            "fantasyRoundPriceChange": -6000
                        },
                        {
                            "playerFirstName": "Mitch",
                            "playerId": 500636,
                            "playerLastName": "Rein",
                            "playerName": "Mitch Rein",
                            "playerPosition": "Hooker",
                            "playerPositionId": 500009,
                            "playerStats": {
                                "allRunMetres": 32,
                                "allRuns": 6,
                                "dummyHalfRuns": 6,
                                "errors": 1,
                                "fantasyPointsTotal": 33,
                                "ineffectiveTackles": 2,
                                "kicks": 1,
                                "mins": 80,
                                "missedTackles": 4,
                                "passes": 118,
                                "passesPerRun": 19.67,
                                "oneOnOneTackles": 2,
                                "tackles": 40,
                                "tryCause": 1,
                                "dummyHalfRunMetres": 32,
                                "ptbAll": 4,
                                "receipts": 118,
                                "grubberKick": 1,
                                "postContactMetres": 7,
                                "dummyPasses": 5,
                                "kickPressures": 1,
                                "lineEngagedRuns": 3,
                                "ptbTwoToThree": 1,
                                "ptbThreeToFour": 1,
                                "ptbFourToFive": 1,
                                "ptbFivePlus": 1,
                                "doubles": 5,
                                "effectiveTacklePercentage": 87,
                                "stint1": 4800
                            },
                            "playerTookTheField": true,
                            "shirtNum": 9,
                            "playerFirstInitial": "M",
                            "playerPositionAbbrev": "HK",
                            "onTheField": true,
                            "fantasyPrice": 451000,
                            "fantasySeasonPriceChange": 5000,
                            "fantasyRoundPriceChange": 4000
                        },
                        {
                            "playerFirstName": "Tariq",
                            "playerId": 500298,
                            "playerLastName": "Sims",
                            "playerName": "Tariq Sims",
                            "playerPosition": "Prop 2",
                            "playerPositionId": 500010,
                            "playerStats": {
                                "allRunMetres": 98,
                                "allRuns": 11,
                                "decoys": 5,
                                "errors": 1,
                                "fantasyPointsTotal": 42,
                                "hitUps": 11,
                                "ineffectiveTackles": 4,
                                "mins": 63,
                                "missedTackles": 2,
                                "penalties": 2,
                                "supports": 4,
                                "tackleBreaks": 4,
                                "tackles": 31,
                                "tryCause": 1,
                                "hitupRunMeters": 98,
                                "ptbAll": 11,
                                "receipts": 13,
                                "postContactMetres": 33,
                                "kickPressures": 2,
                                "ptbTwoToThree": 6,
                                "ptbThreeToFour": 3,
                                "ptbFourToFive": 2,
                                "doubles": 3,
                                "effectiveTacklePercentage": 83.8,
                                "ptbPenalties": 1,
                                "generalPlayPenalties": 1,
                                "foulPlayPenalties": 1,
                                "stint1": 3800
                            },
                            "playerTookTheField": true,
                            "shirtNum": 10,
                            "playerFirstInitial": "T",
                            "playerPositionAbbrev": "PR"
                        },
                        {
                            "playerFirstName": "Tyson",
                            "playerId": 500622,
                            "playerLastName": "Frizell",
                            "playerName": "Tyson Frizell",
                            "playerPosition": "2nd Row 1",
                            "playerPositionId": 500011,
                            "playerStats": {
                                "allRunMetres": 78,
                                "allRuns": 11,
                                "decoys": 5,
                                "fantasyPointsTotal": 36,
                                "hitUps": 10,
                                "ineffectiveTackles": 1,
                                "kickMetres": 6,
                                "kicks": 1,
                                "mins": 51,
                                "missedTackles": 1,
                                "passes": 1,
                                "passesPerRun": 0.09,
                                "oneOnOneTackles": 2,
                                "tackleBreaks": 2,
                                "tackles": 25,
                                "hitupRunMeters": 77,
                                "evasionRuns": 1,
                                "evasionRunMetres": 1,
                                "ptbAll": 10,
                                "receipts": 12,
                                "chipKick": 1,
                                "postContactMetres": 25,
                                "kickPressures": 5,
                                "lineEngagedRuns": 1,
                                "ptbTwoToThree": 6,
                                "ptbThreeToFour": 1,
                                "ptbFourToFive": 3,
                                "doubles": 3,
                                "effectiveTacklePercentage": 92.6,
                                "stint1": 1635,
                                "stint2": 1433
                            },
                            "playerTookTheField": true,
                            "shirtNum": 11,
                            "playerFirstInitial": "T",
                            "playerPositionAbbrev": "2R",
                            "onTheField": true,
                            "fantasyPrice": 398000,
                            "fantasySeasonPriceChange": -61000,
                            "fantasyRoundPriceChange": -25000
                        },
                        {
                            "playerFirstName": "Joel",
                            "playerId": 500640,
                            "playerLastName": "Thompson",
                            "playerName": "Joel Thompson",
                            "playerPosition": "2nd Row 2",
                            "playerPositionId": 500012,
                            "playerStats": {
                                "allRunMetres": 96,
                                "allRuns": 9,
                                "decoys": 6,
                                "fantasyPointsTotal": 39,
                                "hitUps": 8,
                                "ineffectiveTackles": 1,
                                "kickReturnMetres": 6,
                                "kickReturns": 1,
                                "mins": 56,
                                "missedTackles": 1,
                                "offloads": 1,
                                "passes": 2,
                                "passesPerRun": 0.22,
                                "supports": 3,
                                "tackleBreaks": 1,
                                "tackles": 27,
                                "hitupRunMeters": 90,
                                "ptbAll": 8,
                                "receipts": 11,
                                "postContactMetres": 32,
                                "dummyPasses": 1,
                                "kickPressures": 1,
                                "ptbTwoToThree": 2,
                                "ptbThreeToFour": 2,
                                "ptbFourToFive": 4,
                                "doubles": 4,
                                "effectiveTacklePercentage": 93.1,
                                "stint1": 2401,
                                "stint2": 934
                            },
                            "playerTookTheField": true,
                            "shirtNum": 12,
                            "playerFirstInitial": "J",
                            "playerPositionAbbrev": "2R",
                            "onTheField": true,
                            "fantasyPrice": 361000,
                            "fantasySeasonPriceChange": 2000,
                            "fantasyRoundPriceChange": 8000
                        },
                        {
                            "playerFirstName": "Jack",
                            "playerId": 500619,
                            "playerLastName": "de Belin",
                            "playerName": "Jack de Belin",
                            "playerPosition": "Lock",
                            "playerPositionId": 500013,
                            "playerStats": {
                                "allRunMetres": 122,
                                "allRuns": 10,
                                "decoys": 8,
                                "dummyHalfRuns": 1,
                                "errors": 1,
                                "fantasyPointsTotal": 62,
                                "hitUps": 7,
                                "ineffectiveTackles": 1,
                                "mins": 80,
                                "passes": 17,
                                "passesPerRun": 1.7,
                                "oneOnOneTackles": 1,
                                "penalties": 2,
                                "supports": 7,
                                "tackleBreaks": 2,
                                "tackles": 50,
                                "hitupRunMeters": 111,
                                "evasionRuns": 2,
                                "evasionRunMetres": 10,
                                "dummyHalfRunMetres": 1,
                                "ptbAll": 6,
                                "receipts": 26,
                                "postContactMetres": 24,
                                "dummyPasses": 2,
                                "lineEngagedRuns": 2,
                                "ptbTwoToThree": 2,
                                "ptbThreeToFour": 3,
                                "ptbFourToFive": 1,
                                "doubles": 12,
                                "effectiveTacklePercentage": 98,
                                "ptbPenalties": 1,
                                "foulPlayPenalties": 1,
                                "stint1": 4800
                            },
                            "playerTookTheField": true,
                            "shirtNum": 13,
                            "playerFirstInitial": "J",
                            "playerPositionAbbrev": "LK",
                            "onTheField": true,
                            "fantasyPrice": 445000,
                            "fantasySeasonPriceChange": 16000,
                            "fantasyRoundPriceChange": -7000
                        },
                        {
                            "playerFirstName": "Mike",
                            "playerId": 501282,
                            "playerLastName": "Cooper",
                            "playerName": "Mike Cooper",
                            "playerPosition": "Interchange",
                            "playerPositionId": 500014,
                            "playerStats": {
                                "allRunMetres": 156,
                                "allRuns": 18,
                                "decoys": 6,
                                "fantasyPointsTotal": 40,
                                "hitUps": 16,
                                "kickReturnMetres": 16,
                                "kickReturns": 1,
                                "mins": 46,
                                "missedTackles": 1,
                                "offloads": 2,
                                "passes": 7,
                                "passesPerRun": 0.39,
                                "supports": 2,
                                "tackles": 23,
                                "hitupRunMeters": 138,
                                "evasionRuns": 1,
                                "evasionRunMetres": 2,
                                "ptbAll": 15,
                                "receipts": 24,
                                "postContactMetres": 51,
                                "dummyPasses": 1,
                                "kickPressures": 3,
                                "lineEngagedRuns": 1,
                                "ptbTwoToThree": 1,
                                "ptbThreeToFour": 9,
                                "ptbFourToFive": 4,
                                "ptbFivePlus": 1,
                                "doubles": 5,
                                "effectiveTacklePercentage": 95.8,
                                "stint1": 1732,
                                "stint2": 1000
                            },
                            "playerTookTheField": true,
                            "shirtNum": 14,
                            "playerFirstInitial": "M",
                            "playerPositionAbbrev": "INT",
                            "onTheField": true,
                            "fantasyPrice": 372000,
                            "fantasySeasonPriceChange": -94000,
                            "fantasyRoundPriceChange": -23000
                        },
                        {
                            "playerFirstName": "Leeson",
                            "playerId": 500614,
                            "playerLastName": "Ah Mau",
                            "playerName": "Leeson Ah Mau",
                            "playerPosition": "Interchange",
                            "playerPositionId": 500014,
                            "playerStats": {
                                "allRunMetres": 119,
                                "allRuns": 12,
                                "decoys": 5,
                                "fantasyPointsTotal": 20,
                                "hitUps": 10,
                                "ineffectiveTackles": 1,
                                "kickReturnMetres": 35,
                                "kickReturns": 2,
                                "mins": 37,
                                "missedTackles": 3,
                                "onReport": 1,
                                "passes": 3,
                                "passesPerRun": 0.25,
                                "penalties": 1,
                                "supports": 5,
                                "tackles": 17,
                                "tryCause": 1,
                                "hitupRunMeters": 84,
                                "ptbAll": 12,
                                "receipts": 15,
                                "postContactMetres": 46,
                                "ptbTwoToThree": 5,
                                "ptbThreeToFour": 5,
                                "ptbFourToFive": 2,
                                "doubles": 1,
                                "effectiveTacklePercentage": 81,
                                "foulPlayPenalties": 1,
                                "stint1": 2171
                            },
                            "playerTookTheField": true,
                            "shirtNum": 15,
                            "playerFirstInitial": "L",
                            "playerPositionAbbrev": "INT",
                            "fantasyPrice": 286000,
                            "fantasySeasonPriceChange": -71000,
                            "fantasyRoundPriceChange": -4000
                        },
                        {
                            "playerFirstName": "Jake",
                            "playerId": 501088,
                            "playerLastName": "Marketo",
                            "playerName": "Jake Marketo",
                            "playerPosition": "Interchange",
                            "playerPositionId": 500014,
                            "playerStats": {
                                "allRunMetres": 15,
                                "allRuns": 2,
                                "decoys": 1,
                                "fantasyPointsTotal": 6,
                                "hitUps": 2,
                                "mins": 6,
                                "tackles": 5,
                                "hitupRunMeters": 15,
                                "ptbAll": 2,
                                "receipts": 2,
                                "postContactMetres": 5,
                                "ptbTwoToThree": 1,
                                "ptbThreeToFour": 1,
                                "doubles": 2,
                                "effectiveTacklePercentage": 100,
                                "stint1": 357
                            },
                            "playerTookTheField": true,
                            "shirtNum": 17,
                            "playerFirstInitial": "J",
                            "playerPositionAbbrev": "INT",
                            "onTheField": true,
                            "fantasyPrice": 248000,
                            "fantasySeasonPriceChange": 43000,
                            "fantasyRoundPriceChange": -6000
                        },
                        {
                            "playerFirstName": "Tyrone",
                            "playerId": 501033,
                            "playerLastName": "McCarthy",
                            "playerName": "Tyrone McCarthy",
                            "playerPosition": "Interchange",
                            "playerPositionId": 500014,
                            "playerStats": {
                                "allRunMetres": 37,
                                "allRuns": 5,
                                "decoys": 3,
                                "fantasyPointsTotal": 10,
                                "hitUps": 5,
                                "ineffectiveTackles": 2,
                                "mins": 24,
                                "missedTackles": 1,
                                "tackles": 9,
                                "tryCause": 1,
                                "hitupRunMeters": 37,
                                "ptbAll": 5,
                                "receipts": 5,
                                "postContactMetres": 6,
                                "ptbTwoToThree": 3,
                                "ptbThreeToFour": 2,
                                "doubles": 2,
                                "effectiveTacklePercentage": 75,
                                "stint1": 1465
                            },
                            "playerTookTheField": true,
                            "shirtNum": 19,
                            "playerFirstInitial": "T",
                            "playerPositionAbbrev": "INT",
                            "fantasyPrice": 223000
                        }
                    ]
                },
                "teamName": "St. George Illawarra Dragons",
                "teamNickName": "Dragons",
                "teamStats": {
                    "allRunMetres": 1596,
                    "allRuns": 179,
                    "bombKicks": 4,
                    "bombKickMetres": 94,
                    "bombKicksDefused": 1,
                    "completeSets": 27,
                    "completionPercentage": 71,
                    "conversions": 1,
                    "conversionsAttempts": 2,
                    "conversionsMissed": 1,
                    "decoys": 49,
                    "dummyHalfRuns": 13,
                    "errors": 10,
                    "goalConversionRate": 66.67,
                    "allGoals": 2,
                    "allGoalsAttempted": 3,
                    "allGoalsMissed": 1,
                    "hitUps": 76,
                    "incompleteSets": 11,
                    "ineffectiveTackles": 21,
                    "interceptedPass": 1,
                    "intercepts": 1,
                    "kickDead": 1,
                    "kickMetres": 449,
                    "kickReturnMetres": 213,
                    "kickReturns": 18,
                    "kicks": 20,
                    "kicksDefused": 4,
                    "lineDropouts": 1,
                    "linebreakAssists": 3,
                    "linebreaks": 4,
                    "missedTackles": 27,
                    "offloads": 22,
                    "onReports": 1,
                    "oneOnOneSteal": 1,
                    "oneOnOneTackles": 15,
                    "passes": 257,
                    "passesPerRun": 1.44,
                    "penalties": 9,
                    "penaltyGoals": 1,
                    "penaltyGoalsAttempts": 1,
                    "points": 12,
                    "pointsConceded": 25,
                    "possession": 53,
                    "scrumWins": 6,
                    "supports": 69,
                    "tackleBreaks": 46,
                    "tackles": 319,
                    "sets": 38,
                    "tries": 2,
                    "triesConceded": 4,
                    "tryAssists": 2,
                    "tryCause": 11,
                    "trySaves": 1,
                    "hitupRunMeters": 707,
                    "evasionRuns": 72,
                    "evasionRunMetres": 605,
                    "dummyHalfRunMetres": 71,
                    "ptbTotal": 136,
                    "twoManTackles": 57,
                    "threeManTackles": 51,
                    "fourManPlusTackles": 1,
                    "tryScoringPercentage": 7.41,
                    "shiftsLeft": 12,
                    "shiftsRight": 17,
                    "receipts": 447,
                    "forcedDropOutKicker": 3,
                    "chipKick": 4,
                    "grubberKick": 5,
                    "postContactMetres": 455,
                    "dummyPasses": 16,
                    "kickPressures": 15,
                    "lineEngagedRuns": 9,
                    "ptbOneToTwo": 4,
                    "ptbTwoToThree": 52,
                    "ptbThreeToFour": 48,
                    "ptbFourToFive": 27,
                    "ptbFivePlus": 5,
                    "interchangeUsed": 8,
                    "doubles": 46,
                    "longKicksSpace": 4,
                    "effectiveTacklePercentage": 86.9,
                    "ptbPenalties": 4,
                    "generalPlayPenalties": 1,
                    "foulPlayPenalties": 5,
                    "averageSetDistance": 42,
                    "completeSets1stHalf": 12,
                    "completeSets2ndHalf": 15,
                    "completionPercentage1stHalf": 66.67,
                    "completionPercentage2ndHalf": 75,
                    "incompleteSets1stHalf": 6,
                    "incompleteSets2ndHalf": 5,
                    "incompletionPercentage1stHalf": 33.33,
                    "incompletionPercentage2ndHalf": 25
                },
                "teamHexColour": "fe000b",
                "teamHexColour2": "b4b4be"
            },
            {
                "score": {
                    "conversions": 2,
                    "points": 25,
                    "fieldGoals": 1,
                    "penaltyGoals": 2,
                    "tries": 4
                },
                "team1stHalfScore": 18,
                "team2ndHalfScore": 7,
                "teamAbbr": "WST",
                "teamFinalScore": 25,
                "teamFullTimeScore": 25,
                "teamHalfTimeScore": 18,
                "teamId": 500023,
                "teamLineup": {
                    "teamLineUpStatusID": 4,
                    "teamLineUpStatus": "Final",
                    "injuriesAndSuspensions": {
                        "injury": [],
                        "suspension": []
                    },
                    "insAndOuts": {
                        "inOut": [
                            {
                                "inOut": "In",
                                "playerFirstName": "Aaron",
                                "playerId": "500665",
                                "playerLastName": "Woods",
                                "playerName": "Aaron Woods"
                            },
                            {
                                "inOut": "Out",
                                "playerFirstName": "Jacob",
                                "playerId": "503449",
                                "playerLastName": "Liddle",
                                "playerName": "Jacob Liddle"
                            },
                            {
                                "inOut": "In",
                                "playerFirstName": "James",
                                "playerId": "500663",
                                "playerLastName": "Tedesco",
                                "playerName": "James Tedesco"
                            },
                            {
                                "inOut": "Out",
                                "playerFirstName": "JJ",
                                "playerId": "503451",
                                "playerLastName": "Felise",
                                "playerName": "JJ Felise"
                            },
                            {
                                "inOut": "In",
                                "playerFirstName": "Joel",
                                "playerId": "500315",
                                "playerLastName": "Edwards",
                                "playerName": "Joel Edwards"
                            },
                            {
                                "inOut": "Out",
                                "playerFirstName": "Josh",
                                "playerId": "501351",
                                "playerLastName": "Addo-Carr",
                                "playerName": "Josh Addo-Carr"
                            }
                        ]
                    },
                    "teamPlayer": [
                        {
                            "playerFirstName": "James",
                            "playerId": 500663,
                            "playerLastName": "Tedesco",
                            "playerName": "James Tedesco",
                            "playerPosition": "Fullback",
                            "playerPositionId": 500001,
                            "playerStats": {
                                "allRunMetres": 179,
                                "allRuns": 17,
                                "bombKicksDefused": 1,
                                "dummyHalfRuns": 1,
                                "errors": 1,
                                "fantasyPointsTotal": 31,
                                "ineffectiveTackles": 2,
                                "interceptedPass": 1,
                                "kickMetres": 27,
                                "kickReturnMetres": 46,
                                "kickReturns": 7,
                                "kicks": 1,
                                "kicksDefused": 3,
                                "mins": 80,
                                "missedTackles": 3,
                                "passes": 6,
                                "passesPerRun": 0.35,
                                "penalties": 1,
                                "points": 4,
                                "supports": 7,
                                "tackleBreaks": 4,
                                "tries": 1,
                                "evasionRuns": 9,
                                "evasionRunMetres": 124,
                                "dummyHalfRunMetres": 9,
                                "ptbAll": 11,
                                "receipts": 21,
                                "chipKick": 1,
                                "postContactMetres": 17,
                                "dummyPasses": 1,
                                "lineEngagedRuns": 1,
                                "ptbTwoToThree": 1,
                                "ptbThreeToFour": 5,
                                "ptbFourToFive": 4,
                                "ptbFivePlus": 1,
                                "offsidePenalties": 1,
                                "stint1": 4800
                            },
                            "playerTookTheField": true,
                            "shirtNum": 1,
                            "playerFirstInitial": "J",
                            "playerPositionAbbrev": "FB",
                            "onTheField": true,
                            "fantasyPrice": 409000,
                            "fantasySeasonPriceChange": -73000
                        },
                        {
                            "playerFirstName": "David",
                            "playerId": 500658,
                            "playerLastName": "Nofoaluma",
                            "playerName": "David Nofoaluma",
                            "playerPosition": "Winger 1",
                            "playerPositionId": 500002,
                            "playerStats": {
                                "allRunMetres": 112,
                                "allRuns": 13,
                                "bombKicksDefused": 1,
                                "dummyHalfRuns": 3,
                                "errors": 1,
                                "fantasyPointsTotal": 58,
                                "ineffectiveTackles": 2,
                                "kickReturnMetres": 10,
                                "kickReturns": 2,
                                "kicks": 1,
                                "kicksDefused": 2,
                                "linebreaks": 2,
                                "mins": 80,
                                "missedTackles": 2,
                                "offloads": 1,
                                "passes": 6,
                                "passesPerRun": 0.46,
                                "oneOnOneTackles": 1,
                                "points": 4,
                                "supports": 7,
                                "tackleBreaks": 6,
                                "tackles": 10,
                                "tries": 1,
                                "tryAssists": 1,
                                "tryCause": 1,
                                "evasionRuns": 8,
                                "evasionRunMetres": 86,
                                "dummyHalfRunMetres": 16,
                                "ptbAll": 8,
                                "receipts": 20,
                                "grubberKick": 1,
                                "postContactMetres": 15,
                                "ptbTwoToThree": 2,
                                "ptbThreeToFour": 4,
                                "ptbFourToFive": 2,
                                "doubles": 1,
                                "effectiveTacklePercentage": 71.4,
                                "stint1": 4800
                            },
                            "playerTookTheField": true,
                            "shirtNum": 2,
                            "playerFirstInitial": "D",
                            "playerPositionAbbrev": "WG",
                            "onTheField": true,
                            "fantasyPrice": 362000,
                            "fantasySeasonPriceChange": 15000
                        },
                        {
                            "playerFirstName": "Tim",
                            "playerId": 500660,
                            "playerLastName": "Simona",
                            "playerName": "Tim Simona",
                            "playerPosition": "Centre 1",
                            "playerPositionId": 500003,
                            "playerStats": {
                                "allRunMetres": 98,
                                "allRuns": 9,
                                "decoys": 2,
                                "dummyHalfRuns": 1,
                                "errors": 2,
                                "fantasyPointsTotal": 26,
                                "ineffectiveTackles": 4,
                                "kicksDefused": 1,
                                "kicksNotDefused": 1,
                                "lineDropouts": 3,
                                "linebreaks": 1,
                                "mins": 80,
                                "missedTackles": 2,
                                "passes": 2,
                                "passesPerRun": 0.22,
                                "oneOnOneTackles": 2,
                                "supports": 10,
                                "tackleBreaks": 3,
                                "tackles": 11,
                                "tryCause": 1,
                                "evasionRuns": 8,
                                "evasionRunMetres": 91,
                                "dummyHalfRunMetres": 7,
                                "ptbAll": 7,
                                "receipts": 13,
                                "postContactMetres": 15,
                                "kickPressures": 1,
                                "ptbOneToTwo": 1,
                                "ptbTwoToThree": 2,
                                "ptbThreeToFour": 1,
                                "ptbFourToFive": 2,
                                "ptbFivePlus": 1,
                                "doubles": 1,
                                "effectiveTacklePercentage": 64.7,
                                "stint1": 4800
                            },
                            "playerTookTheField": true,
                            "shirtNum": 3,
                            "playerFirstInitial": "T",
                            "playerPositionAbbrev": "CT",
                            "onTheField": true,
                            "fantasyPrice": 280000
                        },
                        {
                            "playerFirstName": "Kevin",
                            "playerId": 500041,
                            "playerLastName": "Naiqama",
                            "playerName": "Kevin Naiqama",
                            "playerPosition": "Centre 2",
                            "playerPositionId": 500004,
                            "playerStats": {
                                "allRunMetres": 136,
                                "allRuns": 13,
                                "decoys": 2,
                                "dummyHalfRuns": 1,
                                "fantasyPointsTotal": 41,
                                "ineffectiveTackles": 3,
                                "kickDead": 1,
                                "kicks": 1,
                                "linebreakAssists": 1,
                                "mins": 80,
                                "missedTackles": 5,
                                "offloads": 1,
                                "passes": 3,
                                "passesPerRun": 0.23,
                                "oneOnOneTackles": 2,
                                "supports": 7,
                                "tackleBreaks": 3,
                                "tackles": 20,
                                "tryAssists": 1,
                                "tryCause": 1,
                                "evasionRuns": 12,
                                "evasionRunMetres": 136,
                                "ptbAll": 11,
                                "receipts": 17,
                                "grubberKick": 1,
                                "postContactMetres": 35,
                                "dummyPasses": 1,
                                "lineEngagedRuns": 1,
                                "ptbTwoToThree": 3,
                                "ptbThreeToFour": 6,
                                "ptbFourToFive": 2,
                                "doubles": 2,
                                "effectiveTacklePercentage": 71.4,
                                "stint1": 4800
                            },
                            "playerTookTheField": true,
                            "shirtNum": 4,
                            "playerFirstInitial": "K",
                            "playerPositionAbbrev": "CT",
                            "onTheField": true,
                            "fantasyPrice": 318000,
                            "fantasySeasonPriceChange": 80000
                        },
                        {
                            "playerFirstName": "Jordan",
                            "playerId": 502193,
                            "playerLastName": "Rankin",
                            "playerName": "Jordan Rankin",
                            "playerPosition": "Winger 2",
                            "playerPositionId": 500005,
                            "playerStats": {
                                "allRunMetres": 75,
                                "allRuns": 10,
                                "bombKicksDefused": 2,
                                "conversions": 2,
                                "conversionsAttempts": 4,
                                "conversionsMissed": 2,
                                "decoys": 2,
                                "errors": 2,
                                "fantasyPointsTotal": 12,
                                "goalConversionRate": 66.67,
                                "allGoals": 4,
                                "allGoalsMissed": 2,
                                "allGoalsAttempted": 6,
                                "ineffectiveTackles": 1,
                                "kicksDefused": 2,
                                "kicksNotDefused": 1,
                                "mins": 80,
                                "missedTackles": 3,
                                "passes": 28,
                                "passesPerRun": 2.8,
                                "penaltyGoals": 2,
                                "penaltyGoalsAttempts": 2,
                                "points": 8,
                                "supports": 6,
                                "tackles": 5,
                                "evasionRuns": 10,
                                "evasionRunMetres": 75,
                                "ptbAll": 9,
                                "receipts": 35,
                                "postContactMetres": 23,
                                "ptbTwoToThree": 1,
                                "ptbThreeToFour": 4,
                                "ptbFourToFive": 2,
                                "ptbFivePlus": 2,
                                "effectiveTacklePercentage": 55.6,
                                "stint1": 4800
                            },
                            "playerTookTheField": true,
                            "shirtNum": 5,
                            "playerFirstInitial": "J",
                            "playerPositionAbbrev": "WG",
                            "onTheField": true,
                            "fantasyPrice": 226000,
                            "fantasySeasonPriceChange": 47000
                        },
                        {
                            "playerFirstName": "Mitchell",
                            "playerId": 500485,
                            "playerLastName": "Moses",
                            "playerName": "Mitchell Moses",
                            "playerPosition": "Five-Eighth",
                            "playerPositionId": 500006,
                            "playerStats": {
                                "allRunMetres": 56,
                                "allRuns": 5,
                                "errors": 1,
                                "fantasyPointsTotal": 44,
                                "fieldGoalConversionRate": 100,
                                "fieldGoals": 1,
                                "fieldGoalsAttempts": 1,
                                "fortyTwentyKicks": 1,
                                "ineffectiveTackles": 2,
                                "kickMetres": 208,
                                "kicks": 5,
                                "linebreakAssists": 1,
                                "linebreaks": 2,
                                "mins": 80,
                                "missedTackles": 7,
                                "offloads": 1,
                                "passes": 29,
                                "passesPerRun": 5.8,
                                "oneOnOneTackles": 3,
                                "penalties": 1,
                                "points": 1,
                                "supports": 5,
                                "tackleBreaks": 2,
                                "tackles": 15,
                                "tryAssists": 1,
                                "tryCause": 1,
                                "evasionRuns": 5,
                                "evasionRunMetres": 56,
                                "ptbAll": 1,
                                "receipts": 38,
                                "forcedDropOutKicker": 1,
                                "chipKick": 1,
                                "postContactMetres": 2,
                                "dummyPasses": 1,
                                "kickPressures": 1,
                                "lineEngagedRuns": 1,
                                "ptbFourToFive": 1,
                                "doubles": 1,
                                "longKicksSpace": 2,
                                "effectiveTacklePercentage": 62.5,
                                "offsidePenalties": 1,
                                "stint1": 4800
                            },
                            "playerTookTheField": true,
                            "shirtNum": 6,
                            "playerFirstInitial": "M",
                            "playerPositionAbbrev": "FE",
                            "onTheField": true,
                            "fantasyPrice": 301000,
                            "fantasySeasonPriceChange": 11000
                        },
                        {
                            "playerFirstName": "Luke",
                            "playerId": 500646,
                            "playerLastName": "Brooks",
                            "playerName": "Luke Brooks",
                            "playerPosition": "Halfback",
                            "playerPositionId": 500007,
                            "playerStats": {
                                "allRunMetres": 103,
                                "allRuns": 11,
                                "bombKicks": 1,
                                "bombKickMetres": 25,
                                "errors": 1,
                                "fantasyPointsTotal": 33,
                                "intercepts": 2,
                                "kickMetres": 205,
                                "kicks": 7,
                                "kicksNotDefused": 2,
                                "linebreaks": 1,
                                "mins": 80,
                                "missedTackles": 10,
                                "offloads": 2,
                                "passes": 25,
                                "passesPerRun": 2.27,
                                "oneOnOneTackles": 4,
                                "penalties": 1,
                                "points": 4,
                                "supports": 9,
                                "tackleBreaks": 3,
                                "tackles": 12,
                                "tries": 1,
                                "tryCause": 1,
                                "evasionRuns": 11,
                                "evasionRunMetres": 103,
                                "ptbAll": 3,
                                "receipts": 40,
                                "chipKick": 2,
                                "postContactMetres": 15,
                                "dummyPasses": 5,
                                "kickPressures": 2,
                                "lineEngagedRuns": 3,
                                "ptbThreeToFour": 2,
                                "ptbFourToFive": 1,
                                "doubles": 1,
                                "longKicksSpace": 1,
                                "effectiveTacklePercentage": 54.5,
                                "foulPlayPenalties": 1,
                                "stint1": 4800
                            },
                            "playerTookTheField": true,
                            "shirtNum": 7,
                            "playerFirstInitial": "L",
                            "playerPositionAbbrev": "HB",
                            "onTheField": true,
                            "fantasyPrice": 314000,
                            "fantasySeasonPriceChange": 16000
                        },
                        {
                            "playerFirstName": "Aaron",
                            "playerId": 500665,
                            "playerLastName": "Woods",
                            "playerName": "Aaron Woods",
                            "playerPosition": "Prop 1",
                            "playerPositionId": 500008,
                            "playerStats": {
                                "allRunMetres": 183,
                                "allRuns": 22,
                                "decoys": 1,
                                "fantasyPointsTotal": 62,
                                "hitUps": 19,
                                "ineffectiveTackles": 2,
                                "kickReturnMetres": 22,
                                "kickReturns": 2,
                                "mins": 65,
                                "missedTackles": 1,
                                "offloads": 4,
                                "passes": 7,
                                "passesPerRun": 0.32,
                                "oneOnOneTackles": 1,
                                "supports": 1,
                                "tackleBreaks": 1,
                                "tackles": 35,
                                "hitupRunMeters": 161,
                                "evasionRuns": 1,
                                "ptbAll": 16,
                                "receipts": 27,
                                "postContactMetres": 59,
                                "dummyPasses": 3,
                                "kickPressures": 1,
                                "lineEngagedRuns": 2,
                                "ptbOneToTwo": 2,
                                "ptbTwoToThree": 5,
                                "ptbThreeToFour": 4,
                                "ptbFourToFive": 5,
                                "doubles": 6,
                                "effectiveTacklePercentage": 92.1,
                                "stint1": 2837,
                                "stint2": 1067
                            },
                            "playerTookTheField": true,
                            "shirtNum": 8,
                            "playerFirstInitial": "A",
                            "playerPositionAbbrev": "PR",
                            "onTheField": true,
                            "fantasyPrice": 388000,
                            "fantasySeasonPriceChange": -52000
                        },
                        {
                            "playerFirstName": "Dene",
                            "playerId": 500959,
                            "playerLastName": "Halatau",
                            "playerName": "Dene Halatau",
                            "playerPosition": "Hooker",
                            "playerPositionId": 500009,
                            "playerStats": {
                                "allRunMetres": 59,
                                "allRuns": 5,
                                "dummyHalfRuns": 4,
                                "fantasyPointsTotal": 40,
                                "ineffectiveTackles": 4,
                                "kickReturnMetres": 5,
                                "kickReturns": 1,
                                "mins": 58,
                                "passes": 66,
                                "passesPerRun": 13.2,
                                "oneOnOneTackles": 4,
                                "tackleBreaks": 2,
                                "tackles": 29,
                                "dummyHalfRunMetres": 54,
                                "ptbAll": 4,
                                "receipts": 68,
                                "postContactMetres": 24,
                                "ptbTwoToThree": 1,
                                "ptbThreeToFour": 3,
                                "effectiveTacklePercentage": 87.9,
                                "stint1": 2836,
                                "stint2": 634
                            },
                            "playerTookTheField": true,
                            "shirtNum": 9,
                            "playerFirstInitial": "D",
                            "playerPositionAbbrev": "HK",
                            "onTheField": true,
                            "fantasyPrice": 173000,
                            "fantasySeasonPriceChange": -65000
                        },
                        {
                            "playerFirstName": "Sauaso",
                            "playerId": 500662,
                            "playerLastName": "Sue",
                            "playerName": "Sauaso Sue",
                            "playerPosition": "Prop 2",
                            "playerPositionId": 500010,
                            "playerStats": {
                                "allRunMetres": 125,
                                "allRuns": 12,
                                "decoys": 2,
                                "fantasyPointsTotal": 32,
                                "hitUps": 11,
                                "ineffectiveTackles": 2,
                                "kickReturnMetres": 9,
                                "kickReturns": 1,
                                "mins": 44,
                                "missedTackles": 2,
                                "offloads": 1,
                                "passes": 1,
                                "passesPerRun": 0.08,
                                "penalties": 1,
                                "supports": 3,
                                "tackleBreaks": 1,
                                "tackles": 21,
                                "hitupRunMeters": 116,
                                "ptbAll": 11,
                                "receipts": 13,
                                "postContactMetres": 49,
                                "kickPressures": 1,
                                "ptbOneToTwo": 1,
                                "ptbTwoToThree": 2,
                                "ptbThreeToFour": 4,
                                "ptbFourToFive": 4,
                                "doubles": 4,
                                "effectiveTacklePercentage": 84,
                                "generalPlayPenalties": 1,
                                "stint1": 1317,
                                "stint2": 896,
                                "stint3": 398
                            },
                            "playerTookTheField": true,
                            "shirtNum": 10,
                            "playerFirstInitial": "S",
                            "playerPositionAbbrev": "PR",
                            "onTheField": true,
                            "fantasyPrice": 302000,
                            "fantasySeasonPriceChange": -23000
                        },
                        {
                            "playerFirstName": "Josh",
                            "playerId": 500882,
                            "playerLastName": "Aloiai",
                            "playerName": "Josh Aloiai",
                            "playerPosition": "2nd Row 1",
                            "playerPositionId": 500011,
                            "playerStats": {
                                "allRunMetres": 107,
                                "allRuns": 13,
                                "fantasyPointsTotal": 62,
                                "hitUps": 13,
                                "ineffectiveTackles": 1,
                                "linebreakAssists": 1,
                                "linebreaks": 1,
                                "mins": 74,
                                "offloads": 2,
                                "passes": 1,
                                "passesPerRun": 0.08,
                                "oneOnOneTackles": 2,
                                "points": 4,
                                "supports": 5,
                                "tackleBreaks": 2,
                                "tackles": 28,
                                "tries": 1,
                                "hitupRunMeters": 107,
                                "ptbAll": 10,
                                "receipts": 14,
                                "postContactMetres": 38,
                                "ptbTwoToThree": 3,
                                "ptbThreeToFour": 7,
                                "doubles": 4,
                                "effectiveTacklePercentage": 96.6,
                                "stint1": 4166,
                                "stint2": 267
                            },
                            "playerTookTheField": true,
                            "shirtNum": 11,
                            "playerFirstInitial": "J",
                            "playerPositionAbbrev": "2R",
                            "onTheField": true,
                            "fantasyPrice": 168000,
                            "fantasySeasonPriceChange": 38000
                        },
                        {
                            "playerFirstName": "Chris",
                            "playerId": 500654,
                            "playerLastName": "Lawrence",
                            "playerName": "Chris Lawrence",
                            "playerPosition": "2nd Row 2",
                            "playerPositionId": 500012,
                            "playerStats": {
                                "allRunMetres": 61,
                                "allRuns": 6,
                                "decoys": 5,
                                "fantasyPointsTotal": 11,
                                "hitUps": 6,
                                "ineffectiveTackles": 1,
                                "mins": 40,
                                "missedTackles": 1,
                                "passes": 3,
                                "passesPerRun": 0.5,
                                "oneOnOneTackles": 1,
                                "penalties": 1,
                                "supports": 3,
                                "tackles": 9,
                                "hitupRunMeters": 61,
                                "ptbAll": 4,
                                "receipts": 9,
                                "postContactMetres": 24,
                                "ptbThreeToFour": 2,
                                "ptbFourToFive": 1,
                                "ptbFivePlus": 1,
                                "doubles": 1,
                                "effectiveTacklePercentage": 81.8,
                                "ptbPenalties": 1,
                                "stint1": 2403
                            },
                            "playerTookTheField": true,
                            "shirtNum": 12,
                            "playerFirstInitial": "C",
                            "playerPositionAbbrev": "2R",
                            "fantasyPrice": 353000,
                            "fantasySeasonPriceChange": 74000
                        },
                        {
                            "playerFirstName": "Elijah",
                            "playerId": 500970,
                            "playerLastName": "Taylor",
                            "playerName": "Elijah Taylor",
                            "playerPosition": "Lock",
                            "playerPositionId": 500013,
                            "playerStats": {
                                "allRunMetres": 25,
                                "allRuns": 2,
                                "decoys": 1,
                                "fantasyPointsTotal": 41,
                                "hitUps": 2,
                                "ineffectiveTackles": 3,
                                "mins": 76,
                                "missedTackles": 4,
                                "passes": 13,
                                "passesPerRun": 6.5,
                                "supports": 9,
                                "tackles": 47,
                                "hitupRunMeters": 25,
                                "ptbAll": 2,
                                "receipts": 15,
                                "postContactMetres": 14,
                                "kickPressures": 2,
                                "ptbThreeToFour": 2,
                                "doubles": 7,
                                "effectiveTacklePercentage": 87,
                                "stint1": 4533
                            },
                            "playerTookTheField": true,
                            "shirtNum": 13,
                            "playerFirstInitial": "E",
                            "playerPositionAbbrev": "LK",
                            "fantasyPrice": 396000,
                            "fantasySeasonPriceChange": -45000
                        },
                        {
                            "playerFirstName": "Tim",
                            "playerId": 500347,
                            "playerLastName": "Grant",
                            "playerName": "Tim Grant",
                            "playerPosition": "Interchange",
                            "playerPositionId": 500014,
                            "playerStats": {
                                "allRunMetres": 15,
                                "allRuns": 2,
                                "fantasyPointsTotal": 1,
                                "hitUps": 2,
                                "mins": 1,
                                "hitupRunMeters": 15,
                                "ptbAll": 1,
                                "receipts": 2,
                                "postContactMetres": 4,
                                "ptbThreeToFour": 1,
                                "stint1": 73
                            },
                            "playerTookTheField": true,
                            "shirtNum": 14,
                            "playerFirstInitial": "T",
                            "playerPositionAbbrev": "INT",
                            "fantasyPrice": 304000,
                            "fantasySeasonPriceChange": 22000
                        },
                        {
                            "playerFirstName": "Ava",
                            "playerId": 500659,
                            "playerLastName": "Seumanufagai",
                            "playerName": "Ava Seumanufagai",
                            "playerPosition": "Interchange",
                            "playerPositionId": 500014,
                            "playerStats": {
                                "allRunMetres": 145,
                                "allRuns": 14,
                                "fantasyPointsTotal": 39,
                                "hitUps": 10,
                                "ineffectiveTackles": 1,
                                "kickReturnMetres": 48,
                                "kickReturns": 4,
                                "mins": 50,
                                "missedTackles": 1,
                                "passes": 1,
                                "passesPerRun": 0.07,
                                "penalties": 1,
                                "supports": 1,
                                "tackles": 29,
                                "hitupRunMeters": 97,
                                "ptbAll": 13,
                                "receipts": 16,
                                "postContactMetres": 47,
                                "ptbTwoToThree": 3,
                                "ptbThreeToFour": 8,
                                "ptbFourToFive": 2,
                                "doubles": 7,
                                "effectiveTacklePercentage": 93.5,
                                "offsidePenalties": 1,
                                "stint1": 3012
                            },
                            "playerTookTheField": true,
                            "shirtNum": 15,
                            "playerFirstInitial": "A",
                            "playerPositionAbbrev": "INT",
                            "fantasyPrice": 285000,
                            "fantasySeasonPriceChange": 15000
                        },
                        {
                            "playerFirstName": "Kyle",
                            "playerId": 500480,
                            "playerLastName": "Lovett",
                            "playerName": "Kyle Lovett",
                            "playerPosition": "Interchange",
                            "playerPositionId": 500014,
                            "playerStats": {
                                "allRunMetres": 50,
                                "allRuns": 7,
                                "decoys": 3,
                                "dummyHalfRuns": 1,
                                "errors": 1,
                                "fantasyPointsTotal": 7,
                                "hitUps": 6,
                                "ineffectiveTackles": 1,
                                "mins": 40,
                                "missedTackles": 3,
                                "oneOnOneTackles": 1,
                                "penalties": 1,
                                "supports": 1,
                                "tackles": 12,
                                "tryCause": 1,
                                "hitupRunMeters": 49,
                                "dummyHalfRunMetres": 1,
                                "ptbAll": 6,
                                "receipts": 7,
                                "postContactMetres": 13,
                                "dummyPasses": 1,
                                "ptbTwoToThree": 2,
                                "ptbThreeToFour": 4,
                                "doubles": 1,
                                "effectiveTacklePercentage": 75,
                                "ptbPenalties": 1,
                                "stint1": 2397
                            },
                            "playerTookTheField": true,
                            "shirtNum": 17,
                            "playerFirstInitial": "K",
                            "playerPositionAbbrev": "INT",
                            "onTheField": true,
                            "fantasyPrice": 323000,
                            "fantasySeasonPriceChange": -9000
                        },
                        {
                            "playerFirstName": "Joel",
                            "playerId": 500315,
                            "playerLastName": "Edwards",
                            "playerName": "Joel Edwards",
                            "playerPosition": "Interchange",
                            "playerPositionId": 500014,
                            "playerStats": {
                                "allRunMetres": 34,
                                "allRuns": 4,
                                "fantasyPointsTotal": 19,
                                "hitUps": 4,
                                "ineffectiveTackles": 1,
                                "mins": 33,
                                "missedTackles": 2,
                                "oneOnOneTackles": 2,
                                "supports": 5,
                                "tackles": 20,
                                "hitupRunMeters": 34,
                                "ptbAll": 3,
                                "receipts": 4,
                                "postContactMetres": 19,
                                "ptbTwoToThree": 1,
                                "ptbThreeToFour": 2,
                                "doubles": 5,
                                "effectiveTacklePercentage": 87,
                                "stint1": 1962
                            },
                            "playerTookTheField": true,
                            "shirtNum": 18,
                            "playerFirstInitial": "J",
                            "playerPositionAbbrev": "INT",
                            "onTheField": true,
                            "fantasyPrice": 163000,
                            "fantasySeasonPriceChange": -7000
                        }
                    ]
                },
                "teamName": "Wests Tigers",
                "teamNickName": "Wests Tigers",
                "teamStats": {
                    "allRunMetres": 1562,
                    "allRuns": 165,
                    "bombKicks": 1,
                    "bombKickMetres": 25,
                    "bombKicksDefused": 4,
                    "completeSets": 32,
                    "completionPercentage": 78,
                    "conversions": 2,
                    "conversionsAttempts": 4,
                    "conversionsMissed": 2,
                    "decoys": 18,
                    "dummyHalfRuns": 11,
                    "errors": 10,
                    "fieldGoalConversionRate": 100,
                    "fieldGoals": 1,
                    "fieldGoalsAttempts": 1,
                    "fortyTwentyKicks": 1,
                    "goalConversionRate": 66.67,
                    "allGoals": 4,
                    "allGoalsAttempted": 6,
                    "allGoalsMissed": 2,
                    "hitUps": 73,
                    "incompleteSets": 9,
                    "ineffectiveTackles": 30,
                    "interceptedPass": 1,
                    "intercepts": 2,
                    "kickDead": 1,
                    "kickMetres": 440,
                    "kickReturnMetres": 140,
                    "kickReturns": 17,
                    "kicks": 15,
                    "kicksDefused": 8,
                    "kicksNotDefused": 4,
                    "lineDropouts": 3,
                    "linebreakAssists": 3,
                    "linebreaks": 7,
                    "missedTackles": 46,
                    "offloads": 12,
                    "oneOnOneTackles": 23,
                    "passes": 191,
                    "passesPerRun": 1.16,
                    "penalties": 7,
                    "penaltyGoals": 2,
                    "penaltyGoalsAttempts": 2,
                    "points": 25,
                    "pointsConceded": 12,
                    "possession": 47,
                    "scrumWins": 5,
                    "supports": 79,
                    "tackleBreaks": 27,
                    "tackles": 303,
                    "sets": 41,
                    "tries": 4,
                    "triesConceded": 2,
                    "tryAssists": 3,
                    "tryCause": 6,
                    "hitupRunMeters": 665,
                    "evasionRuns": 64,
                    "evasionRunMetres": 670,
                    "dummyHalfRunMetres": 87,
                    "ptbTotal": 120,
                    "twoManTackles": 56,
                    "threeManTackles": 57,
                    "fourManPlusTackles": 4,
                    "tryScoringPercentage": 12.5,
                    "shiftsLeft": 8,
                    "shiftsRight": 9,
                    "receipts": 359,
                    "forcedDropOutKicker": 1,
                    "chipKick": 4,
                    "grubberKick": 2,
                    "postContactMetres": 413,
                    "dummyPasses": 12,
                    "kickPressures": 8,
                    "lineEngagedRuns": 8,
                    "ptbOneToTwo": 4,
                    "ptbTwoToThree": 26,
                    "ptbThreeToFour": 59,
                    "ptbFourToFive": 26,
                    "ptbFivePlus": 5,
                    "interchangeUsed": 7,
                    "interchangeLeft": 1,
                    "doubles": 41,
                    "longKicksSpace": 3,
                    "effectiveTacklePercentage": 79.9,
                    "ptbPenalties": 2,
                    "generalPlayPenalties": 1,
                    "foulPlayPenalties": 1,
                    "offsidePenalties": 3,
                    "averageSetDistance": 38.1,
                    "completeSets1stHalf": 17,
                    "completeSets2ndHalf": 15,
                    "completionPercentage1stHalf": 73.91,
                    "completionPercentage2ndHalf": 83.33,
                    "incompleteSets1stHalf": 6,
                    "incompleteSets2ndHalf": 3,
                    "incompletionPercentage1stHalf": 26.09,
                    "incompletionPercentage2ndHalf": 16.67
                },
                "teamHexColour": "ff7f00",
                "teamHexColour2": "000000"
            }
        ]
    }
}