{
    "competitionId": 111,
    "competitionName": "NRL Telstra Premiership",
    "gameId": 20151111740,
    "gameInfo": {
        "assistantReferee1Id": 500028,
        "numberOfPeriods": 2,
        "assistantReferee1Name": "Steve Carrall",
        "assistantReferee2Id": 500068,
        "assistantReferee2Name": "Chris Sutton",
        "gameDate": "2015-07-06",
        "gameHashTag": "#NRLTigersEels",
        "gameNumber": 4,
        "gameSeconds": 4800,
        "gameMinutes": "80:00",
        "gameTime": "1:20:00",
        "groundConditionId": 1,
        "groundConditionName": "N/A",
        "referee1Id": 500008,
        "referee1Name": "Gavin Badger",
        "referee2Id": 500009,
        "referee2Name": "Alan Shortall",
        "startTime": "2015-07-06T19:00:00",
        "startTimeUTC": "2015-07-06T09:00:00Z",
        "venueId": 500002,
        "venueName": "ANZ Stadium",
        "videoReferee1Id": 500017,
        "videoReferee1Name": "Luke Phillips",
        "videoReferee2Id": 500030,
        "videoReferee2Name": "Steve Clark"
    },
    "gameState": "Final",
    "gameStateId": 8,
    "roundId": 17,
    "seasonId": 2015,
    "teams": {
        "teamsMatch": [
            {
                "isHomeTeam": true,
                "score": {
                    "conversions": 1,
                    "points": 16,
                    "penaltyGoals": 1,
                    "tries": 3
                },
                "team1stHalfScore": 16,
                "team2ndHalfScore": 0,
                "teamAbbr": "WST",
                "teamFinalScore": 16,
                "teamFullTimeScore": 16,
                "teamHalfTimeScore": 16,
                "teamId": 500023,
                "teamLineup": {
                    "injuriesAndSuspensions": {
                        "injury": [
                            {
                                "injuryDescription": "Jaw, TBA",
                                "playerFirstName": "Chance",
                                "playerId": "500556",
                                "playerLastName": "Peni",
                                "playerName": "Chance Peni"
                            },
                            {
                                "injuryDescription": "Finger, Indefinite",
                                "playerFirstName": "Josh",
                                "playerId": "500620",
                                "playerLastName": "Drinkwater",
                                "playerName": "Josh Drinkwater"
                            },
                            {
                                "injuryDescription": "Knee, Round 22",
                                "playerFirstName": "David",
                                "playerId": "500658",
                                "playerLastName": "Nofoaluma",
                                "playerName": "David Nofoaluma"
                            },
                            {
                                "injuryDescription": "Neck, Indefinite",
                                "playerFirstName": "Curtis",
                                "playerId": "500661",
                                "playerLastName": "Sironen",
                                "playerName": "Curtis Sironen"
                            },
                            {
                                "injuryDescription": "Neck, Indefinite",
                                "playerFirstName": "Keith",
                                "playerId": "501283",
                                "playerLastName": "Lulia",
                                "playerName": "Keith Lulia"
                            },
                            {
                                "injuryDescription": "Ankle, Round 14",
                                "playerFirstName": "Asipeli",
                                "playerId": "501373",
                                "playerLastName": "Fine",
                                "playerName": "Asipeli Fine"
                            },
                            {
                                "injuryDescription": "AC Joint, Round 17",
                                "playerFirstName": "Tim",
                                "playerId": "500656",
                                "playerLastName": "Moltzen",
                                "playerName": "Tim Moltzen"
                            }
                        ],
                        "suspension": [
                            {
                                "playerFirstName": "Tim",
                                "playerId": 500656,
                                "playerLastName": "Moltzen",
                                "playerName": "Tim Moltzen",
                                "suspensionDescription": "AC Joint, Round 17"
                            }
                        ]
                    },
                    "insAndOuts": {
                        "inOut": [
                            {
                                "inOut": "Out",
                                "playerFirstName": "Aaron",
                                "playerId": "500665",
                                "playerLastName": "Woods",
                                "playerName": "Aaron Woods"
                            },
                            {
                                "inOut": "In",
                                "playerFirstName": "Dene",
                                "playerId": "500959",
                                "playerLastName": "Halatau",
                                "playerName": "Dene Halatau"
                            },
                            {
                                "inOut": "In",
                                "playerFirstName": "Jack",
                                "playerId": "500648",
                                "playerLastName": "Buchanan",
                                "playerName": "Jack Buchanan"
                            },
                            {
                                "inOut": "In",
                                "playerFirstName": "Josh",
                                "playerId": "500620",
                                "playerLastName": "Drinkwater",
                                "playerName": "Josh Drinkwater"
                            },
                            {
                                "inOut": "Out",
                                "playerFirstName": "Luke",
                                "playerId": "500646",
                                "playerLastName": "Brooks",
                                "playerName": "Luke Brooks"
                            },
                            {
                                "inOut": "In",
                                "playerFirstName": "Manaia",
                                "playerId": "500472",
                                "playerLastName": "Cherrington",
                                "playerName": "Manaia Cherrington"
                            },
                            {
                                "inOut": "Out",
                                "playerFirstName": "Matthew",
                                "playerId": "500600",
                                "playerLastName": "Lodge",
                                "playerName": "Matthew Lodge"
                            },
                            {
                                "inOut": "In",
                                "playerFirstName": "Nathan",
                                "playerId": "500484",
                                "playerLastName": "Milone",
                                "playerName": "Nathan Milone"
                            },
                            {
                                "inOut": "Out",
                                "playerFirstName": "Robbie",
                                "playerId": "500649",
                                "playerLastName": "Farah",
                                "playerName": "Robbie Farah"
                            },
                            {
                                "inOut": "Out",
                                "playerFirstName": "Tim",
                                "playerId": "500660",
                                "playerLastName": "Simona",
                                "playerName": "Tim Simona"
                            }
                        ]
                    },
                    "teamPlayer": [
                        {
                            "playerFirstName": "James",
                            "playerId": 500663,
                            "playerLastName": "Tedesco",
                            "playerName": "James Tedesco",
                            "playerPosition": "Fullback",
                            "playerPositionId": 500001,
                            "playerStats": {
                                "allRunMetres": 222,
                                "allRuns": 17,
                                "bombKicksNotDefused": 1,
                                "decoys": 9,
                                "dummyHalfRuns": 3,
                                "fantasyPointsTotal": 78,
                                "kickMetres": 40,
                                "kickReturnMetres": 36,
                                "kickReturns": 4,
                                "kicks": 2,
                                "kicksDefused": 2,
                                "kicksNotDefused": 1,
                                "linebreaks": 1,
                                "mins": 80,
                                "missedTackles": 2,
                                "offloads": 3,
                                "penalties": 1,
                                "supports": 6,
                                "tackleBreaks": 14,
                                "tackles": 1,
                                "tryAssists": 1,
                                "tryCause": 3,
                                "evasionRuns": 10,
                                "evasionRunMetres": 128,
                                "dummyHalfRunMetres": 58,
                                "ptbFast": 8.33,
                                "ptbNeutral": 83.33,
                                "ptbSlow": 8.33,
                                "ptbAll": 12
                            },
                            "playerTookTheField": true,
                            "shirtNum": 1
                        },
                        {
                            "playerFirstName": "Kevin",
                            "playerId": 500041,
                            "playerLastName": "Naiqama",
                            "playerName": "Kevin Naiqama",
                            "playerPosition": "Winger 1",
                            "playerPositionId": 500002,
                            "playerStats": {
                                "allRunMetres": 97,
                                "allRuns": 11,
                                "bombKicksNotDefused": 2,
                                "errors": 2,
                                "fantasyPointsTotal": 40,
                                "ineffectiveTackles": 1,
                                "kickReturnMetres": 16,
                                "kickReturns": 2,
                                "kicksDefused": 1,
                                "kicksNotDefused": 2,
                                "linebreaks": 1,
                                "mins": 80,
                                "points": 8,
                                "supports": 8,
                                "tackleBreaks": 3,
                                "tackles": 5,
                                "tries": 2,
                                "tryCause": 4,
                                "evasionRuns": 9,
                                "evasionRunMetres": 81,
                                "ptbFast": 12.5,
                                "ptbNeutral": 87.5,
                                "ptbAll": 8
                            },
                            "playerTookTheField": true,
                            "shirtNum": 2
                        },
                        {
                            "playerFirstName": "Delouise",
                            "playerId": 500478,
                            "playerLastName": "Hoeter",
                            "playerName": "Delouise Hoeter",
                            "playerPosition": "Centre 1",
                            "playerPositionId": 500003,
                            "playerStats": {
                                "allRunMetres": 51,
                                "allRuns": 7,
                                "fantasyPointsTotal": 34,
                                "ineffectiveTackles": 3,
                                "mins": 74,
                                "missedTackles": 2,
                                "oneOnOneTackles": 2,
                                "penalties": 1,
                                "supports": 13,
                                "tackleBreaks": 2,
                                "tackles": 29,
                                "tryCause": 1,
                                "evasionRuns": 7,
                                "evasionRunMetres": 51,
                                "ptbNeutral": 100,
                                "ptbAll": 5
                            },
                            "playerTookTheField": true,
                            "shirtNum": 3
                        },
                        {
                            "playerFirstName": "Nathan",
                            "playerId": 500484,
                            "playerLastName": "Milone",
                            "playerName": "Nathan Milone",
                            "playerPosition": "Centre 2",
                            "playerPositionId": 500004,
                            "playerStats": {
                                "allRunMetres": 94,
                                "allRuns": 11,
                                "fantasyPointsTotal": 29,
                                "kickMetres": 2,
                                "kicks": 1,
                                "mins": 80,
                                "missedTackles": 1,
                                "oneOnOneTackles": 1,
                                "supports": 10,
                                "tackleBreaks": 2,
                                "tackles": 16,
                                "evasionRuns": 11,
                                "evasionRunMetres": 94,
                                "ptbFast": 9.09,
                                "ptbNeutral": 90.91,
                                "ptbAll": 11
                            },
                            "playerTookTheField": true,
                            "shirtNum": 4
                        },
                        {
                            "playerFirstName": "Pat",
                            "playerId": 501284,
                            "playerLastName": "Richards",
                            "playerName": "Pat Richards",
                            "playerPosition": "Winger 2",
                            "playerPositionId": 500005,
                            "playerStats": {
                                "allRunMetres": 117,
                                "allRuns": 13,
                                "conversions": 1,
                                "conversionsAttempts": 3,
                                "conversionsMissed": 2,
                                "fantasyPointsTotal": 38,
                                "goalConversionRate": 50,
                                "allGoals": 2,
                                "allGoalsMissed": 2,
                                "allGoalsAttempted": 4,
                                "kickMetres": 7,
                                "kickReturnMetres": 8,
                                "kickReturns": 1,
                                "kicks": 1,
                                "kicksDefused": 1,
                                "lineDropouts": 1,
                                "linebreaks": 1,
                                "mins": 80,
                                "offloads": 2,
                                "oneOnOneTackles": 1,
                                "penalties": 1,
                                "penaltyGoals": 1,
                                "penaltyGoalsAttempts": 1,
                                "points": 8,
                                "supports": 8,
                                "tackles": 8,
                                "tries": 1,
                                "evasionRuns": 12,
                                "evasionRunMetres": 109,
                                "ptbNeutral": 100,
                                "ptbAll": 9
                            },
                            "playerTookTheField": true,
                            "shirtNum": 5
                        },
                        {
                            "playerFirstName": "Mitchell",
                            "playerId": 500485,
                            "playerLastName": "Moses",
                            "playerName": "Mitchell Moses",
                            "playerPosition": "Five-eighth",
                            "playerPositionId": 500006,
                            "playerStats": {
                                "allRunMetres": 76,
                                "allRuns": 7,
                                "bombKicksDefused": 1,
                                "dummyHalfRuns": 1,
                                "fantasyPointsTotal": 57,
                                "ineffectiveTackles": 2,
                                "kickMetres": 280,
                                "kickReturnMetres": 4,
                                "kickReturns": 1,
                                "kicks": 6,
                                "kicksDefused": 1,
                                "linebreakAssists": 1,
                                "linebreaks": 1,
                                "mins": 80,
                                "missedTackles": 2,
                                "oneOnOneTackles": 2,
                                "penalties": 1,
                                "supports": 8,
                                "tackleBreaks": 4,
                                "tackles": 23,
                                "tryCause": 1,
                                "evasionRuns": 5,
                                "evasionRunMetres": 65,
                                "dummyHalfRunMetres": 7,
                                "ptbNeutral": 66.67,
                                "ptbSlow": 33.33,
                                "ptbAll": 3
                            },
                            "playerTookTheField": true,
                            "shirtNum": 6
                        },
                        {
                            "playerFirstName": "Josh",
                            "playerId": 500620,
                            "playerLastName": "Drinkwater",
                            "playerName": "Josh Drinkwater",
                            "playerPosition": "Halfback",
                            "playerPositionId": 500007,
                            "playerStats": {
                                "bombKicks": 2,
                                "bombKickMetres": 66,
                                "chargedDown": 1,
                                "errors": 2,
                                "fantasyPointsTotal": 31,
                                "ineffectiveTackles": 1,
                                "kickMetres": 148,
                                "kicks": 7,
                                "linebreakAssists": 1,
                                "mins": 80,
                                "missedTackles": 2,
                                "oneOnOneTackles": 1,
                                "supports": 16,
                                "tackles": 25,
                                "tryAssists": 1
                            },
                            "playerTookTheField": true,
                            "shirtNum": 20
                        },
                        {
                            "playerFirstName": "Sauaso",
                            "playerId": 500662,
                            "playerLastName": "Sue",
                            "playerName": "Sauaso Sue",
                            "playerPosition": "Prop 1",
                            "playerPositionId": 500008,
                            "playerStats": {
                                "allRunMetres": 115,
                                "allRuns": 13,
                                "decoys": 2,
                                "errors": 1,
                                "fantasyPointsTotal": 42,
                                "hitUps": 12,
                                "ineffectiveTackles": 2,
                                "kickReturnMetres": 14,
                                "kickReturns": 1,
                                "mins": 57,
                                "offloads": 2,
                                "oneOnOneTackles": 1,
                                "supports": 3,
                                "tackles": 29,
                                "hitupRunMeters": 101,
                                "ptbFast": 10,
                                "ptbNeutral": 80,
                                "ptbSlow": 10,
                                "ptbAll": 10
                            },
                            "playerTookTheField": true,
                            "shirtNum": 8
                        },
                        {
                            "playerFirstName": "Dene",
                            "playerId": 500959,
                            "playerLastName": "Halatau",
                            "playerName": "Dene Halatau",
                            "playerPosition": "Hooker",
                            "playerPositionId": 500009,
                            "playerStats": {
                                "allRunMetres": 60,
                                "allRuns": 6,
                                "chargeDowns": 1,
                                "decoys": 1,
                                "dummyHalfRuns": 4,
                                "fantasyPointsTotal": 37,
                                "hitUps": 2,
                                "ineffectiveTackles": 2,
                                "mins": 59,
                                "supports": 4,
                                "tackles": 31,
                                "hitupRunMeters": 21,
                                "dummyHalfRunMetres": 39,
                                "ptbNeutral": 100,
                                "ptbAll": 5
                            },
                            "playerTookTheField": true,
                            "shirtNum": 9
                        },
                        {
                            "playerFirstName": "Keith",
                            "playerId": 500652,
                            "playerLastName": "Galloway",
                            "playerName": "Keith Galloway",
                            "playerPosition": "Prop 2",
                            "playerPositionId": 500010,
                            "playerStats": {
                                "allRunMetres": 81,
                                "allRuns": 8,
                                "decoys": 1,
                                "fantasyPointsTotal": 31,
                                "hitUps": 8,
                                "ineffectiveTackles": 2,
                                "linebreakAssists": 1,
                                "mins": 49,
                                "penalties": 2,
                                "supports": 5,
                                "tackles": 25,
                                "tryCause": 1,
                                "hitupRunMeters": 81,
                                "ptbNeutral": 75,
                                "ptbSlow": 25,
                                "ptbAll": 8
                            },
                            "playerTookTheField": true,
                            "shirtNum": 10
                        },
                        {
                            "playerFirstName": "Kyle",
                            "playerId": 500480,
                            "playerLastName": "Lovett",
                            "playerName": "Kyle Lovett",
                            "playerPosition": "2nd Row 1",
                            "playerPositionId": 500011,
                            "playerStats": {
                                "allRunMetres": 95,
                                "allRuns": 11,
                                "decoys": 7,
                                "errors": 1,
                                "fantasyPointsTotal": 46,
                                "hitUps": 11,
                                "ineffectiveTackles": 4,
                                "mins": 80,
                                "missedTackles": 2,
                                "oneOnOneSteal": 1,
                                "oneOnOneTackles": 1,
                                "penalties": 1,
                                "supports": 6,
                                "tackles": 45,
                                "tryCause": 2,
                                "hitupRunMeters": 95,
                                "ptbFast": 10,
                                "ptbNeutral": 90,
                                "ptbAll": 10
                            },
                            "playerTookTheField": true,
                            "shirtNum": 11
                        },
                        {
                            "playerFirstName": "Chris",
                            "playerId": 500654,
                            "playerLastName": "Lawrence",
                            "playerName": "Chris Lawrence",
                            "playerPosition": "2nd Row 2",
                            "playerPositionId": 500012,
                            "playerStats": {
                                "allRunMetres": 77,
                                "allRuns": 8,
                                "decoys": 5,
                                "dummyHalfRuns": 1,
                                "fantasyPointsTotal": 37,
                                "hitUps": 7,
                                "ineffectiveTackles": 1,
                                "mins": 80,
                                "missedTackles": 2,
                                "oneOnOneTackles": 1,
                                "supports": 8,
                                "tackles": 34,
                                "hitupRunMeters": 63,
                                "dummyHalfRunMetres": 14,
                                "ptbFast": 14.29,
                                "ptbNeutral": 85.71,
                                "ptbAll": 7
                            },
                            "playerTookTheField": true,
                            "shirtNum": 12
                        },
                        {
                            "playerFirstName": "Martin",
                            "playerId": 500960,
                            "playerLastName": "Taupau",
                            "playerName": "Martin Taupau",
                            "playerPosition": "Lock",
                            "playerPositionId": 500013,
                            "playerStats": {
                                "allRunMetres": 88,
                                "allRuns": 9,
                                "decoys": 4,
                                "errors": 1,
                                "fantasyPointsTotal": 47,
                                "hitUps": 9,
                                "mins": 56,
                                "missedTackles": 2,
                                "offloads": 1,
                                "onReport": 1,
                                "oneOnOneTackles": 2,
                                "penalties": 2,
                                "supports": 3,
                                "tackleBreaks": 6,
                                "tackles": 29,
                                "hitupRunMeters": 88,
                                "ptbFast": 57.14,
                                "ptbNeutral": 42.86,
                                "ptbAll": 7
                            },
                            "playerTookTheField": true,
                            "shirtNum": 13
                        },
                        {
                            "playerFirstName": "Manaia",
                            "playerId": 500472,
                            "playerLastName": "Cherrington",
                            "playerName": "Manaia Cherrington",
                            "playerPosition": "Interchange",
                            "playerPositionId": 500014,
                            "playerStats": {
                                "allRunMetres": 10,
                                "allRuns": 1,
                                "dummyHalfRuns": 1,
                                "fantasyPointsTotal": 21,
                                "kickMetres": 9,
                                "kicks": 1,
                                "linebreakAssists": 1,
                                "mins": 27,
                                "missedTackles": 2,
                                "tackles": 17,
                                "tryAssists": 1,
                                "dummyHalfRunMetres": 10,
                                "ptbNeutral": 100,
                                "ptbAll": 1
                            },
                            "playerTookTheField": true,
                            "shirtNum": 14
                        },
                        {
                            "playerFirstName": "Ava",
                            "playerId": 500659,
                            "playerLastName": "Seumanufagai",
                            "playerName": "Ava Seumanufagai",
                            "playerPosition": "Interchange",
                            "playerPositionId": 500014,
                            "playerStats": {
                                "allRunMetres": 117,
                                "allRuns": 10,
                                "decoys": 1,
                                "fantasyPointsTotal": 38,
                                "hitUps": 7,
                                "kickReturnMetres": 43,
                                "kickReturns": 3,
                                "mins": 31,
                                "penalties": 1,
                                "supports": 7,
                                "tackleBreaks": 4,
                                "tackles": 17,
                                "hitupRunMeters": 74,
                                "ptbNeutral": 100,
                                "ptbAll": 9
                            },
                            "playerTookTheField": true,
                            "shirtNum": 15
                        },
                        {
                            "playerFirstName": "Brendan",
                            "playerId": 500692,
                            "playerLastName": "Santi",
                            "playerName": "Brendan Santi",
                            "playerPosition": "Interchange",
                            "playerPositionId": 500014,
                            "playerStats": {
                                "allRunMetres": 15,
                                "allRuns": 3,
                                "decoys": 2,
                                "fantasyPointsTotal": 17,
                                "hitUps": 3,
                                "mins": 21,
                                "oneOnOneTackles": 1,
                                "supports": 4,
                                "tackles": 16,
                                "hitupRunMeters": 15,
                                "ptbFast": 33.33,
                                "ptbNeutral": 66.67,
                                "ptbAll": 3
                            },
                            "playerTookTheField": true,
                            "shirtNum": 17
                        },
                        {
                            "playerFirstName": "Jack",
                            "playerId": 500648,
                            "playerLastName": "Buchanan",
                            "playerName": "Jack Buchanan",
                            "playerPosition": "Interchange",
                            "playerPositionId": 500014,
                            "playerStats": {
                                "allRunMetres": 62,
                                "allRuns": 8,
                                "fantasyPointsTotal": 16,
                                "hitUps": 7,
                                "ineffectiveTackles": 1,
                                "kickReturnMetres": 13,
                                "kickReturns": 1,
                                "mins": 26,
                                "missedTackles": 1,
                                "penalties": 2,
                                "supports": 4,
                                "tackles": 16,
                                "hitupRunMeters": 49,
                                "ptbFast": 12.5,
                                "ptbNeutral": 87.5,
                                "ptbAll": 8
                            },
                            "playerTookTheField": true,
                            "shirtNum": 18
                        }
                    ]
                },
                "teamName": "Wests Tigers",
                "teamNickName": "Wests Tigers",
                "teamStats": {
                    "allRunMetres": 1377,
                    "allRuns": 143,
                    "bombKicks": 2,
                    "bombKickMetres": 66,
                    "bombKicksDefused": 1,
                    "bombKicksNotDefused": 3,
                    "chargeDowns": 1,
                    "chargedDown": 1,
                    "completeSets": 23,
                    "completionPercentage": 77,
                    "conversions": 1,
                    "conversionsAttempts": 3,
                    "conversionsMissed": 2,
                    "decoys": 32,
                    "dummyHalfRuns": 10,
                    "errors": 7,
                    "goalConversionRate": 50,
                    "allGoals": 2,
                    "allGoalsAttempted": 4,
                    "allGoalsMissed": 2,
                    "hitUps": 66,
                    "incompleteSets": 7,
                    "ineffectiveTackles": 19,
                    "kickMetres": 487,
                    "kickReturnMetres": 134,
                    "kickReturns": 13,
                    "kicks": 18,
                    "kicksDefused": 5,
                    "kicksNotDefused": 3,
                    "lineDropouts": 1,
                    "linebreakAssists": 4,
                    "linebreaks": 4,
                    "missedTackles": 18,
                    "offloads": 8,
                    "onReports": 1,
                    "oneOnOneTackles": 13,
                    "penalties": 12,
                    "penaltyGoals": 1,
                    "penaltyGoalsAttempts": 1,
                    "points": 16,
                    "pointsConceded": 28,
                    "possession": 41,
                    "scrumWins": 8,
                    "supports": 113,
                    "tackleBreaks": 35,
                    "tackles": 366,
                    "sets": 30,
                    "tries": 3,
                    "triesConceded": 5,
                    "tryAssists": 3,
                    "hitupRunMeters": 588,
                    "evasionRuns": 54,
                    "evasionRunMetres": 527,
                    "dummyHalfRunMetres": 128,
                    "ptbFast": 10,
                    "ptbNeutral": 85,
                    "ptbSlow": 4,
                    "ptbTotal": 116
                }
            },
            {
                "score": {
                    "conversions": 4,
                    "points": 28,
                    "tries": 5
                },
                "team1stHalfScore": 12,
                "team2ndHalfScore": 16,
                "teamAbbr": "PAR",
                "teamFinalScore": 28,
                "teamFullTimeScore": 28,
                "teamHalfTimeScore": 12,
                "teamId": 500031,
                "teamLineup": {
                    "injuriesAndSuspensions": {
                        "injury": [
                            {
                                "injuryDescription": "Knee, Season",
                                "playerFirstName": "Beau",
                                "playerId": "500104",
                                "playerLastName": "Champion",
                                "playerName": "Beau Champion"
                            },
                            {
                                "injuryDescription": "Cheekbone, Round 22",
                                "playerFirstName": "Reece",
                                "playerId": "500331",
                                "playerLastName": "Robinson",
                                "playerName": "Reece Robinson"
                            },
                            {
                                "injuryDescription": "Shoulder, Indefinite",
                                "playerFirstName": "Richie",
                                "playerId": "500577",
                                "playerLastName": "Fa'aoso",
                                "playerName": "Richie Fa'aoso"
                            },
                            {
                                "injuryDescription": "Knee, Round 16",
                                "playerFirstName": "Adam",
                                "playerId": "500635",
                                "playerLastName": "Quinlan",
                                "playerName": "Adam Quinlan"
                            },
                            {
                                "injuryDescription": "ACL, Season",
                                "playerFirstName": "Kenny",
                                "playerId": "500667",
                                "playerLastName": "Edwards",
                                "playerName": "Kenny Edwards"
                            },
                            {
                                "injuryDescription": "Knee, Round 19-20",
                                "playerFirstName": "Nathan",
                                "playerId": "500688",
                                "playerLastName": "Peats",
                                "playerName": "Nathan Peats"
                            },
                            {
                                "injuryDescription": "Pec, Season",
                                "playerFirstName": "Peni",
                                "playerId": "500696",
                                "playerLastName": "Terepo",
                                "playerName": "Peni Terepo"
                            },
                            {
                                "injuryDescription": "Knee, Round 14",
                                "playerFirstName": "Vai",
                                "playerId": "500698",
                                "playerLastName": "Toutai",
                                "playerName": "Vai Toutai"
                            },
                            {
                                "injuryDescription": "Cheek, Round 21",
                                "playerFirstName": "Isaac",
                                "playerId": "500789",
                                "playerLastName": "De Gois",
                                "playerName": "Isaac De Gois"
                            },
                            {
                                "injuryDescription": "Leg, Round 20",
                                "playerFirstName": "John",
                                "playerId": "500891",
                                "playerLastName": "Folau",
                                "playerName": "John Folau"
                            },
                            {
                                "injuryDescription": "Pec, Season",
                                "playerFirstName": "Kaysa",
                                "playerId": "500911",
                                "playerLastName": "Pritchard",
                                "playerName": "Kaysa Pritchard"
                            }
                        ],
                        "suspension": []
                    },
                    "insAndOuts": {
                        "inOut": [
                            {
                                "inOut": "In",
                                "playerFirstName": "Bureta",
                                "playerId": "500668",
                                "playerLastName": "Faraimo",
                                "playerName": "Bureta Faraimo"
                            },
                            {
                                "inOut": "Out",
                                "playerFirstName": "Cody",
                                "playerId": "500833",
                                "playerLastName": "Nelson",
                                "playerName": "Cody Nelson"
                            },
                            {
                                "inOut": "In",
                                "playerFirstName": "Isaac",
                                "playerId": "500789",
                                "playerLastName": "De Gois",
                                "playerName": "Isaac De Gois"
                            },
                            {
                                "inOut": "Out",
                                "playerFirstName": "Joseph",
                                "playerId": "500686",
                                "playerLastName": "Paulo",
                                "playerName": "Joseph Paulo"
                            },
                            {
                                "inOut": "In",
                                "playerFirstName": "Manu",
                                "playerId": "500680",
                                "playerLastName": "Ma'u",
                                "playerName": "Manu Ma'u"
                            },
                            {
                                "inOut": "Out",
                                "playerFirstName": "Will",
                                "playerId": "500672",
                                "playerLastName": "Hopoate",
                                "playerName": "Will Hopoate"
                            }
                        ]
                    },
                    "teamPlayer": [
                        {
                            "playerFirstName": "Corey",
                            "playerId": 500684,
                            "playerLastName": "Norman",
                            "playerName": "Corey Norman",
                            "playerPosition": "Fullback",
                            "playerPositionId": 500001,
                            "playerStats": {
                                "allRunMetres": 149,
                                "allRuns": 15,
                                "bombKicks": 1,
                                "bombKickMetres": 15,
                                "bombKicksDefused": 2,
                                "decoys": 2,
                                "errors": 1,
                                "fantasyPointsTotal": 39,
                                "kickMetres": 88,
                                "kickReturnMetres": 56,
                                "kickReturns": 6,
                                "kicks": 4,
                                "kicksDefused": 4,
                                "linebreakAssists": 1,
                                "mins": 80,
                                "missedTackles": 1,
                                "offloads": 1,
                                "oneOnOneTackles": 1,
                                "penalties": 1,
                                "supports": 13,
                                "tackleBreaks": 3,
                                "tackles": 5,
                                "tryAssists": 1,
                                "evasionRuns": 9,
                                "evasionRunMetres": 93,
                                "ptbFast": 14.29,
                                "ptbNeutral": 85.71,
                                "ptbAll": 14
                            },
                            "playerTookTheField": true,
                            "shirtNum": 1
                        },
                        {
                            "playerFirstName": "Semi",
                            "playerId": 500690,
                            "playerLastName": "Radradra",
                            "playerName": "Semi Radradra",
                            "playerPosition": "Winger 1",
                            "playerPositionId": 500002,
                            "playerStats": {
                                "allRunMetres": 135,
                                "allRuns": 14,
                                "errors": 1,
                                "fantasyPointsTotal": 50,
                                "hitUps": 1,
                                "kickReturnMetres": 10,
                                "kickReturns": 1,
                                "linebreaks": 1,
                                "mins": 80,
                                "missedTackles": 1,
                                "offloads": 2,
                                "oneOnOneTackles": 1,
                                "points": 8,
                                "supports": 13,
                                "tackleBreaks": 1,
                                "tackles": 4,
                                "tries": 2,
                                "tryAssists": 1,
                                "tryCause": 2,
                                "trySaves": 1,
                                "hitupRunMeters": 8,
                                "evasionRuns": 12,
                                "evasionRunMetres": 117,
                                "ptbFast": 25,
                                "ptbNeutral": 75,
                                "ptbAll": 8
                            },
                            "playerTookTheField": true,
                            "shirtNum": 2
                        },
                        {
                            "playerFirstName": "Ryan",
                            "playerId": 500682,
                            "playerLastName": "Morgan",
                            "playerName": "Ryan Morgan",
                            "playerPosition": "Centre 1",
                            "playerPositionId": 500003,
                            "playerStats": {
                                "allRunMetres": 47,
                                "allRuns": 5,
                                "decoys": 1,
                                "fantasyPointsTotal": 10,
                                "hitUps": 1,
                                "mins": 80,
                                "missedTackles": 4,
                                "oneOnOneTackles": 1,
                                "supports": 7,
                                "tackleBreaks": 1,
                                "tackles": 11,
                                "tryCause": 1,
                                "hitupRunMeters": 5,
                                "evasionRuns": 4,
                                "evasionRunMetres": 42,
                                "ptbFast": 33.33,
                                "ptbNeutral": 66.67,
                                "ptbAll": 6
                            },
                            "playerTookTheField": true,
                            "shirtNum": 3
                        },
                        {
                            "playerFirstName": "Brad",
                            "playerId": 500065,
                            "playerLastName": "Takairangi",
                            "playerName": "Brad Takairangi",
                            "playerPosition": "Centre 2",
                            "playerPositionId": 500004,
                            "playerStats": {
                                "allRunMetres": 33,
                                "allRuns": 6,
                                "decoys": 2,
                                "errors": 1,
                                "fantasyPointsTotal": 3,
                                "hitUps": 1,
                                "mins": 80,
                                "missedTackles": 3,
                                "onReport": 1,
                                "oneOnOneTackles": 2,
                                "supports": 12,
                                "tackles": 8,
                                "tryCause": 2,
                                "hitupRunMeters": 10,
                                "evasionRuns": 5,
                                "evasionRunMetres": 23,
                                "ptbNeutral": 100,
                                "ptbAll": 5
                            },
                            "playerTookTheField": true,
                            "shirtNum": 4
                        },
                        {
                            "playerFirstName": "Bureta",
                            "playerId": 500668,
                            "playerLastName": "Faraimo",
                            "playerName": "Bureta Faraimo",
                            "playerPosition": "Winger 2",
                            "playerPositionId": 500005,
                            "playerStats": {
                                "allRunMetres": 157,
                                "allRuns": 14,
                                "dummyHalfRuns": 1,
                                "errors": 2,
                                "fantasyPointsTotal": 22,
                                "ineffectiveTackles": 1,
                                "kickReturnMetres": 30,
                                "kickReturns": 3,
                                "mins": 80,
                                "oneOnOneTackles": 1,
                                "supports": 8,
                                "tackleBreaks": 2,
                                "tackles": 5,
                                "tryCause": 1,
                                "evasionRuns": 10,
                                "evasionRunMetres": 119,
                                "dummyHalfRunMetres": 8,
                                "ptbNeutral": 100,
                                "ptbAll": 12
                            },
                            "playerTookTheField": true,
                            "shirtNum": 5
                        },
                        {
                            "playerFirstName": "Luke",
                            "playerId": 500674,
                            "playerLastName": "Kelly",
                            "playerName": "Luke Kelly",
                            "playerPosition": "Five-eighth",
                            "playerPositionId": 500006,
                            "playerStats": {
                                "allRunMetres": 23,
                                "allRuns": 5,
                                "fantasyPointsTotal": 23,
                                "kickMetres": 32,
                                "kickReturns": 1,
                                "kicks": 2,
                                "kicksDefused": 1,
                                "mins": 80,
                                "missedTackles": 2,
                                "oneOnOneTackles": 1,
                                "points": 4,
                                "supports": 11,
                                "tackleBreaks": 1,
                                "tackles": 12,
                                "tries": 1,
                                "tryCause": 1,
                                "evasionRuns": 4,
                                "evasionRunMetres": 23,
                                "ptbSlow": 100,
                                "ptbAll": 1
                            },
                            "playerTookTheField": true,
                            "shirtNum": 6
                        },
                        {
                            "playerFirstName": "Chris",
                            "playerId": 500691,
                            "playerLastName": "Sandow",
                            "playerName": "Chris Sandow",
                            "playerPosition": "Halfback",
                            "playerPositionId": 500007,
                            "playerStats": {
                                "allRunMetres": 59,
                                "allRuns": 6,
                                "bombKicks": 3,
                                "bombKickMetres": 47,
                                "chargedDown": 1,
                                "conversions": 4,
                                "conversionsAttempts": 5,
                                "conversionsMissed": 1,
                                "errors": 1,
                                "fantasyPointsTotal": 38,
                                "goalConversionRate": 80,
                                "allGoals": 4,
                                "allGoalsMissed": 1,
                                "allGoalsAttempted": 5,
                                "ineffectiveTackles": 2,
                                "kickMetres": 221,
                                "kicks": 9,
                                "linebreakAssists": 1,
                                "linebreaks": 1,
                                "mins": 80,
                                "missedTackles": 7,
                                "offloads": 1,
                                "oneOnOneTackles": 2,
                                "penalties": 1,
                                "points": 12,
                                "supports": 5,
                                "tackleBreaks": 1,
                                "tackles": 8,
                                "tries": 1,
                                "tryAssists": 1,
                                "tryCause": 1,
                                "evasionRuns": 6,
                                "evasionRunMetres": 59,
                                "ptbNeutral": 100,
                                "ptbAll": 2
                            },
                            "playerTookTheField": true,
                            "shirtNum": 7
                        },
                        {
                            "playerFirstName": "Darcy",
                            "playerId": 500677,
                            "playerLastName": "Lussick",
                            "playerName": "Darcy Lussick",
                            "playerPosition": "Prop 1",
                            "playerPositionId": 500008,
                            "playerStats": {
                                "allRunMetres": 73,
                                "allRuns": 8,
                                "decoys": 4,
                                "fantasyPointsTotal": 16,
                                "hitUps": 8,
                                "ineffectiveTackles": 2,
                                "mins": 21,
                                "missedTackles": 1,
                                "supports": 2,
                                "tackles": 11,
                                "hitupRunMeters": 73,
                                "ptbFast": 12.5,
                                "ptbNeutral": 87.5,
                                "ptbAll": 8
                            },
                            "playerTookTheField": true,
                            "shirtNum": 15
                        },
                        {
                            "playerFirstName": "Isaac",
                            "playerId": 500789,
                            "playerLastName": "De Gois",
                            "playerName": "Isaac De Gois",
                            "playerPosition": "Hooker",
                            "playerPositionId": 500009,
                            "playerStats": {
                                "allRunMetres": 16,
                                "allRuns": 3,
                                "dummyHalfRuns": 1,
                                "errors": 1,
                                "fantasyPointsTotal": 49,
                                "hitUps": 1,
                                "ineffectiveTackles": 1,
                                "kickReturns": 1,
                                "kicksDefused": 1,
                                "linebreakAssists": 1,
                                "mins": 80,
                                "missedTackles": 1,
                                "offloads": 1,
                                "oneOnOneTackles": 3,
                                "tackles": 42,
                                "tryAssists": 1,
                                "hitupRunMeters": 8,
                                "dummyHalfRunMetres": 8,
                                "ptbNeutral": 100,
                                "ptbAll": 2
                            },
                            "playerTookTheField": true,
                            "shirtNum": 19
                        },
                        {
                            "playerFirstName": "Tim",
                            "playerId": 500679,
                            "playerLastName": "Mannah",
                            "playerName": "Tim Mannah",
                            "playerPosition": "Prop 2",
                            "playerPositionId": 500010,
                            "playerStats": {
                                "allRunMetres": 167,
                                "allRuns": 20,
                                "decoys": 5,
                                "fantasyPointsTotal": 48,
                                "hitUps": 14,
                                "ineffectiveTackles": 1,
                                "kickReturnMetres": 47,
                                "kickReturns": 6,
                                "linebreaks": 1,
                                "mins": 44,
                                "points": 4,
                                "supports": 1,
                                "tackleBreaks": 2,
                                "tackles": 14,
                                "tries": 1,
                                "hitupRunMeters": 120,
                                "ptbNeutral": 89.47,
                                "ptbSlow": 10.53,
                                "ptbAll": 19
                            },
                            "playerTookTheField": true,
                            "shirtNum": 10
                        },
                        {
                            "playerFirstName": "Manu",
                            "playerId": 500680,
                            "playerLastName": "Ma'u",
                            "playerName": "Manu Ma'u",
                            "playerPosition": "2nd Row 1",
                            "playerPositionId": 500011,
                            "playerStats": {
                                "allRunMetres": 148,
                                "allRuns": 16,
                                "decoys": 11,
                                "dummyHalfRuns": 1,
                                "errors": 1,
                                "fantasyPointsTotal": 39,
                                "hitUps": 15,
                                "ineffectiveTackles": 3,
                                "mins": 80,
                                "missedTackles": 4,
                                "offloads": 1,
                                "oneOnOneTackles": 2,
                                "supports": 7,
                                "tackleBreaks": 1,
                                "tackles": 30,
                                "tryCause": 1,
                                "hitupRunMeters": 140,
                                "dummyHalfRunMetres": 8,
                                "ptbFast": 7.69,
                                "ptbNeutral": 92.31,
                                "ptbAll": 13
                            },
                            "playerTookTheField": true,
                            "shirtNum": 11
                        },
                        {
                            "playerFirstName": "Tepai",
                            "playerId": 500908,
                            "playerLastName": "Moeroa",
                            "playerName": "Tepai Moeroa",
                            "playerPosition": "2nd Row 2",
                            "playerPositionId": 500012,
                            "playerStats": {
                                "allRunMetres": 97,
                                "allRuns": 10,
                                "decoys": 3,
                                "fantasyPointsTotal": 26,
                                "hitUps": 10,
                                "mins": 51,
                                "missedTackles": 2,
                                "offloads": 1,
                                "tackles": 19,
                                "hitupRunMeters": 97,
                                "ptbFast": 25,
                                "ptbNeutral": 75,
                                "ptbAll": 8
                            },
                            "playerTookTheField": true,
                            "shirtNum": 12
                        },
                        {
                            "playerFirstName": "Anthony",
                            "playerId": 500028,
                            "playerLastName": "Watmough",
                            "playerName": "Anthony Watmough",
                            "playerPosition": "Lock",
                            "playerPositionId": 500013,
                            "playerStats": {
                                "allRunMetres": 123,
                                "allRuns": 13,
                                "decoys": 8,
                                "dummyHalfRuns": 1,
                                "fantasyPointsTotal": 28,
                                "hitUps": 12,
                                "ineffectiveTackles": 1,
                                "mins": 52,
                                "missedTackles": 4,
                                "offloads": 1,
                                "supports": 5,
                                "tackles": 22,
                                "hitupRunMeters": 114,
                                "dummyHalfRunMetres": 9,
                                "ptbFast": 9.09,
                                "ptbNeutral": 90.91,
                                "ptbAll": 11
                            },
                            "playerTookTheField": true,
                            "shirtNum": 13
                        },
                        {
                            "playerFirstName": "Junior",
                            "playerId": 500687,
                            "playerLastName": "Paulo",
                            "playerName": "Junior Paulo",
                            "playerPosition": "Interchange",
                            "playerPositionId": 500014,
                            "playerStats": {
                                "allRunMetres": 86,
                                "allRuns": 9,
                                "decoys": 8,
                                "fantasyPointsTotal": 40,
                                "hitUps": 8,
                                "kickReturnMetres": 21,
                                "kickReturns": 1,
                                "mins": 39,
                                "offloads": 1,
                                "penalties": 1,
                                "supports": 1,
                                "tackleBreaks": 4,
                                "tackles": 20,
                                "hitupRunMeters": 65,
                                "ptbNeutral": 100,
                                "ptbAll": 7
                            },
                            "playerTookTheField": true,
                            "shirtNum": 8
                        },
                        {
                            "playerFirstName": "Pauli",
                            "playerId": 500685,
                            "playerLastName": "Pauli",
                            "playerName": "Pauli Pauli",
                            "playerPosition": "Interchange",
                            "playerPositionId": 500014,
                            "playerStats": {
                                "allRunMetres": 76,
                                "allRuns": 7,
                                "decoys": 4,
                                "errors": 1,
                                "fantasyPointsTotal": 19,
                                "hitUps": 7,
                                "ineffectiveTackles": 1,
                                "mins": 30,
                                "penalties": 1,
                                "supports": 2,
                                "tackleBreaks": 1,
                                "tackles": 13,
                                "tryCause": 1,
                                "hitupRunMeters": 76,
                                "ptbNeutral": 100,
                                "ptbAll": 7
                            },
                            "playerTookTheField": true,
                            "shirtNum": 14,
                            "isCaptain": true
                        },
                        {
                            "playerFirstName": "Danny",
                            "playerId": 503454,
                            "playerLastName": "Wicks",
                            "playerName": "Danny Wicks",
                            "playerPosition": "Interchange",
                            "playerPositionId": 500014,
                            "playerStats": {
                                "allRunMetres": 117,
                                "allRuns": 14,
                                "decoys": 2,
                                "fantasyPointsTotal": 35,
                                "hitUps": 14,
                                "mins": 46,
                                "missedTackles": 4,
                                "offloads": 1,
                                "supports": 6,
                                "tackleBreaks": 1,
                                "tackles": 27,
                                "hitupRunMeters": 117,
                                "ptbFast": 16.67,
                                "ptbNeutral": 83.33,
                                "ptbAll": 12
                            },
                            "playerTookTheField": true,
                            "shirtNum": 16
                        },
                        {
                            "playerFirstName": "David",
                            "playerId": 500031,
                            "playerLastName": "Gower",
                            "playerName": "David Gower",
                            "playerPosition": "Interchange",
                            "playerPositionId": 500014,
                            "playerStats": {
                                "allRunMetres": 91,
                                "allRuns": 12,
                                "chargeDowns": 1,
                                "decoys": 2,
                                "errors": 1,
                                "fantasyPointsTotal": 34,
                                "hitUps": 9,
                                "mins": 37,
                                "missedTackles": 1,
                                "oneOnOneTackles": 1,
                                "supports": 3,
                                "tackles": 29,
                                "hitupRunMeters": 71,
                                "evasionRuns": 3,
                                "evasionRunMetres": 20,
                                "ptbNeutral": 100,
                                "ptbAll": 7
                            },
                            "playerTookTheField": true,
                            "shirtNum": 17
                        }
                    ]
                },
                "teamName": "Parramatta Eels",
                "teamNickName": "Eels",
                "teamStats": {
                    "allRunMetres": 1597,
                    "allRuns": 177,
                    "bombKicks": 4,
                    "bombKickMetres": 62,
                    "bombKicksDefused": 2,
                    "chargeDowns": 1,
                    "chargedDown": 1,
                    "completeSets": 32,
                    "completionPercentage": 73,
                    "conversions": 4,
                    "conversionsAttempts": 5,
                    "conversionsMissed": 1,
                    "decoys": 52,
                    "dummyHalfRuns": 4,
                    "errors": 11,
                    "goalConversionRate": 80,
                    "allGoals": 4,
                    "allGoalsAttempted": 5,
                    "allGoalsMissed": 1,
                    "hitUps": 101,
                    "incompleteSets": 12,
                    "ineffectiveTackles": 12,
                    "kickMetres": 341,
                    "kickReturnMetres": 164,
                    "kickReturns": 19,
                    "kicks": 15,
                    "kicksDefused": 6,
                    "linebreakAssists": 3,
                    "linebreaks": 3,
                    "missedTackles": 35,
                    "offloads": 10,
                    "onReports": 1,
                    "oneOnOneTackles": 15,
                    "penalties": 4,
                    "points": 28,
                    "pointsConceded": 16,
                    "possession": 59,
                    "scrumWins": 4,
                    "supports": 96,
                    "tackleBreaks": 18,
                    "tackles": 280,
                    "sets": 44,
                    "tries": 5,
                    "triesConceded": 3,
                    "tryAssists": 4,
                    "trySaves": 1,
                    "hitupRunMeters": 905,
                    "evasionRuns": 53,
                    "evasionRunMetres": 495,
                    "dummyHalfRunMetres": 33,
                    "ptbFast": 9,
                    "ptbNeutral": 89,
                    "ptbSlow": 2,
                    "ptbTotal": 142
                }
            }
        ]
    }
}