{
    "competitionId": 111,
    "competitionName": "NRL Telstra Premiership",
    "gameId": 20151111340,
    "gameInfo": {
        "assistantReferee1Id": 500014,
        "numberOfPeriods": 2,
        "assistantReferee1Name": "Jeff Younis",
        "assistantReferee2Id": 500050,
        "assistantReferee2Name": "Peter Gough",
        "gameDate": "2015-06-06",
        "gameHashTag": "#NRLSouthsWarriors",
        "gameNumber": 4,
        "gameSeconds": 4800,
        "gameTime": "1:20:00",
        "groundConditionId": 1,
        "groundConditionName": "N/A",
        "referee1Id": 500022,
        "referee1Name": "Jared Maxwell",
        "referee2Id": 500029,
        "referee2Name": "Chris Butler",
        "startTime": "2015-06-06T15:30:00",
        "startTimeUTC": "2015-06-06T07:30:00Z",
        "venueId": 500064,
        "venueName": "nib Stadium",
        "videoReferee1Id": 500118,
        "videoReferee1Name": "Steve Folkes",
        "videoReferee2Id": 500001,
        "videoReferee2Name": "Shayne Hayne"
    },
    "gameState": "Final",
    "gameStateId": 8,
    "roundId": 13,
    "seasonId": 2015,
    "teams": {
        "teamsMatch": [
            {
                "isHomeTeam": true,
                "score": {
                    "conversions": 4,
                    "points": 36,
                    "penaltyGoals": 2,
                    "tries": 6
                },
                "team1stHalfScore": 22,
                "team2ndHalfScore": 14,
                "teamAbbr": "SOU",
                "teamFinalScore": 36,
                "teamFullTimeScore": 36,
                "teamHalfTimeScore": 22,
                "teamId": 500005,
                "teamLineup": {
                    "injuriesAndSuspensions": {
                        "injury": [
                            {
                                "injuryDescription": "Thumb, Round 17-19",
                                "playerFirstName": "Glenn",
                                "playerId": "500030",
                                "playerLastName": "Stewart",
                                "playerName": "Glenn Stewart"
                            },
                            {
                                "injuryDescription": "Thumb, Round 16",
                                "playerFirstName": "Adam",
                                "playerId": "500086",
                                "playerLastName": "Reynolds",
                                "playerName": "Adam Reynolds"
                            },
                            {
                                "injuryDescription": "Knee, TBA",
                                "playerFirstName": "Ben",
                                "playerId": "500110",
                                "playerLastName": "Lowe",
                                "playerName": "Ben Lowe"
                            },
                            {
                                "injuryDescription": "Neck, Indefinite",
                                "playerFirstName": "Kyle",
                                "playerId": "500116",
                                "playerLastName": "Turner",
                                "playerName": "Kyle Turner"
                            }
                        ],
                        "suspension": [
                            {
                                "playerFirstName": "Kirisome",
                                "playerId": 500102,
                                "playerLastName": "Auva'a",
                                "playerName": "Kirisome Auva'a",
                                "suspensionDescription": "Indefinite,"
                            },
                            {
                                "playerFirstName": "Cody",
                                "playerId": 500611,
                                "playerLastName": "Walker",
                                "playerName": "Cody Walker",
                                "suspensionDescription": "Suspension, Indefinite"
                            }
                        ]
                    },
                    "insAndOuts": {
                        "inOut": [
                            {
                                "inOut": "In",
                                "playerFirstName": "Ben",
                                "playerId": "500110",
                                "playerLastName": "Lowe",
                                "playerName": "Ben Lowe"
                            },
                            {
                                "inOut": "Out",
                                "playerFirstName": "Cameron",
                                "playerId": "500180",
                                "playerLastName": "McInnes",
                                "playerName": "Cameron McInnes"
                            }
                        ]
                    },
                    "teamPlayer": [
                        {
                            "playerFirstName": "Greg",
                            "playerId": 500080,
                            "playerLastName": "Inglis",
                            "playerName": "Greg Inglis",
                            "playerPosition": "Fullback",
                            "playerPositionId": 500001,
                            "playerStats": {
                                "allRunMetres": 251,
                                "allRuns": 13,
                                "bombKicksNotDefused": 1,
                                "decoys": 1,
                                "dummyHalfRuns": 1,
                                "errors": 1,
                                "fantasyPointsTotal": 50,
                                "kickMetres": 8,
                                "kickReturnMetres": 34,
                                "kickReturns": 2,
                                "kicks": 1,
                                "kicksDefused": 2,
                                "kicksNotDefused": 1,
                                "lineDropouts": 2,
                                "linebreakAssists": 1,
                                "mins": 80,
                                "missedTackles": 1,
                                "oneOnOneTackles": 1,
                                "supports": 4,
                                "tackleBreaks": 5,
                                "tackles": 5,
                                "trySaves": 1,
                                "evasionRuns": 10,
                                "evasionRunMetres": 206,
                                "dummyHalfRunMetres": 11,
                                "ptbFast": 8.33,
                                "ptbNeutral": 66.67,
                                "ptbSlow": 25,
                                "ptbAll": 12
                            },
                            "playerTookTheField": true,
                            "shirtNum": 1,
                            "isCaptain": true
                        },
                        {
                            "playerFirstName": "Alex",
                            "playerId": 500108,
                            "playerLastName": "Johnston",
                            "playerName": "Alex Johnston",
                            "playerPosition": "Winger 1",
                            "playerPositionId": 500002,
                            "playerStats": {
                                "allRunMetres": 88,
                                "allRuns": 7,
                                "bombKicksDefused": 4,
                                "bombKicksNotDefused": 1,
                                "decoys": 1,
                                "dummyHalfRuns": 1,
                                "fantasyPointsTotal": 36,
                                "kickReturnMetres": 35,
                                "kickReturns": 3,
                                "kicksDefused": 4,
                                "kicksNotDefused": 2,
                                "linebreaks": 1,
                                "mins": 80,
                                "missedTackles": 1,
                                "points": 4,
                                "supports": 8,
                                "tackleBreaks": 4,
                                "tackles": 2,
                                "tries": 1,
                                "tryCause": 1,
                                "evasionRuns": 3,
                                "evasionRunMetres": 35,
                                "dummyHalfRunMetres": 18,
                                "ptbNeutral": 100,
                                "ptbAll": 7
                            },
                            "playerTookTheField": true,
                            "shirtNum": 2
                        },
                        {
                            "playerFirstName": "Dylan",
                            "playerId": 500083,
                            "playerLastName": "Walker",
                            "playerName": "Dylan Walker",
                            "playerPosition": "Centre 1",
                            "playerPositionId": 500003,
                            "playerStats": {
                                "allRunMetres": 153,
                                "allRuns": 14,
                                "dummyHalfRuns": 2,
                                "errors": 1,
                                "fantasyPointsTotal": 76,
                                "ineffectiveTackles": 1,
                                "linebreakAssists": 1,
                                "linebreaks": 3,
                                "mins": 80,
                                "offloads": 1,
                                "points": 8,
                                "supports": 3,
                                "tackleBreaks": 5,
                                "tackles": 11,
                                "tries": 2,
                                "tryAssists": 1,
                                "tryCause": 1,
                                "evasionRuns": 12,
                                "evasionRunMetres": 130,
                                "dummyHalfRunMetres": 23,
                                "ptbFast": 9.09,
                                "ptbNeutral": 81.82,
                                "ptbSlow": 9.09,
                                "ptbAll": 11
                            },
                            "playerTookTheField": true,
                            "shirtNum": 3
                        },
                        {
                            "playerFirstName": "Bryson",
                            "playerId": 500082,
                            "playerLastName": "Goodwin",
                            "playerName": "Bryson Goodwin",
                            "playerPosition": "Centre 2",
                            "playerPositionId": 500004,
                            "playerStats": {
                                "allRunMetres": 139,
                                "allRuns": 10,
                                "dummyHalfRuns": 1,
                                "fantasyPointsTotal": 57,
                                "hitUps": 1,
                                "kickMetres": 27,
                                "kicks": 1,
                                "linebreaks": 1,
                                "mins": 80,
                                "offloads": 1,
                                "oneOnOneTackles": 2,
                                "points": 4,
                                "supports": 11,
                                "tackleBreaks": 5,
                                "tackles": 14,
                                "tries": 1,
                                "hitupRunMeters": 11,
                                "evasionRuns": 8,
                                "evasionRunMetres": 118,
                                "dummyHalfRunMetres": 10,
                                "ptbFast": 22.22,
                                "ptbNeutral": 66.67,
                                "ptbSlow": 11.11,
                                "ptbAll": 9
                            },
                            "playerTookTheField": true,
                            "shirtNum": 4
                        },
                        {
                            "playerFirstName": "Aaron",
                            "playerId": 500105,
                            "playerLastName": "Gray",
                            "playerName": "Aaron Gray",
                            "playerPosition": "Winger 2",
                            "playerPositionId": 500005,
                            "playerStats": {
                                "allRunMetres": 125,
                                "allRuns": 11,
                                "bombKicksDefused": 1,
                                "bombKicksNotDefused": 1,
                                "fantasyPointsTotal": 38,
                                "kickReturnMetres": 30,
                                "kickReturns": 2,
                                "kicksDefused": 1,
                                "kicksNotDefused": 1,
                                "linebreaks": 2,
                                "mins": 80,
                                "oneOnOneTackles": 2,
                                "supports": 12,
                                "tackleBreaks": 4,
                                "tackles": 5,
                                "evasionRuns": 9,
                                "evasionRunMetres": 95,
                                "ptbFast": 10,
                                "ptbNeutral": 90,
                                "ptbAll": 10
                            },
                            "playerTookTheField": true,
                            "shirtNum": 5
                        },
                        {
                            "playerFirstName": "John",
                            "playerId": 500085,
                            "playerLastName": "Sutton",
                            "playerName": "John Sutton",
                            "playerPosition": "Five-eighth",
                            "playerPositionId": 500006,
                            "playerStats": {
                                "allRunMetres": 124,
                                "allRuns": 16,
                                "bombKicks": 2,
                                "bombKickMetres": 44,
                                "dummyHalfRuns": 1,
                                "errors": 1,
                                "fantasyPointsTotal": 48,
                                "ineffectiveTackles": 1,
                                "kickMetres": 226,
                                "kicks": 10,
                                "linebreakAssists": 1,
                                "mins": 80,
                                "offloads": 2,
                                "oneOnOneTackles": 2,
                                "supports": 5,
                                "tackles": 21,
                                "evasionRuns": 15,
                                "evasionRunMetres": 114,
                                "dummyHalfRunMetres": 10,
                                "ptbFast": 20,
                                "ptbNeutral": 80,
                                "ptbAll": 5
                            },
                            "playerTookTheField": true,
                            "shirtNum": 6
                        },
                        {
                            "playerFirstName": "Luke",
                            "playerId": 500093,
                            "playerLastName": "Keary",
                            "playerName": "Luke Keary",
                            "playerPosition": "Halfback",
                            "playerPositionId": 500007,
                            "playerStats": {
                                "allRunMetres": 52,
                                "allRuns": 8,
                                "bombKicks": 1,
                                "bombKickMetres": 14,
                                "decoys": 1,
                                "fantasyPointsTotal": 37,
                                "ineffectiveTackles": 3,
                                "kickMetres": 133,
                                "kicks": 7,
                                "linebreakAssists": 1,
                                "mins": 80,
                                "missedTackles": 2,
                                "oneOnOneTackles": 1,
                                "supports": 6,
                                "tackleBreaks": 1,
                                "tackles": 20,
                                "tryAssists": 1,
                                "evasionRuns": 8,
                                "evasionRunMetres": 52,
                                "ptbNeutral": 100,
                                "ptbAll": 4
                            },
                            "playerTookTheField": true,
                            "shirtNum": 7
                        },
                        {
                            "playerFirstName": "Thomas",
                            "playerId": 500087,
                            "playerLastName": "Burgess",
                            "playerName": "Thomas Burgess",
                            "playerPosition": "Prop 1",
                            "playerPositionId": 500008,
                            "playerStats": {
                                "allRunMetres": 139,
                                "allRuns": 14,
                                "decoys": 10,
                                "dummyHalfRuns": 1,
                                "fantasyPointsTotal": 26,
                                "hitUps": 11,
                                "ineffectiveTackles": 1,
                                "kickReturnMetres": 19,
                                "kickReturns": 2,
                                "mins": 37,
                                "missedTackles": 3,
                                "oneOnOneTackles": 1,
                                "supports": 5,
                                "tackles": 19,
                                "hitupRunMeters": 110,
                                "dummyHalfRunMetres": 10,
                                "ptbNeutral": 100,
                                "ptbAll": 14
                            },
                            "playerTookTheField": true,
                            "shirtNum": 8
                        },
                        {
                            "playerFirstName": "Issac",
                            "playerId": 500088,
                            "playerLastName": "Luke",
                            "playerName": "Issac Luke",
                            "playerPosition": "Hooker",
                            "playerPositionId": 500009,
                            "playerStats": {
                                "allRunMetres": 83,
                                "allRuns": 13,
                                "conversions": 4,
                                "conversionsAttempts": 6,
                                "conversionsMissed": 2,
                                "dummyHalfRuns": 6,
                                "errors": 4,
                                "fantasyPointsTotal": 39,
                                "goalConversionRate": 75,
                                "allGoals": 6,
                                "allGoalsMissed": 2,
                                "allGoalsAttempted": 8,
                                "hitUps": 5,
                                "ineffectiveTackles": 1,
                                "kickMetres": 46,
                                "kicks": 1,
                                "mins": 80,
                                "offloads": 1,
                                "oneOnOneTackles": 3,
                                "penaltyGoals": 2,
                                "penaltyGoalsAttempts": 2,
                                "points": 12,
                                "supports": 1,
                                "tackleBreaks": 1,
                                "tackles": 20,
                                "hitupRunMeters": 42,
                                "evasionRuns": 2,
                                "evasionRunMetres": 4,
                                "dummyHalfRunMetres": 37,
                                "ptbNeutral": 100,
                                "ptbAll": 7
                            },
                            "playerTookTheField": true,
                            "shirtNum": 9
                        },
                        {
                            "playerFirstName": "David",
                            "playerId": 500117,
                            "playerLastName": "Tyrrell",
                            "playerName": "David Tyrrell",
                            "playerPosition": "Prop 2",
                            "playerPositionId": 500010,
                            "playerStats": {
                                "allRunMetres": 77,
                                "allRuns": 9,
                                "decoys": 5,
                                "dummyHalfRuns": 1,
                                "fantasyPointsTotal": 16,
                                "hitUps": 7,
                                "ineffectiveTackles": 2,
                                "kickMetres": 10,
                                "kickReturnMetres": 10,
                                "kickReturns": 1,
                                "kicks": 1,
                                "mins": 29,
                                "missedTackles": 1,
                                "supports": 2,
                                "tackles": 11,
                                "hitupRunMeters": 55,
                                "dummyHalfRunMetres": 12,
                                "ptbFast": 33.33,
                                "ptbNeutral": 55.56,
                                "ptbSlow": 11.11,
                                "ptbAll": 9
                            },
                            "playerTookTheField": true,
                            "shirtNum": 10
                        },
                        {
                            "playerFirstName": "Nathan",
                            "playerId": 500647,
                            "playerLastName": "Brown",
                            "playerName": "Nathan Brown",
                            "playerPosition": "2nd Row 1",
                            "playerPositionId": 500011,
                            "playerStats": {
                                "allRunMetres": 69,
                                "allRuns": 7,
                                "decoys": 3,
                                "fantasyPointsTotal": 26,
                                "hitUps": 7,
                                "mins": 41,
                                "missedTackles": 1,
                                "oneOnOneTackles": 1,
                                "tackles": 22,
                                "hitupRunMeters": 69,
                                "ptbNeutral": 100,
                                "ptbAll": 7
                            },
                            "playerTookTheField": true,
                            "shirtNum": 11
                        },
                        {
                            "playerFirstName": "Chris",
                            "playerId": 500090,
                            "playerLastName": "McQueen",
                            "playerName": "Chris McQueen",
                            "playerPosition": "2nd Row 2",
                            "playerPositionId": 500012,
                            "playerStats": {
                                "allRunMetres": 84,
                                "allRuns": 10,
                                "decoys": 9,
                                "fantasyPointsTotal": 34,
                                "hitUps": 10,
                                "ineffectiveTackles": 2,
                                "mins": 80,
                                "missedTackles": 1,
                                "supports": 4,
                                "tackles": 28,
                                "hitupRunMeters": 84,
                                "ptbFast": 10,
                                "ptbNeutral": 90,
                                "ptbAll": 10
                            },
                            "playerTookTheField": true,
                            "shirtNum": 12
                        },
                        {
                            "playerFirstName": "Ben",
                            "playerId": 500110,
                            "playerLastName": "Lowe",
                            "playerName": "Ben Lowe",
                            "playerPosition": "Lock",
                            "playerPositionId": 500013,
                            "playerStats": {
                                "allRunMetres": 117,
                                "allRuns": 15,
                                "decoys": 12,
                                "fantasyPointsTotal": 40,
                                "hitUps": 14,
                                "ineffectiveTackles": 1,
                                "mins": 57,
                                "missedTackles": 2,
                                "penalties": 1,
                                "supports": 9,
                                "tackles": 35,
                                "hitupRunMeters": 110,
                                "evasionRuns": 1,
                                "evasionRunMetres": 7,
                                "ptbFast": 7.14,
                                "ptbNeutral": 92.86,
                                "ptbAll": 14
                            },
                            "playerTookTheField": true,
                            "shirtNum": 18
                        },
                        {
                            "playerFirstName": "Jason",
                            "playerId": 500096,
                            "playerLastName": "Clark",
                            "playerName": "Jason Clark",
                            "playerPosition": "Interchange",
                            "playerPositionId": 500014,
                            "playerStats": {
                                "allRunMetres": 48,
                                "allRuns": 4,
                                "decoys": 6,
                                "fantasyPointsTotal": 15,
                                "hitUps": 4,
                                "ineffectiveTackles": 1,
                                "mins": 23,
                                "missedTackles": 2,
                                "offloads": 1,
                                "supports": 2,
                                "tackles": 13,
                                "hitupRunMeters": 48,
                                "ptbNeutral": 100,
                                "ptbAll": 2
                            },
                            "playerTookTheField": true,
                            "shirtNum": 13
                        },
                        {
                            "playerFirstName": "Chris",
                            "playerId": 500106,
                            "playerLastName": "Grevsmuhl",
                            "playerName": "Chris Grevsmuhl",
                            "playerPosition": "Interchange",
                            "playerPositionId": 500014,
                            "playerStats": {
                                "allRunMetres": 145,
                                "allRuns": 13,
                                "decoys": 6,
                                "fantasyPointsTotal": 60,
                                "hitUps": 13,
                                "ineffectiveTackles": 2,
                                "linebreaks": 1,
                                "mins": 48,
                                "offloads": 1,
                                "points": 4,
                                "supports": 4,
                                "tackleBreaks": 6,
                                "tackles": 14,
                                "tries": 1,
                                "hitupRunMeters": 145,
                                "ptbFast": 27.27,
                                "ptbNeutral": 63.64,
                                "ptbSlow": 9.09,
                                "ptbAll": 11
                            },
                            "playerTookTheField": true,
                            "shirtNum": 15
                        },
                        {
                            "playerFirstName": "Tim",
                            "playerId": 500347,
                            "playerLastName": "Grant",
                            "playerName": "Tim Grant",
                            "playerPosition": "Interchange",
                            "playerPositionId": 500014,
                            "playerStats": {
                                "allRunMetres": 134,
                                "allRuns": 14,
                                "decoys": 6,
                                "fantasyPointsTotal": 55,
                                "hitUps": 12,
                                "ineffectiveTackles": 3,
                                "kickReturnMetres": 10,
                                "kickReturns": 1,
                                "linebreaks": 1,
                                "mins": 41,
                                "penalties": 1,
                                "points": 4,
                                "supports": 3,
                                "tackleBreaks": 4,
                                "tackles": 20,
                                "tries": 1,
                                "hitupRunMeters": 111,
                                "evasionRuns": 1,
                                "evasionRunMetres": 13,
                                "ptbFast": 9.09,
                                "ptbNeutral": 90.91,
                                "ptbAll": 11
                            },
                            "playerTookTheField": true,
                            "shirtNum": 16
                        },
                        {
                            "playerFirstName": "George",
                            "playerId": 500095,
                            "playerLastName": "Burgess",
                            "playerName": "George Burgess",
                            "playerPosition": "Interchange",
                            "playerPositionId": 500014,
                            "playerStats": {
                                "allRunMetres": 181,
                                "allRuns": 18,
                                "decoys": 6,
                                "errors": 1,
                                "fantasyPointsTotal": 51,
                                "hitUps": 13,
                                "kickReturnMetres": 71,
                                "kickReturns": 5,
                                "linebreakAssists": 1,
                                "mins": 44,
                                "oneOnOneTackles": 1,
                                "supports": 6,
                                "tackleBreaks": 2,
                                "tackles": 22,
                                "tryAssists": 1,
                                "hitupRunMeters": 110,
                                "ptbFast": 6.25,
                                "ptbNeutral": 81.25,
                                "ptbSlow": 12.5,
                                "ptbAll": 16
                            },
                            "playerTookTheField": true,
                            "shirtNum": 17
                        }
                    ]
                },
                "teamName": "South Sydney Rabbitohs",
                "teamNickName": "Rabbitohs",
                "teamStats": {
                    "allRunMetres": 2007,
                    "allRuns": 196,
                    "bombKicks": 3,
                    "bombKickMetres": 58,
                    "bombKicksDefused": 5,
                    "bombKicksNotDefused": 3,
                    "completeSets": 31,
                    "completionPercentage": 79,
                    "conversions": 4,
                    "conversionsAttempts": 6,
                    "conversionsMissed": 2,
                    "decoys": 66,
                    "dummyHalfRuns": 14,
                    "errors": 8,
                    "goalConversionRate": 75,
                    "allGoals": 6,
                    "allGoalsAttempted": 8,
                    "allGoalsMissed": 2,
                    "hitUps": 97,
                    "incompleteSets": 8,
                    "ineffectiveTackles": 18,
                    "kickMetres": 450,
                    "kickReturnMetres": 209,
                    "kickReturns": 16,
                    "kicks": 21,
                    "kicksDefused": 7,
                    "kicksNotDefused": 4,
                    "lineDropouts": 2,
                    "linebreakAssists": 5,
                    "linebreaks": 9,
                    "missedTackles": 14,
                    "offloads": 7,
                    "oneOnOneTackles": 14,
                    "penalties": 2,
                    "penaltyGoals": 2,
                    "penaltyGoalsAttempts": 2,
                    "points": 36,
                    "pointsConceded": 4,
                    "possession": 60,
                    "scrumWins": 9,
                    "supports": 85,
                    "tackleBreaks": 37,
                    "tackles": 282,
                    "sets": 39,
                    "tries": 6,
                    "triesConceded": 1,
                    "tryAssists": 3,
                    "trySaves": 1,
                    "hitupRunMeters": 894,
                    "evasionRuns": 69,
                    "evasionRunMetres": 773,
                    "dummyHalfRunMetres": 131,
                    "ptbFast": 10,
                    "ptbNeutral": 84,
                    "ptbSlow": 6,
                    "ptbTotal": 159
                }
            },
            {
                "score": {
                    "points": 4,
                    "tries": 1
                },
                "team1stHalfScore": 4,
                "team2ndHalfScore": 0,
                "teamAbbr": "WAR",
                "teamFinalScore": 4,
                "teamFullTimeScore": 4,
                "teamHalfTimeScore": 4,
                "teamId": 500032,
                "teamLineup": {
                    "injuriesAndSuspensions": {
                        "injury": [
                            {
                                "injuryDescription": "Ankle, Round 14",
                                "playerFirstName": "Matthew",
                                "playerId": "500307",
                                "playerLastName": "Allwood",
                                "playerName": "Matthew Allwood"
                            },
                            {
                                "injuryDescription": "Knee, Round 13",
                                "playerFirstName": "Glen",
                                "playerId": "500699",
                                "playerLastName": "Fisiiahi",
                                "playerName": "Glen Fisiiahi"
                            },
                            {
                                "injuryDescription": "Knee, Season",
                                "playerFirstName": "Ben",
                                "playerId": "500702",
                                "playerLastName": "Henry",
                                "playerName": "Ben Henry"
                            },
                            {
                                "injuryDescription": "ACL, Season",
                                "playerFirstName": "Ngani",
                                "playerId": "500706",
                                "playerLastName": "Laumape",
                                "playerName": "Ngani Laumape"
                            },
                            {
                                "injuryDescription": "Knee, Season",
                                "playerFirstName": "Thomas",
                                "playerId": "500707",
                                "playerLastName": "Leuluai",
                                "playerName": "Thomas Leuluai"
                            },
                            {
                                "injuryDescription": "Hamstring, Indefinite",
                                "playerFirstName": "Sam",
                                "playerId": "500719",
                                "playerLastName": "Rapira",
                                "playerName": "Sam Rapira"
                            },
                            {
                                "injuryDescription": "Groin, Round 14",
                                "playerFirstName": "David",
                                "playerId": "500919",
                                "playerLastName": "Fusitua",
                                "playerName": "David Fusitua"
                            }
                        ],
                        "suspension": [
                            {
                                "playerFirstName": "Konrad",
                                "playerId": 500703,
                                "playerLastName": "Hurrell",
                                "playerName": "Konrad Hurrell",
                                "suspensionDescription": "Raised Knee, Round 14"
                            }
                        ]
                    },
                    "insAndOuts": {
                        "inOut": [
                            {
                                "inOut": "In",
                                "playerFirstName": "Ken",
                                "playerId": "500928",
                                "playerLastName": "Maumalo",
                                "playerName": "Ken Maumalo"
                            },
                            {
                                "inOut": "Out",
                                "playerFirstName": "Sam",
                                "playerId": "501308",
                                "playerLastName": "Tomkins",
                                "playerName": "Sam Tomkins"
                            }
                        ]
                    },
                    "teamPlayer": [
                        {
                            "playerFirstName": "Tuimoala",
                            "playerId": 500927,
                            "playerLastName": "Lolohea",
                            "playerName": "Tuimoala Lolohea",
                            "playerPosition": "Fullback",
                            "playerPositionId": 500001,
                            "playerStats": {
                                "allRunMetres": 115,
                                "allRuns": 10,
                                "bombKicksNotDefused": 1,
                                "decoys": 1,
                                "errors": 3,
                                "fantasyPointsTotal": 9,
                                "kickReturnMetres": 72,
                                "kickReturns": 5,
                                "kicksDefused": 1,
                                "kicksNotDefused": 1,
                                "linebreakAssists": 1,
                                "mins": 80,
                                "missedTackles": 3,
                                "supports": 4,
                                "tackles": 2,
                                "tryAssists": 1,
                                "tryCause": 2,
                                "evasionRuns": 5,
                                "evasionRunMetres": 43,
                                "ptbNeutral": 100,
                                "ptbAll": 7
                            },
                            "playerTookTheField": true,
                            "shirtNum": 3
                        },
                        {
                            "playerFirstName": "Ken",
                            "playerId": 500928,
                            "playerLastName": "Maumalo",
                            "playerName": "Ken Maumalo",
                            "playerPosition": "Winger 1",
                            "playerPositionId": 500002,
                            "playerStats": {
                                "allRunMetres": 156,
                                "allRuns": 14,
                                "bombKicksDefused": 2,
                                "errors": 2,
                                "fantasyPointsTotal": 17,
                                "hitUps": 1,
                                "kickReturnMetres": 47,
                                "kickReturns": 4,
                                "kicksDefused": 6,
                                "mins": 80,
                                "missedTackles": 4,
                                "supports": 9,
                                "tackleBreaks": 2,
                                "tackles": 2,
                                "tryCause": 1,
                                "hitupRunMeters": 16,
                                "evasionRuns": 9,
                                "evasionRunMetres": 93,
                                "ptbFast": 14.29,
                                "ptbNeutral": 78.57,
                                "ptbSlow": 7.14,
                                "ptbAll": 14
                            },
                            "playerTookTheField": true,
                            "shirtNum": 21
                        },
                        {
                            "playerFirstName": "Jonathan",
                            "playerId": 500815,
                            "playerLastName": "Wright",
                            "playerName": "Jonathan Wright",
                            "playerPosition": "Centre 1",
                            "playerPositionId": 500003,
                            "playerStats": {
                                "allRunMetres": 55,
                                "allRuns": 6,
                                "decoys": 2,
                                "fantasyPointsTotal": 15,
                                "hitUps": 1,
                                "ineffectiveTackles": 1,
                                "mins": 38,
                                "missedTackles": 1,
                                "oneOnOneTackles": 2,
                                "supports": 2,
                                "tackleBreaks": 1,
                                "tackles": 9,
                                "tryCause": 1,
                                "hitupRunMeters": 12,
                                "evasionRuns": 5,
                                "evasionRunMetres": 43,
                                "ptbNeutral": 83.33,
                                "ptbSlow": 16.67,
                                "ptbAll": 6
                            },
                            "playerTookTheField": true,
                            "shirtNum": 2
                        },
                        {
                            "playerFirstName": "Solomone",
                            "playerId": 500921,
                            "playerLastName": "Kata",
                            "playerName": "Solomone Kata",
                            "playerPosition": "Centre 2",
                            "playerPositionId": 500004,
                            "playerStats": {
                                "allRunMetres": 115,
                                "allRuns": 10,
                                "decoys": 2,
                                "dummyHalfRuns": 1,
                                "fantasyPointsTotal": 16,
                                "ineffectiveTackles": 1,
                                "mins": 80,
                                "missedTackles": 3,
                                "oneOnOneTackles": 1,
                                "supports": 9,
                                "tackleBreaks": 1,
                                "tackles": 8,
                                "tryCause": 3,
                                "evasionRuns": 9,
                                "evasionRunMetres": 94,
                                "dummyHalfRunMetres": 21,
                                "ptbNeutral": 100,
                                "ptbAll": 9
                            },
                            "playerTookTheField": true,
                            "shirtNum": 4
                        },
                        {
                            "playerFirstName": "Manu",
                            "playerId": 500722,
                            "playerLastName": "Vatuvei",
                            "playerName": "Manu Vatuvei",
                            "playerPosition": "Winger 2",
                            "playerPositionId": 500005,
                            "playerStats": {
                                "allRunMetres": 167,
                                "allRuns": 14,
                                "errors": 1,
                                "fantasyPointsTotal": 46,
                                "hitUps": 2,
                                "linebreaks": 1,
                                "mins": 80,
                                "missedTackles": 3,
                                "offloads": 1,
                                "oneOnOneTackles": 4,
                                "points": 4,
                                "supports": 2,
                                "tackleBreaks": 4,
                                "tackles": 12,
                                "tries": 1,
                                "tryCause": 3,
                                "hitupRunMeters": 19,
                                "evasionRuns": 12,
                                "evasionRunMetres": 148,
                                "ptbNeutral": 100,
                                "ptbAll": 12
                            },
                            "playerTookTheField": true,
                            "shirtNum": 5
                        },
                        {
                            "playerFirstName": "Chad",
                            "playerId": 501183,
                            "playerLastName": "Townsend",
                            "playerName": "Chad Townsend",
                            "playerPosition": "Five-eighth",
                            "playerPositionId": 500006,
                            "playerStats": {
                                "allRunMetres": 54,
                                "allRuns": 10,
                                "bombKicks": 6,
                                "bombKickMetres": 131,
                                "dummyHalfRuns": 2,
                                "fantasyPointsTotal": 39,
                                "ineffectiveTackles": 1,
                                "kickMetres": 131,
                                "kicks": 6,
                                "mins": 80,
                                "offloads": 2,
                                "oneOnOneTackles": 2,
                                "penalties": 1,
                                "supports": 11,
                                "tackles": 26,
                                "tryCause": 2,
                                "evasionRuns": 8,
                                "evasionRunMetres": 40,
                                "dummyHalfRunMetres": 14,
                                "ptbNeutral": 100,
                                "ptbAll": 2
                            },
                            "playerTookTheField": true,
                            "shirtNum": 6
                        },
                        {
                            "playerFirstName": "Shaun",
                            "playerId": 500705,
                            "playerLastName": "Johnson",
                            "playerName": "Shaun Johnson",
                            "playerPosition": "Halfback",
                            "playerPositionId": 500007,
                            "playerStats": {
                                "allRunMetres": 50,
                                "allRuns": 7,
                                "bombKicks": 2,
                                "bombKickMetres": 38,
                                "conversionsAttempts": 1,
                                "conversionsMissed": 1,
                                "errors": 2,
                                "fantasyPointsTotal": 11,
                                "allGoalsMissed": 1,
                                "allGoalsAttempted": 1,
                                "kickMetres": 216,
                                "kicks": 8,
                                "kicksNotDefused": 1,
                                "lineDropouts": 1,
                                "mins": 80,
                                "missedTackles": 5,
                                "oneOnOneTackles": 2,
                                "supports": 8,
                                "tackles": 10,
                                "tryCause": 2,
                                "evasionRuns": 7,
                                "evasionRunMetres": 50
                            },
                            "playerTookTheField": true,
                            "shirtNum": 7
                        },
                        {
                            "playerFirstName": "Jacob",
                            "playerId": 500708,
                            "playerLastName": "Lillyman",
                            "playerName": "Jacob Lillyman",
                            "playerPosition": "Prop 1",
                            "playerPositionId": 500008,
                            "playerStats": {
                                "allRunMetres": 129,
                                "allRuns": 13,
                                "decoys": 6,
                                "errors": 1,
                                "fantasyPointsTotal": 39,
                                "hitUps": 12,
                                "ineffectiveTackles": 1,
                                "kickReturnMetres": 14,
                                "kickReturns": 1,
                                "mins": 65,
                                "missedTackles": 2,
                                "supports": 5,
                                "tackles": 33,
                                "hitupRunMeters": 115,
                                "ptbFast": 8.33,
                                "ptbNeutral": 91.67,
                                "ptbAll": 12
                            },
                            "playerTookTheField": true,
                            "shirtNum": 8
                        },
                        {
                            "playerFirstName": "Siliva",
                            "playerId": 501394,
                            "playerLastName": "Havili",
                            "playerName": "Siliva Havili",
                            "playerPosition": "Hooker",
                            "playerPositionId": 500009,
                            "playerStats": {
                                "allRunMetres": 13,
                                "allRuns": 1,
                                "dummyHalfRuns": 1,
                                "fantasyPointsTotal": 26,
                                "ineffectiveTackles": 2,
                                "mins": 31,
                                "missedTackles": 1,
                                "oneOnOneTackles": 1,
                                "tackleBreaks": 1,
                                "tackles": 24,
                                "dummyHalfRunMetres": 13,
                                "ptbNeutral": 100,
                                "ptbAll": 1
                            },
                            "playerTookTheField": true,
                            "shirtNum": 14
                        },
                        {
                            "playerFirstName": "Ben",
                            "playerId": 500715,
                            "playerLastName": "Matulino",
                            "playerName": "Ben Matulino",
                            "playerPosition": "Prop 2",
                            "playerPositionId": 500010,
                            "playerStats": {
                                "allRunMetres": 110,
                                "allRuns": 10,
                                "decoys": 3,
                                "errors": 1,
                                "fantasyPointsTotal": 54,
                                "hitUps": 8,
                                "ineffectiveTackles": 1,
                                "kickReturnMetres": 32,
                                "kickReturns": 2,
                                "mins": 55,
                                "missedTackles": 2,
                                "offloads": 3,
                                "oneOnOneTackles": 2,
                                "penalties": 1,
                                "supports": 1,
                                "tackleBreaks": 3,
                                "tackles": 36,
                                "tryCause": 1,
                                "hitupRunMeters": 78,
                                "ptbNeutral": 100,
                                "ptbAll": 7
                            },
                            "playerTookTheField": true,
                            "shirtNum": 10
                        },
                        {
                            "playerFirstName": "Bodene",
                            "playerId": 500664,
                            "playerLastName": "Thompson",
                            "playerName": "Bodene Thompson",
                            "playerPosition": "2nd Row 1",
                            "playerPositionId": 500011,
                            "playerStats": {
                                "allRunMetres": 85,
                                "allRuns": 10,
                                "decoys": 9,
                                "fantasyPointsTotal": 34,
                                "hitUps": 9,
                                "linebreaks": 1,
                                "mins": 80,
                                "missedTackles": 4,
                                "oneOnOneTackles": 5,
                                "supports": 5,
                                "tackles": 30,
                                "tryCause": 2,
                                "hitupRunMeters": 76,
                                "evasionRuns": 1,
                                "evasionRunMetres": 9,
                                "ptbNeutral": 100,
                                "ptbAll": 9
                            },
                            "playerTookTheField": true,
                            "shirtNum": 11
                        },
                        {
                            "playerFirstName": "Ryan",
                            "playerId": 500596,
                            "playerLastName": "Hoffman",
                            "playerName": "Ryan Hoffman",
                            "playerPosition": "2nd Row 2",
                            "playerPositionId": 500012,
                            "playerStats": {
                                "allRunMetres": 93,
                                "allRuns": 10,
                                "decoys": 3,
                                "errors": 2,
                                "fantasyPointsTotal": 28,
                                "hitUps": 10,
                                "kickMetres": 13,
                                "kicks": 1,
                                "mins": 80,
                                "missedTackles": 1,
                                "offloads": 1,
                                "supports": 5,
                                "tackleBreaks": 1,
                                "tackles": 20,
                                "tryCause": 1,
                                "hitupRunMeters": 93,
                                "ptbNeutral": 100,
                                "ptbAll": 9
                            },
                            "playerTookTheField": true,
                            "shirtNum": 12
                        },
                        {
                            "playerFirstName": "Simon",
                            "playerId": 500712,
                            "playerLastName": "Mannering",
                            "playerName": "Simon Mannering",
                            "playerPosition": "Lock",
                            "playerPositionId": 500013,
                            "playerStats": {
                                "allRunMetres": 89,
                                "allRuns": 10,
                                "decoys": 10,
                                "errors": 1,
                                "fantasyPointsTotal": 61,
                                "hitUps": 9,
                                "linebreakAssists": 1,
                                "mins": 68,
                                "offloads": 2,
                                "oneOnOneTackles": 1,
                                "supports": 5,
                                "tackleBreaks": 1,
                                "tackles": 46,
                                "hitupRunMeters": 85,
                                "evasionRuns": 1,
                                "evasionRunMetres": 4,
                                "ptbNeutral": 100,
                                "ptbAll": 6
                            },
                            "playerTookTheField": true,
                            "shirtNum": 13,
                            "isCaptain": true
                        },
                        {
                            "playerFirstName": "Nathan",
                            "playerId": 500700,
                            "playerLastName": "Friend",
                            "playerName": "Nathan Friend",
                            "playerPosition": "Interchange",
                            "playerPositionId": 500014,
                            "playerStats": {
                                "allRunMetres": 31,
                                "allRuns": 3,
                                "dummyHalfRuns": 2,
                                "errors": 1,
                                "fantasyPointsTotal": 33,
                                "hitUps": 1,
                                "ineffectiveTackles": 1,
                                "mins": 49,
                                "missedTackles": 3,
                                "oneOnOneTackles": 2,
                                "supports": 1,
                                "tackles": 38,
                                "tryCause": 1,
                                "hitupRunMeters": 13,
                                "dummyHalfRunMetres": 18,
                                "ptbNeutral": 100,
                                "ptbAll": 4
                            },
                            "playerTookTheField": true,
                            "shirtNum": 9
                        },
                        {
                            "playerFirstName": "Sebastine",
                            "playerId": 500704,
                            "playerLastName": "Ikahihifo",
                            "playerName": "Sebastine Ikahihifo",
                            "playerPosition": "Interchange",
                            "playerPositionId": 500014,
                            "playerStats": {
                                "allRunMetres": 33,
                                "allRuns": 3,
                                "decoys": 2,
                                "fantasyPointsTotal": 19,
                                "hitUps": 3,
                                "ineffectiveTackles": 1,
                                "mins": 25,
                                "missedTackles": 3,
                                "supports": 1,
                                "tackles": 22,
                                "tryCause": 1,
                                "hitupRunMeters": 33,
                                "ptbNeutral": 100,
                                "ptbAll": 3
                            },
                            "playerTookTheField": true,
                            "shirtNum": 15
                        },
                        {
                            "playerFirstName": "Sam",
                            "playerId": 500926,
                            "playerLastName": "Lisone",
                            "playerName": "Sam Lisone",
                            "playerPosition": "Interchange",
                            "playerPositionId": 500014,
                            "playerStats": {
                                "allRunMetres": 85,
                                "allRuns": 9,
                                "decoys": 4,
                                "fantasyPointsTotal": 30,
                                "hitUps": 7,
                                "kickReturnMetres": 19,
                                "kickReturns": 1,
                                "mins": 33,
                                "missedTackles": 1,
                                "offloads": 2,
                                "penalties": 2,
                                "supports": 1,
                                "tackles": 24,
                                "hitupRunMeters": 59,
                                "evasionRuns": 1,
                                "evasionRunMetres": 7,
                                "ptbFast": 16.67,
                                "ptbNeutral": 83.33,
                                "ptbAll": 6
                            },
                            "playerTookTheField": true,
                            "shirtNum": 16
                        },
                        {
                            "playerFirstName": "Albert",
                            "playerId": 500937,
                            "playerLastName": "Vete",
                            "playerName": "Albert Vete",
                            "playerPosition": "Interchange",
                            "playerPositionId": 500014,
                            "playerStats": {
                                "allRunMetres": 46,
                                "allRuns": 4,
                                "decoys": 4,
                                "fantasyPointsTotal": 26,
                                "hitUps": 4,
                                "ineffectiveTackles": 1,
                                "mins": 36,
                                "missedTackles": 1,
                                "supports": 1,
                                "tackles": 24,
                                "tryCause": 1,
                                "hitupRunMeters": 46,
                                "ptbNeutral": 100,
                                "ptbAll": 4
                            },
                            "playerTookTheField": true,
                            "shirtNum": 17
                        }
                    ]
                },
                "teamName": "New Zealand Warriors",
                "teamNickName": "Warriors",
                "teamStats": {
                    "allRunMetres": 1423,
                    "allRuns": 144,
                    "bombKicks": 8,
                    "bombKickMetres": 170,
                    "bombKicksDefused": 2,
                    "bombKicksNotDefused": 1,
                    "completeSets": 19,
                    "completionPercentage": 59,
                    "conversionsAttempts": 1,
                    "conversionsMissed": 1,
                    "decoys": 46,
                    "dummyHalfRuns": 6,
                    "errors": 14,
                    "allGoalsAttempted": 1,
                    "allGoalsMissed": 1,
                    "hitUps": 67,
                    "incompleteSets": 13,
                    "ineffectiveTackles": 10,
                    "kickMetres": 361,
                    "kickReturnMetres": 183,
                    "kickReturns": 13,
                    "kicks": 15,
                    "kicksDefused": 7,
                    "kicksNotDefused": 2,
                    "lineDropouts": 1,
                    "linebreakAssists": 2,
                    "linebreaks": 2,
                    "missedTackles": 37,
                    "offloads": 11,
                    "oneOnOneTackles": 22,
                    "penalties": 4,
                    "points": 4,
                    "pointsConceded": 36,
                    "possession": 40,
                    "scrumWins": 5,
                    "supports": 70,
                    "tackleBreaks": 14,
                    "tackles": 366,
                    "sets": 32,
                    "tries": 1,
                    "triesConceded": 6,
                    "tryAssists": 1,
                    "hitupRunMeters": 644,
                    "evasionRuns": 58,
                    "evasionRunMetres": 531,
                    "dummyHalfRunMetres": 65,
                    "ptbFast": 4,
                    "ptbNeutral": 95,
                    "ptbSlow": 2,
                    "ptbTotal": 111
                }
            }
        ]
    }
}