{
    "competitionId": 111,
    "competitionName": "NRL Telstra Premiership",
    "gameId": 20151110130,
    "gameInfo": {
        "assistantReferee1Id": 500024,
        "numberOfPeriods": 2,
        "assistantReferee1Name": "Rickey MacFarlane",
        "assistantReferee2Id": 500074,
        "assistantReferee2Name": "Phil Henderson",
        "gameDate": "2015-03-07",
        "gameHashTag": "#NRLKnightsWarriors",
        "gameNumber": 3,
        "gameSeconds": 4800,
        "gameTime": "1:20:00",
        "groundConditionId": 2,
        "groundConditionName": "Good",
        "referee1Id": 500039,
        "referee1Name": "Ashley Klein",
        "referee2Id": 500029,
        "referee2Name": "Chris Butler",
        "startTime": "2015-03-07T16:30:00",
        "startTimeUTC": "2015-03-07T05:30:00Z",
        "venueId": 500024,
        "venueName": "Hunter Stadium",
        "videoReferee1Id": 500118,
        "videoReferee1Name": "Steve Folkes",
        "videoReferee2Id": 500030,
        "videoReferee2Name": "Steve Clark",
        "weatherId": 2,
        "weatherName": "Fine"
    },
    "gameState": "Final",
    "gameStateId": 8,
    "roundId": 1,
    "seasonId": 2015,
    "teams": {
        "teamsMatch": [
            {
                "isHomeTeam": true,
                "score": {
                    "conversions": 4,
                    "points": 24,
                    "tries": 4
                },
                "team1stHalfScore": 6,
                "team2ndHalfScore": 18,
                "teamAbbr": "NEW",
                "teamFinalScore": 24,
                "teamFullTimeScore": 24,
                "teamHalfTimeScore": 6,
                "teamId": 500003,
                "teamLineup": {
                    "injuriesAndSuspensions": {
                        "injury": [],
                        "suspension": []
                    },
                    "insAndOuts": {
                        "inOut": []
                    },
                    "teamPlayer": [
                        {
                            "playerFirstName": "Sione",
                            "playerId": 500571,
                            "playerLastName": "Mata'utia",
                            "playerName": "Sione Mata'utia",
                            "playerPosition": "Fullback",
                            "playerPositionId": 500001,
                            "playerStats": {
                                "allRunMetres": 179,
                                "allRuns": 20,
                                "decoys": 6,
                                "dummyHalfRuns": 1,
                                "fantasyPointsTotal": 23,
                                "ineffectiveTackles": 1,
                                "kickMetres": 11,
                                "kickReturnMetres": 53,
                                "kickReturns": 6,
                                "kicks": 1,
                                "kicksDefused": 1,
                                "linebreakAssists": 1,
                                "mins": 80,
                                "missedTackles": 4,
                                "oneOnOneTackles": 1,
                                "penalties": 1,
                                "supports": 11,
                                "tackles": 8,
                                "tryAssists": 1,
                                "tryCause": 1,
                                "evasionRuns": 13,
                                "evasionRunMetres": 113,
                                "dummyHalfRunMetres": 13,
                                "ptbFast": 15.79,
                                "ptbNeutral": 84.21,
                                "ptbAll": 19
                            },
                            "playerTookTheField": true,
                            "shirtNum": 18
                        },
                        {
                            "playerFirstName": "James",
                            "playerId": 500378,
                            "playerLastName": "McManus",
                            "playerName": "James McManus",
                            "playerPosition": "Winger 1",
                            "playerPositionId": 500002,
                            "playerStats": {
                                "allRunMetres": 61,
                                "allRuns": 7,
                                "bombKicksDefused": 2,
                                "dummyHalfRuns": 1,
                                "fantasyPointsTotal": 6,
                                "hitUps": 1,
                                "kickMetres": 16,
                                "kickReturnMetres": 5,
                                "kickReturns": 1,
                                "kicks": 1,
                                "kicksDefused": 3,
                                "mins": 68,
                                "missedTackles": 3,
                                "supports": 16,
                                "tackles": 3,
                                "hitupRunMeters": 4,
                                "evasionRuns": 4,
                                "evasionRunMetres": 48,
                                "dummyHalfRunMetres": 4,
                                "ptbNeutral": 87.5,
                                "ptbSlow": 12.5,
                                "ptbAll": 8
                            },
                            "playerTookTheField": true,
                            "shirtNum": 2
                        },
                        {
                            "playerFirstName": "Dane",
                            "playerId": 500043,
                            "playerLastName": "Gagai",
                            "playerName": "Dane Gagai",
                            "playerPosition": "Centre 1",
                            "playerPositionId": 500003,
                            "playerStats": {
                                "allRunMetres": 222,
                                "allRuns": 14,
                                "decoys": 2,
                                "fantasyPointsTotal": 82,
                                "hitUps": 2,
                                "ineffectiveTackles": 1,
                                "intercepts": 1,
                                "kickMetres": 21,
                                "kickReturns": 1,
                                "kicks": 1,
                                "kicksDefused": 1,
                                "linebreaks": 2,
                                "mins": 80,
                                "missedTackles": 3,
                                "oneOnOneTackles": 2,
                                "supports": 17,
                                "tackleBreaks": 8,
                                "tackles": 16,
                                "tries": 2,
                                "tryCause": 1,
                                "hitupRunMeters": 23,
                                "evasionRuns": 11,
                                "evasionRunMetres": 199,
                                "ptbFast": 30,
                                "ptbNeutral": 60,
                                "ptbSlow": 10,
                                "ptbAll": 10
                            },
                            "playerTookTheField": true,
                            "shirtNum": 3
                        },
                        {
                            "playerFirstName": "Joseph",
                            "playerId": 500042,
                            "playerLastName": "Leilua",
                            "playerName": "Joseph Leilua",
                            "playerPosition": "Centre 2",
                            "playerPositionId": 500004,
                            "playerStats": {
                                "allRunMetres": 180,
                                "allRuns": 17,
                                "decoys": 1,
                                "dummyHalfRuns": 1,
                                "errors": 1,
                                "fantasyPointsTotal": 50,
                                "hitUps": 1,
                                "kickReturns": 1,
                                "linebreakAssists": 1,
                                "mins": 80,
                                "missedTackles": 1,
                                "offloads": 3,
                                "supports": 15,
                                "tackleBreaks": 6,
                                "tackles": 5,
                                "tryAssists": 1,
                                "hitupRunMeters": 5,
                                "evasionRuns": 14,
                                "evasionRunMetres": 173,
                                "dummyHalfRunMetres": 2,
                                "ptbFast": 25,
                                "ptbNeutral": 66.67,
                                "ptbSlow": 8.33,
                                "ptbAll": 12
                            },
                            "playerTookTheField": true,
                            "shirtNum": 4
                        },
                        {
                            "playerFirstName": "Akuila",
                            "playerId": 500044,
                            "playerLastName": "Uate",
                            "playerName": "Akuila Uate",
                            "playerPosition": "Winger 2",
                            "playerPositionId": 500005,
                            "playerStats": {
                                "allRunMetres": 161,
                                "allRuns": 10,
                                "bombKicksNotDefused": 1,
                                "errors": 1,
                                "fantasyPointsTotal": 48,
                                "kickReturnMetres": 47,
                                "kickReturns": 3,
                                "kicksDefused": 1,
                                "kicksNotDefused": 2,
                                "linebreakAssists": 1,
                                "linebreaks": 1,
                                "mins": 80,
                                "missedTackles": 1,
                                "offloads": 2,
                                "oneOnOneTackles": 2,
                                "supports": 17,
                                "tackleBreaks": 5,
                                "tackles": 5,
                                "tryAssists": 1,
                                "evasionRuns": 7,
                                "evasionRunMetres": 114,
                                "ptbFast": 11.11,
                                "ptbNeutral": 88.89,
                                "ptbAll": 9
                            },
                            "playerTookTheField": true,
                            "shirtNum": 5
                        },
                        {
                            "playerFirstName": "Jarrod",
                            "playerId": 500045,
                            "playerLastName": "Mullen",
                            "playerName": "Jarrod Mullen",
                            "playerPosition": "Five-eighth",
                            "playerPositionId": 500006,
                            "playerStats": {
                                "allRunMetres": 101,
                                "allRuns": 11,
                                "bombKicks": 5,
                                "bombKickMetres": 90,
                                "bombKicksDefused": 1,
                                "decoys": 3,
                                "errors": 1,
                                "fantasyPointsTotal": 57,
                                "kickMetres": 281,
                                "kicks": 11,
                                "kicksDefused": 1,
                                "lineDropouts": 2,
                                "linebreaks": 1,
                                "mins": 80,
                                "missedTackles": 2,
                                "offloads": 2,
                                "oneOnOneTackles": 2,
                                "supports": 10,
                                "tackleBreaks": 2,
                                "tackles": 24,
                                "tryCause": 1,
                                "evasionRuns": 11,
                                "evasionRunMetres": 101,
                                "ptbFast": 40,
                                "ptbNeutral": 60,
                                "ptbAll": 5
                            },
                            "playerTookTheField": true,
                            "shirtNum": 6
                        },
                        {
                            "playerFirstName": "Tyrone",
                            "playerId": 500046,
                            "playerLastName": "Roberts",
                            "playerName": "Tyrone Roberts",
                            "playerPosition": "Halfback",
                            "playerPositionId": 500007,
                            "playerStats": {
                                "allRunMetres": 25,
                                "allRuns": 6,
                                "bombKicks": 1,
                                "bombKickMetres": 28,
                                "conversions": 3,
                                "conversionsAttempts": 3,
                                "errors": 2,
                                "fantasyPointsTotal": 27,
                                "hitUps": 1,
                                "ineffectiveTackles": 2,
                                "intercepts": 1,
                                "kickMetres": 121,
                                "kickReturns": 1,
                                "kicks": 4,
                                "mins": 67,
                                "missedTackles": 2,
                                "onReport": 1,
                                "oneOnOneTackles": 4,
                                "penalties": 1,
                                "supports": 17,
                                "tackleBreaks": 2,
                                "tackles": 17,
                                "hitupRunMeters": 10,
                                "evasionRuns": 4,
                                "evasionRunMetres": 15,
                                "ptbNeutral": 66.67,
                                "ptbSlow": 33.33,
                                "ptbAll": 3
                            },
                            "playerTookTheField": true,
                            "shirtNum": 7
                        },
                        {
                            "playerFirstName": "Kade",
                            "playerId": 500385,
                            "playerLastName": "Snowden",
                            "playerName": "Kade Snowden",
                            "playerPosition": "Prop 1",
                            "playerPositionId": 500008,
                            "playerStats": {
                                "allRunMetres": 143,
                                "allRuns": 18,
                                "decoys": 4,
                                "fantasyPointsTotal": 43,
                                "hitUps": 17,
                                "ineffectiveTackles": 2,
                                "mins": 49,
                                "missedTackles": 4,
                                "offloads": 1,
                                "oneOnOneTackles": 2,
                                "supports": 8,
                                "tackleBreaks": 1,
                                "tackles": 32,
                                "hitupRunMeters": 139,
                                "evasionRuns": 1,
                                "evasionRunMetres": 4,
                                "ptbFast": 18.75,
                                "ptbNeutral": 68.75,
                                "ptbSlow": 12.5,
                                "ptbAll": 16
                            },
                            "playerTookTheField": true,
                            "shirtNum": 8
                        },
                        {
                            "playerFirstName": "Adam",
                            "playerId": 500370,
                            "playerLastName": "Clydsdale",
                            "playerName": "Adam Clydsdale",
                            "playerPosition": "Hooker",
                            "playerPositionId": 500009,
                            "playerStats": {
                                "allRunMetres": 40,
                                "allRuns": 7,
                                "dummyHalfRuns": 4,
                                "errors": 1,
                                "fantasyPointsTotal": 32,
                                "hitUps": 3,
                                "ineffectiveTackles": 2,
                                "mins": 64,
                                "missedTackles": 4,
                                "supports": 1,
                                "tackles": 38,
                                "hitupRunMeters": 16,
                                "dummyHalfRunMetres": 24,
                                "ptbFast": 16.67,
                                "ptbNeutral": 83.33,
                                "ptbAll": 6
                            },
                            "playerTookTheField": true,
                            "shirtNum": 9
                        },
                        {
                            "playerFirstName": "Korbin",
                            "playerId": 500384,
                            "playerLastName": "Sims",
                            "playerName": "Korbin Sims",
                            "playerPosition": "Prop 2",
                            "playerPositionId": 500010,
                            "playerStats": {
                                "allRunMetres": 93,
                                "allRuns": 10,
                                "decoys": 2,
                                "errors": 2,
                                "fantasyPointsTotal": 12,
                                "hitUps": 7,
                                "ineffectiveTackles": 2,
                                "kickReturnMetres": 39,
                                "kickReturns": 3,
                                "mins": 47,
                                "missedTackles": 5,
                                "offloads": 1,
                                "penalties": 1,
                                "supports": 8,
                                "tackles": 17,
                                "hitupRunMeters": 54,
                                "ptbFast": 28.57,
                                "ptbNeutral": 71.43,
                                "ptbAll": 7
                            },
                            "playerTookTheField": true,
                            "shirtNum": 10
                        },
                        {
                            "playerFirstName": "Beau",
                            "playerId": 500051,
                            "playerLastName": "Scott",
                            "playerName": "Beau Scott",
                            "playerPosition": "2nd Row 1",
                            "playerPositionId": 500011,
                            "playerStats": {
                                "allRunMetres": 65,
                                "allRuns": 6,
                                "decoys": 5,
                                "errors": 2,
                                "fantasyPointsTotal": 32,
                                "hitUps": 6,
                                "ineffectiveTackles": 3,
                                "mins": 80,
                                "missedTackles": 2,
                                "offloads": 1,
                                "oneOnOneTackles": 1,
                                "penalties": 1,
                                "supports": 10,
                                "tackles": 34,
                                "tryCause": 1,
                                "hitupRunMeters": 65,
                                "ptbNeutral": 100,
                                "ptbAll": 5
                            },
                            "playerTookTheField": true,
                            "shirtNum": 11
                        },
                        {
                            "playerFirstName": "Robbie",
                            "playerId": 500050,
                            "playerLastName": "Rochow",
                            "playerName": "Robbie Rochow",
                            "playerPosition": "2nd Row 2",
                            "playerPositionId": 500012,
                            "playerStats": {
                                "allRunMetres": 143,
                                "allRuns": 15,
                                "decoys": 6,
                                "fantasyPointsTotal": 57,
                                "hitUps": 14,
                                "kickMetres": 14,
                                "kicks": 1,
                                "linebreakAssists": 1,
                                "linebreaks": 1,
                                "mins": 80,
                                "missedTackles": 1,
                                "offloads": 1,
                                "oneOnOneTackles": 1,
                                "supports": 10,
                                "tackleBreaks": 2,
                                "tackles": 23,
                                "tries": 1,
                                "hitupRunMeters": 136,
                                "evasionRuns": 1,
                                "evasionRunMetres": 7,
                                "ptbFast": 30.77,
                                "ptbNeutral": 61.54,
                                "ptbSlow": 7.69,
                                "ptbAll": 13
                            },
                            "playerTookTheField": true,
                            "shirtNum": 12
                        },
                        {
                            "playerFirstName": "Jeremy",
                            "playerId": 500052,
                            "playerLastName": "Smith",
                            "playerName": "Jeremy Smith",
                            "playerPosition": "Lock",
                            "playerPositionId": 500013,
                            "playerStats": {
                                "allRunMetres": 76,
                                "allRuns": 8,
                                "decoys": 3,
                                "dummyHalfRuns": 1,
                                "fantasyPointsTotal": 31,
                                "hitUps": 7,
                                "kicks": 1,
                                "mins": 22,
                                "oneOnOneTackles": 3,
                                "penalties": 1,
                                "supports": 7,
                                "tackleBreaks": 1,
                                "tackles": 23,
                                "hitupRunMeters": 67,
                                "dummyHalfRunMetres": 9,
                                "ptbNeutral": 100,
                                "ptbAll": 6
                            },
                            "playerTookTheField": true,
                            "shirtNum": 13
                        },
                        {
                            "playerFirstName": "Tyler",
                            "playerId": 500380,
                            "playerLastName": "Randell",
                            "playerName": "Tyler Randell",
                            "playerPosition": "Interchange",
                            "playerPositionId": 500014,
                            "playerStats": {
                                "allRunMetres": 31,
                                "allRuns": 4,
                                "bombKicks": 1,
                                "bombKickMetres": 32,
                                "conversions": 1,
                                "conversionsAttempts": 1,
                                "decoys": 2,
                                "dummyHalfRuns": 3,
                                "errors": 1,
                                "fantasyPointsTotal": 33,
                                "kickMetres": 32,
                                "kicks": 1,
                                "linebreaks": 1,
                                "mins": 41,
                                "oneOnOneTackles": 2,
                                "penalties": 2,
                                "supports": 3,
                                "tackleBreaks": 2,
                                "tackles": 15,
                                "tries": 1,
                                "evasionRuns": 1,
                                "evasionRunMetres": 3,
                                "dummyHalfRunMetres": 28,
                                "ptbNeutral": 100,
                                "ptbAll": 2
                            },
                            "playerTookTheField": true,
                            "shirtNum": 14
                        },
                        {
                            "playerFirstName": "Chris",
                            "playerId": 500054,
                            "playerLastName": "Houston",
                            "playerName": "Chris Houston",
                            "playerPosition": "Interchange",
                            "playerPositionId": 500014,
                            "playerStats": {
                                "allRunMetres": 76,
                                "allRuns": 9,
                                "decoys": 3,
                                "fantasyPointsTotal": 33,
                                "hitUps": 9,
                                "mins": 33,
                                "missedTackles": 3,
                                "oneOnOneTackles": 1,
                                "supports": 3,
                                "tackles": 32,
                                "tryCause": 1,
                                "hitupRunMeters": 76,
                                "ptbFast": 33.33,
                                "ptbNeutral": 66.67,
                                "ptbAll": 9
                            },
                            "playerTookTheField": true,
                            "shirtNum": 15
                        },
                        {
                            "playerFirstName": "David",
                            "playerId": 500047,
                            "playerLastName": "Fa'alogo",
                            "playerName": "David Fa'alogo",
                            "playerPosition": "Interchange",
                            "playerPositionId": 500014,
                            "playerStats": {
                                "allRunMetres": 78,
                                "allRuns": 7,
                                "chargeDowns": 1,
                                "decoys": 1,
                                "fantasyPointsTotal": 26,
                                "hitUps": 7,
                                "ineffectiveTackles": 1,
                                "kicksDefused": 1,
                                "mins": 58,
                                "missedTackles": 1,
                                "penalties": 2,
                                "sinBins": 1,
                                "supports": 6,
                                "tackles": 29,
                                "hitupRunMeters": 78,
                                "ptbFast": 42.86,
                                "ptbNeutral": 57.14,
                                "ptbAll": 7
                            },
                            "playerTookTheField": true,
                            "shirtNum": 16
                        },
                        {
                            "playerFirstName": "Jack",
                            "playerId": 500639,
                            "playerLastName": "Stockwell",
                            "playerName": "Jack Stockwell",
                            "playerPosition": "Interchange",
                            "playerPositionId": 500014,
                            "playerStats": {
                                "allRunMetres": 89,
                                "allRuns": 9,
                                "decoys": 8,
                                "errors": 1,
                                "fantasyPointsTotal": 37,
                                "hitUps": 9,
                                "mins": 31,
                                "missedTackles": 1,
                                "oneOnOneTackles": 1,
                                "penalties": 1,
                                "supports": 11,
                                "tackleBreaks": 1,
                                "tackles": 32,
                                "hitupRunMeters": 89,
                                "ptbNeutral": 100,
                                "ptbAll": 7
                            },
                            "playerTookTheField": true,
                            "shirtNum": 17
                        }
                    ]
                },
                "teamName": "Newcastle Knights",
                "teamNickName": "Knights",
                "teamStats": {
                    "allRunMetres": 1762,
                    "allRuns": 178,
                    "bombKicks": 7,
                    "bombKickMetres": 150,
                    "bombKicksDefused": 3,
                    "bombKicksNotDefused": 1,
                    "chargeDowns": 1,
                    "completeSets": 30,
                    "completionPercentage": 73,
                    "conversions": 4,
                    "conversionsAttempts": 4,
                    "decoys": 46,
                    "dummyHalfRuns": 11,
                    "errors": 12,
                    "hitUps": 84,
                    "incompleteSets": 11,
                    "ineffectiveTackles": 14,
                    "intercepts": 2,
                    "kickMetres": 496,
                    "kickReturnMetres": 144,
                    "kickReturns": 16,
                    "kicks": 21,
                    "kicksDefused": 8,
                    "kicksNotDefused": 2,
                    "lineDropouts": 2,
                    "linebreakAssists": 4,
                    "linebreaks": 6,
                    "missedTackles": 37,
                    "onReports": 1,
                    "oneOnOneTackles": 22,
                    "penalties": 10,
                    "points": 24,
                    "pointsConceded": 14,
                    "possession": 48,
                    "scrumWins": 8,
                    "sinBins": 1,
                    "supports": 170,
                    "tackleBreaks": 30,
                    "tackles": 353,
                    "sets": 41,
                    "tries": 4,
                    "triesConceded": 2,
                    "tryAssists": 3,
                    "offloads": 11,
                    "hitupRunMeters": 762,
                    "evasionRuns": 67,
                    "evasionRunMetres": 777,
                    "dummyHalfRunMetres": 79,
                    "ptbFast": 19,
                    "ptbNeutral": 76,
                    "ptbSlow": 5,
                    "ptbTotal": 144
                }
            },
            {
                "score": {
                    "conversions": 2,
                    "points": 14,
                    "penaltyGoals": 1,
                    "tries": 2
                },
                "team1stHalfScore": 14,
                "team2ndHalfScore": 0,
                "teamAbbr": "WAR",
                "teamFinalScore": 14,
                "teamFullTimeScore": 14,
                "teamHalfTimeScore": 14,
                "teamId": 500032,
                "teamLineup": {
                    "injuriesAndSuspensions": {
                        "injury": [],
                        "suspension": []
                    },
                    "insAndOuts": {
                        "inOut": []
                    },
                    "teamPlayer": [
                        {
                            "playerFirstName": "Tuimoala",
                            "playerId": 500927,
                            "playerLastName": "Lolohea",
                            "playerName": "Tuimoala Lolohea",
                            "playerPosition": "Fullback",
                            "playerPositionId": 500001,
                            "playerStats": {
                                "allRunMetres": 212,
                                "allRuns": 17,
                                "bombKicksDefused": 1,
                                "decoys": 1,
                                "errors": 1,
                                "fantasyPointsTotal": 67,
                                "ineffectiveTackles": 2,
                                "interceptedPass": 1,
                                "kickMetres": 4,
                                "kickReturnMetres": 144,
                                "kickReturns": 8,
                                "kicks": 1,
                                "kicksDefused": 4,
                                "linebreaks": 1,
                                "mins": 80,
                                "oneOnOneTackles": 1,
                                "supports": 10,
                                "tackleBreaks": 10,
                                "tackles": 5,
                                "tryCause": 1,
                                "trySaves": 1,
                                "evasionRuns": 9,
                                "evasionRunMetres": 68,
                                "ptbNeutral": 100,
                                "ptbAll": 14
                            },
                            "playerTookTheField": true,
                            "shirtNum": 2
                        },
                        {
                            "playerFirstName": "Solomone",
                            "playerId": 500921,
                            "playerLastName": "Kata",
                            "playerName": "Solomone Kata",
                            "playerPosition": "Winger 1",
                            "playerPositionId": 500002,
                            "playerStats": {
                                "allRunMetres": 123,
                                "allRuns": 12,
                                "bombKicksNotDefused": 1,
                                "dummyHalfRuns": 1,
                                "errors": 1,
                                "fantasyPointsTotal": 22,
                                "hitUps": 1,
                                "ineffectiveTackles": 1,
                                "kickReturnMetres": 10,
                                "kickReturns": 1,
                                "kicksNotDefused": 1,
                                "mins": 80,
                                "missedTackles": 2,
                                "oneOnOneTackles": 1,
                                "supports": 7,
                                "tackleBreaks": 3,
                                "tackles": 7,
                                "hitupRunMeters": 6,
                                "evasionRuns": 9,
                                "evasionRunMetres": 88,
                                "dummyHalfRunMetres": 19,
                                "ptbNeutral": 100,
                                "ptbAll": 12
                            },
                            "playerTookTheField": true,
                            "shirtNum": 4
                        },
                        {
                            "playerFirstName": "Konrad",
                            "playerId": 500703,
                            "playerLastName": "Hurrell",
                            "playerName": "Konrad Hurrell",
                            "playerPosition": "Centre 1",
                            "playerPositionId": 500003,
                            "playerStats": {
                                "allRunMetres": 68,
                                "allRuns": 7,
                                "bombKicksDefused": 1,
                                "errors": 2,
                                "fantasyPointsTotal": 20,
                                "hitUps": 1,
                                "kickReturns": 1,
                                "kicksDefused": 1,
                                "linebreaks": 1,
                                "mins": 53,
                                "missedTackles": 2,
                                "offloads": 1,
                                "oneOnOneTackles": 1,
                                "supports": 2,
                                "tackleBreaks": 3,
                                "tackles": 6,
                                "tryCause": 1,
                                "hitupRunMeters": 4,
                                "evasionRuns": 5,
                                "evasionRunMetres": 64,
                                "ptbNeutral": 100,
                                "ptbAll": 5
                            },
                            "playerTookTheField": true,
                            "shirtNum": 3
                        },
                        {
                            "playerFirstName": "Ben",
                            "playerId": 500702,
                            "playerLastName": "Henry",
                            "playerName": "Ben Henry",
                            "playerPosition": "Centre 2",
                            "playerPositionId": 500004,
                            "playerStats": {
                                "allRunMetres": 44,
                                "allRuns": 8,
                                "errors": 1,
                                "fantasyPointsTotal": 17,
                                "ineffectiveTackles": 2,
                                "kickReturns": 1,
                                "kicksDefused": 1,
                                "mins": 80,
                                "missedTackles": 3,
                                "oneOnOneTackles": 3,
                                "penalties": 1,
                                "supports": 19,
                                "tackleBreaks": 1,
                                "tackles": 19,
                                "tryCause": 2,
                                "evasionRuns": 7,
                                "evasionRunMetres": 44,
                                "ptbFast": 14.29,
                                "ptbNeutral": 85.71,
                                "ptbAll": 7
                            },
                            "playerTookTheField": true,
                            "shirtNum": 15
                        },
                        {
                            "playerFirstName": "Manu",
                            "playerId": 500722,
                            "playerLastName": "Vatuvei",
                            "playerName": "Manu Vatuvei",
                            "playerPosition": "Winger 2",
                            "playerPositionId": 500005,
                            "playerStats": {
                                "allRunMetres": 176,
                                "allRuns": 15,
                                "bombKicksDefused": 1,
                                "decoys": 1,
                                "errors": 2,
                                "fantasyPointsTotal": 26,
                                "hitUps": 1,
                                "ineffectiveTackles": 1,
                                "kickReturnMetres": 74,
                                "kickReturns": 4,
                                "kicksDefused": 2,
                                "linebreaks": 1,
                                "mins": 80,
                                "missedTackles": 2,
                                "offloads": 1,
                                "supports": 11,
                                "tackleBreaks": 2,
                                "tackles": 3,
                                "tryCause": 2,
                                "hitupRunMeters": 9,
                                "evasionRuns": 10,
                                "evasionRunMetres": 93,
                                "ptbFast": 45.45,
                                "ptbNeutral": 54.55,
                                "ptbAll": 11
                            },
                            "playerTookTheField": true,
                            "shirtNum": 5
                        },
                        {
                            "playerFirstName": "Chad",
                            "playerId": 501183,
                            "playerLastName": "Townsend",
                            "playerName": "Chad Townsend",
                            "playerPosition": "Five-eighth",
                            "playerPositionId": 500006,
                            "playerStats": {
                                "allRunMetres": 148,
                                "allRuns": 16,
                                "bombKicks": 3,
                                "bombKickMetres": 42,
                                "chargedDown": 1,
                                "decoys": 5,
                                "dummyHalfRuns": 2,
                                "errors": 2,
                                "fantasyPointsTotal": 49,
                                "fortyTwentyKicks": 1,
                                "ineffectiveTackles": 3,
                                "kickMetres": 113,
                                "kicks": 7,
                                "linebreakAssists": 1,
                                "linebreaks": 1,
                                "mins": 80,
                                "missedTackles": 3,
                                "offloads": 3,
                                "oneOnOneTackles": 1,
                                "supports": 25,
                                "tackleBreaks": 2,
                                "tackles": 18,
                                "tryCause": 2,
                                "evasionRuns": 14,
                                "evasionRunMetres": 98,
                                "dummyHalfRunMetres": 50,
                                "ptbFast": 50,
                                "ptbNeutral": 50,
                                "ptbAll": 6
                            },
                            "playerTookTheField": true,
                            "shirtNum": 6
                        },
                        {
                            "playerFirstName": "Shaun",
                            "playerId": 500705,
                            "playerLastName": "Johnson",
                            "playerName": "Shaun Johnson",
                            "playerPosition": "Halfback",
                            "playerPositionId": 500007,
                            "playerStats": {
                                "allRunMetres": 63,
                                "allRuns": 11,
                                "bombKicks": 4,
                                "bombKickMetres": 111,
                                "conversions": 2,
                                "conversionsAttempts": 2,
                                "decoys": 1,
                                "dummyHalfRuns": 2,
                                "errors": 3,
                                "fantasyPointsTotal": 41,
                                "goalConversionRate": 100,
                                "ineffectiveTackles": 3,
                                "kickMetres": 357,
                                "kicks": 13,
                                "linebreakAssists": 1,
                                "mins": 80,
                                "missedTackles": 2,
                                "offloads": 1,
                                "penaltyGoals": 1,
                                "penaltyGoalsAttempts": 1,
                                "supports": 15,
                                "tackleBreaks": 1,
                                "tackles": 15,
                                "tryCause": 1,
                                "evasionRuns": 9,
                                "evasionRunMetres": 41,
                                "dummyHalfRunMetres": 22
                            },
                            "playerTookTheField": true,
                            "shirtNum": 7
                        },
                        {
                            "playerFirstName": "Jacob",
                            "playerId": 500708,
                            "playerLastName": "Lillyman",
                            "playerName": "Jacob Lillyman",
                            "playerPosition": "Prop 1",
                            "playerPositionId": 500008,
                            "playerStats": {
                                "allRunMetres": 69,
                                "allRuns": 8,
                                "decoys": 1,
                                "fantasyPointsTotal": 19,
                                "hitUps": 8,
                                "ineffectiveTackles": 1,
                                "mins": 22,
                                "missedTackles": 1,
                                "penalties": 1,
                                "supports": 3,
                                "tackles": 17,
                                "hitupRunMeters": 69,
                                "ptbFast": 12.5,
                                "ptbNeutral": 87.5,
                                "ptbAll": 8
                            },
                            "playerTookTheField": true,
                            "shirtNum": 8
                        },
                        {
                            "playerFirstName": "Thomas",
                            "playerId": 500707,
                            "playerLastName": "Leuluai",
                            "playerName": "Thomas Leuluai",
                            "playerPosition": "Hooker",
                            "playerPositionId": 500009,
                            "playerStats": {
                                "allRunMetres": 26,
                                "allRuns": 4,
                                "dummyHalfRuns": 3,
                                "fantasyPointsTotal": 41,
                                "hitUps": 1,
                                "ineffectiveTackles": 1,
                                "linebreaks": 1,
                                "mins": 44,
                                "missedTackles": 4,
                                "supports": 3,
                                "tackleBreaks": 3,
                                "tackles": 26,
                                "tries": 1,
                                "tryCause": 2,
                                "hitupRunMeters": 12,
                                "dummyHalfRunMetres": 14,
                                "ptbNeutral": 100,
                                "ptbAll": 1
                            },
                            "playerTookTheField": true,
                            "shirtNum": 9
                        },
                        {
                            "playerFirstName": "Ben",
                            "playerId": 500715,
                            "playerLastName": "Matulino",
                            "playerName": "Ben Matulino",
                            "playerPosition": "Prop 2",
                            "playerPositionId": 500010,
                            "playerStats": {
                                "allRunMetres": 145,
                                "allRuns": 15,
                                "decoys": 5,
                                "fantasyPointsTotal": 45,
                                "hitUps": 14,
                                "ineffectiveTackles": 1,
                                "kickReturnMetres": 18,
                                "kickReturns": 1,
                                "mins": 48,
                                "missedTackles": 2,
                                "offloads": 2,
                                "oneOnOneTackles": 2,
                                "penalties": 1,
                                "supports": 5,
                                "tackleBreaks": 1,
                                "tackles": 30,
                                "hitupRunMeters": 127,
                                "ptbFast": 21.43,
                                "ptbNeutral": 78.57,
                                "ptbAll": 14
                            },
                            "playerTookTheField": true,
                            "shirtNum": 10
                        },
                        {
                            "playerFirstName": "Bodene",
                            "playerId": 500664,
                            "playerLastName": "Thompson",
                            "playerName": "Bodene Thompson",
                            "playerPosition": "2nd Row 1",
                            "playerPositionId": 500011,
                            "playerStats": {
                                "allRunMetres": 118,
                                "allRuns": 15,
                                "bombKicksDefused": 1,
                                "decoys": 4,
                                "errors": 1,
                                "fantasyPointsTotal": 47,
                                "hitUps": 13,
                                "ineffectiveTackles": 2,
                                "kickReturnMetres": 5,
                                "kickReturns": 1,
                                "kicksDefused": 1,
                                "linebreakAssists": 1,
                                "linebreaks": 1,
                                "mins": 80,
                                "missedTackles": 4,
                                "oneOnOneTackles": 2,
                                "penalties": 1,
                                "supports": 6,
                                "tackleBreaks": 2,
                                "tackles": 35,
                                "hitupRunMeters": 108,
                                "evasionRuns": 1,
                                "evasionRunMetres": 5,
                                "ptbFast": 16.67,
                                "ptbNeutral": 83.33,
                                "ptbAll": 12
                            },
                            "playerTookTheField": true,
                            "shirtNum": 11
                        },
                        {
                            "playerFirstName": "Ryan",
                            "playerId": 500596,
                            "playerLastName": "Hoffman",
                            "playerName": "Ryan Hoffman",
                            "playerPosition": "2nd Row 2",
                            "playerPositionId": 500012,
                            "playerStats": {
                                "allRunMetres": 129,
                                "allRuns": 15,
                                "decoys": 7,
                                "errors": 1,
                                "fantasyPointsTotal": 61,
                                "hitUps": 14,
                                "interceptedPass": 1,
                                "kickReturnMetres": 7,
                                "kickReturns": 1,
                                "kicksDefused": 1,
                                "linebreaks": 2,
                                "mins": 80,
                                "missedTackles": 1,
                                "supports": 8,
                                "tackleBreaks": 6,
                                "tackles": 18,
                                "tries": 1,
                                "hitupRunMeters": 122,
                                "ptbNeutral": 100,
                                "ptbAll": 12
                            },
                            "playerTookTheField": true,
                            "shirtNum": 12
                        },
                        {
                            "playerFirstName": "Simon",
                            "playerId": 500712,
                            "playerLastName": "Mannering",
                            "playerName": "Simon Mannering",
                            "playerPosition": "Lock",
                            "playerPositionId": 500013,
                            "playerStats": {
                                "allRunMetres": 69,
                                "allRuns": 9,
                                "decoys": 7,
                                "fantasyPointsTotal": 56,
                                "hitUps": 9,
                                "ineffectiveTackles": 1,
                                "mins": 80,
                                "offloads": 1,
                                "oneOnOneTackles": 4,
                                "penalties": 2,
                                "supports": 18,
                                "tackles": 52,
                                "tryCause": 1,
                                "hitupRunMeters": 69,
                                "ptbFast": 37.5,
                                "ptbNeutral": 62.5,
                                "ptbAll": 8
                            },
                            "playerTookTheField": true,
                            "shirtNum": 13
                        },
                        {
                            "playerFirstName": "Nathan",
                            "playerId": 500700,
                            "playerLastName": "Friend",
                            "playerName": "Nathan Friend",
                            "playerPosition": "Interchange",
                            "playerPositionId": 500014,
                            "playerStats": {
                                "allRunMetres": 52,
                                "allRuns": 6,
                                "dummyHalfRuns": 5,
                                "fantasyPointsTotal": 29,
                                "linebreakAssists": 1,
                                "mins": 36,
                                "missedTackles": 1,
                                "oneOnOneTackles": 1,
                                "tackles": 19,
                                "tryAssists": 1,
                                "evasionRuns": 1,
                                "evasionRunMetres": 9,
                                "dummyHalfRunMetres": 43,
                                "ptbFast": 20,
                                "ptbNeutral": 80,
                                "ptbAll": 5
                            },
                            "playerTookTheField": true,
                            "shirtNum": 14
                        },
                        {
                            "playerFirstName": "Sam",
                            "playerId": 500926,
                            "playerLastName": "Lisone",
                            "playerName": "Sam Lisone",
                            "playerPosition": "Interchange",
                            "playerPositionId": 500014,
                            "playerStats": {
                                "allRunMetres": 92,
                                "allRuns": 13,
                                "decoys": 5,
                                "fantasyPointsTotal": 42,
                                "hitUps": 11,
                                "ineffectiveTackles": 1,
                                "mins": 41,
                                "offloads": 1,
                                "supports": 14,
                                "tackleBreaks": 1,
                                "tackles": 28,
                                "hitupRunMeters": 80,
                                "evasionRuns": 2,
                                "evasionRunMetres": 12,
                                "ptbFast": 22.22,
                                "ptbNeutral": 77.78,
                                "ptbAll": 9
                            },
                            "playerTookTheField": true,
                            "shirtNum": 16
                        },
                        {
                            "playerFirstName": "Albert",
                            "playerId": 500937,
                            "playerLastName": "Vete",
                            "playerName": "Albert Vete",
                            "playerPosition": "Interchange",
                            "playerPositionId": 500014,
                            "playerStats": {
                                "allRunMetres": 125,
                                "allRuns": 19,
                                "decoys": 4,
                                "errors": 1,
                                "fantasyPointsTotal": 23,
                                "hitUps": 18,
                                "ineffectiveTackles": 2,
                                "kickReturnMetres": 10,
                                "kickReturns": 1,
                                "mins": 52,
                                "missedTackles": 2,
                                "penalties": 2,
                                "supports": 5,
                                "tackleBreaks": 1,
                                "tackles": 18,
                                "hitupRunMeters": 115,
                                "ptbFast": 5.56,
                                "ptbNeutral": 88.89,
                                "ptbSlow": 5.56,
                                "ptbAll": 18
                            },
                            "playerTookTheField": true,
                            "shirtNum": 17
                        },
                        {
                            "playerFirstName": "Suaia",
                            "playerId": 500713,
                            "playerLastName": "Matagi",
                            "playerName": "Suaia Matagi",
                            "playerPosition": "Interchange",
                            "playerPositionId": 500014,
                            "playerStats": {
                                "allRunMetres": 80,
                                "allRuns": 9,
                                "decoys": 4,
                                "fantasyPointsTotal": 30,
                                "hitUps": 7,
                                "kickReturnMetres": 15,
                                "kickReturns": 1,
                                "linebreakAssists": 1,
                                "mins": 24,
                                "missedTackles": 1,
                                "oneOnOneTackles": 1,
                                "supports": 4,
                                "tackleBreaks": 1,
                                "tackles": 14,
                                "tryAssists": 1,
                                "tryCause": 1,
                                "hitupRunMeters": 58,
                                "evasionRuns": 1,
                                "evasionRunMetres": 7,
                                "ptbFast": 37.5,
                                "ptbNeutral": 62.5,
                                "ptbAll": 8
                            },
                            "playerTookTheField": true,
                            "shirtNum": 18
                        }
                    ]
                },
                "teamName": "New Zealand Warriors",
                "teamNickName": "Warriors",
                "teamStats": {
                    "allRunMetres": 1735,
                    "allRuns": 199,
                    "bombKicks": 7,
                    "bombKickMetres": 153,
                    "bombKicksDefused": 4,
                    "bombKicksNotDefused": 1,
                    "chargedDown": 1,
                    "completeSets": 27,
                    "completionPercentage": 68,
                    "conversions": 2,
                    "conversionsAttempts": 2,
                    "decoys": 45,
                    "dummyHalfRuns": 13,
                    "errors": 15,
                    "fortyTwentyKicks": 1,
                    "hitUps": 98,
                    "incompleteSets": 13,
                    "ineffectiveTackles": 21,
                    "interceptedPass": 2,
                    "kickMetres": 474,
                    "kickReturnMetres": 283,
                    "kickReturns": 20,
                    "kicks": 21,
                    "kicksDefused": 10,
                    "kicksNotDefused": 1,
                    "linebreakAssists": 5,
                    "linebreaks": 8,
                    "missedTackles": 30,
                    "oneOnOneTackles": 17,
                    "penalties": 8,
                    "penaltyGoals": 1,
                    "penaltyGoalsAttempts": 1,
                    "points": 14,
                    "pointsConceded": 24,
                    "possession": 52,
                    "scrumWins": 7,
                    "supports": 155,
                    "tackleBreaks": 37,
                    "tackles": 330,
                    "sets": 40,
                    "tries": 2,
                    "triesConceded": 4,
                    "tryAssists": 2,
                    "offloads": 10,
                    "trySaves": 1,
                    "hitupRunMeters": 779,
                    "evasionRuns": 68,
                    "evasionRunMetres": 527,
                    "dummyHalfRunMetres": 146,
                    "ptbFast": 17,
                    "ptbNeutral": 83,
                    "ptbSlow": 1,
                    "ptbTotal": 150
                }
            }
        ]
    }
}