{
    "vod": [
        {
            "id": "V0bjFvNTE6-fKp2mw5AmJSGuqzlxV8Fj",
            "contentId": 874595,
            "title": "Rd 26: Bulldogs v Rabbitohs (Hls)",
            "description": "Highlights of the match between the Bulldogs and Rabbitohs from ANZ Stadium",
            "publishDate": "2016-09-02T21:54:00+10:00",
            "publisher": "NRL Chief",
            "thumbnailUrl": "http://bigpondvideo.com/web/images/content/20160902214709a_89x50.jpg",
            "largeThumbnailUrl": "http://bigpondvideo.com/web/images/content/20160902214709a_326x184.jpg",
            "programType": "Highlights",
            "programCategory": "Match",
            "priority": null,
            "lastUpdateDate": "2016-09-02T21:58:20+10:00",
            "isPremium": false,
            "club": [
                500010,
                500005
            ]
        },
        {
            "id": "h4YzJvNTE6Ybk1uIvXU8x8bE6YElcZK8",
            "contentId": 874608,
            "title": "Rd 26 Press Conference: Rabbitohs",
            "description": "The Rabbitohs coach faces the media following the match",
            "publishDate": "2016-09-02T22:41:00+10:00",
            "publisher": "NRL Chief",
            "thumbnailUrl": "http://bigpondvideo.com/web/images/content/20160902221934a_89x50.jpg",
            "largeThumbnailUrl": "http://bigpondvideo.com/web/images/content/20160902221934a_326x184.jpg",
            "programType": "Press Conference",
            "programCategory": null,
            "priority": null,
            "lastUpdateDate": "2016-09-02T22:48:32+10:00",
            "isPremium": false,
            "club": [
                500010,
                500005
            ]
        },
        {
            "id": "5iYTJvNTE6GwAyfrSGuhk1yannM3INmD",
            "contentId": 874607,
            "title": "Rd 26 Press Conference: Bulldogs",
            "description": "The Bulldogs coach faces the media following the match",
            "publishDate": "2016-09-02T22:39:00+10:00",
            "publisher": "NRL Chief",
            "thumbnailUrl": "http://bigpondvideo.com/web/images/content/20160902222908a_89x50.jpg",
            "largeThumbnailUrl": "http://bigpondvideo.com/web/images/content/20160902222908a_326x184.jpg",
            "programType": "Press Conference",
            "programCategory": null,
            "priority": null,
            "lastUpdateDate": "2016-09-02T22:44:30+10:00",
            "isPremium": false,
            "club": [
                500010,
                500005
            ]
        },
        {
            "id": "BxaTFvNTE6fc_GJAy3814BHTuKxa1QqC",
            "contentId": 874685,
            "title": "Rd 26: TRY Joe Burgess (80th min)",
            "description": "The Rabbitohs finish in style as Joe Burgess crosses for a double",
            "publishDate": "2016-09-02T21:43:00+10:00",
            "publisher": "NRL Chief",
            "thumbnailUrl": "http://bigpondvideo.com/web/images/content/20160902214347a_89x50.jpg",
            "largeThumbnailUrl": "http://bigpondvideo.com/web/images/content/20160902214347a_326x184.jpg",
            "programType": "Instant Replay",
            "programCategory": "Score",
            "priority": 1,
            "lastUpdateDate": "2016-09-02T21:46:17+10:00",
            "isPremium": true,
            "club": [
                500010,
                500005
            ]
        },
        {
            "id": "Q1aDFvNTE69mzuJF_4isXXFMcrng-qX7",
            "contentId": 874684,
            "title": "Rd 26: GOAL Adam Reynolds (77th min)",
            "description": "Conversion sees the Rabbitohs lead 24-10",
            "publishDate": "2016-09-02T21:38:00+10:00",
            "publisher": "NRL Chief",
            "thumbnailUrl": "http://bigpondvideo.com/web/images/content/20160902214002a_89x50.jpg",
            "largeThumbnailUrl": "http://bigpondvideo.com/web/images/content/20160902214002a_326x184.jpg",
            "programType": "Instant Replay",
            "programCategory": "Score",
            "priority": 2,
            "lastUpdateDate": "2016-09-02T21:43:16+10:00",
            "isPremium": true,
            "club": [
                500010,
                500005
            ]
        },
        {
            "id": "t3ZzFvNTE6SmodzAwEa_mnK5Hv6gfLPG",
            "contentId": 874683,
            "title": "Rd 26: TRY Aaron Gray (76th min)",
            "description": "The Rabbitohs wrap this match up as Aaron Gray crosses for a 2nd half double",
            "publishDate": "2016-09-02T21:37:00+10:00",
            "publisher": "NRL Chief",
            "thumbnailUrl": "http://bigpondvideo.com/web/images/content/20160902213832a_89x50.jpg",
            "largeThumbnailUrl": "http://bigpondvideo.com/web/images/content/20160902213832a_326x184.jpg",
            "programType": "Instant Replay",
            "programCategory": "Score",
            "priority": 3,
            "lastUpdateDate": "2016-09-02T21:43:16+10:00",
            "isPremium": true,
            "club": [
                500010,
                500005
            ]
        },
        {
            "id": "hoZjFvNTE661asCZFws_DwilFGqptnuH",
            "contentId": 874682,
            "title": "Rd 26: GOAL Adam Reynolds (74th min)",
            "description": "Conversion sees the Rabbitohs lead by 8",
            "publishDate": "2016-09-02T21:34:00+10:00",
            "publisher": "NRL Chief",
            "thumbnailUrl": "http://bigpondvideo.com/web/images/content/20160902213619a_89x50.jpg",
            "largeThumbnailUrl": "http://bigpondvideo.com/web/images/content/20160902213619a_326x184.jpg",
            "programType": "Instant Replay",
            "programCategory": "Score",
            "priority": 4,
            "lastUpdateDate": "2016-09-02T21:43:16+10:00",
            "isPremium": true,
            "club": [
                500010,
                500005
            ]
        },
        {
            "id": "o5ZjFvNTE6RLadZYh_rF2L-ZULkE5-DX",
            "contentId": 874681,
            "title": "Rd 26: TRY Aaron Gray (72nd min)",
            "description": "The Rabbitohs extend their lead as Aaron Gray produces a great solo try",
            "publishDate": "2016-09-02T21:33:00+10:00",
            "publisher": "NRL Chief",
            "thumbnailUrl": "http://bigpondvideo.com/web/images/content/20160902213536a_89x50.jpg",
            "largeThumbnailUrl": "http://bigpondvideo.com/web/images/content/20160902213536a_326x184.jpg",
            "programType": "Instant Replay",
            "programCategory": "Score",
            "priority": 5,
            "lastUpdateDate": "2016-09-02T21:43:16+10:00",
            "isPremium": true,
            "club": [
                500010,
                500005
            ]
        },
        {
            "id": "dmYjFvNTE6mw-jBPGZrpZM-FlISM7Pfx",
            "contentId": 874680,
            "title": "Rd 26: TRY Josh Reynolds (66th min)",
            "description": "The Bulldogs are back in it as Josh Reynolds cleans up the Rabbitohs kick to race away to score",
            "publishDate": "2016-09-02T21:27:00+10:00",
            "publisher": "NRL Chief",
            "thumbnailUrl": "http://bigpondvideo.com/web/images/content/20160902212748a_89x50.jpg",
            "largeThumbnailUrl": "http://bigpondvideo.com/web/images/content/20160902212748a_326x184.jpg",
            "programType": "Instant Replay",
            "programCategory": "Score",
            "priority": 6,
            "lastUpdateDate": "2016-09-02T21:43:16+10:00",
            "isPremium": true,
            "club": [
                500010,
                500005
            ]
        },
        {
            "id": "xnbjBvNTE6rBknWShe-KP0eoxrY2JHiw",
            "contentId": 874679,
            "title": "Rd 26: GOAL Adam Reynolds (32nd min)",
            "description": "Conversion sees the Rabbitohs lead 12-0",
            "publishDate": "2016-09-02T20:32:00+10:00",
            "publisher": "NRL Chief",
            "thumbnailUrl": "http://bigpondvideo.com/web/images/content/20160902203349a_89x50.jpg",
            "largeThumbnailUrl": "http://bigpondvideo.com/web/images/content/20160902203349a_326x184.jpg",
            "programType": "Instant Replay",
            "programCategory": "Score",
            "priority": 7,
            "lastUpdateDate": "2016-09-02T21:42:16+10:00",
            "isPremium": true,
            "club": [
                500010,
                500005
            ]
        },
        {
            "id": "RwbTBvNTE6u9tFq3sDMso5A-5Z3_YaQk",
            "contentId": 874678,
            "title": "Rd 26: TRY Joe Burgess (30th min)",
            "description": "The Rabbitohs take the lead as Joe Burgess cleans up a Dogs error to race away to score",
            "publishDate": "2016-09-02T20:31:00+10:00",
            "publisher": "NRL Chief",
            "thumbnailUrl": "http://bigpondvideo.com/web/images/content/20160902203233a_89x50.jpg",
            "largeThumbnailUrl": "http://bigpondvideo.com/web/images/content/20160902203233a_326x184.jpg",
            "programType": "Instant Replay",
            "programCategory": "Score",
            "priority": 8,
            "lastUpdateDate": "2016-09-02T21:42:16+10:00",
            "isPremium": true,
            "club": [
                500010,
                500005
            ]
        },
        {
            "id": "hvZjBvNTE6gMki1l0HPkfaRxLEhln67d",
            "contentId": 874677,
            "title": "Rd 26: GOAL Adam Reynolds (18th min)",
            "description": "Conversion locks this match up at 6-all",
            "publishDate": "2016-09-02T20:18:00+10:00",
            "publisher": "NRL Chief",
            "thumbnailUrl": "http://bigpondvideo.com/web/images/content/20160902201933a_89x50.jpg",
            "largeThumbnailUrl": "http://bigpondvideo.com/web/images/content/20160902201933a_326x184.jpg",
            "programType": "Instant Replay",
            "programCategory": "Score",
            "priority": null,
            "lastUpdateDate": "2016-09-02T20:22:59+10:00",
            "isPremium": true,
            "club": [
                500010,
                500005
            ]
        },
        {
            "id": "1xZjBvNTE65HgJAvmChKenvsKXNJJOtX",
            "contentId": 874675,
            "title": "Rd 26: TRY Sam Burgess (17th min)",
            "description": "The Rabbitohs strike back as Sam Burgess powers over from close range",
            "publishDate": "2016-09-02T20:17:00+10:00",
            "publisher": "NRL Chief",
            "thumbnailUrl": "http://bigpondvideo.com/web/images/content/20160902201814a_89x50.jpg",
            "largeThumbnailUrl": "http://bigpondvideo.com/web/images/content/20160902201814a_326x184.jpg",
            "programType": "Instant Replay",
            "programCategory": "Score",
            "priority": 9,
            "lastUpdateDate": "2016-09-02T21:42:16+10:00",
            "isPremium": true,
            "club": [
                500010,
                500005
            ]
        },
        {
            "id": "E2OTBvNTE6y5N1l3X4tINOPS1uaM1849",
            "contentId": 874674,
            "title": "Rd 26: GOAL Moses Mbye (8th min)",
            "description": "Conversion sees the Bulldogs lead 6-0",
            "publishDate": "2016-09-02T20:08:00+10:00",
            "publisher": "NRL Chief",
            "thumbnailUrl": "http://bigpondvideo.com/web/images/content/20160902200925a_89x50.jpg",
            "largeThumbnailUrl": "http://bigpondvideo.com/web/images/content/20160902200925a_326x184.jpg",
            "programType": "Instant Replay",
            "programCategory": "Score",
            "priority": null,
            "lastUpdateDate": "2016-09-02T20:11:56+10:00",
            "isPremium": true,
            "club": [
                500010,
                500005
            ]
        },
        {
            "id": "V0ODBvNTE6GCWZtIqqanpc03yAQTYSaB",
            "contentId": 874671,
            "title": "Rd 26: TRY Josh Jackson (7th min)",
            "description": "The Bulldogs open the scoring in this match through a try to Josh Jackson",
            "publishDate": "2016-09-02T20:07:00+10:00",
            "publisher": "NRL Chief",
            "thumbnailUrl": "http://bigpondvideo.com/web/images/content/20160902200832a_89x50.jpg",
            "largeThumbnailUrl": "http://bigpondvideo.com/web/images/content/20160902200832a_326x184.jpg",
            "programType": "Instant Replay",
            "programCategory": "Score",
            "priority": 10,
            "lastUpdateDate": "2016-09-02T21:42:16+10:00",
            "isPremium": true,
            "club": [
                500010,
                500005
            ]
        }
    ],
    "scores": [
        {
            "gameState": "First Half",
            "gameStateId": 3,
            "gameTime": "0:06:04",
            "gameSeconds": 364,
            "GameMinutes": "06:04",
            "playerId": 500226,
            "playerName": "Josh Jackson",
            "scoreMethod": "Try",
            "statEvent": "Try",
            "statId": 38,
            "statValue": 4,
            "vidRef": 9496,
            "homeScore": 4,
            "commentary": "Try by Josh Jackson",
            "tackleNum": 4,
            "teamId": 500010,
            "teamName": "Canterbury-Bankstown Bulldogs",
            "homeTeamAbbrv": "CBY",
            "awayTeamAbbrv": "SOU"
        },
        {
            "gameState": "First Half",
            "gameStateId": 3,
            "gameTime": "0:07:33",
            "gameSeconds": 453,
            "GameMinutes": "07:33",
            "playerId": 500243,
            "playerName": "Moses Mbye",
            "scoreMethod": "Conversion",
            "statEvent": "Conversion-Made",
            "statId": 1,
            "statValue": 2,
            "vidRef": 11705,
            "homeScore": 6,
            "commentary": "Conversion-Made by Moses Mbye",
            "tackleNum": -1,
            "teamId": 500010,
            "teamName": "Canterbury-Bankstown Bulldogs",
            "homeTeamAbbrv": "CBY",
            "awayTeamAbbrv": "SOU"
        },
        {
            "gameState": "Second Half",
            "gameStateId": 5,
            "gameTime": "1:05:35",
            "gameSeconds": 3935,
            "GameMinutes": "65:35",
            "playerId": 500237,
            "playerName": "Josh Reynolds",
            "scoreMethod": "Try",
            "statEvent": "Try",
            "statId": 38,
            "statValue": 4,
            "vidRef": 105660,
            "homeScore": 10,
            "awayScore": 12,
            "commentary": "Try by Josh Reynolds",
            "tackleNum": 1,
            "teamId": 500010,
            "teamName": "Canterbury-Bankstown Bulldogs",
            "homeTeamAbbrv": "CBY",
            "awayTeamAbbrv": "SOU"
        },
        {
            "gameState": "First Half",
            "gameStateId": 3,
            "gameTime": "0:16:13",
            "gameSeconds": 973,
            "GameMinutes": "16:13",
            "playerId": 500092,
            "playerName": "Sam Burgess",
            "scoreMethod": "Try",
            "statEvent": "Try",
            "statId": 38,
            "statValue": 4,
            "vidRef": 24724,
            "homeScore": 6,
            "awayScore": 4,
            "commentary": "Try by Sam Burgess",
            "tackleNum": 4,
            "teamId": 500005,
            "teamName": "South Sydney Rabbitohs",
            "homeTeamAbbrv": "CBY",
            "awayTeamAbbrv": "SOU"
        },
        {
            "gameState": "First Half",
            "gameStateId": 3,
            "gameTime": "0:17:36",
            "gameSeconds": 1056,
            "GameMinutes": "17:36",
            "playerId": 500086,
            "playerName": "Adam Reynolds",
            "scoreMethod": "Conversion",
            "statEvent": "Conversion-Made",
            "statId": 1,
            "statValue": 2,
            "vidRef": 26794,
            "homeScore": 6,
            "awayScore": 6,
            "commentary": "Conversion-Made by Adam Reynolds",
            "tackleNum": -1,
            "teamId": 500005,
            "teamName": "South Sydney Rabbitohs",
            "homeTeamAbbrv": "CBY",
            "awayTeamAbbrv": "SOU"
        },
        {
            "gameState": "First Half",
            "gameStateId": 3,
            "gameTime": "0:29:32",
            "gameSeconds": 1772,
            "GameMinutes": "29:32",
            "playerId": 502205,
            "playerName": "Joe Burgess",
            "scoreMethod": "Try",
            "statEvent": "Try",
            "statId": 38,
            "statValue": 4,
            "vidRef": 44681,
            "homeScore": 6,
            "awayScore": 10,
            "commentary": "Try by Joe Burgess",
            "tackleNum": 1,
            "teamId": 500005,
            "teamName": "South Sydney Rabbitohs",
            "homeTeamAbbrv": "CBY",
            "awayTeamAbbrv": "SOU"
        },
        {
            "gameState": "First Half",
            "gameStateId": 3,
            "gameTime": "0:30:59",
            "gameSeconds": 1859,
            "GameMinutes": "30:59",
            "playerId": 500086,
            "playerName": "Adam Reynolds",
            "scoreMethod": "Conversion",
            "statEvent": "Conversion-Made",
            "statId": 1,
            "statValue": 2,
            "vidRef": 47833,
            "homeScore": 6,
            "awayScore": 12,
            "commentary": "Conversion-Made by Adam Reynolds",
            "tackleNum": -1,
            "teamId": 500005,
            "teamName": "South Sydney Rabbitohs",
            "homeTeamAbbrv": "CBY",
            "awayTeamAbbrv": "SOU"
        },
        {
            "gameState": "Second Half",
            "gameStateId": 5,
            "gameTime": "1:11:48",
            "gameSeconds": 4308,
            "GameMinutes": "71:48",
            "playerId": 500105,
            "playerName": "Aaron Gray",
            "scoreMethod": "Try",
            "statEvent": "Try",
            "statId": 38,
            "statValue": 4,
            "vidRef": 116014,
            "homeScore": 10,
            "awayScore": 16,
            "commentary": "Try by Aaron Gray",
            "tackleNum": 4,
            "teamId": 500005,
            "teamName": "South Sydney Rabbitohs",
            "homeTeamAbbrv": "CBY",
            "awayTeamAbbrv": "SOU"
        },
        {
            "gameState": "Second Half",
            "gameStateId": 5,
            "gameTime": "1:13:12",
            "gameSeconds": 4392,
            "GameMinutes": "73:12",
            "playerId": 500086,
            "playerName": "Adam Reynolds",
            "scoreMethod": "Conversion",
            "statEvent": "Conversion-Made",
            "statId": 1,
            "statValue": 2,
            "vidRef": 118429,
            "homeScore": 10,
            "awayScore": 18,
            "commentary": "Conversion-Made by Adam Reynolds",
            "tackleNum": -1,
            "teamId": 500005,
            "teamName": "South Sydney Rabbitohs",
            "homeTeamAbbrv": "CBY",
            "awayTeamAbbrv": "SOU"
        },
        {
            "gameState": "Second Half",
            "gameStateId": 5,
            "gameTime": "1:15:31",
            "gameSeconds": 4531,
            "GameMinutes": "75:31",
            "playerId": 500105,
            "playerName": "Aaron Gray",
            "scoreMethod": "Try",
            "statEvent": "Try",
            "statId": 38,
            "statValue": 4,
            "vidRef": 121917,
            "homeScore": 10,
            "awayScore": 22,
            "commentary": "Try by Aaron Gray",
            "tackleNum": 4,
            "teamId": 500005,
            "teamName": "South Sydney Rabbitohs",
            "homeTeamAbbrv": "CBY",
            "awayTeamAbbrv": "SOU"
        },
        {
            "gameState": "Second Half",
            "gameStateId": 5,
            "gameTime": "1:16:56",
            "gameSeconds": 4616,
            "GameMinutes": "76:56",
            "playerId": 500086,
            "playerName": "Adam Reynolds",
            "scoreMethod": "Conversion",
            "statEvent": "Conversion-Made",
            "statId": 1,
            "statValue": 2,
            "vidRef": 124527,
            "homeScore": 10,
            "awayScore": 24,
            "commentary": "Conversion-Made by Adam Reynolds",
            "tackleNum": -1,
            "teamId": 500005,
            "teamName": "South Sydney Rabbitohs",
            "homeTeamAbbrv": "CBY",
            "awayTeamAbbrv": "SOU"
        },
        {
            "gameState": "Second Half",
            "gameStateId": 5,
            "gameTime": "1:19:13",
            "gameSeconds": 4753,
            "GameMinutes": "79:13",
            "playerId": 502205,
            "playerName": "Joe Burgess",
            "scoreMethod": "Try",
            "statEvent": "Try",
            "statId": 38,
            "statValue": 4,
            "vidRef": 128759,
            "homeScore": 10,
            "awayScore": 28,
            "commentary": "Try by Joe Burgess",
            "tackleNum": 3,
            "teamId": 500005,
            "teamName": "South Sydney Rabbitohs",
            "homeTeamAbbrv": "CBY",
            "awayTeamAbbrv": "SOU"
        }
    ]
}