{
    "vod": [
        {
            "id": "B0NzR4MzE66O8fJo0BRUIsfsiq3CtHsD",
            "contentId": 851343,
            "title": "Rd 13: GOAL Trent Hodkinson (80th min)",
            "description": "Trent Hodkinson converts the Lachlan Fitzgibbon Try",
            "publishDate": "2016-06-04T19:17:00+10:00",
            "publisher": "NRL Chief",
            "thumbnailUrl": "http://bigpondvideo.com/web/images/content/20160604192307a_89x50.jpg",
            "largeThumbnailUrl": "http://bigpondvideo.com/web/images/content/20160604192307a_326x184.jpg",
            "programType": "Instant Replay",
            "programCategory": "Score",
            "priority": null,
            "lastUpdateDate": "2016-06-04T19:32:49+10:00",
            "isPremium": true,
            "club": [
                500003,
                500012
            ]
        },
        {
            "id": "0zNzR4MzE6uHxmlCl7fuXdcR1nM_ah7i",
            "contentId": 851342,
            "title": "Rd 13: TRY Lachlan Fitzgibbon (79th min)",
            "description": "Lachlan Fitzgibbon scores a try for the Knights",
            "publishDate": "2016-06-04T19:15:00+10:00",
            "publisher": "NRL Chief",
            "thumbnailUrl": "http://bigpondvideo.com/web/images/content/20160604191920a_89x50.jpg",
            "largeThumbnailUrl": "http://bigpondvideo.com/web/images/content/20160604191920a_326x184.jpg",
            "programType": "Instant Replay",
            "programCategory": "Score",
            "priority": null,
            "lastUpdateDate": "2016-06-04T19:30:49+10:00",
            "isPremium": true,
            "club": [
                500003,
                500012
            ]
        },
        {
            "id": "Z5MjR4MzE6lLvmVlc4OHhpYXHV0Ytzj9",
            "contentId": 851341,
            "title": "Rd 13: TRY Kyle Feldt (74th min)",
            "description": "Kyle Feldt scores a try for the Cowboys",
            "publishDate": "2016-06-04T19:10:00+10:00",
            "publisher": "NRL Chief",
            "thumbnailUrl": "http://bigpondvideo.com/web/images/content/20160604191346a_89x50.jpg",
            "largeThumbnailUrl": "http://bigpondvideo.com/web/images/content/20160604191346a_326x184.jpg",
            "programType": "Instant Replay",
            "programCategory": "Score",
            "priority": null,
            "lastUpdateDate": "2016-06-04T19:17:46+10:00",
            "isPremium": true,
            "club": [
                500003,
                500012
            ]
        },
        {
            "id": "t5MDR4MzE65Bm_AaMYFnYvyNuoezSMjC",
            "contentId": 851339,
            "title": "Rd 13: TRY Jake Mamo (67th min)",
            "description": "Jake Mamo scores a try for the Knights",
            "publishDate": "2016-06-04T19:02:00+10:00",
            "publisher": "NRL Chief",
            "thumbnailUrl": "http://bigpondvideo.com/web/images/content/20160604190713a_89x50.jpg",
            "largeThumbnailUrl": "http://bigpondvideo.com/web/images/content/20160604190713a_326x184.jpg",
            "programType": "Instant Replay",
            "programCategory": "Score",
            "priority": null,
            "lastUpdateDate": "2016-06-04T19:11:45+10:00",
            "isPremium": true,
            "club": [
                500003,
                500012
            ]
        },
        {
            "id": "w1eTN4MzE6so8lj5wpiu-AE3UY1K_yqm",
            "contentId": 851338,
            "title": "Rd 13: GOAL Johnathan Thurston (61st min)",
            "description": "Johnathan Thurston converts the Rory Kostjasyn Try",
            "publishDate": "2016-06-04T18:56:00+10:00",
            "publisher": "NRL Chief",
            "thumbnailUrl": "http://bigpondvideo.com/web/images/content/20160604190057a_89x50.jpg",
            "largeThumbnailUrl": "http://bigpondvideo.com/web/images/content/20160604190057a_326x184.jpg",
            "programType": "Instant Replay",
            "programCategory": "Score",
            "priority": null,
            "lastUpdateDate": "2016-06-04T19:05:43+10:00",
            "isPremium": true,
            "club": [
                500003,
                500012
            ]
        },
        {
            "id": "M0eDN4MzE6dfwm7SWz8f7c3Y56qQ195B",
            "contentId": 851337,
            "title": "Rd 13: TRY Rory Kostjasyn (60th min)",
            "description": "Rory Kostjasyn scores a try for the Cowboys",
            "publishDate": "2016-06-04T18:55:00+10:00",
            "publisher": "NRL Chief",
            "thumbnailUrl": "http://bigpondvideo.com/web/images/content/20160604185935a_89x50.jpg",
            "largeThumbnailUrl": "http://bigpondvideo.com/web/images/content/20160604185935a_326x184.jpg",
            "programType": "Instant Replay",
            "programCategory": "Score",
            "priority": null,
            "lastUpdateDate": "2016-06-04T19:02:43+10:00",
            "isPremium": true,
            "club": [
                500003,
                500012
            ]
        },
        {
            "id": "M2djN4MzE6dRNvOCzYfgP730q1Qhf4GF",
            "contentId": 851335,
            "title": "Rd 13: GOAL Johnathan Thurston (54th min)",
            "description": "Johnathan Thurston converts the Kyle Feldt Try",
            "publishDate": "2016-06-04T18:48:00+10:00",
            "publisher": "NRL Chief",
            "thumbnailUrl": "http://bigpondvideo.com/web/images/content/20160604185358a_89x50.jpg",
            "largeThumbnailUrl": "http://bigpondvideo.com/web/images/content/20160604185358a_326x184.jpg",
            "programType": "Instant Replay",
            "programCategory": "Score",
            "priority": null,
            "lastUpdateDate": "2016-06-04T18:57:41+10:00",
            "isPremium": true,
            "club": [
                500003,
                500012
            ]
        },
        {
            "id": "44djN4MzE6PvQDbwrmBAIPU33Y7Iyqak",
            "contentId": 851334,
            "title": "Rd 13: TRY Kyle Feldt (53rd min)",
            "description": "Kyle Feldt scores a try for the Cowboys",
            "publishDate": "2016-06-04T18:47:00+10:00",
            "publisher": "NRL Chief",
            "thumbnailUrl": "http://bigpondvideo.com/web/images/content/20160604185252a_89x50.jpg",
            "largeThumbnailUrl": "http://bigpondvideo.com/web/images/content/20160604185252a_326x184.jpg",
            "programType": "Instant Replay",
            "programCategory": "Score",
            "priority": null,
            "lastUpdateDate": "2016-06-04T18:57:41+10:00",
            "isPremium": true,
            "club": [
                500003,
                500012
            ]
        },
        {
            "id": "J2czN4MzE6V57FksiFJBsOBzSrbSIroF",
            "contentId": 851333,
            "title": "Rd 13: GOAL Johnathan Thurston (46th min)",
            "description": "Johnathan Thurston converts the Jake Granville Try",
            "publishDate": "2016-06-04T18:40:00+10:00",
            "publisher": "NRL Chief",
            "thumbnailUrl": "http://bigpondvideo.com/web/images/content/20160604184557a_89x50.jpg",
            "largeThumbnailUrl": "http://bigpondvideo.com/web/images/content/20160604184557a_326x184.jpg",
            "programType": "Instant Replay",
            "programCategory": "Score",
            "priority": null,
            "lastUpdateDate": "2016-06-04T18:49:40+10:00",
            "isPremium": true,
            "club": [
                500003,
                500012
            ]
        },
        {
            "id": "UzczN4MzE6lv9qD2HEgufish0Wa5cDq9",
            "contentId": 851332,
            "title": "Rd 13: TRY Jake Granville (45th min)",
            "description": "Jake Granville scores a try for the Cowboys",
            "publishDate": "2016-06-04T18:39:00+10:00",
            "publisher": "NRL Chief",
            "thumbnailUrl": "http://bigpondvideo.com/web/images/content/20160604184341a_89x50.jpg",
            "largeThumbnailUrl": "http://bigpondvideo.com/web/images/content/20160604184341a_326x184.jpg",
            "programType": "Instant Replay",
            "programCategory": "Score",
            "priority": null,
            "lastUpdateDate": "2016-06-04T18:47:39+10:00",
            "isPremium": true,
            "club": [
                500003,
                500012
            ]
        },
        {
            "id": "R0azN4MzE65VCNL5hQueCKfgwejZtdWg",
            "contentId": 851331,
            "title": "Rd 13: GOAL Johnathan Thurston (37th min)",
            "description": "Johnathan Thurston converts the Ray Thompson Try",
            "publishDate": "2016-06-04T18:15:00+10:00",
            "publisher": "NRL Chief",
            "thumbnailUrl": "http://bigpondvideo.com/web/images/content/20160604181955a_89x50.jpg",
            "largeThumbnailUrl": "http://bigpondvideo.com/web/images/content/20160604181955a_326x184.jpg",
            "programType": "Instant Replay",
            "programCategory": "Score",
            "priority": null,
            "lastUpdateDate": "2016-06-04T18:46:39+10:00",
            "isPremium": true,
            "club": [
                500003,
                500012
            ]
        },
        {
            "id": "d5ajN4MzE6QGJnDwF4oHFhpMMkstDw6u",
            "contentId": 851330,
            "title": "Rd 13: TRY Ray Thompson (36th min)",
            "description": "Ray Thompson scores his 2nd try for the Cowboys",
            "publishDate": "2016-06-04T18:13:00+10:00",
            "publisher": "NRL Chief",
            "thumbnailUrl": "http://bigpondvideo.com/web/images/content/20160604181716a_89x50.jpg",
            "largeThumbnailUrl": "http://bigpondvideo.com/web/images/content/20160604181716a_326x184.jpg",
            "programType": "Instant Replay",
            "programCategory": "Score",
            "priority": null,
            "lastUpdateDate": "2016-06-04T18:20:33+10:00",
            "isPremium": true,
            "club": [
                500003,
                500012
            ]
        },
        {
            "id": "lzaDN4MzE6231Qs_X7OnfKhHDNFpELL2",
            "contentId": 851328,
            "title": "Rd 13: GOAL Johnathan Thurston (30th min)",
            "description": "Johnathan Thurston converts the Gavin Cooper Try",
            "publishDate": "2016-06-04T18:09:00+10:00",
            "publisher": "NRL Chief",
            "thumbnailUrl": "http://bigpondvideo.com/web/images/content/20160604181138a_89x50.jpg",
            "largeThumbnailUrl": "http://bigpondvideo.com/web/images/content/20160604181138a_326x184.jpg",
            "programType": "Instant Replay",
            "programCategory": "Score",
            "priority": null,
            "lastUpdateDate": "2016-06-04T18:15:31+10:00",
            "isPremium": true,
            "club": [
                500003,
                500012
            ]
        },
        {
            "id": "JjaDN4MzE6p0p6DCgsj0gMaauBjUej8J",
            "contentId": 851327,
            "title": "Rd 13: TRY Gavin Cooper (29th min)",
            "description": "Gavin Cooper scores for the Cowboys",
            "publishDate": "2016-06-04T18:08:00+10:00",
            "publisher": "NRL Chief",
            "thumbnailUrl": "http://bigpondvideo.com/web/images/content/20160604180938a_89x50.jpg",
            "largeThumbnailUrl": "http://bigpondvideo.com/web/images/content/20160604180938a_326x184.jpg",
            "programType": "Instant Replay",
            "programCategory": "Score",
            "priority": null,
            "lastUpdateDate": "2016-06-04T18:14:31+10:00",
            "isPremium": true,
            "club": [
                500003,
                500012
            ]
        },
        {
            "id": "05ZzN4MzE6kS4if4_vK6NtoPA4Lt2qXG",
            "contentId": 851326,
            "title": "Rd 13: GOAL Johnathan Thurston (27th min)",
            "description": "Johnathan Thurston converts the Ray Thompson Try",
            "publishDate": "2016-06-04T18:06:00+10:00",
            "publisher": "NRL Chief",
            "thumbnailUrl": "http://bigpondvideo.com/web/images/content/20160604180808a_89x50.jpg",
            "largeThumbnailUrl": "http://bigpondvideo.com/web/images/content/20160604180808a_326x184.jpg",
            "programType": "Instant Replay",
            "programCategory": "Score",
            "priority": null,
            "lastUpdateDate": "2016-06-04T18:11:30+10:00",
            "isPremium": true,
            "club": [
                500003,
                500012
            ]
        },
        {
            "id": "8xZzN4MzE6xyNpqqGvbbjs5x9t4hfHi1",
            "contentId": 851325,
            "title": "Rd 13: TRY Ray Thompson (26th min)",
            "description": "Ray Thompson scores for the Cowboys",
            "publishDate": "2016-06-04T18:05:00+10:00",
            "publisher": "NRL Chief",
            "thumbnailUrl": "http://bigpondvideo.com/web/images/content/20160604180753a_89x50.jpg",
            "largeThumbnailUrl": "http://bigpondvideo.com/web/images/content/20160604180753a_326x184.jpg",
            "programType": "Instant Replay",
            "programCategory": "Score",
            "priority": null,
            "lastUpdateDate": "2016-06-04T18:11:30+10:00",
            "isPremium": true,
            "club": [
                500003,
                500012
            ]
        },
        {
            "id": "k0ZjN4MzE6euodjzIvpMR6ZxD_x5rppM",
            "contentId": 851324,
            "title": "Rd 13: GOAL Trent Hodkinson (22nd min)",
            "description": "Trent Hodkinson converts the Cory Denniss Try",
            "publishDate": "2016-06-04T17:59:00+10:00",
            "publisher": "NRL Chief",
            "thumbnailUrl": "http://bigpondvideo.com/web/images/content/20160604180428a_89x50.jpg",
            "largeThumbnailUrl": "http://bigpondvideo.com/web/images/content/20160604180428a_326x184.jpg",
            "programType": "Instant Replay",
            "programCategory": "Score",
            "priority": null,
            "lastUpdateDate": "2016-06-04T18:08:29+10:00",
            "isPremium": true,
            "club": [
                500003,
                500012
            ]
        },
        {
            "id": "syZjN4MzE6e24OOM1jCjUwLjQNPT_tdd",
            "contentId": 851323,
            "title": "Rd 13: TRY Cory Denniss (21st min)",
            "description": "Cory Denniss scores for the Knights",
            "publishDate": "2016-06-04T17:58:00+10:00",
            "publisher": "NRL Chief",
            "thumbnailUrl": "http://bigpondvideo.com/web/images/content/20160604180257a_89x50.jpg",
            "largeThumbnailUrl": "http://bigpondvideo.com/web/images/content/20160604180257a_326x184.jpg",
            "programType": "Instant Replay",
            "programCategory": "Score",
            "priority": null,
            "lastUpdateDate": "2016-06-04T18:08:29+10:00",
            "isPremium": true,
            "club": [
                500003,
                500012
            ]
        },
        {
            "id": "11YjN4MzE6C1_019zz8gzrTiUR5OWxyQ",
            "contentId": 851322,
            "title": "Rd 13: GOAL Johnathan Thurston (13th min)",
            "description": "Johnathan Thurston converts the Antonio Winterstein Try",
            "publishDate": "2016-06-04T17:49:00+10:00",
            "publisher": "NRL Chief",
            "thumbnailUrl": "http://bigpondvideo.com/web/images/content/20160604175359a_89x50.jpg",
            "largeThumbnailUrl": "http://bigpondvideo.com/web/images/content/20160604175359a_326x184.jpg",
            "programType": "Instant Replay",
            "programCategory": "Score",
            "priority": null,
            "lastUpdateDate": "2016-06-04T17:57:27+10:00",
            "isPremium": true,
            "club": [
                500003,
                500012
            ]
        },
        {
            "id": "xvYjN4MzE6BEWrIMO9E2DIVKBhqQgYQV",
            "contentId": 851321,
            "title": "Rd 13: TRY Antonio Winterstein (11th min)",
            "description": "Antonio Winterstein scores the first try of the game",
            "publishDate": "2016-06-04T17:48:00+10:00",
            "publisher": "NRL Chief",
            "thumbnailUrl": "http://bigpondvideo.com/web/images/content/20160604175157a_89x50.jpg",
            "largeThumbnailUrl": "http://bigpondvideo.com/web/images/content/20160604175157a_326x184.jpg",
            "programType": "Instant Replay",
            "programCategory": "Score",
            "priority": null,
            "lastUpdateDate": "2016-06-04T17:56:27+10:00",
            "isPremium": true,
            "club": [
                500003,
                500012
            ]
        }
    ],
    "scores": [
        {
            "gameState": "First Half",
            "gameStateId": 3,
            "gameTime": "0:10:55",
            "gameSeconds": 655,
            "GameMinutes": "10:55",
            "playerId": 500305,
            "playerName": "Antonio Winterstein",
            "scoreMethod": "Try",
            "statEvent": "Try",
            "statId": 38,
            "statValue": 4,
            "vidRef": 17490,
            "homeScore": 4,
            "commentary": "Try by Antonio Winterstein",
            "tackleNum": 3,
            "teamId": 500012,
            "teamName": "North Queensland Cowboys",
            "homeTeamAbbrv": "NQL",
            "awayTeamAbbrv": "NEW"
        },
        {
            "gameState": "First Half",
            "gameStateId": 3,
            "gameTime": "0:12:19",
            "gameSeconds": 739,
            "GameMinutes": "12:19",
            "playerId": 500304,
            "playerName": "Johnathan Thurston",
            "scoreMethod": "Conversion",
            "statEvent": "Conversion-Made",
            "statId": 1,
            "statValue": 2,
            "vidRef": 20390,
            "homeScore": 6,
            "commentary": "Conversion-Made by Johnathan Thurston",
            "tackleNum": -1,
            "teamId": 500012,
            "teamName": "North Queensland Cowboys",
            "homeTeamAbbrv": "NQL",
            "awayTeamAbbrv": "NEW"
        },
        {
            "gameState": "First Half",
            "gameStateId": 3,
            "gameTime": "0:25:01",
            "gameSeconds": 1501,
            "GameMinutes": "25:01",
            "playerId": 500302,
            "playerName": "Ray Thompson",
            "scoreMethod": "Try",
            "statEvent": "Try",
            "statId": 38,
            "statValue": 4,
            "vidRef": 39985,
            "homeScore": 10,
            "awayScore": 6,
            "commentary": "Try by Ray Thompson",
            "tackleNum": 3,
            "teamId": 500012,
            "teamName": "North Queensland Cowboys",
            "homeTeamAbbrv": "NQL",
            "awayTeamAbbrv": "NEW"
        },
        {
            "gameState": "First Half",
            "gameStateId": 3,
            "gameTime": "0:26:24",
            "gameSeconds": 1584,
            "GameMinutes": "26:24",
            "playerId": 500304,
            "playerName": "Johnathan Thurston",
            "scoreMethod": "Conversion",
            "statEvent": "Conversion-Made",
            "statId": 1,
            "statValue": 2,
            "vidRef": 42070,
            "homeScore": 12,
            "awayScore": 6,
            "commentary": "Conversion-Made by Johnathan Thurston",
            "tackleNum": -1,
            "teamId": 500012,
            "teamName": "North Queensland Cowboys",
            "homeTeamAbbrv": "NQL",
            "awayTeamAbbrv": "NEW"
        },
        {
            "gameState": "First Half",
            "gameStateId": 3,
            "gameTime": "0:28:04",
            "gameSeconds": 1684,
            "GameMinutes": "28:04",
            "playerId": 500280,
            "playerName": "Gavin Cooper",
            "scoreMethod": "Try",
            "statEvent": "Try",
            "statId": 38,
            "statValue": 4,
            "vidRef": 46251,
            "homeScore": 16,
            "awayScore": 6,
            "commentary": "Try by Gavin Cooper",
            "tackleNum": 6,
            "teamId": 500012,
            "teamName": "North Queensland Cowboys",
            "homeTeamAbbrv": "NQL",
            "awayTeamAbbrv": "NEW"
        },
        {
            "gameState": "First Half",
            "gameStateId": 3,
            "gameTime": "0:28:56",
            "gameSeconds": 1736,
            "GameMinutes": "28:56",
            "playerId": 500304,
            "playerName": "Johnathan Thurston",
            "scoreMethod": "Conversion",
            "statEvent": "Conversion-Made",
            "statId": 1,
            "statValue": 2,
            "vidRef": 47547,
            "homeScore": 18,
            "awayScore": 6,
            "commentary": "Conversion-Made by Johnathan Thurston",
            "tackleNum": -1,
            "teamId": 500012,
            "teamName": "North Queensland Cowboys",
            "homeTeamAbbrv": "NQL",
            "awayTeamAbbrv": "NEW"
        },
        {
            "gameState": "First Half",
            "gameStateId": 3,
            "gameTime": "0:35:08",
            "gameSeconds": 2108,
            "GameMinutes": "35:08",
            "playerId": 500302,
            "playerName": "Ray Thompson",
            "scoreMethod": "Try",
            "statEvent": "Try",
            "statId": 38,
            "statValue": 4,
            "vidRef": 56852,
            "homeScore": 22,
            "awayScore": 6,
            "commentary": "Try by Ray Thompson",
            "tackleNum": 3,
            "teamId": 500012,
            "teamName": "North Queensland Cowboys",
            "homeTeamAbbrv": "NQL",
            "awayTeamAbbrv": "NEW"
        },
        {
            "gameState": "First Half",
            "gameStateId": 3,
            "gameTime": "0:36:01",
            "gameSeconds": 2161,
            "GameMinutes": "36:01",
            "playerId": 500304,
            "playerName": "Johnathan Thurston",
            "scoreMethod": "Conversion",
            "statEvent": "Conversion-Made",
            "statId": 1,
            "statValue": 2,
            "vidRef": 58184,
            "homeScore": 24,
            "awayScore": 6,
            "commentary": "Conversion-Made by Johnathan Thurston",
            "tackleNum": -1,
            "teamId": 500012,
            "teamName": "North Queensland Cowboys",
            "homeTeamAbbrv": "NQL",
            "awayTeamAbbrv": "NEW"
        },
        {
            "gameState": "Second Half",
            "gameStateId": 5,
            "gameTime": "0:44:46",
            "gameSeconds": 2686,
            "GameMinutes": "44:46",
            "playerId": 500251,
            "playerName": "Jake Granville",
            "scoreMethod": "Try",
            "statEvent": "Try",
            "statId": 38,
            "statValue": 4,
            "vidRef": 74711,
            "homeScore": 28,
            "awayScore": 6,
            "commentary": "Try by Jake Granville",
            "tackleNum": 4,
            "teamId": 500012,
            "teamName": "North Queensland Cowboys",
            "homeTeamAbbrv": "NQL",
            "awayTeamAbbrv": "NEW"
        },
        {
            "gameState": "Second Half",
            "gameStateId": 5,
            "gameTime": "0:45:24",
            "gameSeconds": 2724,
            "GameMinutes": "45:24",
            "playerId": 500304,
            "playerName": "Johnathan Thurston",
            "scoreMethod": "Conversion",
            "statEvent": "Conversion-Made",
            "statId": 1,
            "statValue": 2,
            "vidRef": 75663,
            "homeScore": 30,
            "awayScore": 6,
            "commentary": "Conversion-Made by Johnathan Thurston",
            "tackleNum": -1,
            "teamId": 500012,
            "teamName": "North Queensland Cowboys",
            "homeTeamAbbrv": "NQL",
            "awayTeamAbbrv": "NEW"
        },
        {
            "gameState": "Second Half",
            "gameStateId": 5,
            "gameTime": "0:52:38",
            "gameSeconds": 3158,
            "GameMinutes": "52:38",
            "playerId": 500282,
            "playerName": "Kyle Feldt",
            "scoreMethod": "Try",
            "statEvent": "Try",
            "statId": 38,
            "statValue": 4,
            "vidRef": 87556,
            "homeScore": 34,
            "awayScore": 6,
            "commentary": "Try by Kyle Feldt",
            "tackleNum": 2,
            "teamId": 500012,
            "teamName": "North Queensland Cowboys",
            "homeTeamAbbrv": "NQL",
            "awayTeamAbbrv": "NEW"
        },
        {
            "gameState": "Second Half",
            "gameStateId": 5,
            "gameTime": "0:53:54",
            "gameSeconds": 3234,
            "GameMinutes": "53:54",
            "playerId": 500304,
            "playerName": "Johnathan Thurston",
            "scoreMethod": "Conversion",
            "statEvent": "Conversion-Made",
            "statId": 1,
            "statValue": 2,
            "vidRef": 89462,
            "homeScore": 36,
            "awayScore": 6,
            "commentary": "Conversion-Made by Johnathan Thurston",
            "tackleNum": -1,
            "teamId": 500012,
            "teamName": "North Queensland Cowboys",
            "homeTeamAbbrv": "NQL",
            "awayTeamAbbrv": "NEW"
        },
        {
            "gameState": "Second Half",
            "gameStateId": 5,
            "gameTime": "0:59:15",
            "gameSeconds": 3555,
            "GameMinutes": "59:15",
            "playerId": 500287,
            "playerName": "Rory Kostjasyn",
            "scoreMethod": "Try",
            "statEvent": "Try",
            "statId": 38,
            "statValue": 4,
            "vidRef": 97479,
            "homeScore": 40,
            "awayScore": 6,
            "commentary": "Try by Rory Kostjasyn",
            "tackleNum": 3,
            "teamId": 500012,
            "teamName": "North Queensland Cowboys",
            "homeTeamAbbrv": "NQL",
            "awayTeamAbbrv": "NEW"
        },
        {
            "gameState": "Second Half",
            "gameStateId": 5,
            "gameTime": "1:00:20",
            "gameSeconds": 3620,
            "GameMinutes": "60:20",
            "playerId": 500304,
            "playerName": "Johnathan Thurston",
            "scoreMethod": "Conversion",
            "statEvent": "Conversion-Made",
            "statId": 1,
            "statValue": 2,
            "vidRef": 99113,
            "homeScore": 42,
            "awayScore": 6,
            "commentary": "Conversion-Made by Johnathan Thurston",
            "tackleNum": -1,
            "teamId": 500012,
            "teamName": "North Queensland Cowboys",
            "homeTeamAbbrv": "NQL",
            "awayTeamAbbrv": "NEW"
        },
        {
            "gameState": "Second Half",
            "gameStateId": 5,
            "gameTime": "1:13:31",
            "gameSeconds": 4411,
            "GameMinutes": "73:31",
            "playerId": 500282,
            "playerName": "Kyle Feldt",
            "scoreMethod": "Try",
            "statEvent": "Try",
            "statId": 38,
            "statValue": 4,
            "vidRef": 120208,
            "homeScore": 46,
            "awayScore": 10,
            "commentary": "Try by Kyle Feldt",
            "tackleNum": 3,
            "teamId": 500012,
            "teamName": "North Queensland Cowboys",
            "homeTeamAbbrv": "NQL",
            "awayTeamAbbrv": "NEW"
        },
        {
            "gameState": "First Half",
            "gameStateId": 3,
            "gameTime": "0:20:16",
            "gameSeconds": 1216,
            "GameMinutes": "20:16",
            "playerId": 504066,
            "playerName": "Cory Denniss",
            "scoreMethod": "Try",
            "statEvent": "Try",
            "statId": 38,
            "statValue": 4,
            "vidRef": 32321,
            "homeScore": 6,
            "awayScore": 4,
            "commentary": "Try by Cory Denniss",
            "tackleNum": 5,
            "teamId": 500003,
            "teamName": "Newcastle Knights",
            "homeTeamAbbrv": "NQL",
            "awayTeamAbbrv": "NEW"
        },
        {
            "gameState": "First Half",
            "gameStateId": 3,
            "gameTime": "0:21:41",
            "gameSeconds": 1301,
            "GameMinutes": "21:41",
            "playerId": 500224,
            "playerName": "Trent Hodkinson",
            "scoreMethod": "Conversion",
            "statEvent": "Conversion-Made",
            "statId": 1,
            "statValue": 2,
            "vidRef": 34944,
            "homeScore": 6,
            "awayScore": 6,
            "commentary": "Conversion-Made by Trent Hodkinson",
            "tackleNum": -1,
            "teamId": 500003,
            "teamName": "Newcastle Knights",
            "homeTeamAbbrv": "NQL",
            "awayTeamAbbrv": "NEW"
        },
        {
            "gameState": "Second Half",
            "gameStateId": 5,
            "gameTime": "1:06:38",
            "gameSeconds": 3998,
            "GameMinutes": "66:38",
            "playerId": 500553,
            "playerName": "Jake Mamo",
            "scoreMethod": "Try",
            "statEvent": "Try",
            "statId": 38,
            "statValue": 4,
            "vidRef": 109179,
            "homeScore": 42,
            "awayScore": 10,
            "commentary": "Try by Jake Mamo",
            "tackleNum": 5,
            "teamId": 500003,
            "teamName": "Newcastle Knights",
            "homeTeamAbbrv": "NQL",
            "awayTeamAbbrv": "NEW"
        },
        {
            "gameState": "Second Half",
            "gameStateId": 5,
            "gameTime": "1:18:59",
            "gameSeconds": 4739,
            "GameMinutes": "78:59",
            "playerId": 500547,
            "playerName": "Lachlan Fitzgibbon",
            "scoreMethod": "Try",
            "statEvent": "Try",
            "statId": 38,
            "statValue": 4,
            "vidRef": 129413,
            "homeScore": 46,
            "awayScore": 14,
            "commentary": "Try by Lachlan Fitzgibbon",
            "tackleNum": 6,
            "teamId": 500003,
            "teamName": "Newcastle Knights",
            "homeTeamAbbrv": "NQL",
            "awayTeamAbbrv": "NEW"
        },
        {
            "gameState": "Second Half",
            "gameStateId": 5,
            "gameTime": "1:19:52",
            "gameSeconds": 4792,
            "GameMinutes": "79:52",
            "playerId": 500224,
            "playerName": "Trent Hodkinson",
            "scoreMethod": "Conversion",
            "statEvent": "Conversion-Made",
            "statId": 1,
            "statValue": 2,
            "vidRef": 130738,
            "homeScore": 46,
            "awayScore": 16,
            "commentary": "Conversion-Made by Trent Hodkinson",
            "tackleNum": -1,
            "teamId": 500003,
            "teamName": "Newcastle Knights",
            "homeTeamAbbrv": "NQL",
            "awayTeamAbbrv": "NEW"
        }
    ]
}