{
    "vod": [
        {
            "id": "lkZXhkdzpcLMcZNfjhGqME3d92u6iWwf",
            "contentId": 787227,
            "title": "Rd 26: Sharks v Sea Eagles (2)",
            "description": "2nd half replay of the match between the Sharks & Sea Eagles",
            "publishDate": "2015-09-07T06:00:00+10:00",
            "publisher": "NRL Chief",
            "thumbnailUrl": "http://bigpondvideo.com/Web/Images/Content/20150906182329a_89x50.jpg",
            "largeThumbnailUrl": "http://bigpondvideo.com/Web/Images/Content/20150906182329a_326x184.jpg",
            "programType": "Matches",
            "programCategory": "Replay: 2nd Half",
            "priority": null,
            "lastUpdateDate": "2015-09-06T21:23:51+10:00",
            "isPremium": true,
            "club": [
                500028,
                500002
            ]
        },
        {
            "id": "tvZHhkdzrIrgJQPYB_fofwhnDZmsvxS5",
            "contentId": 787226,
            "title": "Rd 26: Sharks v Sea Eagles (1)",
            "description": "1st half replay of the match between the Sharks & Sea Eagles",
            "publishDate": "2015-09-07T06:00:00+10:00",
            "publisher": "NRL Chief",
            "thumbnailUrl": "http://bigpondvideo.com/Web/Images/Content/20150906182243a_89x50.jpg",
            "largeThumbnailUrl": "http://bigpondvideo.com/Web/Images/Content/20150906182243a_326x184.jpg",
            "programType": "Matches",
            "programCategory": "Replay: 1st Half",
            "priority": null,
            "lastUpdateDate": "2015-09-06T21:22:52+10:00",
            "isPremium": true,
            "club": [
                500028,
                500002
            ]
        },
        {
            "id": "p5Y3dkdzoIgbSGbhJyMotmsGd9dAnep6",
            "contentId": 787153,
            "title": "Rd 26: Sharks v Sea Eagles (Hls)",
            "description": "Highlights of the match between the Sharks & Sea Eagles from Remondis Stadium",
            "publishDate": "2015-09-06T18:23:00+10:00",
            "publisher": "NRL Chief",
            "thumbnailUrl": "http://bigpondvideo.com/Web/Images/Content/20150906183219a_89x50.jpg",
            "largeThumbnailUrl": "http://bigpondvideo.com/Web/Images/Content/20150906183219a_326x184.jpg",
            "programType": "Highlights",
            "programCategory": "Match",
            "priority": null,
            "lastUpdateDate": "2015-09-06T18:34:33+10:00",
            "isPremium": false,
            "club": [
                500028,
                500002
            ]
        },
        {
            "id": "x3a3dkdzrpEuDEDBP7v2V5nsCVNtgmiS",
            "contentId": 787187,
            "title": "Rd 26 Press Conference: Sharks",
            "description": "The Sharks coach faces the media following the match",
            "publishDate": "2015-09-06T18:55:00+10:00",
            "publisher": "NRL Chief",
            "thumbnailUrl": "http://bigpondvideo.com/Web/Images/Content/20150906185030a_89x50.jpg",
            "largeThumbnailUrl": "http://bigpondvideo.com/Web/Images/Content/20150906185030a_326x184.jpg",
            "programType": "Press Conference",
            "programCategory": null,
            "priority": null,
            "lastUpdateDate": "2015-09-06T19:04:01+10:00",
            "isPremium": false,
            "club": [
                500028,
                500002
            ]
        },
        {
            "id": "RyaHdkdzrUXi9vqQc5tFfG9zLZyBErIk",
            "contentId": 787188,
            "title": "Rd 26 Press Conference: Sea Eagles",
            "description": "The Sea Eagles coach faces the media following the match",
            "publishDate": "2015-09-06T18:43:10+10:00",
            "publisher": "NRL Chief",
            "thumbnailUrl": "http://bigpondvideo.com/Web/Images/Content/20150906183711a_89x50.jpg",
            "largeThumbnailUrl": "http://bigpondvideo.com/Web/Images/Content/20150906183711a_326x184.jpg",
            "programType": "Press Conference",
            "programCategory": null,
            "priority": null,
            "lastUpdateDate": "2015-09-06T18:53:58+10:00",
            "isPremium": false,
            "club": [
                500028,
                500002
            ]
        },
        {
            "id": "V4N3dkdzowd1a5dVz0ymk3eHHTEdCsZM",
            "contentId": 788307,
            "title": "Rd 26: TRY Tom Trbojevic (68th min)",
            "description": "Justin Horo takes an intercept and heads up field and then finds Tom Trbojevic in support who races away to give the Sea Eagles the lead once again",
            "publishDate": "2015-09-06T17:59:00+10:00",
            "publisher": "NRL Chief",
            "thumbnailUrl": "http://bigpondvideo.com/Web/Images/Content/20150906175722a_89x50.jpg",
            "largeThumbnailUrl": "http://bigpondvideo.com/Web/Images/Content/20150906175722a_326x184.jpg",
            "programType": "Instant Replay",
            "programCategory": "Score",
            "priority": 1,
            "lastUpdateDate": "2015-09-06T18:18:49+10:00",
            "isPremium": true,
            "club": [
                500028,
                500002
            ]
        },
        {
            "id": "FjNHdkdzpFXfsE3rgBWS3FsF3w8igqAj",
            "contentId": 788306,
            "title": "Rd 26: TRY Gerard Beale (56th min)",
            "description": "The Sharks hit the lead as the backline combine to send Gerard Beale over in the corner",
            "publishDate": "2015-09-06T17:44:00+10:00",
            "publisher": "NRL Chief",
            "thumbnailUrl": "http://bigpondvideo.com/Web/Images/Content/20150906174510a_89x50.jpg",
            "largeThumbnailUrl": "http://bigpondvideo.com/Web/Images/Content/20150906174510a_326x184.jpg",
            "programType": "Instant Replay",
            "programCategory": "Score",
            "priority": 2,
            "lastUpdateDate": "2015-09-06T18:17:48+10:00",
            "isPremium": true,
            "club": [
                500028,
                500002
            ]
        },
        {
            "id": "o2dnZkdzro7TuDlr_Af9j3ScNRJAcx_J",
            "contentId": 788305,
            "title": "Rd 26: PENALTY GOAL Kieran Foran (40th min)",
            "description": "Another penalty goal on the stroke of half time sees the Sea Eagles lead 10-8",
            "publishDate": "2015-09-06T17:09:00+10:00",
            "publisher": "NRL Chief",
            "thumbnailUrl": "http://bigpondvideo.com/Web/Images/Content/20150906171138a_89x50.jpg",
            "largeThumbnailUrl": "http://bigpondvideo.com/Web/Images/Content/20150906171138a_326x184.jpg",
            "programType": "Instant Replay",
            "programCategory": "Score",
            "priority": 3,
            "lastUpdateDate": "2015-09-06T18:16:48+10:00",
            "isPremium": true,
            "club": [
                500028,
                500002
            ]
        },
        {
            "id": "hoc3Zkdzof9phAjGzvywr3a3X7TJVqJU",
            "contentId": 788304,
            "title": "Rd 26: PENALTY GOAL Kieran Foran (33rd min)",
            "description": "Penalty goal to the Sea Eagles sees the score locked up at 8-all",
            "publishDate": "2015-09-06T17:00:00+10:00",
            "publisher": "NRL Chief",
            "thumbnailUrl": "http://bigpondvideo.com/Web/Images/Content/20150906170139a_89x50.jpg",
            "largeThumbnailUrl": "http://bigpondvideo.com/Web/Images/Content/20150906170139a_326x184.jpg",
            "programType": "Instant Replay",
            "programCategory": "Score",
            "priority": 4,
            "lastUpdateDate": "2015-09-06T18:16:48+10:00",
            "isPremium": true,
            "club": [
                500028,
                500002
            ]
        },
        {
            "id": "BicXZkdzrUaFpNdkPYzH0-cWCoqvOCcp",
            "contentId": 788303,
            "title": "Rd 26: GOAL Kieran Foran (26th min)",
            "description": "Conversion sees the Sea Eagles trail 8-6",
            "publishDate": "2015-09-06T16:52:00+10:00",
            "publisher": "NRL Chief",
            "thumbnailUrl": "http://bigpondvideo.com/Web/Images/Content/20150906165250a_89x50.jpg",
            "largeThumbnailUrl": "http://bigpondvideo.com/Web/Images/Content/20150906165250a_326x184.jpg",
            "programType": "Instant Replay",
            "programCategory": "Score",
            "priority": 5,
            "lastUpdateDate": "2015-09-06T18:15:48+10:00",
            "isPremium": true,
            "club": [
                500028,
                500002
            ]
        },
        {
            "id": "h5cHZkdzqDfkrOvpZpx_tQXP4G5MDHu-",
            "contentId": 788302,
            "title": "Rd 26: TRY  Jesse Sene-Lefao (25th min)",
            "description": "The Sea Eagles strike back as Jesse Sene-Lefao shows great strength to score from close range",
            "publishDate": "2015-09-06T16:50:00+10:00",
            "publisher": "NRL Chief",
            "thumbnailUrl": "http://bigpondvideo.com/Web/Images/Content/20150906165121a_89x50.jpg",
            "largeThumbnailUrl": "http://bigpondvideo.com/Web/Images/Content/20150906165121a_326x184.jpg",
            "programType": "Instant Replay",
            "programCategory": "Score",
            "priority": 6,
            "lastUpdateDate": "2015-09-06T18:15:48+10:00",
            "isPremium": true,
            "club": [
                500028,
                500002
            ]
        },
        {
            "id": "xlcHZkdzrXQy7OY8C9cdSu-wJgaj7cam",
            "contentId": 788301,
            "title": "Rd 26: GOAL Michael Gordon (23rd min)",
            "description": "Conversion sees the Sharks lead 8-0",
            "publishDate": "2015-09-06T16:47:00+10:00",
            "publisher": "NRL Chief",
            "thumbnailUrl": "http://bigpondvideo.com/Web/Images/Content/20150906164759a_89x50.jpg",
            "largeThumbnailUrl": "http://bigpondvideo.com/Web/Images/Content/20150906164759a_326x184.jpg",
            "programType": "Instant Replay",
            "programCategory": "Score",
            "priority": 7,
            "lastUpdateDate": "2015-09-06T18:15:48+10:00",
            "isPremium": true,
            "club": [
                500028,
                500002
            ]
        },
        {
            "id": "h0b3Zkdzp4Izqi1yEO4IZXURzI4xiU6M",
            "contentId": 788297,
            "title": "Rd 26: TRY Wade Graham (21st min)",
            "description": "The Sharks get the first try for the afternoon as Wade Graham powers over from close range",
            "publishDate": "2015-09-06T16:46:00+10:00",
            "publisher": "NRL Chief",
            "thumbnailUrl": "http://bigpondvideo.com/Web/Images/Content/20150906164623a_89x50.jpg",
            "largeThumbnailUrl": "http://bigpondvideo.com/Web/Images/Content/20150906164623a_326x184.jpg",
            "programType": "Instant Replay",
            "programCategory": "Score",
            "priority": 8,
            "lastUpdateDate": "2015-09-06T18:13:47+10:00",
            "isPremium": true,
            "club": [
                500028,
                500002
            ]
        },
        {
            "id": "VrbHZkdzrkYmHGpPI8EBggZ3EBf09rLD",
            "contentId": 788298,
            "title": "Rd 26: PENALTY GOAL Michael Gordon (15th min)",
            "description": "Penalty goal to the Sharks gives them a 2-0 lead",
            "publishDate": "2015-09-06T16:35:00+10:00",
            "publisher": "NRL Chief",
            "thumbnailUrl": "http://bigpondvideo.com/Web/Images/Content/20150906163454a_89x50.jpg",
            "largeThumbnailUrl": "http://bigpondvideo.com/Web/Images/Content/20150906163454a_326x184.jpg",
            "programType": "Instant Replay",
            "programCategory": "Score",
            "priority": 9,
            "lastUpdateDate": "2015-09-06T18:12:48+10:00",
            "isPremium": true,
            "club": [
                500028,
                500002
            ]
        }
    ],
    "scores": [
        {
            "gameState": "First Half",
            "gameStateId": 3,
            "gameTime": "0:14:01",
            "gameSeconds": 841,
            "playerId": 500797,
            "playerName": "Michael Gordon",
            "scoreMethod": "Penalty Goal",
            "statEvent": "Penalty Shot-Made",
            "statId": 67,
            "statValue": 2,
            "vidRef": 30762,
            "homeScore": 2,
            "teamId": 500028,
            "teamName": "Cronulla-Sutherland Sharks",
            "homeTeamAbbrv": "CRO",
            "awayTeamAbbrv": "MAN"
        },
        {
            "gameState": "First Half",
            "gameStateId": 3,
            "gameTime": "0:20:40",
            "gameSeconds": 1240,
            "playerId": 500798,
            "playerName": "Wade Graham",
            "scoreMethod": "Try",
            "statEvent": "Try",
            "statId": 38,
            "statValue": 4,
            "vidRef": 47066,
            "homeScore": 6,
            "teamId": 500028,
            "teamName": "Cronulla-Sutherland Sharks",
            "homeTeamAbbrv": "CRO",
            "awayTeamAbbrv": "MAN"
        },
        {
            "gameState": "First Half",
            "gameStateId": 3,
            "gameTime": "0:22:03",
            "gameSeconds": 1323,
            "playerId": 500797,
            "playerName": "Michael Gordon",
            "scoreMethod": "Conversion",
            "statEvent": "Conversion-Made",
            "statId": 1,
            "statValue": 2,
            "vidRef": 49415,
            "homeScore": 8,
            "teamId": 500028,
            "teamName": "Cronulla-Sutherland Sharks",
            "homeTeamAbbrv": "CRO",
            "awayTeamAbbrv": "MAN"
        },
        {
            "gameState": "Second Half",
            "gameStateId": 5,
            "gameTime": "0:56:00",
            "gameSeconds": 3360,
            "playerId": 500616,
            "playerName": "Gerard Beale",
            "scoreMethod": "Try",
            "statEvent": "Try",
            "statId": 38,
            "statValue": 4,
            "vidRef": 117623,
            "homeScore": 12,
            "awayScore": 10,
            "teamId": 500028,
            "teamName": "Cronulla-Sutherland Sharks",
            "homeTeamAbbrv": "CRO",
            "awayTeamAbbrv": "MAN"
        },
        {
            "gameState": "First Half",
            "gameStateId": 3,
            "gameTime": "0:24:25",
            "gameSeconds": 1465,
            "playerId": 500583,
            "playerName": "Jesse Sene-Lefao",
            "scoreMethod": "Try",
            "statEvent": "Try",
            "statId": 38,
            "statValue": 4,
            "vidRef": 54392,
            "homeScore": 8,
            "awayScore": 4,
            "teamId": 500002,
            "teamName": "Manly-Warringah Sea Eagles",
            "homeTeamAbbrv": "CRO",
            "awayTeamAbbrv": "MAN"
        },
        {
            "gameState": "First Half",
            "gameStateId": 3,
            "gameTime": "0:25:14",
            "gameSeconds": 1514,
            "playerId": 500023,
            "playerName": "Kieran Foran",
            "scoreMethod": "Conversion",
            "statEvent": "Conversion-Made",
            "statId": 1,
            "statValue": 2,
            "vidRef": 55619,
            "homeScore": 8,
            "awayScore": 6,
            "teamId": 500002,
            "teamName": "Manly-Warringah Sea Eagles",
            "homeTeamAbbrv": "CRO",
            "awayTeamAbbrv": "MAN"
        },
        {
            "gameState": "First Half",
            "gameStateId": 3,
            "gameTime": "0:32:43",
            "gameSeconds": 1963,
            "playerId": 500023,
            "playerName": "Kieran Foran",
            "scoreMethod": "Penalty Goal",
            "statEvent": "Penalty Shot-Made",
            "statId": 67,
            "statValue": 2,
            "vidRef": 68649,
            "homeScore": 8,
            "awayScore": 8,
            "teamId": 500002,
            "teamName": "Manly-Warringah Sea Eagles",
            "homeTeamAbbrv": "CRO",
            "awayTeamAbbrv": "MAN"
        },
        {
            "gameState": "First Half",
            "gameStateId": 3,
            "gameTime": "0:40:00",
            "gameSeconds": 2400,
            "playerId": 500023,
            "playerName": "Kieran Foran",
            "scoreMethod": "Penalty Goal",
            "statEvent": "Penalty Shot-Made",
            "statId": 67,
            "statValue": 2,
            "vidRef": 82525,
            "homeScore": 8,
            "awayScore": 10,
            "teamId": 500002,
            "teamName": "Manly-Warringah Sea Eagles",
            "homeTeamAbbrv": "CRO",
            "awayTeamAbbrv": "MAN"
        },
        {
            "gameState": "Second Half",
            "gameStateId": 5,
            "gameTime": "1:07:36",
            "gameSeconds": 4056,
            "playerId": 501505,
            "playerName": "Tom Trbojevic",
            "scoreMethod": "Try",
            "statEvent": "Try",
            "statId": 38,
            "statValue": 4,
            "vidRef": 135025,
            "homeScore": 12,
            "awayScore": 14,
            "teamId": 500002,
            "teamName": "Manly-Warringah Sea Eagles",
            "homeTeamAbbrv": "CRO",
            "awayTeamAbbrv": "MAN"
        }
    ]
}