{
    "competitionId": 111,
    "competitionName": "NRL Telstra Premiership",
    "gameId": 20161112430,
    "gameInfo": {
        "assistantReferee1Id": 500040,
        "numberOfPeriods": 2,
        "assistantReferee1Name": "Nick Beashel",
        "assistantReferee2Id": 500045,
        "assistantReferee2Name": "Belinda Sleeman",
        "gameDate": "2016-08-20",
        "gameHashTag": "#NRLManlyStorm",
        "gameNumber": 3,
        "gameSeconds": 4800,
        "gameMinutes": "80:00",
        "gameTime": "1:20:00",
        "groundConditionId": 1,
        "groundConditionName": "N/A",
        "referee1Id": 500006,
        "referee1Name": "Henry Perenara",
        "referee2Id": 500018,
        "referee2Name": "Chris James",
        "startTime": "2016-08-20T17:30:00",
        "startTimeUTC": "2016-08-20T07:30:00Z",
        "venueId": 500005,
        "venueName": "Brookvale Oval",
        "videoReferee2Id": 500036,
        "videoReferee2Name": "Jason Robinson",
        "weatherId": 11,
        "weatherName": "Partly Cloudy",
        "broadcastChannel": null,
        "venueLatitude": -34.0386,
        "venueLongitude": 151.1408,
        "broadcastInfo": {
            "radioNetwork": []
        }
    },
    "gameState": "Final",
    "gameStateId": 8,
    "roundId": 24,
    "roundName": "Round 24",
    "seasonId": 2016,
    "teams": {
        "teamsMatch": [
            {
                "isHomeTeam": true,
                "score": {
                    "conversions": 3,
                    "points": 18,
                    "tries": 3
                },
                "team1stHalfScore": 6,
                "team2ndHalfScore": 12,
                "teamAbbr": "MAN",
                "teamFinalScore": 18,
                "teamFullTimeScore": 18,
                "teamHalfTimeScore": 6,
                "teamId": 500002,
                "teamLineup": {
                    "teamLineUpStatusID": 4,
                    "teamLineUpStatus": "Final",
                    "injuriesAndSuspensions": {
                        "injury": [],
                        "suspension": []
                    },
                    "insAndOuts": {
                        "inOut": [
                            {
                                "inOut": "Out",
                                "playerFirstName": "Apisai",
                                "playerId": "500109",
                                "playerLastName": "Koroisau",
                                "playerName": "Apisai Koroisau"
                            },
                            {
                                "inOut": "In",
                                "playerFirstName": "Blake",
                                "playerId": "501035",
                                "playerLastName": "Leary",
                                "playerName": "Blake Leary"
                            },
                            {
                                "inOut": "In",
                                "playerFirstName": "Brad",
                                "playerId": "504226",
                                "playerLastName": "Parker",
                                "playerName": "Brad Parker"
                            },
                            {
                                "inOut": "Out",
                                "playerFirstName": "Darcy",
                                "playerId": "500677",
                                "playerLastName": "Lussick",
                                "playerName": "Darcy Lussick"
                            },
                            {
                                "inOut": "Out",
                                "playerFirstName": "Dylan",
                                "playerId": "500083",
                                "playerLastName": "Walker",
                                "playerName": "Dylan Walker"
                            },
                            {
                                "inOut": "In",
                                "playerFirstName": "Frank",
                                "playerId": "507112",
                                "playerLastName": " Winterstein",
                                "playerName": "Frank Winterstein"
                            },
                            {
                                "inOut": "Out",
                                "playerFirstName": "Jamie",
                                "playerId": "500020",
                                "playerLastName": "Lyon",
                                "playerName": "Jamie Lyon"
                            },
                            {
                                "inOut": "In",
                                "playerFirstName": "Matt",
                                "playerId": "501005",
                                "playerLastName": "Parcell",
                                "playerName": "Matt Parcell"
                            },
                            {
                                "inOut": "In",
                                "playerFirstName": "Nate",
                                "playerId": "500075",
                                "playerLastName": "Myles",
                                "playerName": "Nate Myles"
                            },
                            {
                                "inOut": "Out",
                                "playerFirstName": "Nathan",
                                "playerId": "500624",
                                "playerLastName": "Green",
                                "playerName": "Nathan Green"
                            }
                        ]
                    },
                    "teamPlayer": [
                        {
                            "playerFirstName": "Tom",
                            "playerId": 501505,
                            "playerLastName": "Trbojevic",
                            "playerName": "Tom Trbojevic",
                            "playerPosition": "Fullback",
                            "playerPositionId": 500001,
                            "playerStats": {
                                "allRunMetres": 119,
                                "allRuns": 11,
                                "bombKicksDefused": 2,
                                "decoys": 2,
                                "fantasyPointsTotal": 31,
                                "kickReturnMetres": 34,
                                "kickReturns": 3,
                                "kicksDefused": 4,
                                "linebreakAssists": 1,
                                "mins": 80,
                                "missedTackles": 4,
                                "passes": 8,
                                "passesPerRun": 0.73,
                                "oneOnOneTackles": 1,
                                "supports": 4,
                                "tackleBreaks": 3,
                                "tackles": 3,
                                "tryAssists": 1,
                                "tryCause": 1,
                                "trySaves": 1,
                                "evasionRuns": 8,
                                "evasionRunMetres": 85,
                                "ptbAll": 13,
                                "receipts": 21,
                                "postContactMetres": 35,
                                "kickPressures": 1,
                                "ptbTwoToThree": 4,
                                "ptbThreeToFour": 7,
                                "ptbFourToFive": 2,
                                "effectiveTacklePercentage": 42.9,
                                "stint1": 4800
                            },
                            "playerTookTheField": true,
                            "shirtNum": 1,
                            "playerFirstInitial": "T",
                            "playerPositionAbbrev": "FB",
                            "onTheField": true,
                            "fantasyPrice": 321000,
                            "fantasySeasonPriceChange": 56000,
                            "fantasyRoundPriceChange": -10000
                        },
                        {
                            "playerFirstName": "Jorge",
                            "playerId": 500019,
                            "playerLastName": "Taufua",
                            "playerName": "Jorge Taufua",
                            "playerPosition": "Winger 1",
                            "playerPositionId": 500002,
                            "playerStats": {
                                "allRunMetres": 113,
                                "allRuns": 14,
                                "bombKicksNotDefused": 1,
                                "errors": 1,
                                "fantasyPointsTotal": 15,
                                "hitUps": 2,
                                "kickReturnMetres": 1,
                                "kickReturns": 1,
                                "kicksNotDefused": 2,
                                "mins": 80,
                                "missedTackles": 3,
                                "passes": 2,
                                "passesPerRun": 0.14,
                                "points": 4,
                                "supports": 2,
                                "tackleBreaks": 1,
                                "tackles": 1,
                                "tries": 1,
                                "tryCause": 5,
                                "hitupRunMeters": 24,
                                "evasionRuns": 11,
                                "evasionRunMetres": 88,
                                "ptbAll": 13,
                                "receipts": 18,
                                "postContactMetres": 42,
                                "dummyPasses": 1,
                                "ptbOneToTwo": 1,
                                "ptbTwoToThree": 2,
                                "ptbThreeToFour": 7,
                                "ptbFourToFive": 3,
                                "effectiveTacklePercentage": 25,
                                "stint1": 4800
                            },
                            "playerTookTheField": true,
                            "shirtNum": 2,
                            "playerFirstInitial": "J",
                            "playerPositionAbbrev": "WG",
                            "onTheField": true,
                            "fantasyPrice": 285000,
                            "fantasySeasonPriceChange": 2000,
                            "fantasyRoundPriceChange": -10000
                        },
                        {
                            "playerFirstName": "Lewis",
                            "playerId": 500341,
                            "playerLastName": "Brown",
                            "playerName": "Lewis Brown",
                            "playerPosition": "Centre 1",
                            "playerPositionId": 500003,
                            "playerStats": {
                                "allRunMetres": 39,
                                "allRuns": 7,
                                "dummyHalfRuns": 2,
                                "errors": 2,
                                "fantasyPointsTotal": 6,
                                "mins": 80,
                                "missedTackles": 3,
                                "passes": 28,
                                "passesPerRun": 4,
                                "oneOnOneTackles": 2,
                                "supports": 2,
                                "tackles": 13,
                                "evasionRuns": 5,
                                "evasionRunMetres": 38,
                                "dummyHalfRunMetres": 1,
                                "ptbAll": 6,
                                "receipts": 32,
                                "postContactMetres": 14,
                                "kickPressures": 3,
                                "lineEngagedRuns": 2,
                                "ptbTwoToThree": 2,
                                "ptbThreeToFour": 1,
                                "ptbFourToFive": 1,
                                "ptbFivePlus": 2,
                                "effectiveTacklePercentage": 81.2,
                                "stint1": 4800
                            },
                            "playerTookTheField": true,
                            "shirtNum": 3,
                            "playerFirstInitial": "L",
                            "playerPositionAbbrev": "CT",
                            "onTheField": true,
                            "fantasyPrice": 188000,
                            "fantasySeasonPriceChange": -121000,
                            "fantasyRoundPriceChange": -5000
                        },
                        {
                            "playerFirstName": "Brayden",
                            "playerId": 501255,
                            "playerLastName": "Wiliame",
                            "playerName": "Brayden Wiliame",
                            "playerPosition": "Centre 2",
                            "playerPositionId": 500004,
                            "playerStats": {
                                "allRunMetres": 62,
                                "allRuns": 8,
                                "errors": 1,
                                "fantasyPointsTotal": 14,
                                "ineffectiveTackles": 1,
                                "kickReturns": 1,
                                "mins": 80,
                                "missedTackles": 1,
                                "offloads": 1,
                                "passes": 4,
                                "passesPerRun": 0.5,
                                "oneOnOneTackles": 3,
                                "supports": 1,
                                "tackles": 10,
                                "tryCause": 2,
                                "evasionRuns": 7,
                                "evasionRunMetres": 62,
                                "ptbAll": 6,
                                "receipts": 11,
                                "postContactMetres": 20,
                                "dummyPasses": 1,
                                "ptbTwoToThree": 2,
                                "ptbThreeToFour": 4,
                                "effectiveTacklePercentage": 83.3,
                                "stint1": 4800
                            },
                            "playerTookTheField": true,
                            "shirtNum": 4,
                            "playerFirstInitial": "B",
                            "playerPositionAbbrev": "CT",
                            "onTheField": true,
                            "fantasyPrice": 216000,
                            "fantasySeasonPriceChange": 72000,
                            "fantasyRoundPriceChange": 6000
                        },
                        {
                            "playerFirstName": "Brad",
                            "playerId": 504226,
                            "playerLastName": "Parker",
                            "playerName": "Brad Parker",
                            "playerPosition": "Winger 2",
                            "playerPositionId": 500005,
                            "playerStats": {
                                "allRunMetres": 84,
                                "allRuns": 7,
                                "bombKicksNotDefused": 1,
                                "fantasyPointsTotal": 40,
                                "ineffectiveTackles": 1,
                                "kicksNotDefused": 1,
                                "linebreaks": 1,
                                "mins": 80,
                                "passes": 4,
                                "passesPerRun": 0.57,
                                "points": 8,
                                "supports": 6,
                                "tackleBreaks": 4,
                                "tries": 2,
                                "evasionRuns": 7,
                                "evasionRunMetres": 84,
                                "ptbAll": 5,
                                "receipts": 13,
                                "postContactMetres": 23,
                                "dummyPasses": 2,
                                "ptbTwoToThree": 1,
                                "ptbThreeToFour": 3,
                                "ptbFourToFive": 1,
                                "stint1": 4800
                            },
                            "playerTookTheField": true,
                            "shirtNum": 21,
                            "playerFirstInitial": "B",
                            "playerPositionAbbrev": "WG",
                            "onTheField": true,
                            "fantasyPrice": 128000
                        },
                        {
                            "playerFirstName": "Matthew",
                            "playerId": 501025,
                            "playerLastName": "Wright",
                            "playerName": "Matthew Wright",
                            "playerPosition": "Five-Eighth",
                            "playerPositionId": 500006,
                            "playerStats": {
                                "allRunMetres": 70,
                                "allRuns": 6,
                                "bombKicks": 3,
                                "bombKickMetres": 76,
                                "bombKicksDefused": 1,
                                "conversions": 3,
                                "conversionsAttempts": 3,
                                "decoys": 2,
                                "fantasyPointsTotal": 33,
                                "goalConversionRate": 100,
                                "allGoals": 3,
                                "allGoalsAttempted": 3,
                                "kickMetres": 76,
                                "kickReturnMetres": 35,
                                "kickReturns": 1,
                                "kicks": 3,
                                "kicksDefused": 1,
                                "lineDropouts": 6,
                                "mins": 80,
                                "missedTackles": 5,
                                "passes": 11,
                                "passesPerRun": 1.83,
                                "oneOnOneTackles": 3,
                                "penalties": 1,
                                "points": 6,
                                "supports": 8,
                                "tackleBreaks": 2,
                                "tackles": 22,
                                "tryCause": 1,
                                "evasionRuns": 5,
                                "evasionRunMetres": 35,
                                "ptbAll": 6,
                                "receipts": 20,
                                "postContactMetres": 14,
                                "dummyPasses": 1,
                                "ptbTwoToThree": 2,
                                "ptbThreeToFour": 4,
                                "doubles": 3,
                                "effectiveTacklePercentage": 81.5,
                                "ptbPenalties": 1,
                                "stint1": 4800
                            },
                            "playerTookTheField": true,
                            "shirtNum": 5,
                            "playerFirstInitial": "M",
                            "playerPositionAbbrev": "FE",
                            "onTheField": true,
                            "fantasyPrice": 179000,
                            "fantasySeasonPriceChange": -66000,
                            "fantasyRoundPriceChange": 22000
                        },
                        {
                            "playerFirstName": "Daly",
                            "playerId": 500024,
                            "playerLastName": "Cherry-Evans",
                            "playerName": "Daly Cherry-Evans",
                            "playerPosition": "Halfback",
                            "playerPositionId": 500007,
                            "playerStats": {
                                "allRunMetres": 12,
                                "allRuns": 5,
                                "bombKicks": 5,
                                "bombKickMetres": 103,
                                "chargedDown": 1,
                                "fantasyPointsTotal": 46,
                                "kickMetres": 362,
                                "kicks": 15,
                                "mins": 80,
                                "missedTackles": 2,
                                "offloads": 2,
                                "passes": 26,
                                "passesPerRun": 5.2,
                                "oneOnOneTackles": 2,
                                "supports": 10,
                                "tackles": 22,
                                "tryAssists": 1,
                                "tryCause": 4,
                                "evasionRuns": 5,
                                "evasionRunMetres": 12,
                                "receipts": 44,
                                "grubberKick": 3,
                                "crossFieldKick": 1,
                                "dummyPasses": 5,
                                "kickPressures": 3,
                                "lineEngagedRuns": 2,
                                "doubles": 3,
                                "longKicksSpace": 3,
                                "effectiveTacklePercentage": 91.7,
                                "stint1": 4800
                            },
                            "playerTookTheField": true,
                            "shirtNum": 7,
                            "playerFirstInitial": "D",
                            "playerPositionAbbrev": "HB",
                            "onTheField": true,
                            "fantasyPrice": 395000,
                            "fantasySeasonPriceChange": -87000,
                            "fantasyRoundPriceChange": 3000
                        },
                        {
                            "playerFirstName": "Nate",
                            "playerId": 500075,
                            "playerLastName": "Myles",
                            "playerName": "Nate Myles",
                            "playerPosition": "Prop 1",
                            "playerPositionId": 500008,
                            "playerStats": {
                                "allRunMetres": 117,
                                "allRuns": 12,
                                "decoys": 4,
                                "fantasyPointsTotal": 35,
                                "hitUps": 11,
                                "ineffectiveTackles": 1,
                                "kickReturnMetres": 5,
                                "kickReturns": 1,
                                "mins": 47,
                                "missedTackles": 1,
                                "passes": 1,
                                "passesPerRun": 0.08,
                                "penalties": 1,
                                "supports": 3,
                                "tackles": 28,
                                "hitupRunMeters": 112,
                                "ptbAll": 12,
                                "receipts": 13,
                                "postContactMetres": 42,
                                "dummyPasses": 2,
                                "kickPressures": 2,
                                "ptbTwoToThree": 2,
                                "ptbThreeToFour": 5,
                                "ptbFourToFive": 3,
                                "ptbFivePlus": 2,
                                "doubles": 2,
                                "effectiveTacklePercentage": 93.3,
                                "foulPlayPenalties": 1,
                                "stint1": 1391,
                                "stint2": 1434
                            },
                            "playerTookTheField": true,
                            "shirtNum": 16,
                            "playerFirstInitial": "N",
                            "playerPositionAbbrev": "PR",
                            "onTheField": true,
                            "fantasyPrice": 248000,
                            "fantasySeasonPriceChange": -92000
                        },
                        {
                            "playerFirstName": "Blake",
                            "playerId": 501035,
                            "playerLastName": "Leary",
                            "playerName": "Blake Leary",
                            "playerPosition": "Hooker",
                            "playerPositionId": 500009,
                            "playerStats": {
                                "allRunMetres": 7,
                                "allRuns": 1,
                                "dummyHalfRuns": 1,
                                "fantasyPointsTotal": 18,
                                "mins": 17,
                                "passes": 8,
                                "passesPerRun": 8,
                                "tackleBreaks": 1,
                                "tackles": 15,
                                "dummyHalfRunMetres": 7,
                                "ptbAll": 1,
                                "receipts": 9,
                                "postContactMetres": 2,
                                "dummyPasses": 1,
                                "kickPressures": 1,
                                "ptbTwoToThree": 1,
                                "doubles": 4,
                                "effectiveTacklePercentage": 100,
                                "stint1": 1019
                            },
                            "playerTookTheField": true,
                            "shirtNum": 20,
                            "playerFirstInitial": "B",
                            "playerPositionAbbrev": "HK",
                            "fantasyPrice": 137000,
                            "fantasySeasonPriceChange": -214000
                        },
                        {
                            "playerFirstName": "Addin",
                            "playerId": 500449,
                            "playerLastName": "Fonua-Blake",
                            "playerName": "Addin Fonua-Blake",
                            "playerPosition": "Prop 2",
                            "playerPositionId": 500010,
                            "playerStats": {
                                "allRunMetres": 70,
                                "allRuns": 8,
                                "decoys": 4,
                                "fantasyPointsTotal": 35,
                                "hitUps": 8,
                                "mins": 36,
                                "missedTackles": 1,
                                "passes": 1,
                                "passesPerRun": 0.12,
                                "supports": 1,
                                "tackleBreaks": 3,
                                "tackles": 21,
                                "hitupRunMeters": 70,
                                "ptbAll": 8,
                                "receipts": 9,
                                "postContactMetres": 30,
                                "kickPressures": 2,
                                "ptbTwoToThree": 4,
                                "ptbThreeToFour": 4,
                                "doubles": 2,
                                "effectiveTacklePercentage": 95.5,
                                "stint1": 1010,
                                "stint2": 1148
                            },
                            "playerTookTheField": true,
                            "shirtNum": 10,
                            "playerFirstInitial": "A",
                            "playerPositionAbbrev": "PR",
                            "onTheField": true,
                            "fantasyPrice": 176000
                        },
                        {
                            "playerFirstName": "Martin",
                            "playerId": 500960,
                            "playerLastName": "Taupau",
                            "playerName": "Martin Taupau",
                            "playerPosition": "2nd Row 1",
                            "playerPositionId": 500011,
                            "playerStats": {
                                "allRunMetres": 135,
                                "allRuns": 11,
                                "decoys": 2,
                                "fantasyPointsTotal": 43,
                                "hitUps": 9,
                                "kickReturnMetres": 10,
                                "kickReturns": 1,
                                "mins": 61,
                                "missedTackles": 2,
                                "offloads": 1,
                                "passes": 1,
                                "passesPerRun": 0.09,
                                "supports": 3,
                                "tackleBreaks": 1,
                                "tackles": 29,
                                "hitupRunMeters": 112,
                                "evasionRuns": 1,
                                "evasionRunMetres": 13,
                                "ptbAll": 9,
                                "receipts": 11,
                                "postContactMetres": 58,
                                "dummyPasses": 1,
                                "kickPressures": 1,
                                "lineEngagedRuns": 1,
                                "ptbTwoToThree": 3,
                                "ptbThreeToFour": 3,
                                "ptbFourToFive": 3,
                                "doubles": 5,
                                "effectiveTacklePercentage": 93.5,
                                "stint1": 1839,
                                "stint2": 1782
                            },
                            "playerTookTheField": true,
                            "shirtNum": 11,
                            "playerFirstInitial": "M",
                            "playerPositionAbbrev": "2R",
                            "onTheField": true,
                            "fantasyPrice": 361000,
                            "fantasySeasonPriceChange": -85000,
                            "fantasyRoundPriceChange": 18000
                        },
                        {
                            "playerFirstName": "Jamie",
                            "playerId": 500032,
                            "playerLastName": "Buhrer",
                            "playerName": "Jamie Buhrer",
                            "playerPosition": "2nd Row 2",
                            "playerPositionId": 500012,
                            "playerStats": {
                                "allRunMetres": 152,
                                "allRuns": 15,
                                "decoys": 2,
                                "fantasyPointsTotal": 57,
                                "hitUps": 11,
                                "ineffectiveTackles": 1,
                                "kickReturnMetres": 7,
                                "kickReturns": 1,
                                "mins": 80,
                                "passes": 3,
                                "passesPerRun": 0.2,
                                "oneOnOneTackles": 2,
                                "supports": 9,
                                "tackles": 42,
                                "hitupRunMeters": 126,
                                "evasionRuns": 3,
                                "evasionRunMetres": 19,
                                "ptbAll": 11,
                                "receipts": 15,
                                "postContactMetres": 46,
                                "dummyPasses": 4,
                                "kickPressures": 2,
                                "lineEngagedRuns": 3,
                                "ptbTwoToThree": 2,
                                "ptbThreeToFour": 7,
                                "ptbFourToFive": 1,
                                "ptbFivePlus": 1,
                                "doubles": 5,
                                "effectiveTacklePercentage": 97.7,
                                "stint1": 4800
                            },
                            "playerTookTheField": true,
                            "shirtNum": 12,
                            "playerFirstInitial": "J",
                            "playerPositionAbbrev": "2R",
                            "onTheField": true,
                            "fantasyPrice": 473000,
                            "fantasySeasonPriceChange": 138000,
                            "fantasyRoundPriceChange": 16000
                        },
                        {
                            "playerFirstName": "Jake",
                            "playerId": 500751,
                            "playerLastName": "Trbojevic",
                            "playerName": "Jake Trbojevic",
                            "playerPosition": "Lock",
                            "playerPositionId": 500013,
                            "playerStats": {
                                "allRunMetres": 66,
                                "allRuns": 8,
                                "decoys": 2,
                                "errors": 1,
                                "fantasyPointsTotal": 38,
                                "hitUps": 7,
                                "ineffectiveTackles": 3,
                                "kickReturnMetres": 3,
                                "kickReturns": 1,
                                "mins": 80,
                                "passes": 4,
                                "passesPerRun": 0.5,
                                "oneOnOneTackles": 2,
                                "penalties": 1,
                                "supports": 11,
                                "tackles": 36,
                                "tryCause": 2,
                                "hitupRunMeters": 63,
                                "ptbAll": 8,
                                "receipts": 13,
                                "postContactMetres": 21,
                                "kickPressures": 1,
                                "ptbTwoToThree": 2,
                                "ptbThreeToFour": 5,
                                "ptbFourToFive": 1,
                                "doubles": 5,
                                "effectiveTacklePercentage": 92.3,
                                "ptbPenalties": 1,
                                "stint1": 4800
                            },
                            "playerTookTheField": true,
                            "shirtNum": 13,
                            "playerFirstInitial": "J",
                            "playerPositionAbbrev": "LK",
                            "onTheField": true,
                            "fantasyPrice": 386000,
                            "fantasySeasonPriceChange": 38000,
                            "fantasyRoundPriceChange": -5000
                        },
                        {
                            "playerFirstName": "Matt",
                            "playerId": 501005,
                            "playerLastName": "Parcell",
                            "playerName": "Matt Parcell",
                            "playerPosition": "Interchange",
                            "playerPositionId": 500014,
                            "playerStats": {
                                "allRunMetres": 9,
                                "allRuns": 2,
                                "fantasyPointsTotal": 27,
                                "hitUps": 1,
                                "ineffectiveTackles": 4,
                                "mins": 52,
                                "missedTackles": 1,
                                "passes": 65,
                                "passesPerRun": 32.5,
                                "oneOnOneTackles": 1,
                                "penalties": 1,
                                "supports": 1,
                                "tackles": 31,
                                "hitupRunMeters": 9,
                                "evasionRuns": 1,
                                "ptbAll": 1,
                                "receipts": 66,
                                "postContactMetres": 3,
                                "dummyPasses": 2,
                                "kickPressures": 1,
                                "lineEngagedRuns": 1,
                                "ptbThreeToFour": 1,
                                "doubles": 7,
                                "effectiveTacklePercentage": 86.1,
                                "ptbPenalties": 1,
                                "stint1": 3137
                            },
                            "playerTookTheField": true,
                            "shirtNum": 14,
                            "playerFirstInitial": "M",
                            "playerPositionAbbrev": "INT",
                            "fantasyPrice": 427000,
                            "fantasySeasonPriceChange": 262000
                        },
                        {
                            "playerFirstName": "Josh",
                            "playerId": 501261,
                            "playerLastName": "Starling",
                            "playerName": "Josh Starling",
                            "playerPosition": "Interchange",
                            "playerPositionId": 500014,
                            "playerStats": {
                                "allRunMetres": 64,
                                "allRuns": 7,
                                "decoys": 2,
                                "fantasyPointsTotal": 31,
                                "hitUps": 7,
                                "ineffectiveTackles": 2,
                                "mins": 39,
                                "missedTackles": 2,
                                "offloads": 2,
                                "passes": 1,
                                "passesPerRun": 0.14,
                                "penalties": 1,
                                "supports": 4,
                                "tackles": 27,
                                "hitupRunMeters": 64,
                                "ptbAll": 5,
                                "receipts": 8,
                                "postContactMetres": 24,
                                "dummyPasses": 1,
                                "ptbThreeToFour": 4,
                                "ptbFourToFive": 1,
                                "doubles": 9,
                                "effectiveTacklePercentage": 87.1,
                                "ptbPenalties": 1,
                                "stint1": 2356
                            },
                            "playerTookTheField": true,
                            "shirtNum": 15,
                            "playerFirstInitial": "J",
                            "playerPositionAbbrev": "INT",
                            "fantasyPrice": 219000,
                            "fantasySeasonPriceChange": 22000,
                            "fantasyRoundPriceChange": -6000
                        },
                        {
                            "playerFirstName": "Siosaia",
                            "playerId": 501337,
                            "playerLastName": "Vave",
                            "playerName": "Siosaia Vave",
                            "playerPosition": "Interchange",
                            "playerPositionId": 500014,
                            "playerStats": {
                                "allRunMetres": 102,
                                "allRuns": 11,
                                "decoys": 1,
                                "fantasyPointsTotal": 30,
                                "hitUps": 8,
                                "ineffectiveTackles": 1,
                                "kickReturnMetres": 11,
                                "kickReturns": 1,
                                "mins": 38,
                                "missedTackles": 1,
                                "passes": 4,
                                "passesPerRun": 0.36,
                                "oneOnOneTackles": 1,
                                "penalties": 1,
                                "supports": 1,
                                "tackles": 24,
                                "hitupRunMeters": 77,
                                "evasionRuns": 2,
                                "evasionRunMetres": 14,
                                "ptbAll": 8,
                                "receipts": 13,
                                "postContactMetres": 38,
                                "dummyPasses": 1,
                                "lineEngagedRuns": 2,
                                "ptbOneToTwo": 1,
                                "ptbTwoToThree": 1,
                                "ptbThreeToFour": 5,
                                "ptbFourToFive": 1,
                                "doubles": 3,
                                "effectiveTacklePercentage": 92.3,
                                "foulPlayPenalties": 1,
                                "stint1": 1627,
                                "stint2": 643
                            },
                            "playerTookTheField": true,
                            "shirtNum": 17,
                            "playerFirstInitial": "S",
                            "playerPositionAbbrev": "INT",
                            "onTheField": true,
                            "fantasyPrice": 226000,
                            "fantasySeasonPriceChange": 70000,
                            "fantasyRoundPriceChange": 2000
                        },
                        {
                            "playerFirstName": "Frank",
                            "playerId": 507112,
                            "playerLastName": " Winterstein",
                            "playerName": "Frank  Winterstein",
                            "playerPosition": "Interchange",
                            "playerPositionId": 500014,
                            "playerStats": {
                                "allRunMetres": 31,
                                "allRuns": 3,
                                "fantasyPointsTotal": 11,
                                "hitUps": 3,
                                "ineffectiveTackles": 1,
                                "mins": 30,
                                "missedTackles": 1,
                                "oneOnOneTackles": 2,
                                "tackles": 10,
                                "tryCause": 1,
                                "hitupRunMeters": 31,
                                "ptbAll": 3,
                                "receipts": 3,
                                "postContactMetres": 15,
                                "kickPressures": 1,
                                "ptbOneToTwo": 2,
                                "ptbThreeToFour": 1,
                                "doubles": 1,
                                "effectiveTacklePercentage": 83.3,
                                "stint1": 1812
                            },
                            "playerTookTheField": true,
                            "shirtNum": 23,
                            "playerFirstInitial": "F",
                            "playerPositionAbbrev": "INT"
                        }
                    ]
                },
                "teamName": "Manly-Warringah Sea Eagles",
                "teamNickName": "Sea Eagles",
                "teamStats": {
                    "allRunMetres": 1252,
                    "allRuns": 136,
                    "bombKicks": 8,
                    "bombKickMetres": 178,
                    "bombKicksDefused": 3,
                    "bombKicksNotDefused": 2,
                    "chargedDown": 1,
                    "completeSets": 23,
                    "completionPercentage": 82,
                    "conversions": 3,
                    "conversionsAttempts": 3,
                    "decoys": 21,
                    "dummyHalfRuns": 3,
                    "errors": 5,
                    "goalConversionRate": 100,
                    "allGoals": 3,
                    "allGoalsAttempted": 3,
                    "hitUps": 67,
                    "incompleteSets": 5,
                    "ineffectiveTackles": 15,
                    "kickMetres": 438,
                    "kickReturnMetres": 106,
                    "kickReturns": 11,
                    "kicks": 18,
                    "kicksDefused": 5,
                    "kicksNotDefused": 3,
                    "lineDropouts": 6,
                    "linebreakAssists": 1,
                    "linebreaks": 1,
                    "missedTackles": 27,
                    "offloads": 6,
                    "oneOnOneTackles": 19,
                    "passes": 171,
                    "passesPerRun": 1.26,
                    "penalties": 6,
                    "points": 18,
                    "pointsConceded": 38,
                    "possession": 43,
                    "scrumWins": 7,
                    "supports": 66,
                    "tackleBreaks": 15,
                    "tackles": 334,
                    "sets": 28,
                    "tries": 3,
                    "triesConceded": 7,
                    "tryAssists": 2,
                    "tryCause": 16,
                    "trySaves": 1,
                    "hitupRunMeters": 688,
                    "evasionRuns": 55,
                    "evasionRunMetres": 450,
                    "dummyHalfRunMetres": 8,
                    "ptbTotal": 115,
                    "twoManTackles": 46,
                    "threeManTackles": 57,
                    "fourManPlusTackles": 5,
                    "tryScoringPercentage": 13.04,
                    "shiftsLeft": 9,
                    "shiftsRight": 8,
                    "receipts": 319,
                    "grubberKick": 3,
                    "crossFieldKick": 1,
                    "postContactMetres": 426,
                    "dummyPasses": 22,
                    "kickPressures": 18,
                    "lineEngagedRuns": 11,
                    "ptbOneToTwo": 4,
                    "ptbTwoToThree": 28,
                    "ptbThreeToFour": 61,
                    "ptbFourToFive": 17,
                    "ptbFivePlus": 5,
                    "interchangeUsed": 8,
                    "doubles": 49,
                    "longKicksSpace": 3,
                    "effectiveTacklePercentage": 88.8,
                    "ptbPenalties": 4,
                    "foulPlayPenalties": 2,
                    "averageSetDistance": 44.7,
                    "completeSets1stHalf": 10,
                    "completeSets2ndHalf": 13,
                    "completionPercentage1stHalf": 83.33,
                    "completionPercentage2ndHalf": 81.25,
                    "incompleteSets1stHalf": 2,
                    "incompleteSets2ndHalf": 3,
                    "incompletionPercentage1stHalf": 16.67,
                    "incompletionPercentage2ndHalf": 18.75
                },
                "teamHexColour": "610a35",
                "teamHexColour2": "b4b4be"
            },
            {
                "score": {
                    "conversions": 5,
                    "points": 38,
                    "tries": 7
                },
                "team1stHalfScore": 26,
                "team2ndHalfScore": 12,
                "teamAbbr": "MEL",
                "teamFinalScore": 38,
                "teamFullTimeScore": 38,
                "teamHalfTimeScore": 26,
                "teamId": 500021,
                "teamLineup": {
                    "teamLineUpStatusID": 4,
                    "teamLineUpStatus": "Final",
                    "injuriesAndSuspensions": {
                        "injury": [],
                        "suspension": []
                    },
                    "insAndOuts": {
                        "inOut": [
                            {
                                "inOut": "Out",
                                "playerFirstName": "Cheyse",
                                "playerId": "501260",
                                "playerLastName": "Blair",
                                "playerName": "Cheyse Blair"
                            },
                            {
                                "inOut": "In",
                                "playerFirstName": "Felise",
                                "playerId": "500598",
                                "playerLastName": "Kaufusi",
                                "playerName": "Felise Kaufusi"
                            },
                            {
                                "inOut": "Out",
                                "playerFirstName": "Kevin",
                                "playerId": "500606",
                                "playerLastName": "Proctor",
                                "playerName": "Kevin Proctor"
                            },
                            {
                                "inOut": "Out",
                                "playerFirstName": "Matt",
                                "playerId": "500834",
                                "playerLastName": "White",
                                "playerName": "Matt White"
                            },
                            {
                                "inOut": "In",
                                "playerFirstName": "Nelson",
                                "playerId": "501281",
                                "playerLastName": "Asofa-Solomona",
                                "playerName": "Nelson Asofa-Solomona"
                            },
                            {
                                "inOut": "In",
                                "playerFirstName": "Ryan",
                                "playerId": "500682",
                                "playerLastName": "Morgan",
                                "playerName": "Ryan Morgan"
                            }
                        ]
                    },
                    "teamPlayer": [
                        {
                            "playerFirstName": "Cameron",
                            "playerId": 501459,
                            "playerLastName": "Munster",
                            "playerName": "Cameron Munster",
                            "playerPosition": "Fullback",
                            "playerPositionId": 500001,
                            "playerStats": {
                                "allRunMetres": 124,
                                "allRuns": 17,
                                "bombKicksDefused": 5,
                                "decoys": 1,
                                "errors": 1,
                                "fantasyPointsTotal": 60,
                                "kickMetres": 11,
                                "kickReturnMetres": 51,
                                "kickReturns": 6,
                                "kicks": 2,
                                "kicksDefused": 5,
                                "linebreakAssists": 2,
                                "linebreaks": 1,
                                "mins": 80,
                                "missedTackles": 1,
                                "offloads": 1,
                                "passes": 20,
                                "passesPerRun": 1.18,
                                "supports": 12,
                                "tackleBreaks": 8,
                                "tackles": 3,
                                "tryAssists": 2,
                                "evasionRuns": 11,
                                "evasionRunMetres": 73,
                                "ptbAll": 14,
                                "receipts": 37,
                                "forcedDropOutKicker": 1,
                                "grubberKick": 2,
                                "postContactMetres": 35,
                                "dummyPasses": 4,
                                "lineEngagedRuns": 1,
                                "ptbTwoToThree": 1,
                                "ptbThreeToFour": 5,
                                "ptbFourToFive": 5,
                                "ptbFivePlus": 3,
                                "effectiveTacklePercentage": 75,
                                "stint1": 4800
                            },
                            "playerTookTheField": true,
                            "shirtNum": 1,
                            "playerFirstInitial": "C",
                            "playerPositionAbbrev": "FB",
                            "onTheField": true,
                            "fantasyPrice": 442000,
                            "fantasySeasonPriceChange": 59000,
                            "fantasyRoundPriceChange": -25000
                        },
                        {
                            "playerFirstName": "Suliasi",
                            "playerId": 502107,
                            "playerLastName": "Vunivalu",
                            "playerName": "Suliasi Vunivalu",
                            "playerPosition": "Winger 1",
                            "playerPositionId": 500002,
                            "playerStats": {
                                "allRunMetres": 168,
                                "allRuns": 13,
                                "bombKicksDefused": 2,
                                "dummyHalfRuns": 2,
                                "fantasyPointsTotal": 84,
                                "kickDead": 1,
                                "kickReturnMetres": 70,
                                "kickReturns": 3,
                                "kicks": 1,
                                "kicksDefused": 2,
                                "kicksNotDefused": 1,
                                "linebreaks": 3,
                                "mins": 80,
                                "passes": 3,
                                "passesPerRun": 0.23,
                                "oneOnOneTackles": 2,
                                "penalties": 1,
                                "points": 16,
                                "supports": 10,
                                "tackleBreaks": 6,
                                "tackles": 4,
                                "tries": 4,
                                "tryCause": 1,
                                "evasionRuns": 8,
                                "evasionRunMetres": 76,
                                "dummyHalfRunMetres": 22,
                                "ptbAll": 9,
                                "receipts": 18,
                                "chipKick": 1,
                                "postContactMetres": 28,
                                "dummyPasses": 1,
                                "ptbTwoToThree": 4,
                                "ptbThreeToFour": 1,
                                "ptbFourToFive": 3,
                                "ptbFivePlus": 1,
                                "effectiveTacklePercentage": 100,
                                "generalPlayPenalties": 1,
                                "stint1": 4800
                            },
                            "playerTookTheField": true,
                            "shirtNum": 2,
                            "playerFirstInitial": "S",
                            "playerPositionAbbrev": "WG",
                            "onTheField": true,
                            "fantasyPrice": 205000
                        },
                        {
                            "playerFirstName": "Will",
                            "playerId": 500586,
                            "playerLastName": "Chambers",
                            "playerName": "Will Chambers",
                            "playerPosition": "Centre 1",
                            "playerPositionId": 500003,
                            "playerStats": {
                                "allRunMetres": 89,
                                "allRuns": 11,
                                "decoys": 2,
                                "dummyHalfRuns": 2,
                                "errors": 2,
                                "fantasyPointsTotal": 22,
                                "ineffectiveTackles": 1,
                                "kickReturns": 1,
                                "kicksDefused": 1,
                                "mins": 80,
                                "offloads": 1,
                                "passes": 6,
                                "passesPerRun": 0.55,
                                "oneOnOneTackles": 3,
                                "supports": 7,
                                "tackles": 15,
                                "tryCause": 1,
                                "evasionRuns": 8,
                                "evasionRunMetres": 69,
                                "dummyHalfRunMetres": 20,
                                "ptbAll": 7,
                                "receipts": 17,
                                "postContactMetres": 30,
                                "dummyPasses": 2,
                                "kickPressures": 1,
                                "lineEngagedRuns": 1,
                                "ptbTwoToThree": 3,
                                "ptbThreeToFour": 1,
                                "ptbFourToFive": 3,
                                "doubles": 4,
                                "effectiveTacklePercentage": 93.8,
                                "stint1": 4800
                            },
                            "playerTookTheField": true,
                            "shirtNum": 3,
                            "playerFirstInitial": "W",
                            "playerPositionAbbrev": "CT",
                            "onTheField": true,
                            "fantasyPrice": 229000,
                            "fantasySeasonPriceChange": -123000,
                            "fantasyRoundPriceChange": -19000
                        },
                        {
                            "playerFirstName": "Ryan",
                            "playerId": 500682,
                            "playerLastName": "Morgan",
                            "playerName": "Ryan Morgan",
                            "playerPosition": "Centre 2",
                            "playerPositionId": 500004,
                            "playerStats": {
                                "allRunMetres": 84,
                                "allRuns": 8,
                                "fantasyPointsTotal": 20,
                                "linebreaks": 1,
                                "mins": 80,
                                "missedTackles": 1,
                                "passes": 1,
                                "passesPerRun": 0.12,
                                "supports": 9,
                                "tackles": 10,
                                "tryCause": 2,
                                "evasionRuns": 8,
                                "evasionRunMetres": 84,
                                "ptbAll": 7,
                                "receipts": 9,
                                "postContactMetres": 21,
                                "ptbOneToTwo": 1,
                                "ptbTwoToThree": 3,
                                "ptbThreeToFour": 1,
                                "ptbFourToFive": 2,
                                "doubles": 1,
                                "effectiveTacklePercentage": 90.9,
                                "stint1": 4800
                            },
                            "playerTookTheField": true,
                            "shirtNum": 19,
                            "playerFirstInitial": "R",
                            "playerPositionAbbrev": "CT",
                            "onTheField": true,
                            "fantasyPrice": 273000,
                            "fantasySeasonPriceChange": 66000
                        },
                        {
                            "playerFirstName": "Marika",
                            "playerId": 500653,
                            "playerLastName": "Koroibete",
                            "playerName": "Marika Koroibete",
                            "playerPosition": "Winger 2",
                            "playerPositionId": 500005,
                            "playerStats": {
                                "allRunMetres": 106,
                                "allRuns": 12,
                                "bombKicksNotDefused": 1,
                                "errors": 2,
                                "fantasyPointsTotal": 4,
                                "kickReturnMetres": 27,
                                "kickReturns": 2,
                                "kicksNotDefused": 1,
                                "mins": 80,
                                "missedTackles": 1,
                                "passes": 3,
                                "passesPerRun": 0.25,
                                "supports": 9,
                                "tryCause": 1,
                                "evasionRuns": 10,
                                "evasionRunMetres": 79,
                                "ptbAll": 13,
                                "receipts": 18,
                                "postContactMetres": 37,
                                "dummyPasses": 2,
                                "ptbTwoToThree": 4,
                                "ptbThreeToFour": 6,
                                "ptbFourToFive": 3,
                                "stint1": 4800
                            },
                            "playerTookTheField": true,
                            "shirtNum": 5,
                            "playerFirstInitial": "M",
                            "playerPositionAbbrev": "WG",
                            "onTheField": true,
                            "fantasyPrice": 324000,
                            "fantasySeasonPriceChange": -5000,
                            "fantasyRoundPriceChange": -14000
                        },
                        {
                            "playerFirstName": "Blake",
                            "playerId": 502209,
                            "playerLastName": "Green",
                            "playerName": "Blake Green",
                            "playerPosition": "Five-Eighth",
                            "playerPositionId": 500006,
                            "playerStats": {
                                "allRunMetres": 56,
                                "allRuns": 8,
                                "bombKicks": 1,
                                "bombKickMetres": 14,
                                "errors": 1,
                                "fantasyPointsTotal": 24,
                                "kickMetres": 131,
                                "kicks": 5,
                                "kicksNotDefused": 1,
                                "mins": 80,
                                "missedTackles": 1,
                                "passes": 34,
                                "passesPerRun": 4.25,
                                "oneOnOneTackles": 2,
                                "supports": 6,
                                "tackles": 17,
                                "evasionRuns": 8,
                                "evasionRunMetres": 56,
                                "ptbAll": 5,
                                "receipts": 45,
                                "forcedDropOutKicker": 2,
                                "grubberKick": 2,
                                "postContactMetres": 14,
                                "dummyPasses": 4,
                                "lineEngagedRuns": 2,
                                "ptbTwoToThree": 3,
                                "ptbThreeToFour": 2,
                                "doubles": 2,
                                "longKicksSpace": 1,
                                "effectiveTacklePercentage": 94.4,
                                "stint1": 4800
                            },
                            "playerTookTheField": true,
                            "shirtNum": 6,
                            "playerFirstInitial": "B",
                            "playerPositionAbbrev": "FE",
                            "onTheField": true,
                            "fantasyPrice": 309000,
                            "fantasySeasonPriceChange": -49000,
                            "fantasyRoundPriceChange": -4000
                        },
                        {
                            "playerFirstName": "Cooper",
                            "playerId": 500587,
                            "playerLastName": "Cronk",
                            "playerName": "Cooper Cronk",
                            "playerPosition": "Halfback",
                            "playerPositionId": 500007,
                            "playerStats": {
                                "allRunMetres": 106,
                                "allRuns": 11,
                                "bombKicks": 2,
                                "bombKickMetres": 70,
                                "fantasyPointsTotal": 69,
                                "kickMetres": 186,
                                "kicks": 9,
                                "linebreakAssists": 2,
                                "linebreaks": 1,
                                "mins": 80,
                                "passes": 27,
                                "passesPerRun": 2.45,
                                "oneOnOneTackles": 2,
                                "supports": 15,
                                "tackleBreaks": 3,
                                "tackles": 13,
                                "tryAssists": 4,
                                "evasionRuns": 11,
                                "evasionRunMetres": 106,
                                "ptbAll": 5,
                                "receipts": 41,
                                "forcedDropOutKicker": 2,
                                "grubberKick": 3,
                                "postContactMetres": 12,
                                "dummyPasses": 2,
                                "kickPressures": 1,
                                "lineEngagedRuns": 5,
                                "ptbThreeToFour": 1,
                                "ptbFourToFive": 3,
                                "ptbFivePlus": 1,
                                "doubles": 2,
                                "longKicksSpace": 2,
                                "effectiveTacklePercentage": 100,
                                "stint1": 4800
                            },
                            "playerTookTheField": true,
                            "shirtNum": 7,
                            "playerFirstInitial": "C",
                            "playerPositionAbbrev": "HB",
                            "onTheField": true,
                            "fantasyPrice": 385000,
                            "fantasySeasonPriceChange": -5000,
                            "fantasyRoundPriceChange": -10000
                        },
                        {
                            "playerFirstName": "Jesse",
                            "playerId": 500584,
                            "playerLastName": "Bromwich",
                            "playerName": "Jesse Bromwich",
                            "playerPosition": "Prop 1",
                            "playerPositionId": 500008,
                            "playerStats": {
                                "allRunMetres": 133,
                                "allRuns": 13,
                                "decoys": 2,
                                "errors": 1,
                                "fantasyPointsTotal": 39,
                                "hitUps": 10,
                                "kickReturnMetres": 26,
                                "kickReturns": 2,
                                "mins": 51,
                                "missedTackles": 2,
                                "offloads": 2,
                                "passes": 6,
                                "passesPerRun": 0.46,
                                "penalties": 1,
                                "supports": 5,
                                "tackles": 30,
                                "hitupRunMeters": 107,
                                "evasionRuns": 1,
                                "ptbAll": 9,
                                "receipts": 18,
                                "postContactMetres": 48,
                                "dummyPasses": 2,
                                "kickPressures": 1,
                                "lineEngagedRuns": 1,
                                "ptbTwoToThree": 4,
                                "ptbThreeToFour": 3,
                                "ptbFourToFive": 1,
                                "ptbFivePlus": 1,
                                "doubles": 4,
                                "effectiveTacklePercentage": 93.8,
                                "offsidePenalties": 1,
                                "stint1": 1846,
                                "stint2": 1194
                            },
                            "playerTookTheField": true,
                            "shirtNum": 8,
                            "playerFirstInitial": "J",
                            "playerPositionAbbrev": "PR",
                            "fantasyPrice": 403000,
                            "fantasySeasonPriceChange": -67000,
                            "fantasyRoundPriceChange": -6000
                        },
                        {
                            "playerFirstName": "Cameron",
                            "playerId": 500609,
                            "playerLastName": "Smith",
                            "playerName": "Cameron Smith",
                            "playerPosition": "Hooker",
                            "playerPositionId": 500009,
                            "playerStats": {
                                "allRunMetres": 101,
                                "allRuns": 9,
                                "bombKicks": 1,
                                "bombKickMetres": 39,
                                "conversions": 4,
                                "conversionsAttempts": 6,
                                "conversionsMissed": 2,
                                "dummyHalfRuns": 9,
                                "fantasyPointsTotal": 86,
                                "fortyTwentyKicks": 1,
                                "goalConversionRate": 66.67,
                                "allGoals": 4,
                                "allGoalsMissed": 2,
                                "allGoalsAttempted": 6,
                                "kickDead": 1,
                                "kickMetres": 99,
                                "kicks": 4,
                                "linebreaks": 1,
                                "mins": 76,
                                "missedTackles": 1,
                                "offloads": 2,
                                "passes": 104,
                                "passesPerRun": 11.56,
                                "points": 12,
                                "tackleBreaks": 2,
                                "tackles": 40,
                                "tries": 1,
                                "tryCause": 1,
                                "dummyHalfRunMetres": 101,
                                "ptbAll": 4,
                                "receipts": 108,
                                "forcedDropOutKicker": 1,
                                "grubberKick": 2,
                                "postContactMetres": 15,
                                "dummyPasses": 10,
                                "kickPressures": 3,
                                "lineEngagedRuns": 2,
                                "ptbTwoToThree": 2,
                                "ptbThreeToFour": 2,
                                "doubles": 13,
                                "longKicksSpace": 1,
                                "effectiveTacklePercentage": 97.6,
                                "stint1": 4540
                            },
                            "playerTookTheField": true,
                            "shirtNum": 9,
                            "playerFirstInitial": "C",
                            "playerPositionAbbrev": "HK",
                            "fantasyPrice": 522000,
                            "fantasySeasonPriceChange": -26000,
                            "fantasyRoundPriceChange": -7000
                        },
                        {
                            "playerFirstName": "Tim",
                            "playerId": 500591,
                            "playerLastName": "Glasby",
                            "playerName": "Tim Glasby",
                            "playerPosition": "Prop 2",
                            "playerPositionId": 500010,
                            "playerStats": {
                                "allRunMetres": 128,
                                "allRuns": 15,
                                "chargeDowns": 1,
                                "decoys": 1,
                                "fantasyPointsTotal": 40,
                                "hitUps": 10,
                                "kickReturnMetres": 20,
                                "kickReturns": 2,
                                "kicksDefused": 1,
                                "linebreakAssists": 1,
                                "mins": 46,
                                "missedTackles": 1,
                                "passes": 8,
                                "passesPerRun": 0.53,
                                "supports": 7,
                                "tackles": 27,
                                "tryCause": 1,
                                "hitupRunMeters": 89,
                                "evasionRuns": 3,
                                "evasionRunMetres": 19,
                                "ptbAll": 10,
                                "receipts": 20,
                                "postContactMetres": 40,
                                "kickPressures": 1,
                                "lineEngagedRuns": 3,
                                "ptbTwoToThree": 4,
                                "ptbThreeToFour": 4,
                                "ptbFourToFive": 1,
                                "ptbFivePlus": 1,
                                "doubles": 5,
                                "effectiveTacklePercentage": 96.4,
                                "stint1": 1462,
                                "stint2": 1290
                            },
                            "playerTookTheField": true,
                            "shirtNum": 15,
                            "playerFirstInitial": "T",
                            "playerPositionAbbrev": "PR",
                            "fantasyPrice": 262000,
                            "fantasySeasonPriceChange": -14000,
                            "fantasyRoundPriceChange": -21000
                        },
                        {
                            "playerFirstName": "Kenneath",
                            "playerId": 500585,
                            "playerLastName": "Bromwich",
                            "playerName": "Kenneath Bromwich",
                            "playerPosition": "2nd Row 1",
                            "playerPositionId": 500011,
                            "playerStats": {
                                "allRunMetres": 99,
                                "allRuns": 9,
                                "decoys": 8,
                                "errors": 1,
                                "fantasyPointsTotal": 37,
                                "hitUps": 7,
                                "kickReturnMetres": 17,
                                "kickReturns": 2,
                                "linebreaks": 1,
                                "mins": 58,
                                "missedTackles": 2,
                                "passes": 1,
                                "passesPerRun": 0.11,
                                "oneOnOneTackles": 1,
                                "points": 4,
                                "supports": 8,
                                "tackleBreaks": 1,
                                "tackles": 19,
                                "tries": 1,
                                "hitupRunMeters": 82,
                                "ptbAll": 8,
                                "receipts": 11,
                                "postContactMetres": 21,
                                "kickPressures": 1,
                                "ptbTwoToThree": 4,
                                "ptbThreeToFour": 4,
                                "doubles": 4,
                                "effectiveTacklePercentage": 90.5,
                                "stint1": 3500
                            },
                            "playerTookTheField": true,
                            "shirtNum": 14,
                            "playerFirstInitial": "K",
                            "playerPositionAbbrev": "2R",
                            "fantasyPrice": 286000,
                            "fantasySeasonPriceChange": 21000,
                            "fantasyRoundPriceChange": 6000
                        },
                        {
                            "playerFirstName": "Tohu",
                            "playerId": 500594,
                            "playerLastName": "Harris",
                            "playerName": "Tohu Harris",
                            "playerPosition": "2nd Row 2",
                            "playerPositionId": 500012,
                            "playerStats": {
                                "allRunMetres": 149,
                                "allRuns": 14,
                                "conversions": 1,
                                "conversionsAttempts": 1,
                                "decoys": 4,
                                "fantasyPointsTotal": 58,
                                "goalConversionRate": 100,
                                "allGoals": 1,
                                "allGoalsAttempted": 1,
                                "hitUps": 13,
                                "linebreakAssists": 1,
                                "mins": 65,
                                "missedTackles": 1,
                                "offloads": 1,
                                "passes": 7,
                                "passesPerRun": 0.5,
                                "oneOnOneTackles": 1,
                                "points": 2,
                                "supports": 6,
                                "tackles": 40,
                                "hitupRunMeters": 141,
                                "evasionRuns": 1,
                                "evasionRunMetres": 8,
                                "ptbAll": 12,
                                "receipts": 20,
                                "postContactMetres": 52,
                                "kickPressures": 2,
                                "lineEngagedRuns": 1,
                                "ptbTwoToThree": 1,
                                "ptbThreeToFour": 5,
                                "ptbFourToFive": 6,
                                "doubles": 10,
                                "effectiveTacklePercentage": 97.6,
                                "stint1": 2590,
                                "stint2": 1300
                            },
                            "playerTookTheField": true,
                            "shirtNum": 12,
                            "playerFirstInitial": "T",
                            "playerPositionAbbrev": "2R",
                            "onTheField": true,
                            "fantasyPrice": 417000,
                            "fantasySeasonPriceChange": -11000,
                            "fantasyRoundPriceChange": -6000
                        },
                        {
                            "playerFirstName": "Dale",
                            "playerId": 500222,
                            "playerLastName": "Finucane",
                            "playerName": "Dale Finucane",
                            "playerPosition": "Lock",
                            "playerPositionId": 500013,
                            "playerStats": {
                                "allRunMetres": 190,
                                "allRuns": 21,
                                "decoys": 10,
                                "errors": 1,
                                "fantasyPointsTotal": 51,
                                "hitUps": 18,
                                "ineffectiveTackles": 2,
                                "mins": 66,
                                "passes": 7,
                                "passesPerRun": 0.33,
                                "supports": 5,
                                "tackleBreaks": 2,
                                "tackles": 28,
                                "hitupRunMeters": 172,
                                "evasionRuns": 3,
                                "evasionRunMetres": 18,
                                "ptbAll": 16,
                                "receipts": 25,
                                "postContactMetres": 71,
                                "dummyPasses": 1,
                                "kickPressures": 2,
                                "lineEngagedRuns": 3,
                                "ptbTwoToThree": 1,
                                "ptbThreeToFour": 11,
                                "ptbFourToFive": 3,
                                "ptbFivePlus": 1,
                                "doubles": 2,
                                "effectiveTacklePercentage": 93.3,
                                "stint1": 3722,
                                "stint2": 259
                            },
                            "playerTookTheField": true,
                            "shirtNum": 13,
                            "playerFirstInitial": "D",
                            "playerPositionAbbrev": "LK",
                            "onTheField": true,
                            "fantasyPrice": 363000,
                            "fantasySeasonPriceChange": -6000,
                            "fantasyRoundPriceChange": -7000
                        },
                        {
                            "playerFirstName": "Christian",
                            "playerId": 500786,
                            "playerLastName": "Welch",
                            "playerName": "Christian Welch",
                            "playerPosition": "Interchange",
                            "playerPositionId": 500014,
                            "playerStats": {
                                "allRunMetres": 73,
                                "allRuns": 9,
                                "decoys": 3,
                                "fantasyPointsTotal": 27,
                                "hitUps": 8,
                                "kickReturnMetres": 2,
                                "kickReturns": 1,
                                "mins": 26,
                                "missedTackles": 1,
                                "offloads": 3,
                                "oneOnOneTackles": 1,
                                "penalties": 1,
                                "supports": 6,
                                "tackleBreaks": 1,
                                "tackles": 15,
                                "hitupRunMeters": 71,
                                "ptbAll": 6,
                                "receipts": 9,
                                "postContactMetres": 9,
                                "kickPressures": 1,
                                "ptbTwoToThree": 4,
                                "ptbThreeToFour": 1,
                                "ptbFourToFive": 1,
                                "doubles": 4,
                                "effectiveTacklePercentage": 93.8,
                                "offsidePenalties": 1,
                                "stint1": 674,
                                "stint2": 920
                            },
                            "playerTookTheField": true,
                            "shirtNum": 16,
                            "playerFirstInitial": "C",
                            "playerPositionAbbrev": "INT",
                            "onTheField": true,
                            "fantasyPrice": 157000,
                            "fantasySeasonPriceChange": 23000,
                            "fantasyRoundPriceChange": -9000
                        },
                        {
                            "playerFirstName": "Ben",
                            "playerId": 500593,
                            "playerLastName": "Hampton",
                            "playerName": "Ben Hampton",
                            "playerPosition": "Interchange",
                            "playerPositionId": 500014,
                            "playerStats": {
                                "allRunMetres": 20,
                                "allRuns": 2,
                                "decoys": 1,
                                "dummyHalfRuns": 1,
                                "fantasyPointsTotal": 12,
                                "hitUps": 1,
                                "ineffectiveTackles": 1,
                                "mins": 18,
                                "passes": 11,
                                "passesPerRun": 5.5,
                                "tackles": 10,
                                "hitupRunMeters": 11,
                                "dummyHalfRunMetres": 9,
                                "ptbAll": 2,
                                "receipts": 13,
                                "postContactMetres": 7,
                                "kickPressures": 1,
                                "ptbTwoToThree": 1,
                                "ptbFivePlus": 1,
                                "doubles": 1,
                                "effectiveTacklePercentage": 90.9,
                                "stint1": 1078
                            },
                            "playerTookTheField": true,
                            "shirtNum": 17,
                            "playerFirstInitial": "B",
                            "playerPositionAbbrev": "INT",
                            "onTheField": true,
                            "fantasyPrice": 136000,
                            "fantasySeasonPriceChange": -146000,
                            "fantasyRoundPriceChange": -8000
                        },
                        {
                            "playerFirstName": "Felise",
                            "playerId": 500598,
                            "playerLastName": "Kaufusi",
                            "playerName": "Felise Kaufusi",
                            "playerPosition": "Interchange",
                            "playerPositionId": 500014,
                            "playerStats": {
                                "allRunMetres": 86,
                                "allRuns": 7,
                                "decoys": 3,
                                "fantasyPointsTotal": 35,
                                "hitUps": 5,
                                "kickReturnMetres": 14,
                                "kickReturns": 1,
                                "linebreaks": 1,
                                "mins": 44,
                                "missedTackles": 2,
                                "passes": 1,
                                "passesPerRun": 0.14,
                                "penalties": 1,
                                "points": 4,
                                "supports": 1,
                                "tackleBreaks": 1,
                                "tackles": 18,
                                "tries": 1,
                                "hitupRunMeters": 52,
                                "evasionRuns": 1,
                                "evasionRunMetres": 20,
                                "ptbAll": 6,
                                "receipts": 8,
                                "postContactMetres": 25,
                                "ptbOneToTwo": 1,
                                "ptbTwoToThree": 3,
                                "ptbThreeToFour": 1,
                                "ptbFourToFive": 1,
                                "doubles": 4,
                                "effectiveTacklePercentage": 90,
                                "ptbPenalties": 1,
                                "stint1": 2663
                            },
                            "playerTookTheField": true,
                            "shirtNum": 21,
                            "playerFirstInitial": "F",
                            "playerPositionAbbrev": "INT",
                            "onTheField": true,
                            "fantasyPrice": 186000,
                            "fantasySeasonPriceChange": 20000
                        },
                        {
                            "playerFirstName": "Nelson",
                            "playerId": 501281,
                            "playerLastName": "Asofa-Solomona",
                            "playerName": "Nelson Asofa-Solomona",
                            "playerPosition": "Interchange",
                            "playerPositionId": 500014,
                            "playerStats": {
                                "allRunMetres": 136,
                                "allRuns": 11,
                                "decoys": 7,
                                "fantasyPointsTotal": 32,
                                "hitUps": 9,
                                "kickReturnMetres": 45,
                                "kickReturns": 2,
                                "mins": 29,
                                "missedTackles": 1,
                                "offloads": 2,
                                "supports": 1,
                                "tackleBreaks": 3,
                                "tackles": 8,
                                "hitupRunMeters": 91,
                                "ptbAll": 9,
                                "receipts": 11,
                                "postContactMetres": 49,
                                "dummyPasses": 1,
                                "kickPressures": 1,
                                "ptbTwoToThree": 5,
                                "ptbThreeToFour": 3,
                                "ptbFivePlus": 1,
                                "doubles": 1,
                                "effectiveTacklePercentage": 88.9,
                                "stint1": 1332,
                                "stint2": 428
                            },
                            "playerTookTheField": true,
                            "shirtNum": 23,
                            "playerFirstInitial": "N",
                            "playerPositionAbbrev": "INT",
                            "onTheField": true,
                            "fantasyPrice": 262000,
                            "fantasySeasonPriceChange": 44000
                        }
                    ]
                },
                "teamName": "Melbourne Storm",
                "teamNickName": "Storm",
                "teamStats": {
                    "allRunMetres": 1845,
                    "allRuns": 190,
                    "bombKicks": 4,
                    "bombKickMetres": 123,
                    "bombKicksDefused": 7,
                    "bombKicksNotDefused": 1,
                    "chargeDowns": 1,
                    "completeSets": 32,
                    "completionPercentage": 80,
                    "conversions": 5,
                    "conversionsAttempts": 7,
                    "conversionsMissed": 2,
                    "decoys": 42,
                    "dummyHalfRuns": 14,
                    "errors": 9,
                    "fortyTwentyKicks": 1,
                    "goalConversionRate": 71.43,
                    "allGoals": 5,
                    "allGoalsAttempted": 7,
                    "allGoalsMissed": 2,
                    "hitUps": 81,
                    "incompleteSets": 8,
                    "ineffectiveTackles": 4,
                    "kickDead": 2,
                    "kickMetres": 428,
                    "kickReturnMetres": 270,
                    "kickReturns": 22,
                    "kicks": 21,
                    "kicksDefused": 9,
                    "kicksNotDefused": 3,
                    "linebreakAssists": 6,
                    "linebreaks": 9,
                    "missedTackles": 15,
                    "offloads": 12,
                    "oneOnOneTackles": 12,
                    "passes": 239,
                    "passesPerRun": 1.26,
                    "penalties": 4,
                    "points": 38,
                    "pointsConceded": 18,
                    "possession": 57,
                    "scrumWins": 4,
                    "supports": 107,
                    "tackleBreaks": 27,
                    "tackles": 297,
                    "sets": 40,
                    "tries": 7,
                    "triesConceded": 3,
                    "tryAssists": 6,
                    "tryCause": 7,
                    "hitupRunMeters": 816,
                    "evasionRuns": 73,
                    "evasionRunMetres": 607,
                    "dummyHalfRunMetres": 152,
                    "ptbTotal": 142,
                    "twoManTackles": 75,
                    "threeManTackles": 49,
                    "fourManPlusTackles": 2,
                    "tryScoringPercentage": 21.88,
                    "shiftsLeft": 9,
                    "shiftsRight": 14,
                    "receipts": 428,
                    "forcedDropOutKicker": 6,
                    "chipKick": 1,
                    "grubberKick": 9,
                    "postContactMetres": 513,
                    "dummyPasses": 29,
                    "kickPressures": 15,
                    "lineEngagedRuns": 19,
                    "ptbOneToTwo": 2,
                    "ptbTwoToThree": 47,
                    "ptbThreeToFour": 51,
                    "ptbFourToFive": 32,
                    "ptbFivePlus": 10,
                    "interchangeUsed": 8,
                    "doubles": 57,
                    "longKicksSpace": 4,
                    "effectiveTacklePercentage": 94,
                    "ptbPenalties": 1,
                    "generalPlayPenalties": 1,
                    "offsidePenalties": 2,
                    "averageSetDistance": 46.1,
                    "completeSets1stHalf": 17,
                    "completeSets2ndHalf": 15,
                    "completionPercentage1stHalf": 89.47,
                    "completionPercentage2ndHalf": 71.43,
                    "incompleteSets1stHalf": 2,
                    "incompleteSets2ndHalf": 6,
                    "incompletionPercentage1stHalf": 10.53,
                    "incompletionPercentage2ndHalf": 28.57
                },
                "teamHexColour": "500180",
                "teamHexColour2": "feba35"
            }
        ]
    }
}