{
    "competitionId": 111,
    "competitionName": "NRL Telstra Premiership",
    "gameId": 20161110430,
    "gameInfo": {
        "assistantReferee1Id": 500115,
        "numberOfPeriods": 2,
        "assistantReferee1Name": "Rohan Best",
        "assistantReferee2Id": 500021,
        "assistantReferee2Name": "Dave Ryan",
        "gameDate": "2016-03-26",
        "gameHashTag": "#NRLRaidersTitans",
        "gameNumber": 3,
        "gameSeconds": 4800,
        "gameMinutes": "80:00",
        "gameTime": "1:20:00",
        "groundConditionId": 1,
        "groundConditionName": "N/A",
        "referee1Id": 500006,
        "referee1Name": "Henry Perenara",
        "referee2Id": 500068,
        "referee2Name": "Chris Sutton",
        "startTime": "2016-03-26T17:30:00",
        "startTimeUTC": "2016-03-26T06:30:00Z",
        "venueId": 500071,
        "venueName": "GIO Stadium",
        "videoReferee1Id": 500203,
        "videoReferee1Name": "Ben Galea",
        "videoReferee2Id": 500022,
        "videoReferee2Name": "Jared Maxwell",
        "weatherId": 2,
        "weatherName": "Fine",
        "broadcastChannel": null,
        "venueLatitude": -35.25,
        "venueLongitude": 149.1028,
        "broadcastInfo": {
            "radioNetwork": []
        }
    },
    "gameState": "Final",
    "gameStateId": 8,
    "roundId": 4,
    "roundName": "Round 4",
    "seasonId": 2016,
    "teams": {
        "teamsMatch": [
            {
                "isHomeTeam": true,
                "score": {
                    "conversions": 3,
                    "points": 20,
                    "penaltyGoals": 1,
                    "tries": 3
                },
                "team1stHalfScore": 18,
                "team2ndHalfScore": 2,
                "teamAbbr": "CAN",
                "teamFinalScore": 20,
                "teamFullTimeScore": 20,
                "teamHalfTimeScore": 18,
                "teamId": 500013,
                "teamLineup": {
                    "teamLineUpStatusID": 4,
                    "teamLineUpStatus": "Final",
                    "injuriesAndSuspensions": {
                        "injury": [],
                        "suspension": []
                    },
                    "insAndOuts": {
                        "inOut": []
                    },
                    "teamPlayer": [
                        {
                            "playerFirstName": "Jack",
                            "playerId": 500339,
                            "playerLastName": "Wighton",
                            "playerName": "Jack Wighton",
                            "playerPosition": "Fullback",
                            "playerPositionId": 500001,
                            "playerStats": {
                                "allRunMetres": 119,
                                "allRuns": 15,
                                "bombKicksDefused": 1,
                                "bombKicksNotDefused": 1,
                                "decoys": 2,
                                "dummyHalfRuns": 2,
                                "errors": 1,
                                "fantasyPointsTotal": 30,
                                "kickDead": 1,
                                "kickMetres": 86,
                                "kickReturnMetres": 16,
                                "kickReturns": 2,
                                "kicks": 2,
                                "kicksDefused": 3,
                                "kicksNotDefused": 1,
                                "linebreakAssists": 1,
                                "mins": 80,
                                "missedTackles": 2,
                                "offloads": 3,
                                "passes": 10,
                                "passesPerRun": 0.67,
                                "supports": 8,
                                "tackleBreaks": 3,
                                "tackles": 1,
                                "tryCause": 2,
                                "evasionRuns": 11,
                                "evasionRunMetres": 80,
                                "dummyHalfRunMetres": 23,
                                "ptbAll": 10,
                                "receipts": 26,
                                "postContactMetres": 34,
                                "dummyPasses": 3,
                                "lineEngagedRuns": 3,
                                "ptbOneToTwo": 1,
                                "ptbTwoToThree": 2,
                                "ptbThreeToFour": 5,
                                "ptbFourToFive": 1,
                                "ptbFivePlus": 1,
                                "longKicksSpace": 1,
                                "effectiveTacklePercentage": 33.3
                            },
                            "playerTookTheField": true,
                            "shirtNum": 1,
                            "playerFirstInitial": "J",
                            "playerPositionAbbrev": "FB"
                        },
                        {
                            "playerFirstName": "Edrick",
                            "playerId": 500322,
                            "playerLastName": "Lee",
                            "playerName": "Edrick Lee",
                            "playerPosition": "Winger 1",
                            "playerPositionId": 500002,
                            "playerStats": {
                                "allRunMetres": 99,
                                "allRuns": 7,
                                "bombKicksDefused": 1,
                                "fantasyPointsTotal": 22,
                                "kickReturnMetres": 33,
                                "kickReturns": 3,
                                "kicksDefused": 2,
                                "mins": 80,
                                "passes": 2,
                                "passesPerRun": 0.29,
                                "oneOnOneTackles": 1,
                                "points": 4,
                                "supports": 8,
                                "tackles": 3,
                                "tries": 1,
                                "evasionRuns": 4,
                                "evasionRunMetres": 66,
                                "ptbAll": 8,
                                "receipts": 10,
                                "postContactMetres": 19,
                                "ptbTwoToThree": 6,
                                "ptbThreeToFour": 1,
                                "ptbFourToFive": 1,
                                "doubles": 1,
                                "effectiveTacklePercentage": 100
                            },
                            "playerTookTheField": true,
                            "shirtNum": 2,
                            "playerFirstInitial": "E",
                            "playerPositionAbbrev": "WG"
                        },
                        {
                            "playerFirstName": "Jarrod",
                            "playerId": 500313,
                            "playerLastName": "Croker",
                            "playerName": "Jarrod Croker",
                            "playerPosition": "Centre 1",
                            "playerPositionId": 500003,
                            "playerStats": {
                                "allRunMetres": 90,
                                "allRuns": 10,
                                "bombKicksDefused": 1,
                                "conversions": 3,
                                "conversionsAttempts": 3,
                                "dummyHalfRuns": 2,
                                "errors": 1,
                                "fantasyPointsTotal": 39,
                                "goalConversionRate": 100,
                                "allGoals": 4,
                                "allGoalsAttempted": 4,
                                "kicksDefused": 1,
                                "kicksNotDefused": 1,
                                "mins": 80,
                                "passes": 6,
                                "passesPerRun": 0.6,
                                "oneOnOneTackles": 3,
                                "penaltyGoals": 1,
                                "penaltyGoalsAttempts": 1,
                                "points": 12,
                                "supports": 12,
                                "tackleBreaks": 1,
                                "tackles": 12,
                                "tries": 1,
                                "evasionRuns": 8,
                                "evasionRunMetres": 71,
                                "dummyHalfRunMetres": 19,
                                "ptbAll": 7,
                                "receipts": 15,
                                "postContactMetres": 31,
                                "dummyPasses": 1,
                                "ptbTwoToThree": 4,
                                "ptbThreeToFour": 3,
                                "doubles": 1,
                                "effectiveTacklePercentage": 100
                            },
                            "playerTookTheField": true,
                            "shirtNum": 3,
                            "playerFirstInitial": "J",
                            "playerPositionAbbrev": "CT"
                        },
                        {
                            "playerFirstName": "Brenko",
                            "playerId": 500321,
                            "playerLastName": "Lee",
                            "playerName": "Brenko Lee",
                            "playerPosition": "Centre 2",
                            "playerPositionId": 500004,
                            "playerStats": {
                                "allRunMetres": 130,
                                "allRuns": 12,
                                "dummyHalfRuns": 2,
                                "errors": 1,
                                "fantasyPointsTotal": 29,
                                "hitUps": 1,
                                "ineffectiveTackles": 3,
                                "mins": 80,
                                "missedTackles": 4,
                                "passes": 6,
                                "passesPerRun": 0.5,
                                "oneOnOneTackles": 3,
                                "supports": 10,
                                "tackleBreaks": 2,
                                "tackles": 20,
                                "tryCause": 3,
                                "hitupRunMeters": 12,
                                "evasionRuns": 9,
                                "evasionRunMetres": 94,
                                "dummyHalfRunMetres": 24,
                                "ptbAll": 11,
                                "receipts": 16,
                                "postContactMetres": 47,
                                "dummyPasses": 1,
                                "ptbTwoToThree": 6,
                                "ptbThreeToFour": 4,
                                "ptbFivePlus": 1,
                                "doubles": 4,
                                "effectiveTacklePercentage": 74.1
                            },
                            "playerTookTheField": true,
                            "shirtNum": 4,
                            "playerFirstInitial": "B",
                            "playerPositionAbbrev": "CT"
                        },
                        {
                            "playerFirstName": "Jordan",
                            "playerId": 500330,
                            "playerLastName": "Rapana",
                            "playerName": "Jordan Rapana",
                            "playerPosition": "Winger 2",
                            "playerPositionId": 500005,
                            "playerStats": {
                                "allRunMetres": 143,
                                "allRuns": 17,
                                "bombKicksDefused": 2,
                                "dummyHalfRuns": 6,
                                "errors": 2,
                                "fantasyPointsTotal": 31,
                                "hitUps": 2,
                                "ineffectiveTackles": 1,
                                "kickReturnMetres": 4,
                                "kickReturns": 2,
                                "kicksDefused": 3,
                                "linebreaks": 1,
                                "mins": 80,
                                "missedTackles": 2,
                                "offloads": 3,
                                "passes": 8,
                                "passesPerRun": 0.47,
                                "oneOnOneTackles": 1,
                                "supports": 9,
                                "tackleBreaks": 3,
                                "tackles": 3,
                                "tryCause": 1,
                                "hitupRunMeters": 27,
                                "evasionRuns": 7,
                                "evasionRunMetres": 36,
                                "dummyHalfRunMetres": 76,
                                "ptbAll": 12,
                                "receipts": 24,
                                "postContactMetres": 33,
                                "dummyPasses": 1,
                                "kickPressures": 1,
                                "lineEngagedRuns": 1,
                                "ptbTwoToThree": 4,
                                "ptbThreeToFour": 8,
                                "effectiveTacklePercentage": 50
                            },
                            "playerTookTheField": true,
                            "shirtNum": 5,
                            "playerFirstInitial": "J",
                            "playerPositionAbbrev": "WG"
                        },
                        {
                            "playerFirstName": "Elliott",
                            "playerId": 502134,
                            "playerLastName": "Whitehead",
                            "playerName": "Elliott Whitehead",
                            "playerPosition": "Five-Eighth",
                            "playerPositionId": 500006,
                            "playerStats": {
                                "allRunMetres": 130,
                                "allRuns": 12,
                                "decoys": 1,
                                "dummyHalfRuns": 1,
                                "errors": 2,
                                "fantasyPointsTotal": 68,
                                "ineffectiveTackles": 3,
                                "kicksDefused": 1,
                                "linebreaks": 1,
                                "mins": 80,
                                "missedTackles": 1,
                                "offloads": 2,
                                "passes": 4,
                                "passesPerRun": 0.33,
                                "oneOnOneTackles": 2,
                                "penalties": 1,
                                "points": 4,
                                "supports": 8,
                                "tackleBreaks": 5,
                                "tackles": 31,
                                "tries": 1,
                                "tryCause": 1,
                                "evasionRuns": 11,
                                "evasionRunMetres": 115,
                                "dummyHalfRunMetres": 15,
                                "ptbAll": 6,
                                "receipts": 17,
                                "postContactMetres": 38,
                                "dummyPasses": 3,
                                "kickPressures": 1,
                                "ptbOneToTwo": 1,
                                "ptbTwoToThree": 2,
                                "ptbThreeToFour": 1,
                                "ptbFourToFive": 1,
                                "ptbFivePlus": 1,
                                "doubles": 7,
                                "effectiveTacklePercentage": 88.6,
                                "ptbPenalties": 1
                            },
                            "playerTookTheField": true,
                            "shirtNum": 6,
                            "playerFirstInitial": "E",
                            "playerPositionAbbrev": "FE"
                        },
                        {
                            "playerFirstName": "Sam",
                            "playerId": 500642,
                            "playerLastName": "Williams",
                            "playerName": "Sam Williams",
                            "playerPosition": "Halfback",
                            "playerPositionId": 500007,
                            "playerStats": {
                                "allRunMetres": 26,
                                "allRuns": 3,
                                "bombKicks": 1,
                                "bombKickMetres": 14,
                                "errors": 2,
                                "fantasyPointsTotal": 31,
                                "ineffectiveTackles": 2,
                                "kickMetres": 238,
                                "kicks": 11,
                                "lineDropouts": 2,
                                "linebreaks": 1,
                                "mins": 80,
                                "passes": 35,
                                "passesPerRun": 11.67,
                                "supports": 9,
                                "tackleBreaks": 1,
                                "tackles": 10,
                                "tryAssists": 1,
                                "evasionRuns": 3,
                                "evasionRunMetres": 26,
                                "receipts": 46,
                                "forcedDropOutKicker": 1,
                                "grubberKick": 3,
                                "crossFieldKick": 3,
                                "dummyPasses": 4,
                                "lineEngagedRuns": 2,
                                "doubles": 1,
                                "longKicksSpace": 2,
                                "effectiveTacklePercentage": 83.3
                            },
                            "playerTookTheField": true,
                            "shirtNum": 7,
                            "playerFirstInitial": "S",
                            "playerPositionAbbrev": "HB"
                        },
                        {
                            "playerFirstName": "Shannon",
                            "playerId": 500309,
                            "playerLastName": "Boyd",
                            "playerName": "Shannon Boyd",
                            "playerPosition": "Prop 1",
                            "playerPositionId": 500008,
                            "playerStats": {
                                "allRunMetres": 88,
                                "allRuns": 9,
                                "decoys": 3,
                                "fantasyPointsTotal": 28,
                                "hitUps": 6,
                                "ineffectiveTackles": 3,
                                "kickReturnMetres": 43,
                                "kickReturns": 3,
                                "mins": 31,
                                "supports": 5,
                                "tackleBreaks": 2,
                                "tackles": 14,
                                "hitupRunMeters": 45,
                                "ptbAll": 9,
                                "receipts": 10,
                                "postContactMetres": 40,
                                "kickPressures": 2,
                                "ptbTwoToThree": 6,
                                "ptbFivePlus": 3,
                                "doubles": 2,
                                "effectiveTacklePercentage": 82.4
                            },
                            "playerTookTheField": true,
                            "shirtNum": 8,
                            "playerFirstInitial": "S",
                            "playerPositionAbbrev": "PR"
                        },
                        {
                            "playerFirstName": "Josh",
                            "playerId": 502181,
                            "playerLastName": "Hodgson",
                            "playerName": "Josh Hodgson",
                            "playerPosition": "Hooker",
                            "playerPositionId": 500009,
                            "playerStats": {
                                "allRunMetres": 46,
                                "allRuns": 6,
                                "dummyHalfRuns": 3,
                                "fantasyPointsTotal": 63,
                                "hitUps": 2,
                                "ineffectiveTackles": 2,
                                "kickDead": 1,
                                "kickMetres": 82,
                                "kicks": 2,
                                "linebreakAssists": 1,
                                "linebreaks": 1,
                                "mins": 80,
                                "missedTackles": 2,
                                "passes": 81,
                                "passesPerRun": 13.5,
                                "oneOnOneTackles": 1,
                                "penalties": 1,
                                "supports": 7,
                                "tackleBreaks": 1,
                                "tackles": 42,
                                "tryAssists": 2,
                                "tryCause": 1,
                                "hitupRunMeters": 10,
                                "evasionRuns": 1,
                                "evasionRunMetres": 7,
                                "dummyHalfRunMetres": 29,
                                "ptbAll": 3,
                                "receipts": 85,
                                "postContactMetres": 3,
                                "dummyPasses": 4,
                                "kickPressures": 2,
                                "lineEngagedRuns": 1,
                                "ptbTwoToThree": 1,
                                "ptbFourToFive": 1,
                                "ptbFivePlus": 1,
                                "doubles": 10,
                                "longKicksSpace": 1,
                                "effectiveTacklePercentage": 91.3,
                                "ptbPenalties": 1
                            },
                            "playerTookTheField": true,
                            "shirtNum": 9,
                            "playerFirstInitial": "J",
                            "playerPositionAbbrev": "HK"
                        },
                        {
                            "playerFirstName": "Frank-Paul",
                            "playerId": 500014,
                            "playerLastName": "Nuuausala",
                            "playerName": "Frank-Paul Nuuausala",
                            "playerPosition": "Prop 2",
                            "playerPositionId": 500010,
                            "playerStats": {
                                "allRunMetres": 73,
                                "allRuns": 8,
                                "decoys": 1,
                                "fantasyPointsTotal": 28,
                                "hitUps": 7,
                                "ineffectiveTackles": 3,
                                "mins": 52,
                                "missedTackles": 1,
                                "onReport": 1,
                                "passes": 2,
                                "passesPerRun": 0.25,
                                "penalties": 1,
                                "supports": 3,
                                "tackleBreaks": 2,
                                "tackles": 19,
                                "hitupRunMeters": 65,
                                "evasionRuns": 1,
                                "evasionRunMetres": 8,
                                "ptbAll": 6,
                                "receipts": 9,
                                "postContactMetres": 27,
                                "dummyPasses": 1,
                                "kickPressures": 2,
                                "lineEngagedRuns": 1,
                                "ptbOneToTwo": 1,
                                "ptbTwoToThree": 2,
                                "ptbThreeToFour": 2,
                                "ptbFivePlus": 1,
                                "doubles": 4,
                                "effectiveTacklePercentage": 82.6,
                                "foulPlayPenalties": 1
                            },
                            "playerTookTheField": true,
                            "shirtNum": 10,
                            "playerFirstInitial": "F",
                            "playerPositionAbbrev": "PR"
                        },
                        {
                            "playerFirstName": "Josh",
                            "playerId": 500973,
                            "playerLastName": "Papalii",
                            "playerName": "Josh Papalii",
                            "playerPosition": "2nd Row 1",
                            "playerPositionId": 500011,
                            "playerStats": {
                                "allRunMetres": 139,
                                "allRuns": 16,
                                "decoys": 3,
                                "errors": 2,
                                "fantasyPointsTotal": 47,
                                "hitUps": 14,
                                "ineffectiveTackles": 1,
                                "kickReturnMetres": 4,
                                "kickReturns": 1,
                                "kicksDefused": 1,
                                "mins": 80,
                                "passes": 3,
                                "passesPerRun": 0.19,
                                "oneOnOneTackles": 2,
                                "supports": 6,
                                "tackleBreaks": 6,
                                "tackles": 19,
                                "hitupRunMeters": 130,
                                "evasionRuns": 1,
                                "evasionRunMetres": 5,
                                "ptbAll": 12,
                                "receipts": 17,
                                "postContactMetres": 64,
                                "dummyPasses": 1,
                                "lineEngagedRuns": 1,
                                "ptbZeroToOne": 1,
                                "ptbTwoToThree": 3,
                                "ptbThreeToFour": 3,
                                "ptbFourToFive": 3,
                                "ptbFivePlus": 2,
                                "doubles": 4,
                                "effectiveTacklePercentage": 95
                            },
                            "playerTookTheField": true,
                            "shirtNum": 11,
                            "playerFirstInitial": "J",
                            "playerPositionAbbrev": "2R"
                        },
                        {
                            "playerFirstName": "Iosia",
                            "playerId": 502331,
                            "playerLastName": "Soliola",
                            "playerName": "Iosia Soliola",
                            "playerPosition": "2nd Row 2",
                            "playerPositionId": 500012,
                            "playerStats": {
                                "allRunMetres": 77,
                                "allRuns": 10,
                                "decoys": 2,
                                "errors": 1,
                                "fantasyPointsTotal": 37,
                                "hitUps": 10,
                                "ineffectiveTackles": 2,
                                "mins": 80,
                                "missedTackles": 4,
                                "passes": 1,
                                "passesPerRun": 0.1,
                                "oneOnOneTackles": 1,
                                "supports": 9,
                                "tackles": 40,
                                "tryCause": 1,
                                "hitupRunMeters": 77,
                                "ptbAll": 10,
                                "receipts": 13,
                                "postContactMetres": 20,
                                "kickPressures": 1,
                                "ptbOneToTwo": 2,
                                "ptbTwoToThree": 5,
                                "ptbThreeToFour": 1,
                                "ptbFourToFive": 2,
                                "doubles": 10,
                                "effectiveTacklePercentage": 87
                            },
                            "playerTookTheField": true,
                            "shirtNum": 12,
                            "playerFirstInitial": "I",
                            "playerPositionAbbrev": "2R"
                        },
                        {
                            "playerFirstName": "Shaun",
                            "playerId": 500316,
                            "playerLastName": "Fensom",
                            "playerName": "Shaun Fensom",
                            "playerPosition": "Lock",
                            "playerPositionId": 500013,
                            "playerStats": {
                                "allRunMetres": 94,
                                "allRuns": 14,
                                "decoys": 5,
                                "fantasyPointsTotal": 48,
                                "hitUps": 14,
                                "ineffectiveTackles": 2,
                                "mins": 64,
                                "missedTackles": 1,
                                "passes": 1,
                                "passesPerRun": 0.07,
                                "oneOnOneTackles": 1,
                                "penalties": 2,
                                "supports": 11,
                                "tackles": 45,
                                "tryCause": 1,
                                "hitupRunMeters": 94,
                                "ptbAll": 15,
                                "receipts": 16,
                                "postContactMetres": 31,
                                "kickPressures": 2,
                                "ptbZeroToOne": 1,
                                "ptbTwoToThree": 5,
                                "ptbThreeToFour": 4,
                                "ptbFourToFive": 5,
                                "doubles": 13,
                                "effectiveTacklePercentage": 93.8,
                                "ptbPenalties": 2
                            },
                            "playerTookTheField": true,
                            "shirtNum": 13,
                            "playerFirstInitial": "S",
                            "playerPositionAbbrev": "LK"
                        },
                        {
                            "playerFirstName": "Kurt",
                            "playerId": 500308,
                            "playerLastName": "Baptiste",
                            "playerName": "Kurt Baptiste",
                            "playerPosition": "Interchange",
                            "playerPositionId": 500014,
                            "playerStats": {
                                "allRunMetres": 1,
                                "allRuns": 1,
                                "dummyHalfRuns": 1,
                                "fantasyPointsTotal": 10,
                                "mins": 10,
                                "passes": 5,
                                "passesPerRun": 5,
                                "tackleBreaks": 1,
                                "tackles": 7,
                                "dummyHalfRunMetres": 1,
                                "ptbAll": 1,
                                "receipts": 6,
                                "ptbFourToFive": 1,
                                "doubles": 2,
                                "effectiveTacklePercentage": 100
                            },
                            "playerTookTheField": true,
                            "shirtNum": 14,
                            "playerFirstInitial": "K",
                            "playerPositionAbbrev": "INT"
                        },
                        {
                            "playerFirstName": "Joseph",
                            "playerId": 500555,
                            "playerLastName": "Tapine",
                            "playerName": "Joseph Tapine",
                            "playerPosition": "Interchange",
                            "playerPositionId": 500014,
                            "playerStats": {
                                "allRunMetres": 48,
                                "allRuns": 4,
                                "decoys": 1,
                                "fantasyPointsTotal": 21,
                                "hitUps": 3,
                                "kickReturnMetres": 13,
                                "kickReturns": 1,
                                "mins": 26,
                                "missedTackles": 1,
                                "passes": 3,
                                "passesPerRun": 0.75,
                                "supports": 7,
                                "tackles": 19,
                                "hitupRunMeters": 35,
                                "ptbAll": 4,
                                "receipts": 7,
                                "postContactMetres": 11,
                                "dummyPasses": 1,
                                "kickPressures": 1,
                                "ptbThreeToFour": 2,
                                "ptbFourToFive": 1,
                                "ptbFivePlus": 1,
                                "doubles": 8,
                                "effectiveTacklePercentage": 95
                            },
                            "playerTookTheField": true,
                            "shirtNum": 15,
                            "playerFirstInitial": "J",
                            "playerPositionAbbrev": "INT"
                        },
                        {
                            "playerFirstName": "Paul",
                            "playerId": 500337,
                            "playerLastName": "Vaughan",
                            "playerName": "Paul Vaughan",
                            "playerPosition": "Interchange",
                            "playerPositionId": 500014,
                            "playerStats": {
                                "allRunMetres": 146,
                                "allRuns": 13,
                                "decoys": 2,
                                "fantasyPointsTotal": 59,
                                "hitUps": 12,
                                "kickReturnMetres": 13,
                                "kickReturns": 1,
                                "linebreaks": 1,
                                "mins": 45,
                                "offloads": 1,
                                "penalties": 1,
                                "supports": 5,
                                "tackleBreaks": 4,
                                "tackles": 29,
                                "hitupRunMeters": 133,
                                "ptbAll": 11,
                                "receipts": 13,
                                "postContactMetres": 56,
                                "ptbZeroToOne": 1,
                                "ptbThreeToFour": 7,
                                "ptbFourToFive": 2,
                                "ptbFivePlus": 1,
                                "doubles": 5,
                                "effectiveTacklePercentage": 100,
                                "foulPlayPenalties": 1
                            },
                            "playerTookTheField": true,
                            "shirtNum": 16,
                            "playerFirstInitial": "P",
                            "playerPositionAbbrev": "INT"
                        },
                        {
                            "playerFirstName": "Jeff",
                            "playerId": 500094,
                            "playerLastName": "Lima",
                            "playerName": "Jeff Lima",
                            "playerPosition": "Interchange",
                            "playerPositionId": 500014,
                            "playerStats": {
                                "allRunMetres": 13,
                                "allRuns": 1,
                                "hitUps": 1,
                                "mins": 11,
                                "missedTackles": 1,
                                "penalties": 2,
                                "supports": 1,
                                "tackles": 5,
                                "hitupRunMeters": 13,
                                "ptbAll": 1,
                                "receipts": 1,
                                "postContactMetres": 4,
                                "kickPressures": 2,
                                "ptbTwoToThree": 1,
                                "effectiveTacklePercentage": 83.3,
                                "ptbPenalties": 1,
                                "generalPlayPenalties": 1
                            },
                            "playerTookTheField": true,
                            "shirtNum": 17,
                            "playerFirstInitial": "J",
                            "playerPositionAbbrev": "INT"
                        }
                    ]
                },
                "teamName": "Canberra Raiders",
                "teamNickName": "Raiders",
                "teamStats": {
                    "allRunMetres": 1464,
                    "allRuns": 158,
                    "bombKicks": 1,
                    "bombKickMetres": 14,
                    "bombKicksDefused": 5,
                    "bombKicksNotDefused": 1,
                    "completeSets": 27,
                    "completionPercentage": 73,
                    "conversions": 3,
                    "conversionsAttempts": 3,
                    "decoys": 20,
                    "dummyHalfRuns": 17,
                    "errors": 12,
                    "goalConversionRate": 100,
                    "allGoals": 4,
                    "allGoalsAttempted": 4,
                    "hitUps": 72,
                    "incompleteSets": 10,
                    "ineffectiveTackles": 22,
                    "kickDead": 2,
                    "kickMetres": 406,
                    "kickReturnMetres": 125,
                    "kickReturns": 13,
                    "kicks": 15,
                    "kicksDefused": 11,
                    "kicksNotDefused": 2,
                    "lineDropouts": 2,
                    "linebreakAssists": 2,
                    "linebreaks": 5,
                    "missedTackles": 19,
                    "offloads": 9,
                    "onReports": 1,
                    "oneOnOneTackles": 15,
                    "passes": 167,
                    "passesPerRun": 1.06,
                    "penalties": 8,
                    "penaltyGoals": 1,
                    "penaltyGoalsAttempts": 1,
                    "points": 20,
                    "pointsConceded": 24,
                    "possession": 50,
                    "scrumWins": 4,
                    "supports": 118,
                    "tackleBreaks": 31,
                    "tackles": 319,
                    "sets": 37,
                    "tries": 3,
                    "triesConceded": 4,
                    "tryAssists": 3,
                    "tryCause": 10,
                    "hitupRunMeters": 643,
                    "evasionRuns": 56,
                    "evasionRunMetres": 508,
                    "dummyHalfRunMetres": 188,
                    "ptbTotal": 126,
                    "twoManTackles": 67,
                    "threeManTackles": 42,
                    "fourManPlusTackles": 5,
                    "tryScoringPercentage": 11.11,
                    "shiftsLeft": 5,
                    "shiftsRight": 5,
                    "receipts": 331,
                    "forcedDropOutKicker": 1,
                    "grubberKick": 3,
                    "crossFieldKick": 3,
                    "postContactMetres": 458,
                    "dummyPasses": 20,
                    "kickPressures": 14,
                    "lineEngagedRuns": 9,
                    "ptbZeroToOne": 3,
                    "ptbOneToTwo": 5,
                    "ptbTwoToThree": 47,
                    "ptbThreeToFour": 41,
                    "ptbFourToFive": 18,
                    "ptbFivePlus": 12,
                    "interchangeUsed": 8,
                    "doubles": 72,
                    "longKicksSpace": 4,
                    "effectiveTacklePercentage": 88.6,
                    "ptbPenalties": 5,
                    "generalPlayPenalties": 1,
                    "foulPlayPenalties": 2,
                    "averageSetDistance": 39.6,
                    "completeSets1stHalf": 15,
                    "completeSets2ndHalf": 12,
                    "completionPercentage1stHalf": 75,
                    "completionPercentage2ndHalf": 70.59,
                    "incompleteSets1stHalf": 5,
                    "incompleteSets2ndHalf": 5,
                    "incompletionPercentage1stHalf": 25,
                    "incompletionPercentage2ndHalf": 29.41
                },
                "teamHexColour": "c4d82e",
                "teamHexColour2": "76821C"
            },
            {
                "score": {
                    "conversions": 4,
                    "points": 24,
                    "tries": 4
                },
                "team1stHalfScore": 6,
                "team2ndHalfScore": 18,
                "teamAbbr": "GLD",
                "teamFinalScore": 24,
                "teamFullTimeScore": 24,
                "teamHalfTimeScore": 6,
                "teamId": 500004,
                "teamLineup": {
                    "teamLineUpStatusID": 4,
                    "teamLineUpStatus": "Final",
                    "injuriesAndSuspensions": {
                        "injury": [],
                        "suspension": []
                    },
                    "insAndOuts": {
                        "inOut": [
                            {
                                "inOut": "In",
                                "playerFirstName": "Kierran",
                                "playerId": "500514",
                                "playerLastName": "Moseley",
                                "playerName": "Kierran Moseley"
                            },
                            {
                                "inOut": "Out",
                                "playerFirstName": "Nathan",
                                "playerId": "500700",
                                "playerLastName": "Friend",
                                "playerName": "Nathan Friend"
                            }
                        ]
                    },
                    "teamPlayer": [
                        {
                            "playerFirstName": "David",
                            "playerId": 500831,
                            "playerLastName": "Mead",
                            "playerName": "David Mead",
                            "playerPosition": "Fullback",
                            "playerPositionId": 500001,
                            "playerStats": {
                                "allRunMetres": 120,
                                "allRuns": 13,
                                "decoys": 1,
                                "dummyHalfRuns": 1,
                                "fantasyPointsTotal": 35,
                                "hitUps": 1,
                                "ineffectiveTackles": 1,
                                "kickReturnMetres": 59,
                                "kickReturns": 5,
                                "kicksDefused": 1,
                                "kicksNotDefused": 1,
                                "mins": 80,
                                "missedTackles": 1,
                                "offloads": 1,
                                "passes": 4,
                                "passesPerRun": 0.31,
                                "supports": 20,
                                "tackleBreaks": 1,
                                "tackles": 9,
                                "trySaves": 2,
                                "hitupRunMeters": 4,
                                "evasionRuns": 6,
                                "evasionRunMetres": 50,
                                "dummyHalfRunMetres": 7,
                                "ptbAll": 11,
                                "receipts": 16,
                                "postContactMetres": 21,
                                "dummyPasses": 1,
                                "ptbTwoToThree": 2,
                                "ptbThreeToFour": 6,
                                "ptbFourToFive": 2,
                                "ptbFivePlus": 1,
                                "doubles": 2,
                                "effectiveTacklePercentage": 81.8
                            },
                            "playerTookTheField": true,
                            "shirtNum": 1,
                            "playerFirstInitial": "D",
                            "playerPositionAbbrev": "FB"
                        },
                        {
                            "playerFirstName": "Anthony",
                            "playerId": 500067,
                            "playerLastName": "Don",
                            "playerName": "Anthony Don",
                            "playerPosition": "Winger 1",
                            "playerPositionId": 500002,
                            "playerStats": {
                                "allRunMetres": 55,
                                "allRuns": 6,
                                "bombKicksNotDefused": 1,
                                "errors": 1,
                                "fantasyPointsTotal": 8,
                                "hitUps": 1,
                                "kickReturnMetres": 12,
                                "kickReturns": 1,
                                "kicksNotDefused": 1,
                                "mins": 67,
                                "passes": 3,
                                "passesPerRun": 0.5,
                                "supports": 6,
                                "tackles": 5,
                                "hitupRunMeters": 12,
                                "evasionRuns": 4,
                                "evasionRunMetres": 31,
                                "ptbAll": 6,
                                "receipts": 11,
                                "postContactMetres": 15,
                                "ptbTwoToThree": 3,
                                "ptbThreeToFour": 1,
                                "ptbFourToFive": 2,
                                "effectiveTacklePercentage": 100
                            },
                            "playerTookTheField": true,
                            "shirtNum": 2,
                            "playerFirstInitial": "A",
                            "playerPositionAbbrev": "WG"
                        },
                        {
                            "playerFirstName": "Josh",
                            "playerId": 500256,
                            "playerLastName": "Hoffman",
                            "playerName": "Josh Hoffman",
                            "playerPosition": "Centre 1",
                            "playerPositionId": 500003,
                            "playerStats": {
                                "allRunMetres": 117,
                                "allRuns": 13,
                                "decoys": 1,
                                "dummyHalfRuns": 3,
                                "fantasyPointsTotal": 21,
                                "hitUps": 2,
                                "kicksNotDefused": 1,
                                "mins": 75,
                                "missedTackles": 2,
                                "passes": 2,
                                "passesPerRun": 0.15,
                                "oneOnOneTackles": 3,
                                "supports": 6,
                                "tackleBreaks": 1,
                                "tackles": 11,
                                "hitupRunMeters": 22,
                                "evasionRuns": 8,
                                "evasionRunMetres": 62,
                                "dummyHalfRunMetres": 33,
                                "ptbAll": 13,
                                "receipts": 14,
                                "postContactMetres": 36,
                                "dummyPasses": 1,
                                "ptbTwoToThree": 2,
                                "ptbThreeToFour": 9,
                                "ptbFourToFive": 2,
                                "doubles": 1,
                                "effectiveTacklePercentage": 84.6
                            },
                            "playerTookTheField": true,
                            "shirtNum": 3,
                            "playerFirstInitial": "J",
                            "playerPositionAbbrev": "CT"
                        },
                        {
                            "playerFirstName": "John",
                            "playerId": 500184,
                            "playerLastName": "Olive",
                            "playerName": "John Olive",
                            "playerPosition": "Centre 2",
                            "playerPositionId": 500004,
                            "playerStats": {
                                "allRunMetres": 99,
                                "allRuns": 11,
                                "dummyHalfRuns": 2,
                                "fantasyPointsTotal": 34,
                                "ineffectiveTackles": 1,
                                "linebreaks": 1,
                                "mins": 80,
                                "missedTackles": 1,
                                "passes": 5,
                                "passesPerRun": 0.45,
                                "oneOnOneTackles": 2,
                                "penalties": 2,
                                "points": 4,
                                "supports": 9,
                                "tackleBreaks": 2,
                                "tackles": 13,
                                "tries": 1,
                                "evasionRuns": 9,
                                "evasionRunMetres": 80,
                                "dummyHalfRunMetres": 19,
                                "ptbAll": 9,
                                "receipts": 12,
                                "postContactMetres": 41,
                                "ptbTwoToThree": 6,
                                "ptbThreeToFour": 1,
                                "ptbFourToFive": 2,
                                "doubles": 2,
                                "effectiveTacklePercentage": 86.7,
                                "ptbPenalties": 2
                            },
                            "playerTookTheField": true,
                            "shirtNum": 4,
                            "playerFirstInitial": "J",
                            "playerPositionAbbrev": "CT"
                        },
                        {
                            "playerFirstName": "Nene",
                            "playerId": 500206,
                            "playerLastName": "Macdonald",
                            "playerName": "Nene Macdonald",
                            "playerPosition": "Winger 2",
                            "playerPositionId": 500005,
                            "playerStats": {
                                "allRunMetres": 122,
                                "allRuns": 14,
                                "dummyHalfRuns": 2,
                                "fantasyPointsTotal": 18,
                                "kickReturnMetres": 23,
                                "kickReturns": 2,
                                "kicksNotDefused": 1,
                                "mins": 80,
                                "missedTackles": 1,
                                "offloads": 1,
                                "passes": 6,
                                "passesPerRun": 0.43,
                                "supports": 8,
                                "tackleBreaks": 1,
                                "tackles": 3,
                                "evasionRuns": 10,
                                "evasionRunMetres": 79,
                                "dummyHalfRunMetres": 20,
                                "ptbAll": 13,
                                "receipts": 20,
                                "postContactMetres": 49,
                                "ptbTwoToThree": 4,
                                "ptbThreeToFour": 6,
                                "ptbFourToFive": 3,
                                "effectiveTacklePercentage": 75
                            },
                            "playerTookTheField": true,
                            "shirtNum": 5,
                            "playerFirstInitial": "N",
                            "playerPositionAbbrev": "WG"
                        },
                        {
                            "playerFirstName": "Tyrone",
                            "playerId": 500046,
                            "playerLastName": "Roberts",
                            "playerName": "Tyrone Roberts",
                            "playerPosition": "Five-Eighth",
                            "playerPositionId": 500006,
                            "playerStats": {
                                "allRunMetres": 28,
                                "allRuns": 4,
                                "bombKicks": 1,
                                "bombKickMetres": 10,
                                "conversions": 1,
                                "conversionsAttempts": 1,
                                "dummyHalfRuns": 1,
                                "fantasyPointsTotal": 8,
                                "goalConversionRate": 100,
                                "allGoals": 1,
                                "allGoalsAttempted": 1,
                                "kickDead": 1,
                                "kickMetres": 39,
                                "kicks": 2,
                                "lineDropouts": 1,
                                "mins": 55,
                                "missedTackles": 3,
                                "passes": 21,
                                "passesPerRun": 5.25,
                                "penalties": 1,
                                "points": 2,
                                "supports": 10,
                                "tackles": 11,
                                "evasionRuns": 3,
                                "evasionRunMetres": 17,
                                "dummyHalfRunMetres": 11,
                                "ptbAll": 3,
                                "receipts": 26,
                                "postContactMetres": 5,
                                "dummyPasses": 6,
                                "lineEngagedRuns": 1,
                                "ptbTwoToThree": 1,
                                "ptbThreeToFour": 2,
                                "doubles": 1,
                                "effectiveTacklePercentage": 78.6,
                                "ptbPenalties": 1
                            },
                            "playerTookTheField": true,
                            "shirtNum": 6,
                            "playerFirstInitial": "T",
                            "playerPositionAbbrev": "FE"
                        },
                        {
                            "playerFirstName": "Ashley",
                            "playerId": 500272,
                            "playerLastName": "Taylor",
                            "playerName": "Ashley Taylor",
                            "playerPosition": "Halfback",
                            "playerPositionId": 500007,
                            "playerStats": {
                                "allRunMetres": 16,
                                "allRuns": 4,
                                "bombKicks": 5,
                                "bombKickMetres": 117,
                                "conversions": 3,
                                "conversionsAttempts": 3,
                                "dummyHalfRuns": 1,
                                "errors": 1,
                                "fantasyPointsTotal": 31,
                                "goalConversionRate": 100,
                                "allGoals": 3,
                                "allGoalsAttempted": 3,
                                "ineffectiveTackles": 1,
                                "kickMetres": 226,
                                "kicks": 12,
                                "linebreakAssists": 1,
                                "mins": 80,
                                "missedTackles": 3,
                                "passes": 34,
                                "passesPerRun": 8.5,
                                "penalties": 1,
                                "points": 6,
                                "supports": 15,
                                "tackleBreaks": 1,
                                "tackles": 13,
                                "tryAssists": 1,
                                "tryCause": 1,
                                "evasionRuns": 3,
                                "evasionRunMetres": 6,
                                "dummyHalfRunMetres": 10,
                                "ptbAll": 2,
                                "receipts": 48,
                                "forcedDropOutKicker": 2,
                                "grubberKick": 2,
                                "crossFieldKick": 3,
                                "postContactMetres": 3,
                                "dummyPasses": 2,
                                "lineEngagedRuns": 1,
                                "ptbTwoToThree": 1,
                                "ptbThreeToFour": 1,
                                "doubles": 2,
                                "effectiveTacklePercentage": 76.5,
                                "ptbPenalties": 1
                            },
                            "playerTookTheField": true,
                            "shirtNum": 7,
                            "playerFirstInitial": "A",
                            "playerPositionAbbrev": "HB"
                        },
                        {
                            "playerFirstName": "David",
                            "playerId": 500334,
                            "playerLastName": "Shillington",
                            "playerName": "David Shillington",
                            "playerPosition": "Prop 1",
                            "playerPositionId": 500008,
                            "playerStats": {
                                "allRunMetres": 154,
                                "allRuns": 15,
                                "decoys": 2,
                                "errors": 2,
                                "fantasyPointsTotal": 57,
                                "hitUps": 14,
                                "kicksNotDefused": 1,
                                "linebreaks": 1,
                                "mins": 43,
                                "missedTackles": 2,
                                "offloads": 1,
                                "passes": 1,
                                "passesPerRun": 0.07,
                                "oneOnOneTackles": 1,
                                "points": 4,
                                "supports": 2,
                                "tackleBreaks": 4,
                                "tackles": 24,
                                "tries": 1,
                                "tryCause": 1,
                                "hitupRunMeters": 150,
                                "evasionRuns": 1,
                                "evasionRunMetres": 4,
                                "ptbAll": 11,
                                "receipts": 16,
                                "postContactMetres": 52,
                                "lineEngagedRuns": 1,
                                "ptbZeroToOne": 1,
                                "ptbTwoToThree": 5,
                                "ptbThreeToFour": 3,
                                "ptbFourToFive": 2,
                                "doubles": 5,
                                "effectiveTacklePercentage": 92.3
                            },
                            "playerTookTheField": true,
                            "shirtNum": 8,
                            "playerFirstInitial": "D",
                            "playerPositionAbbrev": "PR"
                        },
                        {
                            "playerFirstName": "Daniel",
                            "playerId": 500015,
                            "playerLastName": "Mortimer",
                            "playerName": "Daniel Mortimer",
                            "playerPosition": "Hooker",
                            "playerPositionId": 500009,
                            "playerStats": {
                                "allRunMetres": 51,
                                "allRuns": 8,
                                "dummyHalfRuns": 6,
                                "fantasyPointsTotal": 56,
                                "hitUps": 2,
                                "ineffectiveTackles": 3,
                                "kickMetres": 99,
                                "kicks": 2,
                                "linebreakAssists": 1,
                                "mins": 51,
                                "missedTackles": 3,
                                "offloads": 2,
                                "passes": 56,
                                "passesPerRun": 7,
                                "oneOnOneTackles": 2,
                                "supports": 3,
                                "tackles": 37,
                                "tryAssists": 1,
                                "tryCause": 1,
                                "trySaves": 1,
                                "hitupRunMeters": 5,
                                "dummyHalfRunMetres": 46,
                                "ptbAll": 6,
                                "receipts": 66,
                                "postContactMetres": 12,
                                "dummyPasses": 7,
                                "kickPressures": 1,
                                "ptbTwoToThree": 4,
                                "ptbThreeToFour": 2,
                                "doubles": 10,
                                "longKicksSpace": 1,
                                "effectiveTacklePercentage": 86
                            },
                            "playerTookTheField": true,
                            "shirtNum": 17,
                            "playerFirstInitial": "D",
                            "playerPositionAbbrev": "HK"
                        },
                        {
                            "playerFirstName": "Agnatius",
                            "playerId": 501393,
                            "playerLastName": "Paasi",
                            "playerName": "Agnatius Paasi",
                            "playerPosition": "Prop 2",
                            "playerPositionId": 500010,
                            "playerStats": {
                                "allRunMetres": 78,
                                "allRuns": 8,
                                "decoys": 2,
                                "fantasyPointsTotal": 19,
                                "hitUps": 6,
                                "kickReturnMetres": 19,
                                "kickReturns": 2,
                                "mins": 33,
                                "missedTackles": 2,
                                "passes": 2,
                                "passesPerRun": 0.25,
                                "oneOnOneTackles": 1,
                                "supports": 2,
                                "tackles": 16,
                                "tryCause": 1,
                                "hitupRunMeters": 59,
                                "ptbAll": 7,
                                "receipts": 10,
                                "postContactMetres": 21,
                                "dummyPasses": 1,
                                "kickPressures": 1,
                                "ptbThreeToFour": 6,
                                "ptbFourToFive": 1,
                                "doubles": 3,
                                "effectiveTacklePercentage": 88.9
                            },
                            "playerTookTheField": true,
                            "shirtNum": 10,
                            "playerFirstInitial": "A",
                            "playerPositionAbbrev": "PR"
                        },
                        {
                            "playerFirstName": "Zeb",
                            "playerId": 502133,
                            "playerLastName": "Taia",
                            "playerName": "Zeb Taia",
                            "playerPosition": "2nd Row 1",
                            "playerPositionId": 500011,
                            "playerStats": {
                                "allRunMetres": 129,
                                "allRuns": 14,
                                "decoys": 1,
                                "dummyHalfRuns": 1,
                                "fantasyPointsTotal": 60,
                                "hitUps": 13,
                                "ineffectiveTackles": 4,
                                "linebreaks": 1,
                                "mins": 80,
                                "missedTackles": 2,
                                "offloads": 3,
                                "passes": 5,
                                "passesPerRun": 0.36,
                                "oneOnOneTackles": 2,
                                "points": 4,
                                "supports": 10,
                                "tackleBreaks": 2,
                                "tackles": 28,
                                "tries": 1,
                                "tryCause": 1,
                                "hitupRunMeters": 115,
                                "dummyHalfRunMetres": 14,
                                "ptbAll": 10,
                                "receipts": 18,
                                "postContactMetres": 38,
                                "ptbOneToTwo": 2,
                                "ptbTwoToThree": 2,
                                "ptbThreeToFour": 2,
                                "ptbFourToFive": 4,
                                "doubles": 5,
                                "effectiveTacklePercentage": 82.4
                            },
                            "playerTookTheField": true,
                            "shirtNum": 11,
                            "playerFirstInitial": "Z",
                            "playerPositionAbbrev": "2R"
                        },
                        {
                            "playerFirstName": "Chris",
                            "playerId": 500090,
                            "playerLastName": "McQueen",
                            "playerName": "Chris McQueen",
                            "playerPosition": "2nd Row 2",
                            "playerPositionId": 500012,
                            "playerStats": {
                                "allRunMetres": 54,
                                "allRuns": 7,
                                "decoys": 7,
                                "errors": 1,
                                "fantasyPointsTotal": 29,
                                "hitUps": 7,
                                "kickDead": 1,
                                "kicks": 1,
                                "mins": 80,
                                "missedTackles": 3,
                                "passes": 2,
                                "passesPerRun": 0.29,
                                "oneOnOneTackles": 1,
                                "penalties": 2,
                                "supports": 7,
                                "tackleBreaks": 2,
                                "tackles": 30,
                                "tryCause": 1,
                                "hitupRunMeters": 54,
                                "ptbAll": 6,
                                "receipts": 10,
                                "crossFieldKick": 1,
                                "postContactMetres": 18,
                                "dummyPasses": 1,
                                "ptbTwoToThree": 1,
                                "ptbThreeToFour": 3,
                                "ptbFourToFive": 2,
                                "doubles": 6,
                                "effectiveTacklePercentage": 90.9,
                                "ptbPenalties": 1,
                                "generalPlayPenalties": 1,
                                "foulPlayPenalties": 1
                            },
                            "playerTookTheField": true,
                            "shirtNum": 12,
                            "playerFirstInitial": "C",
                            "playerPositionAbbrev": "2R"
                        },
                        {
                            "playerFirstName": "Greg",
                            "playerId": 500073,
                            "playerLastName": "Bird",
                            "playerName": "Greg Bird",
                            "playerPosition": "Lock",
                            "playerPositionId": 500013,
                            "playerStats": {
                                "allRunMetres": 114,
                                "allRuns": 16,
                                "fantasyPointsTotal": 35,
                                "hitUps": 12,
                                "ineffectiveTackles": 1,
                                "mins": 67,
                                "missedTackles": 4,
                                "offloads": 3,
                                "passes": 15,
                                "passesPerRun": 0.94,
                                "oneOnOneTackles": 1,
                                "penalties": 1,
                                "supports": 7,
                                "tackleBreaks": 2,
                                "tackles": 22,
                                "hitupRunMeters": 99,
                                "evasionRuns": 4,
                                "evasionRunMetres": 15,
                                "ptbAll": 7,
                                "receipts": 27,
                                "postContactMetres": 36,
                                "dummyPasses": 4,
                                "lineEngagedRuns": 4,
                                "ptbTwoToThree": 2,
                                "ptbThreeToFour": 2,
                                "ptbFourToFive": 3,
                                "doubles": 3,
                                "effectiveTacklePercentage": 81.5,
                                "ptbPenalties": 1
                            },
                            "playerTookTheField": true,
                            "shirtNum": 13,
                            "playerFirstInitial": "G",
                            "playerPositionAbbrev": "LK"
                        },
                        {
                            "playerFirstName": "Luke",
                            "playerId": 500070,
                            "playerLastName": "Douglas",
                            "playerName": "Luke Douglas",
                            "playerPosition": "Interchange",
                            "playerPositionId": 500014,
                            "playerStats": {
                                "allRunMetres": 41,
                                "allRuns": 6,
                                "decoys": 3,
                                "fantasyPointsTotal": 33,
                                "hitUps": 4,
                                "kickReturnMetres": 9,
                                "kickReturns": 1,
                                "linebreakAssists": 1,
                                "mins": 22,
                                "passes": 3,
                                "passesPerRun": 0.5,
                                "supports": 6,
                                "tackles": 12,
                                "tryAssists": 1,
                                "trySaves": 2,
                                "hitupRunMeters": 25,
                                "evasionRuns": 1,
                                "evasionRunMetres": 7,
                                "ptbAll": 5,
                                "receipts": 8,
                                "postContactMetres": 9,
                                "kickPressures": 1,
                                "lineEngagedRuns": 1,
                                "ptbTwoToThree": 2,
                                "ptbThreeToFour": 2,
                                "ptbFivePlus": 1,
                                "doubles": 3,
                                "effectiveTacklePercentage": 100
                            },
                            "playerTookTheField": true,
                            "shirtNum": 14,
                            "playerFirstInitial": "L",
                            "playerPositionAbbrev": "INT"
                        },
                        {
                            "playerFirstName": "Ryan",
                            "playerId": 500072,
                            "playerLastName": "James",
                            "playerName": "Ryan James",
                            "playerPosition": "Interchange",
                            "playerPositionId": 500014,
                            "playerStats": {
                                "allRunMetres": 159,
                                "allRuns": 19,
                                "decoys": 4,
                                "fantasyPointsTotal": 75,
                                "hitUps": 17,
                                "ineffectiveTackles": 2,
                                "kickReturnMetres": 31,
                                "kickReturns": 2,
                                "linebreaks": 1,
                                "mins": 61,
                                "missedTackles": 1,
                                "passes": 1,
                                "passesPerRun": 0.05,
                                "oneOnOneTackles": 3,
                                "penalties": 3,
                                "points": 4,
                                "supports": 10,
                                "tackleBreaks": 3,
                                "tackles": 37,
                                "tries": 1,
                                "trySaves": 2,
                                "hitupRunMeters": 128,
                                "ptbAll": 17,
                                "receipts": 20,
                                "postContactMetres": 56,
                                "dummyPasses": 2,
                                "ptbZeroToOne": 1,
                                "ptbTwoToThree": 7,
                                "ptbThreeToFour": 6,
                                "ptbFourToFive": 2,
                                "ptbFivePlus": 1,
                                "doubles": 6,
                                "effectiveTacklePercentage": 92.5,
                                "ptbPenalties": 3
                            },
                            "playerTookTheField": true,
                            "shirtNum": 15,
                            "playerFirstInitial": "R",
                            "playerPositionAbbrev": "INT"
                        },
                        {
                            "playerFirstName": "Leivaha",
                            "playerId": 502104,
                            "playerLastName": "Pulu",
                            "playerName": "Leivaha Pulu",
                            "playerPosition": "Interchange",
                            "playerPositionId": 500014,
                            "playerStats": {
                                "allRunMetres": 52,
                                "allRuns": 7,
                                "decoys": 5,
                                "errors": 1,
                                "fantasyPointsTotal": 32,
                                "hitUps": 7,
                                "ineffectiveTackles": 1,
                                "mins": 57,
                                "missedTackles": 1,
                                "offloads": 2,
                                "supports": 19,
                                "tackles": 22,
                                "tryCause": 1,
                                "trySaves": 1,
                                "hitupRunMeters": 52,
                                "ptbAll": 6,
                                "receipts": 9,
                                "postContactMetres": 12,
                                "ptbTwoToThree": 3,
                                "ptbThreeToFour": 1,
                                "ptbFourToFive": 2,
                                "doubles": 5,
                                "effectiveTacklePercentage": 91.7
                            },
                            "playerTookTheField": true,
                            "shirtNum": 16,
                            "playerFirstInitial": "L",
                            "playerPositionAbbrev": "INT"
                        },
                        {
                            "playerFirstName": "Kierran",
                            "playerId": 500514,
                            "playerLastName": "Moseley",
                            "playerName": "Kierran Moseley",
                            "playerPosition": "Interchange",
                            "playerPositionId": 500014,
                            "playerStats": {
                                "allRunMetres": 3,
                                "allRuns": 1,
                                "dummyHalfRuns": 1,
                                "fantasyPointsTotal": 13,
                                "mins": 29,
                                "missedTackles": 2,
                                "passes": 41,
                                "passesPerRun": 41,
                                "supports": 2,
                                "tackles": 17,
                                "dummyHalfRunMetres": 3,
                                "receipts": 40,
                                "dummyPasses": 1,
                                "lineEngagedRuns": 1,
                                "doubles": 6,
                                "effectiveTacklePercentage": 89.5
                            },
                            "playerTookTheField": true,
                            "shirtNum": 19,
                            "playerFirstInitial": "K",
                            "playerPositionAbbrev": "INT"
                        }
                    ]
                },
                "teamName": "Gold Coast Titans",
                "teamNickName": "Titans",
                "teamStats": {
                    "allRunMetres": 1390,
                    "allRuns": 166,
                    "bombKicks": 6,
                    "bombKickMetres": 128,
                    "bombKicksNotDefused": 1,
                    "completeSets": 31,
                    "completionPercentage": 84,
                    "conversions": 4,
                    "conversionsAttempts": 4,
                    "decoys": 26,
                    "dummyHalfRuns": 18,
                    "errors": 7,
                    "goalConversionRate": 100,
                    "allGoals": 4,
                    "allGoalsAttempted": 4,
                    "hitUps": 86,
                    "incompleteSets": 6,
                    "ineffectiveTackles": 14,
                    "kickDead": 2,
                    "kickMetres": 364,
                    "kickReturnMetres": 152,
                    "kickReturns": 13,
                    "kicks": 17,
                    "kicksDefused": 1,
                    "kicksNotDefused": 5,
                    "lineDropouts": 1,
                    "linebreakAssists": 3,
                    "linebreaks": 4,
                    "missedTackles": 31,
                    "offloads": 13,
                    "oneOnOneTackles": 16,
                    "passes": 201,
                    "passesPerRun": 1.21,
                    "penalties": 10,
                    "points": 24,
                    "pointsConceded": 20,
                    "possession": 50,
                    "scrumWins": 9,
                    "supports": 142,
                    "tackleBreaks": 19,
                    "tackles": 310,
                    "sets": 37,
                    "tries": 4,
                    "triesConceded": 3,
                    "tryAssists": 3,
                    "tryCause": 7,
                    "trySaves": 8,
                    "hitupRunMeters": 724,
                    "evasionRuns": 49,
                    "evasionRunMetres": 351,
                    "dummyHalfRunMetres": 163,
                    "ptbTotal": 132,
                    "twoManTackles": 70,
                    "threeManTackles": 50,
                    "fourManPlusTackles": 2,
                    "tryScoringPercentage": 12.9,
                    "shiftsLeft": 10,
                    "shiftsRight": 8,
                    "receipts": 371,
                    "forcedDropOutKicker": 2,
                    "grubberKick": 2,
                    "crossFieldKick": 4,
                    "postContactMetres": 424,
                    "dummyPasses": 26,
                    "kickPressures": 3,
                    "lineEngagedRuns": 9,
                    "ptbZeroToOne": 2,
                    "ptbOneToTwo": 2,
                    "ptbTwoToThree": 45,
                    "ptbThreeToFour": 53,
                    "ptbFourToFive": 27,
                    "ptbFivePlus": 3,
                    "interchangeUsed": 6,
                    "interchangeLeft": 2,
                    "doubles": 60,
                    "longKicksSpace": 1,
                    "effectiveTacklePercentage": 87.3,
                    "ptbPenalties": 9,
                    "generalPlayPenalties": 1,
                    "foulPlayPenalties": 1,
                    "averageSetDistance": 37.6,
                    "completeSets1stHalf": 13,
                    "completeSets2ndHalf": 18,
                    "completionPercentage1stHalf": 76.47,
                    "completionPercentage2ndHalf": 90,
                    "incompleteSets1stHalf": 4,
                    "incompleteSets2ndHalf": 2,
                    "incompletionPercentage1stHalf": 23.53,
                    "incompletionPercentage2ndHalf": 10
                },
                "teamHexColour": "00a6e3",
                "teamHexColour2": "005372"
            }
        ]
    }
}