{
    "vod": [
        {
            "id": "YwZ292YTE6_OqLj7na8aZGglx0eyDrCM",
            "contentId": 905881,
            "title": "Rd 8: Eels v Panthers (Hls)",
            "description": "Highlights of the Round 8 clash between the Eels & Panthers",
            "publishDate": "2017-04-22T16:58:00+10:00",
            "publisher": "NRL Chief",
            "thumbnailUrl": "http://bpvideos.telstra.insnw.net/web/images/20170422161110a_89x50.jpg",
            "largeThumbnailUrl": "http://bpvideos.telstra.insnw.net/web/images/20170422161110a_326x184.jpg",
            "programType": "Highlights",
            "programCategory": "Match",
            "priority": null,
            "lastUpdateDate": "2017-04-22T17:07:15+10:00",
            "isPremium": false,
            "club": [
                500031,
                500014
            ]
        },
        {
            "id": "ZtaHB2YTE637UZsMtLx-6-42zdcF8Lwl",
            "contentId": 906487,
            "title": "Rd 8 Press Conference: Eels",
            "description": "Eels coach Brad Arthur faces the media after their Round 8 clash",
            "publishDate": "2017-04-22T18:19:46+10:00",
            "publisher": "NRL Chief",
            "thumbnailUrl": "http://bpvideos.telstra.insnw.net/web/images/20170422181220a_89x50.jpg",
            "largeThumbnailUrl": "http://bpvideos.telstra.insnw.net/web/images/20170422181220a_326x184.jpg",
            "programType": "Press Conference",
            "programCategory": null,
            "priority": null,
            "lastUpdateDate": "2017-04-22T18:25:33+10:00",
            "isPremium": false,
            "club": [
                500031,
                500014
            ]
        },
        {
            "id": "Q3eG92YTE6ce-DfnmJiMgcbdQOz43N9S",
            "contentId": 905917,
            "title": "Rd 8 Press Conference: Panthers",
            "description": "Panthers coach Anthony Griffin faces the media after their Round 8 clash",
            "publishDate": "2017-04-22T17:35:10+10:00",
            "publisher": "NRL Chief",
            "thumbnailUrl": "http://bpvideos.telstra.insnw.net/web/images/20170422173106a_89x50.jpg",
            "largeThumbnailUrl": "http://bpvideos.telstra.insnw.net/web/images/20170422173106a_326x184.jpg",
            "programType": "Press Conference",
            "programCategory": null,
            "priority": null,
            "lastUpdateDate": "2017-04-22T17:48:23+10:00",
            "isPremium": false,
            "club": [
                500031,
                500014
            ]
        },
        {
            "id": "poZG92YTE68vElfjpIZemTu5v0XeR-mC",
            "contentId": 906439,
            "title": "Rd 8: GOAL Nathan Cleary (78th min)",
            "description": "Nathan Cleary converts to bring the Panthers to within a converted try",
            "publishDate": "2017-04-22T16:49:53+10:00",
            "publisher": "NRL Chief",
            "thumbnailUrl": "http://bpvideos.telstra.insnw.net/web/images/20170422164933a_89x50.jpg",
            "largeThumbnailUrl": "http://bpvideos.telstra.insnw.net/web/images/20170422164933a_326x184.jpg",
            "programType": "Instant Replay",
            "programCategory": "Score",
            "priority": null,
            "lastUpdateDate": "2017-04-22T16:55:11+10:00",
            "isPremium": true,
            "club": [
                500031,
                500014
            ]
        },
        {
            "id": "d1Y292YTE6DHyNl1bg9PaOioDiUaIK5y",
            "contentId": 906438,
            "title": "Rd 8: TRY Corey Harawira-Naera (77th min)",
            "description": "Corey Harawira-Naera crosses to narrow the lead of the Eels",
            "publishDate": "2017-04-22T16:46:51+10:00",
            "publisher": "NRL Chief",
            "thumbnailUrl": "http://bpvideos.telstra.insnw.net/web/images/20170422164605a_89x50.jpg",
            "largeThumbnailUrl": "http://bpvideos.telstra.insnw.net/web/images/20170422164605a_326x184.jpg",
            "programType": "Instant Replay",
            "programCategory": "Score",
            "priority": null,
            "lastUpdateDate": "2017-04-22T16:52:10+10:00",
            "isPremium": true,
            "club": [
                500031,
                500014
            ]
        },
        {
            "id": "1uN292YTE6eRYZomZMJwRZ9vft0x-lMm",
            "contentId": 906432,
            "title": "Rd 8: TRY Peta Hiku (56th min)",
            "description": "Peta Hiku dives over out wide to open the Panthers' account",
            "publishDate": "2017-04-22T16:23:54+10:00",
            "publisher": "NRL Chief",
            "thumbnailUrl": "http://bpvideos.telstra.insnw.net/web/images/20170422162337a_89x50.jpg",
            "largeThumbnailUrl": "http://bpvideos.telstra.insnw.net/web/images/20170422162337a_326x184.jpg",
            "programType": "Instant Replay",
            "programCategory": "Score",
            "priority": null,
            "lastUpdateDate": "2017-04-22T16:29:05+10:00",
            "isPremium": true,
            "club": [
                500031,
                500014
            ]
        },
        {
            "id": "x3NG92YTE6dhgRV1O5VZG70f3CZekOVp",
            "contentId": 906429,
            "title": "Rd 8: GOAL Clint Gutherson (45th min)",
            "description": "Clint Gutherson converts Corey Norman's try from the sideline",
            "publishDate": "2017-04-22T16:13:52+10:00",
            "publisher": "NRL Chief",
            "thumbnailUrl": "http://bpvideos.telstra.insnw.net/web/images/20170422161314a_89x50.jpg",
            "largeThumbnailUrl": "http://bpvideos.telstra.insnw.net/web/images/20170422161314a_326x184.jpg",
            "programType": "Instant Replay",
            "programCategory": "Score",
            "priority": null,
            "lastUpdateDate": "2017-04-22T16:19:03+10:00",
            "isPremium": true,
            "club": [
                500031,
                500014
            ]
        },
        {
            "id": "J4M292YTE6UDrYLyG9ss1EKYHTStjsbY",
            "contentId": 906417,
            "title": "Rd 8: TRY Corey Norman (43rd min)",
            "description": "Corey Norman scores his second try of the afternoon",
            "publishDate": "2017-04-22T16:10:28+10:00",
            "publisher": "NRL Chief",
            "thumbnailUrl": "http://bpvideos.telstra.insnw.net/web/images/20170422160957a_89x50.jpg",
            "largeThumbnailUrl": "http://bpvideos.telstra.insnw.net/web/images/20170422160957a_326x184.jpg",
            "programType": "Instant Replay",
            "programCategory": "Score",
            "priority": null,
            "lastUpdateDate": "2017-04-22T16:16:02+10:00",
            "isPremium": true,
            "club": [
                500031,
                500014
            ]
        },
        {
            "id": "00eG52YTE6DaEqmH1nDS67qgZbi8Ll4V",
            "contentId": 906416,
            "title": "Rd 8: TRY Semi Radradra (39th min)",
            "description": "Semi Radradra crosses to extend the Eels' lead",
            "publishDate": "2017-04-22T15:49:52+10:00",
            "publisher": "NRL Chief",
            "thumbnailUrl": "http://bpvideos.telstra.insnw.net/web/images/20170422154943a_89x50.jpg",
            "largeThumbnailUrl": "http://bpvideos.telstra.insnw.net/web/images/20170422154943a_326x184.jpg",
            "programType": "Instant Replay",
            "programCategory": "Score",
            "priority": null,
            "lastUpdateDate": "2017-04-22T15:54:57+10:00",
            "isPremium": true,
            "club": [
                500031,
                500014
            ]
        },
        {
            "id": "Jlcm52YTE6ynUtlr6kPLNckWPUgLRMux",
            "contentId": 906414,
            "title": "Rd 8: PENALTY GOAL Clint Gutherson (15th min)",
            "description": "Clint Gutherson adds to the Eels' lead",
            "publishDate": "2017-04-22T15:26:11+10:00",
            "publisher": "NRL Chief",
            "thumbnailUrl": "http://bpvideos.telstra.insnw.net/web/images/20170422152609a_89x50.jpg",
            "largeThumbnailUrl": "http://bpvideos.telstra.insnw.net/web/images/20170422152609a_326x184.jpg",
            "programType": "Instant Replay",
            "programCategory": "Score",
            "priority": null,
            "lastUpdateDate": "2017-04-22T15:31:52+10:00",
            "isPremium": true,
            "club": [
                500031,
                500014
            ]
        },
        {
            "id": "I5b252YTE6FmFxlq_KLSdnpIbx4rpLjb",
            "contentId": 906410,
            "title": "Rd 8: GOAL Clint Gutherson (5th min)",
            "description": "Clint Gutherson converts the try of Corey Norman",
            "publishDate": "2017-04-22T15:16:41+10:00",
            "publisher": "NRL Chief",
            "thumbnailUrl": "http://bpvideos.telstra.insnw.net/web/images/20170422151612a_89x50.jpg",
            "largeThumbnailUrl": "http://bpvideos.telstra.insnw.net/web/images/20170422151612a_326x184.jpg",
            "programType": "Instant Replay",
            "programCategory": "Score",
            "priority": null,
            "lastUpdateDate": "2017-04-22T15:21:50+10:00",
            "isPremium": true,
            "club": [
                500031,
                500014
            ]
        },
        {
            "id": "44bm52YTE6sdDUruRN7HbeoVsrbUwhpz",
            "contentId": 906409,
            "title": "Rd 8: TRY Corey Norman (4th min)",
            "description": "Corey Norman cleans up the scraps and touches down for the Eels",
            "publishDate": "2017-04-22T15:12:36+10:00",
            "publisher": "NRL Chief",
            "thumbnailUrl": "http://bpvideos.telstra.insnw.net/web/images/20170422151232a_89x50.jpg",
            "largeThumbnailUrl": "http://bpvideos.telstra.insnw.net/web/images/20170422151232a_326x184.jpg",
            "programType": "Instant Replay",
            "programCategory": "Score",
            "priority": null,
            "lastUpdateDate": "2017-04-22T15:17:49+10:00",
            "isPremium": true,
            "club": [
                500031,
                500014
            ]
        }
    ],
    "scores": [
        {
            "gameState": "First Half",
            "gameStateId": 3,
            "gameTime": "0:03:21",
            "gameSeconds": 201,
            "GameMinutes": "03:21",
            "playerId": 500684,
            "playerName": "Corey Norman",
            "scoreMethod": "Try",
            "statEvent": "Try",
            "statId": 38,
            "statValue": 4,
            "vidRef": 8136,
            "homeScore": 4,
            "commentary": "Try by Corey Norman",
            "tackleNum": 1,
            "teamId": 500031,
            "teamName": "Parramatta Eels",
            "homeTeamAbbrv": "PAR",
            "awayTeamAbbrv": "PEN"
        },
        {
            "gameState": "First Half",
            "gameStateId": 3,
            "gameTime": "0:04:07",
            "gameSeconds": 247,
            "GameMinutes": "04:07",
            "playerId": 500729,
            "playerName": "Clinton Gutherson",
            "scoreMethod": "Conversion",
            "statEvent": "Conversion-Made",
            "statId": 1,
            "statValue": 2,
            "vidRef": 9333,
            "homeScore": 6,
            "commentary": "Conversion-Made by Clinton Gutherson",
            "tackleNum": -1,
            "teamId": 500031,
            "teamName": "Parramatta Eels",
            "homeTeamAbbrv": "PAR",
            "awayTeamAbbrv": "PEN"
        },
        {
            "gameState": "First Half",
            "gameStateId": 3,
            "gameTime": "0:14:50",
            "gameSeconds": 890,
            "GameMinutes": "14:50",
            "playerId": 500729,
            "playerName": "Clinton Gutherson",
            "scoreMethod": "Penalty Goal",
            "statEvent": "Penalty Shot-Made",
            "statId": 67,
            "statValue": 2,
            "vidRef": 25405,
            "homeScore": 8,
            "commentary": "Penalty Shot-Made by Clinton Gutherson",
            "tackleNum": -1,
            "teamId": 500031,
            "teamName": "Parramatta Eels",
            "homeTeamAbbrv": "PAR",
            "awayTeamAbbrv": "PEN"
        },
        {
            "gameState": "First Half",
            "gameStateId": 3,
            "gameTime": "0:38:17",
            "gameSeconds": 2297,
            "GameMinutes": "38:17",
            "playerId": 500690,
            "playerName": "Semi Radradra",
            "scoreMethod": "Try",
            "statEvent": "Try",
            "statId": 38,
            "statValue": 4,
            "vidRef": 62754,
            "homeScore": 12,
            "commentary": "Try by Semi Radradra",
            "tackleNum": 5,
            "teamId": 500031,
            "teamName": "Parramatta Eels",
            "homeTeamAbbrv": "PAR",
            "awayTeamAbbrv": "PEN"
        },
        {
            "gameState": "Second Half",
            "gameStateId": 5,
            "gameTime": "0:42:51",
            "gameSeconds": 2571,
            "GameMinutes": "42:51",
            "playerId": 500684,
            "playerName": "Corey Norman",
            "scoreMethod": "Try",
            "statEvent": "Try",
            "statId": 38,
            "statValue": 4,
            "vidRef": 70958,
            "homeScore": 16,
            "commentary": "Try by Corey Norman",
            "tackleNum": 6,
            "teamId": 500031,
            "teamName": "Parramatta Eels",
            "homeTeamAbbrv": "PAR",
            "awayTeamAbbrv": "PEN"
        },
        {
            "gameState": "Second Half",
            "gameStateId": 5,
            "gameTime": "0:44:19",
            "gameSeconds": 2659,
            "GameMinutes": "44:19",
            "playerId": 500729,
            "playerName": "Clinton Gutherson",
            "scoreMethod": "Conversion",
            "statEvent": "Conversion-Made",
            "statId": 1,
            "statValue": 2,
            "vidRef": 73637,
            "homeScore": 18,
            "commentary": "Conversion-Made by Clinton Gutherson",
            "tackleNum": -1,
            "teamId": 500031,
            "teamName": "Parramatta Eels",
            "homeTeamAbbrv": "PAR",
            "awayTeamAbbrv": "PEN"
        },
        {
            "gameState": "Second Half",
            "gameStateId": 5,
            "gameTime": "0:55:22",
            "gameSeconds": 3322,
            "GameMinutes": "55:22",
            "playerId": 500579,
            "playerName": "Peta Hiku",
            "scoreMethod": "Try",
            "statEvent": "Try",
            "statId": 38,
            "statValue": 4,
            "vidRef": 91804,
            "homeScore": 18,
            "awayScore": 4,
            "commentary": "Try by Peta Hiku",
            "tackleNum": 3,
            "teamId": 500014,
            "teamName": "Penrith Panthers",
            "homeTeamAbbrv": "PAR",
            "awayTeamAbbrv": "PEN"
        },
        {
            "gameState": "Second Half",
            "gameStateId": 5,
            "gameTime": "0:56:27",
            "gameSeconds": 3387,
            "GameMinutes": "56:27",
            "playerId": 504120,
            "playerName": "Nathan Cleary",
            "scoreMethod": "Conversion",
            "statEvent": "Conversion-Made",
            "statId": 1,
            "statValue": 2,
            "vidRef": 93432,
            "homeScore": 18,
            "awayScore": 6,
            "commentary": "Conversion-Made by Nathan Cleary",
            "tackleNum": -1,
            "teamId": 500014,
            "teamName": "Penrith Panthers",
            "homeTeamAbbrv": "PAR",
            "awayTeamAbbrv": "PEN"
        },
        {
            "gameState": "Second Half",
            "gameStateId": 5,
            "gameTime": "1:16:48",
            "gameSeconds": 4608,
            "GameMinutes": "76:48",
            "playerId": 501241,
            "playerName": "Corey Harawira-Naera",
            "scoreMethod": "Try",
            "statEvent": "Try",
            "statId": 38,
            "statValue": 4,
            "vidRef": 127780,
            "homeScore": 18,
            "awayScore": 10,
            "commentary": "Try by Corey Harawira-Naera",
            "teamId": 500014,
            "teamName": "Penrith Panthers",
            "homeTeamAbbrv": "PAR",
            "awayTeamAbbrv": "PEN"
        },
        {
            "gameState": "Second Half",
            "gameStateId": 5,
            "gameTime": "1:17:14",
            "gameSeconds": 4634,
            "GameMinutes": "77:14",
            "playerId": 504120,
            "playerName": "Nathan Cleary",
            "scoreMethod": "Conversion",
            "statEvent": "Conversion-Made",
            "statId": 1,
            "statValue": 2,
            "vidRef": 128481,
            "homeScore": 18,
            "awayScore": 12,
            "commentary": "Conversion-Made by Nathan Cleary",
            "tackleNum": -1,
            "teamId": 500014,
            "teamName": "Penrith Panthers",
            "homeTeamAbbrv": "PAR",
            "awayTeamAbbrv": "PEN"
        }
    ],
    "twitter": [
        {
            "id": "855674579057950721",
            "gameSeconds": 4620
        },
        {
            "id": "855674337554161664",
            "gameSeconds": 4620
        },
        {
            "id": "855656501725151232",
            "gameSeconds": 1500
        },
        {
            "id": "855656230139777024",
            "gameSeconds": 1500
        },
        {
            "id": "855651320979533824",
            "gameSeconds": 180
        },
        {
            "id": "855650964161810432",
            "gameSeconds": 180
        }
    ]
}