{
    "competitionId": 111,
    "competitionName": "NRL Telstra Premiership",
    "gameId": 20161110170,
    "gameInfo": {
        "assistantReferee1Id": 500114,
        "numberOfPeriods": 2,
        "assistantReferee1Name": "Clayton Sharpe",
        "assistantReferee2Id": 500050,
        "assistantReferee2Name": "Peter Gough",
        "gameDate": "2016-03-06",
        "gameHashTag": "#NRLTitansKnights",
        "gameNumber": 7,
        "gameSeconds": 4800,
        "gameMinutes": "80:00",
        "gameTime": "1:20:00",
        "groundConditionId": 1,
        "groundConditionName": "N/A",
        "referee1Id": 500006,
        "referee1Name": "Henry Perenara",
        "referee2Id": 500018,
        "referee2Name": "Chris James",
        "startTime": "2016-03-06T17:30:00",
        "startTimeUTC": "2016-03-06T07:30:00Z",
        "venueId": 500046,
        "venueName": "Cbus Super Stadium",
        "videoReferee2Id": 500002,
        "videoReferee2Name": "Matt Cecchin",
        "weatherId": 11,
        "weatherName": "Partly Cloudy",
        "broadcastChannel": null,
        "venueLatitude": 28.0669,
        "venueLongitude": 153.3789,
        "broadcastInfo": {
            "radioNetwork": []
        }
    },
    "gameState": "Final",
    "gameStateId": 8,
    "roundId": 1,
    "roundName": "Round 1",
    "seasonId": 2016,
    "teams": {
        "teamsMatch": [
            {
                "isHomeTeam": true,
                "score": {
                    "conversions": 4,
                    "points": 30,
                    "penaltyGoals": 1,
                    "tries": 5
                },
                "team1stHalfScore": 12,
                "team2ndHalfScore": 18,
                "teamAbbr": "GLD",
                "teamFinalScore": 30,
                "teamFullTimeScore": 30,
                "teamHalfTimeScore": 12,
                "teamId": 500004,
                "teamLineup": {
                    "teamLineUpStatusID": 4,
                    "teamLineUpStatus": "Final",
                    "injuriesAndSuspensions": {
                        "injury": [],
                        "suspension": []
                    },
                    "insAndOuts": {
                        "inOut": []
                    },
                    "teamPlayer": [
                        {
                            "playerFirstName": "David",
                            "playerId": 500831,
                            "playerLastName": "Mead",
                            "playerName": "David Mead",
                            "playerPosition": "Fullback",
                            "playerPositionId": 500001,
                            "playerStats": {
                                "allRunMetres": 158,
                                "allRuns": 19,
                                "bombKicksDefused": 2,
                                "bombKicksNotDefused": 1,
                                "decoys": 1,
                                "dummyHalfRuns": 2,
                                "errors": 1,
                                "fantasyPointsTotal": 23,
                                "kickReturnMetres": 66,
                                "kickReturns": 7,
                                "kicksDefused": 2,
                                "kicksNotDefused": 1,
                                "mins": 80,
                                "missedTackles": 1,
                                "offloads": 1,
                                "passes": 10,
                                "passesPerRun": 0.53,
                                "penalties": 1,
                                "supports": 17,
                                "tackleBreaks": 2,
                                "tackles": 4,
                                "evasionRuns": 10,
                                "evasionRunMetres": 74,
                                "dummyHalfRunMetres": 18,
                                "ptbAll": 19,
                                "receipts": 31,
                                "postContactMetres": 50,
                                "dummyPasses": 2,
                                "ptbZeroToOne": 1,
                                "ptbOneToTwo": 1,
                                "ptbTwoToThree": 1,
                                "ptbThreeToFour": 4,
                                "ptbFourToFive": 11,
                                "ptbFivePlus": 1,
                                "effectiveTacklePercentage": 80,
                                "offsidePenalties": 1
                            },
                            "playerTookTheField": true,
                            "shirtNum": 5,
                            "playerFirstInitial": "D",
                            "playerPositionAbbrev": "FB"
                        },
                        {
                            "playerFirstName": "Anthony",
                            "playerId": 500067,
                            "playerLastName": "Don",
                            "playerName": "Anthony Don",
                            "playerPosition": "Winger 1",
                            "playerPositionId": 500002,
                            "playerStats": {
                                "allRunMetres": 66,
                                "allRuns": 8,
                                "bombKicksDefused": 1,
                                "errors": 1,
                                "fantasyPointsTotal": 32,
                                "kickMetres": 15,
                                "kicks": 1,
                                "kicksDefused": 2,
                                "linebreaks": 1,
                                "mins": 80,
                                "passes": 2,
                                "passesPerRun": 0.25,
                                "oneOnOneTackles": 1,
                                "points": 8,
                                "supports": 8,
                                "tackleBreaks": 1,
                                "tackles": 3,
                                "tries": 2,
                                "evasionRuns": 8,
                                "evasionRunMetres": 66,
                                "ptbAll": 8,
                                "receipts": 14,
                                "grubberKick": 1,
                                "postContactMetres": 7,
                                "ptbTwoToThree": 1,
                                "ptbThreeToFour": 4,
                                "ptbFourToFive": 1,
                                "ptbFivePlus": 2,
                                "effectiveTacklePercentage": 100
                            },
                            "playerTookTheField": true,
                            "shirtNum": 2,
                            "playerFirstInitial": "A",
                            "playerPositionAbbrev": "WG"
                        },
                        {
                            "playerFirstName": "Josh",
                            "playerId": 500256,
                            "playerLastName": "Hoffman",
                            "playerName": "Josh Hoffman",
                            "playerPosition": "Centre 1",
                            "playerPositionId": 500003,
                            "playerStats": {
                                "allRunMetres": 93,
                                "allRuns": 13,
                                "decoys": 3,
                                "dummyHalfRuns": 1,
                                "fantasyPointsTotal": 19,
                                "ineffectiveTackles": 1,
                                "mins": 80,
                                "missedTackles": 2,
                                "passes": 2,
                                "passesPerRun": 0.15,
                                "oneOnOneTackles": 1,
                                "penalties": 1,
                                "supports": 13,
                                "tackleBreaks": 2,
                                "tackles": 10,
                                "evasionRuns": 12,
                                "evasionRunMetres": 78,
                                "dummyHalfRunMetres": 15,
                                "ptbAll": 8,
                                "receipts": 14,
                                "postContactMetres": 7,
                                "lineEngagedRuns": 1,
                                "ptbThreeToFour": 2,
                                "ptbFourToFive": 3,
                                "ptbFivePlus": 3,
                                "effectiveTacklePercentage": 76.9,
                                "generalPlayPenalties": 1,
                                "foulPlayPenalties": 1
                            },
                            "playerTookTheField": true,
                            "shirtNum": 3,
                            "playerFirstInitial": "J",
                            "playerPositionAbbrev": "CT"
                        },
                        {
                            "playerFirstName": "Nathan",
                            "playerId": 500888,
                            "playerLastName": "Davis",
                            "playerName": "Nathan Davis",
                            "playerPosition": "Centre 2",
                            "playerPositionId": 500004,
                            "playerStats": {
                                "allRunMetres": 99,
                                "allRuns": 9,
                                "decoys": 2,
                                "fantasyPointsTotal": 22,
                                "kickMetres": 30,
                                "kicks": 1,
                                "kicksNotDefused": 1,
                                "mins": 80,
                                "missedTackles": 3,
                                "offloads": 1,
                                "passes": 4,
                                "passesPerRun": 0.44,
                                "supports": 11,
                                "tackleBreaks": 2,
                                "tackles": 10,
                                "tryCause": 1,
                                "evasionRuns": 9,
                                "evasionRunMetres": 99,
                                "ptbAll": 8,
                                "receipts": 12,
                                "grubberKick": 1,
                                "postContactMetres": 17,
                                "ptbTwoToThree": 1,
                                "ptbThreeToFour": 3,
                                "ptbFourToFive": 4,
                                "doubles": 2,
                                "effectiveTacklePercentage": 76.9
                            },
                            "playerTookTheField": true,
                            "shirtNum": 4,
                            "playerFirstInitial": "N",
                            "playerPositionAbbrev": "CT"
                        },
                        {
                            "playerFirstName": "John",
                            "playerId": 500184,
                            "playerLastName": "Olive",
                            "playerName": "John Olive",
                            "playerPosition": "Winger 2",
                            "playerPositionId": 500005,
                            "playerStats": {
                                "allRunMetres": 54,
                                "allRuns": 8,
                                "decoys": 1,
                                "dummyHalfRuns": 2,
                                "fantasyPointsTotal": 26,
                                "kickReturnMetres": 10,
                                "kickReturns": 1,
                                "mins": 80,
                                "oneOnOneTackles": 2,
                                "points": 4,
                                "supports": 11,
                                "tackleBreaks": 2,
                                "tackles": 7,
                                "tries": 1,
                                "evasionRuns": 5,
                                "evasionRunMetres": 34,
                                "dummyHalfRunMetres": 10,
                                "ptbAll": 8,
                                "receipts": 10,
                                "postContactMetres": 19,
                                "ptbTwoToThree": 1,
                                "ptbThreeToFour": 5,
                                "ptbFourToFive": 2,
                                "effectiveTacklePercentage": 100
                            },
                            "playerTookTheField": true,
                            "shirtNum": 20,
                            "playerFirstInitial": "J",
                            "playerPositionAbbrev": "WG"
                        },
                        {
                            "playerFirstName": "Tyrone",
                            "playerId": 500046,
                            "playerLastName": "Roberts",
                            "playerName": "Tyrone Roberts",
                            "playerPosition": "Five-Eighth",
                            "playerPositionId": 500006,
                            "playerStats": {
                                "allRunMetres": 21,
                                "allRuns": 3,
                                "bombKicks": 6,
                                "bombKickMetres": 149,
                                "bombKicksNotDefused": 1,
                                "conversions": 4,
                                "conversionsAttempts": 5,
                                "conversionsMissed": 1,
                                "errors": 1,
                                "fantasyPointsTotal": 49,
                                "goalConversionRate": 83.33,
                                "allGoals": 5,
                                "allGoalsMissed": 1,
                                "allGoalsAttempted": 6,
                                "kickMetres": 393,
                                "kicks": 12,
                                "kicksNotDefused": 1,
                                "mins": 80,
                                "missedTackles": 1,
                                "passes": 36,
                                "passesPerRun": 12,
                                "oneOnOneTackles": 1,
                                "penaltyGoals": 1,
                                "penaltyGoalsAttempts": 1,
                                "points": 10,
                                "supports": 14,
                                "tackleBreaks": 1,
                                "tackles": 19,
                                "tryCause": 2,
                                "evasionRuns": 3,
                                "evasionRunMetres": 21,
                                "ptbAll": 3,
                                "receipts": 52,
                                "crossFieldKick": 1,
                                "postContactMetres": 2,
                                "dummyPasses": 2,
                                "kickPressures": 1,
                                "ptbThreeToFour": 1,
                                "ptbFourToFive": 2,
                                "doubles": 4,
                                "longKicksSpace": 4,
                                "effectiveTacklePercentage": 95
                            },
                            "playerTookTheField": true,
                            "shirtNum": 6,
                            "playerFirstInitial": "T",
                            "playerPositionAbbrev": "FE"
                        },
                        {
                            "playerFirstName": "Ashley",
                            "playerId": 500272,
                            "playerLastName": "Taylor",
                            "playerName": "Ashley Taylor",
                            "playerPosition": "Halfback",
                            "playerPositionId": 500007,
                            "playerStats": {
                                "allRunMetres": 20,
                                "allRuns": 4,
                                "bombKicks": 2,
                                "bombKickMetres": 50,
                                "dummyHalfRuns": 1,
                                "errors": 2,
                                "fantasyPointsTotal": 22,
                                "hitUps": 1,
                                "kickMetres": 70,
                                "kicks": 5,
                                "mins": 80,
                                "missedTackles": 4,
                                "offloads": 1,
                                "passes": 25,
                                "passesPerRun": 6.25,
                                "penalties": 1,
                                "supports": 17,
                                "tackles": 19,
                                "tryAssists": 2,
                                "hitupRunMeters": 8,
                                "evasionRuns": 2,
                                "evasionRunMetres": 12,
                                "ptbAll": 2,
                                "receipts": 31,
                                "chipKick": 1,
                                "grubberKick": 2,
                                "postContactMetres": 2,
                                "dummyPasses": 2,
                                "ptbTwoToThree": 2,
                                "doubles": 4,
                                "effectiveTacklePercentage": 82.6,
                                "ptbPenalties": 1
                            },
                            "playerTookTheField": true,
                            "shirtNum": 7,
                            "playerFirstInitial": "A",
                            "playerPositionAbbrev": "HB"
                        },
                        {
                            "playerFirstName": "David",
                            "playerId": 500334,
                            "playerLastName": "Shillington",
                            "playerName": "David Shillington",
                            "playerPosition": "Prop 1",
                            "playerPositionId": 500008,
                            "playerStats": {
                                "allRunMetres": 92,
                                "allRuns": 13,
                                "decoys": 2,
                                "errors": 1,
                                "fantasyPointsTotal": 41,
                                "hitUps": 11,
                                "kickReturnMetres": 10,
                                "kickReturns": 2,
                                "mins": 45,
                                "offloads": 1,
                                "passes": 1,
                                "passesPerRun": 0.08,
                                "oneOnOneTackles": 2,
                                "supports": 6,
                                "tackles": 32,
                                "hitupRunMeters": 82,
                                "ptbAll": 11,
                                "receipts": 14,
                                "postContactMetres": 18,
                                "ptbTwoToThree": 2,
                                "ptbThreeToFour": 5,
                                "ptbFourToFive": 3,
                                "ptbFivePlus": 1,
                                "doubles": 11,
                                "effectiveTacklePercentage": 100
                            },
                            "playerTookTheField": true,
                            "shirtNum": 8,
                            "playerFirstInitial": "D",
                            "playerPositionAbbrev": "PR"
                        },
                        {
                            "playerFirstName": "Nathan",
                            "playerId": 500700,
                            "playerLastName": "Friend",
                            "playerName": "Nathan Friend",
                            "playerPosition": "Hooker",
                            "playerPositionId": 500009,
                            "playerStats": {
                                "allRunMetres": 4,
                                "allRuns": 1,
                                "decoys": 1,
                                "dummyHalfRuns": 1,
                                "fantasyPointsTotal": 14,
                                "ineffectiveTackles": 1,
                                "mins": 30,
                                "missedTackles": 2,
                                "passes": 43,
                                "passesPerRun": 43,
                                "oneOnOneTackles": 3,
                                "tackles": 18,
                                "dummyHalfRunMetres": 4,
                                "ptbAll": 1,
                                "receipts": 44,
                                "postContactMetres": 2,
                                "ptbFourToFive": 1,
                                "doubles": 3,
                                "effectiveTacklePercentage": 85.7
                            },
                            "playerTookTheField": true,
                            "shirtNum": 9,
                            "playerFirstInitial": "N",
                            "playerPositionAbbrev": "HK"
                        },
                        {
                            "playerFirstName": "Agnatius",
                            "playerId": 501393,
                            "playerLastName": "Paasi",
                            "playerName": "Agnatius Paasi",
                            "playerPosition": "Prop 2",
                            "playerPositionId": 500010,
                            "playerStats": {
                                "allRunMetres": 165,
                                "allRuns": 16,
                                "decoys": 5,
                                "errors": 1,
                                "fantasyPointsTotal": 57,
                                "hitUps": 11,
                                "kickReturnMetres": 62,
                                "kickReturns": 5,
                                "linebreaks": 1,
                                "mins": 41,
                                "passes": 1,
                                "passesPerRun": 0.06,
                                "oneOnOneTackles": 1,
                                "points": 4,
                                "supports": 4,
                                "tackleBreaks": 5,
                                "tackles": 16,
                                "tries": 1,
                                "hitupRunMeters": 103,
                                "ptbAll": 14,
                                "receipts": 17,
                                "postContactMetres": 44,
                                "dummyPasses": 1,
                                "ptbTwoToThree": 1,
                                "ptbThreeToFour": 6,
                                "ptbFourToFive": 5,
                                "ptbFivePlus": 2,
                                "doubles": 5,
                                "effectiveTacklePercentage": 100
                            },
                            "playerTookTheField": true,
                            "shirtNum": 10,
                            "playerFirstInitial": "A",
                            "playerPositionAbbrev": "PR"
                        },
                        {
                            "playerFirstName": "Zeb",
                            "playerId": 502133,
                            "playerLastName": "Taia",
                            "playerName": "Zeb Taia",
                            "playerPosition": "2nd Row 1",
                            "playerPositionId": 500011,
                            "playerStats": {
                                "allRunMetres": 111,
                                "allRuns": 12,
                                "decoys": 4,
                                "errors": 1,
                                "fantasyPointsTotal": 49,
                                "hitUps": 12,
                                "ineffectiveTackles": 1,
                                "mins": 80,
                                "missedTackles": 4,
                                "passes": 4,
                                "passesPerRun": 0.33,
                                "penalties": 1,
                                "points": 4,
                                "supports": 8,
                                "tackleBreaks": 1,
                                "tackles": 39,
                                "tries": 1,
                                "hitupRunMeters": 111,
                                "ptbAll": 11,
                                "receipts": 17,
                                "postContactMetres": 42,
                                "ptbTwoToThree": 1,
                                "ptbThreeToFour": 4,
                                "ptbFourToFive": 5,
                                "ptbFivePlus": 1,
                                "doubles": 7,
                                "effectiveTacklePercentage": 88.6,
                                "offsidePenalties": 1
                            },
                            "playerTookTheField": true,
                            "shirtNum": 11,
                            "playerFirstInitial": "Z",
                            "playerPositionAbbrev": "2R"
                        },
                        {
                            "playerFirstName": "Chris",
                            "playerId": 500090,
                            "playerLastName": "McQueen",
                            "playerName": "Chris McQueen",
                            "playerPosition": "2nd Row 2",
                            "playerPositionId": 500012,
                            "playerStats": {
                                "allRunMetres": 68,
                                "allRuns": 10,
                                "decoys": 7,
                                "fantasyPointsTotal": 26,
                                "hitUps": 10,
                                "kicksDefused": 1,
                                "mins": 80,
                                "missedTackles": 3,
                                "passes": 1,
                                "passesPerRun": 0.1,
                                "oneOnOneTackles": 2,
                                "supports": 11,
                                "tackleBreaks": 1,
                                "tackles": 22,
                                "tryCause": 1,
                                "hitupRunMeters": 68,
                                "ptbAll": 10,
                                "receipts": 12,
                                "postContactMetres": 19,
                                "dummyPasses": 1,
                                "kickPressures": 1,
                                "ptbThreeToFour": 6,
                                "ptbFourToFive": 1,
                                "ptbFivePlus": 3,
                                "doubles": 2,
                                "effectiveTacklePercentage": 88
                            },
                            "playerTookTheField": true,
                            "shirtNum": 12,
                            "playerFirstInitial": "C",
                            "playerPositionAbbrev": "2R"
                        },
                        {
                            "playerFirstName": "Greg",
                            "playerId": 500073,
                            "playerLastName": "Bird",
                            "playerName": "Greg Bird",
                            "playerPosition": "Lock",
                            "playerPositionId": 500013,
                            "playerStats": {
                                "allRunMetres": 158,
                                "allRuns": 20,
                                "decoys": 1,
                                "fantasyPointsTotal": 61,
                                "hitUps": 19,
                                "linebreakAssists": 2,
                                "mins": 62,
                                "missedTackles": 1,
                                "offloads": 4,
                                "passes": 4,
                                "passesPerRun": 0.2,
                                "penalties": 1,
                                "supports": 9,
                                "tackleBreaks": 1,
                                "tackles": 25,
                                "tryAssists": 2,
                                "hitupRunMeters": 152,
                                "evasionRuns": 1,
                                "evasionRunMetres": 6,
                                "ptbAll": 15,
                                "receipts": 24,
                                "postContactMetres": 40,
                                "dummyPasses": 2,
                                "kickPressures": 1,
                                "lineEngagedRuns": 1,
                                "ptbTwoToThree": 1,
                                "ptbThreeToFour": 6,
                                "ptbFourToFive": 5,
                                "ptbFivePlus": 3,
                                "doubles": 2,
                                "effectiveTacklePercentage": 96.2,
                                "ptbPenalties": 1
                            },
                            "playerTookTheField": true,
                            "shirtNum": 13,
                            "playerFirstInitial": "G",
                            "playerPositionAbbrev": "LK"
                        },
                        {
                            "playerFirstName": "Eddy",
                            "playerId": 502632,
                            "playerLastName": "Pettybourne",
                            "playerName": "Eddy Pettybourne",
                            "playerPosition": "Interchange",
                            "playerPositionId": 500014,
                            "playerStats": {
                                "allRunMetres": 20,
                                "allRuns": 5,
                                "fantasyPointsTotal": 11,
                                "hitUps": 4,
                                "mins": 17,
                                "missedTackles": 1,
                                "passes": 1,
                                "passesPerRun": 0.2,
                                "tackles": 11,
                                "hitupRunMeters": 20,
                                "evasionRuns": 1,
                                "ptbAll": 4,
                                "receipts": 5,
                                "postContactMetres": 1,
                                "lineEngagedRuns": 1,
                                "ptbThreeToFour": 2,
                                "ptbFourToFive": 1,
                                "ptbFivePlus": 1,
                                "doubles": 1,
                                "effectiveTacklePercentage": 91.7
                            },
                            "playerTookTheField": true,
                            "shirtNum": 14,
                            "playerFirstInitial": "E",
                            "playerPositionAbbrev": "INT"
                        },
                        {
                            "playerFirstName": "Ryan",
                            "playerId": 500072,
                            "playerLastName": "James",
                            "playerName": "Ryan James",
                            "playerPosition": "Interchange",
                            "playerPositionId": 500014,
                            "playerStats": {
                                "allRunMetres": 106,
                                "allRuns": 17,
                                "decoys": 3,
                                "errors": 1,
                                "fantasyPointsTotal": 33,
                                "hitUps": 15,
                                "mins": 53,
                                "missedTackles": 2,
                                "passes": 8,
                                "passesPerRun": 0.47,
                                "supports": 10,
                                "tackles": 29,
                                "hitupRunMeters": 94,
                                "evasionRuns": 2,
                                "evasionRunMetres": 12,
                                "ptbAll": 13,
                                "receipts": 23,
                                "postContactMetres": 20,
                                "dummyPasses": 3,
                                "kickPressures": 2,
                                "lineEngagedRuns": 2,
                                "ptbOneToTwo": 3,
                                "ptbTwoToThree": 3,
                                "ptbThreeToFour": 4,
                                "ptbFourToFive": 3,
                                "doubles": 6,
                                "effectiveTacklePercentage": 93.5
                            },
                            "playerTookTheField": true,
                            "shirtNum": 15,
                            "playerFirstInitial": "R",
                            "playerPositionAbbrev": "INT"
                        },
                        {
                            "playerFirstName": "Leivaha",
                            "playerId": 502104,
                            "playerLastName": "Pulu",
                            "playerName": "Leivaha Pulu",
                            "playerPosition": "Interchange",
                            "playerPositionId": 500014,
                            "playerStats": {
                                "allRunMetres": 29,
                                "allRuns": 5,
                                "errors": 1,
                                "fantasyPointsTotal": 13,
                                "hitUps": 4,
                                "mins": 22,
                                "offloads": 1,
                                "passes": 2,
                                "passesPerRun": 0.4,
                                "supports": 5,
                                "tackles": 11,
                                "hitupRunMeters": 23,
                                "evasionRuns": 1,
                                "evasionRunMetres": 6,
                                "ptbAll": 4,
                                "receipts": 8,
                                "postContactMetres": 8,
                                "kickPressures": 1,
                                "lineEngagedRuns": 1,
                                "ptbTwoToThree": 1,
                                "ptbThreeToFour": 1,
                                "ptbFourToFive": 1,
                                "ptbFivePlus": 1,
                                "doubles": 1,
                                "effectiveTacklePercentage": 100
                            },
                            "playerTookTheField": true,
                            "shirtNum": 16,
                            "playerFirstInitial": "L",
                            "playerPositionAbbrev": "INT"
                        },
                        {
                            "playerFirstName": "Daniel",
                            "playerId": 500015,
                            "playerLastName": "Mortimer",
                            "playerName": "Daniel Mortimer",
                            "playerPosition": "Interchange",
                            "playerPositionId": 500014,
                            "playerStats": {
                                "allRunMetres": 43,
                                "allRuns": 5,
                                "dummyHalfRuns": 4,
                                "errors": 1,
                                "fantasyPointsTotal": 37,
                                "hitUps": 1,
                                "kickMetres": 2,
                                "kicks": 1,
                                "mins": 50,
                                "offloads": 2,
                                "passes": 72,
                                "passesPerRun": 14.4,
                                "oneOnOneTackles": 1,
                                "penalties": 1,
                                "supports": 1,
                                "tackleBreaks": 1,
                                "tackles": 30,
                                "hitupRunMeters": 6,
                                "dummyHalfRunMetres": 37,
                                "ptbAll": 2,
                                "receipts": 79,
                                "chipKick": 1,
                                "postContactMetres": 6,
                                "dummyPasses": 2,
                                "ptbThreeToFour": 2,
                                "doubles": 5,
                                "effectiveTacklePercentage": 100,
                                "ptbPenalties": 1
                            },
                            "playerTookTheField": true,
                            "shirtNum": 17,
                            "playerFirstInitial": "D",
                            "playerPositionAbbrev": "INT"
                        }
                    ]
                },
                "teamName": "Gold Coast Titans",
                "teamNickName": "Titans",
                "teamStats": {
                    "allRunMetres": 1311,
                    "allRuns": 168,
                    "bombKicks": 8,
                    "bombKickMetres": 198,
                    "bombKicksDefused": 3,
                    "bombKicksNotDefused": 2,
                    "completeSets": 32,
                    "completionPercentage": 78,
                    "conversions": 4,
                    "conversionsAttempts": 5,
                    "conversionsMissed": 1,
                    "decoys": 30,
                    "dummyHalfRuns": 11,
                    "errors": 11,
                    "goalConversionRate": 83.33,
                    "allGoals": 5,
                    "allGoalsAttempted": 6,
                    "allGoalsMissed": 1,
                    "hitUps": 88,
                    "incompleteSets": 9,
                    "ineffectiveTackles": 3,
                    "kickMetres": 510,
                    "kickReturnMetres": 149,
                    "kickReturns": 15,
                    "kicks": 20,
                    "kicksDefused": 5,
                    "kicksNotDefused": 3,
                    "linebreakAssists": 2,
                    "linebreaks": 2,
                    "missedTackles": 24,
                    "offloads": 11,
                    "oneOnOneTackles": 14,
                    "passes": 216,
                    "passesPerRun": 1.29,
                    "penalties": 6,
                    "penaltyGoals": 1,
                    "penaltyGoalsAttempts": 1,
                    "points": 30,
                    "pointsConceded": 12,
                    "possession": 55,
                    "scrumWins": 8,
                    "supports": 145,
                    "tackleBreaks": 19,
                    "tackles": 305,
                    "sets": 41,
                    "tries": 5,
                    "triesConceded": 2,
                    "tryAssists": 4,
                    "tryCause": 4,
                    "hitupRunMeters": 667,
                    "evasionRuns": 54,
                    "evasionRunMetres": 410,
                    "dummyHalfRunMetres": 85,
                    "ptbTotal": 141,
                    "tryScoringPercentage": 15.62,
                    "shiftsLeft": 4,
                    "shiftsRight": 11,
                    "receipts": 407,
                    "chipKick": 2,
                    "grubberKick": 4,
                    "crossFieldKick": 1,
                    "postContactMetres": 306,
                    "dummyPasses": 15,
                    "kickPressures": 6,
                    "lineEngagedRuns": 6,
                    "ptbZeroToOne": 1,
                    "ptbOneToTwo": 4,
                    "ptbTwoToThree": 15,
                    "ptbThreeToFour": 55,
                    "ptbFourToFive": 48,
                    "ptbFivePlus": 18,
                    "interchangeUsed": 7,
                    "interchangeLeft": 1,
                    "doubles": 53,
                    "longKicksSpace": 4,
                    "effectiveTacklePercentage": 91.9,
                    "ptbPenalties": 3,
                    "generalPlayPenalties": 1,
                    "foulPlayPenalties": 1,
                    "offsidePenalties": 2,
                    "averageSetDistance": 32,
                    "completeSets1stHalf": 18,
                    "completeSets2ndHalf": 14,
                    "completionPercentage1stHalf": 81.82,
                    "completionPercentage2ndHalf": 73.68,
                    "incompleteSets1stHalf": 4,
                    "incompleteSets2ndHalf": 5,
                    "incompletionPercentage1stHalf": 18.18,
                    "incompletionPercentage2ndHalf": 26.32
                },
                "teamHexColour": "00a6e3",
                "teamHexColour2": "005372"
            },
            {
                "score": {
                    "conversions": 2,
                    "points": 12,
                    "tries": 2
                },
                "team1stHalfScore": 6,
                "team2ndHalfScore": 6,
                "teamAbbr": "NEW",
                "teamFinalScore": 12,
                "teamFullTimeScore": 12,
                "teamHalfTimeScore": 6,
                "teamId": 500003,
                "teamLineup": {
                    "teamLineUpStatusID": 4,
                    "teamLineUpStatus": "Final",
                    "injuriesAndSuspensions": {
                        "injury": [],
                        "suspension": []
                    },
                    "insAndOuts": {
                        "inOut": []
                    },
                    "teamPlayer": [
                        {
                            "playerFirstName": "Jaelen",
                            "playerId": 500130,
                            "playerLastName": "Feeney",
                            "playerName": "Jaelen Feeney",
                            "playerPosition": "Fullback",
                            "playerPositionId": 500001,
                            "playerStats": {
                                "allRunMetres": 46,
                                "allRuns": 9,
                                "bombKicksDefused": 2,
                                "bombKicksNotDefused": 1,
                                "decoys": 1,
                                "dummyHalfRuns": 1,
                                "errors": 1,
                                "fantasyPointsTotal": 13,
                                "ineffectiveTackles": 1,
                                "kickReturnMetres": 20,
                                "kickReturns": 5,
                                "kicksDefused": 3,
                                "kicksNotDefused": 2,
                                "mins": 80,
                                "missedTackles": 1,
                                "passes": 10,
                                "passesPerRun": 1.11,
                                "oneOnOneTackles": 2,
                                "supports": 23,
                                "tackleBreaks": 1,
                                "tackles": 7,
                                "tryCause": 2,
                                "evasionRuns": 3,
                                "evasionRunMetres": 16,
                                "dummyHalfRunMetres": 10,
                                "ptbAll": 6,
                                "receipts": 22,
                                "postContactMetres": 4,
                                "dummyPasses": 1,
                                "ptbThreeToFour": 4,
                                "ptbFourToFive": 1,
                                "ptbFivePlus": 1,
                                "doubles": 1,
                                "effectiveTacklePercentage": 77.8
                            },
                            "playerTookTheField": true,
                            "shirtNum": 1,
                            "playerFirstInitial": "J",
                            "playerPositionAbbrev": "FB"
                        },
                        {
                            "playerFirstName": "Chanel",
                            "playerId": 500376,
                            "playerLastName": "Mata'utia",
                            "playerName": "Chanel Mata'utia",
                            "playerPosition": "Winger 1",
                            "playerPositionId": 500002,
                            "playerStats": {
                                "allRunMetres": 51,
                                "allRuns": 6,
                                "bombKicksNotDefused": 1,
                                "fantasyPointsTotal": 8,
                                "kicksNotDefused": 1,
                                "mins": 80,
                                "missedTackles": 1,
                                "passes": 1,
                                "passesPerRun": 0.17,
                                "oneOnOneTackles": 1,
                                "supports": 10,
                                "tackles": 5,
                                "tryCause": 2,
                                "evasionRuns": 6,
                                "evasionRunMetres": 51,
                                "ptbAll": 6,
                                "receipts": 7,
                                "postContactMetres": 10,
                                "ptbThreeToFour": 3,
                                "ptbFourToFive": 3,
                                "effectiveTacklePercentage": 83.3
                            },
                            "playerTookTheField": true,
                            "shirtNum": 2,
                            "playerFirstInitial": "C",
                            "playerPositionAbbrev": "WG"
                        },
                        {
                            "playerFirstName": "Dane",
                            "playerId": 500043,
                            "playerLastName": "Gagai",
                            "playerName": "Dane Gagai",
                            "playerPosition": "Centre 1",
                            "playerPositionId": 500003,
                            "playerStats": {
                                "allRunMetres": 135,
                                "allRuns": 20,
                                "dummyHalfRuns": 2,
                                "errors": 2,
                                "fantasyPointsTotal": 27,
                                "hitUps": 2,
                                "ineffectiveTackles": 1,
                                "kickReturnMetres": 4,
                                "kickReturns": 1,
                                "mins": 80,
                                "missedTackles": 4,
                                "offloads": 1,
                                "passes": 4,
                                "passesPerRun": 0.2,
                                "oneOnOneTackles": 1,
                                "supports": 10,
                                "tackleBreaks": 4,
                                "tackles": 12,
                                "hitupRunMeters": 14,
                                "evasionRuns": 15,
                                "evasionRunMetres": 94,
                                "dummyHalfRunMetres": 23,
                                "ptbAll": 15,
                                "receipts": 23,
                                "postContactMetres": 19,
                                "kickPressures": 1,
                                "ptbTwoToThree": 6,
                                "ptbThreeToFour": 6,
                                "ptbFourToFive": 1,
                                "ptbFivePlus": 2,
                                "doubles": 1,
                                "effectiveTacklePercentage": 70.6
                            },
                            "playerTookTheField": true,
                            "shirtNum": 3,
                            "playerFirstInitial": "D",
                            "playerPositionAbbrev": "CT"
                        },
                        {
                            "playerFirstName": "Pat",
                            "playerId": 500377,
                            "playerLastName": "Mata'utia",
                            "playerName": "Pat Mata'utia",
                            "playerPosition": "Centre 2",
                            "playerPositionId": 500004,
                            "playerStats": {
                                "allRunMetres": 62,
                                "allRuns": 11,
                                "errors": 1,
                                "fantasyPointsTotal": 34,
                                "linebreaks": 1,
                                "mins": 80,
                                "offloads": 1,
                                "passes": 2,
                                "passesPerRun": 0.18,
                                "oneOnOneTackles": 1,
                                "points": 4,
                                "supports": 5,
                                "tackleBreaks": 2,
                                "tackles": 10,
                                "tries": 1,
                                "tryCause": 2,
                                "evasionRuns": 11,
                                "evasionRunMetres": 62,
                                "ptbAll": 8,
                                "receipts": 13,
                                "postContactMetres": 11,
                                "ptbTwoToThree": 5,
                                "ptbThreeToFour": 2,
                                "ptbFourToFive": 1,
                                "doubles": 1,
                                "effectiveTacklePercentage": 100
                            },
                            "playerTookTheField": true,
                            "shirtNum": 4,
                            "playerFirstInitial": "P",
                            "playerPositionAbbrev": "CT"
                        },
                        {
                            "playerFirstName": "Akuila",
                            "playerId": 500044,
                            "playerLastName": "Uate",
                            "playerName": "Akuila Uate",
                            "playerPosition": "Winger 2",
                            "playerPositionId": 500005,
                            "playerStats": {
                                "allRunMetres": 190,
                                "allRuns": 19,
                                "bombKicksDefused": 1,
                                "dummyHalfRuns": 1,
                                "errors": 1,
                                "fantasyPointsTotal": 30,
                                "hitUps": 2,
                                "ineffectiveTackles": 1,
                                "kickReturnMetres": 64,
                                "kickReturns": 5,
                                "kicksDefused": 2,
                                "kicksNotDefused": 1,
                                "mins": 80,
                                "missedTackles": 1,
                                "passes": 1,
                                "passesPerRun": 0.05,
                                "oneOnOneTackles": 1,
                                "supports": 9,
                                "tackleBreaks": 2,
                                "tackles": 7,
                                "tryCause": 2,
                                "hitupRunMeters": 16,
                                "evasionRuns": 11,
                                "evasionRunMetres": 100,
                                "dummyHalfRunMetres": 10,
                                "ptbAll": 19,
                                "receipts": 22,
                                "postContactMetres": 42,
                                "ptbTwoToThree": 6,
                                "ptbThreeToFour": 9,
                                "ptbFourToFive": 4,
                                "doubles": 1,
                                "effectiveTacklePercentage": 77.8
                            },
                            "playerTookTheField": true,
                            "shirtNum": 5,
                            "playerFirstInitial": "A",
                            "playerPositionAbbrev": "WG"
                        },
                        {
                            "playerFirstName": "Jarrod",
                            "playerId": 500045,
                            "playerLastName": "Mullen",
                            "playerName": "Jarrod Mullen",
                            "playerPosition": "Five-Eighth",
                            "playerPositionId": 500006,
                            "playerStats": {
                                "allRunMetres": 22,
                                "allRuns": 5,
                                "bombKicks": 3,
                                "bombKickMetres": 65,
                                "errors": 1,
                                "fantasyPointsTotal": 39,
                                "kickMetres": 261,
                                "kicks": 9,
                                "linebreakAssists": 1,
                                "mins": 80,
                                "missedTackles": 2,
                                "passes": 32,
                                "passesPerRun": 6.4,
                                "supports": 11,
                                "tackleBreaks": 2,
                                "tackles": 17,
                                "tryAssists": 1,
                                "evasionRuns": 5,
                                "evasionRunMetres": 22,
                                "ptbAll": 2,
                                "receipts": 44,
                                "crossFieldKick": 1,
                                "postContactMetres": 1,
                                "dummyPasses": 2,
                                "kickPressures": 2,
                                "lineEngagedRuns": 2,
                                "ptbTwoToThree": 1,
                                "ptbFivePlus": 1,
                                "doubles": 1,
                                "longKicksSpace": 1,
                                "effectiveTacklePercentage": 89.5
                            },
                            "playerTookTheField": true,
                            "shirtNum": 6,
                            "playerFirstInitial": "J",
                            "playerPositionAbbrev": "FE"
                        },
                        {
                            "playerFirstName": "Trent",
                            "playerId": 500224,
                            "playerLastName": "Hodkinson",
                            "playerName": "Trent Hodkinson",
                            "playerPosition": "Halfback",
                            "playerPositionId": 500007,
                            "playerStats": {
                                "allRunMetres": 20,
                                "allRuns": 3,
                                "bombKicks": 2,
                                "bombKickMetres": 41,
                                "conversions": 2,
                                "conversionsAttempts": 2,
                                "decoys": 1,
                                "errors": 1,
                                "fantasyPointsTotal": 33,
                                "goalConversionRate": 100,
                                "allGoals": 2,
                                "allGoalsAttempted": 2,
                                "ineffectiveTackles": 1,
                                "kickMetres": 102,
                                "kicks": 5,
                                "lineDropouts": 1,
                                "linebreakAssists": 1,
                                "mins": 80,
                                "missedTackles": 2,
                                "passes": 42,
                                "passesPerRun": 14,
                                "oneOnOneTackles": 5,
                                "points": 4,
                                "supports": 7,
                                "tackles": 21,
                                "tryAssists": 1,
                                "tryCause": 1,
                                "evasionRuns": 3,
                                "evasionRunMetres": 20,
                                "ptbAll": 2,
                                "receipts": 50,
                                "grubberKick": 1,
                                "dummyPasses": 5,
                                "lineEngagedRuns": 1,
                                "ptbTwoToThree": 1,
                                "ptbThreeToFour": 1,
                                "doubles": 5,
                                "effectiveTacklePercentage": 87.5
                            },
                            "playerTookTheField": true,
                            "shirtNum": 7,
                            "playerFirstInitial": "T",
                            "playerPositionAbbrev": "HB"
                        },
                        {
                            "playerFirstName": "Kade",
                            "playerId": 500385,
                            "playerLastName": "Snowden",
                            "playerName": "Kade Snowden",
                            "playerPosition": "Prop 1",
                            "playerPositionId": 500008,
                            "playerStats": {
                                "allRunMetres": 28,
                                "allRuns": 5,
                                "decoys": 2,
                                "errors": 1,
                                "fantasyPointsTotal": 13,
                                "hitUps": 4,
                                "kickReturnMetres": 4,
                                "kickReturns": 1,
                                "mins": 28,
                                "missedTackles": 1,
                                "passes": 2,
                                "passesPerRun": 0.4,
                                "oneOnOneTackles": 1,
                                "penalties": 3,
                                "supports": 3,
                                "tackles": 21,
                                "hitupRunMeters": 24,
                                "ptbAll": 4,
                                "receipts": 7,
                                "postContactMetres": 5,
                                "kickPressures": 2,
                                "ptbOneToTwo": 1,
                                "ptbTwoToThree": 1,
                                "ptbFourToFive": 1,
                                "ptbFivePlus": 1,
                                "doubles": 3,
                                "effectiveTacklePercentage": 95.5,
                                "ptbPenalties": 1,
                                "generalPlayPenalties": 1,
                                "offsidePenalties": 1
                            },
                            "playerTookTheField": true,
                            "shirtNum": 8,
                            "playerFirstInitial": "K",
                            "playerPositionAbbrev": "PR"
                        },
                        {
                            "playerFirstName": "Tyler",
                            "playerId": 500380,
                            "playerLastName": "Randell",
                            "playerName": "Tyler Randell",
                            "playerPosition": "Hooker",
                            "playerPositionId": 500009,
                            "playerStats": {
                                "allRunMetres": 53,
                                "allRuns": 7,
                                "dummyHalfRuns": 5,
                                "fantasyPointsTotal": 65,
                                "hitUps": 2,
                                "ineffectiveTackles": 3,
                                "mins": 80,
                                "passes": 92,
                                "passesPerRun": 13.14,
                                "oneOnOneTackles": 3,
                                "penalties": 1,
                                "tackles": 62,
                                "hitupRunMeters": 4,
                                "dummyHalfRunMetres": 49,
                                "ptbAll": 5,
                                "receipts": 92,
                                "postContactMetres": 11,
                                "dummyPasses": 2,
                                "kickPressures": 1,
                                "lineEngagedRuns": 1,
                                "ptbThreeToFour": 2,
                                "ptbFourToFive": 1,
                                "ptbFivePlus": 2,
                                "doubles": 11,
                                "effectiveTacklePercentage": 95.4,
                                "ptbPenalties": 1
                            },
                            "playerTookTheField": true,
                            "shirtNum": 9,
                            "playerFirstInitial": "T",
                            "playerPositionAbbrev": "HK"
                        },
                        {
                            "playerFirstName": "Sam",
                            "playerId": 500324,
                            "playerLastName": "Mataora",
                            "playerName": "Sam Mataora",
                            "playerPosition": "Prop 2",
                            "playerPositionId": 500010,
                            "playerStats": {
                                "allRunMetres": 76,
                                "allRuns": 9,
                                "fantasyPointsTotal": 40,
                                "hitUps": 9,
                                "ineffectiveTackles": 1,
                                "mins": 41,
                                "offloads": 1,
                                "oneOnOneTackles": 7,
                                "penalties": 1,
                                "supports": 4,
                                "tackleBreaks": 1,
                                "tackles": 30,
                                "hitupRunMeters": 76,
                                "ptbAll": 7,
                                "receipts": 9,
                                "postContactMetres": 27,
                                "ptbOneToTwo": 1,
                                "ptbTwoToThree": 1,
                                "ptbThreeToFour": 3,
                                "ptbFourToFive": 2,
                                "doubles": 9,
                                "effectiveTacklePercentage": 96.8,
                                "ptbPenalties": 1
                            },
                            "playerTookTheField": true,
                            "shirtNum": 10,
                            "playerFirstInitial": "S",
                            "playerPositionAbbrev": "PR"
                        },
                        {
                            "playerFirstName": "Jacob",
                            "playerId": 503523,
                            "playerLastName": "Saifiti",
                            "playerName": "Jacob Saifiti",
                            "playerPosition": "2nd Row 1",
                            "playerPositionId": 500011,
                            "playerStats": {
                                "allRunMetres": 67,
                                "allRuns": 9,
                                "decoys": 4,
                                "fantasyPointsTotal": 29,
                                "hitUps": 9,
                                "ineffectiveTackles": 2,
                                "mins": 64,
                                "missedTackles": 1,
                                "oneOnOneTackles": 5,
                                "supports": 5,
                                "tackles": 25,
                                "tryCause": 1,
                                "hitupRunMeters": 67,
                                "ptbAll": 9,
                                "receipts": 9,
                                "postContactMetres": 21,
                                "kickPressures": 1,
                                "ptbTwoToThree": 3,
                                "ptbThreeToFour": 5,
                                "ptbFourToFive": 1,
                                "doubles": 3,
                                "effectiveTacklePercentage": 89.3
                            },
                            "playerTookTheField": true,
                            "shirtNum": 11,
                            "playerFirstInitial": "J",
                            "playerPositionAbbrev": "2R"
                        },
                        {
                            "playerFirstName": "Robbie",
                            "playerId": 500050,
                            "playerLastName": "Rochow",
                            "playerName": "Robbie Rochow",
                            "playerPosition": "2nd Row 2",
                            "playerPositionId": 500012,
                            "playerStats": {
                                "allRunMetres": 94,
                                "allRuns": 13,
                                "decoys": 2,
                                "fantasyPointsTotal": 51,
                                "hitUps": 13,
                                "ineffectiveTackles": 2,
                                "mins": 75,
                                "passes": 3,
                                "passesPerRun": 0.23,
                                "oneOnOneTackles": 8,
                                "supports": 4,
                                "tackleBreaks": 3,
                                "tackles": 33,
                                "hitupRunMeters": 94,
                                "ptbAll": 13,
                                "receipts": 18,
                                "postContactMetres": 18,
                                "ptbTwoToThree": 7,
                                "ptbThreeToFour": 5,
                                "ptbFivePlus": 1,
                                "doubles": 8,
                                "effectiveTacklePercentage": 94.3
                            },
                            "playerTookTheField": true,
                            "shirtNum": 12,
                            "playerFirstInitial": "R",
                            "playerPositionAbbrev": "2R"
                        },
                        {
                            "playerFirstName": "Jeremy",
                            "playerId": 500052,
                            "playerLastName": "Smith",
                            "playerName": "Jeremy Smith",
                            "playerPosition": "Lock",
                            "playerPositionId": 500013,
                            "playerStats": {
                                "allRunMetres": 56,
                                "allRuns": 8,
                                "fantasyPointsTotal": 32,
                                "hitUps": 7,
                                "ineffectiveTackles": 1,
                                "mins": 44,
                                "passes": 1,
                                "passesPerRun": 0.12,
                                "oneOnOneTackles": 1,
                                "penalties": 1,
                                "supports": 3,
                                "tackleBreaks": 1,
                                "tackles": 26,
                                "hitupRunMeters": 54,
                                "evasionRuns": 1,
                                "evasionRunMetres": 2,
                                "ptbAll": 7,
                                "receipts": 8,
                                "postContactMetres": 13,
                                "lineEngagedRuns": 1,
                                "ptbTwoToThree": 1,
                                "ptbThreeToFour": 3,
                                "ptbFourToFive": 3,
                                "doubles": 4,
                                "effectiveTacklePercentage": 96.3,
                                "foulPlayPenalties": 1
                            },
                            "playerTookTheField": true,
                            "shirtNum": 13,
                            "playerFirstInitial": "J",
                            "playerPositionAbbrev": "LK"
                        },
                        {
                            "playerFirstName": "David",
                            "playerId": 500915,
                            "playerLastName": "Bhana",
                            "playerName": "David Bhana",
                            "playerPosition": "Interchange",
                            "playerPositionId": 500014,
                            "playerStats": {
                                "allRunMetres": 23,
                                "allRuns": 3,
                                "decoys": 5,
                                "fantasyPointsTotal": 24,
                                "hitUps": 3,
                                "ineffectiveTackles": 1,
                                "mins": 35,
                                "missedTackles": 1,
                                "passes": 1,
                                "passesPerRun": 0.33,
                                "oneOnOneTackles": 1,
                                "supports": 8,
                                "tackles": 24,
                                "hitupRunMeters": 23,
                                "ptbAll": 3,
                                "receipts": 4,
                                "postContactMetres": 6,
                                "kickPressures": 1,
                                "ptbTwoToThree": 2,
                                "ptbThreeToFour": 1,
                                "doubles": 7,
                                "effectiveTacklePercentage": 92.3
                            },
                            "playerTookTheField": true,
                            "shirtNum": 14,
                            "playerFirstInitial": "D",
                            "playerPositionAbbrev": "INT"
                        },
                        {
                            "playerFirstName": "Korbin",
                            "playerId": 500384,
                            "playerLastName": "Sims",
                            "playerName": "Korbin Sims",
                            "playerPosition": "Interchange",
                            "playerPositionId": 500014,
                            "playerStats": {
                                "allRunMetres": 97,
                                "allRuns": 9,
                                "decoys": 2,
                                "dummyHalfRuns": 1,
                                "fantasyPointsTotal": 51,
                                "hitUps": 8,
                                "mins": 53,
                                "missedTackles": 2,
                                "offloads": 1,
                                "passes": 2,
                                "passesPerRun": 0.22,
                                "oneOnOneSteal": 1,
                                "oneOnOneTackles": 2,
                                "penalties": 1,
                                "supports": 6,
                                "tackleBreaks": 5,
                                "tackles": 31,
                                "hitupRunMeters": 66,
                                "dummyHalfRunMetres": 31,
                                "ptbAll": 9,
                                "receipts": 12,
                                "postContactMetres": 15,
                                "ptbTwoToThree": 2,
                                "ptbThreeToFour": 4,
                                "ptbFourToFive": 3,
                                "doubles": 7,
                                "effectiveTacklePercentage": 93.9,
                                "ptbPenalties": 1
                            },
                            "playerTookTheField": true,
                            "shirtNum": 15,
                            "playerFirstInitial": "K",
                            "playerPositionAbbrev": "INT"
                        },
                        {
                            "playerFirstName": "Pauli",
                            "playerId": 500685,
                            "playerLastName": "Pauli",
                            "playerName": "Pauli Pauli",
                            "playerPosition": "Interchange",
                            "playerPositionId": 500014,
                            "playerStats": {
                                "allRunMetres": 64,
                                "allRuns": 6,
                                "decoys": 3,
                                "errors": 1,
                                "fantasyPointsTotal": 17,
                                "hitUps": 6,
                                "mins": 25,
                                "missedTackles": 2,
                                "onReport": 1,
                                "passes": 1,
                                "passesPerRun": 0.17,
                                "oneOnOneTackles": 1,
                                "penalties": 1,
                                "supports": 3,
                                "tackles": 19,
                                "hitupRunMeters": 64,
                                "ptbAll": 5,
                                "receipts": 7,
                                "postContactMetres": 25,
                                "kickPressures": 1,
                                "ptbTwoToThree": 1,
                                "ptbThreeToFour": 3,
                                "ptbFourToFive": 1,
                                "doubles": 3,
                                "effectiveTacklePercentage": 90.5,
                                "generalPlayPenalties": 1
                            },
                            "playerTookTheField": true,
                            "shirtNum": 17,
                            "playerFirstInitial": "P",
                            "playerPositionAbbrev": "INT"
                        },
                        {
                            "playerFirstName": "Daniel",
                            "playerId": 503571,
                            "playerLastName": "Saifiti",
                            "playerName": "Daniel Saifiti",
                            "playerPosition": "Interchange",
                            "playerPositionId": 500014,
                            "playerStats": {
                                "allRunMetres": 66,
                                "allRuns": 8,
                                "decoys": 6,
                                "errors": 1,
                                "fantasyPointsTotal": 40,
                                "hitUps": 8,
                                "ineffectiveTackles": 1,
                                "linebreaks": 1,
                                "mins": 32,
                                "missedTackles": 1,
                                "points": 4,
                                "supports": 2,
                                "tackleBreaks": 2,
                                "tackles": 20,
                                "tries": 1,
                                "hitupRunMeters": 66,
                                "ptbAll": 6,
                                "receipts": 8,
                                "postContactMetres": 13,
                                "kickPressures": 1,
                                "ptbTwoToThree": 2,
                                "ptbThreeToFour": 3,
                                "ptbFourToFive": 1,
                                "doubles": 5,
                                "effectiveTacklePercentage": 90.9
                            },
                            "playerTookTheField": true,
                            "shirtNum": 18,
                            "playerFirstInitial": "D",
                            "playerPositionAbbrev": "INT"
                        }
                    ]
                },
                "teamName": "Newcastle Knights",
                "teamNickName": "Knights",
                "teamStats": {
                    "allRunMetres": 1148,
                    "allRuns": 150,
                    "bombKicks": 5,
                    "bombKickMetres": 105,
                    "bombKicksDefused": 3,
                    "bombKicksNotDefused": 2,
                    "completeSets": 23,
                    "completionPercentage": 79,
                    "conversions": 2,
                    "conversionsAttempts": 2,
                    "decoys": 26,
                    "dummyHalfRuns": 10,
                    "errors": 10,
                    "goalConversionRate": 100,
                    "allGoals": 2,
                    "allGoalsAttempted": 2,
                    "hitUps": 73,
                    "incompleteSets": 6,
                    "ineffectiveTackles": 15,
                    "kickMetres": 363,
                    "kickReturnMetres": 93,
                    "kickReturns": 12,
                    "kicks": 14,
                    "kicksDefused": 5,
                    "kicksNotDefused": 4,
                    "lineDropouts": 1,
                    "linebreakAssists": 2,
                    "linebreaks": 2,
                    "missedTackles": 19,
                    "offloads": 4,
                    "onReports": 1,
                    "oneOnOneSteal": 1,
                    "oneOnOneTackles": 40,
                    "passes": 194,
                    "passesPerRun": 1.29,
                    "penalties": 8,
                    "points": 12,
                    "pointsConceded": 30,
                    "possession": 45,
                    "scrumWins": 9,
                    "supports": 113,
                    "tackleBreaks": 23,
                    "tackles": 370,
                    "sets": 29,
                    "tries": 2,
                    "triesConceded": 5,
                    "tryAssists": 2,
                    "tryCause": 10,
                    "hitupRunMeters": 566,
                    "evasionRuns": 55,
                    "evasionRunMetres": 367,
                    "dummyHalfRunMetres": 122,
                    "ptbTotal": 126,
                    "tryScoringPercentage": 8.7,
                    "shiftsLeft": 11,
                    "shiftsRight": 5,
                    "receipts": 355,
                    "grubberKick": 1,
                    "crossFieldKick": 1,
                    "postContactMetres": 242,
                    "dummyPasses": 10,
                    "kickPressures": 10,
                    "lineEngagedRuns": 5,
                    "ptbOneToTwo": 2,
                    "ptbTwoToThree": 39,
                    "ptbThreeToFour": 54,
                    "ptbFourToFive": 23,
                    "ptbFivePlus": 8,
                    "interchangeUsed": 8,
                    "doubles": 70,
                    "longKicksSpace": 1,
                    "effectiveTacklePercentage": 91.6,
                    "ptbPenalties": 4,
                    "generalPlayPenalties": 2,
                    "foulPlayPenalties": 1,
                    "offsidePenalties": 1,
                    "averageSetDistance": 39.6,
                    "completeSets1stHalf": 13,
                    "completeSets2ndHalf": 10,
                    "completionPercentage1stHalf": 76.47,
                    "completionPercentage2ndHalf": 83.33,
                    "incompleteSets1stHalf": 4,
                    "incompleteSets2ndHalf": 2,
                    "incompletionPercentage1stHalf": 23.53,
                    "incompletionPercentage2ndHalf": 16.67
                },
                "teamHexColour": "0054a6",
                "teamHexColour2": "002242"
            }
        ]
    }
}