{
    "vod": [
        {
            "id": "w4NHl4czp_t-nYnf05TiNnjqymQ-9_48",
            "contentId": 729190,
            "title": "Rd 2: Sharks v Broncos (Hls)",
            "description": "Highlights of the match between the Shakrs & Broncos from Remondis Stadium",
            "publishDate": "2015-03-13T22:44:00+11:00",
            "publisher": "NRL Chief",
            "thumbnailUrl": "http://bigpondvideo.com/Web/Images/Content/20150313224502a_89x50.jpg",
            "largeThumbnailUrl": "http://bigpondvideo.com/Web/Images/Content/20150313224502a_326x184.jpg",
            "programType": "Highlights",
            "programCategory": "Match",
            "priority": null,
            "lastUpdateDate": "2015-03-13T22:49:26+11:00",
            "isPremium": false,
            "club": [
                500011,
                500028
            ]
        },
        {
            "id": "p1ZXl4czoQ9OY30tl85fkQsTjbsspYV9",
            "contentId": 729291,
            "title": "Rd 2 Press Conference: Sharks",
            "description": "The Sharks coach faces the media following the match",
            "publishDate": "2015-03-13T23:07:00+11:00",
            "publisher": "NRL Chief",
            "thumbnailUrl": "http://bigpondvideo.com/Web/Images/Content/20150313230526a_89x50.jpg",
            "largeThumbnailUrl": "http://bigpondvideo.com/Web/Images/Content/20150313230526a_326x184.jpg",
            "programType": "Press Conference",
            "programCategory": null,
            "priority": null,
            "lastUpdateDate": "2015-03-13T23:14:40+11:00",
            "isPremium": false,
            "club": [
                500011,
                500028
            ]
        },
        {
            "id": "FyZHl4czqbkwGXEMd9GuyOw75oOlZlOG",
            "contentId": 729292,
            "title": "Rd 2 Press Conference: Broncos",
            "description": "The Broncos coach faces the media following the match",
            "publishDate": "2015-03-13T23:05:00+11:00",
            "publisher": "NRL Chief",
            "thumbnailUrl": "http://bigpondvideo.com/Web/Images/Content/20150313230537a_89x50.jpg",
            "largeThumbnailUrl": "http://bigpondvideo.com/Web/Images/Content/20150313230537a_326x184.jpg",
            "programType": "Press Conference",
            "programCategory": null,
            "priority": null,
            "lastUpdateDate": "2015-03-13T23:18:42+11:00",
            "isPremium": false,
            "club": [
                500011,
                500028
            ]
        },
        {
            "id": "xpanh4czpk1qigVxZdeUCHFPf3H7kgTn",
            "contentId": 729281,
            "title": "Rd 2: TRY Lachlan Maranta (61st min)",
            "description": "The Broncos score off a great hit from Sam Thaiday, which knocks the ball loose to Lachlan Maranta, for a try to take their lead to 8",
            "publishDate": "2015-03-13T22:04:00+11:00",
            "publisher": "NRL Chief",
            "thumbnailUrl": "http://bigpondvideo.com/Web/Images/Content/20150313220253a_89x50.jpg",
            "largeThumbnailUrl": "http://bigpondvideo.com/Web/Images/Content/20150313220253a_326x184.jpg",
            "programType": "Instant Replay",
            "programCategory": "Score",
            "priority": 1,
            "lastUpdateDate": "2015-03-13T22:41:22+11:00",
            "isPremium": true,
            "club": [
                500011,
                500028
            ]
        },
        {
            "id": "s0ZHh4czrF7cOL5X28bt3uETI3nP8jao",
            "contentId": 729279,
            "title": "Rd 2: GOAL Corey Parker (47th min)",
            "description": "The broncos extend their lead through the Corey Parker conversion, 6-2",
            "publishDate": "2015-03-13T21:49:00+11:00",
            "publisher": "NRL Chief",
            "thumbnailUrl": "http://bigpondvideo.com/Web/Images/Content/20150313214951a_89x50.jpg",
            "largeThumbnailUrl": "http://bigpondvideo.com/Web/Images/Content/20150313214951a_326x184.jpg",
            "programType": "Instant Replay",
            "programCategory": "Score",
            "priority": 2,
            "lastUpdateDate": "2015-03-13T22:40:31+11:00",
            "isPremium": true,
            "club": [
                500011,
                500028
            ]
        },
        {
            "id": "luY3h4czoyZJPCBHz1e63rByRP_3-rKX",
            "contentId": 729277,
            "title": "Rd 2: TRY Corey Oates (46th min)",
            "description": "The Broncos open their scoring account with a try to Corey Oates down the left side",
            "publishDate": "2015-03-13T21:48:00+11:00",
            "publisher": "NRL Chief",
            "thumbnailUrl": "http://bigpondvideo.com/Web/Images/Content/20150313214922a_89x50.jpg",
            "largeThumbnailUrl": "http://bigpondvideo.com/Web/Images/Content/20150313214922a_326x184.jpg",
            "programType": "Instant Replay",
            "programCategory": "Score",
            "priority": 3,
            "lastUpdateDate": "2015-03-13T22:31:19+11:00",
            "isPremium": true,
            "club": [
                500011,
                500028
            ]
        },
        {
            "id": "IxMnh4czrzXSplYJtlY1IYr2xBTJe0uA",
            "contentId": 729276,
            "title": "Rd 2: PENALTY GOAL Michael Gordon (38th min)",
            "description": "The Sharks break the deadlock after almost 39 minutes of play with a penalty goal taken by their fullback, 2-0",
            "publishDate": "2015-03-13T21:35:01+11:00",
            "publisher": "NRL Chief",
            "thumbnailUrl": "http://bigpondvideo.com/Web/Images/Content/20150313215007a_89x50.jpg",
            "largeThumbnailUrl": "http://bigpondvideo.com/Web/Images/Content/20150313215007a_326x184.jpg",
            "programType": "Instant Replay",
            "programCategory": "Score",
            "priority": 4,
            "lastUpdateDate": "2015-03-13T22:42:22+11:00",
            "isPremium": true,
            "club": [
                500011,
                500028
            ]
        }
    ],
    "scores": [
        {
            "gameState": "First Half",
            "gameStateId": 3,
            "gameTime": "0:38:22",
            "gameSeconds": 2302,
            "playerId": 500797,
            "playerName": "Michael Gordon",
            "scoreMethod": "Penalty Goal",
            "statId": 67,
            "statValue": 2,
            "vidRef": 65318,
            "homeScore": 2,
            "teamId": 500028,
            "teamName": "Cronulla-Sutherland Sharks",
            "homeTeamAbbrv": "CRO",
            "awayTeamAbbrv": "BRI"
        },
        {
            "gameState": "Second Half",
            "gameStateId": 5,
            "gameTime": "0:45:42",
            "gameSeconds": 2742,
            "playerId": 500266,
            "playerName": "Corey Oates",
            "scoreMethod": "Try",
            "statId": 38,
            "statValue": 4,
            "vidRef": 77017,
            "homeScore": 2,
            "awayScore": 4,
            "teamId": 500011,
            "teamName": "Brisbane Broncos",
            "homeTeamAbbrv": "CRO",
            "awayTeamAbbrv": "BRI"
        },
        {
            "gameState": "Second Half",
            "gameStateId": 5,
            "gameTime": "0:46:46",
            "gameSeconds": 2806,
            "playerId": 500268,
            "playerName": "Corey Parker",
            "scoreMethod": "Conversion",
            "statId": 1,
            "statValue": 2,
            "vidRef": 80745,
            "homeScore": 2,
            "awayScore": 6,
            "teamId": 500011,
            "teamName": "Brisbane Broncos",
            "homeTeamAbbrv": "CRO",
            "awayTeamAbbrv": "BRI"
        },
        {
            "gameState": "Second Half",
            "gameStateId": 5,
            "gameTime": "1:00:54",
            "gameSeconds": 3654,
            "playerId": 500260,
            "playerName": "Lachlan Maranta",
            "scoreMethod": "Try",
            "statId": 38,
            "statValue": 4,
            "vidRef": 101957,
            "homeScore": 2,
            "awayScore": 10,
            "teamId": 500011,
            "teamName": "Brisbane Broncos",
            "homeTeamAbbrv": "CRO",
            "awayTeamAbbrv": "BRI"
        }
    ]
}