{
    "competitionId": 111,
    "competitionName": "NRL Telstra Premiership",
    "gameId": 20151110770,
    "gameInfo": {
        "assistantReferee1Id": 500013,
        "numberOfPeriods": 2,
        "assistantReferee1Name": "Brett Suttor",
        "assistantReferee2Id": 500074,
        "assistantReferee2Name": "Phil Henderson",
        "gameDate": "2015-04-19",
        "gameHashTag": "#NRLKnightsEels",
        "gameNumber": 7,
        "gameSeconds": 4800,
        "gameTime": "1:20:00",
        "groundConditionId": 1,
        "groundConditionName": "N/A",
        "referee1Id": 500011,
        "referee1Name": "Adam Devcich",
        "referee2Id": 500034,
        "referee2Name": "Dave Munro",
        "startTime": "2015-04-19T16:00:00",
        "startTimeUTC": "2015-04-19T06:00:00Z",
        "venueId": 500024,
        "venueName": "Hunter Stadium",
        "videoReferee1Id": 500017,
        "videoReferee1Name": "Luke Phillips",
        "videoReferee2Id": 500030,
        "videoReferee2Name": "Steve Clark",
        "weatherId": -1,
        "weatherName": "Unknown"
    },
    "gameState": "Final",
    "gameStateId": 8,
    "roundId": 7,
    "seasonId": 2015,
    "teams": {
        "teamsMatch": [
            {
                "isHomeTeam": true,
                "score": {
                    "conversions": 2,
                    "points": 22,
                    "penaltyGoals": 1,
                    "tries": 4
                },
                "team1stHalfScore": 12,
                "team2ndHalfScore": 10,
                "teamAbbr": "NEW",
                "teamFinalScore": 22,
                "teamFullTimeScore": 22,
                "teamHalfTimeScore": 12,
                "teamId": 500003,
                "teamLineup": {
                    "injuriesAndSuspensions": {
                        "injury": [],
                        "suspension": []
                    },
                    "insAndOuts": {
                        "inOut": [
                            {
                                "inOut": "Out",
                                "playerFirstName": "Sione",
                                "playerId": "500571",
                                "playerLastName": "Mata'utia",
                                "playerName": "Sione Mata'utia"
                            },
                            {
                                "inOut": "In",
                                "playerFirstName": "Tyler",
                                "playerId": "500380",
                                "playerLastName": "Randell",
                                "playerName": "Tyler Randell"
                            }
                        ]
                    },
                    "teamPlayer": [
                        {
                            "playerFirstName": "Kurt",
                            "playerId": 500373,
                            "playerLastName": "Gidley",
                            "playerName": "Kurt Gidley",
                            "playerPosition": "Fullback",
                            "playerPositionId": 500001,
                            "playerStats": {
                                "allRunMetres": 121,
                                "allRuns": 17,
                                "decoys": 3,
                                "errors": 2,
                                "fantasyPointsTotal": 20,
                                "hitUps": 1,
                                "ineffectiveTackles": 1,
                                "kickMetres": 31,
                                "kickReturnMetres": 61,
                                "kickReturns": 6,
                                "kicks": 1,
                                "kicksDefused": 2,
                                "mins": 80,
                                "missedTackles": 2,
                                "offloads": 1,
                                "oneOnOneTackles": 1,
                                "supports": 18,
                                "tackles": 11,
                                "tryCause": 2,
                                "hitupRunMeters": 5,
                                "evasionRuns": 10,
                                "evasionRunMetres": 55,
                                "ptbFast": 7.14,
                                "ptbNeutral": 92.86,
                                "ptbAll": 14
                            },
                            "playerTookTheField": true,
                            "shirtNum": 1
                        },
                        {
                            "playerFirstName": "James",
                            "playerId": 500378,
                            "playerLastName": "McManus",
                            "playerName": "James McManus",
                            "playerPosition": "Winger 1",
                            "playerPositionId": 500002,
                            "playerStats": {
                                "allRunMetres": 117,
                                "allRuns": 12,
                                "bombKicksDefused": 1,
                                "decoys": 1,
                                "fantasyPointsTotal": 33,
                                "hitUps": 1,
                                "kickReturnMetres": 26,
                                "kickReturns": 4,
                                "kicksDefused": 2,
                                "kicksNotDefused": 2,
                                "mins": 80,
                                "missedTackles": 1,
                                "supports": 7,
                                "tackleBreaks": 4,
                                "tackles": 2,
                                "tries": 1,
                                "tryCause": 2,
                                "hitupRunMeters": 10,
                                "evasionRuns": 7,
                                "evasionRunMetres": 81,
                                "ptbNeutral": 100,
                                "ptbAll": 12
                            },
                            "playerTookTheField": true,
                            "shirtNum": 2
                        },
                        {
                            "playerFirstName": "Dane",
                            "playerId": 500043,
                            "playerLastName": "Gagai",
                            "playerName": "Dane Gagai",
                            "playerPosition": "Centre 1",
                            "playerPositionId": 500003,
                            "playerStats": {
                                "allRunMetres": 126,
                                "allRuns": 14,
                                "dummyHalfRuns": 1,
                                "fantasyPointsTotal": 71,
                                "ineffectiveTackles": 1,
                                "kickReturnMetres": 12,
                                "kickReturns": 2,
                                "kicksDefused": 1,
                                "linebreakAssists": 1,
                                "linebreaks": 2,
                                "mins": 80,
                                "missedTackles": 2,
                                "offloads": 1,
                                "supports": 8,
                                "tackleBreaks": 9,
                                "tackles": 15,
                                "tries": 1,
                                "tryCause": 2,
                                "evasionRuns": 11,
                                "evasionRunMetres": 107,
                                "dummyHalfRunMetres": 7,
                                "ptbFast": 10,
                                "ptbNeutral": 90,
                                "ptbAll": 10
                            },
                            "playerTookTheField": true,
                            "shirtNum": 3
                        },
                        {
                            "playerFirstName": "Joseph",
                            "playerId": 500042,
                            "playerLastName": "Leilua",
                            "playerName": "Joseph Leilua",
                            "playerPosition": "Centre 2",
                            "playerPositionId": 500004,
                            "playerStats": {
                                "allRunMetres": 105,
                                "allRuns": 9,
                                "decoys": 1,
                                "dummyHalfRuns": 1,
                                "fantasyPointsTotal": 25,
                                "hitUps": 1,
                                "linebreaks": 1,
                                "mins": 80,
                                "missedTackles": 2,
                                "oneOnOneTackles": 2,
                                "supports": 7,
                                "tackles": 10,
                                "tryAssists": 1,
                                "tryCause": 2,
                                "hitupRunMeters": 6,
                                "evasionRuns": 7,
                                "evasionRunMetres": 83,
                                "dummyHalfRunMetres": 16,
                                "ptbFast": 14.29,
                                "ptbNeutral": 85.71,
                                "ptbAll": 7
                            },
                            "playerTookTheField": true,
                            "shirtNum": 4
                        },
                        {
                            "playerFirstName": "Akuila",
                            "playerId": 500044,
                            "playerLastName": "Uate",
                            "playerName": "Akuila Uate",
                            "playerPosition": "Winger 2",
                            "playerPositionId": 500005,
                            "playerStats": {
                                "allRunMetres": 125,
                                "allRuns": 10,
                                "dummyHalfRuns": 1,
                                "fantasyPointsTotal": 45,
                                "kickReturnMetres": 32,
                                "kickReturns": 3,
                                "kicksDefused": 3,
                                "linebreaks": 2,
                                "mins": 80,
                                "missedTackles": 2,
                                "oneOnOneTackles": 1,
                                "supports": 7,
                                "tackleBreaks": 1,
                                "tackles": 10,
                                "tries": 1,
                                "tryAssists": 1,
                                "tryCause": 2,
                                "evasionRuns": 6,
                                "evasionRunMetres": 86,
                                "dummyHalfRunMetres": 7,
                                "ptbNeutral": 100,
                                "ptbAll": 9
                            },
                            "playerTookTheField": true,
                            "shirtNum": 5
                        },
                        {
                            "playerFirstName": "Jarrod",
                            "playerId": 500045,
                            "playerLastName": "Mullen",
                            "playerName": "Jarrod Mullen",
                            "playerPosition": "Five-eighth",
                            "playerPositionId": 500006,
                            "playerStats": {
                                "allRunMetres": 25,
                                "allRuns": 6,
                                "decoys": 1,
                                "errors": 1,
                                "fantasyPointsTotal": 38,
                                "ineffectiveTackles": 3,
                                "kickMetres": 238,
                                "kickReturns": 1,
                                "kicks": 7,
                                "kicksDefused": 2,
                                "lineDropouts": 1,
                                "linebreakAssists": 2,
                                "mins": 80,
                                "missedTackles": 3,
                                "offloads": 3,
                                "oneOnOneTackles": 1,
                                "penalties": 1,
                                "supports": 7,
                                "tackles": 13,
                                "tryAssists": 2,
                                "tryCause": 1,
                                "evasionRuns": 5,
                                "evasionRunMetres": 25,
                                "ptbNeutral": 100,
                                "ptbAll": 1
                            },
                            "playerTookTheField": true,
                            "shirtNum": 6
                        },
                        {
                            "playerFirstName": "Tyrone",
                            "playerId": 500046,
                            "playerLastName": "Roberts",
                            "playerName": "Tyrone Roberts",
                            "playerPosition": "Halfback",
                            "playerPositionId": 500007,
                            "playerStats": {
                                "allRunMetres": 73,
                                "allRuns": 10,
                                "bombKicks": 1,
                                "bombKickMetres": 20,
                                "conversions": 2,
                                "conversionsAttempts": 4,
                                "conversionsMissed": 2,
                                "dummyHalfRuns": 1,
                                "errors": 3,
                                "fantasyPointsTotal": 19,
                                "goalConversionRate": 20,
                                "ineffectiveTackles": 2,
                                "kickMetres": 116,
                                "kicks": 5,
                                "mins": 80,
                                "missedTackles": 2,
                                "oneOnOneTackles": 1,
                                "penaltyGoals": 1,
                                "penaltyGoalsAttempts": 1,
                                "supports": 10,
                                "tackles": 11,
                                "evasionRuns": 9,
                                "evasionRunMetres": 64,
                                "dummyHalfRunMetres": 9,
                                "ptbNeutral": 100,
                                "ptbAll": 5
                            },
                            "playerTookTheField": true,
                            "shirtNum": 7
                        },
                        {
                            "playerFirstName": "Kade",
                            "playerId": 500385,
                            "playerLastName": "Snowden",
                            "playerName": "Kade Snowden",
                            "playerPosition": "Prop 1",
                            "playerPositionId": 500008,
                            "playerStats": {
                                "allRunMetres": 78,
                                "allRuns": 11,
                                "decoys": 1,
                                "fantasyPointsTotal": 42,
                                "hitUps": 11,
                                "ineffectiveTackles": 3,
                                "mins": 50,
                                "missedTackles": 3,
                                "offloads": 1,
                                "penalties": 1,
                                "supports": 3,
                                "tackleBreaks": 1,
                                "tackles": 38,
                                "hitupRunMeters": 78,
                                "ptbFast": 10,
                                "ptbNeutral": 80,
                                "ptbSlow": 10,
                                "ptbAll": 10
                            },
                            "playerTookTheField": true,
                            "shirtNum": 8
                        },
                        {
                            "playerFirstName": "Adam",
                            "playerId": 500370,
                            "playerLastName": "Clydsdale",
                            "playerName": "Adam Clydsdale",
                            "playerPosition": "Hooker",
                            "playerPositionId": 500009,
                            "playerStats": {
                                "allRunMetres": 27,
                                "allRuns": 4,
                                "dummyHalfRuns": 3,
                                "fantasyPointsTotal": 30,
                                "ineffectiveTackles": 2,
                                "mins": 45,
                                "supports": 1,
                                "tackles": 28,
                                "evasionRuns": 1,
                                "evasionRunMetres": 12,
                                "dummyHalfRunMetres": 15,
                                "ptbNeutral": 100,
                                "ptbAll": 2
                            },
                            "playerTookTheField": true,
                            "shirtNum": 9
                        },
                        {
                            "playerFirstName": "David",
                            "playerId": 500047,
                            "playerLastName": "Fa'alogo",
                            "playerName": "David Fa'alogo",
                            "playerPosition": "Prop 2",
                            "playerPositionId": 500010,
                            "playerStats": {
                                "allRunMetres": 48,
                                "allRuns": 8,
                                "decoys": 2,
                                "errors": 1,
                                "fantasyPointsTotal": 21,
                                "hitUps": 8,
                                "ineffectiveTackles": 2,
                                "mins": 35,
                                "penalties": 1,
                                "supports": 2,
                                "tackles": 21,
                                "hitupRunMeters": 48,
                                "ptbNeutral": 100,
                                "ptbAll": 7
                            },
                            "playerTookTheField": true,
                            "shirtNum": 15
                        },
                        {
                            "playerFirstName": "Chris",
                            "playerId": 500054,
                            "playerLastName": "Houston",
                            "playerName": "Chris Houston",
                            "playerPosition": "2nd Row 1",
                            "playerPositionId": 500011,
                            "playerStats": {
                                "allRunMetres": 78,
                                "allRuns": 8,
                                "decoys": 5,
                                "errors": 1,
                                "fantasyPointsTotal": 41,
                                "hitUps": 7,
                                "ineffectiveTackles": 2,
                                "kickMetres": 2,
                                "kicks": 1,
                                "linebreakAssists": 1,
                                "mins": 68,
                                "missedTackles": 2,
                                "oneOnOneTackles": 3,
                                "supports": 6,
                                "tackles": 30,
                                "tries": 1,
                                "hitupRunMeters": 61,
                                "evasionRuns": 1,
                                "evasionRunMetres": 17,
                                "ptbNeutral": 100,
                                "ptbAll": 6
                            },
                            "playerTookTheField": true,
                            "shirtNum": 11
                        },
                        {
                            "playerFirstName": "Tariq",
                            "playerId": 500298,
                            "playerLastName": "Sims",
                            "playerName": "Tariq Sims",
                            "playerPosition": "2nd Row 2",
                            "playerPositionId": 500012,
                            "playerStats": {
                                "allRunMetres": 102,
                                "allRuns": 14,
                                "decoys": 4,
                                "errors": 1,
                                "fantasyPointsTotal": 30,
                                "hitUps": 13,
                                "ineffectiveTackles": 4,
                                "kickReturnMetres": 10,
                                "kickReturns": 1,
                                "mins": 80,
                                "missedTackles": 1,
                                "oneOnOneTackles": 2,
                                "supports": 13,
                                "tackles": 24,
                                "hitupRunMeters": 92,
                                "ptbFast": 23.08,
                                "ptbNeutral": 69.23,
                                "ptbSlow": 7.69,
                                "ptbAll": 13
                            },
                            "playerTookTheField": true,
                            "shirtNum": 12
                        },
                        {
                            "playerFirstName": "Jeremy",
                            "playerId": 500052,
                            "playerLastName": "Smith",
                            "playerName": "Jeremy Smith",
                            "playerPosition": "Lock",
                            "playerPositionId": 500013,
                            "playerStats": {
                                "allRunMetres": 36,
                                "allRuns": 5,
                                "decoys": 7,
                                "fantasyPointsTotal": 35,
                                "hitUps": 5,
                                "ineffectiveTackles": 2,
                                "mins": 52,
                                "offloads": 1,
                                "supports": 8,
                                "tackles": 30,
                                "hitupRunMeters": 36,
                                "ptbNeutral": 100,
                                "ptbAll": 4
                            },
                            "playerTookTheField": true,
                            "shirtNum": 13
                        },
                        {
                            "playerFirstName": "Korbin",
                            "playerId": 500384,
                            "playerLastName": "Sims",
                            "playerName": "Korbin Sims",
                            "playerPosition": "Interchange",
                            "playerPositionId": 500014,
                            "playerStats": {
                                "allRunMetres": 107,
                                "allRuns": 12,
                                "decoys": 2,
                                "errors": 2,
                                "fantasyPointsTotal": 26,
                                "hitUps": 11,
                                "kickReturnMetres": 9,
                                "kickReturns": 1,
                                "mins": 39,
                                "missedTackles": 1,
                                "oneOnOneTackles": 2,
                                "penalties": 1,
                                "supports": 2,
                                "tackleBreaks": 1,
                                "tackles": 21,
                                "hitupRunMeters": 98,
                                "ptbFast": 9.09,
                                "ptbNeutral": 90.91,
                                "ptbAll": 11
                            },
                            "playerTookTheField": true,
                            "shirtNum": 10
                        },
                        {
                            "playerFirstName": "Tyler",
                            "playerId": 500380,
                            "playerLastName": "Randell",
                            "playerName": "Tyler Randell",
                            "playerPosition": "Interchange",
                            "playerPositionId": 500014,
                            "playerStats": {
                                "allRunMetres": 16,
                                "allRuns": 4,
                                "decoys": 1,
                                "dummyHalfRuns": 3,
                                "errors": 1,
                                "fantasyPointsTotal": 17,
                                "hitUps": 1,
                                "mins": 35,
                                "oneOnOneTackles": 3,
                                "supports": 1,
                                "tackles": 18,
                                "hitupRunMeters": 5,
                                "dummyHalfRunMetres": 11,
                                "ptbNeutral": 100,
                                "ptbAll": 3
                            },
                            "playerTookTheField": true,
                            "shirtNum": 14
                        },
                        {
                            "playerFirstName": "Joseph",
                            "playerId": 500555,
                            "playerLastName": "Tapine",
                            "playerName": "Joseph Tapine",
                            "playerPosition": "Interchange",
                            "playerPositionId": 500014,
                            "playerStats": {
                                "allRunMetres": 49,
                                "allRuns": 5,
                                "decoys": 2,
                                "fantasyPointsTotal": 19,
                                "hitUps": 3,
                                "ineffectiveTackles": 1,
                                "kickReturnMetres": 25,
                                "kickReturns": 2,
                                "mins": 33,
                                "missedTackles": 3,
                                "supports": 3,
                                "tackleBreaks": 1,
                                "tackles": 18,
                                "tryCause": 2,
                                "hitupRunMeters": 24,
                                "ptbFast": 20,
                                "ptbNeutral": 80,
                                "ptbAll": 5
                            },
                            "playerTookTheField": true,
                            "shirtNum": 16
                        },
                        {
                            "playerFirstName": "Jack",
                            "playerId": 500639,
                            "playerLastName": "Stockwell",
                            "playerName": "Jack Stockwell",
                            "playerPosition": "Interchange",
                            "playerPositionId": 500014,
                            "playerStats": {
                                "allRunMetres": 86,
                                "allRuns": 11,
                                "decoys": 7,
                                "fantasyPointsTotal": 34,
                                "hitUps": 9,
                                "kickReturnMetres": 16,
                                "kickReturns": 2,
                                "mins": 43,
                                "supports": 3,
                                "tackleBreaks": 1,
                                "tackles": 23,
                                "hitupRunMeters": 70,
                                "ptbFast": 9.09,
                                "ptbNeutral": 81.82,
                                "ptbSlow": 9.09,
                                "ptbAll": 11
                            },
                            "playerTookTheField": true,
                            "shirtNum": 17
                        }
                    ]
                },
                "teamName": "Newcastle Knights",
                "teamNickName": "Knights",
                "teamStats": {
                    "allRunMetres": 1320,
                    "allRuns": 160,
                    "bombKicks": 1,
                    "bombKickMetres": 20,
                    "bombKicksDefused": 1,
                    "completeSets": 26,
                    "completionPercentage": 72,
                    "conversions": 2,
                    "conversionsAttempts": 4,
                    "conversionsMissed": 2,
                    "decoys": 37,
                    "dummyHalfRuns": 10,
                    "errors": 13,
                    "hitUps": 71,
                    "incompleteSets": 10,
                    "ineffectiveTackles": 23,
                    "kickMetres": 388,
                    "kickReturnMetres": 191,
                    "kickReturns": 22,
                    "kicks": 14,
                    "kicksDefused": 10,
                    "kicksNotDefused": 2,
                    "lineDropouts": 1,
                    "linebreakAssists": 4,
                    "linebreaks": 5,
                    "missedTackles": 24,
                    "oneOnOneTackles": 16,
                    "penalties": 4,
                    "penaltyGoals": 1,
                    "penaltyGoalsAttempts": 1,
                    "points": 22,
                    "pointsConceded": 28,
                    "possession": 54,
                    "scrumWins": 3,
                    "supports": 106,
                    "tackleBreaks": 18,
                    "tackles": 323,
                    "sets": 36,
                    "tries": 4,
                    "triesConceded": 5,
                    "tryAssists": 4,
                    "offloads": 7,
                    "hitupRunMeters": 534,
                    "evasionRuns": 57,
                    "evasionRunMetres": 531,
                    "dummyHalfRunMetres": 64,
                    "ptbFast": 8,
                    "ptbNeutral": 90,
                    "ptbSlow": 2,
                    "ptbTotal": 130
                }
            },
            {
                "score": {
                    "conversions": 3,
                    "points": 28,
                    "penaltyGoals": 1,
                    "tries": 5
                },
                "team1stHalfScore": 10,
                "team2ndHalfScore": 18,
                "teamAbbr": "PAR",
                "teamFinalScore": 28,
                "teamFullTimeScore": 28,
                "teamHalfTimeScore": 10,
                "teamId": 500031,
                "teamLineup": {
                    "injuriesAndSuspensions": {
                        "injury": [],
                        "suspension": []
                    },
                    "insAndOuts": {
                        "inOut": [
                            {
                                "inOut": "In",
                                "playerFirstName": "Brad",
                                "playerId": "500065",
                                "playerLastName": "Takairangi",
                                "playerName": "Brad Takairangi"
                            },
                            {
                                "inOut": "Out",
                                "playerFirstName": "Darcy",
                                "playerId": "500677",
                                "playerLastName": "Lussick",
                                "playerName": "Darcy Lussick"
                            },
                            {
                                "inOut": "In",
                                "playerFirstName": "Richie",
                                "playerId": "500577",
                                "playerLastName": "Fa'aoso",
                                "playerName": "Richie Fa'aoso"
                            },
                            {
                                "inOut": "Out",
                                "playerFirstName": "Ryan",
                                "playerId": "500682",
                                "playerLastName": "Morgan",
                                "playerName": "Ryan Morgan"
                            }
                        ]
                    },
                    "teamPlayer": [
                        {
                            "playerFirstName": "Will",
                            "playerId": 500672,
                            "playerLastName": "Hopoate",
                            "playerName": "Will Hopoate",
                            "playerPosition": "Fullback",
                            "playerPositionId": 500001,
                            "playerStats": {
                                "allRunMetres": 98,
                                "allRuns": 12,
                                "dummyHalfRuns": 6,
                                "errors": 1,
                                "fantasyPointsTotal": 29,
                                "mins": 80,
                                "missedTackles": 1,
                                "oneOnOneTackles": 5,
                                "penalties": 1,
                                "supports": 10,
                                "tackles": 26,
                                "evasionRuns": 6,
                                "evasionRunMetres": 52,
                                "dummyHalfRunMetres": 46,
                                "ptbFast": 16.67,
                                "ptbNeutral": 83.33,
                                "ptbAll": 12
                            },
                            "playerTookTheField": true,
                            "shirtNum": 1
                        },
                        {
                            "playerFirstName": "Bureta",
                            "playerId": 500668,
                            "playerLastName": "Faraimo",
                            "playerName": "Bureta Faraimo",
                            "playerPosition": "Winger 1",
                            "playerPositionId": 500002,
                            "playerStats": {
                                "allRunMetres": 110,
                                "allRuns": 14,
                                "fantasyPointsTotal": 34,
                                "kickReturnMetres": 26,
                                "kickReturns": 3,
                                "mins": 80,
                                "missedTackles": 1,
                                "offloads": 1,
                                "supports": 9,
                                "tackleBreaks": 3,
                                "tackles": 6,
                                "tries": 1,
                                "tryCause": 1,
                                "evasionRuns": 11,
                                "evasionRunMetres": 84,
                                "ptbFast": 33.33,
                                "ptbNeutral": 66.67,
                                "ptbAll": 12
                            },
                            "playerTookTheField": true,
                            "shirtNum": 2
                        },
                        {
                            "playerFirstName": "Brad",
                            "playerId": 500065,
                            "playerLastName": "Takairangi",
                            "playerName": "Brad Takairangi",
                            "playerPosition": "Centre 1",
                            "playerPositionId": 500003,
                            "playerStats": {
                                "allRunMetres": 71,
                                "allRuns": 10,
                                "decoys": 1,
                                "dummyHalfRuns": 1,
                                "fantasyPointsTotal": 16,
                                "ineffectiveTackles": 1,
                                "linebreakAssists": 1,
                                "mins": 80,
                                "missedTackles": 2,
                                "offloads": 2,
                                "penalties": 1,
                                "supports": 10,
                                "tackles": 4,
                                "tryAssists": 1,
                                "tryCause": 3,
                                "evasionRuns": 9,
                                "evasionRunMetres": 63,
                                "dummyHalfRunMetres": 8,
                                "ptbFast": 28.57,
                                "ptbNeutral": 71.43,
                                "ptbAll": 7
                            },
                            "playerTookTheField": true,
                            "shirtNum": 19
                        },
                        {
                            "playerFirstName": "John",
                            "playerId": 500891,
                            "playerLastName": "Folau",
                            "playerName": "John Folau",
                            "playerPosition": "Centre 2",
                            "playerPositionId": 500004,
                            "playerStats": {
                                "allRunMetres": 114,
                                "allRuns": 10,
                                "fantasyPointsTotal": 51,
                                "ineffectiveTackles": 1,
                                "kickReturnMetres": 40,
                                "kickReturns": 3,
                                "linebreaks": 2,
                                "mins": 80,
                                "missedTackles": 1,
                                "supports": 9,
                                "tackleBreaks": 6,
                                "tries": 2,
                                "tryCause": 3,
                                "evasionRuns": 7,
                                "evasionRunMetres": 74,
                                "ptbFast": 25,
                                "ptbNeutral": 75,
                                "ptbAll": 8
                            },
                            "playerTookTheField": true,
                            "shirtNum": 4
                        },
                        {
                            "playerFirstName": "Reece",
                            "playerId": 500331,
                            "playerLastName": "Robinson",
                            "playerName": "Reece Robinson",
                            "playerPosition": "Winger 2",
                            "playerPositionId": 500005,
                            "playerStats": {
                                "allRunMetres": 57,
                                "allRuns": 10,
                                "bombKicksDefused": 1,
                                "dummyHalfRuns": 1,
                                "errors": 1,
                                "fantasyPointsTotal": 12,
                                "kickReturnMetres": 11,
                                "kickReturns": 3,
                                "kicksDefused": 2,
                                "mins": 80,
                                "missedTackles": 1,
                                "offloads": 1,
                                "oneOnOneTackles": 1,
                                "supports": 12,
                                "tackleBreaks": 2,
                                "tackles": 1,
                                "tryCause": 1,
                                "evasionRuns": 6,
                                "evasionRunMetres": 44,
                                "dummyHalfRunMetres": 2,
                                "ptbFast": 20,
                                "ptbNeutral": 80,
                                "ptbAll": 5
                            },
                            "playerTookTheField": true,
                            "shirtNum": 5
                        },
                        {
                            "playerFirstName": "Corey",
                            "playerId": 500684,
                            "playerLastName": "Norman",
                            "playerName": "Corey Norman",
                            "playerPosition": "Five-eighth",
                            "playerPositionId": 500006,
                            "playerStats": {
                                "allRunMetres": 92,
                                "allRuns": 11,
                                "bombKicks": 1,
                                "bombKickMetres": 26,
                                "decoys": 1,
                                "errors": 1,
                                "fantasyPointsTotal": 44,
                                "ineffectiveTackles": 1,
                                "kickMetres": 101,
                                "kicks": 6,
                                "kicksDefused": 1,
                                "linebreaks": 1,
                                "mins": 80,
                                "missedTackles": 1,
                                "offloads": 1,
                                "oneOnOneTackles": 1,
                                "penalties": 1,
                                "supports": 9,
                                "tackleBreaks": 7,
                                "tackles": 8,
                                "tryCause": 2,
                                "evasionRuns": 11,
                                "evasionRunMetres": 92,
                                "ptbFast": 14.29,
                                "ptbNeutral": 85.71,
                                "ptbAll": 7
                            },
                            "playerTookTheField": true,
                            "shirtNum": 6
                        },
                        {
                            "playerFirstName": "Chris",
                            "playerId": 500691,
                            "playerLastName": "Sandow",
                            "playerName": "Chris Sandow",
                            "playerPosition": "Halfback",
                            "playerPositionId": 500007,
                            "playerStats": {
                                "allRunMetres": 32,
                                "allRuns": 7,
                                "conversions": 3,
                                "conversionsAttempts": 5,
                                "conversionsMissed": 2,
                                "decoys": 1,
                                "fantasyPointsTotal": 54,
                                "fortyTwentyKicks": 1,
                                "goalConversionRate": 16.667,
                                "ineffectiveTackles": 1,
                                "kickMetres": 412,
                                "kickReturnMetres": 2,
                                "kickReturns": 1,
                                "kicks": 15,
                                "kicksDefused": 1,
                                "lineDropouts": 3,
                                "mins": 80,
                                "missedTackles": 1,
                                "oneOnOneTackles": 1,
                                "penaltyGoals": 1,
                                "penaltyGoalsAttempts": 1,
                                "supports": 8,
                                "tackles": 15,
                                "tryAssists": 1,
                                "tryCause": 1,
                                "evasionRuns": 6,
                                "evasionRunMetres": 30,
                                "ptbNeutral": 75,
                                "ptbSlow": 25,
                                "ptbAll": 4
                            },
                            "playerTookTheField": true,
                            "shirtNum": 7
                        },
                        {
                            "playerFirstName": "Danny",
                            "playerId": 503454,
                            "playerLastName": "Wicks",
                            "playerName": "Danny Wicks",
                            "playerPosition": "Prop 1",
                            "playerPositionId": 500008,
                            "playerStats": {
                                "allRunMetres": 118,
                                "allRuns": 15,
                                "decoys": 6,
                                "fantasyPointsTotal": 41,
                                "hitUps": 15,
                                "ineffectiveTackles": 1,
                                "mins": 53,
                                "missedTackles": 1,
                                "oneOnOneTackles": 2,
                                "supports": 4,
                                "tackleBreaks": 1,
                                "tackles": 29,
                                "tryCause": 1,
                                "hitupRunMeters": 118,
                                "ptbFast": 21.43,
                                "ptbNeutral": 71.43,
                                "ptbSlow": 7.14,
                                "ptbAll": 14
                            },
                            "playerTookTheField": true,
                            "shirtNum": 16
                        },
                        {
                            "playerFirstName": "Nathan",
                            "playerId": 500688,
                            "playerLastName": "Peats",
                            "playerName": "Nathan Peats",
                            "playerPosition": "Hooker",
                            "playerPositionId": 500009,
                            "playerStats": {
                                "allRunMetres": 34,
                                "allRuns": 6,
                                "decoys": 1,
                                "dummyHalfRuns": 2,
                                "errors": 1,
                                "fantasyPointsTotal": 65,
                                "hitUps": 2,
                                "linebreakAssists": 1,
                                "linebreaks": 1,
                                "mins": 70,
                                "missedTackles": 3,
                                "oneOnOneTackles": 2,
                                "penalties": 1,
                                "supports": 4,
                                "tackleBreaks": 2,
                                "tackles": 39,
                                "tries": 2,
                                "tryAssists": 1,
                                "hitupRunMeters": 15,
                                "evasionRuns": 2,
                                "evasionRunMetres": 5,
                                "dummyHalfRunMetres": 14,
                                "ptbNeutral": 100,
                                "ptbAll": 5
                            },
                            "playerTookTheField": true,
                            "shirtNum": 9
                        },
                        {
                            "playerFirstName": "Tim",
                            "playerId": 500679,
                            "playerLastName": "Mannah",
                            "playerName": "Tim Mannah",
                            "playerPosition": "Prop 2",
                            "playerPositionId": 500010,
                            "playerStats": {
                                "allRunMetres": 162,
                                "allRuns": 16,
                                "decoys": 5,
                                "fantasyPointsTotal": 51,
                                "hitUps": 13,
                                "kickReturnMetres": 60,
                                "kickReturns": 3,
                                "mins": 55,
                                "offloads": 1,
                                "penalties": 1,
                                "supports": 3,
                                "tackleBreaks": 1,
                                "tackles": 32,
                                "hitupRunMeters": 102,
                                "ptbFast": 7.14,
                                "ptbNeutral": 92.86,
                                "ptbAll": 14
                            },
                            "playerTookTheField": true,
                            "shirtNum": 10
                        },
                        {
                            "playerFirstName": "Manu",
                            "playerId": 500680,
                            "playerLastName": "Ma'u",
                            "playerName": "Manu Ma'u",
                            "playerPosition": "2nd Row 1",
                            "playerPositionId": 500011,
                            "playerStats": {
                                "allRunMetres": 123,
                                "allRuns": 16,
                                "decoys": 4,
                                "fantasyPointsTotal": 27,
                                "hitUps": 14,
                                "ineffectiveTackles": 2,
                                "mins": 80,
                                "missedTackles": 2,
                                "oneOnOneTackles": 2,
                                "penalties": 1,
                                "supports": 6,
                                "tackles": 21,
                                "hitupRunMeters": 105,
                                "evasionRuns": 2,
                                "evasionRunMetres": 18,
                                "ptbFast": 35.71,
                                "ptbNeutral": 64.29,
                                "ptbAll": 14
                            },
                            "playerTookTheField": true,
                            "shirtNum": 11
                        },
                        {
                            "playerFirstName": "David",
                            "playerId": 500031,
                            "playerLastName": "Gower",
                            "playerName": "David Gower",
                            "playerPosition": "2nd Row 2",
                            "playerPositionId": 500012,
                            "playerStats": {
                                "allRunMetres": 100,
                                "allRuns": 11,
                                "decoys": 1,
                                "errors": 1,
                                "fantasyPointsTotal": 51,
                                "hitUps": 10,
                                "mins": 55,
                                "offloads": 3,
                                "oneOnOneTackles": 1,
                                "supports": 2,
                                "tackleBreaks": 2,
                                "tackles": 31,
                                "hitupRunMeters": 95,
                                "evasionRuns": 1,
                                "evasionRunMetres": 5,
                                "ptbNeutral": 100,
                                "ptbAll": 7
                            },
                            "playerTookTheField": true,
                            "shirtNum": 12
                        },
                        {
                            "playerFirstName": "Anthony",
                            "playerId": 500028,
                            "playerLastName": "Watmough",
                            "playerName": "Anthony Watmough",
                            "playerPosition": "Lock",
                            "playerPositionId": 500013,
                            "playerStats": {
                                "allRunMetres": 109,
                                "allRuns": 14,
                                "decoys": 3,
                                "errors": 1,
                                "fantasyPointsTotal": 39,
                                "hitUps": 13,
                                "ineffectiveTackles": 1,
                                "mins": 47,
                                "missedTackles": 2,
                                "offloads": 2,
                                "oneOnOneTackles": 2,
                                "penalties": 1,
                                "supports": 4,
                                "tackles": 33,
                                "hitupRunMeters": 102,
                                "evasionRuns": 1,
                                "evasionRunMetres": 7,
                                "ptbFast": 10,
                                "ptbNeutral": 90,
                                "ptbAll": 10
                            },
                            "playerTookTheField": true,
                            "shirtNum": 13
                        },
                        {
                            "playerFirstName": "Isaac",
                            "playerId": 500789,
                            "playerLastName": "De Gois",
                            "playerName": "Isaac De Gois",
                            "playerPosition": "Interchange",
                            "playerPositionId": 500014,
                            "playerStats": {
                                "allRunMetres": 10,
                                "allRuns": 2,
                                "dummyHalfRuns": 1,
                                "fantasyPointsTotal": 17,
                                "hitUps": 1,
                                "mins": 31,
                                "missedTackles": 1,
                                "oneOnOneTackles": 1,
                                "penalties": 1,
                                "supports": 1,
                                "tackles": 20,
                                "hitupRunMeters": 5,
                                "dummyHalfRunMetres": 5,
                                "ptbFast": 100,
                                "ptbAll": 1
                            },
                            "playerTookTheField": true,
                            "shirtNum": 14
                        },
                        {
                            "playerFirstName": "Joseph",
                            "playerId": 500686,
                            "playerLastName": "Paulo",
                            "playerName": "Joseph Paulo",
                            "playerPosition": "Interchange",
                            "playerPositionId": 500014,
                            "playerStats": {
                                "allRunMetres": 65,
                                "allRuns": 11,
                                "decoys": 7,
                                "fantasyPointsTotal": 41,
                                "hitUps": 8,
                                "linebreakAssists": 1,
                                "mins": 57,
                                "offloads": 1,
                                "supports": 7,
                                "tackles": 31,
                                "hitupRunMeters": 51,
                                "evasionRuns": 3,
                                "evasionRunMetres": 14,
                                "ptbFast": 28.57,
                                "ptbNeutral": 57.14,
                                "ptbSlow": 14.29,
                                "ptbAll": 7
                            },
                            "playerTookTheField": true,
                            "shirtNum": 15
                        },
                        {
                            "playerFirstName": "Peni",
                            "playerId": 500696,
                            "playerLastName": "Terepo",
                            "playerName": "Peni Terepo",
                            "playerPosition": "Interchange",
                            "playerPositionId": 500014,
                            "playerStats": {
                                "allRunMetres": 92,
                                "allRuns": 11,
                                "decoys": 5,
                                "fantasyPointsTotal": 31,
                                "hitUps": 11,
                                "ineffectiveTackles": 1,
                                "kickMetres": 4,
                                "kicks": 1,
                                "linebreaks": 1,
                                "mins": 27,
                                "offloads": 1,
                                "supports": 1,
                                "tackles": 16,
                                "hitupRunMeters": 92,
                                "ptbFast": 30,
                                "ptbNeutral": 70,
                                "ptbAll": 10
                            },
                            "playerTookTheField": true,
                            "shirtNum": 17
                        },
                        {
                            "playerFirstName": "Richie",
                            "playerId": 500577,
                            "playerLastName": "Fa'aoso",
                            "playerName": "Richie Fa'aoso",
                            "playerPosition": "Interchange",
                            "playerPositionId": 500014,
                            "playerStats": {
                                "allRunMetres": 18,
                                "allRuns": 2,
                                "fantasyPointsTotal": 2,
                                "hitUps": 2,
                                "mins": 5,
                                "missedTackles": 1,
                                "tackles": 3,
                                "hitupRunMeters": 18,
                                "ptbNeutral": 100,
                                "ptbAll": 2
                            },
                            "playerTookTheField": true,
                            "shirtNum": 18
                        }
                    ]
                },
                "teamName": "Parramatta Eels",
                "teamNickName": "Eels",
                "teamStats": {
                    "allRunMetres": 1407,
                    "allRuns": 178,
                    "bombKicks": 1,
                    "bombKickMetres": 26,
                    "bombKicksDefused": 1,
                    "completeSets": 29,
                    "completionPercentage": 78,
                    "conversions": 3,
                    "conversionsAttempts": 5,
                    "conversionsMissed": 2,
                    "decoys": 35,
                    "dummyHalfRuns": 11,
                    "errors": 6,
                    "fortyTwentyKicks": 1,
                    "hitUps": 89,
                    "incompleteSets": 8,
                    "ineffectiveTackles": 9,
                    "kickMetres": 517,
                    "kickReturnMetres": 140,
                    "kickReturns": 13,
                    "kicks": 22,
                    "kicksDefused": 4,
                    "lineDropouts": 3,
                    "linebreakAssists": 3,
                    "linebreaks": 5,
                    "missedTackles": 18,
                    "oneOnOneTackles": 18,
                    "penalties": 8,
                    "penaltyGoals": 1,
                    "penaltyGoalsAttempts": 1,
                    "points": 28,
                    "pointsConceded": 22,
                    "possession": 46,
                    "scrumWins": 5,
                    "supports": 99,
                    "tackleBreaks": 24,
                    "tackles": 315,
                    "sets": 37,
                    "tries": 5,
                    "triesConceded": 4,
                    "tryAssists": 3,
                    "offloads": 13,
                    "hitupRunMeters": 704,
                    "evasionRuns": 65,
                    "evasionRunMetres": 487,
                    "dummyHalfRunMetres": 76,
                    "ptbFast": 20,
                    "ptbNeutral": 78,
                    "ptbSlow": 2,
                    "ptbTotal": 139
                }
            }
        ]
    }
}