{
    "vod": [
        {
            "id": "J3NzkxYzE6U85bWAMDM7MpZfuGIV1Dmp",
            "contentId": 926809,
            "title": "Rd 20: Cowboys v Warriors (Hls)",
            "description": "Highlights of the clash between the Cowboys & Warriors",
            "publishDate": "2017-07-22T21:24:17+10:00",
            "publisher": "NRL Chief",
            "thumbnailUrl": "http://bpvideos.telstra.insnw.net/web/images/20170722211738a_89x50.jpg",
            "largeThumbnailUrl": "http://bpvideos.telstra.insnw.net/web/images/20170722211738a_326x184.jpg",
            "programType": "Highlights",
            "programCategory": "Match",
            "priority": null,
            "lastUpdateDate": "2017-07-22T21:29:19+10:00",
            "isPremium": false,
            "club": [
                500012,
                500032
            ]
        },
        {
            "id": "RsZTkxYzE6QwpFGykTxtjoeGF6NC44kB",
            "contentId": 926950,
            "title": "Rd 20 Press Conference: Cowboys",
            "description": "Cowboys coach Paul Green speaks with the media following their Round 20 clash",
            "publishDate": "2017-07-22T21:57:58+10:00",
            "publisher": "NRL Chief",
            "thumbnailUrl": "http://bpvideos.telstra.insnw.net/web/images/20170722214338a_89x50.jpg",
            "largeThumbnailUrl": "http://bpvideos.telstra.insnw.net/web/images/20170722214338a_326x184.jpg",
            "programType": "Press Conference",
            "programCategory": null,
            "priority": null,
            "lastUpdateDate": "2017-07-22T22:03:28+10:00",
            "isPremium": false,
            "club": [
                500012,
                500032
            ]
        },
        {
            "id": "Y2ZjkxYzE6mOp-gl5ivKhhW_HvaWBsQ2",
            "contentId": 926957,
            "title": "Rd 20 Press Conference: Warriors",
            "description": "Warriors coach Stephen Kearney speaks with the media following their Round 20 clash",
            "publishDate": "2017-07-22T21:24:51+10:00",
            "publisher": "NRL Chief",
            "thumbnailUrl": "http://bpvideos.telstra.insnw.net/web/images/20170722220020a_89x50.jpg",
            "largeThumbnailUrl": "http://bpvideos.telstra.insnw.net/web/images/20170722220020a_326x184.jpg",
            "programType": "Press Conference",
            "programCategory": null,
            "priority": null,
            "lastUpdateDate": "2017-07-22T22:05:29+10:00",
            "isPremium": false,
            "club": [
                500012,
                500032
            ]
        },
        {
            "id": "xkNjkxYzE6VHmzrkb51Q-zX4w29XxblN",
            "contentId": 926942,
            "title": "Rd 20: GOAL Ethan Lowe (80th min)",
            "description": "Ethan Lowe converts the try of Javid Bowen",
            "publishDate": "2017-07-22T21:17:39+10:00",
            "publisher": "NRL Chief",
            "thumbnailUrl": "http://bpvideos.telstra.insnw.net/web/images/20170722211710a_89x50.jpg",
            "largeThumbnailUrl": "http://bpvideos.telstra.insnw.net/web/images/20170722211710a_326x184.jpg",
            "programType": "Instant Replay",
            "programCategory": "Score",
            "priority": null,
            "lastUpdateDate": "2017-07-22T21:21:17+10:00",
            "isPremium": true,
            "club": [
                500012,
                500032
            ]
        },
        {
            "id": "xiNjkxYzE6a2GmnsSZYS290mcQYQQQay",
            "contentId": 926940,
            "title": "Rd 20: TRY Javid Bowen (80th min)",
            "description": "Javid Bowen runs the length of the field to seal the win with his second try",
            "publishDate": "2017-07-22T21:16:55+10:00",
            "publisher": "NRL Chief",
            "thumbnailUrl": "http://bpvideos.telstra.insnw.net/web/images/20170722211653a_89x50.jpg",
            "largeThumbnailUrl": "http://bpvideos.telstra.insnw.net/web/images/20170722211653a_326x184.jpg",
            "programType": "Instant Replay",
            "programCategory": "Score",
            "priority": null,
            "lastUpdateDate": "2017-07-22T21:21:17+10:00",
            "isPremium": true,
            "club": [
                500012,
                500032
            ]
        },
        {
            "id": "VsMDkxYzE66CiacPOcJeS1HBLGJEPjxW",
            "contentId": 926937,
            "title": "Rd 20: TRY Ethan Lowe (58th min)",
            "description": "Ethan Lowe crosses for his first try of 2017",
            "publishDate": "2017-07-22T20:55:02+10:00",
            "publisher": "NRL Chief",
            "thumbnailUrl": "http://bpvideos.telstra.insnw.net/web/images/20170722205457a_89x50.jpg",
            "largeThumbnailUrl": "http://bpvideos.telstra.insnw.net/web/images/20170722205457a_326x184.jpg",
            "programType": "Instant Replay",
            "programCategory": "Score",
            "priority": null,
            "lastUpdateDate": "2017-07-22T20:59:12+10:00",
            "isPremium": true,
            "club": [
                500012,
                500032
            ]
        },
        {
            "id": "1qeDgxYzE6UaJ4u4M3LyDImHazcB40zY",
            "contentId": 926927,
            "title": "Rd 20: PENALTY GOAL Ethan Lowe (52nd min)",
            "description": "Ethan Lowe kicks the Cowboys two points clear",
            "publishDate": "2017-07-22T20:47:27+10:00",
            "publisher": "NRL Chief",
            "thumbnailUrl": "http://bpvideos.telstra.insnw.net/web/images/20170722204659a_89x50.jpg",
            "largeThumbnailUrl": "http://bpvideos.telstra.insnw.net/web/images/20170722204659a_326x184.jpg",
            "programType": "Instant Replay",
            "programCategory": "Score",
            "priority": null,
            "lastUpdateDate": "2017-07-22T20:51:11+10:00",
            "isPremium": true,
            "club": [
                500012,
                500032
            ]
        },
        {
            "id": "hmcjgxYzE6bADSIiwDO7tB4U0P3qNHcO",
            "contentId": 926908,
            "title": "Rd 20: GOAL Issac Luke (40th min)",
            "description": "Issac Luke converts Simon Mannering's try",
            "publishDate": "2017-07-22T20:22:41+10:00",
            "publisher": "NRL Chief",
            "thumbnailUrl": "http://bpvideos.telstra.insnw.net/web/images/20170722202236a_89x50.jpg",
            "largeThumbnailUrl": "http://bpvideos.telstra.insnw.net/web/images/20170722202236a_326x184.jpg",
            "programType": "Instant Replay",
            "programCategory": "Score",
            "priority": null,
            "lastUpdateDate": "2017-07-22T20:26:05+10:00",
            "isPremium": true,
            "club": [
                500012,
                500032
            ]
        },
        {
            "id": "0xcjgxYzE6-LipdOJz2s4URrL7dBUDVI",
            "contentId": 926906,
            "title": "Rd 20: TRY Simon Mannering (40th min)",
            "description": "Simon Mannering crashes over right on half time",
            "publishDate": "2017-07-22T20:21:05+10:00",
            "publisher": "NRL Chief",
            "thumbnailUrl": "http://bpvideos.telstra.insnw.net/web/images/20170722202104a_89x50.jpg",
            "largeThumbnailUrl": "http://bpvideos.telstra.insnw.net/web/images/20170722202104a_326x184.jpg",
            "programType": "Instant Replay",
            "programCategory": "Score",
            "priority": null,
            "lastUpdateDate": "2017-07-22T20:25:05+10:00",
            "isPremium": true,
            "club": [
                500012,
                500032
            ]
        },
        {
            "id": "d3cTgxYzE69Sq-UXRZ_4X_W3DXqyHXPe",
            "contentId": 926904,
            "title": "Rd 20: GOAL Ethan Lowe (39th min)",
            "description": "Ethan Lowe converts the try of Javid Bowen",
            "publishDate": "2017-07-22T20:20:42+10:00",
            "publisher": "NRL Chief",
            "thumbnailUrl": "http://bpvideos.telstra.insnw.net/web/images/20170722202029a_89x50.jpg",
            "largeThumbnailUrl": "http://bpvideos.telstra.insnw.net/web/images/20170722202029a_326x184.jpg",
            "programType": "Instant Replay",
            "programCategory": "Score",
            "priority": null,
            "lastUpdateDate": "2017-07-22T20:24:04+10:00",
            "isPremium": true,
            "club": [
                500012,
                500032
            ]
        },
        {
            "id": "p1cTgxYzE6aB65NSqBYOLjMbWeA3gMEu",
            "contentId": 926903,
            "title": "Rd 20: TRY Javid Bowen (38th min)",
            "description": "Javid Bowen crosses for the Cowboys' second try",
            "publishDate": "2017-07-22T20:19:50+10:00",
            "publisher": "NRL Chief",
            "thumbnailUrl": "http://bpvideos.telstra.insnw.net/web/images/20170722201956a_89x50.jpg",
            "largeThumbnailUrl": "http://bpvideos.telstra.insnw.net/web/images/20170722201956a_326x184.jpg",
            "programType": "Instant Replay",
            "programCategory": "Score",
            "priority": null,
            "lastUpdateDate": "2017-07-22T20:24:04+10:00",
            "isPremium": true,
            "club": [
                500012,
                500032
            ]
        },
        {
            "id": "IwbTgxYzE6Fe-D0pCbz4erYonwf8dWv4",
            "contentId": 926897,
            "title": "Rd 20: GOAL Ethan Lowe (21st min)",
            "description": "Ethan Lowe converts the try of Justin O'Neill",
            "publishDate": "2017-07-22T19:55:46+10:00",
            "publisher": "NRL Chief",
            "thumbnailUrl": "http://bpvideos.telstra.insnw.net/web/images/20170722195536a_89x50.jpg",
            "largeThumbnailUrl": "http://bpvideos.telstra.insnw.net/web/images/20170722195536a_326x184.jpg",
            "programType": "Instant Replay",
            "programCategory": "Score",
            "priority": null,
            "lastUpdateDate": "2017-07-22T19:59:59+10:00",
            "isPremium": true,
            "club": [
                500012,
                500032
            ]
        },
        {
            "id": "lwbDgxYzE6mpMZYA4WyAig3s17K2dLcm",
            "contentId": 926896,
            "title": "Rd 20: TRY Justin O'Neill (20th min)",
            "description": "Justin O'Neill scores the Cowboys' first try",
            "publishDate": "2017-07-22T19:54:17+10:00",
            "publisher": "NRL Chief",
            "thumbnailUrl": "http://bpvideos.telstra.insnw.net/web/images/20170722195416a_89x50.jpg",
            "largeThumbnailUrl": "http://bpvideos.telstra.insnw.net/web/images/20170722195416a_326x184.jpg",
            "programType": "Instant Replay",
            "programCategory": "Score",
            "priority": null,
            "lastUpdateDate": "2017-07-22T19:57:58+10:00",
            "isPremium": true,
            "club": [
                500012,
                500032
            ]
        },
        {
            "id": "E0azgxYzE6RUItc9kdRdhjTVpTPKnIcw",
            "contentId": 926893,
            "title": "Rd 20: GOAL Issac Luke (11th min)",
            "description": "Issac Luke converts the try of Bunty Afoa",
            "publishDate": "2017-07-22T19:44:41+10:00",
            "publisher": "NRL Chief",
            "thumbnailUrl": "http://bpvideos.telstra.insnw.net/web/images/20170722194419a_89x50.jpg",
            "largeThumbnailUrl": "http://bpvideos.telstra.insnw.net/web/images/20170722194419a_326x184.jpg",
            "programType": "Instant Replay",
            "programCategory": "Score",
            "priority": null,
            "lastUpdateDate": "2017-07-22T21:31:19+10:00",
            "isPremium": true,
            "club": [
                500012,
                500032
            ]
        },
        {
            "id": "EyazgxYzE6pSyVDPamJjsPItxOjqY6kG",
            "contentId": 926892,
            "title": "Rd 20: TRY Bunty Afoa (10th min)",
            "description": "The Warriors forward crosses early in Townsville",
            "publishDate": "2017-07-22T19:44:07+10:00",
            "publisher": "NRL Chief",
            "thumbnailUrl": "http://bpvideos.telstra.insnw.net/web/images/20170722194402a_89x50.jpg",
            "largeThumbnailUrl": "http://bpvideos.telstra.insnw.net/web/images/20170722194402a_326x184.jpg",
            "programType": "Instant Replay",
            "programCategory": "Score",
            "priority": null,
            "lastUpdateDate": "2017-07-22T21:31:19+10:00",
            "isPremium": true,
            "club": [
                500012,
                500032
            ]
        }
    ],
    "scores": [
        {
            "gameState": "First Half",
            "gameStateId": 3,
            "gameTime": "0:19:15",
            "gameSeconds": 1155,
            "GameMinutes": "19:15",
            "playerId": 500605,
            "playerName": "Justin O'Neill",
            "scoreMethod": "Try",
            "statEvent": "Try",
            "statId": 38,
            "statValue": 4,
            "vidRef": 29373,
            "homeScore": 4,
            "awayScore": 6,
            "commentary": "Try by Justin O'Neill",
            "tackleNum": 6,
            "teamId": 500012,
            "teamName": "North Queensland Cowboys",
            "homeTeamAbbrv": "NQL",
            "awayTeamAbbrv": "WAR"
        },
        {
            "gameState": "First Half",
            "gameStateId": 3,
            "gameTime": "0:20:45",
            "gameSeconds": 1245,
            "GameMinutes": "20:45",
            "playerId": 500289,
            "playerName": "Ethan Lowe",
            "scoreMethod": "Conversion",
            "statEvent": "Conversion-Made",
            "statId": 1,
            "statValue": 2,
            "vidRef": 31886,
            "homeScore": 6,
            "awayScore": 6,
            "commentary": "Conversion-Made by Ethan Lowe",
            "tackleNum": -1,
            "teamId": 500012,
            "teamName": "North Queensland Cowboys",
            "homeTeamAbbrv": "NQL",
            "awayTeamAbbrv": "WAR"
        },
        {
            "gameState": "First Half",
            "gameStateId": 3,
            "gameTime": "0:36:57",
            "gameSeconds": 2217,
            "GameMinutes": "36:57",
            "playerId": 500279,
            "playerName": "Javid Bowen",
            "scoreMethod": "Try",
            "statEvent": "Try",
            "statId": 38,
            "statValue": 4,
            "vidRef": 57932,
            "homeScore": 10,
            "awayScore": 6,
            "commentary": "Try by Javid Bowen",
            "tackleNum": 5,
            "teamId": 500012,
            "teamName": "North Queensland Cowboys",
            "homeTeamAbbrv": "NQL",
            "awayTeamAbbrv": "WAR"
        },
        {
            "gameState": "First Half",
            "gameStateId": 3,
            "gameTime": "0:38:12",
            "gameSeconds": 2292,
            "GameMinutes": "38:12",
            "playerId": 500289,
            "playerName": "Ethan Lowe",
            "scoreMethod": "Conversion",
            "statEvent": "Conversion-Made",
            "statId": 1,
            "statValue": 2,
            "vidRef": 61245,
            "homeScore": 12,
            "awayScore": 6,
            "commentary": "Conversion-Made by Ethan Lowe",
            "tackleNum": -1,
            "teamId": 500012,
            "teamName": "North Queensland Cowboys",
            "homeTeamAbbrv": "NQL",
            "awayTeamAbbrv": "WAR"
        },
        {
            "gameState": "Second Half",
            "gameStateId": 5,
            "gameTime": "0:50:59",
            "gameSeconds": 3059,
            "GameMinutes": "50:59",
            "playerId": 500289,
            "playerName": "Ethan Lowe",
            "scoreMethod": "Penalty Goal",
            "statEvent": "Penalty Shot-Made",
            "statId": 67,
            "statValue": 2,
            "vidRef": 83767,
            "homeScore": 14,
            "awayScore": 12,
            "commentary": "Penalty Shot-Made by Ethan Lowe",
            "tackleNum": -1,
            "teamId": 500012,
            "teamName": "North Queensland Cowboys",
            "homeTeamAbbrv": "NQL",
            "awayTeamAbbrv": "WAR"
        },
        {
            "gameState": "Second Half",
            "gameStateId": 5,
            "gameTime": "0:57:54",
            "gameSeconds": 3474,
            "GameMinutes": "57:54",
            "playerId": 500289,
            "playerName": "Ethan Lowe",
            "scoreMethod": "Try",
            "statEvent": "Try",
            "statId": 38,
            "statValue": 4,
            "vidRef": 94590,
            "homeScore": 18,
            "awayScore": 12,
            "commentary": "Try by Ethan Lowe",
            "tackleNum": 5,
            "teamId": 500012,
            "teamName": "North Queensland Cowboys",
            "homeTeamAbbrv": "NQL",
            "awayTeamAbbrv": "WAR"
        },
        {
            "gameState": "Second Half",
            "gameStateId": 5,
            "gameTime": "1:19:47",
            "gameSeconds": 4787,
            "GameMinutes": "79:47",
            "playerId": 500279,
            "playerName": "Javid Bowen",
            "scoreMethod": "Try",
            "statEvent": "Try",
            "statId": 38,
            "statValue": 4,
            "vidRef": 128856,
            "homeScore": 22,
            "awayScore": 12,
            "commentary": "Try by Javid Bowen",
            "tackleNum": 1,
            "teamId": 500012,
            "teamName": "North Queensland Cowboys",
            "homeTeamAbbrv": "NQL",
            "awayTeamAbbrv": "WAR"
        },
        {
            "gameState": "Second Half",
            "gameStateId": 5,
            "gameTime": "1:19:58",
            "gameSeconds": 4798,
            "GameMinutes": "79:58",
            "playerId": 500289,
            "playerName": "Ethan Lowe",
            "scoreMethod": "Conversion",
            "statEvent": "Conversion-Made",
            "statId": 1,
            "statValue": 2,
            "vidRef": 130590,
            "homeScore": 24,
            "awayScore": 12,
            "commentary": "Conversion-Made by Ethan Lowe",
            "tackleNum": -1,
            "teamId": 500012,
            "teamName": "North Queensland Cowboys",
            "homeTeamAbbrv": "NQL",
            "awayTeamAbbrv": "WAR"
        },
        {
            "gameState": "First Half",
            "gameStateId": 3,
            "gameTime": "0:08:56",
            "gameSeconds": 536,
            "GameMinutes": "08:56",
            "playerId": 501744,
            "playerName": "Bunty Afoa",
            "scoreMethod": "Try",
            "statEvent": "Try",
            "statId": 38,
            "statValue": 4,
            "vidRef": 13420,
            "awayScore": 4,
            "commentary": "Try by Bunty Afoa",
            "tackleNum": 3,
            "teamId": 500032,
            "teamName": "New Zealand Warriors",
            "homeTeamAbbrv": "NQL",
            "awayTeamAbbrv": "WAR"
        },
        {
            "gameState": "First Half",
            "gameStateId": 3,
            "gameTime": "0:10:26",
            "gameSeconds": 626,
            "GameMinutes": "10:26",
            "playerId": 500088,
            "playerName": "Issac Luke",
            "scoreMethod": "Conversion",
            "statEvent": "Conversion-Made",
            "statId": 1,
            "statValue": 2,
            "vidRef": 15756,
            "awayScore": 6,
            "commentary": "Conversion-Made by Issac Luke",
            "tackleNum": -1,
            "teamId": 500032,
            "teamName": "New Zealand Warriors",
            "homeTeamAbbrv": "NQL",
            "awayTeamAbbrv": "WAR"
        },
        {
            "gameState": "First Half",
            "gameStateId": 3,
            "gameTime": "0:39:40",
            "gameSeconds": 2380,
            "GameMinutes": "39:40",
            "playerId": 500712,
            "playerName": "Simon Mannering",
            "scoreMethod": "Try",
            "statEvent": "Try",
            "statId": 38,
            "statValue": 4,
            "vidRef": 64422,
            "homeScore": 12,
            "awayScore": 10,
            "commentary": "Try by Simon Mannering",
            "tackleNum": 4,
            "teamId": 500032,
            "teamName": "New Zealand Warriors",
            "homeTeamAbbrv": "NQL",
            "awayTeamAbbrv": "WAR"
        },
        {
            "gameState": "First Half",
            "gameStateId": 3,
            "gameTime": "0:40:00",
            "gameSeconds": 2400,
            "GameMinutes": "40:00",
            "playerId": 500088,
            "playerName": "Issac Luke",
            "scoreMethod": "Conversion",
            "statEvent": "Conversion-Made",
            "statId": 1,
            "statValue": 2,
            "vidRef": 66777,
            "homeScore": 12,
            "awayScore": 12,
            "commentary": "Conversion-Made by Issac Luke",
            "tackleNum": -1,
            "teamId": 500032,
            "teamName": "New Zealand Warriors",
            "homeTeamAbbrv": "NQL",
            "awayTeamAbbrv": "WAR"
        }
    ],
    "twitter": [
        {
            "id": "888704942021648384",
            "gameSeconds": 2220
        },
        {
            "id": "888704722470699008",
            "gameSeconds": 2220
        },
        {
            "id": "888701933464059904",
            "gameSeconds": 1860
        },
        {
            "id": "888701703255502848",
            "gameSeconds": 1860
        }
    ]
}