{
    "vod": [
        {
            "id": "dscmw1djoHdiWn6Ubln2WXEFGrdyCkEy",
            "contentId": 768017,
            "title": "Rd 18: Bulldogs v Broncos (1)",
            "description": "1st half replay of the match between the Bulldogs & Broncos",
            "publishDate": "2015-07-12T09:30:02+10:00",
            "publisher": "NRL Chief",
            "thumbnailUrl": "http://bigpondvideo.com/Web/Images/Content/20150711214727a_89x50.jpg",
            "largeThumbnailUrl": "http://bigpondvideo.com/Web/Images/Content/20150711214727a_326x184.jpg",
            "programType": "Matches",
            "programCategory": "Replay: 1st Half",
            "priority": null,
            "lastUpdateDate": "2015-07-12T13:44:00+10:00",
            "isPremium": true,
            "club": [
                500011,
                500010
            ]
        },
        {
            "id": "14eWs1djp-s_012CuTejHNB5NuyE4QK5",
            "contentId": 767974,
            "title": "Rd 18: Bulldogs v Broncos (Hls)",
            "description": "Highlights of the match between the Bulldogs & Broncos from ANZ Stadium",
            "publishDate": "2015-07-11T21:45:00+10:00",
            "publisher": "NRL Chief",
            "thumbnailUrl": "http://bigpondvideo.com/Web/Images/Content/20150711214139a_89x50.jpg",
            "largeThumbnailUrl": "http://bigpondvideo.com/Web/Images/Content/20150711214139a_326x184.jpg",
            "programType": "Highlights",
            "programCategory": "Match",
            "priority": null,
            "lastUpdateDate": "2015-07-11T21:49:18+10:00",
            "isPremium": false,
            "club": [
                500011,
                500010
            ]
        },
        {
            "id": "h4Ymw1djqcbn1ZTGKzcvHpwxTO2dgFWv",
            "contentId": 767999,
            "title": "Rd 18 Press Conference: Broncos",
            "description": "The Broncos coach faces the media following the match",
            "publishDate": "2015-07-11T22:18:00+10:00",
            "publisher": "NRL Chief",
            "thumbnailUrl": "http://bigpondvideo.com/Web/Images/Content/20150711215418a_89x50.jpg",
            "largeThumbnailUrl": "http://bigpondvideo.com/Web/Images/Content/20150711215418a_326x184.jpg",
            "programType": "Press Conference",
            "programCategory": null,
            "priority": null,
            "lastUpdateDate": "2015-07-11T22:26:28+10:00",
            "isPremium": false,
            "club": [
                500011,
                500010
            ]
        },
        {
            "id": "huOWw1djoyz53RKwz8KVgggN3FnqCOuG",
            "contentId": 767998,
            "title": "Rd 18 Press Conference: Bulldogs",
            "description": "The Bulldogs coach faces the media following the match",
            "publishDate": "2015-07-11T22:13:00+10:00",
            "publisher": "NRL Chief",
            "thumbnailUrl": "http://bigpondvideo.com/Web/Images/Content/20150711220115a_89x50.jpg",
            "largeThumbnailUrl": "http://bigpondvideo.com/Web/Images/Content/20150711220115a_326x184.jpg",
            "programType": "Press Conference",
            "programCategory": null,
            "priority": null,
            "lastUpdateDate": "2015-07-11T22:20:30+10:00",
            "isPremium": false,
            "club": [
                500011,
                500010
            ]
        },
        {
            "id": "s1b2s1djqM1IwJjuNQcKeGCq0ZRo5y6i",
            "contentId": 769133,
            "title": "Rd 18: GOAL Corey Parker (62nd min)",
            "description": "Conversion sees the Broncos lead 16-8",
            "publishDate": "2015-07-11T21:13:00+10:00",
            "publisher": "NRL Chief",
            "thumbnailUrl": "http://bigpondvideo.com/Web/Images/Content/20150711211239a_89x50.jpg",
            "largeThumbnailUrl": "http://bigpondvideo.com/Web/Images/Content/20150711211239a_326x184.jpg",
            "programType": "Instant Replay",
            "programCategory": "Score",
            "priority": 1,
            "lastUpdateDate": "2015-07-11T21:36:13+10:00",
            "isPremium": true,
            "club": [
                500011,
                500010
            ]
        },
        {
            "id": "Jlbms1djrffM7zhMqYCxnbc8wbhhgoQz",
            "contentId": 769134,
            "title": "Rd 18: TRY Adam Blair (61st min)",
            "description": "Broncos extend their lead as Adam Blair burrows over from close range",
            "publishDate": "2015-07-11T21:11:00+10:00",
            "publisher": "NRL Chief",
            "thumbnailUrl": "http://bigpondvideo.com/Web/Images/Content/20150711211100a_89x50.jpg",
            "largeThumbnailUrl": "http://bigpondvideo.com/Web/Images/Content/20150711211100a_326x184.jpg",
            "programType": "Instant Replay",
            "programCategory": "Score",
            "priority": 2,
            "lastUpdateDate": "2015-07-11T21:35:13+10:00",
            "isPremium": true,
            "club": [
                500011,
                500010
            ]
        },
        {
            "id": "Jhams1djojpW6Hvb9E-AsTYXPKaS2RWQ",
            "contentId": 769132,
            "title": "Rd 18: TRY Shaun Lane (50th min)",
            "description": "Bulldogs strike back as Shaun Lane powers over from close range",
            "publishDate": "2015-07-11T20:58:00+10:00",
            "publisher": "NRL Chief",
            "thumbnailUrl": "http://bigpondvideo.com/Web/Images/Content/20150711205742a_89x50.jpg",
            "largeThumbnailUrl": "http://bigpondvideo.com/Web/Images/Content/20150711205742a_326x184.jpg",
            "programType": "Instant Replay",
            "programCategory": "Score",
            "priority": 3,
            "lastUpdateDate": "2015-07-11T21:34:12+10:00",
            "isPremium": true,
            "club": [
                500011,
                500010
            ]
        },
        {
            "id": "BxOWs1djr1NYv5GLqY06fLSLXbycM79-",
            "contentId": 769142,
            "title": "Rd 18: GOAL Jordan Kahu (36th min)",
            "description": "Conversion sees the Broncos lead 10-4",
            "publishDate": "2015-07-11T20:23:20+10:00",
            "publisher": "NRL Chief",
            "thumbnailUrl": "http://bigpondvideo.com/Web/Images/Content/20150711202314a_89x50.jpg",
            "largeThumbnailUrl": "http://bigpondvideo.com/Web/Images/Content/20150711202314a_326x184.jpg",
            "programType": "Instant Replay",
            "programCategory": "Score",
            "priority": 4,
            "lastUpdateDate": "2015-07-11T21:34:12+10:00",
            "isPremium": true,
            "club": [
                500011,
                500010
            ]
        },
        {
            "id": "UxOGs1djp5fPo0__dBpYFOvOiH5mVj-X",
            "contentId": 769140,
            "title": "Rd 18: TRY Sam Thaiday (36th min)",
            "description": "Great short ball by Anthony Milford sends Sam Thaiday over for the Broncos",
            "publishDate": "2015-07-11T20:22:10+10:00",
            "publisher": "NRL Chief",
            "thumbnailUrl": "http://bigpondvideo.com/Web/Images/Content/20150711202304a_89x50.jpg",
            "largeThumbnailUrl": "http://bigpondvideo.com/Web/Images/Content/20150711202304a_326x184.jpg",
            "programType": "Instant Replay",
            "programCategory": "Score",
            "priority": 5,
            "lastUpdateDate": "2015-07-11T21:33:12+10:00",
            "isPremium": true,
            "club": [
                500011,
                500010
            ]
        },
        {
            "id": "VzM2s1djrQHls-gL07OvXosHlqBC72eR",
            "contentId": 769141,
            "title": "Rd 18: TRY Josh Morris (26th min)",
            "description": "Bulldogs keep the ball alive and the twins combine to send Josh Morris over to score",
            "publishDate": "2015-07-11T20:13:00+10:00",
            "publisher": "NRL Chief",
            "thumbnailUrl": "http://bigpondvideo.com/Web/Images/Content/20150711201151a_89x50.jpg",
            "largeThumbnailUrl": "http://bigpondvideo.com/Web/Images/Content/20150711201151a_326x184.jpg",
            "programType": "Instant Replay",
            "programCategory": "Score",
            "priority": 6,
            "lastUpdateDate": "2015-07-11T21:33:12+10:00",
            "isPremium": true,
            "club": [
                500011,
                500010
            ]
        },
        {
            "id": "BiMGs1djqAMsBZv6IIyzG7Z2kYKwWnXq",
            "contentId": 769139,
            "title": "Rd 18: TRY Daniel Vidot (15th min)",
            "description": "Possession tells the tail as the Broncos open the scoring in this match through a try to Daniel Vidot",
            "publishDate": "2015-07-11T20:02:00+10:00",
            "publisher": "NRL Chief",
            "thumbnailUrl": "http://bigpondvideo.com/Web/Images/Content/20150711195920a_89x50.jpg",
            "largeThumbnailUrl": "http://bigpondvideo.com/Web/Images/Content/20150711195920a_326x184.jpg",
            "programType": "Instant Replay",
            "programCategory": "Score",
            "priority": 7,
            "lastUpdateDate": "2015-07-11T21:31:12+10:00",
            "isPremium": true,
            "club": [
                500011,
                500010
            ]
        }
    ],
    "scores": [
        {
            "gameState": "First Half",
            "gameStateId": 3,
            "gameTime": "0:25:58",
            "gameSeconds": 1558,
            "playerId": 500232,
            "playerName": "Josh Morris",
            "scoreMethod": "Try",
            "statEvent": "Try",
            "statId": 38,
            "statValue": 4,
            "vidRef": 44180,
            "homeScore": 4,
            "awayScore": 4,
            "teamId": 500010,
            "teamName": "Canterbury-Bankstown Bulldogs",
            "homeTeamAbbrv": "CBY",
            "awayTeamAbbrv": "BRI"
        },
        {
            "gameState": "Second Half",
            "gameStateId": 5,
            "gameTime": "0:49:23",
            "gameSeconds": 2963,
            "playerId": 500140,
            "playerName": "Shaun Lane",
            "scoreMethod": "Try",
            "statEvent": "Try",
            "statId": 38,
            "statValue": 4,
            "vidRef": 85649,
            "homeScore": 8,
            "awayScore": 10,
            "teamId": 500010,
            "teamName": "Canterbury-Bankstown Bulldogs",
            "homeTeamAbbrv": "CBY",
            "awayTeamAbbrv": "BRI"
        },
        {
            "gameState": "First Half",
            "gameStateId": 3,
            "gameTime": "0:14:40",
            "gameSeconds": 880,
            "playerId": 500274,
            "playerName": "Daniel Vidot",
            "scoreMethod": "Try",
            "statEvent": "Try",
            "statId": 38,
            "statValue": 4,
            "vidRef": 24203,
            "awayScore": 4,
            "teamId": 500011,
            "teamName": "Brisbane Broncos",
            "homeTeamAbbrv": "CBY",
            "awayTeamAbbrv": "BRI"
        },
        {
            "gameState": "First Half",
            "gameStateId": 3,
            "gameTime": "0:33:34",
            "gameSeconds": 2014,
            "playerId": 500273,
            "playerName": "Sam Thaiday",
            "scoreMethod": "Try",
            "statEvent": "Try",
            "statId": 38,
            "statValue": 4,
            "vidRef": 55578,
            "homeScore": 4,
            "awayScore": 8,
            "teamId": 500011,
            "teamName": "Brisbane Broncos",
            "homeTeamAbbrv": "CBY",
            "awayTeamAbbrv": "BRI"
        },
        {
            "gameState": "First Half",
            "gameStateId": 3,
            "gameTime": "0:35:11",
            "gameSeconds": 2111,
            "playerId": 500258,
            "playerName": "Jordan Kahu",
            "scoreMethod": "Conversion",
            "statEvent": "Conversion-Made",
            "statId": 1,
            "statValue": 2,
            "vidRef": 57992,
            "homeScore": 4,
            "awayScore": 10,
            "teamId": 500011,
            "teamName": "Brisbane Broncos",
            "homeTeamAbbrv": "CBY",
            "awayTeamAbbrv": "BRI"
        },
        {
            "gameState": "Second Half",
            "gameStateId": 5,
            "gameTime": "1:00:18",
            "gameSeconds": 3618,
            "playerId": 500645,
            "playerName": "Adam Blair",
            "scoreMethod": "Try",
            "statEvent": "Try",
            "statId": 38,
            "statValue": 4,
            "vidRef": 104502,
            "homeScore": 8,
            "awayScore": 14,
            "teamId": 500011,
            "teamName": "Brisbane Broncos",
            "homeTeamAbbrv": "CBY",
            "awayTeamAbbrv": "BRI"
        },
        {
            "gameState": "Second Half",
            "gameStateId": 5,
            "gameTime": "1:01:21",
            "gameSeconds": 3681,
            "playerId": 500268,
            "playerName": "Corey Parker",
            "scoreMethod": "Conversion",
            "statEvent": "Conversion-Made",
            "statId": 1,
            "statValue": 2,
            "vidRef": 106065,
            "homeScore": 8,
            "awayScore": 16,
            "teamId": 500011,
            "teamName": "Brisbane Broncos",
            "homeTeamAbbrv": "CBY",
            "awayTeamAbbrv": "BRI"
        }
    ]
}