{
    "vod": [
        {
            "id": "Q4MWkzdDrHrJcUr7OHXYOMlnBOPq_OFN",
            "contentId": 731450,
            "title": "Rd 3: Sea Eagles v Bulldogs (1)",
            "description": "1st half replay of the match between the Sea Eagles & Bulldogs",
            "publishDate": "2015-03-21T09:30:00+11:00",
            "publisher": "NRL Chief",
            "thumbnailUrl": "http://bigpondvideo.com/Web/Images/Content/20150320225352a_89x50.jpg",
            "largeThumbnailUrl": "http://bigpondvideo.com/Web/Images/Content/20150320225352a_326x184.jpg",
            "programType": "Matches",
            "programCategory": "Replay: 1st Half",
            "priority": null,
            "lastUpdateDate": "2015-03-21T17:10:54+11:00",
            "isPremium": true,
            "club": [
                500010,
                500002
            ]
        },
        {
            "id": "0xMmkzdDrmGcVu8XfhX3Gvd436iF0O2M",
            "contentId": 731454,
            "title": "Rd 3: Sea Eagles v Bulldogs (2)",
            "description": "2nd half replay of the match between the Sea Eagles & Bulldogs",
            "publishDate": "2015-03-21T09:30:00+11:00",
            "publisher": "NRL Chief",
            "thumbnailUrl": "http://bigpondvideo.com/Web/Images/Content/20150320225537a_89x50.jpg",
            "largeThumbnailUrl": "http://bigpondvideo.com/Web/Images/Content/20150320225537a_326x184.jpg",
            "programType": "Matches",
            "programCategory": "Replay: 2nd Half",
            "priority": null,
            "lastUpdateDate": "2015-03-21T17:14:56+11:00",
            "isPremium": true,
            "club": [
                500010,
                500002
            ]
        },
        {
            "id": "hoZWczdDo1VAJ6VvdDslOqfDrbKsSn2b",
            "contentId": 731350,
            "title": "Rd 3: Sea Eagles v Bulldogs (Hls)",
            "description": "Highlights of the match between the Sea Eagles & Bulldogs from Brookvale Oval.",
            "publishDate": "2015-03-20T21:54:00+11:00",
            "publisher": "NRL Chief",
            "thumbnailUrl": "http://bigpondvideo.com/Web/Images/Content/20150320215154a_89x50.jpg",
            "largeThumbnailUrl": "http://bigpondvideo.com/Web/Images/Content/20150320215154a_326x184.jpg",
            "programType": "Highlights",
            "programCategory": "Match",
            "priority": null,
            "lastUpdateDate": "2015-03-20T21:58:30+11:00",
            "isPremium": false,
            "club": [
                500010,
                500002
            ]
        },
        {
            "id": "5sb2czdDqlPKWg9MBtLjpbs1nLJG2366",
            "contentId": 731403,
            "title": "Rd 3 Press Conference: Sea Eagles",
            "description": "The Sea Eagles coach faces the media following the match",
            "publishDate": "2015-03-20T22:15:00+11:00",
            "publisher": "NRL Chief",
            "thumbnailUrl": "http://bigpondvideo.com/Web/Images/Content/20150320221415a_89x50.jpg",
            "largeThumbnailUrl": "http://bigpondvideo.com/Web/Images/Content/20150320221415a_326x184.jpg",
            "programType": "Press Conference",
            "programCategory": null,
            "priority": null,
            "lastUpdateDate": "2015-03-20T22:20:43+11:00",
            "isPremium": false,
            "club": [
                500010,
                500002
            ]
        },
        {
            "id": "95bGczdDrj_i6DgsswnENRHn9AfyPgxA",
            "contentId": 731406,
            "title": "Rd 3 Press Conference: Bulldogs",
            "description": "The Bulldogs coach faces the media following the match",
            "publishDate": "2015-03-20T22:11:00+11:00",
            "publisher": "NRL Chief",
            "thumbnailUrl": "http://bigpondvideo.com/Web/Images/Content/20150320221138a_89x50.jpg",
            "largeThumbnailUrl": "http://bigpondvideo.com/Web/Images/Content/20150320221138a_326x184.jpg",
            "programType": "Press Conference",
            "programCategory": null,
            "priority": null,
            "lastUpdateDate": "2015-03-20T22:17:42+11:00",
            "isPremium": false,
            "club": [
                500010,
                500002
            ]
        },
        {
            "id": "9sNmczdDoU4Q6CW7TZzYrmizlHsBsgaj",
            "contentId": 731507,
            "title": "Rd 3: TRY Peta Hiku (73rd min)",
            "description": "Sea Eagles set up a grandstand finish as Peta Hiku scores for the homeside",
            "publishDate": "2015-03-20T21:34:10+11:00",
            "publisher": "NRL Chief",
            "thumbnailUrl": "http://bigpondvideo.com/Web/Images/Content/20150320213417a_89x50.jpg",
            "largeThumbnailUrl": "http://bigpondvideo.com/Web/Images/Content/20150320213417a_326x184.jpg",
            "programType": "Instant Replay",
            "programCategory": "Score",
            "priority": 1,
            "lastUpdateDate": "2015-03-20T21:43:26+11:00",
            "isPremium": true,
            "club": [
                500010,
                500002
            ]
        },
        {
            "id": "h5M2czdDoZEeWhJu8nrLXB8t1naDDAFU",
            "contentId": 731508,
            "title": "Rd 3: GOAL Trent Hodkinson (72nd min)",
            "description": "Conversion takes the visitors out to a 16-8 lead",
            "publishDate": "2015-03-20T21:33:00+11:00",
            "publisher": "NRL Chief",
            "thumbnailUrl": "http://bigpondvideo.com/Web/Images/Content/20150320213336a_89x50.jpg",
            "largeThumbnailUrl": "http://bigpondvideo.com/Web/Images/Content/20150320213336a_326x184.jpg",
            "programType": "Instant Replay",
            "programCategory": "Score",
            "priority": 2,
            "lastUpdateDate": "2015-03-20T21:42:25+11:00",
            "isPremium": true,
            "club": [
                500010,
                500002
            ]
        },
        {
            "id": "gyMWczdDoAOiHPs-zOi1GKpwvZ1bieJe",
            "contentId": 731503,
            "title": "Rd 3: TRY Sam Perrett (70th min)",
            "description": "Bulldogs extend their lead through a great try to Sam Perrett",
            "publishDate": "2015-03-20T21:30:00+11:00",
            "publisher": "NRL Chief",
            "thumbnailUrl": "http://bigpondvideo.com/Web/Images/Content/20150320213011a_89x50.jpg",
            "largeThumbnailUrl": "http://bigpondvideo.com/Web/Images/Content/20150320213011a_326x184.jpg",
            "programType": "Instant Replay",
            "programCategory": "Score",
            "priority": 3,
            "lastUpdateDate": "2015-03-20T21:42:23+11:00",
            "isPremium": true,
            "club": [
                500010,
                500002
            ]
        },
        {
            "id": "9xNGYzdDp4qLesDu44OIekCNVAPgHBwS",
            "contentId": 731501,
            "title": "Rd 3: TRY Steve Matai (50th min)",
            "description": "Sea Eagles get another try as Steve Matai gets the benefit of the doubt from the video ref",
            "publishDate": "2015-03-20T21:05:00+11:00",
            "publisher": "NRL Chief",
            "thumbnailUrl": "http://bigpondvideo.com/Web/Images/Content/20150320210611a_89x50.jpg",
            "largeThumbnailUrl": "http://bigpondvideo.com/Web/Images/Content/20150320210611a_326x184.jpg",
            "programType": "Instant Replay",
            "programCategory": "Score",
            "priority": 4,
            "lastUpdateDate": "2015-03-20T21:42:23+11:00",
            "isPremium": true,
            "club": [
                500010,
                500002
            ]
        },
        {
            "id": "5rMWUzdDrFK4ikJBST6VnWJLWpo-9F_l",
            "contentId": 731500,
            "title": "Rd 3: GOAL Trent Hodkinson (36th min)",
            "description": "Conversion takes the Dogs out to a 10-4 lead",
            "publishDate": "2015-03-20T20:31:00+11:00",
            "publisher": "NRL Chief",
            "thumbnailUrl": "http://bigpondvideo.com/Web/Images/Content/20150320203142a_89x50.jpg",
            "largeThumbnailUrl": "http://bigpondvideo.com/Web/Images/Content/20150320203142a_326x184.jpg",
            "programType": "Instant Replay",
            "programCategory": "Score",
            "priority": 5,
            "lastUpdateDate": "2015-03-20T21:41:28+11:00",
            "isPremium": true,
            "club": [
                500010,
                500002
            ]
        },
        {
            "id": "g4MWUzdDpMug7j4jWmiy8PDQwISBtArO",
            "contentId": 731495,
            "title": "Rd 3: TRY Tim Lafai (36th min)",
            "description": "Sea Eagles let the bomb bounce and pay the price as Tim Lafai scores for the Bulldogs",
            "publishDate": "2015-03-20T20:30:00+11:00",
            "publisher": "NRL Chief",
            "thumbnailUrl": "http://bigpondvideo.com/Web/Images/Content/20150320203045a_89x50.jpg",
            "largeThumbnailUrl": "http://bigpondvideo.com/Web/Images/Content/20150320203045a_326x184.jpg",
            "programType": "Instant Replay",
            "programCategory": "Score",
            "priority": 6,
            "lastUpdateDate": "2015-03-20T21:41:27+11:00",
            "isPremium": true,
            "club": [
                500010,
                500002
            ]
        },
        {
            "id": "hucmQzdDrhX3VHA759yw9chQzjaPaZpI",
            "contentId": 731487,
            "title": "Rd 3: TRY Feleti Mateo (30th min)",
            "description": "Sea Eagles hit back through a strong try to Feleti Mateo",
            "publishDate": "2015-03-20T20:23:00+11:00",
            "publisher": "NRL Chief",
            "thumbnailUrl": "http://bigpondvideo.com/Web/Images/Content/20150320202418a_89x50.jpg",
            "largeThumbnailUrl": "http://bigpondvideo.com/Web/Images/Content/20150320202418a_326x184.jpg",
            "programType": "Instant Replay",
            "programCategory": "Score",
            "priority": 7,
            "lastUpdateDate": "2015-03-20T21:41:23+11:00",
            "isPremium": true,
            "club": [
                500010,
                500002
            ]
        },
        {
            "id": "J4YmQzdDqm830ymCBAOCWrrij064Byte",
            "contentId": 731482,
            "title": "Rd 3: TRY Tim Lafai (17th min)",
            "description": "Bulldogs open the scoring in this match through Tim Lafai crossing out wide",
            "publishDate": "2015-03-20T20:10:00+11:00",
            "publisher": "NRL Chief",
            "thumbnailUrl": "http://bigpondvideo.com/Web/Images/Content/20150320200944a_89x50.jpg",
            "largeThumbnailUrl": "http://bigpondvideo.com/Web/Images/Content/20150320200944a_326x184.jpg",
            "programType": "Instant Replay",
            "programCategory": "Score",
            "priority": 8,
            "lastUpdateDate": "2015-03-20T21:40:24+11:00",
            "isPremium": true,
            "club": [
                500010,
                500002
            ]
        }
    ],
    "scores": [
        {
            "gameState": "First Half",
            "gameStateId": 3,
            "gameTime": "0:29:11",
            "gameSeconds": 1751,
            "playerId": 500714,
            "playerName": "Feleti Mateo",
            "scoreMethod": "Try",
            "statId": 38,
            "statValue": 4,
            "vidRef": 51551,
            "homeScore": 4,
            "awayScore": 4,
            "teamId": 500002,
            "teamName": "Manly-Warringah Sea Eagles",
            "homeTeamAbbrv": "MAN",
            "awayTeamAbbrv": "CBY"
        },
        {
            "gameState": "Second Half",
            "gameStateId": 5,
            "gameTime": "0:49:01",
            "gameSeconds": 2941,
            "playerId": 500021,
            "playerName": "Steve Matai",
            "scoreMethod": "Try",
            "statId": 38,
            "statValue": 4,
            "vidRef": 88868,
            "homeScore": 8,
            "awayScore": 10,
            "teamId": 500002,
            "teamName": "Manly-Warringah Sea Eagles",
            "homeTeamAbbrv": "MAN",
            "awayTeamAbbrv": "CBY"
        },
        {
            "gameState": "Second Half",
            "gameStateId": 5,
            "gameTime": "1:13:06",
            "gameSeconds": 4386,
            "playerId": 500579,
            "playerName": "Peta Hiku",
            "scoreMethod": "Try",
            "statId": 38,
            "statValue": 4,
            "vidRef": 132883,
            "homeScore": 12,
            "awayScore": 16,
            "teamId": 500002,
            "teamName": "Manly-Warringah Sea Eagles",
            "homeTeamAbbrv": "MAN",
            "awayTeamAbbrv": "CBY"
        },
        {
            "gameState": "First Half",
            "gameStateId": 3,
            "gameTime": "0:16:01",
            "gameSeconds": 961,
            "playerId": 500229,
            "playerName": "Timoteo Lafai",
            "scoreMethod": "Try",
            "statId": 38,
            "statValue": 4,
            "vidRef": 28599,
            "awayScore": 4,
            "teamId": 500010,
            "teamName": "Canterbury-Bankstown Bulldogs",
            "homeTeamAbbrv": "MAN",
            "awayTeamAbbrv": "CBY"
        },
        {
            "gameState": "First Half",
            "gameStateId": 3,
            "gameTime": "0:35:41",
            "gameSeconds": 2141,
            "playerId": 500229,
            "playerName": "Timoteo Lafai",
            "scoreMethod": "Try",
            "statId": 38,
            "statValue": 4,
            "vidRef": 61633,
            "homeScore": 4,
            "awayScore": 8,
            "teamId": 500010,
            "teamName": "Canterbury-Bankstown Bulldogs",
            "homeTeamAbbrv": "MAN",
            "awayTeamAbbrv": "CBY"
        },
        {
            "gameState": "First Half",
            "gameStateId": 3,
            "gameTime": "0:36:49",
            "gameSeconds": 2209,
            "playerId": 500224,
            "playerName": "Trent Hodkinson",
            "scoreMethod": "Conversion",
            "statId": 1,
            "statValue": 2,
            "vidRef": 64663,
            "homeScore": 4,
            "awayScore": 10,
            "teamId": 500010,
            "teamName": "Canterbury-Bankstown Bulldogs",
            "homeTeamAbbrv": "MAN",
            "awayTeamAbbrv": "CBY"
        },
        {
            "gameState": "Second Half",
            "gameStateId": 5,
            "gameTime": "1:09:44",
            "gameSeconds": 4184,
            "playerId": 500234,
            "playerName": "Sam Perrett",
            "scoreMethod": "Try",
            "statId": 38,
            "statValue": 4,
            "vidRef": 127836,
            "homeScore": 8,
            "awayScore": 14,
            "teamId": 500010,
            "teamName": "Canterbury-Bankstown Bulldogs",
            "homeTeamAbbrv": "MAN",
            "awayTeamAbbrv": "CBY"
        },
        {
            "gameState": "Second Half",
            "gameStateId": 5,
            "gameTime": "1:11:35",
            "gameSeconds": 4295,
            "playerId": 500224,
            "playerName": "Trent Hodkinson",
            "scoreMethod": "Conversion",
            "statId": 1,
            "statValue": 2,
            "vidRef": 130618,
            "homeScore": 8,
            "awayScore": 16,
            "teamId": 500010,
            "teamName": "Canterbury-Bankstown Bulldogs",
            "homeTeamAbbrv": "MAN",
            "awayTeamAbbrv": "CBY"
        }
    ]
}