{
    "competitionId": 111,
    "competitionName": "NRL Telstra Premiership",
    "gameId": 20161112450,
    "gameInfo": {
        "assistantReferee1Id": 500013,
        "numberOfPeriods": 2,
        "assistantReferee1Name": "Brett Suttor",
        "assistantReferee2Id": 500057,
        "assistantReferee2Name": "Nick Morel",
        "gameDate": "2016-08-20",
        "gameHashTag": "#NRLCowboysWarriors",
        "gameNumber": 5,
        "gameSeconds": 4800,
        "gameMinutes": "80:00",
        "gameTime": "1:20:00",
        "groundConditionId": 1,
        "groundConditionName": "N/A",
        "referee1Id": 500039,
        "referee1Name": "Ashley Klein",
        "referee2Id": 500019,
        "referee2Name": "Adam Gee",
        "startTime": "2016-08-20T19:30:00",
        "startTimeUTC": "2016-08-20T09:30:00Z",
        "venueId": 500003,
        "venueName": "1300SMILES Stadium",
        "videoReferee1Id": 500203,
        "videoReferee1Name": "Ben Galea",
        "videoReferee2Id": 500033,
        "videoReferee2Name": "Steve Chiddy",
        "weatherId": 2,
        "weatherName": "Fine",
        "broadcastChannel": null,
        "venueLatitude": -19.3161,
        "venueLongitude": 146.7119,
        "broadcastInfo": {
            "radioNetwork": []
        }
    },
    "gameState": "Final",
    "gameStateId": 8,
    "roundId": 24,
    "roundName": "Round 24",
    "seasonId": 2016,
    "teams": {
        "teamsMatch": [
            {
                "isHomeTeam": true,
                "score": {
                    "conversions": 5,
                    "points": 34,
                    "tries": 6
                },
                "team1stHalfScore": 22,
                "team2ndHalfScore": 12,
                "teamAbbr": "NQL",
                "teamFinalScore": 34,
                "teamFullTimeScore": 34,
                "teamHalfTimeScore": 22,
                "teamId": 500012,
                "teamLineup": {
                    "teamLineUpStatusID": 4,
                    "teamLineUpStatus": "Final",
                    "injuriesAndSuspensions": {
                        "injury": [],
                        "suspension": []
                    },
                    "insAndOuts": {
                        "inOut": [
                            {
                                "inOut": "In",
                                "playerFirstName": "Antonio",
                                "playerId": "500305",
                                "playerLastName": "Winterstein",
                                "playerName": "Antonio Winterstein"
                            },
                            {
                                "inOut": "In",
                                "playerFirstName": "Ben",
                                "playerId": "501034",
                                "playerLastName": "Spina",
                                "playerName": "Ben Spina"
                            },
                            {
                                "inOut": "In",
                                "playerFirstName": "Coen",
                                "playerId": "500405",
                                "playerLastName": "Hess",
                                "playerName": "Coen Hess"
                            },
                            {
                                "inOut": "Out",
                                "playerFirstName": "Javid",
                                "playerId": "500279",
                                "playerLastName": "Bowen",
                                "playerName": "Javid Bowen"
                            },
                            {
                                "inOut": "Out",
                                "playerFirstName": "John",
                                "playerId": "500277",
                                "playerLastName": "Asiata",
                                "playerName": "John Asiata"
                            },
                            {
                                "inOut": "Out",
                                "playerFirstName": "Matthew",
                                "playerId": "500296",
                                "playerLastName": "Scott",
                                "playerName": "Matthew Scott"
                            }
                        ]
                    },
                    "teamPlayer": [
                        {
                            "playerFirstName": "Lachlan",
                            "playerId": 500281,
                            "playerLastName": "Coote",
                            "playerName": "Lachlan Coote",
                            "playerPosition": "Fullback",
                            "playerPositionId": 500001,
                            "playerStats": {
                                "allRunMetres": 39,
                                "allRuns": 6,
                                "decoys": 1,
                                "errors": 1,
                                "fantasyPointsTotal": 22,
                                "kickDead": 1,
                                "kickMetres": 236,
                                "kickReturnMetres": 15,
                                "kickReturns": 2,
                                "kicks": 8,
                                "kicksDefused": 1,
                                "kicksNotDefused": 2,
                                "mins": 80,
                                "missedTackles": 2,
                                "passes": 27,
                                "passesPerRun": 4.5,
                                "oneOnOneTackles": 1,
                                "supports": 7,
                                "tackleBreaks": 1,
                                "tackles": 10,
                                "evasionRuns": 4,
                                "evasionRunMetres": 24,
                                "ptbAll": 5,
                                "receipts": 41,
                                "forcedDropOutKicker": 2,
                                "grubberKick": 3,
                                "postContactMetres": 8,
                                "dummyPasses": 2,
                                "lineEngagedRuns": 1,
                                "ptbTwoToThree": 1,
                                "ptbThreeToFour": 3,
                                "ptbFourToFive": 1,
                                "longKicksSpace": 3,
                                "effectiveTacklePercentage": 83.3,
                                "stint1": 4800
                            },
                            "playerTookTheField": true,
                            "shirtNum": 1,
                            "playerFirstInitial": "L",
                            "playerPositionAbbrev": "FB",
                            "onTheField": true,
                            "fantasyPrice": 200000,
                            "fantasySeasonPriceChange": -175000,
                            "fantasyRoundPriceChange": -25000
                        },
                        {
                            "playerFirstName": "Kyle",
                            "playerId": 500282,
                            "playerLastName": "Feldt",
                            "playerName": "Kyle Feldt",
                            "playerPosition": "Winger 1",
                            "playerPositionId": 500002,
                            "playerStats": {
                                "allRunMetres": 73,
                                "allRuns": 8,
                                "bombKicksNotDefused": 1,
                                "errors": 1,
                                "fantasyPointsTotal": 34,
                                "kickReturnMetres": 6,
                                "kickReturns": 1,
                                "kicksDefused": 1,
                                "kicksNotDefused": 1,
                                "mins": 80,
                                "offloads": 1,
                                "passes": 6,
                                "passesPerRun": 0.75,
                                "oneOnOneTackles": 1,
                                "points": 8,
                                "supports": 3,
                                "tackleBreaks": 1,
                                "tackles": 7,
                                "tries": 2,
                                "evasionRuns": 7,
                                "evasionRunMetres": 67,
                                "ptbAll": 5,
                                "receipts": 16,
                                "postContactMetres": 24,
                                "ptbOneToTwo": 1,
                                "ptbThreeToFour": 3,
                                "ptbFourToFive": 1,
                                "doubles": 1,
                                "effectiveTacklePercentage": 100,
                                "stint1": 4778
                            },
                            "playerTookTheField": true,
                            "shirtNum": 2,
                            "playerFirstInitial": "K",
                            "playerPositionAbbrev": "WG",
                            "fantasyPrice": 229000,
                            "fantasySeasonPriceChange": -41000,
                            "fantasyRoundPriceChange": -3000
                        },
                        {
                            "playerFirstName": "Justin",
                            "playerId": 500605,
                            "playerLastName": "O'Neill",
                            "playerName": "Justin O'Neill",
                            "playerPosition": "Centre 1",
                            "playerPositionId": 500003,
                            "playerStats": {
                                "allRunMetres": 76,
                                "allRuns": 8,
                                "decoys": 1,
                                "errors": 2,
                                "fantasyPointsTotal": 25,
                                "ineffectiveTackles": 1,
                                "linebreaks": 1,
                                "mins": 80,
                                "missedTackles": 3,
                                "passes": 2,
                                "passesPerRun": 0.25,
                                "points": 4,
                                "supports": 2,
                                "tackleBreaks": 2,
                                "tackles": 10,
                                "tries": 1,
                                "tryCause": 1,
                                "evasionRuns": 8,
                                "evasionRunMetres": 76,
                                "ptbAll": 7,
                                "receipts": 12,
                                "postContactMetres": 22,
                                "dummyPasses": 1,
                                "ptbTwoToThree": 3,
                                "ptbFourToFive": 4,
                                "doubles": 1,
                                "effectiveTacklePercentage": 71.4,
                                "stint1": 4800
                            },
                            "playerTookTheField": true,
                            "shirtNum": 3,
                            "playerFirstInitial": "J",
                            "playerPositionAbbrev": "CT",
                            "onTheField": true,
                            "fantasyPrice": 258000,
                            "fantasySeasonPriceChange": -24000,
                            "fantasyRoundPriceChange": -6000
                        },
                        {
                            "playerFirstName": "Kane",
                            "playerId": 500288,
                            "playerLastName": "Linnett",
                            "playerName": "Kane Linnett",
                            "playerPosition": "Centre 2",
                            "playerPositionId": 500004,
                            "playerStats": {
                                "allRunMetres": 141,
                                "allRuns": 13,
                                "decoys": 2,
                                "errors": 1,
                                "fantasyPointsTotal": 23,
                                "ineffectiveTackles": 1,
                                "kicksDefused": 1,
                                "mins": 80,
                                "missedTackles": 1,
                                "offloads": 1,
                                "passes": 2,
                                "passesPerRun": 0.15,
                                "oneOnOneTackles": 1,
                                "supports": 5,
                                "tackleBreaks": 2,
                                "tackles": 4,
                                "evasionRuns": 13,
                                "evasionRunMetres": 141,
                                "ptbAll": 12,
                                "receipts": 16,
                                "postContactMetres": 55,
                                "ptbOneToTwo": 1,
                                "ptbTwoToThree": 5,
                                "ptbThreeToFour": 5,
                                "ptbFourToFive": 1,
                                "effectiveTacklePercentage": 66.7,
                                "stint1": 4800
                            },
                            "playerTookTheField": true,
                            "shirtNum": 4,
                            "playerFirstInitial": "K",
                            "playerPositionAbbrev": "CT",
                            "onTheField": true,
                            "fantasyPrice": 227000,
                            "fantasySeasonPriceChange": -95000,
                            "fantasyRoundPriceChange": 17000
                        },
                        {
                            "playerFirstName": "Antonio",
                            "playerId": 500305,
                            "playerLastName": "Winterstein",
                            "playerName": "Antonio Winterstein",
                            "playerPosition": "Winger 2",
                            "playerPositionId": 500005,
                            "playerStats": {
                                "allRunMetres": 190,
                                "allRuns": 15,
                                "bombKicksDefused": 1,
                                "bombKicksNotDefused": 1,
                                "dummyHalfRuns": 1,
                                "errors": 3,
                                "fantasyPointsTotal": 14,
                                "kickReturnMetres": 76,
                                "kickReturns": 5,
                                "kicksDefused": 1,
                                "kicksNotDefused": 1,
                                "mins": 80,
                                "missedTackles": 2,
                                "passes": 4,
                                "passesPerRun": 0.27,
                                "supports": 7,
                                "tackleBreaks": 1,
                                "tackles": 1,
                                "evasionRuns": 9,
                                "evasionRunMetres": 98,
                                "dummyHalfRunMetres": 16,
                                "ptbAll": 15,
                                "receipts": 22,
                                "postContactMetres": 68,
                                "ptbOneToTwo": 1,
                                "ptbThreeToFour": 5,
                                "ptbFourToFive": 8,
                                "ptbFivePlus": 1,
                                "effectiveTacklePercentage": 33.3,
                                "stint1": 4800
                            },
                            "playerTookTheField": true,
                            "shirtNum": 5,
                            "playerFirstInitial": "A",
                            "playerPositionAbbrev": "WG",
                            "onTheField": true,
                            "fantasyPrice": 282000,
                            "fantasySeasonPriceChange": 31000
                        },
                        {
                            "playerFirstName": "Michael",
                            "playerId": 500292,
                            "playerLastName": "Morgan",
                            "playerName": "Michael Morgan",
                            "playerPosition": "Five-Eighth",
                            "playerPositionId": 500006,
                            "playerStats": {
                                "allRunMetres": 58,
                                "allRuns": 6,
                                "bombKicks": 1,
                                "bombKickMetres": 32,
                                "fantasyPointsTotal": 57,
                                "kickMetres": 76,
                                "kicks": 5,
                                "linebreaks": 1,
                                "mins": 80,
                                "missedTackles": 2,
                                "offloads": 1,
                                "passes": 21,
                                "passesPerRun": 3.5,
                                "points": 4,
                                "supports": 5,
                                "tackleBreaks": 4,
                                "tackles": 22,
                                "tries": 1,
                                "tryAssists": 1,
                                "tryCause": 1,
                                "evasionRuns": 6,
                                "evasionRunMetres": 58,
                                "ptbAll": 2,
                                "receipts": 31,
                                "grubberKick": 4,
                                "postContactMetres": 18,
                                "dummyPasses": 1,
                                "lineEngagedRuns": 1,
                                "ptbThreeToFour": 1,
                                "ptbFourToFive": 1,
                                "doubles": 4,
                                "effectiveTacklePercentage": 91.7,
                                "stint1": 4800
                            },
                            "playerTookTheField": true,
                            "shirtNum": 6,
                            "playerFirstInitial": "M",
                            "playerPositionAbbrev": "FE",
                            "onTheField": true,
                            "fantasyPrice": 318000,
                            "fantasySeasonPriceChange": -64000,
                            "fantasyRoundPriceChange": -7000
                        },
                        {
                            "playerFirstName": "Johnathan",
                            "playerId": 500304,
                            "playerLastName": "Thurston",
                            "playerName": "Johnathan Thurston",
                            "playerPosition": "Halfback",
                            "playerPositionId": 500007,
                            "playerStats": {
                                "allRunMetres": 19,
                                "allRuns": 7,
                                "bombKicks": 1,
                                "bombKickMetres": 29,
                                "conversions": 5,
                                "conversionsAttempts": 6,
                                "conversionsMissed": 1,
                                "fantasyPointsTotal": 61,
                                "goalConversionRate": 83.33,
                                "allGoals": 5,
                                "allGoalsMissed": 1,
                                "allGoalsAttempted": 6,
                                "kickMetres": 115,
                                "kicks": 8,
                                "linebreakAssists": 3,
                                "mins": 80,
                                "passes": 52,
                                "passesPerRun": 7.43,
                                "points": 10,
                                "supports": 8,
                                "tackleBreaks": 3,
                                "tackles": 15,
                                "tryAssists": 3,
                                "evasionRuns": 7,
                                "evasionRunMetres": 19,
                                "ptbAll": 3,
                                "receipts": 62,
                                "forcedDropOutKicker": 3,
                                "grubberKick": 5,
                                "crossFieldKick": 1,
                                "dummyPasses": 5,
                                "kickPressures": 1,
                                "lineEngagedRuns": 2,
                                "ptbThreeToFour": 1,
                                "ptbFourToFive": 1,
                                "ptbFivePlus": 1,
                                "doubles": 3,
                                "longKicksSpace": 1,
                                "effectiveTacklePercentage": 100,
                                "stint1": 4800
                            },
                            "playerTookTheField": true,
                            "shirtNum": 7,
                            "playerFirstInitial": "J",
                            "playerPositionAbbrev": "HB",
                            "onTheField": true,
                            "fantasyPrice": 406000,
                            "fantasySeasonPriceChange": -122000,
                            "fantasyRoundPriceChange": -18000
                        },
                        {
                            "playerFirstName": "Scott",
                            "playerId": 500278,
                            "playerLastName": "Bolton",
                            "playerName": "Scott Bolton",
                            "playerPosition": "Prop 1",
                            "playerPositionId": 500008,
                            "playerStats": {
                                "allRunMetres": 189,
                                "allRuns": 18,
                                "decoys": 2,
                                "fantasyPointsTotal": 42,
                                "hitUps": 18,
                                "ineffectiveTackles": 1,
                                "mins": 48,
                                "passes": 1,
                                "passesPerRun": 0.06,
                                "supports": 3,
                                "tackleBreaks": 3,
                                "tackles": 15,
                                "hitupRunMeters": 189,
                                "ptbAll": 18,
                                "receipts": 19,
                                "postContactMetres": 84,
                                "ptbOneToTwo": 1,
                                "ptbTwoToThree": 7,
                                "ptbThreeToFour": 7,
                                "ptbFourToFive": 3,
                                "doubles": 2,
                                "effectiveTacklePercentage": 93.8,
                                "stint1": 1685,
                                "stint2": 1174
                            },
                            "playerTookTheField": true,
                            "shirtNum": 16,
                            "playerFirstInitial": "S",
                            "playerPositionAbbrev": "PR",
                            "onTheField": true,
                            "fantasyPrice": 275000,
                            "fantasySeasonPriceChange": -28000
                        },
                        {
                            "playerFirstName": "Rory",
                            "playerId": 500287,
                            "playerLastName": "Kostjasyn",
                            "playerName": "Rory Kostjasyn",
                            "playerPosition": "Hooker",
                            "playerPositionId": 500009,
                            "playerStats": {
                                "allRuns": 1,
                                "dummyHalfRuns": 1,
                                "errors": 1,
                                "fantasyPointsTotal": 16,
                                "mins": 51,
                                "missedTackles": 1,
                                "offloads": 1,
                                "passes": 99,
                                "passesPerRun": 99,
                                "oneOnOneTackles": 2,
                                "penalties": 2,
                                "supports": 1,
                                "tackles": 22,
                                "receipts": 98,
                                "dummyPasses": 2,
                                "kickPressures": 1,
                                "doubles": 1,
                                "effectiveTacklePercentage": 95.7,
                                "ptbPenalties": 2,
                                "stint1": 3032
                            },
                            "playerTookTheField": true,
                            "shirtNum": 14,
                            "playerFirstInitial": "R",
                            "playerPositionAbbrev": "HK",
                            "fantasyPrice": 185000,
                            "fantasySeasonPriceChange": -13000,
                            "fantasyRoundPriceChange": 4000
                        },
                        {
                            "playerFirstName": "James",
                            "playerId": 500299,
                            "playerLastName": "Tamou",
                            "playerName": "James Tamou",
                            "playerPosition": "Prop 2",
                            "playerPositionId": 500010,
                            "playerStats": {
                                "allRunMetres": 227,
                                "allRuns": 22,
                                "decoys": 2,
                                "fantasyPointsTotal": 52,
                                "hitUps": 14,
                                "ineffectiveTackles": 1,
                                "kickReturnMetres": 103,
                                "kickReturns": 8,
                                "mins": 46,
                                "offloads": 1,
                                "passes": 1,
                                "passesPerRun": 0.05,
                                "supports": 2,
                                "tackleBreaks": 4,
                                "tackles": 16,
                                "hitupRunMeters": 124,
                                "ptbAll": 18,
                                "receipts": 22,
                                "postContactMetres": 69,
                                "ptbTwoToThree": 1,
                                "ptbThreeToFour": 11,
                                "ptbFourToFive": 4,
                                "ptbFivePlus": 2,
                                "doubles": 2,
                                "effectiveTacklePercentage": 94.1,
                                "stint1": 1558,
                                "stint2": 1193
                            },
                            "playerTookTheField": true,
                            "shirtNum": 10,
                            "playerFirstInitial": "J",
                            "playerPositionAbbrev": "PR",
                            "onTheField": true,
                            "fantasyPrice": 345000,
                            "fantasySeasonPriceChange": -4000,
                            "fantasyRoundPriceChange": 6000
                        },
                        {
                            "playerFirstName": "Gavin",
                            "playerId": 500280,
                            "playerLastName": "Cooper",
                            "playerName": "Gavin Cooper",
                            "playerPosition": "2nd Row 1",
                            "playerPositionId": 500011,
                            "playerStats": {
                                "allRunMetres": 83,
                                "allRuns": 11,
                                "decoys": 7,
                                "fantasyPointsTotal": 27,
                                "hitUps": 10,
                                "ineffectiveTackles": 1,
                                "kickMetres": 26,
                                "kickReturnMetres": 6,
                                "kickReturns": 1,
                                "kicks": 1,
                                "kicksDefused": 1,
                                "mins": 80,
                                "missedTackles": 1,
                                "passes": 6,
                                "passesPerRun": 0.55,
                                "oneOnOneTackles": 2,
                                "supports": 10,
                                "tackles": 19,
                                "hitupRunMeters": 77,
                                "ptbAll": 10,
                                "receipts": 18,
                                "postContactMetres": 31,
                                "ptbTwoToThree": 2,
                                "ptbThreeToFour": 7,
                                "ptbFourToFive": 1,
                                "effectiveTacklePercentage": 90.5,
                                "stint1": 4800
                            },
                            "playerTookTheField": true,
                            "shirtNum": 11,
                            "playerFirstInitial": "G",
                            "playerPositionAbbrev": "2R",
                            "onTheField": true,
                            "fantasyPrice": 296000,
                            "fantasySeasonPriceChange": -139000,
                            "fantasyRoundPriceChange": -17000
                        },
                        {
                            "playerFirstName": "Ethan",
                            "playerId": 500289,
                            "playerLastName": "Lowe",
                            "playerName": "Ethan Lowe",
                            "playerPosition": "2nd Row 2",
                            "playerPositionId": 500012,
                            "playerStats": {
                                "allRunMetres": 123,
                                "allRuns": 13,
                                "decoys": 4,
                                "fantasyPointsTotal": 40,
                                "hitUps": 13,
                                "mins": 61,
                                "passes": 4,
                                "passesPerRun": 0.31,
                                "supports": 2,
                                "tackles": 28,
                                "hitupRunMeters": 123,
                                "ptbAll": 13,
                                "receipts": 17,
                                "postContactMetres": 55,
                                "dummyPasses": 1,
                                "kickPressures": 1,
                                "ptbTwoToThree": 1,
                                "ptbThreeToFour": 8,
                                "ptbFourToFive": 4,
                                "doubles": 4,
                                "effectiveTacklePercentage": 100,
                                "stint1": 3625,
                                "stint2": 22
                            },
                            "playerTookTheField": true,
                            "shirtNum": 12,
                            "playerFirstInitial": "E",
                            "playerPositionAbbrev": "2R",
                            "onTheField": true,
                            "fantasyPrice": 433000,
                            "fantasySeasonPriceChange": 13000,
                            "fantasyRoundPriceChange": 26000
                        },
                        {
                            "playerFirstName": "Jason",
                            "playerId": 500301,
                            "playerLastName": "Taumalolo",
                            "playerName": "Jason Taumalolo",
                            "playerPosition": "Lock",
                            "playerPositionId": 500013,
                            "playerStats": {
                                "allRunMetres": 213,
                                "allRuns": 20,
                                "decoys": 4,
                                "errors": 1,
                                "fantasyPointsTotal": 62,
                                "hitUps": 20,
                                "linebreaks": 1,
                                "mins": 57,
                                "passes": 4,
                                "passesPerRun": 0.2,
                                "oneOnOneTackles": 1,
                                "points": 4,
                                "supports": 3,
                                "tackleBreaks": 4,
                                "tackles": 19,
                                "tries": 1,
                                "hitupRunMeters": 213,
                                "ptbAll": 18,
                                "receipts": 24,
                                "postContactMetres": 87,
                                "ptbOneToTwo": 3,
                                "ptbThreeToFour": 6,
                                "ptbFourToFive": 7,
                                "ptbFivePlus": 2,
                                "doubles": 2,
                                "effectiveTacklePercentage": 100,
                                "stint1": 2743,
                                "stint2": 694
                            },
                            "playerTookTheField": true,
                            "shirtNum": 13,
                            "playerFirstInitial": "J",
                            "playerPositionAbbrev": "LK",
                            "onTheField": true,
                            "fantasyPrice": 413000,
                            "fantasySeasonPriceChange": 22000,
                            "fantasyRoundPriceChange": 5000
                        },
                        {
                            "playerFirstName": "Ray",
                            "playerId": 500302,
                            "playerLastName": "Thompson",
                            "playerName": "Ray Thompson",
                            "playerPosition": "Interchange",
                            "playerPositionId": 500014,
                            "playerStats": {
                                "allRunMetres": 20,
                                "allRuns": 2,
                                "dummyHalfRuns": 1,
                                "fantasyPointsTotal": 33,
                                "linebreaks": 1,
                                "mins": 29,
                                "passes": 42,
                                "passesPerRun": 21,
                                "points": 4,
                                "tackleBreaks": 3,
                                "tackles": 10,
                                "tries": 1,
                                "evasionRuns": 1,
                                "evasionRunMetres": 9,
                                "dummyHalfRunMetres": 11,
                                "receipts": 41,
                                "lineEngagedRuns": 1,
                                "effectiveTacklePercentage": 100,
                                "stint1": 1768
                            },
                            "playerTookTheField": true,
                            "shirtNum": 9,
                            "playerFirstInitial": "R",
                            "playerPositionAbbrev": "INT",
                            "onTheField": true,
                            "fantasyPrice": 251000,
                            "fantasySeasonPriceChange": 6000,
                            "fantasyRoundPriceChange": -4000
                        },
                        {
                            "playerFirstName": "Coen",
                            "playerId": 500405,
                            "playerLastName": "Hess",
                            "playerName": "Coen Hess",
                            "playerPosition": "Interchange",
                            "playerPositionId": 500014,
                            "playerStats": {
                                "allRunMetres": 50,
                                "allRuns": 6,
                                "decoys": 2,
                                "fantasyPointsTotal": 31,
                                "hitUps": 6,
                                "ineffectiveTackles": 1,
                                "kicks": 1,
                                "mins": 52,
                                "passes": 1,
                                "passesPerRun": 0.17,
                                "supports": 4,
                                "tackles": 26,
                                "hitupRunMeters": 50,
                                "ptbAll": 7,
                                "receipts": 10,
                                "forcedDropOutKicker": 1,
                                "grubberKick": 1,
                                "postContactMetres": 20,
                                "ptbTwoToThree": 1,
                                "ptbThreeToFour": 5,
                                "ptbFourToFive": 1,
                                "doubles": 6,
                                "effectiveTacklePercentage": 96.3,
                                "stint1": 3115
                            },
                            "playerTookTheField": true,
                            "shirtNum": 15,
                            "playerFirstInitial": "C",
                            "playerPositionAbbrev": "INT",
                            "onTheField": true,
                            "fantasyPrice": 295000,
                            "fantasySeasonPriceChange": -31000
                        },
                        {
                            "playerFirstName": "Patrick",
                            "playerId": 500285,
                            "playerLastName": "Kaufusi",
                            "playerName": "Patrick Kaufusi",
                            "playerPosition": "Interchange",
                            "playerPositionId": 500014,
                            "playerStats": {
                                "allRunMetres": 112,
                                "allRuns": 13,
                                "decoys": 5,
                                "fantasyPointsTotal": 29,
                                "hitUps": 11,
                                "kickReturnMetres": 21,
                                "kickReturns": 2,
                                "mins": 34,
                                "passes": 2,
                                "passesPerRun": 0.15,
                                "supports": 1,
                                "tackles": 18,
                                "hitupRunMeters": 91,
                                "ptbAll": 13,
                                "receipts": 15,
                                "postContactMetres": 41,
                                "ptbTwoToThree": 3,
                                "ptbThreeToFour": 4,
                                "ptbFourToFive": 4,
                                "ptbFivePlus": 2,
                                "doubles": 2,
                                "effectiveTacklePercentage": 100,
                                "stint1": 2049
                            },
                            "playerTookTheField": true,
                            "shirtNum": 17,
                            "playerFirstInitial": "P",
                            "playerPositionAbbrev": "INT",
                            "fantasyPrice": 147000,
                            "fantasySeasonPriceChange": 13000,
                            "fantasyRoundPriceChange": -8000
                        },
                        {
                            "playerFirstName": "Ben",
                            "playerId": 501034,
                            "playerLastName": "Spina",
                            "playerName": "Ben Spina",
                            "playerPosition": "Interchange",
                            "playerPositionId": 500014,
                            "playerStats": {
                                "allRunMetres": 52,
                                "allRuns": 7,
                                "decoys": 3,
                                "fantasyPointsTotal": 13,
                                "hitUps": 7,
                                "mins": 23,
                                "missedTackles": 1,
                                "passes": 1,
                                "passesPerRun": 0.14,
                                "penalties": 1,
                                "supports": 3,
                                "tackles": 12,
                                "hitupRunMeters": 52,
                                "ptbAll": 7,
                                "receipts": 8,
                                "postContactMetres": 25,
                                "ptbOneToTwo": 1,
                                "ptbThreeToFour": 4,
                                "ptbFourToFive": 2,
                                "doubles": 2,
                                "effectiveTacklePercentage": 92.3,
                                "ptbPenalties": 1,
                                "stint1": 1363
                            },
                            "playerTookTheField": true,
                            "shirtNum": 20,
                            "playerFirstInitial": "B",
                            "playerPositionAbbrev": "INT",
                            "fantasyPrice": 279000,
                            "fantasySeasonPriceChange": -10000
                        }
                    ]
                },
                "teamName": "North Queensland Cowboys",
                "teamNickName": "Cowboys",
                "teamStats": {
                    "allRunMetres": 1664,
                    "allRuns": 176,
                    "bombKicks": 2,
                    "bombKickMetres": 62,
                    "bombKicksDefused": 1,
                    "bombKicksNotDefused": 2,
                    "completeSets": 33,
                    "completionPercentage": 77,
                    "conversions": 5,
                    "conversionsAttempts": 6,
                    "conversionsMissed": 1,
                    "decoys": 33,
                    "dummyHalfRuns": 3,
                    "errors": 10,
                    "goalConversionRate": 83.33,
                    "allGoals": 5,
                    "allGoalsAttempted": 6,
                    "allGoalsMissed": 1,
                    "hitUps": 99,
                    "incompleteSets": 10,
                    "ineffectiveTackles": 6,
                    "kickDead": 1,
                    "kickMetres": 453,
                    "kickReturnMetres": 227,
                    "kickReturns": 19,
                    "kicks": 23,
                    "kicksDefused": 5,
                    "kicksNotDefused": 4,
                    "linebreakAssists": 3,
                    "linebreaks": 4,
                    "missedTackles": 13,
                    "offloads": 5,
                    "oneOnOneTackles": 8,
                    "passes": 275,
                    "passesPerRun": 1.56,
                    "penalties": 3,
                    "points": 34,
                    "pointsConceded": 6,
                    "possession": 60,
                    "scrumWins": 7,
                    "supports": 66,
                    "tackleBreaks": 28,
                    "tackles": 254,
                    "sets": 43,
                    "tries": 6,
                    "triesConceded": 1,
                    "tryAssists": 4,
                    "tryCause": 2,
                    "hitupRunMeters": 918,
                    "evasionRuns": 55,
                    "evasionRunMetres": 492,
                    "dummyHalfRunMetres": 27,
                    "ptbTotal": 153,
                    "twoManTackles": 68,
                    "threeManTackles": 68,
                    "fourManPlusTackles": 1,
                    "tryScoringPercentage": 18.18,
                    "shiftsLeft": 16,
                    "shiftsRight": 10,
                    "receipts": 472,
                    "forcedDropOutKicker": 6,
                    "grubberKick": 13,
                    "crossFieldKick": 1,
                    "postContactMetres": 607,
                    "dummyPasses": 12,
                    "kickPressures": 3,
                    "lineEngagedRuns": 5,
                    "ptbOneToTwo": 8,
                    "ptbTwoToThree": 24,
                    "ptbThreeToFour": 70,
                    "ptbFourToFive": 43,
                    "ptbFivePlus": 8,
                    "interchangeUsed": 8,
                    "doubles": 30,
                    "longKicksSpace": 4,
                    "effectiveTacklePercentage": 93,
                    "ptbPenalties": 3,
                    "averageSetDistance": 38.7,
                    "completeSets1stHalf": 17,
                    "completeSets2ndHalf": 16,
                    "completionPercentage1stHalf": 80.95,
                    "completionPercentage2ndHalf": 72.73,
                    "incompleteSets1stHalf": 4,
                    "incompleteSets2ndHalf": 6,
                    "incompletionPercentage1stHalf": 19.05,
                    "incompletionPercentage2ndHalf": 27.27
                },
                "teamHexColour": "fcde05",
                "teamHexColour2": "102247"
            },
            {
                "score": {
                    "conversions": 1,
                    "points": 6,
                    "tries": 1
                },
                "team1stHalfScore": 6,
                "team2ndHalfScore": 0,
                "teamAbbr": "WAR",
                "teamFinalScore": 6,
                "teamFullTimeScore": 6,
                "teamHalfTimeScore": 6,
                "teamId": 500032,
                "teamLineup": {
                    "teamLineUpStatusID": 4,
                    "teamLineUpStatus": "Final",
                    "injuriesAndSuspensions": {
                        "injury": [],
                        "suspension": []
                    },
                    "insAndOuts": {
                        "inOut": [
                            {
                                "inOut": "In",
                                "playerFirstName": "James",
                                "playerId": "501286",
                                "playerLastName": "Gavet",
                                "playerName": "James Gavet"
                            },
                            {
                                "inOut": "Out",
                                "playerFirstName": "Jazz",
                                "playerId": "501451",
                                "playerLastName": "Tevaga",
                                "playerName": "Jazz Tevaga"
                            },
                            {
                                "inOut": "In",
                                "playerFirstName": "Ma'afoaeata",
                                "playerId": "501614",
                                "playerLastName": "Hingano",
                                "playerName": "Ma'afoaeata Hingano"
                            },
                            {
                                "inOut": "In",
                                "playerFirstName": "Matthew",
                                "playerId": "500307",
                                "playerLastName": "Allwood",
                                "playerName": "Matthew Allwood"
                            },
                            {
                                "inOut": "Out",
                                "playerFirstName": "Solomone",
                                "playerId": "500921",
                                "playerLastName": "Kata",
                                "playerName": "Solomone Kata"
                            },
                            {
                                "inOut": "Out",
                                "playerFirstName": "Tuimoala",
                                "playerId": "500927",
                                "playerLastName": "Lolohea",
                                "playerName": "Tuimoala Lolohea"
                            }
                        ]
                    },
                    "teamPlayer": [
                        {
                            "playerFirstName": "David",
                            "playerId": 500919,
                            "playerLastName": "Fusitua",
                            "playerName": "David Fusitua",
                            "playerPosition": "Fullback",
                            "playerPositionId": 500001,
                            "playerStats": {
                                "allRunMetres": 56,
                                "allRuns": 7,
                                "bombKicksDefused": 1,
                                "decoys": 2,
                                "errors": 1,
                                "fantasyPointsTotal": 22,
                                "kickReturnMetres": 22,
                                "kickReturns": 4,
                                "kicksDefused": 5,
                                "kicksNotDefused": 1,
                                "lineDropouts": 1,
                                "linebreaks": 1,
                                "mins": 80,
                                "missedTackles": 2,
                                "passes": 4,
                                "passesPerRun": 0.57,
                                "tackleBreaks": 1,
                                "tackles": 6,
                                "trySaves": 1,
                                "evasionRuns": 3,
                                "evasionRunMetres": 34,
                                "ptbAll": 9,
                                "receipts": 16,
                                "postContactMetres": 15,
                                "ptbOneToTwo": 1,
                                "ptbThreeToFour": 1,
                                "ptbFourToFive": 6,
                                "ptbFivePlus": 1,
                                "effectiveTacklePercentage": 75,
                                "stint1": 4800
                            },
                            "playerTookTheField": true,
                            "shirtNum": 1,
                            "playerFirstInitial": "D",
                            "playerPositionAbbrev": "FB",
                            "onTheField": true,
                            "fantasyPrice": 319000,
                            "fantasySeasonPriceChange": 58000,
                            "fantasyRoundPriceChange": -6000
                        },
                        {
                            "playerFirstName": "Ken",
                            "playerId": 500928,
                            "playerLastName": "Maumalo",
                            "playerName": "Ken Maumalo",
                            "playerPosition": "Winger 1",
                            "playerPositionId": 500002,
                            "playerStats": {
                                "allRunMetres": 40,
                                "allRuns": 5,
                                "fantasyPointsTotal": 3,
                                "kickReturnMetres": 6,
                                "kickReturns": 1,
                                "mins": 17,
                                "missedTackles": 1,
                                "passes": 1,
                                "passesPerRun": 0.2,
                                "tackles": 1,
                                "evasionRuns": 4,
                                "evasionRunMetres": 34,
                                "ptbAll": 5,
                                "receipts": 5,
                                "postContactMetres": 17,
                                "ptbOneToTwo": 1,
                                "ptbTwoToThree": 2,
                                "ptbThreeToFour": 2,
                                "effectiveTacklePercentage": 50,
                                "stint1": 1048
                            },
                            "playerTookTheField": true,
                            "shirtNum": 2,
                            "playerFirstInitial": "K",
                            "playerPositionAbbrev": "WG",
                            "fantasyPrice": 195000,
                            "fantasySeasonPriceChange": 45000,
                            "fantasyRoundPriceChange": -7000
                        },
                        {
                            "playerFirstName": "Blake",
                            "playerId": 500787,
                            "playerLastName": "Ayshford",
                            "playerName": "Blake Ayshford",
                            "playerPosition": "Centre 1",
                            "playerPositionId": 500003,
                            "playerStats": {
                                "allRunMetres": 56,
                                "allRuns": 6,
                                "errors": 1,
                                "fantasyPointsTotal": 17,
                                "ineffectiveTackles": 1,
                                "kicksDefused": 1,
                                "mins": 80,
                                "missedTackles": 1,
                                "passes": 2,
                                "passesPerRun": 0.33,
                                "supports": 1,
                                "tackleBreaks": 1,
                                "tackles": 12,
                                "evasionRuns": 6,
                                "evasionRunMetres": 56,
                                "ptbAll": 6,
                                "receipts": 9,
                                "postContactMetres": 29,
                                "kickPressures": 1,
                                "ptbTwoToThree": 1,
                                "ptbThreeToFour": 5,
                                "doubles": 1,
                                "effectiveTacklePercentage": 85.7,
                                "stint1": 4800
                            },
                            "playerTookTheField": true,
                            "shirtNum": 3,
                            "playerFirstInitial": "B",
                            "playerPositionAbbrev": "CT",
                            "onTheField": true,
                            "fantasyPrice": 218000,
                            "fantasySeasonPriceChange": 22000,
                            "fantasyRoundPriceChange": -36000
                        },
                        {
                            "playerFirstName": "Matthew",
                            "playerId": 500307,
                            "playerLastName": "Allwood",
                            "playerName": "Matthew Allwood",
                            "playerPosition": "Centre 2",
                            "playerPositionId": 500004,
                            "playerStats": {
                                "allRunMetres": 82,
                                "allRuns": 9,
                                "decoys": 1,
                                "errors": 1,
                                "fantasyPointsTotal": 8,
                                "ineffectiveTackles": 1,
                                "mins": 80,
                                "missedTackles": 2,
                                "passes": 4,
                                "passesPerRun": 0.44,
                                "penalties": 1,
                                "supports": 4,
                                "tackleBreaks": 1,
                                "tackles": 5,
                                "tryCause": 1,
                                "evasionRuns": 9,
                                "evasionRunMetres": 82,
                                "ptbAll": 8,
                                "receipts": 14,
                                "postContactMetres": 33,
                                "ptbTwoToThree": 2,
                                "ptbThreeToFour": 5,
                                "ptbFourToFive": 1,
                                "effectiveTacklePercentage": 62.5,
                                "generalPlayPenalties": 1,
                                "stint1": 4800
                            },
                            "playerTookTheField": true,
                            "shirtNum": 18,
                            "playerFirstInitial": "M",
                            "playerPositionAbbrev": "CT",
                            "onTheField": true,
                            "fantasyPrice": 225000,
                            "fantasySeasonPriceChange": -24000
                        },
                        {
                            "playerFirstName": "Manu",
                            "playerId": 500722,
                            "playerLastName": "Vatuvei",
                            "playerName": "Manu Vatuvei",
                            "playerPosition": "Winger 2",
                            "playerPositionId": 500005,
                            "playerStats": {
                                "allRunMetres": 144,
                                "allRuns": 16,
                                "errors": 1,
                                "fantasyPointsTotal": 20,
                                "kicksDefused": 2,
                                "kicksNotDefused": 3,
                                "mins": 80,
                                "missedTackles": 1,
                                "passes": 2,
                                "passesPerRun": 0.12,
                                "penalties": 1,
                                "supports": 3,
                                "tackleBreaks": 3,
                                "tackles": 1,
                                "tryCause": 3,
                                "evasionRuns": 16,
                                "evasionRunMetres": 144,
                                "ptbAll": 15,
                                "receipts": 18,
                                "postContactMetres": 66,
                                "ptbTwoToThree": 12,
                                "ptbThreeToFour": 3,
                                "effectiveTacklePercentage": 50,
                                "generalPlayPenalties": 1,
                                "stint1": 4800
                            },
                            "playerTookTheField": true,
                            "shirtNum": 5,
                            "playerFirstInitial": "M",
                            "playerPositionAbbrev": "WG",
                            "onTheField": true,
                            "fantasyPrice": 226000,
                            "fantasySeasonPriceChange": -100000,
                            "fantasyRoundPriceChange": -4000
                        },
                        {
                            "playerFirstName": "Thomas",
                            "playerId": 500707,
                            "playerLastName": "Leuluai",
                            "playerName": "Thomas Leuluai",
                            "playerPosition": "Five-Eighth",
                            "playerPositionId": 500006,
                            "playerStats": {
                                "bombKicks": 1,
                                "bombKickMetres": 21,
                                "decoys": 1,
                                "fantasyPointsTotal": 34,
                                "ineffectiveTackles": 1,
                                "kickMetres": 42,
                                "kicks": 2,
                                "kicksNotDefused": 1,
                                "mins": 80,
                                "missedTackles": 1,
                                "passes": 59,
                                "oneOnOneTackles": 6,
                                "tackles": 34,
                                "tryCause": 2,
                                "receipts": 60,
                                "grubberKick": 1,
                                "kickPressures": 1,
                                "doubles": 5,
                                "effectiveTacklePercentage": 94.4,
                                "stint1": 4800
                            },
                            "playerTookTheField": true,
                            "shirtNum": 6,
                            "playerFirstInitial": "T",
                            "playerPositionAbbrev": "FE",
                            "onTheField": true,
                            "fantasyPrice": 283000,
                            "fantasySeasonPriceChange": 4000,
                            "fantasyRoundPriceChange": 4000
                        },
                        {
                            "playerFirstName": "Shaun",
                            "playerId": 500705,
                            "playerLastName": "Johnson",
                            "playerName": "Shaun Johnson",
                            "playerPosition": "Halfback",
                            "playerPositionId": 500007,
                            "playerStats": {
                                "allRunMetres": 14,
                                "allRuns": 2,
                                "bombKicks": 2,
                                "bombKickMetres": 57,
                                "conversions": 1,
                                "conversionsAttempts": 1,
                                "errors": 3,
                                "fantasyPointsTotal": 34,
                                "goalConversionRate": 100,
                                "allGoals": 1,
                                "allGoalsAttempted": 1,
                                "kickMetres": 286,
                                "kicks": 12,
                                "lineDropouts": 5,
                                "linebreakAssists": 1,
                                "mins": 80,
                                "missedTackles": 1,
                                "passes": 28,
                                "passesPerRun": 14,
                                "points": 2,
                                "supports": 1,
                                "tackleBreaks": 1,
                                "tackles": 20,
                                "tryCause": 1,
                                "evasionRuns": 2,
                                "evasionRunMetres": 14,
                                "receipts": 40,
                                "chipKick": 1,
                                "grubberKick": 3,
                                "crossFieldKick": 1,
                                "postContactMetres": 5,
                                "dummyPasses": 1,
                                "doubles": 3,
                                "longKicksSpace": 3,
                                "effectiveTacklePercentage": 95.2,
                                "stint1": 4800
                            },
                            "playerTookTheField": true,
                            "shirtNum": 7,
                            "playerFirstInitial": "S",
                            "playerPositionAbbrev": "HB",
                            "onTheField": true,
                            "fantasyPrice": 479000,
                            "fantasySeasonPriceChange": 2000,
                            "fantasyRoundPriceChange": -30000
                        },
                        {
                            "playerFirstName": "Jacob",
                            "playerId": 500708,
                            "playerLastName": "Lillyman",
                            "playerName": "Jacob Lillyman",
                            "playerPosition": "Prop 1",
                            "playerPositionId": 500008,
                            "playerStats": {
                                "allRunMetres": 64,
                                "allRuns": 7,
                                "decoys": 4,
                                "errors": 1,
                                "fantasyPointsTotal": 27,
                                "hitUps": 7,
                                "mins": 41,
                                "missedTackles": 5,
                                "passes": 1,
                                "passesPerRun": 0.14,
                                "oneOnOneTackles": 1,
                                "supports": 1,
                                "tackles": 33,
                                "tryCause": 2,
                                "hitupRunMeters": 64,
                                "ptbAll": 6,
                                "receipts": 8,
                                "postContactMetres": 24,
                                "ptbThreeToFour": 5,
                                "ptbFourToFive": 1,
                                "doubles": 5,
                                "effectiveTacklePercentage": 86.8,
                                "stint1": 1599,
                                "stint2": 821
                            },
                            "playerTookTheField": true,
                            "shirtNum": 8,
                            "playerFirstInitial": "J",
                            "playerPositionAbbrev": "PR",
                            "onTheField": true,
                            "fantasyPrice": 287000,
                            "fantasySeasonPriceChange": -12000,
                            "fantasyRoundPriceChange": -6000
                        },
                        {
                            "playerFirstName": "Nathaniel",
                            "playerId": 501319,
                            "playerLastName": "Roache",
                            "playerName": "Nathaniel Roache",
                            "playerPosition": "Hooker",
                            "playerPositionId": 500009,
                            "playerStats": {
                                "allRunMetres": 31,
                                "allRuns": 4,
                                "bombKicksNotDefused": 1,
                                "dummyHalfRuns": 3,
                                "errors": 1,
                                "fantasyPointsTotal": 29,
                                "ineffectiveTackles": 1,
                                "kickReturnMetres": 6,
                                "kickReturns": 1,
                                "kicksNotDefused": 1,
                                "mins": 80,
                                "missedTackles": 1,
                                "passes": 22,
                                "passesPerRun": 5.5,
                                "oneOnOneTackles": 3,
                                "tackles": 25,
                                "trySaves": 1,
                                "dummyHalfRunMetres": 25,
                                "ptbAll": 4,
                                "receipts": 27,
                                "postContactMetres": 7,
                                "dummyPasses": 2,
                                "kickPressures": 1,
                                "ptbTwoToThree": 1,
                                "ptbThreeToFour": 3,
                                "doubles": 1,
                                "effectiveTacklePercentage": 92.6,
                                "stint1": 4800
                            },
                            "playerTookTheField": true,
                            "shirtNum": 14,
                            "playerFirstInitial": "N",
                            "playerPositionAbbrev": "HK",
                            "onTheField": true,
                            "fantasyPrice": 138000,
                            "fantasySeasonPriceChange": 8000,
                            "fantasyRoundPriceChange": 10000
                        },
                        {
                            "playerFirstName": "Albert",
                            "playerId": 500937,
                            "playerLastName": "Vete",
                            "playerName": "Albert Vete",
                            "playerPosition": "Prop 2",
                            "playerPositionId": 500010,
                            "playerStats": {
                                "allRunMetres": 57,
                                "allRuns": 6,
                                "decoys": 3,
                                "fantasyPointsTotal": 39,
                                "hitUps": 6,
                                "mins": 44,
                                "missedTackles": 1,
                                "offloads": 1,
                                "passes": 4,
                                "passesPerRun": 0.67,
                                "penalties": 2,
                                "supports": 3,
                                "tackleBreaks": 1,
                                "tackles": 35,
                                "tryCause": 1,
                                "hitupRunMeters": 57,
                                "ptbAll": 5,
                                "receipts": 10,
                                "postContactMetres": 23,
                                "kickPressures": 2,
                                "ptbThreeToFour": 3,
                                "ptbFourToFive": 2,
                                "doubles": 8,
                                "effectiveTacklePercentage": 97.2,
                                "ptbPenalties": 1,
                                "offsidePenalties": 1,
                                "stint1": 1271,
                                "stint2": 980,
                                "stint3": 427
                            },
                            "playerTookTheField": true,
                            "shirtNum": 10,
                            "playerFirstInitial": "A",
                            "playerPositionAbbrev": "PR",
                            "onTheField": true,
                            "fantasyPrice": 285000,
                            "fantasySeasonPriceChange": 31000,
                            "fantasyRoundPriceChange": -3000
                        },
                        {
                            "playerFirstName": "Bodene",
                            "playerId": 500664,
                            "playerLastName": "Thompson",
                            "playerName": "Bodene Thompson",
                            "playerPosition": "2nd Row 1",
                            "playerPositionId": 500011,
                            "playerStats": {
                                "allRunMetres": 44,
                                "allRuns": 6,
                                "decoys": 2,
                                "fantasyPointsTotal": 54,
                                "hitUps": 6,
                                "kickMetres": 44,
                                "kicks": 1,
                                "mins": 80,
                                "missedTackles": 1,
                                "offloads": 1,
                                "passes": 3,
                                "passesPerRun": 0.5,
                                "oneOnOneTackles": 1,
                                "tackles": 43,
                                "trySaves": 1,
                                "hitupRunMeters": 44,
                                "ptbAll": 5,
                                "receipts": 10,
                                "postContactMetres": 15,
                                "kickPressures": 2,
                                "ptbTwoToThree": 1,
                                "ptbThreeToFour": 4,
                                "doubles": 9,
                                "longKicksSpace": 1,
                                "effectiveTacklePercentage": 97.7,
                                "stint1": 4800
                            },
                            "playerTookTheField": true,
                            "shirtNum": 11,
                            "playerFirstInitial": "B",
                            "playerPositionAbbrev": "2R",
                            "onTheField": true,
                            "fantasyPrice": 512000,
                            "fantasySeasonPriceChange": 62000,
                            "fantasyRoundPriceChange": -9000
                        },
                        {
                            "playerFirstName": "Ryan",
                            "playerId": 500596,
                            "playerLastName": "Hoffman",
                            "playerName": "Ryan Hoffman",
                            "playerPosition": "2nd Row 2",
                            "playerPositionId": 500012,
                            "playerStats": {
                                "allRunMetres": 86,
                                "allRuns": 10,
                                "decoys": 2,
                                "errors": 1,
                                "fantasyPointsTotal": 36,
                                "hitUps": 10,
                                "ineffectiveTackles": 1,
                                "kicksDefused": 1,
                                "linebreakAssists": 1,
                                "linebreaks": 1,
                                "mins": 80,
                                "missedTackles": 2,
                                "offloads": 1,
                                "passes": 3,
                                "passesPerRun": 0.3,
                                "oneOnOneTackles": 1,
                                "penalties": 2,
                                "points": 4,
                                "supports": 5,
                                "tackleBreaks": 2,
                                "tackles": 15,
                                "tries": 1,
                                "tryCause": 1,
                                "hitupRunMeters": 86,
                                "ptbAll": 8,
                                "receipts": 14,
                                "postContactMetres": 33,
                                "kickPressures": 4,
                                "ptbTwoToThree": 2,
                                "ptbThreeToFour": 3,
                                "ptbFourToFive": 3,
                                "effectiveTacklePercentage": 83.3,
                                "ptbPenalties": 2,
                                "stint1": 4800
                            },
                            "playerTookTheField": true,
                            "shirtNum": 12,
                            "playerFirstInitial": "R",
                            "playerPositionAbbrev": "2R",
                            "onTheField": true,
                            "fantasyPrice": 311000,
                            "fantasySeasonPriceChange": 10000,
                            "fantasyRoundPriceChange": 13000
                        },
                        {
                            "playerFirstName": "Simon",
                            "playerId": 500712,
                            "playerLastName": "Mannering",
                            "playerName": "Simon Mannering",
                            "playerPosition": "Lock",
                            "playerPositionId": 500013,
                            "playerStats": {
                                "allRunMetres": 70,
                                "allRuns": 9,
                                "decoys": 4,
                                "fantasyPointsTotal": 81,
                                "hitUps": 7,
                                "ineffectiveTackles": 1,
                                "mins": 73,
                                "passes": 8,
                                "passesPerRun": 0.89,
                                "oneOnOneTackles": 2,
                                "supports": 6,
                                "tackles": 69,
                                "trySaves": 1,
                                "hitupRunMeters": 63,
                                "evasionRuns": 2,
                                "evasionRunMetres": 7,
                                "ptbAll": 7,
                                "receipts": 15,
                                "postContactMetres": 26,
                                "dummyPasses": 1,
                                "kickPressures": 1,
                                "lineEngagedRuns": 2,
                                "ptbTwoToThree": 3,
                                "ptbThreeToFour": 2,
                                "ptbFourToFive": 2,
                                "doubles": 14,
                                "effectiveTacklePercentage": 98.6,
                                "stint1": 4372
                            },
                            "playerTookTheField": true,
                            "shirtNum": 13,
                            "playerFirstInitial": "S",
                            "playerPositionAbbrev": "LK",
                            "fantasyPrice": 507000,
                            "fantasySeasonPriceChange": -28000,
                            "fantasyRoundPriceChange": 4000
                        },
                        {
                            "playerFirstName": "Sam",
                            "playerId": 500926,
                            "playerLastName": "Lisone",
                            "playerName": "Sam Lisone",
                            "playerPosition": "Interchange",
                            "playerPositionId": 500014,
                            "playerStats": {
                                "allRunMetres": 87,
                                "allRuns": 9,
                                "decoys": 4,
                                "errors": 1,
                                "fantasyPointsTotal": 19,
                                "hitUps": 8,
                                "kickReturnMetres": 12,
                                "kickReturns": 1,
                                "mins": 33,
                                "missedTackles": 5,
                                "passes": 2,
                                "passesPerRun": 0.22,
                                "oneOnOneTackles": 1,
                                "supports": 2,
                                "tackleBreaks": 1,
                                "tackles": 20,
                                "hitupRunMeters": 75,
                                "ptbAll": 8,
                                "receipts": 12,
                                "postContactMetres": 41,
                                "dummyPasses": 2,
                                "ptbOneToTwo": 1,
                                "ptbTwoToThree": 4,
                                "ptbThreeToFour": 3,
                                "doubles": 3,
                                "effectiveTacklePercentage": 80,
                                "stint1": 1275,
                                "stint2": 718
                            },
                            "playerTookTheField": true,
                            "shirtNum": 15,
                            "playerFirstInitial": "S",
                            "playerPositionAbbrev": "INT",
                            "onTheField": true,
                            "fantasyPrice": 234000,
                            "fantasySeasonPriceChange": 7000,
                            "fantasyRoundPriceChange": -5000
                        },
                        {
                            "playerFirstName": "Ben",
                            "playerId": 500715,
                            "playerLastName": "Matulino",
                            "playerName": "Ben Matulino",
                            "playerPosition": "Interchange",
                            "playerPositionId": 500014,
                            "playerStats": {
                                "allRunMetres": 76,
                                "allRuns": 8,
                                "decoys": 2,
                                "fantasyPointsTotal": 25,
                                "hitUps": 7,
                                "kickReturnMetres": 10,
                                "kickReturns": 1,
                                "mins": 31,
                                "missedTackles": 1,
                                "tackles": 20,
                                "hitupRunMeters": 66,
                                "ptbAll": 8,
                                "receipts": 8,
                                "postContactMetres": 31,
                                "dummyPasses": 1,
                                "ptbTwoToThree": 1,
                                "ptbThreeToFour": 4,
                                "ptbFourToFive": 2,
                                "ptbFivePlus": 1,
                                "doubles": 3,
                                "effectiveTacklePercentage": 95.2,
                                "stint1": 1728,
                                "stint2": 103
                            },
                            "playerTookTheField": true,
                            "shirtNum": 16,
                            "playerFirstInitial": "B",
                            "playerPositionAbbrev": "INT",
                            "fantasyPrice": 342000,
                            "fantasySeasonPriceChange": -83000,
                            "fantasyRoundPriceChange": -14000
                        },
                        {
                            "playerFirstName": "James",
                            "playerId": 501286,
                            "playerLastName": "Gavet",
                            "playerName": "James Gavet",
                            "playerPosition": "Interchange",
                            "playerPositionId": 500014,
                            "playerStats": {
                                "allRunMetres": 38,
                                "allRuns": 4,
                                "decoys": 1,
                                "fantasyPointsTotal": 15,
                                "hitUps": 4,
                                "mins": 18,
                                "missedTackles": 2,
                                "tackles": 16,
                                "tryCause": 1,
                                "hitupRunMeters": 38,
                                "ptbAll": 3,
                                "receipts": 4,
                                "postContactMetres": 18,
                                "ptbThreeToFour": 2,
                                "ptbFivePlus": 1,
                                "doubles": 3,
                                "effectiveTacklePercentage": 88.9,
                                "stint1": 1105
                            },
                            "playerTookTheField": true,
                            "shirtNum": 17,
                            "playerFirstInitial": "J",
                            "playerPositionAbbrev": "INT",
                            "fantasyPrice": 203000,
                            "fantasySeasonPriceChange": 69000
                        },
                        {
                            "playerFirstName": "Ma'afoaeata",
                            "playerId": 501614,
                            "playerLastName": "Hingano",
                            "playerName": "Ma'afoaeata Hingano",
                            "playerPosition": "Interchange",
                            "playerPositionId": 500014,
                            "playerStats": {
                                "allRunMetres": 74,
                                "allRuns": 8,
                                "errors": 2,
                                "fantasyPointsTotal": 30,
                                "kickMetres": 32,
                                "kicks": 1,
                                "linebreakAssists": 1,
                                "linebreaks": 1,
                                "mins": 63,
                                "missedTackles": 1,
                                "passes": 27,
                                "passesPerRun": 3.38,
                                "oneOnOneTackles": 1,
                                "supports": 3,
                                "tackleBreaks": 2,
                                "tackles": 11,
                                "tryAssists": 1,
                                "tryCause": 1,
                                "evasionRuns": 8,
                                "evasionRunMetres": 74,
                                "ptbAll": 3,
                                "receipts": 34,
                                "postContactMetres": 16,
                                "dummyPasses": 1,
                                "kickPressures": 1,
                                "lineEngagedRuns": 3,
                                "ptbThreeToFour": 1,
                                "ptbFourToFive": 2,
                                "doubles": 1,
                                "longKicksSpace": 1,
                                "effectiveTacklePercentage": 91.7,
                                "stint1": 3752
                            },
                            "playerTookTheField": true,
                            "shirtNum": 22,
                            "playerFirstInitial": "M",
                            "playerPositionAbbrev": "INT",
                            "onTheField": true,
                            "fantasyPrice": 130000
                        }
                    ]
                },
                "teamName": "New Zealand Warriors",
                "teamNickName": "Warriors",
                "teamStats": {
                    "allRunMetres": 1020,
                    "allRuns": 116,
                    "bombKicks": 3,
                    "bombKickMetres": 77,
                    "bombKicksDefused": 1,
                    "bombKicksNotDefused": 1,
                    "completeSets": 17,
                    "completionPercentage": 57,
                    "conversions": 1,
                    "conversionsAttempts": 1,
                    "decoys": 26,
                    "dummyHalfRuns": 3,
                    "errors": 13,
                    "goalConversionRate": 100,
                    "allGoals": 1,
                    "allGoalsAttempted": 1,
                    "hitUps": 55,
                    "incompleteSets": 13,
                    "ineffectiveTackles": 6,
                    "kickMetres": 404,
                    "kickReturnMetres": 56,
                    "kickReturns": 8,
                    "kicks": 16,
                    "kicksDefused": 9,
                    "kicksNotDefused": 6,
                    "lineDropouts": 6,
                    "linebreakAssists": 3,
                    "linebreaks": 3,
                    "missedTackles": 28,
                    "offloads": 3,
                    "oneOnOneTackles": 16,
                    "passes": 170,
                    "passesPerRun": 1.47,
                    "penalties": 6,
                    "points": 6,
                    "pointsConceded": 34,
                    "possession": 40,
                    "scrumWins": 9,
                    "supports": 29,
                    "tackleBreaks": 13,
                    "tackles": 366,
                    "sets": 30,
                    "tries": 1,
                    "triesConceded": 6,
                    "tryAssists": 1,
                    "tryCause": 13,
                    "trySaves": 4,
                    "hitupRunMeters": 494,
                    "evasionRuns": 50,
                    "evasionRunMetres": 445,
                    "dummyHalfRunMetres": 25,
                    "ptbTotal": 100,
                    "twoManTackles": 55,
                    "threeManTackles": 40,
                    "fourManPlusTackles": 3,
                    "tryScoringPercentage": 5.88,
                    "shiftsLeft": 15,
                    "shiftsRight": 11,
                    "receipts": 304,
                    "chipKick": 1,
                    "grubberKick": 4,
                    "crossFieldKick": 1,
                    "postContactMetres": 398,
                    "dummyPasses": 8,
                    "kickPressures": 13,
                    "lineEngagedRuns": 5,
                    "ptbOneToTwo": 3,
                    "ptbTwoToThree": 29,
                    "ptbThreeToFour": 46,
                    "ptbFourToFive": 19,
                    "ptbFivePlus": 3,
                    "interchangeUsed": 7,
                    "interchangeLeft": 1,
                    "doubles": 56,
                    "longKicksSpace": 5,
                    "effectiveTacklePercentage": 91.5,
                    "ptbPenalties": 3,
                    "generalPlayPenalties": 2,
                    "offsidePenalties": 1,
                    "averageSetDistance": 34,
                    "completeSets1stHalf": 9,
                    "completeSets2ndHalf": 8,
                    "completionPercentage1stHalf": 60,
                    "completionPercentage2ndHalf": 53.33,
                    "incompleteSets1stHalf": 6,
                    "incompleteSets2ndHalf": 7,
                    "incompletionPercentage1stHalf": 40,
                    "incompletionPercentage2ndHalf": 46.67
                },
                "teamHexColour": "cccccc",
                "teamHexColour2": "000000"
            }
        ]
    }
}