{
    "competitionId": 111,
    "competitionName": "NRL Telstra Premiership",
    "gameId": 20151110970,
    "gameInfo": {
        "assistantReferee1Id": 500013,
        "numberOfPeriods": 2,
        "assistantReferee1Name": "Brett Suttor",
        "assistantReferee2Id": 500040,
        "assistantReferee2Name": "Nick Beashel",
        "gameDate": "2015-05-10",
        "gameHashTag": "#NRLEelsStorm",
        "gameNumber": 7,
        "gameSeconds": 4800,
        "gameTime": "1:20:00",
        "groundConditionId": 2,
        "groundConditionName": "Good",
        "referee1Id": 500004,
        "referee1Name": "Gerard Sutton",
        "referee2Id": 500009,
        "referee2Name": "Alan Shortall",
        "startTime": "2015-05-10T16:00:00",
        "startTimeUTC": "2015-05-10T06:00:00Z",
        "venueId": 500008,
        "venueName": "Pirtek Stadium",
        "videoReferee1Id": 500232,
        "videoReferee1Name": "Luke Patten",
        "videoReferee2Id": 500027,
        "videoReferee2Name": "Bernard Sutton",
        "weatherId": 2,
        "weatherName": "Fine"
    },
    "gameState": "Final",
    "gameStateId": 8,
    "roundId": 9,
    "seasonId": 2015,
    "teams": {
        "teamsMatch": [
            {
                "isHomeTeam": true,
                "score": {
                    "conversions": 1,
                    "points": 10,
                    "tries": 2
                },
                "team1stHalfScore": 10,
                "team2ndHalfScore": 0,
                "teamAbbr": "PAR",
                "teamFinalScore": 10,
                "teamFullTimeScore": 10,
                "teamHalfTimeScore": 10,
                "teamId": 500031,
                "teamLineup": {
                    "injuriesAndSuspensions": {
                        "injury": [],
                        "suspension": []
                    },
                    "insAndOuts": {
                        "inOut": [
                            {
                                "inOut": "Out",
                                "playerFirstName": "Bureta",
                                "playerId": "500668",
                                "playerLastName": "Faraimo",
                                "playerName": "Bureta Faraimo"
                            },
                            {
                                "inOut": "In",
                                "playerFirstName": "Isaac",
                                "playerId": "500789",
                                "playerLastName": "De Gois",
                                "playerName": "Isaac De Gois"
                            },
                            {
                                "inOut": "Out",
                                "playerFirstName": "John",
                                "playerId": "500891",
                                "playerLastName": "Folau",
                                "playerName": "John Folau"
                            },
                            {
                                "inOut": "Out",
                                "playerFirstName": "Pauli",
                                "playerId": "500685",
                                "playerLastName": "Pauli",
                                "playerName": "Pauli Pauli"
                            },
                            {
                                "inOut": "In",
                                "playerFirstName": "Ryan",
                                "playerId": "500682",
                                "playerLastName": "Morgan",
                                "playerName": "Ryan Morgan"
                            },
                            {
                                "inOut": "In",
                                "playerFirstName": "Semi",
                                "playerId": "500690",
                                "playerLastName": "Radradra",
                                "playerName": "Semi Radradra"
                            }
                        ]
                    },
                    "teamPlayer": [
                        {
                            "playerFirstName": "Reece",
                            "playerId": 500331,
                            "playerLastName": "Robinson",
                            "playerName": "Reece Robinson",
                            "playerPosition": "Fullback",
                            "playerPositionId": 500001,
                            "playerStats": {
                                "allRunMetres": 124,
                                "allRuns": 15,
                                "bombKicksDefused": 2,
                                "decoys": 1,
                                "dummyHalfRuns": 1,
                                "errors": 1,
                                "fantasyPointsTotal": 39,
                                "kickReturnMetres": 67,
                                "kickReturns": 8,
                                "kicksDefused": 4,
                                "linebreakAssists": 1,
                                "mins": 80,
                                "offloads": 2,
                                "oneOnOneTackles": 1,
                                "penalties": 1,
                                "supports": 5,
                                "tackleBreaks": 3,
                                "tackles": 7,
                                "tryAssists": 1,
                                "evasionRuns": 6,
                                "evasionRunMetres": 44,
                                "dummyHalfRunMetres": 13,
                                "ptbFast": 14.29,
                                "ptbNeutral": 85.71,
                                "ptbAll": 7
                            },
                            "playerTookTheField": true,
                            "shirtNum": 1
                        },
                        {
                            "playerFirstName": "Semi",
                            "playerId": 500690,
                            "playerLastName": "Radradra",
                            "playerName": "Semi Radradra",
                            "playerPosition": "Winger 1",
                            "playerPositionId": 500002,
                            "playerStats": {
                                "allRunMetres": 191,
                                "allRuns": 14,
                                "fantasyPointsTotal": 27,
                                "kickReturnMetres": 60,
                                "kickReturns": 4,
                                "kicksNotDefused": 1,
                                "mins": 80,
                                "missedTackles": 1,
                                "supports": 2,
                                "tackleBreaks": 3,
                                "tackles": 1,
                                "tryCause": 4,
                                "evasionRuns": 10,
                                "evasionRunMetres": 131,
                                "ptbFast": 35.71,
                                "ptbNeutral": 64.29,
                                "ptbAll": 14
                            },
                            "playerTookTheField": true,
                            "shirtNum": 2
                        },
                        {
                            "playerFirstName": "Will",
                            "playerId": 500672,
                            "playerLastName": "Hopoate",
                            "playerName": "Will Hopoate",
                            "playerPosition": "Centre 1",
                            "playerPositionId": 500003,
                            "playerStats": {
                                "allRunMetres": 176,
                                "allRuns": 19,
                                "dummyHalfRuns": 1,
                                "errors": 3,
                                "fantasyPointsTotal": 43,
                                "hitUps": 1,
                                "kickReturnMetres": 26,
                                "kickReturns": 3,
                                "kicksDefused": 2,
                                "linebreakAssists": 1,
                                "linebreaks": 1,
                                "mins": 80,
                                "missedTackles": 3,
                                "points": 4,
                                "supports": 2,
                                "tackleBreaks": 4,
                                "tackles": 5,
                                "tries": 1,
                                "tryAssists": 1,
                                "tryCause": 1,
                                "hitupRunMeters": 12,
                                "evasionRuns": 14,
                                "evasionRunMetres": 127,
                                "dummyHalfRunMetres": 11,
                                "ptbFast": 22.22,
                                "ptbNeutral": 77.78,
                                "ptbAll": 18
                            },
                            "playerTookTheField": true,
                            "shirtNum": 3
                        },
                        {
                            "playerFirstName": "Brad",
                            "playerId": 500065,
                            "playerLastName": "Takairangi",
                            "playerName": "Brad Takairangi",
                            "playerPosition": "Centre 2",
                            "playerPositionId": 500004,
                            "playerStats": {
                                "allRunMetres": 58,
                                "allRuns": 6,
                                "decoys": 1,
                                "errors": 2,
                                "fantasyPointsTotal": 9,
                                "ineffectiveTackles": 1,
                                "mins": 80,
                                "missedTackles": 4,
                                "oneOnOneTackles": 1,
                                "supports": 7,
                                "tackleBreaks": 2,
                                "tackles": 10,
                                "tryCause": 2,
                                "evasionRuns": 6,
                                "evasionRunMetres": 58,
                                "ptbNeutral": 100,
                                "ptbAll": 4
                            },
                            "playerTookTheField": true,
                            "shirtNum": 4
                        },
                        {
                            "playerFirstName": "Ryan",
                            "playerId": 500682,
                            "playerLastName": "Morgan",
                            "playerName": "Ryan Morgan",
                            "playerPosition": "Winger 2",
                            "playerPositionId": 500005,
                            "playerStats": {
                                "allRunMetres": 78,
                                "allRuns": 9,
                                "dummyHalfRuns": 1,
                                "fantasyPointsTotal": 39,
                                "hitUps": 1,
                                "ineffectiveTackles": 2,
                                "linebreaks": 1,
                                "mins": 80,
                                "missedTackles": 1,
                                "oneOnOneTackles": 2,
                                "points": 4,
                                "supports": 5,
                                "tackleBreaks": 1,
                                "tackles": 19,
                                "tries": 1,
                                "tryCause": 1,
                                "hitupRunMeters": 13,
                                "evasionRuns": 7,
                                "evasionRunMetres": 63,
                                "dummyHalfRunMetres": 2,
                                "ptbFast": 14.29,
                                "ptbNeutral": 85.71,
                                "ptbAll": 7
                            },
                            "playerTookTheField": true,
                            "shirtNum": 5
                        },
                        {
                            "playerFirstName": "Corey",
                            "playerId": 500684,
                            "playerLastName": "Norman",
                            "playerName": "Corey Norman",
                            "playerPosition": "Five-eighth",
                            "playerPositionId": 500006,
                            "playerStats": {
                                "allRunMetres": 71,
                                "allRuns": 8,
                                "bombKicks": 2,
                                "bombKickMetres": 36,
                                "fantasyPointsTotal": 45,
                                "ineffectiveTackles": 2,
                                "kickMetres": 48,
                                "kicks": 3,
                                "linebreaks": 1,
                                "mins": 80,
                                "missedTackles": 2,
                                "offloads": 3,
                                "oneOnOneTackles": 1,
                                "penalties": 1,
                                "supports": 3,
                                "tackleBreaks": 4,
                                "tackles": 20,
                                "evasionRuns": 8,
                                "evasionRunMetres": 71,
                                "ptbNeutral": 100,
                                "ptbAll": 3
                            },
                            "playerTookTheField": true,
                            "shirtNum": 6
                        },
                        {
                            "playerFirstName": "Chris",
                            "playerId": 500691,
                            "playerLastName": "Sandow",
                            "playerName": "Chris Sandow",
                            "playerPosition": "Halfback",
                            "playerPositionId": 500007,
                            "playerStats": {
                                "allRunMetres": 47,
                                "allRuns": 5,
                                "bombKicks": 1,
                                "bombKickMetres": 28,
                                "conversions": 1,
                                "conversionsAttempts": 2,
                                "conversionsMissed": 1,
                                "decoys": 1,
                                "errors": 2,
                                "fantasyPointsTotal": 8,
                                "goalConversionRate": 50,
                                "allGoals": 1,
                                "allGoalsMissed": 1,
                                "allGoalsAttempted": 2,
                                "intercepts": 1,
                                "kickMetres": 242,
                                "kickReturnMetres": 8,
                                "kickReturns": 1,
                                "kicks": 9,
                                "kicksDefused": 1,
                                "lineDropouts": 3,
                                "mins": 80,
                                "missedTackles": 9,
                                "penalties": 3,
                                "points": 2,
                                "supports": 4,
                                "tackleBreaks": 1,
                                "tackles": 14,
                                "evasionRuns": 4,
                                "evasionRunMetres": 39
                            },
                            "playerTookTheField": true,
                            "shirtNum": 7
                        },
                        {
                            "playerFirstName": "Danny",
                            "playerId": 503454,
                            "playerLastName": "Wicks",
                            "playerName": "Danny Wicks",
                            "playerPosition": "Prop 1",
                            "playerPositionId": 500008,
                            "playerStats": {
                                "allRunMetres": 159,
                                "allRuns": 16,
                                "decoys": 5,
                                "fantasyPointsTotal": 46,
                                "hitUps": 12,
                                "kickReturnMetres": 48,
                                "kickReturns": 3,
                                "linebreakAssists": 1,
                                "mins": 62,
                                "missedTackles": 3,
                                "offloads": 1,
                                "oneOnOneTackles": 2,
                                "penalties": 2,
                                "supports": 5,
                                "tackleBreaks": 1,
                                "tackles": 34,
                                "hitupRunMeters": 106,
                                "evasionRuns": 1,
                                "evasionRunMetres": 5,
                                "ptbFast": 7.14,
                                "ptbNeutral": 78.57,
                                "ptbSlow": 14.29,
                                "ptbAll": 14
                            },
                            "playerTookTheField": true,
                            "shirtNum": 8
                        },
                        {
                            "playerFirstName": "Nathan",
                            "playerId": 500688,
                            "playerLastName": "Peats",
                            "playerName": "Nathan Peats",
                            "playerPosition": "Hooker",
                            "playerPositionId": 500009,
                            "playerStats": {
                                "allRunMetres": 75,
                                "allRuns": 7,
                                "decoys": 2,
                                "dummyHalfRuns": 3,
                                "fantasyPointsTotal": 61,
                                "hitUps": 3,
                                "ineffectiveTackles": 2,
                                "mins": 76,
                                "missedTackles": 1,
                                "supports": 1,
                                "tackleBreaks": 2,
                                "tackles": 50,
                                "tryCause": 1,
                                "hitupRunMeters": 28,
                                "evasionRuns": 1,
                                "evasionRunMetres": 3,
                                "dummyHalfRunMetres": 44,
                                "ptbNeutral": 100,
                                "ptbAll": 4
                            },
                            "playerTookTheField": true,
                            "shirtNum": 9
                        },
                        {
                            "playerFirstName": "Tim",
                            "playerId": 500679,
                            "playerLastName": "Mannah",
                            "playerName": "Tim Mannah",
                            "playerPosition": "Prop 2",
                            "playerPositionId": 500010,
                            "playerStats": {
                                "allRunMetres": 94,
                                "allRuns": 12,
                                "decoys": 4,
                                "fantasyPointsTotal": 37,
                                "hitUps": 12,
                                "mins": 42,
                                "missedTackles": 2,
                                "supports": 6,
                                "tackleBreaks": 1,
                                "tackles": 29,
                                "hitupRunMeters": 94,
                                "ptbNeutral": 91.67,
                                "ptbSlow": 8.33,
                                "ptbAll": 12
                            },
                            "playerTookTheField": true,
                            "shirtNum": 10
                        },
                        {
                            "playerFirstName": "Manu",
                            "playerId": 500680,
                            "playerLastName": "Ma'u",
                            "playerName": "Manu Ma'u",
                            "playerPosition": "2nd Row 1",
                            "playerPositionId": 500011,
                            "playerStats": {
                                "allRunMetres": 69,
                                "allRuns": 9,
                                "decoys": 5,
                                "errors": 1,
                                "fantasyPointsTotal": 41,
                                "hitUps": 9,
                                "ineffectiveTackles": 1,
                                "mins": 80,
                                "missedTackles": 1,
                                "offloads": 2,
                                "oneOnOneTackles": 4,
                                "supports": 3,
                                "tackles": 35,
                                "tryCause": 1,
                                "hitupRunMeters": 69,
                                "ptbFast": 16.67,
                                "ptbNeutral": 83.33,
                                "ptbAll": 6
                            },
                            "playerTookTheField": true,
                            "shirtNum": 11
                        },
                        {
                            "playerFirstName": "David",
                            "playerId": 500031,
                            "playerLastName": "Gower",
                            "playerName": "David Gower",
                            "playerPosition": "2nd Row 2",
                            "playerPositionId": 500012,
                            "playerStats": {
                                "allRunMetres": 47,
                                "allRuns": 6,
                                "fantasyPointsTotal": 16,
                                "hitUps": 6,
                                "mins": 23,
                                "missedTackles": 1,
                                "penalties": 1,
                                "supports": 2,
                                "tackleBreaks": 1,
                                "tackles": 13,
                                "hitupRunMeters": 47,
                                "ptbNeutral": 100,
                                "ptbAll": 5
                            },
                            "playerTookTheField": true,
                            "shirtNum": 12
                        },
                        {
                            "playerFirstName": "Anthony",
                            "playerId": 500028,
                            "playerLastName": "Watmough",
                            "playerName": "Anthony Watmough",
                            "playerPosition": "Lock",
                            "playerPositionId": 500013,
                            "playerStats": {
                                "allRunMetres": 60,
                                "allRuns": 6,
                                "decoys": 7,
                                "fantasyPointsTotal": 35,
                                "hitUps": 6,
                                "ineffectiveTackles": 1,
                                "mins": 63,
                                "missedTackles": 5,
                                "offloads": 1,
                                "oneOnOneTackles": 2,
                                "supports": 4,
                                "tackles": 37,
                                "hitupRunMeters": 60,
                                "ptbFast": 40,
                                "ptbNeutral": 60,
                                "ptbAll": 5
                            },
                            "playerTookTheField": true,
                            "shirtNum": 13
                        },
                        {
                            "playerFirstName": "Isaac",
                            "playerId": 500789,
                            "playerLastName": "De Gois",
                            "playerName": "Isaac De Gois",
                            "playerPosition": "Interchange",
                            "playerPositionId": 500014,
                            "playerStats": {
                                "allRunMetres": 2,
                                "allRuns": 1,
                                "dummyHalfRuns": 1,
                                "fantasyPointsTotal": 18,
                                "mins": 23,
                                "missedTackles": 1,
                                "oneOnOneTackles": 2,
                                "supports": 2,
                                "tackles": 20,
                                "dummyHalfRunMetres": 2
                            },
                            "playerTookTheField": true,
                            "shirtNum": 14
                        },
                        {
                            "playerFirstName": "Joseph",
                            "playerId": 500686,
                            "playerLastName": "Paulo",
                            "playerName": "Joseph Paulo",
                            "playerPosition": "Interchange",
                            "playerPositionId": 500014,
                            "playerStats": {
                                "allRunMetres": 78,
                                "allRuns": 10,
                                "decoys": 1,
                                "fantasyPointsTotal": 33,
                                "hitUps": 7,
                                "kicksNotDefused": 1,
                                "mins": 46,
                                "missedTackles": 3,
                                "offloads": 1,
                                "oneOnOneTackles": 1,
                                "penalties": 1,
                                "supports": 2,
                                "tackles": 32,
                                "hitupRunMeters": 57,
                                "evasionRuns": 3,
                                "evasionRunMetres": 21,
                                "ptbNeutral": 83.33,
                                "ptbSlow": 16.67,
                                "ptbAll": 6
                            },
                            "playerTookTheField": true,
                            "shirtNum": 15
                        },
                        {
                            "playerFirstName": "Richie",
                            "playerId": 500577,
                            "playerLastName": "Fa'aoso",
                            "playerName": "Richie Fa'aoso",
                            "playerPosition": "Interchange",
                            "playerPositionId": 500014,
                            "playerStats": {
                                "allRunMetres": 56,
                                "allRuns": 8,
                                "decoys": 3,
                                "errors": 1,
                                "fantasyPointsTotal": 16,
                                "hitUps": 7,
                                "ineffectiveTackles": 1,
                                "kickReturnMetres": 10,
                                "kickReturns": 1,
                                "mins": 27,
                                "supports": 4,
                                "tackles": 13,
                                "hitupRunMeters": 46,
                                "ptbFast": 28.57,
                                "ptbNeutral": 71.43,
                                "ptbAll": 7
                            },
                            "playerTookTheField": true,
                            "shirtNum": 16
                        },
                        {
                            "playerFirstName": "Peni",
                            "playerId": 500696,
                            "playerLastName": "Terepo",
                            "playerName": "Peni Terepo",
                            "playerPosition": "Interchange",
                            "playerPositionId": 500014,
                            "playerStats": {
                                "allRunMetres": 26,
                                "allRuns": 4,
                                "decoys": 6,
                                "errors": 3,
                                "fantasyPointsTotal": 26,
                                "hitUps": 4,
                                "ineffectiveTackles": 2,
                                "mins": 38,
                                "oneOnOneTackles": 1,
                                "supports": 1,
                                "tackleBreaks": 2,
                                "tackles": 24,
                                "hitupRunMeters": 26,
                                "ptbNeutral": 100,
                                "ptbAll": 2
                            },
                            "playerTookTheField": true,
                            "shirtNum": 17
                        }
                    ]
                },
                "teamName": "Parramatta Eels",
                "teamNickName": "Eels",
                "teamStats": {
                    "allRunMetres": 1408,
                    "allRuns": 155,
                    "bombKicks": 3,
                    "bombKickMetres": 65,
                    "bombKicksDefused": 2,
                    "completeSets": 22,
                    "completionPercentage": 63,
                    "conversions": 1,
                    "conversionsAttempts": 2,
                    "conversionsMissed": 1,
                    "decoys": 36,
                    "dummyHalfRuns": 7,
                    "errors": 13,
                    "goalConversionRate": 50,
                    "allGoals": 1,
                    "allGoalsAttempted": 2,
                    "allGoalsMissed": 1,
                    "hitUps": 68,
                    "incompleteSets": 13,
                    "ineffectiveTackles": 12,
                    "intercepts": 1,
                    "kickMetres": 291,
                    "kickReturnMetres": 219,
                    "kickReturns": 20,
                    "kicks": 12,
                    "kicksDefused": 7,
                    "kicksNotDefused": 2,
                    "lineDropouts": 3,
                    "linebreakAssists": 3,
                    "linebreaks": 3,
                    "missedTackles": 37,
                    "offloads": 10,
                    "oneOnOneTackles": 17,
                    "penalties": 9,
                    "points": 10,
                    "pointsConceded": 28,
                    "possession": 45,
                    "scrumWins": 3,
                    "supports": 58,
                    "tackleBreaks": 25,
                    "tackles": 363,
                    "sets": 35,
                    "tries": 2,
                    "triesConceded": 5,
                    "tryAssists": 2,
                    "hitupRunMeters": 556,
                    "evasionRuns": 60,
                    "evasionRunMetres": 560,
                    "dummyHalfRunMetres": 73,
                    "ptbFast": 15,
                    "ptbNeutral": 82,
                    "ptbSlow": 4,
                    "ptbTotal": 114
                }
            },
            {
                "score": {
                    "conversions": 4,
                    "points": 28,
                    "tries": 5
                },
                "team1stHalfScore": 10,
                "team2ndHalfScore": 18,
                "teamAbbr": "MEL",
                "teamFinalScore": 28,
                "teamFullTimeScore": 28,
                "teamHalfTimeScore": 10,
                "teamId": 500021,
                "teamLineup": {
                    "injuriesAndSuspensions": {
                        "injury": [],
                        "suspension": []
                    },
                    "insAndOuts": {
                        "inOut": [
                            {
                                "inOut": "In",
                                "playerFirstName": "Billy",
                                "playerId": "500608",
                                "playerLastName": "Slater",
                                "playerName": "Billy Slater"
                            },
                            {
                                "inOut": "Out",
                                "playerFirstName": "Cameron",
                                "playerId": "501459",
                                "playerLastName": "Munster",
                                "playerName": "Cameron Munster"
                            },
                            {
                                "inOut": "In",
                                "playerFirstName": "Christian",
                                "playerId": "500786",
                                "playerLastName": "Welch Nichol",
                                "playerName": "Christian Welch Nichol"
                            },
                            {
                                "inOut": "In",
                                "playerFirstName": "Dayne",
                                "playerId": "500613",
                                "playerLastName": "Weston",
                                "playerName": "Dayne Weston"
                            },
                            {
                                "inOut": "Out",
                                "playerFirstName": "Felise",
                                "playerId": "500598",
                                "playerLastName": "Kaufusi",
                                "playerName": "Felise Kaufusi"
                            },
                            {
                                "inOut": "Out",
                                "playerFirstName": "Jordan",
                                "playerId": "500602",
                                "playerLastName": "McLean",
                                "playerName": "Jordan McLean"
                            },
                            {
                                "inOut": "In",
                                "playerFirstName": "Kenneath",
                                "playerId": "500585",
                                "playerLastName": "Bromwich",
                                "playerName": "Kenneath Bromwich"
                            },
                            {
                                "inOut": "Out",
                                "playerFirstName": "Nelson",
                                "playerId": "501281",
                                "playerLastName": "Asofa-Solomona",
                                "playerName": "Nelson Asofa-Solomona"
                            }
                        ]
                    },
                    "teamPlayer": [
                        {
                            "playerFirstName": "Billy",
                            "playerId": 500608,
                            "playerLastName": "Slater",
                            "playerName": "Billy Slater",
                            "playerPosition": "Fullback",
                            "playerPositionId": 500001,
                            "playerStats": {
                                "allRunMetres": 75,
                                "allRuns": 10,
                                "bombKicksDefused": 1,
                                "decoys": 2,
                                "errors": 1,
                                "fantasyPointsTotal": 64,
                                "ineffectiveTackles": 1,
                                "kickReturnMetres": 15,
                                "kickReturns": 2,
                                "kicksDefused": 3,
                                "linebreakAssists": 1,
                                "linebreaks": 2,
                                "mins": 72,
                                "missedTackles": 1,
                                "offloads": 1,
                                "oneOnOneTackles": 3,
                                "points": 8,
                                "supports": 5,
                                "tackleBreaks": 5,
                                "tackles": 5,
                                "tries": 2,
                                "tryAssists": 1,
                                "trySaves": 1,
                                "evasionRuns": 8,
                                "evasionRunMetres": 60,
                                "ptbNeutral": 100,
                                "ptbAll": 6
                            },
                            "playerTookTheField": true,
                            "shirtNum": 1
                        },
                        {
                            "playerFirstName": "Mahe",
                            "playerId": 500589,
                            "playerLastName": "Fonua",
                            "playerName": "Mahe Fonua",
                            "playerPosition": "Winger 1",
                            "playerPositionId": 500002,
                            "playerStats": {
                                "allRunMetres": 91,
                                "allRuns": 12,
                                "bombKicksDefused": 1,
                                "decoys": 1,
                                "fantasyPointsTotal": 19,
                                "hitUps": 1,
                                "kickReturnMetres": 43,
                                "kickReturns": 4,
                                "kicksDefused": 2,
                                "linebreakAssists": 1,
                                "mins": 80,
                                "missedTackles": 5,
                                "oneOnOneTackles": 2,
                                "supports": 13,
                                "tackleBreaks": 1,
                                "tackles": 8,
                                "tryAssists": 1,
                                "hitupRunMeters": 8,
                                "evasionRuns": 7,
                                "evasionRunMetres": 40,
                                "ptbFast": 27.27,
                                "ptbNeutral": 72.73,
                                "ptbAll": 11
                            },
                            "playerTookTheField": true,
                            "shirtNum": 2
                        },
                        {
                            "playerFirstName": "Will",
                            "playerId": 500586,
                            "playerLastName": "Chambers",
                            "playerName": "Will Chambers",
                            "playerPosition": "Centre 1",
                            "playerPositionId": 500003,
                            "playerStats": {
                                "allRunMetres": 201,
                                "allRuns": 15,
                                "decoys": 1,
                                "fantasyPointsTotal": 61,
                                "ineffectiveTackles": 2,
                                "kickReturnMetres": 4,
                                "kickReturns": 1,
                                "kicksDefused": 1,
                                "linebreaks": 1,
                                "mins": 80,
                                "missedTackles": 2,
                                "offloads": 1,
                                "oneOnOneTackles": 1,
                                "points": 4,
                                "supports": 5,
                                "tackleBreaks": 5,
                                "tackles": 15,
                                "tries": 1,
                                "evasionRuns": 14,
                                "evasionRunMetres": 197,
                                "ptbFast": 7.69,
                                "ptbNeutral": 92.31,
                                "ptbAll": 13
                            },
                            "playerTookTheField": true,
                            "shirtNum": 3
                        },
                        {
                            "playerFirstName": "Kurt",
                            "playerId": 500601,
                            "playerLastName": "Mann",
                            "playerName": "Kurt Mann",
                            "playerPosition": "Centre 2",
                            "playerPositionId": 500004,
                            "playerStats": {
                                "allRunMetres": 80,
                                "allRuns": 8,
                                "decoys": 3,
                                "dummyHalfRuns": 3,
                                "fantasyPointsTotal": 41,
                                "mins": 80,
                                "missedTackles": 2,
                                "oneOnOneTackles": 3,
                                "supports": 7,
                                "tackleBreaks": 6,
                                "tackles": 19,
                                "tryCause": 1,
                                "evasionRuns": 5,
                                "evasionRunMetres": 59,
                                "dummyHalfRunMetres": 21,
                                "ptbFast": 14.29,
                                "ptbNeutral": 85.71,
                                "ptbAll": 7
                            },
                            "playerTookTheField": true,
                            "shirtNum": 4
                        },
                        {
                            "playerFirstName": "Marika",
                            "playerId": 500653,
                            "playerLastName": "Koroibete",
                            "playerName": "Marika Koroibete",
                            "playerPosition": "Winger 2",
                            "playerPositionId": 500005,
                            "playerStats": {
                                "allRunMetres": 126,
                                "allRuns": 12,
                                "decoys": 2,
                                "errors": 3,
                                "fantasyPointsTotal": 37,
                                "ineffectiveTackles": 1,
                                "kickReturnMetres": 2,
                                "kickReturns": 1,
                                "kicksDefused": 1,
                                "mins": 80,
                                "missedTackles": 1,
                                "offloads": 1,
                                "oneOnOneTackles": 2,
                                "penalties": 1,
                                "points": 4,
                                "supports": 6,
                                "tackleBreaks": 6,
                                "tackles": 6,
                                "tries": 1,
                                "tryCause": 1,
                                "evasionRuns": 11,
                                "evasionRunMetres": 124,
                                "ptbFast": 11.11,
                                "ptbNeutral": 88.89,
                                "ptbAll": 9
                            },
                            "playerTookTheField": true,
                            "shirtNum": 5
                        },
                        {
                            "playerFirstName": "Blake",
                            "playerId": 502209,
                            "playerLastName": "Green",
                            "playerName": "Blake Green",
                            "playerPosition": "Five-eighth",
                            "playerPositionId": 500006,
                            "playerStats": {
                                "allRunMetres": 81,
                                "allRuns": 13,
                                "decoys": 3,
                                "errors": 2,
                                "fantasyPointsTotal": 37,
                                "ineffectiveTackles": 1,
                                "interceptedPass": 1,
                                "kickMetres": 44,
                                "kickReturnMetres": 10,
                                "kickReturns": 1,
                                "kicks": 2,
                                "mins": 80,
                                "missedTackles": 2,
                                "offloads": 2,
                                "oneOnOneTackles": 3,
                                "supports": 10,
                                "tackleBreaks": 5,
                                "tackles": 16,
                                "evasionRuns": 12,
                                "evasionRunMetres": 71,
                                "ptbNeutral": 100,
                                "ptbAll": 5
                            },
                            "playerTookTheField": true,
                            "shirtNum": 6
                        },
                        {
                            "playerFirstName": "Cooper",
                            "playerId": 500587,
                            "playerLastName": "Cronk",
                            "playerName": "Cooper Cronk",
                            "playerPosition": "Halfback",
                            "playerPositionId": 500007,
                            "playerStats": {
                                "allRunMetres": 62,
                                "allRuns": 10,
                                "bombKicks": 2,
                                "bombKickMetres": 49,
                                "fantasyPointsTotal": 44,
                                "ineffectiveTackles": 5,
                                "kickMetres": 407,
                                "kickReturnMetres": 4,
                                "kickReturns": 1,
                                "kicks": 15,
                                "mins": 80,
                                "missedTackles": 1,
                                "supports": 4,
                                "tackleBreaks": 1,
                                "tackles": 12,
                                "tryAssists": 1,
                                "evasionRuns": 9,
                                "evasionRunMetres": 58,
                                "ptbFast": 16.67,
                                "ptbNeutral": 83.33,
                                "ptbAll": 6
                            },
                            "playerTookTheField": true,
                            "shirtNum": 7
                        },
                        {
                            "playerFirstName": "Jesse",
                            "playerId": 500584,
                            "playerLastName": "Bromwich",
                            "playerName": "Jesse Bromwich",
                            "playerPosition": "Prop 1",
                            "playerPositionId": 500008,
                            "playerStats": {
                                "allRunMetres": 174,
                                "allRuns": 19,
                                "decoys": 7,
                                "fantasyPointsTotal": 46,
                                "hitUps": 18,
                                "mins": 62,
                                "missedTackles": 2,
                                "offloads": 1,
                                "penalties": 1,
                                "supports": 7,
                                "tackleBreaks": 3,
                                "tackles": 24,
                                "hitupRunMeters": 165,
                                "evasionRuns": 1,
                                "evasionRunMetres": 9,
                                "ptbFast": 5.88,
                                "ptbNeutral": 94.12,
                                "ptbAll": 17
                            },
                            "playerTookTheField": true,
                            "shirtNum": 8
                        },
                        {
                            "playerFirstName": "Cameron",
                            "playerId": 500609,
                            "playerLastName": "Smith",
                            "playerName": "Cameron Smith",
                            "playerPosition": "Hooker",
                            "playerPositionId": 500009,
                            "playerStats": {
                                "allRunMetres": 36,
                                "allRuns": 9,
                                "conversions": 4,
                                "conversionsAttempts": 5,
                                "conversionsMissed": 1,
                                "dummyHalfRuns": 6,
                                "errors": 1,
                                "fantasyPointsTotal": 51,
                                "goalConversionRate": 80,
                                "allGoals": 4,
                                "allGoalsMissed": 1,
                                "allGoalsAttempted": 5,
                                "hitUps": 2,
                                "kickMetres": 116,
                                "kicks": 4,
                                "lineDropouts": 1,
                                "mins": 80,
                                "missedTackles": 3,
                                "offloads": 3,
                                "oneOnOneTackles": 1,
                                "points": 8,
                                "supports": 2,
                                "tackles": 37,
                                "tryCause": 1,
                                "hitupRunMeters": 12,
                                "evasionRuns": 1,
                                "dummyHalfRunMetres": 24,
                                "ptbNeutral": 60,
                                "ptbSlow": 40,
                                "ptbAll": 5
                            },
                            "playerTookTheField": true,
                            "shirtNum": 9
                        },
                        {
                            "playerFirstName": "Tim",
                            "playerId": 500591,
                            "playerLastName": "Glasby",
                            "playerName": "Tim Glasby",
                            "playerPosition": "Prop 2",
                            "playerPositionId": 500010,
                            "playerStats": {
                                "allRunMetres": 78,
                                "allRuns": 11,
                                "decoys": 2,
                                "fantasyPointsTotal": 32,
                                "hitUps": 11,
                                "ineffectiveTackles": 1,
                                "mins": 36,
                                "missedTackles": 1,
                                "supports": 3,
                                "tackleBreaks": 3,
                                "tackles": 18,
                                "hitupRunMeters": 78,
                                "ptbFast": 9.09,
                                "ptbNeutral": 81.82,
                                "ptbSlow": 9.09,
                                "ptbAll": 11
                            },
                            "playerTookTheField": true,
                            "shirtNum": 15
                        },
                        {
                            "playerFirstName": "Kevin",
                            "playerId": 500606,
                            "playerLastName": "Proctor",
                            "playerName": "Kevin Proctor",
                            "playerPosition": "2nd Row 1",
                            "playerPositionId": 500011,
                            "playerStats": {
                                "allRunMetres": 150,
                                "allRuns": 13,
                                "decoys": 2,
                                "fantasyPointsTotal": 53,
                                "hitUps": 13,
                                "ineffectiveTackles": 1,
                                "linebreakAssists": 1,
                                "mins": 80,
                                "missedTackles": 2,
                                "offloads": 2,
                                "supports": 5,
                                "tackles": 31,
                                "tryAssists": 1,
                                "hitupRunMeters": 150,
                                "ptbFast": 11.11,
                                "ptbNeutral": 88.89,
                                "ptbAll": 9
                            },
                            "playerTookTheField": true,
                            "shirtNum": 11
                        },
                        {
                            "playerFirstName": "Tohu",
                            "playerId": 500594,
                            "playerLastName": "Harris",
                            "playerName": "Tohu Harris",
                            "playerPosition": "2nd Row 2",
                            "playerPositionId": 500012,
                            "playerStats": {
                                "allRunMetres": 112,
                                "allRuns": 12,
                                "decoys": 4,
                                "fantasyPointsTotal": 41,
                                "hitUps": 11,
                                "mins": 62,
                                "missedTackles": 1,
                                "supports": 8,
                                "tackleBreaks": 2,
                                "tackles": 26,
                                "hitupRunMeters": 103,
                                "evasionRuns": 1,
                                "evasionRunMetres": 9,
                                "ptbFast": 18.18,
                                "ptbNeutral": 81.82,
                                "ptbAll": 11
                            },
                            "playerTookTheField": true,
                            "shirtNum": 12
                        },
                        {
                            "playerFirstName": "Dale",
                            "playerId": 500222,
                            "playerLastName": "Finucane",
                            "playerName": "Dale Finucane",
                            "playerPosition": "Lock",
                            "playerPositionId": 500013,
                            "playerStats": {
                                "allRunMetres": 131,
                                "allRuns": 15,
                                "decoys": 6,
                                "fantasyPointsTotal": 53,
                                "hitUps": 12,
                                "kickReturnMetres": 32,
                                "kickReturns": 2,
                                "mins": 60,
                                "missedTackles": 2,
                                "points": 4,
                                "supports": 8,
                                "tackles": 36,
                                "tries": 1,
                                "hitupRunMeters": 94,
                                "evasionRuns": 1,
                                "evasionRunMetres": 5,
                                "ptbFast": 7.14,
                                "ptbNeutral": 85.71,
                                "ptbSlow": 7.14,
                                "ptbAll": 14
                            },
                            "playerTookTheField": true,
                            "shirtNum": 13
                        },
                        {
                            "playerFirstName": "Ryan",
                            "playerId": 500595,
                            "playerLastName": "Hinchcliffe",
                            "playerName": "Ryan Hinchcliffe",
                            "playerPosition": "Interchange",
                            "playerPositionId": 500014,
                            "playerStats": {
                                "allRunMetres": 72,
                                "allRuns": 9,
                                "decoys": 9,
                                "fantasyPointsTotal": 29,
                                "hitUps": 7,
                                "mins": 50,
                                "penalties": 1,
                                "supports": 8,
                                "tackles": 24,
                                "hitupRunMeters": 48,
                                "evasionRuns": 2,
                                "evasionRunMetres": 24,
                                "ptbNeutral": 100,
                                "ptbAll": 7
                            },
                            "playerTookTheField": true,
                            "shirtNum": 14
                        },
                        {
                            "playerFirstName": "Dayne",
                            "playerId": 500613,
                            "playerLastName": "Weston",
                            "playerName": "Dayne Weston",
                            "playerPosition": "Interchange",
                            "playerPositionId": 500014,
                            "playerStats": {
                                "allRunMetres": 49,
                                "allRuns": 6,
                                "decoys": 3,
                                "fantasyPointsTotal": 14,
                                "hitUps": 4,
                                "kickReturnMetres": 21,
                                "kickReturns": 2,
                                "mins": 24,
                                "penalties": 2,
                                "supports": 3,
                                "tackles": 14,
                                "hitupRunMeters": 28,
                                "ptbFast": 16.67,
                                "ptbNeutral": 66.67,
                                "ptbSlow": 16.67,
                                "ptbAll": 6
                            },
                            "playerTookTheField": true,
                            "shirtNum": 16
                        },
                        {
                            "playerFirstName": "Kenneath",
                            "playerId": 500585,
                            "playerLastName": "Bromwich",
                            "playerName": "Kenneath Bromwich",
                            "playerPosition": "Interchange",
                            "playerPositionId": 500014,
                            "playerStats": {
                                "allRunMetres": 42,
                                "allRuns": 5,
                                "decoys": 1,
                                "fantasyPointsTotal": 16,
                                "hitUps": 4,
                                "kickReturnMetres": 8,
                                "kickReturns": 1,
                                "mins": 20,
                                "penalties": 1,
                                "supports": 2,
                                "tackles": 14,
                                "hitupRunMeters": 34,
                                "ptbFast": 40,
                                "ptbNeutral": 60,
                                "ptbAll": 5
                            },
                            "playerTookTheField": true,
                            "shirtNum": 19
                        },
                        {
                            "playerFirstName": "Christian",
                            "playerId": 500786,
                            "playerLastName": "Welch Nichol",
                            "playerName": "Christian Welch Nichol",
                            "playerPosition": "Interchange",
                            "playerPositionId": 500014,
                            "playerStats": {
                                "allRunMetres": 26,
                                "allRuns": 5,
                                "fantasyPointsTotal": 13,
                                "hitUps": 4,
                                "mins": 14,
                                "supports": 1,
                                "tackles": 11,
                                "hitupRunMeters": 19,
                                "evasionRuns": 1,
                                "evasionRunMetres": 7,
                                "ptbFast": 16.67,
                                "ptbNeutral": 83.33,
                                "ptbAll": 6
                            },
                            "playerTookTheField": true,
                            "shirtNum": 20
                        }
                    ]
                },
                "teamName": "Melbourne Storm",
                "teamNickName": "Storm",
                "teamStats": {
                    "allRunMetres": 1588,
                    "allRuns": 184,
                    "bombKicks": 2,
                    "bombKickMetres": 49,
                    "bombKicksDefused": 2,
                    "completeSets": 34,
                    "completionPercentage": 83,
                    "conversions": 4,
                    "conversionsAttempts": 5,
                    "conversionsMissed": 1,
                    "decoys": 46,
                    "dummyHalfRuns": 9,
                    "errors": 7,
                    "goalConversionRate": 80,
                    "allGoals": 4,
                    "allGoalsAttempted": 5,
                    "allGoalsMissed": 1,
                    "hitUps": 87,
                    "incompleteSets": 7,
                    "ineffectiveTackles": 12,
                    "interceptedPass": 1,
                    "kickMetres": 567,
                    "kickReturnMetres": 140,
                    "kickReturns": 15,
                    "kicks": 21,
                    "kicksDefused": 7,
                    "lineDropouts": 1,
                    "linebreakAssists": 3,
                    "linebreaks": 3,
                    "missedTackles": 25,
                    "offloads": 11,
                    "oneOnOneTackles": 15,
                    "penalties": 6,
                    "points": 28,
                    "pointsConceded": 10,
                    "possession": 55,
                    "scrumWins": 7,
                    "supports": 97,
                    "tackleBreaks": 37,
                    "tackles": 316,
                    "sets": 41,
                    "tries": 5,
                    "triesConceded": 2,
                    "tryAssists": 4,
                    "trySaves": 1,
                    "hitupRunMeters": 740,
                    "evasionRuns": 73,
                    "evasionRunMetres": 663,
                    "dummyHalfRunMetres": 45,
                    "ptbFast": 11,
                    "ptbNeutral": 85,
                    "ptbSlow": 3,
                    "ptbTotal": 148
                }
            }
        ]
    }
}