{
    "vod": [
        {
            "id": "BiZ21mYjE6_pG2F0nd5pjtTQP-GqEVA4",
            "contentId": 916091,
            "title": "Rd 13: Storm v Knights (Hls)",
            "description": "Highlights of the Round 13 clash between the Storm & Knights",
            "publishDate": "2017-06-02T19:56:33+10:00",
            "publisher": "NRL Chief",
            "thumbnailUrl": "http://bpvideos.telstra.insnw.net/web/images/20170602195530a_89x50.jpg",
            "largeThumbnailUrl": "http://bpvideos.telstra.insnw.net/web/images/20170602195530a_326x184.jpg",
            "programType": "Highlights",
            "programCategory": "Match",
            "priority": null,
            "lastUpdateDate": "2017-06-02T20:14:51+10:00",
            "isPremium": false,
            "club": [
                500021,
                500003
            ]
        },
        {
            "id": "80Z25mYjE6Mm75krSlMUMR701OKjx9jH",
            "contentId": 916115,
            "title": "Rd 13 Press Conference: Storm",
            "description": "Storm coach Craig Bellamy answers the media's questions following their win over the Knights",
            "publishDate": "2017-06-02T21:38:55+10:00",
            "publisher": "NRL Chief",
            "thumbnailUrl": "http://bpvideos.telstra.insnw.net/web/images/20170602213809a_89x50.png",
            "largeThumbnailUrl": "http://bpvideos.telstra.insnw.net/web/images/20170602213809a_326x184.png",
            "programType": "Press Conference",
            "programCategory": null,
            "priority": null,
            "lastUpdateDate": "2017-06-02T22:00:41+10:00",
            "isPremium": false,
            "club": [
                500021,
                500003
            ]
        },
        {
            "id": "w3Zm5mYjE6i8erCtgaZbBB72xFOg0ELC",
            "contentId": 916114,
            "title": "Rd 13 Press Conference: Knights",
            "description": "Knights coach Nathan Brown answers the media's questions following his side's loss to the Storm",
            "publishDate": "2017-06-02T21:37:49+10:00",
            "publisher": "NRL Chief",
            "thumbnailUrl": "http://bpvideos.telstra.insnw.net/web/images/20170602213723a_89x50.png",
            "largeThumbnailUrl": "http://bpvideos.telstra.insnw.net/web/images/20170602213723a_326x184.png",
            "programType": "Press Conference",
            "programCategory": null,
            "priority": null,
            "lastUpdateDate": "2017-06-02T21:56:41+10:00",
            "isPremium": false,
            "club": [
                500021,
                500003
            ]
        },
        {
            "id": "pjYm1mYjE6FLypI02pfPAr2DWu0OAjCW",
            "contentId": 916087,
            "title": "Rd 13: TRY Cheyse Blair (79th min)",
            "description": "Cheyse Blair crosses for a late try for the Storm",
            "publishDate": "2017-06-02T19:44:39+10:00",
            "publisher": "NRL Chief",
            "thumbnailUrl": "http://bpvideos.telstra.insnw.net/web/images/20170602194411a_89x50.jpg",
            "largeThumbnailUrl": "http://bpvideos.telstra.insnw.net/web/images/20170602194411a_326x184.jpg",
            "programType": "Instant Replay",
            "programCategory": "Score",
            "priority": 10,
            "lastUpdateDate": "2017-06-02T20:08:49+10:00",
            "isPremium": true,
            "club": [
                500021,
                500003
            ]
        },
        {
            "id": "l5OW1mYjE66IKBZW-enA1rpBcHUbj7U2",
            "contentId": 916086,
            "title": "Rd 13: GOAL Brock Lamb (73rd min)",
            "description": "Brock Lamb converts the try of Lachlan Fitzgibbon",
            "publishDate": "2017-06-02T19:39:20+10:00",
            "publisher": "NRL Chief",
            "thumbnailUrl": "http://bpvideos.telstra.insnw.net/web/images/20170602193855a_89x50.jpg",
            "largeThumbnailUrl": "http://bpvideos.telstra.insnw.net/web/images/20170602193855a_326x184.jpg",
            "programType": "Instant Replay",
            "programCategory": "Score",
            "priority": null,
            "lastUpdateDate": "2017-06-02T19:56:47+10:00",
            "isPremium": true,
            "club": [
                500021,
                500003
            ]
        },
        {
            "id": "Y0OW1mYjE6b1kWewcCzR2613H1G61Qr8",
            "contentId": 916085,
            "title": "Rd 13: TRY Lachlan Fitzgibbon (72nd min)",
            "description": "Lachlan Fitzgibbon scores the Knights' second try",
            "publishDate": "2017-06-02T19:36:40+10:00",
            "publisher": "NRL Chief",
            "thumbnailUrl": "http://bpvideos.telstra.insnw.net/web/images/20170602193623a_89x50.jpg",
            "largeThumbnailUrl": "http://bpvideos.telstra.insnw.net/web/images/20170602193623a_326x184.jpg",
            "programType": "Instant Replay",
            "programCategory": "Score",
            "priority": 9,
            "lastUpdateDate": "2017-06-02T20:08:49+10:00",
            "isPremium": true,
            "club": [
                500021,
                500003
            ]
        },
        {
            "id": "5qNm1mYjE6uCMCCmL-O5LJJ9m-oiqi5I",
            "contentId": 916084,
            "title": "Rd 13: TRY Brandon Smith (62nd min)",
            "description": "Brandon Smith scores a try on debut for the Storm",
            "publishDate": "2017-06-02T19:26:54+10:00",
            "publisher": "NRL Chief",
            "thumbnailUrl": "http://bpvideos.telstra.insnw.net/web/images/20170602192648a_89x50.jpg",
            "largeThumbnailUrl": "http://bpvideos.telstra.insnw.net/web/images/20170602192648a_326x184.jpg",
            "programType": "Instant Replay",
            "programCategory": "Score",
            "priority": 8,
            "lastUpdateDate": "2017-06-02T20:08:49+10:00",
            "isPremium": true,
            "club": [
                500021,
                500003
            ]
        },
        {
            "id": "RrM21mYjE6txcyH86-aQ-1G485PuHlbF",
            "contentId": 916083,
            "title": "Rd 13: GOAL Cameron Munster (54th min)",
            "description": "Cameron Munster converts the try of Billy Slater",
            "publishDate": "2017-06-02T19:18:47+10:00",
            "publisher": "NRL Chief",
            "thumbnailUrl": "http://bpvideos.telstra.insnw.net/web/images/20170602191839a_89x50.jpg",
            "largeThumbnailUrl": "http://bpvideos.telstra.insnw.net/web/images/20170602191839a_326x184.jpg",
            "programType": "Instant Replay",
            "programCategory": "Score",
            "priority": null,
            "lastUpdateDate": "2017-06-02T19:36:41+10:00",
            "isPremium": true,
            "club": [
                500021,
                500003
            ]
        },
        {
            "id": "52Mm1mYjE6fLDxJaJ-N7bzthK4xxFbW7",
            "contentId": 916082,
            "title": "Rd 13: TRY Billy Slater (53rd min)",
            "description": "Billy Slater crosses for his second try",
            "publishDate": "2017-06-02T19:17:46+10:00",
            "publisher": "NRL Chief",
            "thumbnailUrl": "http://bpvideos.telstra.insnw.net/web/images/20170602191701a_89x50.jpg",
            "largeThumbnailUrl": "http://bpvideos.telstra.insnw.net/web/images/20170602191701a_326x184.jpg",
            "programType": "Instant Replay",
            "programCategory": "Score",
            "priority": 7,
            "lastUpdateDate": "2017-06-02T20:08:49+10:00",
            "isPremium": true,
            "club": [
                500021,
                500003
            ]
        },
        {
            "id": "1iMm1mYjE6ys-xCLywO5G5eD5_qLuELn",
            "contentId": 916081,
            "title": "Rd 13: TRY Suliasi Vunivalu (50th min)",
            "description": "Suliasi Vunivalu flies high to put the Storm out to a 20-point lead",
            "publishDate": "2017-06-02T19:13:54+10:00",
            "publisher": "NRL Chief",
            "thumbnailUrl": "http://bpvideos.telstra.insnw.net/web/images/20170602191345a_89x50.jpg",
            "largeThumbnailUrl": "http://bpvideos.telstra.insnw.net/web/images/20170602191345a_326x184.jpg",
            "programType": "Instant Replay",
            "programCategory": "Score",
            "priority": 6,
            "lastUpdateDate": "2017-06-02T20:08:49+10:00",
            "isPremium": true,
            "club": [
                500021,
                500003
            ]
        },
        {
            "id": "hjMW1mYjE63opM-NiagL9nGHEsXEAS6T",
            "contentId": 916080,
            "title": "Rd 13: GOAL Cameron Munster (44th min)",
            "description": "Cameron Munster converts the try of Billy Slater",
            "publishDate": "2017-06-02T19:09:57+10:00",
            "publisher": "NRL Chief",
            "thumbnailUrl": "http://bpvideos.telstra.insnw.net/web/images/20170602190911a_89x50.jpg",
            "largeThumbnailUrl": "http://bpvideos.telstra.insnw.net/web/images/20170602190911a_326x184.jpg",
            "programType": "Instant Replay",
            "programCategory": "Score",
            "priority": null,
            "lastUpdateDate": "2017-06-02T19:27:39+10:00",
            "isPremium": true,
            "club": [
                500021,
                500003
            ]
        },
        {
            "id": "k4MW1mYjE6f1fow2QD19Eo9H9x_5a4DQ",
            "contentId": 916079,
            "title": "Rd 13: TRY Billy Slater (43rd min)",
            "description": "Billy Slater scores the Storm's first try of the second half",
            "publishDate": "2017-06-02T19:08:49+10:00",
            "publisher": "NRL Chief",
            "thumbnailUrl": "http://bpvideos.telstra.insnw.net/web/images/20170602190815a_89x50.jpg",
            "largeThumbnailUrl": "http://bpvideos.telstra.insnw.net/web/images/20170602190815a_326x184.jpg",
            "programType": "Instant Replay",
            "programCategory": "Score",
            "priority": 5,
            "lastUpdateDate": "2017-06-02T20:07:49+10:00",
            "isPremium": true,
            "club": [
                500021,
                500003
            ]
        },
        {
            "id": "F1aWxmYjE68729W64KfGf6a9nenaPlNV",
            "contentId": 916077,
            "title": "Rd 13: GOAL Brock Lamb (29th min)",
            "description": "Brock Lamb converts superbly from the touch line",
            "publishDate": "2017-06-02T18:36:32+10:00",
            "publisher": "NRL Chief",
            "thumbnailUrl": "http://bpvideos.telstra.insnw.net/web/images/20170602183555a_89x50.jpg",
            "largeThumbnailUrl": "http://bpvideos.telstra.insnw.net/web/images/20170602183555a_326x184.jpg",
            "programType": "Instant Replay",
            "programCategory": "Score",
            "priority": null,
            "lastUpdateDate": "2017-06-02T18:54:31+10:00",
            "isPremium": true,
            "club": [
                500021,
                500003
            ]
        },
        {
            "id": "F4aGxmYjE6dVm-oYEX1hNi7r_X913fMs",
            "contentId": 916076,
            "title": "Rd 13: TRY Ken Sio (28th min)",
            "description": "Ken Sio scores Newcastle's first points of the evening",
            "publishDate": "2017-06-02T18:32:11+10:00",
            "publisher": "NRL Chief",
            "thumbnailUrl": "http://bpvideos.telstra.insnw.net/web/images/20170602183229a_89x50.jpg",
            "largeThumbnailUrl": "http://bpvideos.telstra.insnw.net/web/images/20170602183229a_326x184.jpg",
            "programType": "Instant Replay",
            "programCategory": "Score",
            "priority": 4,
            "lastUpdateDate": "2017-06-02T20:07:49+10:00",
            "isPremium": true,
            "club": [
                500021,
                500003
            ]
        },
        {
            "id": "UxZmxmYjE6yTg--1yJC9NaHu1MTQ-YHh",
            "contentId": 916074,
            "title": "Rd 13: GOAL Cameron Munster (19th min)",
            "description": "Cameron Munster converts the try of Felise Kaufusi from the touch line",
            "publishDate": "2017-06-02T18:23:58+10:00",
            "publisher": "NRL Chief",
            "thumbnailUrl": "http://bpvideos.telstra.insnw.net/web/images/20170602182337a_89x50.jpg",
            "largeThumbnailUrl": "http://bpvideos.telstra.insnw.net/web/images/20170602182337a_326x184.jpg",
            "programType": "Instant Replay",
            "programCategory": "Score",
            "priority": null,
            "lastUpdateDate": "2017-06-02T18:42:28+10:00",
            "isPremium": true,
            "club": [
                500021,
                500003
            ]
        },
        {
            "id": "BvZWxmYjE6brR1iPW7m8rdJXstETEC-2",
            "contentId": 916075,
            "title": "Rd 13: TRY Felise Kaufusi (17th min)",
            "description": "Felise Kaufusi scores Melbourne's third try in quick time",
            "publishDate": "2017-06-02T18:23:49+10:00",
            "publisher": "NRL Chief",
            "thumbnailUrl": "http://bpvideos.telstra.insnw.net/web/images/20170602182325a_89x50.jpg",
            "largeThumbnailUrl": "http://bpvideos.telstra.insnw.net/web/images/20170602182325a_326x184.jpg",
            "programType": "Instant Replay",
            "programCategory": "Score",
            "priority": 3,
            "lastUpdateDate": "2017-06-02T20:07:49+10:00",
            "isPremium": true,
            "club": [
                500021,
                500003
            ]
        },
        {
            "id": "hoZGxmYjE6YTB6648N9TeJNLflacHnt1",
            "contentId": 916073,
            "title": "Rd 13: GOAL Cameron Munster (16th min)",
            "description": "Cameron Munster converts the try of Josh Addo-Carr",
            "publishDate": "2017-06-02T18:19:47+10:00",
            "publisher": "NRL Chief",
            "thumbnailUrl": "http://bpvideos.telstra.insnw.net/web/images/20170602181927a_89x50.jpg",
            "largeThumbnailUrl": "http://bpvideos.telstra.insnw.net/web/images/20170602181927a_326x184.jpg",
            "programType": "Instant Replay",
            "programCategory": "Score",
            "priority": null,
            "lastUpdateDate": "2017-06-02T18:37:27+10:00",
            "isPremium": true,
            "club": [
                500021,
                500003
            ]
        },
        {
            "id": "hmZGxmYjE633AqsNhdbMQiadk_Ctf1bt",
            "contentId": 916072,
            "title": "Rd 13: TRY Josh Addo-Carr (14th min)",
            "description": "Josh Addo-Carr scores Melbourne's second try",
            "publishDate": "2017-06-02T18:19:18+10:00",
            "publisher": "NRL Chief",
            "thumbnailUrl": "http://bpvideos.telstra.insnw.net/web/images/20170602181914a_89x50.jpg",
            "largeThumbnailUrl": "http://bpvideos.telstra.insnw.net/web/images/20170602181914a_326x184.jpg",
            "programType": "Instant Replay",
            "programCategory": "Score",
            "priority": 2,
            "lastUpdateDate": "2017-06-02T20:07:49+10:00",
            "isPremium": true,
            "club": [
                500021,
                500003
            ]
        },
        {
            "id": "R4OWxmYjE6yU1TbQg1eo4PTifpzocbEE",
            "contentId": 916070,
            "title": "Rd 13: TRY Suliasi Vunivalu (2nd min)",
            "description": "Suliasi Vunivalu opens the scoring in just the second minute",
            "publishDate": "2017-06-02T18:08:18+10:00",
            "publisher": "NRL Chief",
            "thumbnailUrl": "http://bpvideos.telstra.insnw.net/web/images/20170602180844a_89x50.jpg",
            "largeThumbnailUrl": "http://bpvideos.telstra.insnw.net/web/images/20170602180844a_326x184.jpg",
            "programType": "Instant Replay",
            "programCategory": "Score",
            "priority": 1,
            "lastUpdateDate": "2017-06-02T20:07:49+10:00",
            "isPremium": true,
            "club": [
                500021,
                500003
            ]
        }
    ],
    "scores": [
        {
            "gameState": "First Half",
            "gameStateId": 3,
            "gameTime": "0:01:38",
            "gameSeconds": 98,
            "GameMinutes": "01:38",
            "playerId": 502107,
            "playerName": "Suliasi Vunivalu",
            "scoreMethod": "Try",
            "statEvent": "Try",
            "statId": 38,
            "statValue": 4,
            "vidRef": 2498,
            "homeScore": 4,
            "commentary": "Try by Suliasi Vunivalu",
            "tackleNum": 5,
            "teamId": 500021,
            "teamName": "Melbourne Storm",
            "homeTeamAbbrv": "MEL",
            "awayTeamAbbrv": "NEW"
        },
        {
            "gameState": "First Half",
            "gameStateId": 3,
            "gameTime": "0:13:50",
            "gameSeconds": 830,
            "GameMinutes": "13:50",
            "playerId": 501351,
            "playerName": "Josh Addo-Carr",
            "scoreMethod": "Try",
            "statEvent": "Try",
            "statId": 38,
            "statValue": 4,
            "vidRef": 21013,
            "homeScore": 8,
            "commentary": "Try by Josh Addo-Carr",
            "tackleNum": 3,
            "teamId": 500021,
            "teamName": "Melbourne Storm",
            "homeTeamAbbrv": "MEL",
            "awayTeamAbbrv": "NEW"
        },
        {
            "gameState": "First Half",
            "gameStateId": 3,
            "gameTime": "0:15:21",
            "gameSeconds": 921,
            "GameMinutes": "15:21",
            "playerId": 501459,
            "playerName": "Cameron Munster",
            "scoreMethod": "Conversion",
            "statEvent": "Conversion-Made",
            "statId": 1,
            "statValue": 2,
            "vidRef": 23293,
            "homeScore": 10,
            "commentary": "Conversion-Made by Cameron Munster",
            "tackleNum": -1,
            "teamId": 500021,
            "teamName": "Melbourne Storm",
            "homeTeamAbbrv": "MEL",
            "awayTeamAbbrv": "NEW"
        },
        {
            "gameState": "First Half",
            "gameStateId": 3,
            "gameTime": "0:16:57",
            "gameSeconds": 1017,
            "GameMinutes": "16:57",
            "playerId": 500598,
            "playerName": "Felise Kaufusi",
            "scoreMethod": "Try",
            "statEvent": "Try",
            "statId": 38,
            "statValue": 4,
            "vidRef": 25701,
            "homeScore": 14,
            "commentary": "Try by Felise Kaufusi",
            "tackleNum": 3,
            "teamId": 500021,
            "teamName": "Melbourne Storm",
            "homeTeamAbbrv": "MEL",
            "awayTeamAbbrv": "NEW"
        },
        {
            "gameState": "First Half",
            "gameStateId": 3,
            "gameTime": "0:18:29",
            "gameSeconds": 1109,
            "GameMinutes": "18:29",
            "playerId": 501459,
            "playerName": "Cameron Munster",
            "scoreMethod": "Conversion",
            "statEvent": "Conversion-Made",
            "statId": 1,
            "statValue": 2,
            "vidRef": 28245,
            "homeScore": 16,
            "commentary": "Conversion-Made by Cameron Munster",
            "tackleNum": -1,
            "teamId": 500021,
            "teamName": "Melbourne Storm",
            "homeTeamAbbrv": "MEL",
            "awayTeamAbbrv": "NEW"
        },
        {
            "gameState": "Second Half",
            "gameStateId": 5,
            "gameTime": "0:42:40",
            "gameSeconds": 2560,
            "GameMinutes": "42:40",
            "playerId": 500608,
            "playerName": "Billy Slater",
            "scoreMethod": "Try",
            "statEvent": "Try",
            "statId": 38,
            "statValue": 4,
            "vidRef": 69031,
            "homeScore": 20,
            "awayScore": 6,
            "commentary": "Try by Billy Slater",
            "tackleNum": 6,
            "teamId": 500021,
            "teamName": "Melbourne Storm",
            "homeTeamAbbrv": "MEL",
            "awayTeamAbbrv": "NEW"
        },
        {
            "gameState": "Second Half",
            "gameStateId": 5,
            "gameTime": "0:43:21",
            "gameSeconds": 2601,
            "GameMinutes": "43:21",
            "playerId": 501459,
            "playerName": "Cameron Munster",
            "scoreMethod": "Conversion",
            "statEvent": "Conversion-Made",
            "statId": 1,
            "statValue": 2,
            "vidRef": 73528,
            "homeScore": 22,
            "awayScore": 6,
            "commentary": "Conversion-Made by Cameron Munster",
            "tackleNum": -1,
            "teamId": 500021,
            "teamName": "Melbourne Storm",
            "homeTeamAbbrv": "MEL",
            "awayTeamAbbrv": "NEW"
        },
        {
            "gameState": "Second Half",
            "gameStateId": 5,
            "gameTime": "0:49:35",
            "gameSeconds": 2975,
            "GameMinutes": "49:35",
            "playerId": 502107,
            "playerName": "Suliasi Vunivalu",
            "scoreMethod": "Try",
            "statEvent": "Try",
            "statId": 38,
            "statValue": 4,
            "vidRef": 82886,
            "homeScore": 26,
            "awayScore": 6,
            "commentary": "Try by Suliasi Vunivalu",
            "tackleNum": 6,
            "teamId": 500021,
            "teamName": "Melbourne Storm",
            "homeTeamAbbrv": "MEL",
            "awayTeamAbbrv": "NEW"
        },
        {
            "gameState": "Second Half",
            "gameStateId": 5,
            "gameTime": "0:52:08",
            "gameSeconds": 3128,
            "GameMinutes": "52:08",
            "playerId": 500608,
            "playerName": "Billy Slater",
            "scoreMethod": "Try",
            "statEvent": "Try",
            "statId": 38,
            "statValue": 4,
            "vidRef": 87561,
            "homeScore": 30,
            "awayScore": 6,
            "commentary": "Try by Billy Slater",
            "tackleNum": 5,
            "teamId": 500021,
            "teamName": "Melbourne Storm",
            "homeTeamAbbrv": "MEL",
            "awayTeamAbbrv": "NEW"
        },
        {
            "gameState": "Second Half",
            "gameStateId": 5,
            "gameTime": "0:53:24",
            "gameSeconds": 3204,
            "GameMinutes": "53:24",
            "playerId": 501459,
            "playerName": "Cameron Munster",
            "scoreMethod": "Conversion",
            "statEvent": "Conversion-Made",
            "statId": 1,
            "statValue": 2,
            "vidRef": 89458,
            "homeScore": 32,
            "awayScore": 6,
            "commentary": "Conversion-Made by Cameron Munster",
            "tackleNum": -1,
            "teamId": 500021,
            "teamName": "Melbourne Storm",
            "homeTeamAbbrv": "MEL",
            "awayTeamAbbrv": "NEW"
        },
        {
            "gameState": "Second Half",
            "gameStateId": 5,
            "gameTime": "1:01:44",
            "gameSeconds": 3704,
            "GameMinutes": "61:44",
            "playerId": 503419,
            "playerName": "Brandon Smith",
            "scoreMethod": "Try",
            "statEvent": "Try",
            "statId": 38,
            "statValue": 4,
            "vidRef": 101957,
            "homeScore": 36,
            "awayScore": 6,
            "commentary": "Try by Brandon Smith",
            "tackleNum": 3,
            "teamId": 500021,
            "teamName": "Melbourne Storm",
            "homeTeamAbbrv": "MEL",
            "awayTeamAbbrv": "NEW"
        },
        {
            "gameState": "Second Half",
            "gameStateId": 5,
            "gameTime": "1:18:17",
            "gameSeconds": 4697,
            "GameMinutes": "78:17",
            "playerId": 501260,
            "playerName": "Cheyse Blair",
            "scoreMethod": "Try",
            "statEvent": "Try",
            "statId": 38,
            "statValue": 4,
            "vidRef": 127829,
            "homeScore": 40,
            "awayScore": 12,
            "commentary": "Try by Cheyse Blair",
            "tackleNum": 6,
            "teamId": 500021,
            "teamName": "Melbourne Storm",
            "homeTeamAbbrv": "MEL",
            "awayTeamAbbrv": "NEW"
        },
        {
            "gameState": "First Half",
            "gameStateId": 3,
            "gameTime": "0:27:43",
            "gameSeconds": 1663,
            "GameMinutes": "27:43",
            "playerId": 500693,
            "playerName": "Ken Sio",
            "scoreMethod": "Try",
            "statEvent": "Try",
            "statId": 38,
            "statValue": 4,
            "vidRef": 42071,
            "homeScore": 16,
            "awayScore": 4,
            "commentary": "Try by Ken Sio",
            "tackleNum": 2,
            "teamId": 500003,
            "teamName": "Newcastle Knights",
            "homeTeamAbbrv": "MEL",
            "awayTeamAbbrv": "NEW"
        },
        {
            "gameState": "First Half",
            "gameStateId": 3,
            "gameTime": "0:28:42",
            "gameSeconds": 1722,
            "GameMinutes": "28:42",
            "playerId": 502675,
            "playerName": "Brock Lamb",
            "scoreMethod": "Conversion",
            "statEvent": "Conversion-Made",
            "statId": 1,
            "statValue": 2,
            "vidRef": 46061,
            "homeScore": 16,
            "awayScore": 6,
            "commentary": "Conversion-Made by Brock Lamb",
            "tackleNum": -1,
            "teamId": 500003,
            "teamName": "Newcastle Knights",
            "homeTeamAbbrv": "MEL",
            "awayTeamAbbrv": "NEW"
        },
        {
            "gameState": "Second Half",
            "gameStateId": 5,
            "gameTime": "1:11:29",
            "gameSeconds": 4289,
            "GameMinutes": "71:29",
            "playerId": 500547,
            "playerName": "Lachlan Fitzgibbon",
            "scoreMethod": "Try",
            "statEvent": "Try",
            "statId": 38,
            "statValue": 4,
            "vidRef": 117621,
            "homeScore": 36,
            "awayScore": 10,
            "commentary": "Try by Lachlan Fitzgibbon",
            "tackleNum": 1,
            "teamId": 500003,
            "teamName": "Newcastle Knights",
            "homeTeamAbbrv": "MEL",
            "awayTeamAbbrv": "NEW"
        },
        {
            "gameState": "Second Half",
            "gameStateId": 5,
            "gameTime": "1:12:15",
            "gameSeconds": 4335,
            "GameMinutes": "72:15",
            "playerId": 502675,
            "playerName": "Brock Lamb",
            "scoreMethod": "Conversion",
            "statEvent": "Conversion-Made",
            "statId": 1,
            "statValue": 2,
            "vidRef": 118776,
            "homeScore": 36,
            "awayScore": 12,
            "commentary": "Conversion-Made by Brock Lamb",
            "tackleNum": -1,
            "teamId": 500003,
            "teamName": "Newcastle Knights",
            "homeTeamAbbrv": "MEL",
            "awayTeamAbbrv": "NEW"
        }
    ],
    "twitter": [
        {
            "id": "870573623408418816",
            "gameSeconds": 3960
        },
        {
            "id": "870573242238423040",
            "gameSeconds": 3960
        },
        {
            "id": "870569077982482432",
            "gameSeconds": 3000
        },
        {
            "id": "870568682052661249",
            "gameSeconds": 3000
        },
        {
            "id": "870567302667698177",
            "gameSeconds": 2580
        },
        {
            "id": "870566882218135552",
            "gameSeconds": 2580
        },
        {
            "id": "870559027951935488",
            "gameSeconds": 1680
        },
        {
            "id": "870558570684731394",
            "gameSeconds": 1680
        }
    ]
}