{
    "vod": [
        {
            "id": "lqYWU3NDE61Qw9RD3WYD4ya2xNkxuH7P",
            "contentId": 856300,
            "title": "Rd 15: Rabbitohs v Eels (Hls)",
            "description": "Highlights of the match between the Rabbitohs and Eels from ANZ Stadium",
            "publishDate": "2016-06-17T22:14:00+10:00",
            "publisher": "NRL Chief",
            "thumbnailUrl": "http://bigpondvideo.com/web/images/content/20160617221219a_89x50.jpg",
            "largeThumbnailUrl": "http://bigpondvideo.com/web/images/content/20160617221219a_326x184.jpg",
            "programType": "Highlights",
            "programCategory": "Match",
            "priority": null,
            "lastUpdateDate": "2016-06-17T23:08:43+10:00",
            "isPremium": false,
            "club": [
                500031,
                500005
            ]
        },
        {
            "id": "FzYmU3NDE6ndD-MtEs1ffY9d4mpftIBo",
            "contentId": 856307,
            "title": "Rd 15 Press Conference: Rabbitohs",
            "description": "The Rabbitohs coach faces the media following the match",
            "publishDate": "2016-06-17T22:37:00+10:00",
            "publisher": "NRL Chief",
            "thumbnailUrl": "http://bigpondvideo.com/web/images/content/20160617223204a_89x50.jpg",
            "largeThumbnailUrl": "http://bigpondvideo.com/web/images/content/20160617223204a_326x184.jpg",
            "programType": "Press Conference",
            "programCategory": null,
            "priority": null,
            "lastUpdateDate": "2016-06-17T23:09:42+10:00",
            "isPremium": false,
            "club": [
                500031,
                500005
            ]
        },
        {
            "id": "15YmU3NDE6tQmnyzptbIsqsZOxfjNZ0w",
            "contentId": 856308,
            "title": "Rd 15 Press Conference: Eels",
            "description": "The Eels coach faces the media following the match",
            "publishDate": "2016-06-17T22:36:00+10:00",
            "publisher": "NRL Chief",
            "thumbnailUrl": "http://bigpondvideo.com/web/images/content/20160617221731a_89x50.jpg",
            "largeThumbnailUrl": "http://bigpondvideo.com/web/images/content/20160617221731a_326x184.jpg",
            "programType": "Press Conference",
            "programCategory": null,
            "priority": null,
            "lastUpdateDate": "2016-06-17T23:09:42+10:00",
            "isPremium": false,
            "club": [
                500031,
                500005
            ]
        },
        {
            "id": "JubWU3NDE6xJb3zaBBGo_-eQ9RItqvtp",
            "contentId": 855702,
            "title": "Rd 15: GOAL Michael Gordon (80th min)",
            "description": "Michael Gordon converts the Semi Radradra try",
            "publishDate": "2016-06-17T21:39:05+10:00",
            "publisher": "NRL Chief",
            "thumbnailUrl": "http://bigpondvideo.com/web/images/content/20160617214725a_89x50.jpg",
            "largeThumbnailUrl": "http://bigpondvideo.com/web/images/content/20160617214725a_326x184.jpg",
            "programType": "Instant Replay",
            "programCategory": "Score",
            "priority": null,
            "lastUpdateDate": "2016-06-17T23:29:47+10:00",
            "isPremium": true,
            "club": [
                500031,
                500005
            ]
        },
        {
            "id": "JsbWU3NDE6CNTUHXQRXuhBvS2YErROgj",
            "contentId": 855697,
            "title": "Rd 15: TRY Semi Radradra (78th min)",
            "description": "Semi Radradra scores a try for the Eels",
            "publishDate": "2016-06-17T21:37:05+10:00",
            "publisher": "NRL Chief",
            "thumbnailUrl": "http://bigpondvideo.com/web/images/content/20160617214702a_89x50.jpg",
            "largeThumbnailUrl": "http://bigpondvideo.com/web/images/content/20160617214702a_326x184.jpg",
            "programType": "Instant Replay",
            "programCategory": "Score",
            "priority": null,
            "lastUpdateDate": "2016-06-17T23:29:47+10:00",
            "isPremium": true,
            "club": [
                500031,
                500005
            ]
        },
        {
            "id": "IxbWU3NDE6dxTFhSg-eOsypE0YlCKXfc",
            "contentId": 855695,
            "title": "Rd 15: PENALTY GOAL Michael Gordon (77th min)",
            "description": "Michael Gordon kicks a penalty goal",
            "publishDate": "2016-06-17T21:34:05+10:00",
            "publisher": "NRL Chief",
            "thumbnailUrl": "http://bigpondvideo.com/web/images/content/20160617214018a_89x50.jpg",
            "largeThumbnailUrl": "http://bigpondvideo.com/web/images/content/20160617214018a_326x184.jpg",
            "programType": "Instant Replay",
            "programCategory": "Score",
            "priority": null,
            "lastUpdateDate": "2016-06-17T23:29:47+10:00",
            "isPremium": true,
            "club": [
                500031,
                500005
            ]
        },
        {
            "id": "ZkbWU3NDE6e-NJg-AJq43w_1LFr6g77L",
            "contentId": 855688,
            "title": "Rd 15: PENALTY GOAL Michael Gordon (70th min)",
            "description": "Michael Gordon kicks a penalty goal",
            "publishDate": "2016-06-17T21:29:05+10:00",
            "publisher": "NRL Chief",
            "thumbnailUrl": "http://bigpondvideo.com/web/images/content/20160617213246a_89x50.jpg",
            "largeThumbnailUrl": "http://bigpondvideo.com/web/images/content/20160617213246a_326x184.jpg",
            "programType": "Instant Replay",
            "programCategory": "Score",
            "priority": null,
            "lastUpdateDate": "2016-06-17T23:29:47+10:00",
            "isPremium": true,
            "club": [
                500031,
                500005
            ]
        },
        {
            "id": "UzbWU3NDE6ri9ELSuQ1-Giu2uXrlMMGO",
            "contentId": 855687,
            "title": "Rd 15: GOAL Michael Gordon (64th min)",
            "description": "Michael Gordon converts the Bevan French try",
            "publishDate": "2016-06-17T21:21:05+10:00",
            "publisher": "NRL Chief",
            "thumbnailUrl": "http://bigpondvideo.com/web/images/content/20160617212759a_89x50.jpg",
            "largeThumbnailUrl": "http://bigpondvideo.com/web/images/content/20160617212759a_326x184.jpg",
            "programType": "Instant Replay",
            "programCategory": "Score",
            "priority": null,
            "lastUpdateDate": "2016-06-17T23:29:47+10:00",
            "isPremium": true,
            "club": [
                500031,
                500005
            ]
        },
        {
            "id": "1vbGU3NDE6dTn2ZqwJaMEWeMyljkH8AR",
            "contentId": 855686,
            "title": "Rd 15: TRY Bevan French (62nd min)",
            "description": "Bevan French scores a try for the Eels",
            "publishDate": "2016-06-17T21:19:05+10:00",
            "publisher": "NRL Chief",
            "thumbnailUrl": "http://bigpondvideo.com/web/images/content/20160617212451a_89x50.jpg",
            "largeThumbnailUrl": "http://bigpondvideo.com/web/images/content/20160617212451a_326x184.jpg",
            "programType": "Instant Replay",
            "programCategory": "Score",
            "priority": null,
            "lastUpdateDate": "2016-06-17T23:28:47+10:00",
            "isPremium": true,
            "club": [
                500031,
                500005
            ]
        },
        {
            "id": "kxY2M3NDE6EZ6irwHXtzEfu1etgUA6FD",
            "contentId": 855685,
            "title": "Rd 15: GOAL Cody Walker (38th min)",
            "description": "Cody Walker converts the Nathan Brown try",
            "publishDate": "2016-06-17T20:40:00+10:00",
            "publisher": "NRL Chief",
            "thumbnailUrl": "http://bigpondvideo.com/web/images/content/20160617204645a_89x50.jpg",
            "largeThumbnailUrl": "http://bigpondvideo.com/web/images/content/20160617204645a_326x184.jpg",
            "programType": "Instant Replay",
            "programCategory": "Score",
            "priority": null,
            "lastUpdateDate": "2016-06-17T21:01:14+10:00",
            "isPremium": true,
            "club": [
                500031,
                500005
            ]
        },
        {
            "id": "tzYmM3NDE6eqyLgT4r9pQxDi9JYofBlp",
            "contentId": 855683,
            "title": "Rd 15: TRY Nathan Brown (37th min)",
            "description": "Nathan Brown scores a try for the Rabbitohs",
            "publishDate": "2016-06-17T20:39:00+10:00",
            "publisher": "NRL Chief",
            "thumbnailUrl": "http://bigpondvideo.com/web/images/content/20160617204617a_89x50.jpg",
            "largeThumbnailUrl": "http://bigpondvideo.com/web/images/content/20160617204617a_326x184.jpg",
            "programType": "Instant Replay",
            "programCategory": "Score",
            "priority": null,
            "lastUpdateDate": "2016-06-17T21:01:14+10:00",
            "isPremium": true,
            "club": [
                500031,
                500005
            ]
        },
        {
            "id": "NnYmM3NDE6URbDCZUgNbrm_JjtGGjh8I",
            "contentId": 855682,
            "title": "Rd 15: GOAL Michael Gordon (25th min)",
            "description": "Michael Gordon converts the Bevan French try",
            "publishDate": "2016-06-17T20:24:00+10:00",
            "publisher": "NRL Chief",
            "thumbnailUrl": "http://bigpondvideo.com/web/images/content/20160617203553a_89x50.jpg",
            "largeThumbnailUrl": "http://bigpondvideo.com/web/images/content/20160617203553a_326x184.jpg",
            "programType": "Instant Replay",
            "programCategory": "Score",
            "priority": null,
            "lastUpdateDate": "2016-06-17T21:00:14+10:00",
            "isPremium": true,
            "club": [
                500031,
                500005
            ]
        },
        {
            "id": "ZrYmM3NDE60fO9xTN4Nq6f9Cl0Cz00SC",
            "contentId": 855681,
            "title": "Rd 15: TRY Bevan French (23rd min)",
            "description": "Bevan French scores a try for the Eels",
            "publishDate": "2016-06-17T20:23:00+10:00",
            "publisher": "NRL Chief",
            "thumbnailUrl": "http://bigpondvideo.com/web/images/content/20160617203538a_89x50.jpg",
            "largeThumbnailUrl": "http://bigpondvideo.com/web/images/content/20160617203538a_326x184.jpg",
            "programType": "Instant Replay",
            "programCategory": "Score",
            "priority": null,
            "lastUpdateDate": "2016-06-17T21:01:14+10:00",
            "isPremium": true,
            "club": [
                500031,
                500005
            ]
        },
        {
            "id": "swYmM3NDE6K1079NclTOLgZjcxWEzst5",
            "contentId": 855680,
            "title": "Rd 15: PENALTY GOAL Michael Gordon (19th min)",
            "description": "Michael Gordon kicks a penalty goal",
            "publishDate": "2016-06-17T20:18:00+10:00",
            "publisher": "NRL Chief",
            "thumbnailUrl": "http://bigpondvideo.com/web/images/content/20160617202241a_89x50.jpg",
            "largeThumbnailUrl": "http://bigpondvideo.com/web/images/content/20160617202241a_326x184.jpg",
            "programType": "Instant Replay",
            "programCategory": "Score",
            "priority": null,
            "lastUpdateDate": "2016-06-17T20:59:13+10:00",
            "isPremium": true,
            "club": [
                500031,
                500005
            ]
        },
        {
            "id": "50YWM3NDE60HukP6SiX8J4xh2xBxIrLC",
            "contentId": 855679,
            "title": "Rd 15: GOAL Michael Gordon (17th min)",
            "description": "Michael Gordon converts the Clinton Gutherson try",
            "publishDate": "2016-06-17T20:16:00+10:00",
            "publisher": "NRL Chief",
            "thumbnailUrl": "http://bigpondvideo.com/web/images/content/20160617202011a_89x50.jpg",
            "largeThumbnailUrl": "http://bigpondvideo.com/web/images/content/20160617202011a_326x184.jpg",
            "programType": "Instant Replay",
            "programCategory": "Score",
            "priority": null,
            "lastUpdateDate": "2016-06-17T20:59:13+10:00",
            "isPremium": true,
            "club": [
                500031,
                500005
            ]
        },
        {
            "id": "RsYWM3NDE6_4UpHz5Cmyvh27Ob5yqPMg",
            "contentId": 855678,
            "title": "Rd 15: TRY Clinton Gutherson (16th min)",
            "description": "Clinton Gutherson scores a try for the Eels",
            "publishDate": "2016-06-17T20:15:00+10:00",
            "publisher": "NRL Chief",
            "thumbnailUrl": "http://bigpondvideo.com/web/images/content/20160617201857a_89x50.jpg",
            "largeThumbnailUrl": "http://bigpondvideo.com/web/images/content/20160617201857a_326x184.jpg",
            "programType": "Instant Replay",
            "programCategory": "Score",
            "priority": null,
            "lastUpdateDate": "2016-06-17T20:59:13+10:00",
            "isPremium": true,
            "club": [
                500031,
                500005
            ]
        },
        {
            "id": "piYWM3NDE6I0kz-tIdH183z9rn_Rsn95",
            "contentId": 855677,
            "title": "Rd 15: GOAL Cody Walker (11th min)",
            "description": "Cody Walker converts the Alex Johnston try",
            "publishDate": "2016-06-17T20:09:00+10:00",
            "publisher": "NRL Chief",
            "thumbnailUrl": "http://bigpondvideo.com/web/images/content/20160617201455a_89x50.jpg",
            "largeThumbnailUrl": "http://bigpondvideo.com/web/images/content/20160617201455a_326x184.jpg",
            "programType": "Instant Replay",
            "programCategory": "Score",
            "priority": null,
            "lastUpdateDate": "2016-06-17T20:58:14+10:00",
            "isPremium": true,
            "club": [
                500031,
                500005
            ]
        },
        {
            "id": "Q1YWM3NDE6w7apCXcyV3vfD9gtW9v2uf",
            "contentId": 855675,
            "title": "Rd 15: TRY Alex Johnston (10th min)",
            "description": "Alex Johnston scores a try for the Rabbitohs",
            "publishDate": "2016-06-17T20:07:00+10:00",
            "publisher": "NRL Chief",
            "thumbnailUrl": "http://bigpondvideo.com/web/images/content/20160617201207a_89x50.jpg",
            "largeThumbnailUrl": "http://bigpondvideo.com/web/images/content/20160617201207a_326x184.jpg",
            "programType": "Instant Replay",
            "programCategory": "Score",
            "priority": null,
            "lastUpdateDate": "2016-06-17T20:58:14+10:00",
            "isPremium": true,
            "club": [
                500031,
                500005
            ]
        }
    ],
    "scores": [
        {
            "gameState": "First Half",
            "gameStateId": 3,
            "gameTime": "0:09:24",
            "gameSeconds": 564,
            "GameMinutes": "09:24",
            "playerId": 500108,
            "playerName": "Alex Johnston",
            "scoreMethod": "Try",
            "statEvent": "Try",
            "statId": 38,
            "statValue": 4,
            "vidRef": 17299,
            "homeScore": 4,
            "commentary": "Try by Alex Johnston",
            "tackleNum": 3,
            "teamId": 500005,
            "teamName": "South Sydney Rabbitohs",
            "homeTeamAbbrv": "SOU",
            "awayTeamAbbrv": "PAR"
        },
        {
            "gameState": "First Half",
            "gameStateId": 3,
            "gameTime": "0:10:41",
            "gameSeconds": 641,
            "GameMinutes": "10:41",
            "playerId": 500611,
            "playerName": "Cody Walker",
            "scoreMethod": "Conversion",
            "statEvent": "Conversion-Made",
            "statId": 1,
            "statValue": 2,
            "vidRef": 19215,
            "homeScore": 6,
            "commentary": "Conversion-Made by Cody Walker",
            "tackleNum": -1,
            "teamId": 500005,
            "teamName": "South Sydney Rabbitohs",
            "homeTeamAbbrv": "SOU",
            "awayTeamAbbrv": "PAR"
        },
        {
            "gameState": "First Half",
            "gameStateId": 3,
            "gameTime": "0:36:24",
            "gameSeconds": 2184,
            "GameMinutes": "36:24",
            "playerId": 500647,
            "playerName": "Nathan Brown",
            "scoreMethod": "Try",
            "statEvent": "Try",
            "statId": 38,
            "statValue": 4,
            "vidRef": 59355,
            "homeScore": 10,
            "awayScore": 14,
            "commentary": "Try by Nathan Brown",
            "tackleNum": 4,
            "teamId": 500005,
            "teamName": "South Sydney Rabbitohs",
            "homeTeamAbbrv": "SOU",
            "awayTeamAbbrv": "PAR"
        },
        {
            "gameState": "First Half",
            "gameStateId": 3,
            "gameTime": "0:37:44",
            "gameSeconds": 2264,
            "GameMinutes": "37:44",
            "playerId": 500611,
            "playerName": "Cody Walker",
            "scoreMethod": "Conversion",
            "statEvent": "Conversion-Made",
            "statId": 1,
            "statValue": 2,
            "vidRef": 61354,
            "homeScore": 12,
            "awayScore": 14,
            "commentary": "Conversion-Made by Cody Walker",
            "tackleNum": -1,
            "teamId": 500005,
            "teamName": "South Sydney Rabbitohs",
            "homeTeamAbbrv": "SOU",
            "awayTeamAbbrv": "PAR"
        },
        {
            "gameState": "First Half",
            "gameStateId": 3,
            "gameTime": "0:15:07",
            "gameSeconds": 907,
            "GameMinutes": "15:07",
            "playerId": 500729,
            "playerName": "Clinton Gutherson",
            "scoreMethod": "Try",
            "statEvent": "Try",
            "statId": 38,
            "statValue": 4,
            "vidRef": 26351,
            "homeScore": 6,
            "awayScore": 4,
            "commentary": "Try by Clinton Gutherson",
            "tackleNum": 6,
            "teamId": 500031,
            "teamName": "Parramatta Eels",
            "homeTeamAbbrv": "SOU",
            "awayTeamAbbrv": "PAR"
        },
        {
            "gameState": "First Half",
            "gameStateId": 3,
            "gameTime": "0:16:30",
            "gameSeconds": 990,
            "GameMinutes": "16:30",
            "playerId": 500797,
            "playerName": "Michael Gordon",
            "scoreMethod": "Conversion",
            "statEvent": "Conversion-Made",
            "statId": 1,
            "statValue": 2,
            "vidRef": 28416,
            "homeScore": 6,
            "awayScore": 6,
            "commentary": "Conversion-Made by Michael Gordon",
            "tackleNum": -1,
            "teamId": 500031,
            "teamName": "Parramatta Eels",
            "homeTeamAbbrv": "SOU",
            "awayTeamAbbrv": "PAR"
        },
        {
            "gameState": "First Half",
            "gameStateId": 3,
            "gameTime": "0:18:56",
            "gameSeconds": 1136,
            "GameMinutes": "18:56",
            "playerId": 500797,
            "playerName": "Michael Gordon",
            "scoreMethod": "Penalty Goal",
            "statEvent": "Penalty Shot-Made",
            "statId": 67,
            "statValue": 2,
            "vidRef": 32075,
            "homeScore": 6,
            "awayScore": 8,
            "commentary": "Penalty Shot-Made by Michael Gordon",
            "tackleNum": -1,
            "teamId": 500031,
            "teamName": "Parramatta Eels",
            "homeTeamAbbrv": "SOU",
            "awayTeamAbbrv": "PAR"
        },
        {
            "gameState": "First Half",
            "gameStateId": 3,
            "gameTime": "0:22:36",
            "gameSeconds": 1356,
            "GameMinutes": "22:36",
            "playerId": 503601,
            "playerName": "Bevan French",
            "scoreMethod": "Try",
            "statEvent": "Try",
            "statId": 38,
            "statValue": 4,
            "vidRef": 37561,
            "homeScore": 6,
            "awayScore": 12,
            "commentary": "Try by Bevan French",
            "tackleNum": 4,
            "teamId": 500031,
            "teamName": "Parramatta Eels",
            "homeTeamAbbrv": "SOU",
            "awayTeamAbbrv": "PAR"
        },
        {
            "gameState": "First Half",
            "gameStateId": 3,
            "gameTime": "0:24:00",
            "gameSeconds": 1440,
            "GameMinutes": "24:00",
            "playerId": 500797,
            "playerName": "Michael Gordon",
            "scoreMethod": "Conversion",
            "statEvent": "Conversion-Made",
            "statId": 1,
            "statValue": 2,
            "vidRef": 40206,
            "homeScore": 6,
            "awayScore": 14,
            "commentary": "Conversion-Made by Michael Gordon",
            "tackleNum": -1,
            "teamId": 500031,
            "teamName": "Parramatta Eels",
            "homeTeamAbbrv": "SOU",
            "awayTeamAbbrv": "PAR"
        },
        {
            "gameState": "Second Half",
            "gameStateId": 5,
            "gameTime": "1:01:47",
            "gameSeconds": 3707,
            "GameMinutes": "61:47",
            "playerId": 503601,
            "playerName": "Bevan French",
            "scoreMethod": "Try",
            "statEvent": "Try",
            "statId": 38,
            "statValue": 4,
            "vidRef": 104248,
            "homeScore": 12,
            "awayScore": 18,
            "commentary": "Try by Bevan French",
            "tackleNum": 1,
            "teamId": 500031,
            "teamName": "Parramatta Eels",
            "homeTeamAbbrv": "SOU",
            "awayTeamAbbrv": "PAR"
        },
        {
            "gameState": "Second Half",
            "gameStateId": 5,
            "gameTime": "1:03:10",
            "gameSeconds": 3790,
            "GameMinutes": "63:10",
            "playerId": 500797,
            "playerName": "Michael Gordon",
            "scoreMethod": "Conversion",
            "statEvent": "Conversion-Made",
            "statId": 1,
            "statValue": 2,
            "vidRef": 107063,
            "homeScore": 12,
            "awayScore": 20,
            "commentary": "Conversion-Made by Michael Gordon",
            "tackleNum": -1,
            "teamId": 500031,
            "teamName": "Parramatta Eels",
            "homeTeamAbbrv": "SOU",
            "awayTeamAbbrv": "PAR"
        },
        {
            "gameState": "Second Half",
            "gameStateId": 5,
            "gameTime": "1:09:29",
            "gameSeconds": 4169,
            "GameMinutes": "69:29",
            "playerId": 500797,
            "playerName": "Michael Gordon",
            "scoreMethod": "Penalty Goal",
            "statEvent": "Penalty Shot-Made",
            "statId": 67,
            "statValue": 2,
            "vidRef": 116565,
            "homeScore": 12,
            "awayScore": 22,
            "commentary": "Penalty Shot-Made by Michael Gordon",
            "tackleNum": -1,
            "teamId": 500031,
            "teamName": "Parramatta Eels",
            "homeTeamAbbrv": "SOU",
            "awayTeamAbbrv": "PAR"
        },
        {
            "gameState": "Second Half",
            "gameStateId": 5,
            "gameTime": "1:16:29",
            "gameSeconds": 4589,
            "GameMinutes": "76:29",
            "playerId": 500797,
            "playerName": "Michael Gordon",
            "scoreMethod": "Penalty Goal",
            "statEvent": "Penalty Shot-Made",
            "statId": 67,
            "statValue": 2,
            "vidRef": 127070,
            "homeScore": 12,
            "awayScore": 24,
            "commentary": "Penalty Shot-Made by Michael Gordon",
            "tackleNum": -1,
            "teamId": 500031,
            "teamName": "Parramatta Eels",
            "homeTeamAbbrv": "SOU",
            "awayTeamAbbrv": "PAR"
        },
        {
            "gameState": "Second Half",
            "gameStateId": 5,
            "gameTime": "1:17:57",
            "gameSeconds": 4677,
            "GameMinutes": "77:57",
            "playerId": 500690,
            "playerName": "Semi Radradra",
            "scoreMethod": "Try",
            "statEvent": "Try",
            "statId": 38,
            "statValue": 4,
            "vidRef": 130423,
            "homeScore": 12,
            "awayScore": 28,
            "commentary": "Try by Semi Radradra",
            "tackleNum": 1,
            "teamId": 500031,
            "teamName": "Parramatta Eels",
            "homeTeamAbbrv": "SOU",
            "awayTeamAbbrv": "PAR"
        },
        {
            "gameState": "Second Half",
            "gameStateId": 5,
            "gameTime": "1:19:13",
            "gameSeconds": 4753,
            "GameMinutes": "79:13",
            "playerId": 500797,
            "playerName": "Michael Gordon",
            "scoreMethod": "Conversion",
            "statEvent": "Conversion-Made",
            "statId": 1,
            "statValue": 2,
            "vidRef": 133401,
            "homeScore": 12,
            "awayScore": 30,
            "commentary": "Conversion-Made by Michael Gordon",
            "tackleNum": -1,
            "teamId": 500031,
            "teamName": "Parramatta Eels",
            "homeTeamAbbrv": "SOU",
            "awayTeamAbbrv": "PAR"
        }
    ]
}