{
    "competitionId": 111,
    "competitionName": "NRL Telstra Premiership",
    "gameId": 20171110820,
    "gameInfo": {
        "assistantReferee1Id": 500020,
        "assistantReferee1Name": "Jason Walsh",
        "assistantReferee2Id": 500021,
        "assistantReferee2Name": "Dave Ryan",
        "crowd": 11083,
        "gameDate": "2017-04-21",
        "gameHashTag": "#NRLSouthsBroncos",
        "gameNumber": 2,
        "gameSeconds": 4800,
        "gameMinutes": "80:00",
        "gameTime": "1:20:00",
        "groundConditionId": 2,
        "groundConditionName": "Good",
        "numberOfPeriods": 2,
        "referee1Id": 500039,
        "referee1Name": "Ashley Klein",
        "referee2Id": 500029,
        "referee2Name": "Chris Butler",
        "startTime": "2017-04-21T19:50:00",
        "startTimeUTC": "2017-04-21T09:50:00Z",
        "venueId": 500002,
        "venueName": "ANZ Stadium",
        "videoReferee1Id": 500203,
        "videoReferee1Name": "Ben Galea",
        "seniorReviewOfficialId": 500027,
        "seniorReviewOfficialName": "Bernard Sutton",
        "weatherId": 11,
        "weatherName": "Partly Cloudy",
        "broadcastChannel": "NINE",
        "broadcastScheduledTimeUTC": "2017-04-21T09:40:00Z",
        "broadcastScheduledTime": "2017-04-21T19:40:00",
        "venueLatitude": -33.8472,
        "venueLongitude": 151.0633,
        "broadcastInfo": {
            "radioNetwork": []
        }
    },
    "gameState": "Final",
    "gameStateId": 8,
    "roundId": 8,
    "roundName": "Round 8",
    "seasonId": 2017,
    "teams": {
        "teamsMatch": [
            {
                "isHomeTeam": true,
                "score": {
                    "conversions": 3,
                    "points": 24,
                    "penaltyGoals": 1,
                    "tries": 4,
                    "allGoals": 4
                },
                "team1stHalfScore": 8,
                "team2ndHalfScore": 16,
                "teamAbbr": "SOU",
                "teamFinalScore": 24,
                "teamFullTimeScore": 24,
                "teamHalfTimeScore": 8,
                "teamId": 500005,
                "teamLineup": {
                    "teamLineUpStatusID": 4,
                    "teamLineUpStatus": "Final",
                    "injuriesAndSuspensions": {
                        "injury": [],
                        "suspension": []
                    },
                    "insAndOuts": {
                        "inOut": [
                            {
                                "inOut": "Out",
                                "playerFirstName": "Adam",
                                "playerId": "500086",
                                "playerLastName": "Reynolds",
                                "playerName": "Adam Reynolds"
                            },
                            {
                                "inOut": "Out",
                                "playerFirstName": "Braidon",
                                "playerId": "506040",
                                "playerLastName": " Burns",
                                "playerName": "Braidon Burns"
                            },
                            {
                                "inOut": "In",
                                "playerFirstName": "Cameron",
                                "playerId": "504176",
                                "playerLastName": "Murray",
                                "playerName": "Cameron Murray"
                            },
                            {
                                "inOut": "In",
                                "playerFirstName": "Hymel",
                                "playerId": "500597",
                                "playerLastName": "Hunt",
                                "playerName": "Hymel Hunt"
                            }
                        ]
                    },
                    "teamPlayer": [
                        {
                            "playerFirstName": "Alex",
                            "playerId": 500108,
                            "playerLastName": "Johnston",
                            "playerName": "Alex Johnston",
                            "playerPosition": "Fullback",
                            "playerPositionId": 500001,
                            "playerStats": {
                                "allRunMetres": 77,
                                "allRuns": 13,
                                "dummyHalfRuns": 1,
                                "errors": 1,
                                "fantasyPointsTotal": 17,
                                "kickReturnMetres": 23,
                                "kickReturns": 4,
                                "kicksDefused": 1,
                                "kicksNotDefused": 1,
                                "mins": 80,
                                "missedTackles": 2,
                                "passes": 11,
                                "passesPerRun": 0.85,
                                "supports": 15,
                                "tackleBreaks": 1,
                                "tackles": 7,
                                "trySaves": 1,
                                "evasionRuns": 8,
                                "evasionRunMetres": 44,
                                "dummyHalfRunMetres": 10,
                                "ptbAll": 12,
                                "receipts": 24,
                                "postContactMetres": 18,
                                "lineEngagedRuns": 1,
                                "ptbAverage": 3.38,
                                "ptbTwoToThree": 6,
                                "ptbThreeToFour": 2,
                                "ptbFourToFive": 3,
                                "ptbFivePlus": 1,
                                "ptbOpp20m": 2,
                                "doubles": 1,
                                "effectiveTacklePercentage": 77.8,
                                "stint1": 4800,
                                "kickReceiptRuns": 4,
                                "kickReceiptMetres": 23
                            },
                            "playerTookTheField": true,
                            "shirtNum": 1,
                            "playerFirstInitial": "A",
                            "playerPositionAbbrev": "FB",
                            "onTheField": true,
                            "fantasyPrice": 302000,
                            "fantasySeasonPriceChange": 44000,
                            "fantasyRoundPriceChange": -12000
                        },
                        {
                            "playerFirstName": "Hymel",
                            "playerId": 500597,
                            "playerLastName": "Hunt",
                            "playerName": "Hymel Hunt",
                            "playerPosition": "Winger 1",
                            "playerPositionId": 500002,
                            "playerStats": {
                                "allRunMetres": 79,
                                "allRuns": 10,
                                "decoys": 1,
                                "errors": 1,
                                "fantasyPointsTotal": 24,
                                "kickReturnMetres": 19,
                                "kickReturns": 3,
                                "kicksDefused": 1,
                                "mins": 80,
                                "missedTackles": 1,
                                "passes": 2,
                                "passesPerRun": 0.2,
                                "supports": 13,
                                "tackleBreaks": 3,
                                "tackles": 11,
                                "tryCause": 2,
                                "evasionRuns": 7,
                                "evasionRunMetres": 60,
                                "ptbAll": 10,
                                "receipts": 12,
                                "postContactMetres": 26,
                                "ptbAverage": 2.61,
                                "ptbOneToTwo": 2,
                                "ptbTwoToThree": 6,
                                "ptbThreeToFour": 2,
                                "doubles": 2,
                                "effectiveTacklePercentage": 91.7,
                                "stint1": 4800,
                                "kickReceiptRuns": 3,
                                "kickReceiptMetres": 19
                            },
                            "playerTookTheField": true,
                            "shirtNum": 21,
                            "playerFirstInitial": "H",
                            "playerPositionAbbrev": "WG",
                            "onTheField": true,
                            "fantasyPrice": 250000,
                            "fantasySeasonPriceChange": -55000
                        },
                        {
                            "playerFirstName": "Robert",
                            "playerId": 501252,
                            "playerLastName": "Jennings",
                            "playerName": "Robert Jennings",
                            "playerPosition": "Centre 1",
                            "playerPositionId": 500003,
                            "playerStats": {
                                "allRunMetres": 71,
                                "allRuns": 9,
                                "bombKicksDefused": 1,
                                "errors": 2,
                                "fantasyPointsTotal": 21,
                                "kicksDefused": 1,
                                "mins": 80,
                                "missedTackles": 3,
                                "offloads": 1,
                                "oneOnOneTackles": 2,
                                "points": 4,
                                "supports": 20,
                                "tackleBreaks": 1,
                                "tackles": 10,
                                "tries": 1,
                                "evasionRuns": 9,
                                "evasionRunMetres": 71,
                                "ptbAll": 7,
                                "receipts": 12,
                                "postContactMetres": 24,
                                "ptbAverage": 3.64,
                                "ptbOneToTwo": 1,
                                "ptbTwoToThree": 1,
                                "ptbThreeToFour": 3,
                                "ptbFourToFive": 1,
                                "ptbFivePlus": 1,
                                "ptbOpp20m": 2,
                                "doubles": 1,
                                "effectiveTacklePercentage": 76.9,
                                "stint1": 4800
                            },
                            "playerTookTheField": true,
                            "shirtNum": 3,
                            "playerFirstInitial": "R",
                            "playerPositionAbbrev": "CT",
                            "onTheField": true,
                            "fantasyPrice": 210000,
                            "fantasySeasonPriceChange": 72000,
                            "fantasyRoundPriceChange": 10000
                        },
                        {
                            "playerFirstName": "Siosifa",
                            "playerId": 504175,
                            "playerLastName": "Talakai",
                            "playerName": "Siosifa Talakai",
                            "playerPosition": "Centre 2",
                            "playerPositionId": 500004,
                            "playerStats": {
                                "allRunMetres": 104,
                                "allRuns": 12,
                                "decoys": 1,
                                "fantasyPointsTotal": 37,
                                "ineffectiveTackles": 2,
                                "linebreaks": 1,
                                "mins": 80,
                                "missedTackles": 5,
                                "passes": 2,
                                "passesPerRun": 0.17,
                                "points": 4,
                                "supports": 17,
                                "tackleBreaks": 4,
                                "tackles": 13,
                                "tries": 1,
                                "tryCause": 2,
                                "evasionRuns": 12,
                                "evasionRunMetres": 104,
                                "ptbAll": 10,
                                "receipts": 13,
                                "postContactMetres": 42,
                                "ptbAverage": 3.08,
                                "ptbTwoToThree": 5,
                                "ptbThreeToFour": 4,
                                "ptbFourToFive": 1,
                                "ptbOpp20m": 2,
                                "doubles": 3,
                                "effectiveTacklePercentage": 65,
                                "stint1": 4800
                            },
                            "playerTookTheField": true,
                            "shirtNum": 4,
                            "playerFirstInitial": "S",
                            "playerPositionAbbrev": "CT",
                            "onTheField": true,
                            "fantasyPrice": 229000,
                            "fantasySeasonPriceChange": 52000,
                            "fantasyRoundPriceChange": 7000
                        },
                        {
                            "playerFirstName": "Bryson",
                            "playerId": 500082,
                            "playerLastName": "Goodwin",
                            "playerName": "Bryson Goodwin",
                            "playerPosition": "Winger 2",
                            "playerPositionId": 500005,
                            "playerStats": {
                                "allRunMetres": 107,
                                "allRuns": 12,
                                "conversions": 3,
                                "conversionsAttempts": 4,
                                "conversionsMissed": 1,
                                "dummyHalfRuns": 1,
                                "fantasyPointsTotal": 32,
                                "goalConversionRate": 66.67,
                                "allGoals": 4,
                                "allGoalsMissed": 2,
                                "allGoalsAttempted": 6,
                                "kickReturnMetres": 22,
                                "kickReturns": 2,
                                "mins": 80,
                                "missedTackles": 1,
                                "offloads": 2,
                                "passes": 3,
                                "passesPerRun": 0.25,
                                "penalties": 1,
                                "penaltyGoals": 1,
                                "penaltyGoalsAttempts": 2,
                                "penaltyGoalsMissed": 1,
                                "points": 8,
                                "supports": 11,
                                "tackleBreaks": 2,
                                "tackles": 3,
                                "tryAssists": 1,
                                "evasionRuns": 9,
                                "evasionRunMetres": 69,
                                "dummyHalfRunMetres": 16,
                                "ptbAll": 10,
                                "receipts": 14,
                                "postContactMetres": 45,
                                "ptbAverage": 2.61,
                                "ptbOneToTwo": 2,
                                "ptbTwoToThree": 6,
                                "ptbFourToFive": 2,
                                "effectiveTacklePercentage": 75,
                                "generalPlayPenalties": 1,
                                "stint1": 4800,
                                "kickReceiptRuns": 2,
                                "kickReceiptMetres": 22
                            },
                            "playerTookTheField": true,
                            "shirtNum": 5,
                            "playerFirstInitial": "B",
                            "playerPositionAbbrev": "WG",
                            "onTheField": true,
                            "fantasyPrice": 281000,
                            "fantasySeasonPriceChange": -65000,
                            "fantasyRoundPriceChange": -29000
                        },
                        {
                            "playerFirstName": "John",
                            "playerId": 500085,
                            "playerLastName": "Sutton",
                            "playerName": "John Sutton",
                            "playerPosition": "Five-Eighth",
                            "playerPositionId": 500006,
                            "playerStats": {
                                "allRunMetres": 130,
                                "allRuns": 14,
                                "errors": 1,
                                "fantasyPointsTotal": 46,
                                "kickMetres": 42,
                                "kicks": 1,
                                "kicksNotDefused": 1,
                                "linebreaks": 1,
                                "mins": 80,
                                "missedTackles": 1,
                                "passes": 39,
                                "passesPerRun": 2.79,
                                "supports": 10,
                                "tackleBreaks": 1,
                                "tackles": 28,
                                "tryCause": 1,
                                "evasionRuns": 14,
                                "evasionRunMetres": 130,
                                "ptbAll": 6,
                                "receipts": 49,
                                "postContactMetres": 46,
                                "dummyPasses": 9,
                                "lineEngagedRuns": 6,
                                "ptbAverage": 2.94,
                                "ptbOneToTwo": 1,
                                "ptbTwoToThree": 2,
                                "ptbThreeToFour": 3,
                                "doubles": 6,
                                "effectiveTacklePercentage": 96.6,
                                "stint1": 4800
                            },
                            "playerTookTheField": true,
                            "shirtNum": 11,
                            "playerFirstInitial": "J",
                            "playerPositionAbbrev": "FE",
                            "onTheField": true,
                            "fantasyPrice": 417000,
                            "fantasySeasonPriceChange": 12000,
                            "fantasyRoundPriceChange": 4000
                        },
                        {
                            "playerFirstName": "Cody",
                            "playerId": 500611,
                            "playerLastName": "Walker",
                            "playerName": "Cody Walker",
                            "playerPosition": "Halfback",
                            "playerPositionId": 500007,
                            "playerStats": {
                                "allRunMetres": 102,
                                "allRuns": 15,
                                "bombKicks": 4,
                                "bombKickMetres": 101,
                                "decoys": 1,
                                "dummyHalfRuns": 1,
                                "errors": 2,
                                "fantasyPointsTotal": 41,
                                "fieldGoalsAttempts": 1,
                                "fieldGoalsMissed": 1,
                                "ineffectiveTackles": 1,
                                "kickMetres": 234,
                                "kicks": 12,
                                "mins": 80,
                                "missedTackles": 2,
                                "offloads": 1,
                                "passes": 29,
                                "passesPerRun": 1.93,
                                "oneOnOneTackles": 2,
                                "penalties": 1,
                                "supports": 14,
                                "tackleBreaks": 1,
                                "tackles": 20,
                                "tryAssists": 1,
                                "evasionRuns": 14,
                                "evasionRunMetres": 88,
                                "dummyHalfRunMetres": 14,
                                "ptbAll": 2,
                                "receipts": 46,
                                "forcedDropOutKicker": 2,
                                "grubberKick": 4,
                                "crossFieldKick": 1,
                                "postContactMetres": 13,
                                "dummyPasses": 9,
                                "lineEngagedRuns": 10,
                                "ptbAverage": 2.44,
                                "ptbTwoToThree": 2,
                                "doubles": 2,
                                "effectiveTacklePercentage": 87,
                                "offsidePenalties": 1,
                                "stint1": 4800
                            },
                            "playerTookTheField": true,
                            "shirtNum": 6,
                            "playerFirstInitial": "C",
                            "playerPositionAbbrev": "HB",
                            "onTheField": true,
                            "fantasyPrice": 482000,
                            "fantasySeasonPriceChange": 7000,
                            "fantasyRoundPriceChange": 1000
                        },
                        {
                            "playerFirstName": "Thomas",
                            "playerId": 500087,
                            "playerLastName": "Burgess",
                            "playerName": "Thomas Burgess",
                            "playerPosition": "Prop 1",
                            "playerPositionId": 500008,
                            "playerStats": {
                                "allRunMetres": 173,
                                "allRuns": 16,
                                "decoys": 6,
                                "errors": 1,
                                "fantasyPointsTotal": 45,
                                "hitUps": 14,
                                "kickReturnMetres": 33,
                                "kickReturns": 2,
                                "mins": 39,
                                "penalties": 1,
                                "supports": 9,
                                "tackleBreaks": 3,
                                "tackles": 23,
                                "hitupRunMeters": 140,
                                "ptbAll": 14,
                                "receipts": 16,
                                "postContactMetres": 69,
                                "dummyPasses": 1,
                                "ptbAverage": 2.61,
                                "ptbOneToTwo": 3,
                                "ptbTwoToThree": 8,
                                "ptbThreeToFour": 3,
                                "ptbOpp20m": 1,
                                "doubles": 5,
                                "effectiveTacklePercentage": 100,
                                "offsidePenalties": 1,
                                "stint1": 1605,
                                "stint2": 753
                            },
                            "playerTookTheField": true,
                            "shirtNum": 8,
                            "playerFirstInitial": "T",
                            "playerPositionAbbrev": "PR",
                            "onTheField": true,
                            "fantasyPrice": 321000,
                            "fantasySeasonPriceChange": 1000
                        },
                        {
                            "playerFirstName": "Damien",
                            "playerId": 501600,
                            "playerLastName": "Cook",
                            "playerName": "Damien Cook",
                            "playerPosition": "Hooker",
                            "playerPositionId": 500009,
                            "playerStats": {
                                "allRunMetres": 45,
                                "allRuns": 4,
                                "dummyHalfRuns": 2,
                                "fantasyPointsTotal": 52,
                                "ineffectiveTackles": 1,
                                "kickMetres": 137,
                                "kickReturnMetres": 7,
                                "kickReturns": 1,
                                "kicks": 3,
                                "kicksDefused": 1,
                                "mins": 49,
                                "missedTackles": 2,
                                "offloads": 2,
                                "passes": 48,
                                "passesPerRun": 12,
                                "penalties": 1,
                                "points": 4,
                                "supports": 2,
                                "tackles": 35,
                                "tries": 1,
                                "evasionRuns": 1,
                                "evasionRunMetres": 12,
                                "dummyHalfRunMetres": 26,
                                "receipts": 54,
                                "postContactMetres": 12,
                                "dummyPasses": 3,
                                "kickPressures": 2,
                                "lineEngagedRuns": 1,
                                "doubles": 13,
                                "effectiveTacklePercentage": 92.1,
                                "ptbPenalties": 1,
                                "stint1": 2714,
                                "stint2": 217,
                                "kickReceiptRuns": 1,
                                "kickReceiptMetres": 7
                            },
                            "playerTookTheField": true,
                            "shirtNum": 9,
                            "playerFirstInitial": "D",
                            "playerPositionAbbrev": "HK",
                            "onTheField": true,
                            "fantasyPrice": 323000,
                            "fantasySeasonPriceChange": 1000,
                            "fantasyRoundPriceChange": 21000
                        },
                        {
                            "playerFirstName": "George",
                            "playerId": 500095,
                            "playerLastName": "Burgess",
                            "playerName": "George Burgess",
                            "playerPosition": "Prop 2",
                            "playerPositionId": 500010,
                            "playerStats": {
                                "allRunMetres": 131,
                                "allRuns": 12,
                                "decoys": 6,
                                "fantasyPointsTotal": 26,
                                "hitUps": 10,
                                "ineffectiveTackles": 1,
                                "kickReturnMetres": 24,
                                "kickReturns": 2,
                                "mins": 39,
                                "missedTackles": 1,
                                "penalties": 3,
                                "supports": 1,
                                "tackles": 21,
                                "hitupRunMeters": 107,
                                "ptbAll": 11,
                                "receipts": 12,
                                "postContactMetres": 57,
                                "dummyPasses": 1,
                                "kickPressures": 2,
                                "ptbAverage": 3.33,
                                "ptbOneToTwo": 1,
                                "ptbTwoToThree": 4,
                                "ptbThreeToFour": 2,
                                "ptbFourToFive": 4,
                                "ptbOpp20m": 3,
                                "doubles": 4,
                                "effectiveTacklePercentage": 91.3,
                                "generalPlayPenalties": 1,
                                "foulPlayPenalties": 1,
                                "offsidePenalties": 1,
                                "stint1": 1420,
                                "stint2": 904
                            },
                            "playerTookTheField": true,
                            "shirtNum": 17,
                            "playerFirstInitial": "G",
                            "playerPositionAbbrev": "PR",
                            "fantasyPrice": 251000,
                            "fantasySeasonPriceChange": -51000,
                            "fantasyRoundPriceChange": -25000
                        },
                        {
                            "playerFirstName": "Kyle",
                            "playerId": 500116,
                            "playerLastName": "Turner",
                            "playerName": "Kyle Turner",
                            "playerPosition": "2nd Row 1",
                            "playerPositionId": 500011,
                            "playerStats": {
                                "allRunMetres": 70,
                                "allRuns": 8,
                                "decoys": 4,
                                "errors": 1,
                                "fantasyPointsTotal": 39,
                                "hitUps": 8,
                                "ineffectiveTackles": 3,
                                "mins": 67,
                                "missedTackles": 1,
                                "supports": 8,
                                "tackleBreaks": 1,
                                "tackles": 33,
                                "tryCause": 1,
                                "hitupRunMeters": 70,
                                "ptbAll": 8,
                                "receipts": 9,
                                "postContactMetres": 30,
                                "kickPressures": 1,
                                "ptbAverage": 2.76,
                                "ptbOneToTwo": 3,
                                "ptbTwoToThree": 1,
                                "ptbThreeToFour": 3,
                                "ptbFourToFive": 1,
                                "ptbOpp20m": 1,
                                "doubles": 5,
                                "effectiveTacklePercentage": 89.2,
                                "stint1": 3143,
                                "stint2": 900
                            },
                            "playerTookTheField": true,
                            "shirtNum": 10,
                            "playerFirstInitial": "K",
                            "playerPositionAbbrev": "2R",
                            "onTheField": true,
                            "fantasyPrice": 325000,
                            "fantasySeasonPriceChange": -25000,
                            "fantasyRoundPriceChange": 8000
                        },
                        {
                            "playerFirstName": "Angus",
                            "playerId": 503240,
                            "playerLastName": "Crichton",
                            "playerName": "Angus Crichton",
                            "playerPosition": "2nd Row 2",
                            "playerPositionId": 500012,
                            "playerStats": {
                                "allRunMetres": 117,
                                "allRuns": 14,
                                "decoys": 5,
                                "fantasyPointsTotal": 84,
                                "hitUps": 13,
                                "ineffectiveTackles": 1,
                                "kickReturnMetres": 11,
                                "kickReturns": 1,
                                "kicksNotDefused": 1,
                                "linebreaks": 1,
                                "mins": 76,
                                "missedTackles": 2,
                                "oneOnOneTackles": 1,
                                "points": 4,
                                "supports": 7,
                                "tackleBreaks": 7,
                                "tackles": 39,
                                "tries": 1,
                                "trySaves": 1,
                                "hitupRunMeters": 106,
                                "ptbAll": 12,
                                "receipts": 14,
                                "postContactMetres": 48,
                                "dummyPasses": 1,
                                "ptbAverage": 3.01,
                                "ptbOneToTwo": 1,
                                "ptbTwoToThree": 5,
                                "ptbThreeToFour": 5,
                                "ptbFourToFive": 1,
                                "ptbOpp20m": 1,
                                "doubles": 12,
                                "effectiveTacklePercentage": 92.9,
                                "stint1": 4583
                            },
                            "playerTookTheField": true,
                            "shirtNum": 12,
                            "playerFirstInitial": "A",
                            "playerPositionAbbrev": "2R",
                            "fantasyPrice": 315000,
                            "fantasySeasonPriceChange": 86000,
                            "fantasyRoundPriceChange": 44000
                        },
                        {
                            "playerFirstName": "Sam",
                            "playerId": 500092,
                            "playerLastName": "Burgess",
                            "playerName": "Sam Burgess",
                            "playerPosition": "Lock",
                            "playerPositionId": 500013,
                            "playerStats": {
                                "allRunMetres": 199,
                                "allRuns": 20,
                                "decoys": 7,
                                "fantasyPointsTotal": 60,
                                "hitUps": 16,
                                "kickReturnMetres": 20,
                                "kickReturns": 1,
                                "mins": 80,
                                "offloads": 2,
                                "passes": 7,
                                "passesPerRun": 0.35,
                                "oneOnOneTackles": 3,
                                "penalties": 1,
                                "supports": 8,
                                "tackles": 34,
                                "trySaves": 1,
                                "hitupRunMeters": 163,
                                "evasionRuns": 3,
                                "evasionRunMetres": 16,
                                "ptbAll": 15,
                                "receipts": 24,
                                "postContactMetres": 75,
                                "kickPressures": 2,
                                "lineEngagedRuns": 3,
                                "ptbAverage": 2.99,
                                "ptbOneToTwo": 1,
                                "ptbTwoToThree": 7,
                                "ptbThreeToFour": 7,
                                "doubles": 6,
                                "effectiveTacklePercentage": 100,
                                "foulPlayPenalties": 1,
                                "stint1": 4800
                            },
                            "playerTookTheField": true,
                            "shirtNum": 13,
                            "isCaptain": true,
                            "playerFirstInitial": "S",
                            "playerPositionAbbrev": "LK",
                            "onTheField": true,
                            "fantasyPrice": 490000,
                            "fantasySeasonPriceChange": -33000,
                            "fantasyRoundPriceChange": 10000
                        },
                        {
                            "playerFirstName": "Robbie",
                            "playerId": 500649,
                            "playerLastName": "Farah",
                            "playerName": "Robbie Farah",
                            "playerPosition": "Interchange",
                            "playerPositionId": 500014,
                            "playerStats": {
                                "allRunMetres": 13,
                                "allRuns": 3,
                                "dummyHalfRuns": 3,
                                "errors": 1,
                                "fantasyPointsTotal": 33,
                                "kickMetres": 56,
                                "kicks": 2,
                                "linebreakAssists": 2,
                                "mins": 35,
                                "missedTackles": 1,
                                "passes": 59,
                                "passesPerRun": 19.67,
                                "tackles": 20,
                                "tryAssists": 2,
                                "dummyHalfRunMetres": 13,
                                "ptbAll": 1,
                                "receipts": 60,
                                "postContactMetres": 5,
                                "dummyPasses": 8,
                                "kickPressures": 4,
                                "lineEngagedRuns": 2,
                                "ptbAverage": 2.72,
                                "ptbTwoToThree": 1,
                                "doubles": 6,
                                "effectiveTacklePercentage": 95.2,
                                "stint1": 2085
                            },
                            "playerTookTheField": true,
                            "shirtNum": 14,
                            "playerFirstInitial": "R",
                            "playerPositionAbbrev": "INT",
                            "onTheField": true,
                            "fantasyPrice": 352000,
                            "fantasySeasonPriceChange": -83000,
                            "fantasyRoundPriceChange": -44000
                        },
                        {
                            "playerFirstName": "Jason",
                            "playerId": 500096,
                            "playerLastName": "Clark",
                            "playerName": "Jason Clark",
                            "playerPosition": "Interchange",
                            "playerPositionId": 500014,
                            "playerStats": {
                                "allRunMetres": 68,
                                "allRuns": 7,
                                "decoys": 7,
                                "fantasyPointsTotal": 26,
                                "hitUps": 7,
                                "mins": 39,
                                "passes": 1,
                                "passesPerRun": 0.14,
                                "oneOnOneTackles": 1,
                                "supports": 9,
                                "tackleBreaks": 1,
                                "tackles": 17,
                                "hitupRunMeters": 68,
                                "ptbAll": 7,
                                "receipts": 8,
                                "postContactMetres": 29,
                                "dummyPasses": 1,
                                "kickPressures": 2,
                                "ptbAverage": 2.86,
                                "ptbOneToTwo": 1,
                                "ptbTwoToThree": 2,
                                "ptbThreeToFour": 4,
                                "ptbOpp20m": 1,
                                "doubles": 3,
                                "effectiveTacklePercentage": 100,
                                "stint1": 2333
                            },
                            "playerTookTheField": true,
                            "shirtNum": 15,
                            "playerFirstInitial": "J",
                            "playerPositionAbbrev": "INT",
                            "fantasyPrice": 329000,
                            "fantasySeasonPriceChange": 4000,
                            "fantasyRoundPriceChange": 1000
                        },
                        {
                            "playerFirstName": "Zane",
                            "playerId": 500183,
                            "playerLastName": "Musgrove",
                            "playerName": "Zane Musgrove",
                            "playerPosition": "Interchange",
                            "playerPositionId": 500014,
                            "playerStats": {
                                "allRunMetres": 98,
                                "allRuns": 9,
                                "decoys": 8,
                                "fantasyPointsTotal": 35,
                                "hitUps": 6,
                                "kickReturnMetres": 43,
                                "kickReturns": 3,
                                "mins": 38,
                                "penalties": 1,
                                "supports": 4,
                                "tackles": 23,
                                "trySaves": 1,
                                "hitupRunMeters": 55,
                                "ptbAll": 9,
                                "receipts": 9,
                                "postContactMetres": 33,
                                "ptbAverage": 3.8,
                                "ptbTwoToThree": 2,
                                "ptbThreeToFour": 3,
                                "ptbFourToFive": 4,
                                "ptbOpp20m": 3,
                                "doubles": 5,
                                "effectiveTacklePercentage": 100,
                                "ptbPenalties": 1,
                                "stint1": 2295
                            },
                            "playerTookTheField": true,
                            "shirtNum": 16,
                            "playerFirstInitial": "Z",
                            "playerPositionAbbrev": "INT",
                            "fantasyPrice": 293000,
                            "fantasySeasonPriceChange": 56000,
                            "fantasyRoundPriceChange": 1000
                        },
                        {
                            "playerFirstName": "Cameron",
                            "playerId": 504176,
                            "playerLastName": "Murray",
                            "playerName": "Cameron Murray",
                            "playerPosition": "Interchange",
                            "playerPositionId": 500014,
                            "playerStats": {
                                "allRunMetres": 17,
                                "allRuns": 2,
                                "fantasyPointsTotal": 10,
                                "hitUps": 2,
                                "mins": 17,
                                "passes": 1,
                                "passesPerRun": 0.5,
                                "supports": 1,
                                "tackles": 9,
                                "hitupRunMeters": 17,
                                "ptbAll": 2,
                                "receipts": 3,
                                "postContactMetres": 6,
                                "ptbAverage": 3.34,
                                "ptbTwoToThree": 1,
                                "ptbFourToFive": 1,
                                "doubles": 3,
                                "effectiveTacklePercentage": 100,
                                "stint1": 1047
                            },
                            "playerTookTheField": true,
                            "shirtNum": 19,
                            "playerFirstInitial": "C",
                            "playerPositionAbbrev": "INT",
                            "onTheField": true,
                            "fantasyPrice": 138000
                        }
                    ]
                },
                "teamName": "South Sydney Rabbitohs",
                "teamNickName": "Rabbitohs",
                "teamStats": {
                    "allRunMetres": 1608,
                    "allRuns": 180,
                    "bombKicks": 4,
                    "bombKickMetres": 101,
                    "bombKicksDefused": 1,
                    "completeSets": 26,
                    "completionPercentage": 76,
                    "conversions": 3,
                    "conversionsAttempts": 4,
                    "conversionsMissed": 1,
                    "decoys": 46,
                    "dummyHalfRuns": 8,
                    "errors": 10,
                    "fieldGoalsAttempts": 1,
                    "fieldGoalsMissed": 1,
                    "goalConversionRate": 66.67,
                    "allGoals": 4,
                    "allGoalsAttempted": 6,
                    "allGoalsMissed": 2,
                    "hitUps": 76,
                    "incompleteSets": 8,
                    "ineffectiveTackles": 9,
                    "kickMetres": 469,
                    "kickReturnMetres": 203,
                    "kickReturns": 19,
                    "kicks": 18,
                    "kicksDefused": 4,
                    "kicksNotDefused": 3,
                    "linebreakAssists": 2,
                    "linebreaks": 3,
                    "missedTackles": 22,
                    "offloads": 8,
                    "oneOnOneTackles": 9,
                    "passes": 202,
                    "passesPerRun": 1.12,
                    "penalties": 9,
                    "penaltyGoals": 1,
                    "penaltyGoalsAttempts": 2,
                    "penaltyGoalsMissed": 1,
                    "points": 24,
                    "pointsConceded": 25,
                    "possession": 48,
                    "scrumWins": 3,
                    "supports": 149,
                    "tackleBreaks": 25,
                    "tackles": 346,
                    "sets": 34,
                    "tries": 4,
                    "triesConceded": 4,
                    "tryAssists": 4,
                    "tryCause": 6,
                    "trySaves": 4,
                    "hitupRunMeters": 728,
                    "evasionRuns": 77,
                    "evasionRunMetres": 596,
                    "dummyHalfRunMetres": 81,
                    "ptbTotal": 136,
                    "twoManTackles": 65,
                    "threeManTackles": 60,
                    "fourManPlusTackles": 1,
                    "tryScoringPercentage": 11.76,
                    "shiftsLeft": 12,
                    "shiftsRight": 9,
                    "receipts": 379,
                    "forcedDropOutKicker": 2,
                    "grubberKick": 4,
                    "crossFieldKick": 1,
                    "postContactMetres": 578,
                    "dummyPasses": 33,
                    "kickPressures": 13,
                    "lineEngagedRuns": 23,
                    "ptbAverage": 3.02,
                    "ptbOneToTwo": 16,
                    "ptbTwoToThree": 59,
                    "ptbThreeToFour": 41,
                    "ptbFourToFive": 18,
                    "ptbFivePlus": 2,
                    "ptbOpp20m": 16,
                    "interchangeUsed": 8,
                    "doubles": 77,
                    "effectiveTacklePercentage": 91.8,
                    "ptbPenalties": 2,
                    "generalPlayPenalties": 2,
                    "foulPlayPenalties": 2,
                    "offsidePenalties": 3,
                    "averageSetDistance": 47.3,
                    "completeSets1stHalf": 11,
                    "completeSets2ndHalf": 15,
                    "completionPercentage1stHalf": 79,
                    "completionPercentage2ndHalf": 75,
                    "incompleteSets1stHalf": 3,
                    "incompleteSets2ndHalf": 5,
                    "incompletionPercentage1stHalf": 21,
                    "incompletionPercentage2ndHalf": 25,
                    "kickReceiptRuns": 10,
                    "kickReceiptMetres": 72,
                    "averageOneManTackleTiming": 2.77,
                    "averageTwoManTackleTiming": 3.03,
                    "averageThreeManTackleTiming": 3.08,
                    "averageFourManTackleTiming": 4.2
                },
                "teamHexColour": "01914c",
                "teamHexColour2": "ed1b26",
                "teamCoaches": {
                    "teamCoach": [
                        {
                            "coachId": 50005,
                            "coachName": "Michael Maguire",
                            "coachRoleId": 12,
                            "coachRole": "Coach"
                        }
                    ]
                }
            },
            {
                "score": {
                    "conversions": 3,
                    "points": 25,
                    "fieldGoals": 1,
                    "penaltyGoals": 1,
                    "tries": 4,
                    "allGoals": 4
                },
                "team1stHalfScore": 18,
                "team2ndHalfScore": 7,
                "teamAbbr": "BRI",
                "teamFinalScore": 25,
                "teamFullTimeScore": 25,
                "teamHalfTimeScore": 18,
                "teamId": 500011,
                "teamLineup": {
                    "teamLineUpStatusID": 4,
                    "teamLineUpStatus": "Final",
                    "injuriesAndSuspensions": {
                        "injury": [],
                        "suspension": []
                    },
                    "insAndOuts": {
                        "inOut": [
                            {
                                "inOut": "In",
                                "playerFirstName": "Joe",
                                "playerId": "500267",
                                "playerLastName": "Ofahengaue",
                                "playerName": "Joe Ofahengaue"
                            },
                            {
                                "inOut": "In",
                                "playerFirstName": "Jonus",
                                "playerId": "503735",
                                "playerLastName": "Pearson",
                                "playerName": "Jonus Pearson"
                            },
                            {
                                "inOut": "Out",
                                "playerFirstName": "Jordan",
                                "playerId": "500258",
                                "playerLastName": "Kahu",
                                "playerName": "Jordan Kahu"
                            },
                            {
                                "inOut": "Out",
                                "playerFirstName": "Tevita",
                                "playerId": "500438",
                                "playerLastName": "Pangai Junior",
                                "playerName": "Tevita Pangai Junior"
                            }
                        ]
                    },
                    "teamPlayer": [
                        {
                            "playerFirstName": "Darius",
                            "playerId": 500040,
                            "playerLastName": "Boyd",
                            "playerName": "Darius Boyd",
                            "playerPosition": "Fullback",
                            "playerPositionId": 500001,
                            "playerStats": {
                                "allRunMetres": 83,
                                "allRuns": 11,
                                "bombKicksDefused": 1,
                                "decoys": 1,
                                "dummyHalfRuns": 1,
                                "fantasyPointsTotal": 32,
                                "kickReturnMetres": 40,
                                "kickReturns": 5,
                                "kicksDefused": 4,
                                "linebreakAssists": 2,
                                "mins": 80,
                                "missedTackles": 3,
                                "passes": 15,
                                "passesPerRun": 1,
                                "supports": 10,
                                "tackleBreaks": 2,
                                "tackles": 6,
                                "tryAssists": 2,
                                "evasionRuns": 5,
                                "evasionRunMetres": 32,
                                "dummyHalfRunMetres": 11,
                                "ptbAll": 7,
                                "receipts": 22,
                                "postContactMetres": 20,
                                "dummyPasses": 2,
                                "lineEngagedRuns": 3,
                                "ptbAverage": 3.63,
                                "ptbTwoToThree": 1,
                                "ptbThreeToFour": 5,
                                "ptbFourToFive": 1,
                                "doubles": 1,
                                "effectiveTacklePercentage": 66.7,
                                "kickReceiptRuns": 5,
                                "kickReceiptMetres": 40
                            },
                            "playerTookTheField": true,
                            "shirtNum": 1,
                            "isCaptain": true,
                            "playerFirstInitial": "D",
                            "playerPositionAbbrev": "FB",
                            "onTheField": true
                        },
                        {
                            "playerFirstName": "Corey",
                            "playerId": 500266,
                            "playerLastName": "Oates",
                            "playerName": "Corey Oates",
                            "playerPosition": "Winger 1",
                            "playerPositionId": 500002,
                            "playerStats": {
                                "allRunMetres": 178,
                                "allRuns": 16,
                                "errors": 1,
                                "fantasyPointsTotal": 53,
                                "hitUps": 3,
                                "kickReturnMetres": 48,
                                "kickReturns": 4,
                                "linebreaks": 2,
                                "mins": 80,
                                "missedTackles": 1,
                                "passes": 2,
                                "oneOnOneTackles": 1,
                                "points": 8,
                                "supports": 12,
                                "tackleBreaks": 4,
                                "tackles": 4,
                                "tries": 2,
                                "hitupRunMeters": 31,
                                "evasionRuns": 9,
                                "evasionRunMetres": 99,
                                "ptbAll": 13,
                                "receipts": 18,
                                "postContactMetres": 52,
                                "ptbAverage": 3.78,
                                "ptbOneToTwo": 1,
                                "ptbTwoToThree": 1,
                                "ptbThreeToFour": 5,
                                "ptbFourToFive": 6,
                                "ptbOpp20m": 1,
                                "effectiveTacklePercentage": 80,
                                "kickReceiptRuns": 4,
                                "kickReceiptMetres": 48
                            },
                            "playerTookTheField": true,
                            "shirtNum": 2,
                            "playerFirstInitial": "C",
                            "playerPositionAbbrev": "WG",
                            "onTheField": true
                        },
                        {
                            "playerFirstName": "James",
                            "playerId": 500517,
                            "playerLastName": "Roberts",
                            "playerName": "James Roberts",
                            "playerPosition": "Centre 1",
                            "playerPositionId": 500003,
                            "playerStats": {
                                "allRunMetres": 203,
                                "allRuns": 12,
                                "decoys": 1,
                                "dummyHalfRuns": 1,
                                "errors": 1,
                                "fantasyPointsTotal": 33,
                                "ineffectiveTackles": 1,
                                "kicksNotDefused": 1,
                                "mins": 80,
                                "passes": 3,
                                "oneOnOneTackles": 2,
                                "penalties": 1,
                                "supports": 8,
                                "tackleBreaks": 3,
                                "tackles": 8,
                                "tryCause": 1,
                                "evasionRuns": 11,
                                "evasionRunMetres": 197,
                                "dummyHalfRunMetres": 6,
                                "ptbAll": 10,
                                "receipts": 16,
                                "postContactMetres": 43,
                                "dummyPasses": 2,
                                "ptbAverage": 3.58,
                                "ptbTwoToThree": 4,
                                "ptbThreeToFour": 2,
                                "ptbFourToFive": 4,
                                "ptbOpp20m": 2,
                                "doubles": 1,
                                "effectiveTacklePercentage": 88.9,
                                "generalPlayPenalties": 1
                            },
                            "playerTookTheField": true,
                            "shirtNum": 3,
                            "playerFirstInitial": "J",
                            "playerPositionAbbrev": "CT",
                            "onTheField": true
                        },
                        {
                            "playerFirstName": "Tautau",
                            "playerId": 500121,
                            "playerLastName": "Moga",
                            "playerName": "Tautau Moga",
                            "playerPosition": "Centre 2",
                            "playerPositionId": 500004,
                            "playerStats": {
                                "allRunMetres": 135,
                                "allRuns": 13,
                                "decoys": 2,
                                "dummyHalfRuns": 3,
                                "fantasyPointsTotal": 43,
                                "kickReturnMetres": 8,
                                "kickReturns": 1,
                                "mins": 80,
                                "missedTackles": 3,
                                "offloads": 2,
                                "passes": 5,
                                "oneOnOneTackles": 1,
                                "penalties": 2,
                                "points": 4,
                                "supports": 14,
                                "tackleBreaks": 4,
                                "tackles": 16,
                                "tries": 1,
                                "tryCause": 1,
                                "evasionRuns": 9,
                                "evasionRunMetres": 90,
                                "dummyHalfRunMetres": 37,
                                "ptbAll": 8,
                                "receipts": 17,
                                "postContactMetres": 54,
                                "ptbAverage": 4.18,
                                "ptbThreeToFour": 3,
                                "ptbFourToFive": 4,
                                "ptbFivePlus": 1,
                                "doubles": 1,
                                "effectiveTacklePercentage": 84.2,
                                "ptbPenalties": 2
                            },
                            "playerTookTheField": true,
                            "shirtNum": 4,
                            "playerFirstInitial": "T",
                            "playerPositionAbbrev": "CT",
                            "onTheField": true
                        },
                        {
                            "playerFirstName": "David",
                            "playerId": 500831,
                            "playerLastName": "Mead",
                            "playerName": "David Mead",
                            "playerPosition": "Winger 2",
                            "playerPositionId": 500005,
                            "playerStats": {
                                "allRunMetres": 58,
                                "allRuns": 7,
                                "bombKicksNotDefused": 2,
                                "dummyHalfRuns": 1,
                                "errors": 1,
                                "fantasyPointsTotal": 12,
                                "hitUps": 1,
                                "kickReturnMetres": 11,
                                "kickReturns": 2,
                                "kicksNotDefused": 3,
                                "mins": 66,
                                "missedTackles": 1,
                                "passes": 3,
                                "oneOnOneTackles": 2,
                                "supports": 7,
                                "tackleBreaks": 2,
                                "tackles": 5,
                                "tryCause": 2,
                                "hitupRunMeters": 10,
                                "evasionRuns": 3,
                                "evasionRunMetres": 29,
                                "dummyHalfRunMetres": 8,
                                "ptbAll": 6,
                                "receipts": 12,
                                "postContactMetres": 20,
                                "ptbAverage": 3.52,
                                "ptbThreeToFour": 5,
                                "ptbFourToFive": 1,
                                "doubles": 1,
                                "effectiveTacklePercentage": 83.3,
                                "kickReceiptRuns": 2,
                                "kickReceiptMetres": 11
                            },
                            "playerTookTheField": true,
                            "shirtNum": 17,
                            "playerFirstInitial": "D",
                            "playerPositionAbbrev": "WG"
                        },
                        {
                            "playerFirstName": "Anthony",
                            "playerId": 500326,
                            "playerLastName": "Milford",
                            "playerName": "Anthony Milford",
                            "playerPosition": "Five-Eighth",
                            "playerPositionId": 500006,
                            "playerStats": {
                                "allRunMetres": 68,
                                "allRuns": 15,
                                "bombKicks": 1,
                                "bombKickMetres": 17,
                                "conversions": 3,
                                "conversionsAttempts": 4,
                                "conversionsMissed": 1,
                                "dummyHalfRuns": 1,
                                "errors": 1,
                                "fantasyPointsTotal": 37,
                                "fieldGoalConversionRate": 50,
                                "fieldGoals": 1,
                                "fieldGoalsAttempts": 2,
                                "fieldGoalsMissed": 1,
                                "goalConversionRate": 80,
                                "allGoals": 4,
                                "allGoalsMissed": 1,
                                "allGoalsAttempted": 5,
                                "kickMetres": 186,
                                "kicks": 9,
                                "lineDropouts": 2,
                                "mins": 79,
                                "missedTackles": 5,
                                "offloads": 2,
                                "passes": 40,
                                "passesPerRun": 3,
                                "penalties": 1,
                                "penaltyGoals": 1,
                                "penaltyGoalsAttempts": 1,
                                "points": 9,
                                "supports": 12,
                                "tackleBreaks": 1,
                                "tackles": 11,
                                "trySaves": 1,
                                "evasionRuns": 14,
                                "evasionRunMetres": 56,
                                "dummyHalfRunMetres": 12,
                                "ptbAll": 1,
                                "receipts": 57,
                                "grubberKick": 5,
                                "postContactMetres": 5,
                                "dummyPasses": 9,
                                "lineEngagedRuns": 8,
                                "ptbAverage": 3.84,
                                "ptbThreeToFour": 1,
                                "doubles": 1,
                                "effectiveTacklePercentage": 68.8,
                                "foulPlayPenalties": 1
                            },
                            "playerTookTheField": true,
                            "shirtNum": 6,
                            "playerFirstInitial": "A",
                            "playerPositionAbbrev": "FE",
                            "onTheField": true
                        },
                        {
                            "playerFirstName": "Kodi",
                            "playerId": 500265,
                            "playerLastName": "Nikorima",
                            "playerName": "Kodi Nikorima",
                            "playerPosition": "Halfback",
                            "playerPositionId": 500007,
                            "playerStats": {
                                "allRunMetres": 48,
                                "allRuns": 9,
                                "bombKicks": 1,
                                "decoys": 1,
                                "errors": 1,
                                "fantasyPointsTotal": 27,
                                "ineffectiveTackles": 4,
                                "kickMetres": 124,
                                "kickReturnMetres": 11,
                                "kickReturns": 1,
                                "kicks": 5,
                                "mins": 80,
                                "offloads": 1,
                                "passes": 22,
                                "passesPerRun": 2,
                                "oneOnOneTackles": 1,
                                "supports": 16,
                                "tackles": 17,
                                "evasionRuns": 8,
                                "evasionRunMetres": 37,
                                "ptbAll": 2,
                                "receipts": 30,
                                "grubberKick": 1,
                                "postContactMetres": 4,
                                "dummyPasses": 5,
                                "lineEngagedRuns": 6,
                                "ptbAverage": 5.02,
                                "ptbFourToFive": 1,
                                "ptbFivePlus": 1,
                                "ptbOpp20m": 1,
                                "doubles": 1,
                                "effectiveTacklePercentage": 81
                            },
                            "playerTookTheField": true,
                            "shirtNum": 7,
                            "playerFirstInitial": "K",
                            "playerPositionAbbrev": "HB",
                            "onTheField": true
                        },
                        {
                            "playerFirstName": "Herman",
                            "playerId": 500129,
                            "playerLastName": "Ese'ese",
                            "playerName": "Herman Ese'ese",
                            "playerPosition": "Prop 1",
                            "playerPositionId": 500008,
                            "playerStats": {
                                "allRunMetres": 90,
                                "allRuns": 12,
                                "decoys": 6,
                                "fantasyPointsTotal": 40,
                                "hitUps": 11,
                                "kickReturnMetres": 5,
                                "kickReturns": 1,
                                "mins": 45,
                                "missedTackles": 1,
                                "supports": 6,
                                "tackles": 33,
                                "hitupRunMeters": 85,
                                "ptbAll": 12,
                                "receipts": 12,
                                "postContactMetres": 37,
                                "ptbAverage": 4.05,
                                "ptbThreeToFour": 5,
                                "ptbFourToFive": 5,
                                "ptbFivePlus": 2,
                                "ptbOpp20m": 5,
                                "doubles": 5,
                                "effectiveTacklePercentage": 97.1
                            },
                            "playerTookTheField": true,
                            "shirtNum": 16,
                            "playerFirstInitial": "H",
                            "playerPositionAbbrev": "PR",
                            "onTheField": true
                        },
                        {
                            "playerFirstName": "Andrew",
                            "playerId": 500261,
                            "playerLastName": "McCullough",
                            "playerName": "Andrew McCullough",
                            "playerPosition": "Hooker",
                            "playerPositionId": 500009,
                            "playerStats": {
                                "allRunMetres": 41,
                                "allRuns": 5,
                                "dummyHalfRuns": 5,
                                "errors": 1,
                                "fantasyPointsTotal": 64,
                                "ineffectiveTackles": 2,
                                "kickMetres": 90,
                                "kicks": 2,
                                "mins": 80,
                                "missedTackles": 1,
                                "passes": 106,
                                "passesPerRun": 21,
                                "penalties": 1,
                                "tackles": 57,
                                "tryCause": 2,
                                "trySaves": 1,
                                "dummyHalfRunMetres": 41,
                                "ptbAll": 3,
                                "receipts": 104,
                                "postContactMetres": 16,
                                "dummyPasses": 4,
                                "kickPressures": 2,
                                "lineEngagedRuns": 1,
                                "ptbAverage": 4.08,
                                "ptbThreeToFour": 1,
                                "ptbFourToFive": 2,
                                "doubles": 14,
                                "longKicksSpace": 2,
                                "effectiveTacklePercentage": 95,
                                "ptbPenalties": 1
                            },
                            "playerTookTheField": true,
                            "shirtNum": 9,
                            "playerFirstInitial": "A",
                            "playerPositionAbbrev": "HK",
                            "onTheField": true
                        },
                        {
                            "playerFirstName": "Adam",
                            "playerId": 500645,
                            "playerLastName": "Blair",
                            "playerName": "Adam Blair",
                            "playerPosition": "Prop 2",
                            "playerPositionId": 500010,
                            "playerStats": {
                                "allRunMetres": 62,
                                "allRuns": 8,
                                "decoys": 4,
                                "fantasyPointsTotal": 38,
                                "hitUps": 7,
                                "kickReturnMetres": 2,
                                "kickReturns": 1,
                                "mins": 51,
                                "missedTackles": 2,
                                "passes": 3,
                                "supports": 3,
                                "tackles": 36,
                                "hitupRunMeters": 60,
                                "ptbAll": 8,
                                "receipts": 11,
                                "postContactMetres": 22,
                                "dummyPasses": 4,
                                "kickPressures": 2,
                                "ptbAverage": 3.72,
                                "ptbTwoToThree": 3,
                                "ptbThreeToFour": 3,
                                "ptbFourToFive": 1,
                                "ptbFivePlus": 1,
                                "ptbOpp20m": 4,
                                "doubles": 9,
                                "effectiveTacklePercentage": 94.7
                            },
                            "playerTookTheField": true,
                            "shirtNum": 10,
                            "playerFirstInitial": "A",
                            "playerPositionAbbrev": "PR",
                            "onTheField": true
                        },
                        {
                            "playerFirstName": "Alex",
                            "playerId": 500250,
                            "playerLastName": "Glenn",
                            "playerName": "Alex Glenn",
                            "playerPosition": "2nd Row 1",
                            "playerPositionId": 500011,
                            "playerStats": {
                                "allRunMetres": 120,
                                "allRuns": 13,
                                "decoys": 6,
                                "fantasyPointsTotal": 38,
                                "hitUps": 12,
                                "ineffectiveTackles": 1,
                                "kickReturnMetres": 9,
                                "kickReturns": 1,
                                "mins": 56,
                                "oneOnOneTackles": 1,
                                "supports": 6,
                                "tackles": 26,
                                "hitupRunMeters": 111,
                                "ptbAll": 12,
                                "receipts": 13,
                                "postContactMetres": 47,
                                "ptbAverage": 3.25,
                                "ptbTwoToThree": 4,
                                "ptbThreeToFour": 7,
                                "ptbFourToFive": 1,
                                "ptbOpp20m": 2,
                                "doubles": 6,
                                "effectiveTacklePercentage": 96.3
                            },
                            "playerTookTheField": true,
                            "shirtNum": 14,
                            "playerFirstInitial": "A",
                            "playerPositionAbbrev": "2R",
                            "onTheField": true
                        },
                        {
                            "playerFirstName": "Matt",
                            "playerId": 500249,
                            "playerLastName": "Gillett",
                            "playerName": "Matt Gillett",
                            "playerPosition": "2nd Row 2",
                            "playerPositionId": 500012,
                            "playerStats": {
                                "allRunMetres": 95,
                                "allRuns": 11,
                                "decoys": 6,
                                "errors": 1,
                                "fantasyPointsTotal": 47,
                                "hitUps": 10,
                                "ineffectiveTackles": 2,
                                "kickMetres": 15,
                                "kicks": 1,
                                "mins": 80,
                                "missedTackles": 1,
                                "passes": 2,
                                "oneOnOneTackles": 1,
                                "supports": 7,
                                "tackleBreaks": 3,
                                "tackles": 33,
                                "hitupRunMeters": 91,
                                "evasionRuns": 1,
                                "evasionRunMetres": 4,
                                "ptbAll": 9,
                                "receipts": 14,
                                "postContactMetres": 28,
                                "dummyPasses": 1,
                                "kickPressures": 4,
                                "lineEngagedRuns": 1,
                                "ptbAverage": 3.75,
                                "ptbOneToTwo": 1,
                                "ptbTwoToThree": 2,
                                "ptbThreeToFour": 2,
                                "ptbFourToFive": 3,
                                "ptbFivePlus": 1,
                                "ptbOpp20m": 1,
                                "doubles": 10,
                                "longKicksSpace": 1,
                                "effectiveTacklePercentage": 91.7
                            },
                            "playerTookTheField": true,
                            "shirtNum": 12,
                            "playerFirstInitial": "M",
                            "playerPositionAbbrev": "2R",
                            "onTheField": true
                        },
                        {
                            "playerFirstName": "Josh",
                            "playerId": 500262,
                            "playerLastName": "McGuire",
                            "playerName": "Josh McGuire",
                            "playerPosition": "Lock",
                            "playerPositionId": 500013,
                            "playerStats": {
                                "allRunMetres": 136,
                                "allRuns": 14,
                                "decoys": 9,
                                "fantasyPointsTotal": 38,
                                "hitUps": 14,
                                "ineffectiveTackles": 3,
                                "mins": 55,
                                "missedTackles": 4,
                                "offloads": 1,
                                "passes": 8,
                                "passesPerRun": 1,
                                "oneOnOneTackles": 1,
                                "supports": 5,
                                "tackleBreaks": 1,
                                "tackles": 28,
                                "hitupRunMeters": 136,
                                "ptbAll": 13,
                                "receipts": 22,
                                "postContactMetres": 55,
                                "dummyPasses": 1,
                                "kickPressures": 2,
                                "ptbAverage": 3.69,
                                "ptbTwoToThree": 2,
                                "ptbThreeToFour": 8,
                                "ptbFourToFive": 3,
                                "ptbOpp20m": 6,
                                "doubles": 2,
                                "effectiveTacklePercentage": 80
                            },
                            "playerTookTheField": true,
                            "shirtNum": 13,
                            "playerFirstInitial": "J",
                            "playerPositionAbbrev": "LK"
                        },
                        {
                            "playerFirstName": "Korbin",
                            "playerId": 500384,
                            "playerLastName": "Sims",
                            "playerName": "Korbin Sims",
                            "playerPosition": "Interchange",
                            "playerPositionId": 500014,
                            "playerStats": {
                                "allRunMetres": 79,
                                "allRuns": 9,
                                "decoys": 3,
                                "fantasyPointsTotal": 33,
                                "hitUps": 7,
                                "ineffectiveTackles": 1,
                                "kickReturnMetres": 13,
                                "kickReturns": 1,
                                "mins": 33,
                                "offloads": 1,
                                "points": 4,
                                "supports": 10,
                                "tackles": 16,
                                "tries": 1,
                                "hitupRunMeters": 59,
                                "evasionRuns": 1,
                                "evasionRunMetres": 7,
                                "ptbAll": 7,
                                "receipts": 9,
                                "postContactMetres": 28,
                                "ptbAverage": 3.51,
                                "ptbTwoToThree": 2,
                                "ptbThreeToFour": 3,
                                "ptbFourToFive": 2,
                                "ptbOpp20m": 3,
                                "doubles": 2,
                                "effectiveTacklePercentage": 94.1
                            },
                            "playerTookTheField": true,
                            "shirtNum": 8,
                            "playerFirstInitial": "K",
                            "playerPositionAbbrev": "INT"
                        },
                        {
                            "playerFirstName": "Sam",
                            "playerId": 500273,
                            "playerLastName": "Thaiday",
                            "playerName": "Sam Thaiday",
                            "playerPosition": "Interchange",
                            "playerPositionId": 500014,
                            "playerStats": {
                                "allRunMetres": 142,
                                "allRuns": 13,
                                "decoys": 2,
                                "fantasyPointsTotal": 30,
                                "hitUps": 13,
                                "mins": 57,
                                "missedTackles": 3,
                                "passes": 1,
                                "oneOnOneTackles": 2,
                                "supports": 7,
                                "tackles": 22,
                                "tryCause": 1,
                                "hitupRunMeters": 142,
                                "ptbAll": 12,
                                "receipts": 14,
                                "postContactMetres": 68,
                                "dummyPasses": 2,
                                "ptbAverage": 3.37,
                                "ptbOneToTwo": 2,
                                "ptbTwoToThree": 1,
                                "ptbThreeToFour": 6,
                                "ptbFourToFive": 3,
                                "ptbOpp20m": 3,
                                "doubles": 6,
                                "effectiveTacklePercentage": 88
                            },
                            "playerTookTheField": true,
                            "shirtNum": 11,
                            "playerFirstInitial": "S",
                            "playerPositionAbbrev": "INT",
                            "onTheField": true
                        },
                        {
                            "playerFirstName": "Joe",
                            "playerId": 500267,
                            "playerLastName": "Ofahengaue",
                            "playerName": "Joe Ofahengaue",
                            "playerPosition": "Interchange",
                            "playerPositionId": 500014,
                            "playerStats": {
                                "allRunMetres": 85,
                                "allRuns": 9,
                                "fantasyPointsTotal": 28,
                                "hitUps": 8,
                                "kickReturnMetres": 10,
                                "kickReturns": 1,
                                "mins": 24,
                                "passes": 1,
                                "oneOnOneTackles": 2,
                                "supports": 2,
                                "tackleBreaks": 2,
                                "tackles": 14,
                                "hitupRunMeters": 75,
                                "ptbAll": 9,
                                "receipts": 10,
                                "postContactMetres": 33,
                                "ptbAverage": 3.49,
                                "ptbTwoToThree": 3,
                                "ptbThreeToFour": 4,
                                "ptbFourToFive": 2,
                                "ptbOpp20m": 1,
                                "doubles": 3,
                                "effectiveTacklePercentage": 100
                            },
                            "playerTookTheField": true,
                            "shirtNum": 15,
                            "playerFirstInitial": "J",
                            "playerPositionAbbrev": "INT"
                        },
                        {
                            "playerFirstName": "Jonus",
                            "playerId": 503735,
                            "playerLastName": "Pearson",
                            "playerName": "Jonus Pearson",
                            "playerPosition": "Interchange",
                            "playerPositionId": 500014,
                            "playerStats": {
                                "allRunMetres": 13,
                                "allRuns": 2,
                                "decoys": 1,
                                "fantasyPointsTotal": 1,
                                "hitUps": 1,
                                "mins": 14,
                                "passes": 3,
                                "passesPerRun": 2,
                                "supports": 4,
                                "hitupRunMeters": 10,
                                "evasionRuns": 1,
                                "evasionRunMetres": 3,
                                "ptbAll": 2,
                                "receipts": 5,
                                "postContactMetres": 3,
                                "ptbAverage": 3.44,
                                "ptbThreeToFour": 2
                            },
                            "playerTookTheField": true,
                            "shirtNum": 21,
                            "playerFirstInitial": "J",
                            "playerPositionAbbrev": "INT",
                            "onTheField": true
                        }
                    ]
                },
                "teamName": "Brisbane Broncos",
                "teamNickName": "Broncos",
                "teamStats": {
                    "allRunMetres": 1634,
                    "allRuns": 179,
                    "bombKicks": 2,
                    "bombKickMetres": 17,
                    "bombKicksDefused": 1,
                    "bombKicksNotDefused": 2,
                    "completeSets": 30,
                    "completionPercentage": 83,
                    "conversions": 3,
                    "conversionsAttempts": 4,
                    "conversionsMissed": 1,
                    "decoys": 42,
                    "dummyHalfRuns": 12,
                    "errors": 7,
                    "fieldGoalConversionRate": 50,
                    "fieldGoals": 1,
                    "fieldGoalsAttempts": 2,
                    "fieldGoalsMissed": 1,
                    "goalConversionRate": 80,
                    "allGoals": 4,
                    "allGoalsAttempted": 5,
                    "allGoalsMissed": 1,
                    "hitUps": 87,
                    "incompleteSets": 6,
                    "ineffectiveTackles": 14,
                    "kickMetres": 415,
                    "kickReturnMetres": 158,
                    "kickReturns": 18,
                    "kicks": 17,
                    "kicksDefused": 4,
                    "kicksNotDefused": 4,
                    "lineDropouts": 2,
                    "linebreakAssists": 2,
                    "linebreaks": 2,
                    "missedTackles": 25,
                    "offloads": 7,
                    "oneOnOneTackles": 14,
                    "passes": 214,
                    "passesPerRun": 1.2,
                    "penalties": 5,
                    "penaltyGoals": 1,
                    "penaltyGoalsAttempts": 1,
                    "points": 25,
                    "pointsConceded": 24,
                    "possession": 52,
                    "scrumWins": 3,
                    "supports": 129,
                    "tackleBreaks": 22,
                    "tackles": 332,
                    "sets": 36,
                    "tries": 4,
                    "triesConceded": 4,
                    "tryAssists": 2,
                    "tryCause": 7,
                    "trySaves": 2,
                    "hitupRunMeters": 808,
                    "evasionRuns": 62,
                    "evasionRunMetres": 553,
                    "dummyHalfRunMetres": 115,
                    "ptbTotal": 134,
                    "twoManTackles": 55,
                    "threeManTackles": 70,
                    "fourManPlusTackles": 3,
                    "tryScoringPercentage": 11.11,
                    "shiftsLeft": 16,
                    "shiftsRight": 11,
                    "receipts": 386,
                    "grubberKick": 6,
                    "postContactMetres": 536,
                    "dummyPasses": 30,
                    "kickPressures": 10,
                    "lineEngagedRuns": 19,
                    "ptbAverage": 3.68,
                    "ptbOneToTwo": 4,
                    "ptbTwoToThree": 23,
                    "ptbThreeToFour": 62,
                    "ptbFourToFive": 39,
                    "ptbFivePlus": 6,
                    "ptbOpp20m": 29,
                    "interchangeUsed": 8,
                    "doubles": 63,
                    "longKicksSpace": 3,
                    "effectiveTacklePercentage": 89.5,
                    "ptbPenalties": 3,
                    "generalPlayPenalties": 1,
                    "foulPlayPenalties": 1,
                    "averageSetDistance": 45.4,
                    "completeSets1stHalf": 19,
                    "completeSets2ndHalf": 11,
                    "completionPercentage1stHalf": 90,
                    "completionPercentage2ndHalf": 73,
                    "incompleteSets1stHalf": 2,
                    "incompleteSets2ndHalf": 4,
                    "incompletionPercentage1stHalf": 10,
                    "incompletionPercentage2ndHalf": 27,
                    "kickReceiptRuns": 11,
                    "kickReceiptMetres": 100,
                    "averageOneManTackleTiming": 3.43,
                    "averageTwoManTackleTiming": 3.69,
                    "averageThreeManTackleTiming": 3.71,
                    "averageFourManTackleTiming": 4.52
                },
                "teamHexColour": "650038",
                "teamHexColour2": "ffce35",
                "teamCoaches": {
                    "teamCoach": [
                        {
                            "coachId": 50001,
                            "coachName": "Wayne Bennett",
                            "coachRoleId": 12,
                            "coachRole": "Coach"
                        }
                    ]
                }
            }
        ]
    }
}