{
    "vod": [
        {
            "id": "1jbnE3dDpZCVN5wxDLH4oKvbFQCQXPN8",
            "contentId": 734114,
            "title": "Rd 4: FIELD GOAL Chris Sandow (77th min)",
            "description": "Chris Sandow puts the game out of reach by kicking a late field goal, putting the lead out past a converted try, 23-16",
            "publishDate": "2015-03-27T21:31:00+11:00",
            "publisher": "NRL Chief",
            "thumbnailUrl": "http://bigpondvideo.com/Web/Images/Content/20150327213126a_89x50.jpg",
            "largeThumbnailUrl": "http://bigpondvideo.com/Web/Images/Content/20150327213126a_326x184.jpg",
            "programType": "Instant Replay",
            "programCategory": "Score",
            "priority": null,
            "lastUpdateDate": "2015-03-27T21:33:58+11:00",
            "isPremium": true,
            "club": [
                500031,
                500005
            ]
        },
        {
            "id": "9yZ3E3dDpvWoz-A45Wo2MJ4K3Zs5MSsT",
            "contentId": 734113,
            "title": "Rd 4: TRY Reece Robinson (68th min)",
            "description": "Reece Robinson bags his second try of the night, celebrating his 100th NRL game, to extend the Eels lead, 22-16",
            "publishDate": "2015-03-27T21:20:00+11:00",
            "publisher": "NRL Chief",
            "thumbnailUrl": "http://bigpondvideo.com/Web/Images/Content/20150327212023a_89x50.jpg",
            "largeThumbnailUrl": "http://bigpondvideo.com/Web/Images/Content/20150327212023a_326x184.jpg",
            "programType": "Instant Replay",
            "programCategory": "Score",
            "priority": null,
            "lastUpdateDate": "2015-03-27T21:22:55+11:00",
            "isPremium": true,
            "club": [
                500031,
                500005
            ]
        },
        {
            "id": "BhZHE3dDpsvSh0xkl8tCd0zSvnG20I1_",
            "contentId": 734112,
            "title": "Rd 4: TRY Alex Johnston (61st min)",
            "description": "The Rabbitohs score down the left side through winger Alex Johnston, cutting down the Eels lead, 18-16",
            "publishDate": "2015-03-27T21:14:00+11:00",
            "publisher": "NRL Chief",
            "thumbnailUrl": "http://bigpondvideo.com/Web/Images/Content/20150327211320a_89x50.jpg",
            "largeThumbnailUrl": "http://bigpondvideo.com/Web/Images/Content/20150327211320a_326x184.jpg",
            "programType": "Instant Replay",
            "programCategory": "Score",
            "priority": null,
            "lastUpdateDate": "2015-03-27T21:16:51+11:00",
            "isPremium": true,
            "club": [
                500031,
                500005
            ]
        },
        {
            "id": "t1M3E3dDrJDaZbqB_NFl9TnqbxpLlEzx",
            "contentId": 734111,
            "title": "Rd 4: TRY Reece Robinson (43rd min)",
            "description": "The Eels score first after halftime, this time down the left side, through their other winger Reece Robinson, 18-12",
            "publishDate": "2015-03-27T20:56:00+11:00",
            "publisher": "NRL Chief",
            "thumbnailUrl": "http://bigpondvideo.com/Web/Images/Content/20150327205614a_89x50.jpg",
            "largeThumbnailUrl": "http://bigpondvideo.com/Web/Images/Content/20150327205614a_326x184.jpg",
            "programType": "Instant Replay",
            "programCategory": "Score",
            "priority": null,
            "lastUpdateDate": "2015-03-27T20:59:39+11:00",
            "isPremium": true,
            "club": [
                500031,
                500005
            ]
        },
        {
            "id": "44c3A3dDouLFHyKKzvcNy69i2q2AahQA",
            "contentId": 734110,
            "title": "Rd 4: GOAL Chris Sandow (40th min)",
            "description": "The conversion taken by Chris Sandow puts the Eels in the lead at the break, 14-12",
            "publishDate": "2015-03-27T20:34:00+11:00",
            "publisher": "NRL Chief",
            "thumbnailUrl": "http://bigpondvideo.com/Web/Images/Content/20150327203318a_89x50.jpg",
            "largeThumbnailUrl": "http://bigpondvideo.com/Web/Images/Content/20150327203318a_326x184.jpg",
            "programType": "Instant Replay",
            "programCategory": "Score",
            "priority": null,
            "lastUpdateDate": "2015-03-27T20:37:27+11:00",
            "isPremium": true,
            "club": [
                500031,
                500005
            ]
        },
        {
            "id": "E0c3A3dDqNcm7fz0iYmoQSgihchmu3CG",
            "contentId": 734102,
            "title": "Rd 4: TRY John Folau (40th min)",
            "description": "The Eels winger John Folau scores his second of the night just before halftime",
            "publishDate": "2015-03-27T20:33:00+11:00",
            "publisher": "NRL Chief",
            "thumbnailUrl": "http://bigpondvideo.com/Web/Images/Content/20150327203342a_89x50.jpg",
            "largeThumbnailUrl": "http://bigpondvideo.com/Web/Images/Content/20150327203342a_326x184.jpg",
            "programType": "Instant Replay",
            "programCategory": "Score",
            "priority": null,
            "lastUpdateDate": "2015-03-27T20:36:28+11:00",
            "isPremium": true,
            "club": [
                500031,
                500005
            ]
        },
        {
            "id": "I1cnA3dDqgWDqvgHayqOfRIgfT2tTvse",
            "contentId": 734101,
            "title": "Rd 4: GOAL Adam Reynolds (35th min)",
            "description": "Adam Reynolds converts the try, Rabbitohs lead 12-8",
            "publishDate": "2015-03-27T20:29:00+11:00",
            "publisher": "NRL Chief",
            "thumbnailUrl": "http://bigpondvideo.com/Web/Images/Content/20150327202814a_89x50.jpg",
            "largeThumbnailUrl": "http://bigpondvideo.com/Web/Images/Content/20150327202814a_326x184.jpg",
            "programType": "Instant Replay",
            "programCategory": "Score",
            "priority": null,
            "lastUpdateDate": "2015-03-27T20:32:25+11:00",
            "isPremium": true,
            "club": [
                500031,
                500005
            ]
        },
        {
            "id": "9vcXA3dDq89ri3uSKfMnYkbht-Au7N2u",
            "contentId": 734100,
            "title": "Rd 4: TRY Chris Grevsmuhl (34th min)",
            "description": "The Rabbitohs get themselves back into the lead, this time with a try to Chris Grevsmuhl from a bomb",
            "publishDate": "2015-03-27T20:27:00+11:00",
            "publisher": "NRL Chief",
            "thumbnailUrl": "http://bigpondvideo.com/Web/Images/Content/20150327202735a_89x50.jpg",
            "largeThumbnailUrl": "http://bigpondvideo.com/Web/Images/Content/20150327202735a_326x184.jpg",
            "programType": "Instant Replay",
            "programCategory": "Score",
            "priority": null,
            "lastUpdateDate": "2015-03-27T20:31:26+11:00",
            "isPremium": true,
            "club": [
                500031,
                500005
            ]
        },
        {
            "id": "RucHA3dDp65HGecXJ8BM5H7_uYOOqrjc",
            "contentId": 734094,
            "title": "Rd 4: PENALTY GOAL Chris Sandow (30th min)",
            "description": "The Eels are given a penalty right in front and elect to take the shot at goal, putting themselves in front, 8-6",
            "publishDate": "2015-03-27T20:23:00+11:00",
            "publisher": "NRL Chief",
            "thumbnailUrl": "http://bigpondvideo.com/Web/Images/Content/20150327202321a_89x50.jpg",
            "largeThumbnailUrl": "http://bigpondvideo.com/Web/Images/Content/20150327202321a_326x184.jpg",
            "programType": "Instant Replay",
            "programCategory": "Score",
            "priority": null,
            "lastUpdateDate": "2015-03-27T20:26:22+11:00",
            "isPremium": true,
            "club": [
                500031,
                500005
            ]
        },
        {
            "id": "92bHA3dDrxxPXVdln_LchAmnRHnOs1S_",
            "contentId": 734096,
            "title": "Rd 4: GOAL Chris Sandow (16th min)",
            "description": "The Eels halfback Chris Sandow successfully converts the first try to lock up the scores at 6 a piece",
            "publishDate": "2015-03-27T20:08:00+11:00",
            "publisher": "NRL Chief",
            "thumbnailUrl": "http://bigpondvideo.com/Web/Images/Content/20150327200755a_89x50.jpg",
            "largeThumbnailUrl": "http://bigpondvideo.com/Web/Images/Content/20150327200755a_326x184.jpg",
            "programType": "Instant Replay",
            "programCategory": "Score",
            "priority": null,
            "lastUpdateDate": "2015-03-27T20:17:18+11:00",
            "isPremium": true,
            "club": [
                500031,
                500005
            ]
        },
        {
            "id": "E5bHA3dDq1c4uHMoNLO8Lllg-uGWx_-I",
            "contentId": 734095,
            "title": "Rd 4: TRY John Folau (15th min)",
            "description": "The Eels hit back with a try to their winger John Folau",
            "publishDate": "2015-03-27T20:06:00+11:00",
            "publisher": "NRL Chief",
            "thumbnailUrl": "http://bigpondvideo.com/Web/Images/Content/20150327200604a_89x50.jpg",
            "largeThumbnailUrl": "http://bigpondvideo.com/Web/Images/Content/20150327200604a_326x184.jpg",
            "programType": "Instant Replay",
            "programCategory": "Score",
            "priority": null,
            "lastUpdateDate": "2015-03-27T20:10:14+11:00",
            "isPremium": true,
            "club": [
                500031,
                500005
            ]
        },
        {
            "id": "Rla3A3dDqWUY_7mTh_TkLWcSnAokHO9A",
            "contentId": 734093,
            "title": "Rd 4: GOAL Adam Reynolds (10th min)",
            "description": "The conversion is successfully taken by Adam Reynolds, 6-0",
            "publishDate": "2015-03-27T20:01:00+11:00",
            "publisher": "NRL Chief",
            "thumbnailUrl": "http://bigpondvideo.com/Web/Images/Content/20150327200105a_89x50.jpg",
            "largeThumbnailUrl": "http://bigpondvideo.com/Web/Images/Content/20150327200105a_326x184.jpg",
            "programType": "Instant Replay",
            "programCategory": "Score",
            "priority": null,
            "lastUpdateDate": "2015-03-27T20:12:15+11:00",
            "isPremium": true,
            "club": [
                500031,
                500005
            ]
        },
        {
            "id": "Qwa3A3dDooLkRb7RI1wgEpqBQvjwyWaQ",
            "contentId": 734092,
            "title": "Rd 4: TRY Joel Reddy (9th min)",
            "description": "The Rabbitohs are the first to score through their winger Joel Reddy",
            "publishDate": "2015-03-27T20:00:00+11:00",
            "publisher": "NRL Chief",
            "thumbnailUrl": "http://bigpondvideo.com/Web/Images/Content/20150327200029a_89x50.jpg",
            "largeThumbnailUrl": "http://bigpondvideo.com/Web/Images/Content/20150327200029a_326x184.jpg",
            "programType": "Instant Replay",
            "programCategory": "Score",
            "priority": null,
            "lastUpdateDate": "2015-03-27T20:03:10+11:00",
            "isPremium": true,
            "club": [
                500031,
                500005
            ]
        }
    ],
    "scores": [
        {
            "gameState": "First Half",
            "gameStateId": 3,
            "gameTime": "0:14:20",
            "gameSeconds": 860,
            "playerId": 500891,
            "playerName": "John Folau",
            "scoreMethod": "Try",
            "statId": 38,
            "statValue": 4,
            "vidRef": 23763,
            "homeScore": 4,
            "awayScore": 6,
            "teamId": 500031,
            "teamName": "Parramatta Eels",
            "homeTeamAbbrv": "PAR",
            "awayTeamAbbrv": "SOU"
        },
        {
            "gameState": "First Half",
            "gameStateId": 3,
            "gameTime": "0:15:42",
            "gameSeconds": 942,
            "playerId": 500691,
            "playerName": "Chris Sandow",
            "scoreMethod": "Conversion",
            "statId": 1,
            "statValue": 2,
            "vidRef": 25806,
            "homeScore": 6,
            "awayScore": 6,
            "teamId": 500031,
            "teamName": "Parramatta Eels",
            "homeTeamAbbrv": "PAR",
            "awayTeamAbbrv": "SOU"
        },
        {
            "gameState": "First Half",
            "gameStateId": 3,
            "gameTime": "0:29:19",
            "gameSeconds": 1759,
            "playerId": 500691,
            "playerName": "Chris Sandow",
            "scoreMethod": "Penalty Goal",
            "statId": 67,
            "statValue": 2,
            "vidRef": 49186,
            "homeScore": 8,
            "awayScore": 6,
            "teamId": 500031,
            "teamName": "Parramatta Eels",
            "homeTeamAbbrv": "PAR",
            "awayTeamAbbrv": "SOU"
        },
        {
            "gameState": "First Half",
            "gameStateId": 3,
            "gameTime": "0:39:21",
            "gameSeconds": 2361,
            "playerId": 500891,
            "playerName": "John Folau",
            "scoreMethod": "Try",
            "statId": 38,
            "statValue": 4,
            "vidRef": 64238,
            "homeScore": 12,
            "awayScore": 12,
            "teamId": 500031,
            "teamName": "Parramatta Eels",
            "homeTeamAbbrv": "PAR",
            "awayTeamAbbrv": "SOU"
        },
        {
            "gameState": "First Half",
            "gameStateId": 3,
            "gameTime": "0:40:00",
            "gameSeconds": 2400,
            "playerId": 500691,
            "playerName": "Chris Sandow",
            "scoreMethod": "Conversion",
            "statId": 1,
            "statValue": 2,
            "vidRef": 67514,
            "homeScore": 14,
            "awayScore": 12,
            "teamId": 500031,
            "teamName": "Parramatta Eels",
            "homeTeamAbbrv": "PAR",
            "awayTeamAbbrv": "SOU"
        },
        {
            "gameState": "Second Half",
            "gameStateId": 5,
            "gameTime": "0:42:40",
            "gameSeconds": 2560,
            "playerId": 500331,
            "playerName": "Reece Robinson",
            "scoreMethod": "Try",
            "statId": 38,
            "statValue": 4,
            "vidRef": 73527,
            "homeScore": 18,
            "awayScore": 12,
            "teamId": 500031,
            "teamName": "Parramatta Eels",
            "homeTeamAbbrv": "PAR",
            "awayTeamAbbrv": "SOU"
        },
        {
            "gameState": "Second Half",
            "gameStateId": 5,
            "gameTime": "1:07:17",
            "gameSeconds": 4037,
            "playerId": 500331,
            "playerName": "Reece Robinson",
            "scoreMethod": "Try",
            "statId": 38,
            "statValue": 4,
            "vidRef": 112932,
            "homeScore": 22,
            "awayScore": 16,
            "teamId": 500031,
            "teamName": "Parramatta Eels",
            "homeTeamAbbrv": "PAR",
            "awayTeamAbbrv": "SOU"
        },
        {
            "gameState": "Second Half",
            "gameStateId": 5,
            "gameTime": "1:16:08",
            "gameSeconds": 4568,
            "playerId": 500691,
            "playerName": "Chris Sandow",
            "scoreMethod": "Field Goal",
            "statId": 69,
            "statValue": 1,
            "vidRef": 128335,
            "homeScore": 23,
            "awayScore": 16,
            "teamId": 500031,
            "teamName": "Parramatta Eels",
            "homeTeamAbbrv": "PAR",
            "awayTeamAbbrv": "SOU"
        },
        {
            "gameState": "Second Half",
            "gameStateId": 5,
            "gameTime": "1:19:52",
            "gameSeconds": 4792,
            "playerId": 500691,
            "playerName": "Chris Sandow",
            "scoreMethod": "Try",
            "statId": 38,
            "statValue": 4,
            "vidRef": 138322,
            "homeScore": 27,
            "awayScore": 16,
            "teamId": 500031,
            "teamName": "Parramatta Eels",
            "homeTeamAbbrv": "PAR",
            "awayTeamAbbrv": "SOU"
        },
        {
            "gameState": "Second Half",
            "gameStateId": 5,
            "gameTime": "1:20:00",
            "gameSeconds": 4800,
            "playerId": 500691,
            "playerName": "Chris Sandow",
            "scoreMethod": "Conversion",
            "statId": 1,
            "statValue": 2,
            "vidRef": 140530,
            "homeScore": 29,
            "awayScore": 16,
            "teamId": 500031,
            "teamName": "Parramatta Eels",
            "homeTeamAbbrv": "PAR",
            "awayTeamAbbrv": "SOU"
        },
        {
            "gameState": "First Half",
            "gameStateId": 3,
            "gameTime": "0:08:23",
            "gameSeconds": 503,
            "playerId": 500113,
            "playerName": "Joel Reddy",
            "scoreMethod": "Try",
            "statId": 38,
            "statValue": 4,
            "vidRef": 14834,
            "awayScore": 4,
            "teamId": 500005,
            "teamName": "South Sydney Rabbitohs",
            "homeTeamAbbrv": "PAR",
            "awayTeamAbbrv": "SOU"
        },
        {
            "gameState": "First Half",
            "gameStateId": 3,
            "gameTime": "0:09:53",
            "gameSeconds": 593,
            "playerId": 500086,
            "playerName": "Adam Reynolds",
            "scoreMethod": "Conversion",
            "statId": 1,
            "statValue": 2,
            "vidRef": 17075,
            "awayScore": 6,
            "teamId": 500005,
            "teamName": "South Sydney Rabbitohs",
            "homeTeamAbbrv": "PAR",
            "awayTeamAbbrv": "SOU"
        },
        {
            "gameState": "First Half",
            "gameStateId": 3,
            "gameTime": "0:33:36",
            "gameSeconds": 2016,
            "playerId": 500106,
            "playerName": "Chris Grevsmuhl",
            "scoreMethod": "Try",
            "statId": 38,
            "statValue": 4,
            "vidRef": 55612,
            "homeScore": 8,
            "awayScore": 10,
            "teamId": 500005,
            "teamName": "South Sydney Rabbitohs",
            "homeTeamAbbrv": "PAR",
            "awayTeamAbbrv": "SOU"
        },
        {
            "gameState": "First Half",
            "gameStateId": 3,
            "gameTime": "0:35:03",
            "gameSeconds": 2103,
            "playerId": 500086,
            "playerName": "Adam Reynolds",
            "scoreMethod": "Conversion",
            "statId": 1,
            "statValue": 2,
            "vidRef": 57786,
            "homeScore": 8,
            "awayScore": 12,
            "teamId": 500005,
            "teamName": "South Sydney Rabbitohs",
            "homeTeamAbbrv": "PAR",
            "awayTeamAbbrv": "SOU"
        },
        {
            "gameState": "Second Half",
            "gameStateId": 5,
            "gameTime": "1:00:53",
            "gameSeconds": 3653,
            "playerId": 500108,
            "playerName": "Alex Johnston",
            "scoreMethod": "Try",
            "statId": 38,
            "statValue": 4,
            "vidRef": 101752,
            "homeScore": 18,
            "awayScore": 16,
            "teamId": 500005,
            "teamName": "South Sydney Rabbitohs",
            "homeTeamAbbrv": "PAR",
            "awayTeamAbbrv": "SOU"
        }
    ]
}