{
    "competitionId": 111,
    "competitionName": "NRL Telstra Premiership",
    "gameId": 20161110130,
    "gameInfo": {
        "assistantReferee1Id": 500013,
        "numberOfPeriods": 2,
        "assistantReferee1Name": "Brett Suttor",
        "assistantReferee2Id": 500021,
        "assistantReferee2Name": "Dave Ryan",
        "gameDate": "2016-03-05",
        "gameHashTag": "#NRLRaidersPanthers",
        "gameNumber": 3,
        "gameSeconds": 4800,
        "gameMinutes": "80:00",
        "gameTime": "1:20:00",
        "groundConditionId": 1,
        "groundConditionName": "N/A",
        "referee1Id": 500008,
        "referee1Name": "Gavin Badger",
        "referee2Id": 500034,
        "referee2Name": "Dave Munro",
        "startTime": "2016-03-05T15:00:00",
        "startTimeUTC": "2016-03-05T04:00:00Z",
        "venueId": 500071,
        "venueName": "GIO Stadium",
        "videoReferee1Id": 500203,
        "videoReferee1Name": "Ben Galea",
        "videoReferee2Id": 500036,
        "videoReferee2Name": "Jason Robinson",
        "weatherId": 2,
        "weatherName": "Fine",
        "broadcastChannel": null,
        "venueLatitude": 35.25,
        "venueLongitude": 149.1028,
        "broadcastInfo": {
            "radioNetwork": []
        }
    },
    "gameState": "Final",
    "gameStateId": 8,
    "roundId": 1,
    "roundName": "Round 1",
    "seasonId": 2016,
    "teams": {
        "teamsMatch": [
            {
                "isHomeTeam": true,
                "score": {
                    "conversions": 3,
                    "points": 30,
                    "penaltyGoals": 2,
                    "tries": 5
                },
                "team1stHalfScore": 16,
                "team2ndHalfScore": 14,
                "teamAbbr": "CAN",
                "teamFinalScore": 30,
                "teamFullTimeScore": 30,
                "teamHalfTimeScore": 16,
                "teamId": 500013,
                "teamLineup": {
                    "teamLineUpStatusID": 4,
                    "teamLineUpStatus": "Final",
                    "injuriesAndSuspensions": {
                        "injury": [],
                        "suspension": []
                    },
                    "insAndOuts": {
                        "inOut": []
                    },
                    "teamPlayer": [
                        {
                            "playerFirstName": "Jack",
                            "playerId": 500339,
                            "playerLastName": "Wighton",
                            "playerName": "Jack Wighton",
                            "playerPosition": "Fullback",
                            "playerPositionId": 500001,
                            "playerStats": {
                                "allRunMetres": 154,
                                "allRuns": 18,
                                "bombKicksDefused": 3,
                                "bombKicksNotDefused": 1,
                                "decoys": 1,
                                "dummyHalfRuns": 3,
                                "errors": 1,
                                "fantasyPointsTotal": 30,
                                "ineffectiveTackles": 2,
                                "kickMetres": 30,
                                "kickReturnMetres": 42,
                                "kickReturns": 3,
                                "kicks": 1,
                                "kicksDefused": 3,
                                "kicksNotDefused": 1,
                                "mins": 80,
                                "passes": 5,
                                "passesPerRun": 0.28,
                                "oneOnOneTackles": 1,
                                "supports": 8,
                                "tackleBreaks": 3,
                                "tackles": 4,
                                "evasionRuns": 12,
                                "evasionRunMetres": 98,
                                "dummyHalfRunMetres": 14,
                                "ptbAll": 15,
                                "receipts": 24,
                                "postContactMetres": 47,
                                "dummyPasses": 1,
                                "lineEngagedRuns": 1,
                                "ptbOneToTwo": 1,
                                "ptbTwoToThree": 3,
                                "ptbThreeToFour": 9,
                                "ptbFourToFive": 2,
                                "effectiveTacklePercentage": 66.7
                            },
                            "playerTookTheField": true,
                            "shirtNum": 1,
                            "playerFirstInitial": "J",
                            "playerPositionAbbrev": "FB"
                        },
                        {
                            "playerFirstName": "Edrick",
                            "playerId": 500322,
                            "playerLastName": "Lee",
                            "playerName": "Edrick Lee",
                            "playerPosition": "Winger 1",
                            "playerPositionId": 500002,
                            "playerStats": {
                                "allRunMetres": 54,
                                "allRuns": 7,
                                "bombKicksNotDefused": 1,
                                "dummyHalfRuns": 2,
                                "errors": 1,
                                "fantasyPointsTotal": 31,
                                "ineffectiveTackles": 1,
                                "kicksDefused": 1,
                                "kicksNotDefused": 1,
                                "linebreaks": 1,
                                "mins": 80,
                                "passes": 1,
                                "passesPerRun": 0.14,
                                "oneOnOneTackles": 2,
                                "penalties": 1,
                                "points": 4,
                                "supports": 12,
                                "tackleBreaks": 4,
                                "tackles": 5,
                                "tries": 1,
                                "evasionRuns": 5,
                                "evasionRunMetres": 36,
                                "dummyHalfRunMetres": 18,
                                "ptbAll": 7,
                                "receipts": 10,
                                "postContactMetres": 18,
                                "ptbTwoToThree": 2,
                                "ptbThreeToFour": 3,
                                "ptbFourToFive": 2,
                                "effectiveTacklePercentage": 83.3,
                                "generalPlayPenalties": 1
                            },
                            "playerTookTheField": true,
                            "shirtNum": 2,
                            "playerFirstInitial": "E",
                            "playerPositionAbbrev": "WG"
                        },
                        {
                            "playerFirstName": "Jarrod",
                            "playerId": 500313,
                            "playerLastName": "Croker",
                            "playerName": "Jarrod Croker",
                            "playerPosition": "Centre 1",
                            "playerPositionId": 500003,
                            "playerStats": {
                                "allRunMetres": 24,
                                "allRuns": 4,
                                "conversions": 3,
                                "conversionsAttempts": 5,
                                "conversionsMissed": 2,
                                "fantasyPointsTotal": 37,
                                "goalConversionRate": 71.43,
                                "allGoals": 5,
                                "allGoalsMissed": 2,
                                "allGoalsAttempted": 7,
                                "linebreakAssists": 1,
                                "mins": 80,
                                "passes": 5,
                                "passesPerRun": 1.25,
                                "oneOnOneTackles": 4,
                                "penaltyGoals": 2,
                                "penaltyGoalsAttempts": 2,
                                "points": 10,
                                "supports": 11,
                                "tackleBreaks": 2,
                                "tackles": 12,
                                "tryAssists": 1,
                                "evasionRuns": 4,
                                "evasionRunMetres": 24,
                                "ptbAll": 1,
                                "receipts": 6,
                                "dummyPasses": 1,
                                "lineEngagedRuns": 1,
                                "ptbFourToFive": 1,
                                "effectiveTacklePercentage": 100
                            },
                            "playerTookTheField": true,
                            "shirtNum": 3,
                            "playerFirstInitial": "J",
                            "playerPositionAbbrev": "CT"
                        },
                        {
                            "playerFirstName": "Joseph",
                            "playerId": 500042,
                            "playerLastName": "Leilua",
                            "playerName": "Joseph Leilua",
                            "playerPosition": "Centre 2",
                            "playerPositionId": 500004,
                            "playerStats": {
                                "allRunMetres": 115,
                                "allRuns": 14,
                                "dummyHalfRuns": 1,
                                "errors": 2,
                                "fantasyPointsTotal": 32,
                                "mins": 80,
                                "offloads": 2,
                                "passes": 6,
                                "passesPerRun": 0.43,
                                "oneOnOneLost": 1,
                                "penalties": 3,
                                "supports": 10,
                                "tackleBreaks": 6,
                                "tackles": 9,
                                "tryCause": 2,
                                "evasionRuns": 13,
                                "evasionRunMetres": 104,
                                "dummyHalfRunMetres": 11,
                                "ptbAll": 9,
                                "receipts": 15,
                                "postContactMetres": 25,
                                "dummyPasses": 1,
                                "ptbTwoToThree": 1,
                                "ptbThreeToFour": 8,
                                "doubles": 2,
                                "effectiveTacklePercentage": 100,
                                "ptbPenalties": 2,
                                "offsidePenalties": 1
                            },
                            "playerTookTheField": true,
                            "shirtNum": 4,
                            "playerFirstInitial": "J",
                            "playerPositionAbbrev": "CT"
                        },
                        {
                            "playerFirstName": "Jordan",
                            "playerId": 500330,
                            "playerLastName": "Rapana",
                            "playerName": "Jordan Rapana",
                            "playerPosition": "Winger 2",
                            "playerPositionId": 500005,
                            "playerStats": {
                                "allRunMetres": 37,
                                "allRuns": 8,
                                "bombKicksDefused": 2,
                                "errors": 1,
                                "fantasyPointsTotal": 8,
                                "kickReturns": 2,
                                "kicksDefused": 2,
                                "mins": 80,
                                "missedTackles": 1,
                                "passes": 5,
                                "passesPerRun": 0.62,
                                "oneOnOneTackles": 2,
                                "supports": 11,
                                "tackleBreaks": 1,
                                "tackles": 4,
                                "tryCause": 1,
                                "evasionRuns": 6,
                                "evasionRunMetres": 37,
                                "ptbAll": 8,
                                "receipts": 14,
                                "postContactMetres": 8,
                                "ptbTwoToThree": 2,
                                "ptbThreeToFour": 3,
                                "ptbFourToFive": 2,
                                "ptbFivePlus": 1,
                                "effectiveTacklePercentage": 80
                            },
                            "playerTookTheField": true,
                            "shirtNum": 5,
                            "playerFirstInitial": "J",
                            "playerPositionAbbrev": "WG"
                        },
                        {
                            "playerFirstName": "Blake",
                            "playerId": 501375,
                            "playerLastName": "Austin",
                            "playerName": "Blake Austin",
                            "playerPosition": "Five-Eighth",
                            "playerPositionId": 500006,
                            "playerStats": {
                                "allRunMetres": 45,
                                "allRuns": 5,
                                "fantasyPointsTotal": 41,
                                "ineffectiveTackles": 1,
                                "intercepts": 1,
                                "kickMetres": 121,
                                "kicks": 3,
                                "lineDropouts": 1,
                                "linebreakAssists": 1,
                                "linebreaks": 1,
                                "mins": 46,
                                "passes": 15,
                                "passesPerRun": 3,
                                "oneOnOneTackles": 1,
                                "points": 4,
                                "supports": 6,
                                "tackleBreaks": 2,
                                "tackles": 6,
                                "tries": 1,
                                "tryAssists": 1,
                                "tryCause": 1,
                                "evasionRuns": 5,
                                "evasionRunMetres": 45,
                                "ptbAll": 1,
                                "receipts": 21,
                                "postContactMetres": 8,
                                "dummyPasses": 3,
                                "lineEngagedRuns": 2,
                                "ptbFourToFive": 1,
                                "longKicksSpace": 1,
                                "effectiveTacklePercentage": 85.7
                            },
                            "playerTookTheField": true,
                            "shirtNum": 14,
                            "playerFirstInitial": "B",
                            "playerPositionAbbrev": "FE"
                        },
                        {
                            "playerFirstName": "Aidan",
                            "playerId": 500068,
                            "playerLastName": "Sezer",
                            "playerName": "Aidan Sezer",
                            "playerPosition": "Halfback",
                            "playerPositionId": 500007,
                            "playerStats": {
                                "allRunMetres": 66,
                                "allRuns": 12,
                                "bombKicks": 1,
                                "bombKickMetres": 30,
                                "chargedDown": 1,
                                "dummyHalfRuns": 2,
                                "errors": 1,
                                "fantasyPointsTotal": 63,
                                "ineffectiveTackles": 1,
                                "kickDead": 1,
                                "kickMetres": 242,
                                "kicks": 9,
                                "linebreaks": 2,
                                "mins": 80,
                                "missedTackles": 3,
                                "offloads": 1,
                                "passes": 16,
                                "passesPerRun": 1.33,
                                "oneOnOneTackles": 4,
                                "points": 8,
                                "supports": 7,
                                "tackleBreaks": 4,
                                "tackles": 15,
                                "tries": 2,
                                "evasionRuns": 10,
                                "evasionRunMetres": 61,
                                "dummyHalfRunMetres": 5,
                                "ptbAll": 2,
                                "receipts": 31,
                                "forcedDropOutKicker": 1,
                                "grubberKick": 2,
                                "crossFieldKick": 1,
                                "postContactMetres": 3,
                                "kickPressures": 3,
                                "lineEngagedRuns": 6,
                                "ptbThreeToFour": 1,
                                "ptbFivePlus": 1,
                                "doubles": 1,
                                "longKicksSpace": 3,
                                "effectiveTacklePercentage": 78.9
                            },
                            "playerTookTheField": true,
                            "shirtNum": 7,
                            "playerFirstInitial": "A",
                            "playerPositionAbbrev": "HB"
                        },
                        {
                            "playerFirstName": "Shannon",
                            "playerId": 500309,
                            "playerLastName": "Boyd",
                            "playerName": "Shannon Boyd",
                            "playerPosition": "Prop 1",
                            "playerPositionId": 500008,
                            "playerStats": {
                                "allRunMetres": 65,
                                "allRuns": 8,
                                "decoys": 4,
                                "errors": 1,
                                "fantasyPointsTotal": 27,
                                "hitUps": 5,
                                "ineffectiveTackles": 1,
                                "kickReturnMetres": 31,
                                "kickReturns": 3,
                                "mins": 33,
                                "missedTackles": 1,
                                "oneOnOneTackles": 7,
                                "supports": 5,
                                "tackles": 25,
                                "tryCause": 1,
                                "hitupRunMeters": 34,
                                "ptbAll": 7,
                                "receipts": 10,
                                "postContactMetres": 20,
                                "ptbTwoToThree": 2,
                                "ptbThreeToFour": 4,
                                "ptbFourToFive": 1,
                                "doubles": 9,
                                "effectiveTacklePercentage": 92.6
                            },
                            "playerTookTheField": true,
                            "shirtNum": 8,
                            "playerFirstInitial": "S",
                            "playerPositionAbbrev": "PR"
                        },
                        {
                            "playerFirstName": "Josh",
                            "playerId": 502181,
                            "playerLastName": "Hodgson",
                            "playerName": "Josh Hodgson",
                            "playerPosition": "Hooker",
                            "playerPositionId": 500009,
                            "playerStats": {
                                "allRunMetres": 58,
                                "allRuns": 10,
                                "dummyHalfRuns": 6,
                                "errors": 1,
                                "fantasyPointsTotal": 33,
                                "hitUps": 1,
                                "ineffectiveTackles": 4,
                                "kickMetres": 4,
                                "kicks": 1,
                                "linebreakAssists": 1,
                                "mins": 80,
                                "missedTackles": 3,
                                "passes": 62,
                                "passesPerRun": 6.2,
                                "oneOnOneTackles": 8,
                                "supports": 8,
                                "tackleBreaks": 1,
                                "tackles": 31,
                                "hitupRunMeters": 10,
                                "evasionRuns": 3,
                                "evasionRunMetres": 19,
                                "dummyHalfRunMetres": 29,
                                "ptbAll": 3,
                                "receipts": 66,
                                "grubberKick": 1,
                                "postContactMetres": 7,
                                "dummyPasses": 6,
                                "kickPressures": 1,
                                "lineEngagedRuns": 6,
                                "ptbThreeToFour": 2,
                                "ptbFourToFive": 1,
                                "doubles": 6,
                                "effectiveTacklePercentage": 81.6
                            },
                            "playerTookTheField": true,
                            "shirtNum": 9,
                            "playerFirstInitial": "J",
                            "playerPositionAbbrev": "HK"
                        },
                        {
                            "playerFirstName": "Frank-Paul",
                            "playerId": 500014,
                            "playerLastName": "Nuuausala",
                            "playerName": "Frank-Paul Nuuausala",
                            "playerPosition": "Prop 2",
                            "playerPositionId": 500010,
                            "playerStats": {
                                "allRunMetres": 102,
                                "allRuns": 8,
                                "fantasyPointsTotal": 38,
                                "hitUps": 8,
                                "linebreaks": 1,
                                "mins": 32,
                                "offloads": 1,
                                "passes": 1,
                                "passesPerRun": 0.12,
                                "supports": 2,
                                "tackleBreaks": 2,
                                "tackles": 16,
                                "hitupRunMeters": 102,
                                "ptbAll": 7,
                                "receipts": 9,
                                "postContactMetres": 24,
                                "kickPressures": 1,
                                "ptbThreeToFour": 5,
                                "ptbFourToFive": 1,
                                "ptbFivePlus": 1,
                                "doubles": 2,
                                "effectiveTacklePercentage": 100
                            },
                            "playerTookTheField": true,
                            "shirtNum": 10,
                            "playerFirstInitial": "F",
                            "playerPositionAbbrev": "PR"
                        },
                        {
                            "playerFirstName": "Josh",
                            "playerId": 500973,
                            "playerLastName": "Papalii",
                            "playerName": "Josh Papalii",
                            "playerPosition": "2nd Row 1",
                            "playerPositionId": 500011,
                            "playerStats": {
                                "allRunMetres": 65,
                                "allRuns": 8,
                                "decoys": 3,
                                "fantasyPointsTotal": 39,
                                "hitUps": 8,
                                "ineffectiveTackles": 2,
                                "mins": 76,
                                "offloads": 3,
                                "passes": 5,
                                "passesPerRun": 0.62,
                                "oneOnOneTackles": 4,
                                "supports": 8,
                                "tackleBreaks": 2,
                                "tackles": 21,
                                "hitupRunMeters": 65,
                                "ptbAll": 5,
                                "receipts": 13,
                                "postContactMetres": 13,
                                "kickPressures": 2,
                                "ptbThreeToFour": 1,
                                "ptbFourToFive": 3,
                                "ptbFivePlus": 1,
                                "doubles": 1,
                                "effectiveTacklePercentage": 91.3
                            },
                            "playerTookTheField": true,
                            "shirtNum": 11,
                            "playerFirstInitial": "J",
                            "playerPositionAbbrev": "2R"
                        },
                        {
                            "playerFirstName": "Elliott",
                            "playerId": 502134,
                            "playerLastName": "Whitehead",
                            "playerName": "Elliott Whitehead",
                            "playerPosition": "2nd Row 2",
                            "playerPositionId": 500012,
                            "playerStats": {
                                "allRunMetres": 73,
                                "allRuns": 12,
                                "fantasyPointsTotal": 32,
                                "hitUps": 11,
                                "intercepts": 1,
                                "mins": 80,
                                "missedTackles": 5,
                                "offloads": 1,
                                "passes": 2,
                                "passesPerRun": 0.17,
                                "oneOnOneTackles": 8,
                                "penalties": 2,
                                "supports": 12,
                                "tackles": 37,
                                "tryCause": 1,
                                "hitupRunMeters": 67,
                                "evasionRuns": 1,
                                "evasionRunMetres": 6,
                                "ptbAll": 10,
                                "receipts": 13,
                                "postContactMetres": 20,
                                "kickPressures": 1,
                                "lineEngagedRuns": 1,
                                "ptbTwoToThree": 1,
                                "ptbThreeToFour": 4,
                                "ptbFourToFive": 2,
                                "ptbFivePlus": 3,
                                "doubles": 10,
                                "effectiveTacklePercentage": 88.1,
                                "ptbPenalties": 2
                            },
                            "playerTookTheField": true,
                            "shirtNum": 12,
                            "playerFirstInitial": "E",
                            "playerPositionAbbrev": "2R"
                        },
                        {
                            "playerFirstName": "Shaun",
                            "playerId": 500316,
                            "playerLastName": "Fensom",
                            "playerName": "Shaun Fensom",
                            "playerPosition": "Lock",
                            "playerPositionId": 500013,
                            "playerStats": {
                                "allRunMetres": 132,
                                "allRuns": 13,
                                "fantasyPointsTotal": 71,
                                "hitUps": 13,
                                "ineffectiveTackles": 1,
                                "linebreaks": 1,
                                "mins": 52,
                                "missedTackles": 1,
                                "oneOnOneTackles": 7,
                                "penalties": 1,
                                "points": 4,
                                "supports": 8,
                                "tackleBreaks": 4,
                                "tackles": 38,
                                "tries": 1,
                                "tryCause": 1,
                                "hitupRunMeters": 132,
                                "ptbAll": 12,
                                "receipts": 13,
                                "postContactMetres": 28,
                                "kickPressures": 1,
                                "ptbTwoToThree": 5,
                                "ptbThreeToFour": 3,
                                "ptbFourToFive": 3,
                                "ptbFivePlus": 1,
                                "doubles": 9,
                                "effectiveTacklePercentage": 95,
                                "ptbPenalties": 1
                            },
                            "playerTookTheField": true,
                            "shirtNum": 13,
                            "playerFirstInitial": "S",
                            "playerPositionAbbrev": "LK"
                        },
                        {
                            "playerFirstName": "Iosia",
                            "playerId": 502331,
                            "playerLastName": "Soliola",
                            "playerName": "Iosia Soliola",
                            "playerPosition": "Interchange",
                            "playerPositionId": 500014,
                            "playerStats": {
                                "allRunMetres": 101,
                                "allRuns": 13,
                                "decoys": 6,
                                "dummyHalfRuns": 1,
                                "fantasyPointsTotal": 44,
                                "hitUps": 9,
                                "ineffectiveTackles": 1,
                                "kickReturnMetres": 12,
                                "kickReturns": 1,
                                "mins": 57,
                                "missedTackles": 2,
                                "passes": 2,
                                "passesPerRun": 0.15,
                                "oneOnOneTackles": 2,
                                "supports": 15,
                                "tackleBreaks": 2,
                                "tackles": 32,
                                "hitupRunMeters": 70,
                                "evasionRuns": 2,
                                "evasionRunMetres": 8,
                                "dummyHalfRunMetres": 11,
                                "ptbAll": 10,
                                "receipts": 13,
                                "postContactMetres": 22,
                                "dummyPasses": 1,
                                "kickPressures": 1,
                                "lineEngagedRuns": 2,
                                "ptbOneToTwo": 1,
                                "ptbTwoToThree": 1,
                                "ptbThreeToFour": 7,
                                "ptbFourToFive": 1,
                                "doubles": 5,
                                "effectiveTacklePercentage": 91.4
                            },
                            "playerTookTheField": true,
                            "shirtNum": 15,
                            "playerFirstInitial": "I",
                            "playerPositionAbbrev": "INT"
                        },
                        {
                            "playerFirstName": "Paul",
                            "playerId": 500337,
                            "playerLastName": "Vaughan",
                            "playerName": "Paul Vaughan",
                            "playerPosition": "Interchange",
                            "playerPositionId": 500014,
                            "playerStats": {
                                "allRunMetres": 90,
                                "allRuns": 13,
                                "decoys": 3,
                                "dummyHalfRuns": 1,
                                "fantasyPointsTotal": 40,
                                "hitUps": 12,
                                "ineffectiveTackles": 2,
                                "mins": 41,
                                "offloads": 1,
                                "oneOnOneTackles": 2,
                                "tackleBreaks": 3,
                                "tackles": 20,
                                "hitupRunMeters": 83,
                                "dummyHalfRunMetres": 7,
                                "ptbAll": 11,
                                "receipts": 13,
                                "postContactMetres": 27,
                                "dummyPasses": 1,
                                "ptbTwoToThree": 4,
                                "ptbThreeToFour": 4,
                                "ptbFivePlus": 3,
                                "doubles": 5,
                                "effectiveTacklePercentage": 90.9
                            },
                            "playerTookTheField": true,
                            "shirtNum": 16,
                            "playerFirstInitial": "P",
                            "playerPositionAbbrev": "INT"
                        },
                        {
                            "playerFirstName": "Jeff",
                            "playerId": 500094,
                            "playerLastName": "Lima",
                            "playerName": "Jeff Lima",
                            "playerPosition": "Interchange",
                            "playerPositionId": 500014,
                            "playerStats": {
                                "allRunMetres": 105,
                                "allRuns": 13,
                                "decoys": 2,
                                "fantasyPointsTotal": 16,
                                "hitUps": 9,
                                "kickReturnMetres": 42,
                                "kickReturns": 3,
                                "mins": 26,
                                "missedTackles": 2,
                                "passes": 2,
                                "passesPerRun": 0.15,
                                "oneOnOneTackles": 1,
                                "supports": 3,
                                "tackles": 10,
                                "hitupRunMeters": 59,
                                "evasionRuns": 1,
                                "evasionRunMetres": 4,
                                "ptbAll": 11,
                                "receipts": 14,
                                "postContactMetres": 21,
                                "lineEngagedRuns": 1,
                                "ptbTwoToThree": 1,
                                "ptbThreeToFour": 7,
                                "ptbFourToFive": 2,
                                "ptbFivePlus": 1,
                                "doubles": 2,
                                "effectiveTacklePercentage": 83.3
                            },
                            "playerTookTheField": true,
                            "shirtNum": 17,
                            "playerFirstInitial": "J",
                            "playerPositionAbbrev": "INT"
                        },
                        {
                            "playerFirstName": "Kurt",
                            "playerId": 500308,
                            "playerLastName": "Baptiste",
                            "playerName": "Kurt Baptiste",
                            "playerPosition": "Interchange",
                            "playerPositionId": 500014,
                            "playerStats": {
                                "allRunMetres": 24,
                                "allRuns": 4,
                                "dummyHalfRuns": 1,
                                "fantasyPointsTotal": 11,
                                "hitUps": 2,
                                "ineffectiveTackles": 1,
                                "mins": 34,
                                "missedTackles": 2,
                                "passes": 48,
                                "passesPerRun": 12,
                                "oneOnOneTackles": 2,
                                "supports": 1,
                                "tackles": 13,
                                "hitupRunMeters": 10,
                                "evasionRuns": 1,
                                "evasionRunMetres": 7,
                                "dummyHalfRunMetres": 7,
                                "ptbAll": 3,
                                "receipts": 50,
                                "postContactMetres": 6,
                                "dummyPasses": 1,
                                "kickPressures": 1,
                                "lineEngagedRuns": 1,
                                "ptbTwoToThree": 1,
                                "ptbFourToFive": 1,
                                "ptbFivePlus": 1,
                                "doubles": 4,
                                "effectiveTacklePercentage": 81.2
                            },
                            "playerTookTheField": true,
                            "shirtNum": 18,
                            "playerFirstInitial": "K",
                            "playerPositionAbbrev": "INT"
                        }
                    ]
                },
                "teamName": "Canberra Raiders",
                "teamNickName": "Raiders",
                "teamStats": {
                    "allRunMetres": 1315,
                    "allRuns": 170,
                    "bombKicks": 1,
                    "bombKickMetres": 30,
                    "bombKicksDefused": 5,
                    "bombKicksNotDefused": 2,
                    "chargedDown": 1,
                    "completeSets": 31,
                    "completionPercentage": 79,
                    "conversions": 3,
                    "conversionsAttempts": 5,
                    "conversionsMissed": 2,
                    "decoys": 19,
                    "dummyHalfRuns": 17,
                    "errors": 8,
                    "goalConversionRate": 71.43,
                    "allGoals": 5,
                    "allGoalsAttempted": 7,
                    "allGoalsMissed": 2,
                    "hitUps": 78,
                    "incompleteSets": 8,
                    "ineffectiveTackles": 17,
                    "intercepts": 2,
                    "kickDead": 1,
                    "kickMetres": 397,
                    "kickReturnMetres": 128,
                    "kickReturns": 12,
                    "kicks": 14,
                    "kicksDefused": 6,
                    "kicksNotDefused": 2,
                    "lineDropouts": 1,
                    "linebreakAssists": 3,
                    "linebreaks": 6,
                    "missedTackles": 20,
                    "offloads": 9,
                    "oneOnOneLost": 1,
                    "oneOnOneTackles": 55,
                    "passes": 175,
                    "passesPerRun": 1.03,
                    "penalties": 7,
                    "penaltyGoals": 2,
                    "penaltyGoalsAttempts": 2,
                    "points": 30,
                    "pointsConceded": 22,
                    "possession": 49,
                    "scrumWins": 5,
                    "supports": 127,
                    "tackleBreaks": 36,
                    "tackles": 298,
                    "sets": 39,
                    "tries": 5,
                    "triesConceded": 3,
                    "tryAssists": 2,
                    "tryCause": 7,
                    "hitupRunMeters": 634,
                    "evasionRuns": 63,
                    "evasionRunMetres": 450,
                    "dummyHalfRunMetres": 103,
                    "ptbTotal": 122,
                    "tryScoringPercentage": 16.13,
                    "shiftsLeft": 5,
                    "shiftsRight": 2,
                    "receipts": 335,
                    "forcedDropOutKicker": 1,
                    "grubberKick": 3,
                    "crossFieldKick": 1,
                    "postContactMetres": 297,
                    "dummyPasses": 15,
                    "kickPressures": 11,
                    "lineEngagedRuns": 21,
                    "ptbOneToTwo": 2,
                    "ptbTwoToThree": 23,
                    "ptbThreeToFour": 61,
                    "ptbFourToFive": 23,
                    "ptbFivePlus": 13,
                    "interchangeUsed": 8,
                    "doubles": 56,
                    "longKicksSpace": 4,
                    "effectiveTacklePercentage": 89,
                    "ptbPenalties": 5,
                    "generalPlayPenalties": 1,
                    "offsidePenalties": 1,
                    "averageSetDistance": 33.7,
                    "completeSets1stHalf": 14,
                    "completeSets2ndHalf": 17,
                    "completionPercentage1stHalf": 73.68,
                    "completionPercentage2ndHalf": 85,
                    "incompleteSets1stHalf": 5,
                    "incompleteSets2ndHalf": 3,
                    "incompletionPercentage1stHalf": 26.32,
                    "incompletionPercentage2ndHalf": 15
                },
                "teamHexColour": "c4d82e",
                "teamHexColour2": "76821C"
            },
            {
                "score": {
                    "conversions": 3,
                    "points": 22,
                    "penaltyGoals": 2,
                    "tries": 3
                },
                "team1stHalfScore": 16,
                "team2ndHalfScore": 6,
                "teamAbbr": "PEN",
                "teamFinalScore": 22,
                "teamFullTimeScore": 22,
                "teamHalfTimeScore": 16,
                "teamId": 500014,
                "teamLineup": {
                    "teamLineUpStatusID": 4,
                    "teamLineUpStatus": "Final",
                    "injuriesAndSuspensions": {
                        "injury": [],
                        "suspension": []
                    },
                    "insAndOuts": {
                        "inOut": []
                    },
                    "teamPlayer": [
                        {
                            "playerFirstName": "Will",
                            "playerId": 501253,
                            "playerLastName": "Smith",
                            "playerName": "Will Smith",
                            "playerPosition": "Fullback",
                            "playerPositionId": 500001,
                            "playerStats": {
                                "allRunMetres": 141,
                                "allRuns": 10,
                                "bombKicksDefused": 1,
                                "errors": 1,
                                "fantasyPointsTotal": 34,
                                "kickReturnMetres": 78,
                                "kickReturns": 5,
                                "kicksDefused": 3,
                                "linebreaks": 1,
                                "mins": 80,
                                "missedTackles": 4,
                                "offloads": 2,
                                "passes": 35,
                                "passesPerRun": 3.5,
                                "oneOnOneTackles": 2,
                                "supports": 11,
                                "tackleBreaks": 2,
                                "tackles": 13,
                                "tryCause": 3,
                                "evasionRuns": 5,
                                "evasionRunMetres": 63,
                                "ptbAll": 8,
                                "receipts": 46,
                                "postContactMetres": 54,
                                "ptbTwoToThree": 4,
                                "ptbThreeToFour": 2,
                                "ptbFourToFive": 1,
                                "ptbFivePlus": 1,
                                "doubles": 2,
                                "effectiveTacklePercentage": 76.5
                            },
                            "playerTookTheField": true,
                            "shirtNum": 1,
                            "playerFirstInitial": "W",
                            "playerPositionAbbrev": "FB"
                        },
                        {
                            "playerFirstName": "Josh",
                            "playerId": 500352,
                            "playerLastName": "Mansour",
                            "playerName": "Josh Mansour",
                            "playerPosition": "Winger 1",
                            "playerPositionId": 500002,
                            "playerStats": {
                                "allRunMetres": 123,
                                "allRuns": 12,
                                "decoys": 1,
                                "dummyHalfRuns": 4,
                                "errors": 2,
                                "fantasyPointsTotal": 35,
                                "hitUps": 1,
                                "linebreaks": 1,
                                "mins": 80,
                                "oneOnOneTackles": 1,
                                "points": 4,
                                "supports": 8,
                                "tackleBreaks": 2,
                                "tackles": 9,
                                "tries": 1,
                                "hitupRunMeters": 14,
                                "evasionRuns": 7,
                                "evasionRunMetres": 52,
                                "dummyHalfRunMetres": 57,
                                "ptbAll": 9,
                                "receipts": 15,
                                "postContactMetres": 37,
                                "dummyPasses": 1,
                                "ptbOneToTwo": 1,
                                "ptbTwoToThree": 5,
                                "ptbThreeToFour": 2,
                                "ptbFourToFive": 1,
                                "doubles": 2,
                                "effectiveTacklePercentage": 100
                            },
                            "playerTookTheField": true,
                            "shirtNum": 2,
                            "playerFirstInitial": "J",
                            "playerPositionAbbrev": "WG"
                        },
                        {
                            "playerFirstName": "Waqa",
                            "playerId": 500496,
                            "playerLastName": "Blake",
                            "playerName": "Waqa Blake",
                            "playerPosition": "Centre 1",
                            "playerPositionId": 500003,
                            "playerStats": {
                                "allRunMetres": 21,
                                "allRuns": 3,
                                "chargeDowns": 1,
                                "decoys": 2,
                                "fantasyPointsTotal": 8,
                                "ineffectiveTackles": 2,
                                "kicksDefused": 1,
                                "mins": 80,
                                "missedTackles": 3,
                                "offloads": 1,
                                "passes": 3,
                                "passesPerRun": 1,
                                "penalties": 1,
                                "supports": 12,
                                "tackles": 11,
                                "tryCause": 2,
                                "evasionRuns": 3,
                                "evasionRunMetres": 21,
                                "ptbAll": 3,
                                "receipts": 10,
                                "postContactMetres": 3,
                                "ptbThreeToFour": 1,
                                "ptbFourToFive": 2,
                                "doubles": 2,
                                "effectiveTacklePercentage": 68.8,
                                "ptbPenalties": 1
                            },
                            "playerTookTheField": true,
                            "shirtNum": 3,
                            "playerFirstInitial": "W",
                            "playerPositionAbbrev": "CT"
                        },
                        {
                            "playerFirstName": "Peta",
                            "playerId": 500579,
                            "playerLastName": "Hiku",
                            "playerName": "Peta Hiku",
                            "playerPosition": "Centre 2",
                            "playerPositionId": 500004,
                            "playerStats": {
                                "allRunMetres": 109,
                                "allRuns": 14,
                                "decoys": 1,
                                "errors": 2,
                                "fantasyPointsTotal": 37,
                                "hitUps": 1,
                                "ineffectiveTackles": 2,
                                "linebreaks": 1,
                                "mins": 80,
                                "missedTackles": 1,
                                "offloads": 1,
                                "passes": 3,
                                "passesPerRun": 0.21,
                                "oneOnOneTackles": 2,
                                "points": 4,
                                "supports": 6,
                                "tackleBreaks": 1,
                                "tackles": 16,
                                "tries": 1,
                                "hitupRunMeters": 7,
                                "evasionRuns": 13,
                                "evasionRunMetres": 102,
                                "ptbAll": 10,
                                "receipts": 15,
                                "postContactMetres": 15,
                                "dummyPasses": 1,
                                "ptbTwoToThree": 2,
                                "ptbThreeToFour": 4,
                                "ptbFourToFive": 2,
                                "ptbFivePlus": 2,
                                "doubles": 3,
                                "effectiveTacklePercentage": 84.2
                            },
                            "playerTookTheField": true,
                            "shirtNum": 4,
                            "playerFirstInitial": "P",
                            "playerPositionAbbrev": "CT"
                        },
                        {
                            "playerFirstName": "Dallin",
                            "playerId": 500532,
                            "playerLastName": "Watene Zelezniak",
                            "playerName": "Dallin Watene Zelezniak",
                            "playerPosition": "Winger 2",
                            "playerPositionId": 500005,
                            "playerStats": {
                                "allRunMetres": 61,
                                "allRuns": 9,
                                "fantasyPointsTotal": 19,
                                "ineffectiveTackles": 1,
                                "kickReturnMetres": 25,
                                "kickReturns": 2,
                                "mins": 80,
                                "missedTackles": 1,
                                "offloads": 2,
                                "oneOnOneTackles": 1,
                                "penalties": 1,
                                "supports": 6,
                                "tackleBreaks": 2,
                                "tackles": 7,
                                "tryCause": 2,
                                "evasionRuns": 7,
                                "evasionRunMetres": 36,
                                "ptbAll": 6,
                                "receipts": 10,
                                "postContactMetres": 14,
                                "ptbTwoToThree": 1,
                                "ptbThreeToFour": 5,
                                "doubles": 1,
                                "effectiveTacklePercentage": 77.8,
                                "ptbPenalties": 1
                            },
                            "playerTookTheField": true,
                            "shirtNum": 5,
                            "playerFirstInitial": "D",
                            "playerPositionAbbrev": "WG"
                        },
                        {
                            "playerFirstName": "Jamie",
                            "playerId": 501259,
                            "playerLastName": "Soward",
                            "playerName": "Jamie Soward",
                            "playerPosition": "Five-Eighth",
                            "playerPositionId": 500006,
                            "playerStats": {
                                "allRunMetres": 42,
                                "allRuns": 4,
                                "bombKicks": 2,
                                "bombKickMetres": 44,
                                "conversions": 3,
                                "conversionsAttempts": 3,
                                "errors": 1,
                                "fantasyPointsTotal": 29,
                                "goalConversionRate": 100,
                                "allGoals": 5,
                                "allGoalsAttempted": 5,
                                "kickMetres": 106,
                                "kicks": 4,
                                "lineDropouts": 1,
                                "mins": 80,
                                "missedTackles": 2,
                                "offloads": 1,
                                "passes": 28,
                                "passesPerRun": 7,
                                "oneOnOneSteal": 1,
                                "oneOnOneTackles": 2,
                                "penalties": 2,
                                "penaltyGoals": 2,
                                "penaltyGoalsAttempts": 2,
                                "points": 10,
                                "supports": 6,
                                "tackleBreaks": 1,
                                "tackles": 15,
                                "tryCause": 1,
                                "evasionRuns": 4,
                                "evasionRunMetres": 42,
                                "ptbAll": 2,
                                "receipts": 36,
                                "chipKick": 1,
                                "postContactMetres": 1,
                                "dummyPasses": 2,
                                "lineEngagedRuns": 2,
                                "ptbThreeToFour": 1,
                                "ptbFourToFive": 1,
                                "doubles": 2,
                                "longKicksSpace": 1,
                                "effectiveTacklePercentage": 88.2,
                                "ptbPenalties": 1,
                                "foulPlayPenalties": 1
                            },
                            "playerTookTheField": true,
                            "shirtNum": 6,
                            "playerFirstInitial": "J",
                            "playerPositionAbbrev": "FE"
                        },
                        {
                            "playerFirstName": "Peter",
                            "playerId": 500956,
                            "playerLastName": "Wallace",
                            "playerName": "Peter Wallace",
                            "playerPosition": "Halfback",
                            "playerPositionId": 500007,
                            "playerStats": {
                                "allRunMetres": 31,
                                "allRuns": 5,
                                "bombKicks": 6,
                                "bombKickMetres": 118,
                                "errors": 1,
                                "fantasyPointsTotal": 21,
                                "ineffectiveTackles": 1,
                                "kickMetres": 217,
                                "kicks": 9,
                                "kicksDefused": 1,
                                "mins": 80,
                                "missedTackles": 4,
                                "passes": 31,
                                "passesPerRun": 6.2,
                                "oneOnOneTackles": 3,
                                "supports": 20,
                                "tackles": 17,
                                "tryCause": 3,
                                "evasionRuns": 5,
                                "evasionRunMetres": 31,
                                "ptbAll": 5,
                                "receipts": 46,
                                "forcedDropOutKicker": 1,
                                "chipKick": 1,
                                "postContactMetres": 2,
                                "dummyPasses": 1,
                                "kickPressures": 1,
                                "ptbTwoToThree": 1,
                                "ptbThreeToFour": 1,
                                "ptbFourToFive": 2,
                                "ptbFivePlus": 1,
                                "doubles": 5,
                                "longKicksSpace": 1,
                                "effectiveTacklePercentage": 77.3
                            },
                            "playerTookTheField": true,
                            "shirtNum": 7,
                            "playerFirstInitial": "P",
                            "playerPositionAbbrev": "HB"
                        },
                        {
                            "playerFirstName": "Sam",
                            "playerId": 500354,
                            "playerLastName": "McKendry",
                            "playerName": "Sam McKendry",
                            "playerPosition": "Prop 1",
                            "playerPositionId": 500008,
                            "playerStats": {
                                "allRunMetres": 37,
                                "allRuns": 4,
                                "decoys": 1,
                                "fantasyPointsTotal": 14,
                                "hitUps": 3,
                                "ineffectiveTackles": 1,
                                "kickReturnMetres": 8,
                                "kickReturns": 1,
                                "mins": 27,
                                "missedTackles": 1,
                                "penalties": 1,
                                "supports": 5,
                                "tackleBreaks": 1,
                                "tackles": 12,
                                "hitupRunMeters": 29,
                                "ptbAll": 4,
                                "receipts": 4,
                                "postContactMetres": 7,
                                "ptbTwoToThree": 2,
                                "ptbThreeToFour": 1,
                                "ptbFourToFive": 1,
                                "doubles": 2,
                                "effectiveTacklePercentage": 85.7,
                                "ptbPenalties": 1
                            },
                            "playerTookTheField": true,
                            "shirtNum": 8,
                            "playerFirstInitial": "S",
                            "playerPositionAbbrev": "PR"
                        },
                        {
                            "playerFirstName": "James",
                            "playerId": 500362,
                            "playerLastName": "Segeyaro",
                            "playerName": "James Segeyaro",
                            "playerPosition": "Hooker",
                            "playerPositionId": 500009,
                            "playerStats": {
                                "allRunMetres": 48,
                                "allRuns": 5,
                                "dummyHalfRuns": 4,
                                "errors": 1,
                                "fantasyPointsTotal": 31,
                                "hitUps": 1,
                                "ineffectiveTackles": 1,
                                "interceptedPass": 1,
                                "linebreakAssists": 1,
                                "mins": 56,
                                "missedTackles": 3,
                                "passes": 66,
                                "passesPerRun": 13.2,
                                "oneOnOneTackles": 1,
                                "tackles": 28,
                                "tryAssists": 1,
                                "hitupRunMeters": 8,
                                "dummyHalfRunMetres": 40,
                                "ptbAll": 4,
                                "receipts": 69,
                                "postContactMetres": 2,
                                "dummyPasses": 4,
                                "ptbTwoToThree": 3,
                                "ptbThreeToFour": 1,
                                "doubles": 5,
                                "effectiveTacklePercentage": 87.5
                            },
                            "playerTookTheField": true,
                            "shirtNum": 9,
                            "playerFirstInitial": "J",
                            "playerPositionAbbrev": "HK"
                        },
                        {
                            "playerFirstName": "Reagan",
                            "playerId": 500498,
                            "playerLastName": "Campbell-Gillard",
                            "playerName": "Reagan Campbell-Gillard",
                            "playerPosition": "Prop 2",
                            "playerPositionId": 500010,
                            "playerStats": {
                                "allRunMetres": 128,
                                "allRuns": 14,
                                "decoys": 8,
                                "errors": 1,
                                "fantasyPointsTotal": 17,
                                "hitUps": 12,
                                "ineffectiveTackles": 2,
                                "kickReturnMetres": 31,
                                "kickReturns": 2,
                                "mins": 48,
                                "missedTackles": 3,
                                "passes": 1,
                                "passesPerRun": 0.07,
                                "oneOnOneTackles": 1,
                                "penalties": 1,
                                "supports": 11,
                                "tackles": 15,
                                "tryCause": 1,
                                "hitupRunMeters": 97,
                                "ptbAll": 11,
                                "receipts": 15,
                                "postContactMetres": 25,
                                "ptbTwoToThree": 1,
                                "ptbThreeToFour": 4,
                                "ptbFourToFive": 6,
                                "effectiveTacklePercentage": 75,
                                "ptbPenalties": 1
                            },
                            "playerTookTheField": true,
                            "shirtNum": 10,
                            "playerFirstInitial": "R",
                            "playerPositionAbbrev": "PR"
                        },
                        {
                            "playerFirstName": "Bryce",
                            "playerId": 500499,
                            "playerLastName": "Cartwright",
                            "playerName": "Bryce Cartwright",
                            "playerPosition": "2nd Row 1",
                            "playerPositionId": 500011,
                            "playerStats": {
                                "allRunMetres": 122,
                                "allRuns": 13,
                                "bombKicks": 1,
                                "bombKickMetres": 18,
                                "decoys": 4,
                                "fantasyPointsTotal": 37,
                                "hitUps": 12,
                                "ineffectiveTackles": 2,
                                "kickMetres": 18,
                                "kicks": 1,
                                "mins": 80,
                                "missedTackles": 6,
                                "offloads": 2,
                                "passes": 7,
                                "passesPerRun": 0.54,
                                "oneOnOneTackles": 2,
                                "supports": 17,
                                "tackleBreaks": 3,
                                "tackles": 24,
                                "tryCause": 1,
                                "hitupRunMeters": 114,
                                "evasionRuns": 1,
                                "evasionRunMetres": 8,
                                "ptbAll": 10,
                                "receipts": 20,
                                "postContactMetres": 34,
                                "dummyPasses": 5,
                                "kickPressures": 2,
                                "lineEngagedRuns": 1,
                                "ptbOneToTwo": 1,
                                "ptbTwoToThree": 1,
                                "ptbThreeToFour": 3,
                                "ptbFourToFive": 3,
                                "ptbFivePlus": 2,
                                "doubles": 5,
                                "effectiveTacklePercentage": 75
                            },
                            "playerTookTheField": true,
                            "shirtNum": 11,
                            "playerFirstInitial": "B",
                            "playerPositionAbbrev": "2R"
                        },
                        {
                            "playerFirstName": "Isaah",
                            "playerId": 500534,
                            "playerLastName": "Yeo",
                            "playerName": "Isaah Yeo",
                            "playerPosition": "2nd Row 2",
                            "playerPositionId": 500012,
                            "playerStats": {
                                "allRunMetres": 63,
                                "allRuns": 8,
                                "decoys": 7,
                                "fantasyPointsTotal": 28,
                                "hitUps": 7,
                                "ineffectiveTackles": 1,
                                "kickReturnMetres": 2,
                                "kickReturns": 1,
                                "mins": 65,
                                "missedTackles": 1,
                                "passes": 6,
                                "passesPerRun": 0.75,
                                "oneOnOneTackles": 1,
                                "penalties": 1,
                                "supports": 15,
                                "tackles": 26,
                                "tryCause": 1,
                                "hitupRunMeters": 61,
                                "ptbAll": 8,
                                "receipts": 14,
                                "postContactMetres": 18,
                                "dummyPasses": 1,
                                "kickPressures": 1,
                                "ptbTwoToThree": 1,
                                "ptbThreeToFour": 3,
                                "ptbFourToFive": 3,
                                "ptbFivePlus": 1,
                                "doubles": 5,
                                "effectiveTacklePercentage": 92.9,
                                "ptbPenalties": 1
                            },
                            "playerTookTheField": true,
                            "shirtNum": 12,
                            "playerFirstInitial": "I",
                            "playerPositionAbbrev": "2R"
                        },
                        {
                            "playerFirstName": "Trent",
                            "playerId": 500632,
                            "playerLastName": "Merrin",
                            "playerName": "Trent Merrin",
                            "playerPosition": "Lock",
                            "playerPositionId": 500013,
                            "playerStats": {
                                "allRunMetres": 148,
                                "allRuns": 15,
                                "decoys": 2,
                                "fantasyPointsTotal": 54,
                                "hitUps": 15,
                                "linebreaks": 1,
                                "mins": 58,
                                "missedTackles": 3,
                                "offloads": 1,
                                "oneOnOneTackles": 3,
                                "penalties": 1,
                                "points": 4,
                                "supports": 3,
                                "tackleBreaks": 3,
                                "tackles": 25,
                                "tries": 1,
                                "tryCause": 1,
                                "hitupRunMeters": 148,
                                "ptbAll": 13,
                                "receipts": 16,
                                "postContactMetres": 36,
                                "kickPressures": 1,
                                "ptbOneToTwo": 2,
                                "ptbTwoToThree": 2,
                                "ptbThreeToFour": 5,
                                "ptbFourToFive": 4,
                                "doubles": 3,
                                "effectiveTacklePercentage": 89.3,
                                "ptbPenalties": 1
                            },
                            "playerTookTheField": true,
                            "shirtNum": 13,
                            "playerFirstInitial": "T",
                            "playerPositionAbbrev": "LK"
                        },
                        {
                            "playerFirstName": "Tyrone",
                            "playerId": 501184,
                            "playerLastName": "Peachey",
                            "playerName": "Tyrone Peachey",
                            "playerPosition": "Interchange",
                            "playerPositionId": 500014,
                            "playerStats": {
                                "allRunMetres": 80,
                                "allRuns": 10,
                                "decoys": 4,
                                "fantasyPointsTotal": 47,
                                "hitUps": 9,
                                "linebreakAssists": 2,
                                "mins": 53,
                                "missedTackles": 1,
                                "passes": 7,
                                "passesPerRun": 0.7,
                                "oneOnOneTackles": 1,
                                "penalties": 2,
                                "supports": 6,
                                "tackleBreaks": 4,
                                "tackles": 19,
                                "tryAssists": 2,
                                "hitupRunMeters": 74,
                                "evasionRuns": 1,
                                "evasionRunMetres": 6,
                                "ptbAll": 9,
                                "receipts": 16,
                                "postContactMetres": 6,
                                "lineEngagedRuns": 1,
                                "ptbTwoToThree": 1,
                                "ptbThreeToFour": 5,
                                "ptbFourToFive": 3,
                                "doubles": 1,
                                "effectiveTacklePercentage": 95,
                                "ptbPenalties": 2
                            },
                            "playerTookTheField": true,
                            "shirtNum": 14,
                            "playerFirstInitial": "T",
                            "playerPositionAbbrev": "INT"
                        },
                        {
                            "playerFirstName": "Jeremy",
                            "playerId": 500351,
                            "playerLastName": "Latimore",
                            "playerName": "Jeremy Latimore",
                            "playerPosition": "Interchange",
                            "playerPositionId": 500014,
                            "playerStats": {
                                "allRunMetres": 57,
                                "allRuns": 7,
                                "decoys": 2,
                                "errors": 1,
                                "fantasyPointsTotal": 31,
                                "hitUps": 7,
                                "ineffectiveTackles": 2,
                                "mins": 41,
                                "missedTackles": 3,
                                "offloads": 1,
                                "passes": 1,
                                "passesPerRun": 0.14,
                                "oneOnOneTackles": 5,
                                "supports": 3,
                                "tackles": 32,
                                "tryCause": 1,
                                "hitupRunMeters": 57,
                                "ptbAll": 6,
                                "receipts": 9,
                                "postContactMetres": 16,
                                "dummyPasses": 1,
                                "kickPressures": 2,
                                "ptbTwoToThree": 1,
                                "ptbThreeToFour": 5,
                                "doubles": 8,
                                "effectiveTacklePercentage": 86.5
                            },
                            "playerTookTheField": true,
                            "shirtNum": 15,
                            "playerFirstInitial": "J",
                            "playerPositionAbbrev": "INT"
                        },
                        {
                            "playerFirstName": "Suaia",
                            "playerId": 500713,
                            "playerLastName": "Matagi",
                            "playerName": "Suaia Matagi",
                            "playerPosition": "Interchange",
                            "playerPositionId": 500014,
                            "playerStats": {
                                "allRunMetres": 86,
                                "allRuns": 10,
                                "decoys": 7,
                                "fantasyPointsTotal": 25,
                                "hitUps": 8,
                                "kickReturnMetres": 22,
                                "kickReturns": 2,
                                "kicksDefused": 1,
                                "mins": 35,
                                "offloads": 1,
                                "passes": 1,
                                "passesPerRun": 0.1,
                                "supports": 5,
                                "tackleBreaks": 1,
                                "tackles": 11,
                                "hitupRunMeters": 64,
                                "ptbAll": 10,
                                "receipts": 12,
                                "postContactMetres": 27,
                                "dummyPasses": 3,
                                "kickPressures": 2,
                                "ptbTwoToThree": 5,
                                "ptbThreeToFour": 4,
                                "ptbFourToFive": 1,
                                "doubles": 5,
                                "effectiveTacklePercentage": 100
                            },
                            "playerTookTheField": true,
                            "shirtNum": 16,
                            "playerFirstInitial": "S",
                            "playerPositionAbbrev": "INT"
                        },
                        {
                            "playerFirstName": "James",
                            "playerId": 502580,
                            "playerLastName": "Fisher-Harris",
                            "playerName": "James Fisher-Harris",
                            "playerPosition": "Interchange",
                            "playerPositionId": 500014,
                            "playerStats": {
                                "allRunMetres": 32,
                                "allRuns": 4,
                                "decoys": 1,
                                "errors": 1,
                                "fantasyPointsTotal": 12,
                                "hitUps": 4,
                                "interceptedPass": 1,
                                "mins": 18,
                                "offloads": 1,
                                "passes": 1,
                                "passesPerRun": 0.25,
                                "supports": 3,
                                "tackles": 9,
                                "hitupRunMeters": 32,
                                "ptbAll": 2,
                                "receipts": 5,
                                "postContactMetres": 6,
                                "ptbTwoToThree": 1,
                                "ptbFourToFive": 1,
                                "doubles": 1,
                                "effectiveTacklePercentage": 100
                            },
                            "playerTookTheField": true,
                            "shirtNum": 20,
                            "playerFirstInitial": "J",
                            "playerPositionAbbrev": "INT"
                        }
                    ]
                },
                "teamName": "Penrith Panthers",
                "teamNickName": "Panthers",
                "teamStats": {
                    "allRunMetres": 1333,
                    "allRuns": 147,
                    "bombKicks": 9,
                    "bombKickMetres": 180,
                    "bombKicksDefused": 1,
                    "chargeDowns": 1,
                    "completeSets": 22,
                    "completionPercentage": 73,
                    "conversions": 3,
                    "conversionsAttempts": 3,
                    "decoys": 40,
                    "dummyHalfRuns": 8,
                    "errors": 11,
                    "goalConversionRate": 100,
                    "allGoals": 5,
                    "allGoalsAttempted": 5,
                    "hitUps": 80,
                    "incompleteSets": 8,
                    "ineffectiveTackles": 15,
                    "interceptedPass": 2,
                    "kickMetres": 341,
                    "kickReturnMetres": 167,
                    "kickReturns": 13,
                    "kicks": 14,
                    "kicksDefused": 6,
                    "lineDropouts": 1,
                    "linebreakAssists": 3,
                    "linebreaks": 4,
                    "missedTackles": 36,
                    "offloads": 13,
                    "oneOnOneSteal": 1,
                    "oneOnOneTackles": 25,
                    "passes": 190,
                    "passesPerRun": 1.29,
                    "penalties": 10,
                    "penaltyGoals": 2,
                    "penaltyGoalsAttempts": 2,
                    "points": 22,
                    "pointsConceded": 30,
                    "possession": 51,
                    "scrumWins": 5,
                    "supports": 137,
                    "tackleBreaks": 20,
                    "tackles": 289,
                    "sets": 30,
                    "tries": 3,
                    "triesConceded": 5,
                    "tryAssists": 3,
                    "tryCause": 16,
                    "hitupRunMeters": 706,
                    "evasionRuns": 46,
                    "evasionRunMetres": 362,
                    "dummyHalfRunMetres": 98,
                    "ptbTotal": 120,
                    "tryScoringPercentage": 13.64,
                    "shiftsLeft": 8,
                    "shiftsRight": 11,
                    "receipts": 358,
                    "forcedDropOutKicker": 1,
                    "chipKick": 2,
                    "postContactMetres": 304,
                    "dummyPasses": 19,
                    "kickPressures": 9,
                    "lineEngagedRuns": 4,
                    "ptbOneToTwo": 4,
                    "ptbTwoToThree": 31,
                    "ptbThreeToFour": 47,
                    "ptbFourToFive": 31,
                    "ptbFivePlus": 7,
                    "interchangeUsed": 8,
                    "doubles": 52,
                    "longKicksSpace": 2,
                    "effectiveTacklePercentage": 85,
                    "ptbPenalties": 9,
                    "foulPlayPenalties": 1,
                    "averageSetDistance": 44.4,
                    "completeSets1stHalf": 14,
                    "completeSets2ndHalf": 8,
                    "completionPercentage1stHalf": 77.78,
                    "completionPercentage2ndHalf": 66.67,
                    "incompleteSets1stHalf": 4,
                    "incompleteSets2ndHalf": 4,
                    "incompletionPercentage1stHalf": 22.22,
                    "incompletionPercentage2ndHalf": 33.33
                },
                "teamHexColour": "00687d",
                "teamHexColour2": "00343E"
            }
        ]
    }
}