{
    "vod": [
        {
            "id": "o4eG15YTE6GArnZ_SiB8tdG1fBi56rLu",
            "contentId": 907200,
            "title": "Rd 9: Rabbitohs v Sea Eagles (Hls)",
            "description": "Highlights of the Round 9 clash between the Rabbitohs & Sea Eagles",
            "publishDate": "2017-04-28T19:51:01+10:00",
            "publisher": "NRL Chief",
            "thumbnailUrl": "http://bpvideos.telstra.insnw.net/web/images/20170428194643a_89x50.jpg",
            "largeThumbnailUrl": "http://bpvideos.telstra.insnw.net/web/images/20170428194643a_326x184.jpg",
            "programType": "Highlights",
            "programCategory": "Match",
            "priority": null,
            "lastUpdateDate": "2017-04-28T20:42:01+10:00",
            "isPremium": false,
            "club": [
                500002,
                500005
            ]
        },
        {
            "id": "dkZm55YTE6h7ii65gc7J1H3QSjaCxUbd",
            "contentId": 907816,
            "title": "Rd 9 Press Conference: Rabbitohs",
            "description": "Rabbitohs coach Michael Maguire answers the media's questions following his team's Round 9 clash.",
            "publishDate": "2017-04-28T20:43:40+10:00",
            "publisher": "NRL Chief",
            "thumbnailUrl": "http://bpvideos.telstra.insnw.net/web/images/20170428204128a_89x50.jpg",
            "largeThumbnailUrl": "http://bpvideos.telstra.insnw.net/web/images/20170428204128a_326x184.jpg",
            "programType": "Press Conference",
            "programCategory": null,
            "priority": null,
            "lastUpdateDate": "2017-04-28T20:54:05+10:00",
            "isPremium": false,
            "club": [
                500002,
                500005
            ]
        },
        {
            "id": "w5ZG55YTE6F6iJCZEMoaZT2gLEmWxfiZ",
            "contentId": 907813,
            "title": "Rd 9 Press Conference: Sea Eagles",
            "description": "Sea Eagles coach Trent Barrett answers the media's questions following his team's Round 9 clash.",
            "publishDate": "2017-04-28T20:35:26+10:00",
            "publisher": "NRL Chief",
            "thumbnailUrl": "http://bpvideos.telstra.insnw.net/web/images/20170428202530a_89x50.jpg",
            "largeThumbnailUrl": "http://bpvideos.telstra.insnw.net/web/images/20170428202530a_326x184.jpg",
            "programType": "Press Conference",
            "programCategory": null,
            "priority": null,
            "lastUpdateDate": "2017-04-28T20:48:02+10:00",
            "isPremium": false,
            "club": [
                500002,
                500005
            ]
        },
        {
            "id": "d4dW15YTE62n6jrF7I7XMcYzJtxIsBQA",
            "contentId": 907907,
            "title": "Rd 9: TRY Blake Green (72nd min)",
            "description": "Blake Green scores another try for the Sea Eagles",
            "publishDate": "2017-04-28T19:42:13+10:00",
            "publisher": "NRL Chief",
            "thumbnailUrl": "http://bpvideos.telstra.insnw.net/web/images/20170428194234a_89x50.jpg",
            "largeThumbnailUrl": "http://bpvideos.telstra.insnw.net/web/images/20170428194234a_326x184.jpg",
            "programType": "Instant Replay",
            "programCategory": "Score",
            "priority": 10,
            "lastUpdateDate": "2017-04-28T19:47:47+10:00",
            "isPremium": true,
            "club": [
                500002,
                500005
            ]
        },
        {
            "id": "1idW15YTE6O4je3aRN6XLcxCwBVGaIA8",
            "contentId": 907906,
            "title": "Rd 9: TRY Akuila Uate (69th min)",
            "description": "Akuila Uate scores his fourth try of the night",
            "publishDate": "2017-04-28T19:38:12+10:00",
            "publisher": "NRL Chief",
            "thumbnailUrl": "http://bpvideos.telstra.insnw.net/web/images/20170428193846a_89x50.jpg",
            "largeThumbnailUrl": "http://bpvideos.telstra.insnw.net/web/images/20170428193846a_326x184.jpg",
            "programType": "Instant Replay",
            "programCategory": "Score",
            "priority": 9,
            "lastUpdateDate": "2017-04-28T19:47:47+10:00",
            "isPremium": true,
            "club": [
                500002,
                500005
            ]
        },
        {
            "id": "51cG15YTE6LHDtkDIKYagEm4S12qvScG",
            "contentId": 907903,
            "title": "Rd 9: TRY Akuila Uate (59th min)",
            "description": "Akuila Uate crosses to complete his hat-trick",
            "publishDate": "2017-04-28T19:26:12+10:00",
            "publisher": "NRL Chief",
            "thumbnailUrl": "http://bpvideos.telstra.insnw.net/web/images/20170428192535a_89x50.jpg",
            "largeThumbnailUrl": "http://bpvideos.telstra.insnw.net/web/images/20170428192535a_326x184.jpg",
            "programType": "Instant Replay",
            "programCategory": "Score",
            "priority": 8,
            "lastUpdateDate": "2017-04-28T19:47:47+10:00",
            "isPremium": true,
            "club": [
                500002,
                500005
            ]
        },
        {
            "id": "54b215YTE64usGqj_Jiy9466OCGF-wue",
            "contentId": 907902,
            "title": "Rd 9: GOAL Adam Reynolds (51st min)",
            "description": "Adam Reynolds converts the try of Hymel Hunt",
            "publishDate": "2017-04-28T19:22:24+10:00",
            "publisher": "NRL Chief",
            "thumbnailUrl": "http://bpvideos.telstra.insnw.net/web/images/20170428191848a_89x50.jpg",
            "largeThumbnailUrl": "http://bpvideos.telstra.insnw.net/web/images/20170428191848a_326x184.jpg",
            "programType": "Instant Replay",
            "programCategory": "Score",
            "priority": null,
            "lastUpdateDate": "2017-04-28T19:27:42+10:00",
            "isPremium": true,
            "club": [
                500002,
                500005
            ]
        },
        {
            "id": "E5b215YTE6hGPhYfki5KT72cppw_HoBA",
            "contentId": 907901,
            "title": "Rd 9: TRY Hymel Hunt (50th min)",
            "description": "Hymel Hunt scores the Rabbitohs' first try of the night.",
            "publishDate": "2017-04-28T19:20:10+10:00",
            "publisher": "NRL Chief",
            "thumbnailUrl": "http://bpvideos.telstra.insnw.net/web/images/20170428191701a_89x50.jpg",
            "largeThumbnailUrl": "http://bpvideos.telstra.insnw.net/web/images/20170428191701a_326x184.jpg",
            "programType": "Instant Replay",
            "programCategory": "Score",
            "priority": 7,
            "lastUpdateDate": "2017-04-28T19:46:47+10:00",
            "isPremium": true,
            "club": [
                500002,
                500005
            ]
        },
        {
            "id": "I3ZW15YTE6RoqcWhloIymny3CYiZ6Pv5",
            "contentId": 907894,
            "title": "Rd 9: GOAL Dylan Walker (40th min)",
            "description": "Dylan Walker converts the try of Jake Trbojevic",
            "publishDate": "2017-04-28T18:52:49+10:00",
            "publisher": "NRL Chief",
            "thumbnailUrl": "http://bpvideos.telstra.insnw.net/web/images/20170428185217a_89x50.jpg",
            "largeThumbnailUrl": "http://bpvideos.telstra.insnw.net/web/images/20170428185217a_326x184.jpg",
            "programType": "Instant Replay",
            "programCategory": "Score",
            "priority": null,
            "lastUpdateDate": "2017-04-28T18:57:35+10:00",
            "isPremium": true,
            "club": [
                500002,
                500005
            ]
        },
        {
            "id": "B1ZG15YTE6zAiNIuh_vV3k8qZ3Ar73nN",
            "contentId": 907893,
            "title": "Rd 9: TRY Jake Trbojevic (38th min)",
            "description": "Jake Trbojevic crosses to take Manly out to a 26-point lead",
            "publishDate": "2017-04-28T18:50:18+10:00",
            "publisher": "NRL Chief",
            "thumbnailUrl": "http://bpvideos.telstra.insnw.net/web/images/20170428185001a_89x50.jpg",
            "largeThumbnailUrl": "http://bpvideos.telstra.insnw.net/web/images/20170428185001a_326x184.jpg",
            "programType": "Instant Replay",
            "programCategory": "Score",
            "priority": 6,
            "lastUpdateDate": "2017-04-28T19:46:47+10:00",
            "isPremium": true,
            "club": [
                500002,
                500005
            ]
        },
        {
            "id": "YxY215YTE6ifZ4O1irSNk-65HNqZqc60",
            "contentId": 907892,
            "title": "Rd 9: TRY Akuila Uate (35th min)",
            "description": "Akuila Uate crosses for a quickfire double",
            "publishDate": "2017-04-28T18:44:17+10:00",
            "publisher": "NRL Chief",
            "thumbnailUrl": "http://bpvideos.telstra.insnw.net/web/images/20170428184438a_89x50.jpg",
            "largeThumbnailUrl": "http://bpvideos.telstra.insnw.net/web/images/20170428184438a_326x184.jpg",
            "programType": "Instant Replay",
            "programCategory": "Score",
            "priority": 5,
            "lastUpdateDate": "2017-04-28T19:46:47+10:00",
            "isPremium": true,
            "club": [
                500002,
                500005
            ]
        },
        {
            "id": "AyYm15YTE6h0LKUhOm9gqPiDXWvmQJTS",
            "contentId": 907890,
            "title": "Rd 9: TRY Akuila Uate (30th min)",
            "description": "Akuila Uate crosses out wide for Manly's fourth try",
            "publishDate": "2017-04-28T18:41:22+10:00",
            "publisher": "NRL Chief",
            "thumbnailUrl": "http://bpvideos.telstra.insnw.net/web/images/20170428184133a_89x50.jpg",
            "largeThumbnailUrl": "http://bpvideos.telstra.insnw.net/web/images/20170428184133a_326x184.jpg",
            "programType": "Instant Replay",
            "programCategory": "Score",
            "priority": 4,
            "lastUpdateDate": "2017-04-28T19:46:46+10:00",
            "isPremium": true,
            "club": [
                500002,
                500005
            ]
        },
        {
            "id": "40OW15YTE6dyWDPhBnkCSxx6o-9S3_Co",
            "contentId": 907889,
            "title": "Rd 9: TRY Jorge Taufua (27th min)",
            "description": "Jorge Taufua crosses for Manly's third try",
            "publishDate": "2017-04-28T18:35:22+10:00",
            "publisher": "NRL Chief",
            "thumbnailUrl": "http://bpvideos.telstra.insnw.net/web/images/20170428183532a_89x50.jpg",
            "largeThumbnailUrl": "http://bpvideos.telstra.insnw.net/web/images/20170428183532a_326x184.jpg",
            "programType": "Instant Replay",
            "programCategory": "Score",
            "priority": 3,
            "lastUpdateDate": "2017-04-28T19:45:49+10:00",
            "isPremium": true,
            "club": [
                500002,
                500005
            ]
        },
        {
            "id": "1oOG15YTE65k5XnBK7GkrmUgoyAGgUsk",
            "contentId": 907888,
            "title": "Rd 9: GOAL Dylan Walker (24th min)",
            "description": "Dylan Walker converts the try of Curtis Sironen",
            "publishDate": "2017-04-28T18:33:51+10:00",
            "publisher": "NRL Chief",
            "thumbnailUrl": "http://bpvideos.telstra.insnw.net/web/images/20170428183158a_89x50.jpg",
            "largeThumbnailUrl": "http://bpvideos.telstra.insnw.net/web/images/20170428183158a_326x184.jpg",
            "programType": "Instant Replay",
            "programCategory": "Score",
            "priority": null,
            "lastUpdateDate": "2017-04-28T18:40:31+10:00",
            "isPremium": true,
            "club": [
                500002,
                500005
            ]
        },
        {
            "id": "Q0N215YTE6YycqPPjob4qxzCilS3D97b",
            "contentId": 907887,
            "title": "Rd 9: TRY Curtis Sironen (22nd min)",
            "description": "Curtis Sironen chases down a grubber to score Manly's second try",
            "publishDate": "2017-04-28T18:30:52+10:00",
            "publisher": "NRL Chief",
            "thumbnailUrl": "http://bpvideos.telstra.insnw.net/web/images/20170428183029a_89x50.jpg",
            "largeThumbnailUrl": "http://bpvideos.telstra.insnw.net/web/images/20170428183029a_326x184.jpg",
            "programType": "Instant Replay",
            "programCategory": "Score",
            "priority": 2,
            "lastUpdateDate": "2017-04-28T19:45:49+10:00",
            "isPremium": true,
            "club": [
                500002,
                500005
            ]
        },
        {
            "id": "hpNW15YTE6Kd5Dw-pLA7Da5dX8Hb7AY7",
            "contentId": 907882,
            "title": "Rd 9: GOAL Dylan Walker (13th min)",
            "description": "Dylan Walker converts the try of Brenton Lawrence",
            "publishDate": "2017-04-28T18:23:07+10:00",
            "publisher": "NRL Chief",
            "thumbnailUrl": "http://bpvideos.telstra.insnw.net/web/images/20170428182357a_89x50.jpg",
            "largeThumbnailUrl": "http://bpvideos.telstra.insnw.net/web/images/20170428182357a_326x184.jpg",
            "programType": "Instant Replay",
            "programCategory": "Score",
            "priority": null,
            "lastUpdateDate": "2017-04-28T18:30:29+10:00",
            "isPremium": true,
            "club": [
                500002,
                500005
            ]
        },
        {
            "id": "ZmNG15YTE659hi7ab3OdTwNrf1hkmD5I",
            "contentId": 907883,
            "title": "Rd 9: TRY Brenton Lawrence (12th min)",
            "description": "A rampaging Brenton Lawrence cuts through for Manly's first try",
            "publishDate": "2017-04-28T18:21:09+10:00",
            "publisher": "NRL Chief",
            "thumbnailUrl": "http://bpvideos.telstra.insnw.net/web/images/20170428182118a_89x50.jpg",
            "largeThumbnailUrl": "http://bpvideos.telstra.insnw.net/web/images/20170428182118a_326x184.jpg",
            "programType": "Instant Replay",
            "programCategory": "Score",
            "priority": 1,
            "lastUpdateDate": "2017-04-28T19:45:49+10:00",
            "isPremium": true,
            "club": [
                500002,
                500005
            ]
        },
        {
            "id": "52MG15YTE6T_MOxCoPYsjflqIZ85UHWw",
            "contentId": 907880,
            "title": "Rd 8: PENALTY GOAL Adam Reynolds (5th min)",
            "description": "Adam Reynolds opens the scoring with a penalty goal",
            "publishDate": "2017-04-28T18:11:59+10:00",
            "publisher": "NRL Chief",
            "thumbnailUrl": "http://bpvideos.telstra.insnw.net/web/images/20170428181130a_89x50.jpg",
            "largeThumbnailUrl": "http://bpvideos.telstra.insnw.net/web/images/20170428181130a_326x184.jpg",
            "programType": "Instant Replay",
            "programCategory": "Score",
            "priority": null,
            "lastUpdateDate": "2017-04-28T18:17:26+10:00",
            "isPremium": true,
            "club": [
                500002,
                500005
            ]
        }
    ],
    "scores": [
        {
            "gameState": "First Half",
            "gameStateId": 3,
            "gameTime": "0:04:17",
            "gameSeconds": 257,
            "GameMinutes": "04:17",
            "playerId": 500086,
            "playerName": "Adam Reynolds",
            "scoreMethod": "Penalty Goal",
            "statEvent": "Penalty Shot-Made",
            "statId": 67,
            "statValue": 2,
            "vidRef": 6688,
            "homeScore": 2,
            "commentary": "Penalty Shot-Made by Adam Reynolds",
            "tackleNum": -1,
            "teamId": 500005,
            "teamName": "South Sydney Rabbitohs",
            "homeTeamAbbrv": "SOU",
            "awayTeamAbbrv": "MAN"
        },
        {
            "gameState": "Second Half",
            "gameStateId": 5,
            "gameTime": "0:49:44",
            "gameSeconds": 2984,
            "GameMinutes": "49:44",
            "playerId": 500597,
            "playerName": "Hymel Hunt",
            "scoreMethod": "Try",
            "statEvent": "Try",
            "statId": 38,
            "statValue": 4,
            "vidRef": 81897,
            "homeScore": 6,
            "awayScore": 30,
            "commentary": "Try by Hymel Hunt",
            "tackleNum": 3,
            "teamId": 500005,
            "teamName": "South Sydney Rabbitohs",
            "homeTeamAbbrv": "SOU",
            "awayTeamAbbrv": "MAN"
        },
        {
            "gameState": "Second Half",
            "gameStateId": 5,
            "gameTime": "0:50:37",
            "gameSeconds": 3037,
            "GameMinutes": "50:37",
            "playerId": 500086,
            "playerName": "Adam Reynolds",
            "scoreMethod": "Conversion",
            "statEvent": "Conversion-Made",
            "statId": 1,
            "statValue": 2,
            "vidRef": 86012,
            "homeScore": 8,
            "awayScore": 30,
            "commentary": "Conversion-Made by Adam Reynolds",
            "tackleNum": -1,
            "teamId": 500005,
            "teamName": "South Sydney Rabbitohs",
            "homeTeamAbbrv": "SOU",
            "awayTeamAbbrv": "MAN"
        },
        {
            "gameState": "First Half",
            "gameStateId": 3,
            "gameTime": "0:11:12",
            "gameSeconds": 672,
            "GameMinutes": "11:12",
            "playerId": 500025,
            "playerName": "Brenton Lawrence",
            "scoreMethod": "Try",
            "statEvent": "Try",
            "statId": 38,
            "statValue": 4,
            "vidRef": 17378,
            "homeScore": 2,
            "awayScore": 4,
            "commentary": "Try by Brenton Lawrence",
            "tackleNum": 4,
            "teamId": 500002,
            "teamName": "Manly-Warringah Sea Eagles",
            "homeTeamAbbrv": "SOU",
            "awayTeamAbbrv": "MAN"
        },
        {
            "gameState": "First Half",
            "gameStateId": 3,
            "gameTime": "0:12:40",
            "gameSeconds": 760,
            "GameMinutes": "12:40",
            "playerId": 500083,
            "playerName": "Dylan Walker",
            "scoreMethod": "Conversion",
            "statEvent": "Conversion-Made",
            "statId": 1,
            "statValue": 2,
            "vidRef": 19579,
            "homeScore": 2,
            "awayScore": 6,
            "commentary": "Conversion-Made by Dylan Walker",
            "tackleNum": -1,
            "teamId": 500002,
            "teamName": "Manly-Warringah Sea Eagles",
            "homeTeamAbbrv": "SOU",
            "awayTeamAbbrv": "MAN"
        },
        {
            "gameState": "First Half",
            "gameStateId": 3,
            "gameTime": "0:21:51",
            "gameSeconds": 1311,
            "GameMinutes": "21:51",
            "playerId": 500661,
            "playerName": "Curtis Sironen",
            "scoreMethod": "Try",
            "statEvent": "Try",
            "statId": 38,
            "statValue": 4,
            "vidRef": 34454,
            "homeScore": 2,
            "awayScore": 10,
            "commentary": "Try by Curtis Sironen",
            "tackleNum": 4,
            "teamId": 500002,
            "teamName": "Manly-Warringah Sea Eagles",
            "homeTeamAbbrv": "SOU",
            "awayTeamAbbrv": "MAN"
        },
        {
            "gameState": "First Half",
            "gameStateId": 3,
            "gameTime": "0:23:02",
            "gameSeconds": 1382,
            "GameMinutes": "23:02",
            "playerId": 500083,
            "playerName": "Dylan Walker",
            "scoreMethod": "Conversion",
            "statEvent": "Conversion-Made",
            "statId": 1,
            "statValue": 2,
            "vidRef": 38441,
            "homeScore": 2,
            "awayScore": 12,
            "commentary": "Conversion-Made by Dylan Walker",
            "tackleNum": -1,
            "teamId": 500002,
            "teamName": "Manly-Warringah Sea Eagles",
            "homeTeamAbbrv": "SOU",
            "awayTeamAbbrv": "MAN"
        },
        {
            "gameState": "First Half",
            "gameStateId": 3,
            "gameTime": "0:26:09",
            "gameSeconds": 1569,
            "GameMinutes": "26:09",
            "playerId": 500019,
            "playerName": "Jorge Taufua",
            "scoreMethod": "Try",
            "statEvent": "Try",
            "statId": 38,
            "statValue": 4,
            "vidRef": 43114,
            "homeScore": 2,
            "awayScore": 16,
            "commentary": "Try by Jorge Taufua",
            "tackleNum": 4,
            "teamId": 500002,
            "teamName": "Manly-Warringah Sea Eagles",
            "homeTeamAbbrv": "SOU",
            "awayTeamAbbrv": "MAN"
        },
        {
            "gameState": "First Half",
            "gameStateId": 3,
            "gameTime": "0:28:55",
            "gameSeconds": 1735,
            "GameMinutes": "28:55",
            "playerId": 500044,
            "playerName": "Akuila Uate",
            "scoreMethod": "Try",
            "statEvent": "Try",
            "statId": 38,
            "statValue": 4,
            "vidRef": 49092,
            "homeScore": 2,
            "awayScore": 20,
            "commentary": "Try by Akuila Uate",
            "tackleNum": 6,
            "teamId": 500002,
            "teamName": "Manly-Warringah Sea Eagles",
            "homeTeamAbbrv": "SOU",
            "awayTeamAbbrv": "MAN"
        },
        {
            "gameState": "First Half",
            "gameStateId": 3,
            "gameTime": "0:34:28",
            "gameSeconds": 2068,
            "GameMinutes": "34:28",
            "playerId": 500044,
            "playerName": "Akuila Uate",
            "scoreMethod": "Try",
            "statEvent": "Try",
            "statId": 38,
            "statValue": 4,
            "vidRef": 57712,
            "homeScore": 2,
            "awayScore": 24,
            "commentary": "Try by Akuila Uate",
            "tackleNum": 4,
            "teamId": 500002,
            "teamName": "Manly-Warringah Sea Eagles",
            "homeTeamAbbrv": "SOU",
            "awayTeamAbbrv": "MAN"
        },
        {
            "gameState": "First Half",
            "gameStateId": 3,
            "gameTime": "0:37:31",
            "gameSeconds": 2251,
            "GameMinutes": "37:31",
            "playerId": 500751,
            "playerName": "Jake Trbojevic",
            "scoreMethod": "Try",
            "statEvent": "Try",
            "statId": 38,
            "statValue": 4,
            "vidRef": 62427,
            "homeScore": 2,
            "awayScore": 28,
            "commentary": "Try by Jake Trbojevic",
            "tackleNum": 6,
            "teamId": 500002,
            "teamName": "Manly-Warringah Sea Eagles",
            "homeTeamAbbrv": "SOU",
            "awayTeamAbbrv": "MAN"
        },
        {
            "gameState": "First Half",
            "gameStateId": 3,
            "gameTime": "0:39:04",
            "gameSeconds": 2344,
            "GameMinutes": "39:04",
            "playerId": 500083,
            "playerName": "Dylan Walker",
            "scoreMethod": "Conversion",
            "statEvent": "Conversion-Made",
            "statId": 1,
            "statValue": 2,
            "vidRef": 64830,
            "homeScore": 2,
            "awayScore": 30,
            "commentary": "Conversion-Made by Dylan Walker",
            "tackleNum": -1,
            "teamId": 500002,
            "teamName": "Manly-Warringah Sea Eagles",
            "homeTeamAbbrv": "SOU",
            "awayTeamAbbrv": "MAN"
        },
        {
            "gameState": "Second Half",
            "gameStateId": 5,
            "gameTime": "0:58:11",
            "gameSeconds": 3491,
            "GameMinutes": "58:11",
            "playerId": 500044,
            "playerName": "Akuila Uate",
            "scoreMethod": "Try",
            "statEvent": "Try",
            "statId": 38,
            "statValue": 4,
            "vidRef": 98226,
            "homeScore": 8,
            "awayScore": 34,
            "commentary": "Try by Akuila Uate",
            "tackleNum": 4,
            "teamId": 500002,
            "teamName": "Manly-Warringah Sea Eagles",
            "homeTeamAbbrv": "SOU",
            "awayTeamAbbrv": "MAN"
        },
        {
            "gameState": "Second Half",
            "gameStateId": 5,
            "gameTime": "1:08:36",
            "gameSeconds": 4116,
            "GameMinutes": "68:36",
            "playerId": 500044,
            "playerName": "Akuila Uate",
            "scoreMethod": "Try",
            "statEvent": "Try",
            "statId": 38,
            "statValue": 4,
            "vidRef": 116557,
            "homeScore": 8,
            "awayScore": 38,
            "commentary": "Try by Akuila Uate",
            "tackleNum": 2,
            "teamId": 500002,
            "teamName": "Manly-Warringah Sea Eagles",
            "homeTeamAbbrv": "SOU",
            "awayTeamAbbrv": "MAN"
        },
        {
            "gameState": "Second Half",
            "gameStateId": 5,
            "gameTime": "1:10:09",
            "gameSeconds": 4209,
            "GameMinutes": "70:09",
            "playerId": 500202,
            "playerName": "Jackson Hastings",
            "scoreMethod": "Conversion",
            "statEvent": "Conversion-Made",
            "statId": 1,
            "statValue": 2,
            "vidRef": 118869,
            "homeScore": 8,
            "awayScore": 40,
            "commentary": "Conversion-Made by Jackson Hastings",
            "tackleNum": -1,
            "teamId": 500002,
            "teamName": "Manly-Warringah Sea Eagles",
            "homeTeamAbbrv": "SOU",
            "awayTeamAbbrv": "MAN"
        },
        {
            "gameState": "Second Half",
            "gameStateId": 5,
            "gameTime": "1:11:34",
            "gameSeconds": 4294,
            "GameMinutes": "71:34",
            "playerId": 502209,
            "playerName": "Blake Green",
            "scoreMethod": "Try",
            "statEvent": "Try",
            "statId": 38,
            "statValue": 4,
            "vidRef": 121006,
            "homeScore": 8,
            "awayScore": 44,
            "commentary": "Try by Blake Green",
            "tackleNum": 4,
            "teamId": 500002,
            "teamName": "Manly-Warringah Sea Eagles",
            "homeTeamAbbrv": "SOU",
            "awayTeamAbbrv": "MAN"
        },
        {
            "gameState": "Second Half",
            "gameStateId": 5,
            "gameTime": "1:12:58",
            "gameSeconds": 4378,
            "GameMinutes": "72:58",
            "playerId": 500202,
            "playerName": "Jackson Hastings",
            "scoreMethod": "Conversion",
            "statEvent": "Conversion-Made",
            "statId": 1,
            "statValue": 2,
            "vidRef": 123095,
            "homeScore": 8,
            "awayScore": 46,
            "commentary": "Conversion-Made by Jackson Hastings",
            "tackleNum": -1,
            "teamId": 500002,
            "teamName": "Manly-Warringah Sea Eagles",
            "homeTeamAbbrv": "SOU",
            "awayTeamAbbrv": "MAN"
        }
    ],
    "twitter": [
        {
            "id": "857889211562696704",
            "gameSeconds": 3720
        },
        {
            "id": "857888970092367872",
            "gameSeconds": 3720
        },
        {
            "id": "857886098680238080",
            "gameSeconds": 3000
        },
        {
            "id": "857885699915239425",
            "gameSeconds": 3000
        },
        {
            "id": "857874465706856448",
            "gameSeconds": 1320
        },
        {
            "id": "857874187561521152",
            "gameSeconds": 1320
        }
    ]
}