{
    "vod": [
        {
            "id": "lzM29lNTE65hGuy1ALGh8OeSTOjYugF2",
            "contentId": 871513,
            "title": "Rd 24: Broncos v Bulldogs (Hls)",
            "description": "Highlights of the match between the Broncos and Bulldogs from Suncorp Stadium",
            "publishDate": "2016-08-18T22:02:00+10:00",
            "publisher": "NRL Chief",
            "thumbnailUrl": "http://bigpondvideo.com/web/images/content/20160818214434a_89x50.jpg",
            "largeThumbnailUrl": "http://bigpondvideo.com/web/images/content/20160818214434a_326x184.jpg",
            "programType": "Highlights",
            "programCategory": "Match",
            "priority": null,
            "lastUpdateDate": "2016-08-18T22:06:36+10:00",
            "isPremium": false,
            "club": [
                500011,
                500010
            ]
        },
        {
            "id": "xvbm9lNTE6yz0pnZd8H3C-a-bNXJEwfp",
            "contentId": 871522,
            "title": "Rd 24 Press Conference: Bulldogs",
            "description": "The Bulldogs coach faces the media following the match",
            "publishDate": "2016-08-18T22:39:00+10:00",
            "publisher": "NRL Chief",
            "thumbnailUrl": "http://bigpondvideo.com/web/images/content/20160818222440a_89x50.jpg",
            "largeThumbnailUrl": "http://bigpondvideo.com/web/images/content/20160818222440a_326x184.jpg",
            "programType": "Press Conference",
            "programCategory": null,
            "priority": null,
            "lastUpdateDate": "2016-08-18T22:43:45+10:00",
            "isPremium": false,
            "club": [
                500011,
                500010
            ]
        },
        {
            "id": "k3b29lNTE6i0D6yRA0flBQv_NpqLLQ3h",
            "contentId": 871521,
            "title": "Rd 24 Press Conference: Broncos",
            "description": "The Broncos coach faces the media following the match",
            "publishDate": "2016-08-18T22:38:00+10:00",
            "publisher": "NRL Chief",
            "thumbnailUrl": "http://bigpondvideo.com/web/images/content/20160818222426a_89x50.jpg",
            "largeThumbnailUrl": "http://bigpondvideo.com/web/images/content/20160818222426a_326x184.jpg",
            "programType": "Press Conference",
            "programCategory": null,
            "priority": null,
            "lastUpdateDate": "2016-08-18T22:44:45+10:00",
            "isPremium": false,
            "club": [
                500011,
                500010
            ]
        },
        {
            "id": "gydW5lNTE6Cw1ITfcVdGdS-4NJHZ3b9z",
            "contentId": 871262,
            "title": "Rd 24: PENALTY GOAL Jordan Kahu (80th min)",
            "description": "Penalty goal to the Broncos gives them a win 20-10 victory over the Bulldogs",
            "publishDate": "2016-08-18T21:41:00+10:00",
            "publisher": "NRL Chief",
            "thumbnailUrl": "http://bigpondvideo.com/web/images/content/20160818214257a_89x50.jpg",
            "largeThumbnailUrl": "http://bigpondvideo.com/web/images/content/20160818214257a_326x184.jpg",
            "programType": "Instant Replay",
            "programCategory": "Score",
            "priority": 1,
            "lastUpdateDate": "2016-08-18T21:46:32+10:00",
            "isPremium": true,
            "club": [
                500011,
                500010
            ]
        },
        {
            "id": "tubm5lNTE6_4YF59NTedFyP1wFrVVSCg",
            "contentId": 871261,
            "title": "Rd 24: GOAL Moses Mbye (70th min)",
            "description": "Conversion sees the Bulldogs trail 18-10",
            "publishDate": "2016-08-18T21:29:00+10:00",
            "publisher": "NRL Chief",
            "thumbnailUrl": "http://bigpondvideo.com/web/images/content/20160818212934a_89x50.jpg",
            "largeThumbnailUrl": "http://bigpondvideo.com/web/images/content/20160818212934a_326x184.jpg",
            "programType": "Instant Replay",
            "programCategory": "Score",
            "priority": 2,
            "lastUpdateDate": "2016-08-18T21:41:30+10:00",
            "isPremium": true,
            "club": [
                500011,
                500010
            ]
        },
        {
            "id": "Jmbm5lNTE6s_vbqJHYoPEqk0FGQ4HWDd",
            "contentId": 871260,
            "title": "Rd 24: TRY Sam Kasiano (69th min)",
            "description": "The Bulldogs go over as the big man Sam Kasiano powers through the Broncos defense to score",
            "publishDate": "2016-08-18T21:28:00+10:00",
            "publisher": "NRL Chief",
            "thumbnailUrl": "http://bigpondvideo.com/web/images/content/20160818212908a_89x50.jpg",
            "largeThumbnailUrl": "http://bigpondvideo.com/web/images/content/20160818212908a_326x184.jpg",
            "programType": "Instant Replay",
            "programCategory": "Score",
            "priority": 3,
            "lastUpdateDate": "2016-08-18T21:41:30+10:00",
            "isPremium": true,
            "club": [
                500011,
                500010
            ]
        },
        {
            "id": "lpa25lNTE6WTLr9K7InawMqdVGyiba7w",
            "contentId": 871259,
            "title": "Rd 24: PENALTY GOAL Jordan Kahu (63rd min)",
            "description": "Penalty goal to the Broncos takes them out to a 18-4 lead",
            "publishDate": "2016-08-18T21:19:00+10:00",
            "publisher": "NRL Chief",
            "thumbnailUrl": "http://bigpondvideo.com/web/images/content/20160818212107a_89x50.jpg",
            "largeThumbnailUrl": "http://bigpondvideo.com/web/images/content/20160818212107a_326x184.jpg",
            "programType": "Instant Replay",
            "programCategory": "Score",
            "priority": 4,
            "lastUpdateDate": "2016-08-18T21:41:30+10:00",
            "isPremium": true,
            "club": [
                500011,
                500010
            ]
        },
        {
            "id": "hxaW5lNTE6G9Md9ZwmjhPK4H-5AxV26X",
            "contentId": 871258,
            "title": "Rd 24: GOAL Jordan Kahu (59th min)",
            "description": "Conversion sees the Broncos lead 16-8",
            "publishDate": "2016-08-18T21:15:00+10:00",
            "publisher": "NRL Chief",
            "thumbnailUrl": "http://bigpondvideo.com/web/images/content/20160818211604a_89x50.jpg",
            "largeThumbnailUrl": "http://bigpondvideo.com/web/images/content/20160818211604a_326x184.jpg",
            "programType": "Instant Replay",
            "programCategory": "Score",
            "priority": 5,
            "lastUpdateDate": "2016-08-18T21:41:30+10:00",
            "isPremium": true,
            "club": [
                500011,
                500010
            ]
        },
        {
            "id": "hjaW5lNTE6J7p_AfwjbhpknnWpP1x-0J",
            "contentId": 871257,
            "title": "Rd 24: TRY Sam Thaiday (57th min)",
            "description": "The Broncos go further in front as Sam Thaiday powers over out wide",
            "publishDate": "2016-08-18T21:14:00+10:00",
            "publisher": "NRL Chief",
            "thumbnailUrl": "http://bigpondvideo.com/web/images/content/20160818211506a_89x50.jpg",
            "largeThumbnailUrl": "http://bigpondvideo.com/web/images/content/20160818211506a_326x184.jpg",
            "programType": "Instant Replay",
            "programCategory": "Score",
            "priority": 6,
            "lastUpdateDate": "2016-08-18T21:40:30+10:00",
            "isPremium": true,
            "club": [
                500011,
                500010
            ]
        },
        {
            "id": "J2MW5lNTE6CJb227G99vbGb8m2wHVkBr",
            "contentId": 871256,
            "title": "Rd 24: GOAL Jordan Kahu (40th min)",
            "description": "Conversion sees the Broncos lead 10-4",
            "publishDate": "2016-08-18T20:41:00+10:00",
            "publisher": "NRL Chief",
            "thumbnailUrl": "http://bigpondvideo.com/web/images/content/20160818204250a_89x50.jpg",
            "largeThumbnailUrl": "http://bigpondvideo.com/web/images/content/20160818204250a_326x184.jpg",
            "programType": "Instant Replay",
            "programCategory": "Score",
            "priority": 7,
            "lastUpdateDate": "2016-08-18T21:40:29+10:00",
            "isPremium": true,
            "club": [
                500011,
                500010
            ]
        },
        {
            "id": "J4MW5lNTE66cTrFYmvK13CW-jbmlVwZZ",
            "contentId": 871255,
            "title": "Rd 24: TRY Ben Hunt (40th min)",
            "description": "The Broncos strike right on the stroke of half time as Ben Hunt kicks and regathers to score his 7th try for the year",
            "publishDate": "2016-08-18T20:40:00+10:00",
            "publisher": "NRL Chief",
            "thumbnailUrl": "http://bigpondvideo.com/web/images/content/20160818204134a_89x50.jpg",
            "largeThumbnailUrl": "http://bigpondvideo.com/web/images/content/20160818204134a_326x184.jpg",
            "programType": "Instant Replay",
            "programCategory": "Score",
            "priority": 8,
            "lastUpdateDate": "2016-08-18T21:40:29+10:00",
            "isPremium": true,
            "club": [
                500011,
                500010
            ]
        },
        {
            "id": "Z4dW1lNTE63YwuldacU6dyEL4zdWJGmZ",
            "contentId": 871254,
            "title": "Rd 24: TRY Brett Morris (28th min)",
            "description": "The Bulldogs strike back as Brett Morris crosses for his 10th try for the season",
            "publishDate": "2016-08-18T20:30:00+10:00",
            "publisher": "NRL Chief",
            "thumbnailUrl": "http://bigpondvideo.com/web/images/content/20160818203024a_89x50.jpg",
            "largeThumbnailUrl": "http://bigpondvideo.com/web/images/content/20160818203024a_326x184.jpg",
            "programType": "Instant Replay",
            "programCategory": "Score",
            "priority": 9,
            "lastUpdateDate": "2016-08-18T21:40:29+10:00",
            "isPremium": true,
            "club": [
                500011,
                500010
            ]
        },
        {
            "id": "9ob21lNTE6FSCagSjjdWiU5QBndUcND3",
            "contentId": 871253,
            "title": "Rd 24: TRY Tom Opacic (12th min)",
            "description": "The Broncos open the scoring in this match as they put it through the hands to see Tom Opacic cross in the corner",
            "publishDate": "2016-08-18T20:12:00+10:00",
            "publisher": "NRL Chief",
            "thumbnailUrl": "http://bigpondvideo.com/web/images/content/20160818201343a_89x50.jpg",
            "largeThumbnailUrl": "http://bigpondvideo.com/web/images/content/20160818201343a_326x184.jpg",
            "programType": "Instant Replay",
            "programCategory": "Score",
            "priority": 10,
            "lastUpdateDate": "2016-08-18T21:39:30+10:00",
            "isPremium": true,
            "club": [
                500011,
                500010
            ]
        }
    ],
    "scores": [
        {
            "gameState": "First Half",
            "gameStateId": 3,
            "gameTime": "0:11:58",
            "gameSeconds": 718,
            "GameMinutes": "11:58",
            "playerId": 500154,
            "playerName": "Tom Opacic",
            "scoreMethod": "Try",
            "statEvent": "Try",
            "statId": 38,
            "statValue": 4,
            "vidRef": 19180,
            "homeScore": 4,
            "commentary": "Try by Tom Opacic",
            "tackleNum": 5,
            "teamId": 500011,
            "teamName": "Brisbane Broncos",
            "homeTeamAbbrv": "BRI",
            "awayTeamAbbrv": "CBY"
        },
        {
            "gameState": "First Half",
            "gameStateId": 3,
            "gameTime": "0:39:19",
            "gameSeconds": 2359,
            "GameMinutes": "39:19",
            "playerId": 500257,
            "playerName": "Ben Hunt",
            "scoreMethod": "Try",
            "statEvent": "Try",
            "statId": 38,
            "statValue": 4,
            "vidRef": 62675,
            "homeScore": 8,
            "awayScore": 4,
            "commentary": "Try by Ben Hunt",
            "tackleNum": 5,
            "teamId": 500011,
            "teamName": "Brisbane Broncos",
            "homeTeamAbbrv": "BRI",
            "awayTeamAbbrv": "CBY"
        },
        {
            "gameState": "First Half",
            "gameStateId": 3,
            "gameTime": "0:40:00",
            "gameSeconds": 2400,
            "GameMinutes": "40:00",
            "playerId": 500258,
            "playerName": "Jordan Kahu",
            "scoreMethod": "Conversion",
            "statEvent": "Conversion-Made",
            "statId": 1,
            "statValue": 2,
            "vidRef": 64779,
            "homeScore": 10,
            "awayScore": 4,
            "commentary": "Conversion-Made by Jordan Kahu",
            "tackleNum": -1,
            "teamId": 500011,
            "teamName": "Brisbane Broncos",
            "homeTeamAbbrv": "BRI",
            "awayTeamAbbrv": "CBY"
        },
        {
            "gameState": "Second Half",
            "gameStateId": 5,
            "gameTime": "0:56:46",
            "gameSeconds": 3406,
            "GameMinutes": "56:46",
            "playerId": 500273,
            "playerName": "Sam Thaiday",
            "scoreMethod": "Try",
            "statEvent": "Try",
            "statId": 38,
            "statValue": 4,
            "vidRef": 91718,
            "homeScore": 14,
            "awayScore": 4,
            "commentary": "Try by Sam Thaiday",
            "tackleNum": 4,
            "teamId": 500011,
            "teamName": "Brisbane Broncos",
            "homeTeamAbbrv": "BRI",
            "awayTeamAbbrv": "CBY"
        },
        {
            "gameState": "Second Half",
            "gameStateId": 5,
            "gameTime": "0:58:04",
            "gameSeconds": 3484,
            "GameMinutes": "58:04",
            "playerId": 500258,
            "playerName": "Jordan Kahu",
            "scoreMethod": "Conversion",
            "statEvent": "Conversion-Made",
            "statId": 1,
            "statValue": 2,
            "vidRef": 93723,
            "homeScore": 16,
            "awayScore": 4,
            "commentary": "Conversion-Made by Jordan Kahu",
            "tackleNum": -1,
            "teamId": 500011,
            "teamName": "Brisbane Broncos",
            "homeTeamAbbrv": "BRI",
            "awayTeamAbbrv": "CBY"
        },
        {
            "gameState": "Second Half",
            "gameStateId": 5,
            "gameTime": "1:02:30",
            "gameSeconds": 3750,
            "GameMinutes": "62:30",
            "playerId": 500258,
            "playerName": "Jordan Kahu",
            "scoreMethod": "Penalty Goal",
            "statEvent": "Penalty Shot-Made",
            "statId": 67,
            "statValue": 2,
            "vidRef": 100374,
            "homeScore": 18,
            "awayScore": 4,
            "commentary": "Penalty Shot-Made by Jordan Kahu",
            "tackleNum": -1,
            "teamId": 500011,
            "teamName": "Brisbane Broncos",
            "homeTeamAbbrv": "BRI",
            "awayTeamAbbrv": "CBY"
        },
        {
            "gameState": "Second Half",
            "gameStateId": 5,
            "gameTime": "1:20:00",
            "gameSeconds": 4800,
            "GameMinutes": "80:00",
            "playerId": 500258,
            "playerName": "Jordan Kahu",
            "scoreMethod": "Penalty Goal",
            "statEvent": "Penalty Shot-Made",
            "statId": 67,
            "statValue": 2,
            "vidRef": 131431,
            "homeScore": 20,
            "awayScore": 10,
            "commentary": "Penalty Shot-Made by Jordan Kahu",
            "tackleNum": -1,
            "teamId": 500011,
            "teamName": "Brisbane Broncos",
            "homeTeamAbbrv": "BRI",
            "awayTeamAbbrv": "CBY"
        },
        {
            "gameState": "First Half",
            "gameStateId": 3,
            "gameTime": "0:27:55",
            "gameSeconds": 1675,
            "GameMinutes": "27:55",
            "playerId": 500633,
            "playerName": "Brett Morris",
            "scoreMethod": "Try",
            "statEvent": "Try",
            "statId": 38,
            "statValue": 4,
            "vidRef": 44570,
            "homeScore": 4,
            "awayScore": 4,
            "commentary": "Try by Brett Morris",
            "tackleNum": 4,
            "teamId": 500010,
            "teamName": "Canterbury-Bankstown Bulldogs",
            "homeTeamAbbrv": "BRI",
            "awayTeamAbbrv": "CBY"
        },
        {
            "gameState": "Second Half",
            "gameStateId": 5,
            "gameTime": "1:08:47",
            "gameSeconds": 4127,
            "GameMinutes": "68:47",
            "playerId": 500227,
            "playerName": "Sam Kasiano",
            "scoreMethod": "Try",
            "statEvent": "Try",
            "statId": 38,
            "statValue": 4,
            "vidRef": 111224,
            "homeScore": 18,
            "awayScore": 8,
            "commentary": "Try by Sam Kasiano",
            "tackleNum": 3,
            "teamId": 500010,
            "teamName": "Canterbury-Bankstown Bulldogs",
            "homeTeamAbbrv": "BRI",
            "awayTeamAbbrv": "CBY"
        },
        {
            "gameState": "Second Half",
            "gameStateId": 5,
            "gameTime": "1:09:31",
            "gameSeconds": 4171,
            "GameMinutes": "69:31",
            "playerId": 500243,
            "playerName": "Moses Mbye",
            "scoreMethod": "Conversion",
            "statEvent": "Conversion-Made",
            "statId": 1,
            "statValue": 2,
            "vidRef": 112332,
            "homeScore": 18,
            "awayScore": 10,
            "commentary": "Conversion-Made by Moses Mbye",
            "tackleNum": -1,
            "teamId": 500010,
            "teamName": "Canterbury-Bankstown Bulldogs",
            "homeTeamAbbrv": "BRI",
            "awayTeamAbbrv": "CBY"
        }
    ]
}