{
    "competitionId": 111,
    "competitionName": "NRL Telstra Premiership",
    "gameId": 20151110670,
    "gameInfo": {
        "assistantReferee1Id": 500038,
        "numberOfPeriods": 2,
        "assistantReferee1Name": "Michael Wise",
        "assistantReferee2Id": 500114,
        "assistantReferee2Name": "Clayton Sharpe",
        "gameDate": "2015-04-12",
        "gameHashTag": "#NRLDragonsBulldogs",
        "gameNumber": 7,
        "gameSeconds": 4800,
        "gameTime": "1:20:00",
        "groundConditionId": 1,
        "groundConditionName": "N/A",
        "referee1Id": 500016,
        "referee1Name": "Ben Cummins",
        "referee2Id": 500070,
        "referee2Name": "Matt Noyen",
        "startTime": "2015-04-12T16:00:00",
        "startTimeUTC": "2015-04-12T06:00:00Z",
        "venueId": 500002,
        "venueName": "ANZ Stadium",
        "videoReferee1Id": 500232,
        "videoReferee1Name": "Luke Patten",
        "videoReferee2Id": 500039,
        "videoReferee2Name": "Ashley Klein",
        "weatherId": 2,
        "weatherName": "Fine"
    },
    "gameState": "Final",
    "gameStateId": 8,
    "roundId": 6,
    "seasonId": 2015,
    "teams": {
        "teamsMatch": [
            {
                "isHomeTeam": true,
                "score": {
                    "conversions": 5,
                    "points": 31,
                    "fieldGoals": 1,
                    "tries": 5
                },
                "team1stHalfScore": 18,
                "team2ndHalfScore": 13,
                "teamAbbr": "SGI",
                "teamFinalScore": 31,
                "teamFullTimeScore": 31,
                "teamHalfTimeScore": 18,
                "teamId": 500022,
                "teamLineup": {
                    "injuriesAndSuspensions": {
                        "injury": [],
                        "suspension": []
                    },
                    "insAndOuts": {
                        "inOut": [
                            {
                                "inOut": "In",
                                "playerFirstName": "Ben",
                                "playerId": "500618",
                                "playerLastName": "Creagh",
                                "playerName": "Ben Creagh"
                            },
                            {
                                "inOut": "Out",
                                "playerFirstName": "Jason",
                                "playerId": "500634",
                                "playerLastName": "Nightingale",
                                "playerName": "Jason Nightingale"
                            },
                            {
                                "inOut": "Out",
                                "playerFirstName": "Mike",
                                "playerId": "501282",
                                "playerLastName": "Cooper",
                                "playerName": "Mike Cooper"
                            },
                            {
                                "inOut": "In",
                                "playerFirstName": "Peter",
                                "playerId": "500630",
                                "playerLastName": "Mata'utia",
                                "playerName": "Peter Mata'utia"
                            }
                        ]
                    },
                    "teamPlayer": [
                        {
                            "playerFirstName": "Josh",
                            "playerId": 500621,
                            "playerLastName": "Dugan",
                            "playerName": "Josh Dugan",
                            "playerPosition": "Fullback",
                            "playerPositionId": 500001,
                            "playerStats": {
                                "allRunMetres": 141,
                                "allRuns": 19,
                                "decoys": 1,
                                "dummyHalfRuns": 2,
                                "errors": 2,
                                "fantasyPointsTotal": 54,
                                "hitUps": 1,
                                "kickReturnMetres": 33,
                                "kickReturns": 5,
                                "kicksDefused": 1,
                                "lineDropouts": 3,
                                "linebreaks": 1,
                                "mins": 72,
                                "missedTackles": 1,
                                "offloads": 1,
                                "supports": 9,
                                "tackleBreaks": 5,
                                "tackles": 6,
                                "tries": 1,
                                "trySaves": 2,
                                "hitupRunMeters": 12,
                                "evasionRuns": 11,
                                "evasionRunMetres": 83,
                                "dummyHalfRunMetres": 13,
                                "ptbFast": 7.14,
                                "ptbNeutral": 71.43,
                                "ptbSlow": 21.43,
                                "ptbAll": 14
                            },
                            "playerTookTheField": true,
                            "shirtNum": 1
                        },
                        {
                            "playerFirstName": "Etonia",
                            "playerId": 500357,
                            "playerLastName": "Nabuli",
                            "playerName": "Etonia Nabuli",
                            "playerPosition": "Winger 1",
                            "playerPositionId": 500002,
                            "playerStats": {
                                "allRunMetres": 76,
                                "allRuns": 11,
                                "dummyHalfRuns": 1,
                                "errors": 2,
                                "fantasyPointsTotal": 1,
                                "ineffectiveTackles": 2,
                                "kickReturns": 1,
                                "kicksDefused": 2,
                                "mins": 80,
                                "missedTackles": 3,
                                "oneOnOneTackles": 1,
                                "supports": 12,
                                "tackles": 2,
                                "evasionRuns": 9,
                                "evasionRunMetres": 71,
                                "dummyHalfRunMetres": 5,
                                "ptbNeutral": 100,
                                "ptbAll": 8
                            },
                            "playerTookTheField": true,
                            "shirtNum": 2
                        },
                        {
                            "playerFirstName": "Euan",
                            "playerId": 500441,
                            "playerLastName": "Aitken",
                            "playerName": "Euan Aitken",
                            "playerPosition": "Centre 1",
                            "playerPositionId": 500003,
                            "playerStats": {
                                "allRunMetres": 113,
                                "allRuns": 12,
                                "dummyHalfRuns": 2,
                                "fantasyPointsTotal": 50,
                                "ineffectiveTackles": 1,
                                "mins": 80,
                                "oneOnOneTackles": 4,
                                "supports": 11,
                                "tackleBreaks": 1,
                                "tackles": 23,
                                "tries": 1,
                                "trySaves": 1,
                                "evasionRuns": 10,
                                "evasionRunMetres": 84,
                                "dummyHalfRunMetres": 29,
                                "ptbFast": 8.33,
                                "ptbNeutral": 83.33,
                                "ptbSlow": 8.33,
                                "ptbAll": 12
                            },
                            "playerTookTheField": true,
                            "shirtNum": 3
                        },
                        {
                            "playerFirstName": "Dylan",
                            "playerId": 500084,
                            "playerLastName": "Farrell",
                            "playerName": "Dylan Farrell",
                            "playerPosition": "Centre 2",
                            "playerPositionId": 500004,
                            "playerStats": {
                                "allRunMetres": 61,
                                "allRuns": 9,
                                "decoys": 1,
                                "dummyHalfRuns": 2,
                                "errors": 1,
                                "fantasyPointsTotal": 31,
                                "ineffectiveTackles": 1,
                                "kicksDefused": 1,
                                "mins": 80,
                                "missedTackles": 4,
                                "offloads": 1,
                                "oneOnOneTackles": 2,
                                "supports": 5,
                                "tackles": 32,
                                "tryCause": 1,
                                "evasionRuns": 7,
                                "evasionRunMetres": 46,
                                "dummyHalfRunMetres": 15,
                                "ptbFast": 11.11,
                                "ptbNeutral": 88.89,
                                "ptbAll": 9
                            },
                            "playerTookTheField": true,
                            "shirtNum": 4
                        },
                        {
                            "playerFirstName": "Peter",
                            "playerId": 500630,
                            "playerLastName": "Mata'utia",
                            "playerName": "Peter Mata'utia",
                            "playerPosition": "Winger 2",
                            "playerPositionId": 500005,
                            "playerStats": {
                                "allRunMetres": 199,
                                "allRuns": 16,
                                "bombKicksDefused": 1,
                                "decoys": 1,
                                "errors": 1,
                                "fantasyPointsTotal": 50,
                                "ineffectiveTackles": 2,
                                "kickReturnMetres": 79,
                                "kickReturns": 6,
                                "kicks": 1,
                                "kicksDefused": 6,
                                "linebreaks": 2,
                                "mins": 80,
                                "missedTackles": 1,
                                "supports": 4,
                                "tackleBreaks": 3,
                                "tackles": 4,
                                "tries": 1,
                                "evasionRuns": 10,
                                "evasionRunMetres": 120,
                                "ptbNeutral": 100,
                                "ptbAll": 15
                            },
                            "playerTookTheField": true,
                            "shirtNum": 21
                        },
                        {
                            "playerFirstName": "Gareth",
                            "playerId": 500641,
                            "playerLastName": "Widdop",
                            "playerName": "Gareth Widdop",
                            "playerPosition": "Five-eighth",
                            "playerPositionId": 500006,
                            "playerStats": {
                                "allRunMetres": 49,
                                "allRuns": 8,
                                "bombKicks": 1,
                                "bombKickMetres": 34,
                                "bombKicksDefused": 1,
                                "conversions": 5,
                                "conversionsAttempts": 5,
                                "errors": 2,
                                "fantasyPointsTotal": 48,
                                "kickMetres": 157,
                                "kickReturnMetres": 11,
                                "kickReturns": 2,
                                "kicks": 6,
                                "kicksDefused": 3,
                                "linebreakAssists": 1,
                                "mins": 80,
                                "missedTackles": 2,
                                "offloads": 1,
                                "oneOnOneTackles": 1,
                                "supports": 11,
                                "tackleBreaks": 1,
                                "tackles": 10,
                                "tryAssists": 2,
                                "trySaves": 1,
                                "evasionRuns": 6,
                                "evasionRunMetres": 38,
                                "ptbNeutral": 80,
                                "ptbSlow": 20,
                                "ptbAll": 5
                            },
                            "playerTookTheField": true,
                            "shirtNum": 6
                        },
                        {
                            "playerFirstName": "Benji",
                            "playerId": 500948,
                            "playerLastName": "Marshall",
                            "playerName": "Benji Marshall",
                            "playerPosition": "Halfback",
                            "playerPositionId": 500007,
                            "playerStats": {
                                "allRunMetres": 32,
                                "allRuns": 7,
                                "bombKicks": 1,
                                "bombKickMetres": 33,
                                "errors": 1,
                                "fantasyPointsTotal": 38,
                                "fieldGoalConversionRate": 100,
                                "fieldGoals": 1,
                                "fieldGoalsAttempts": 1,
                                "ineffectiveTackles": 4,
                                "kickMetres": 343,
                                "kicks": 11,
                                "linebreakAssists": 2,
                                "mins": 80,
                                "missedTackles": 4,
                                "supports": 1,
                                "tackles": 9,
                                "tryAssists": 2,
                                "tryCause": 1,
                                "evasionRuns": 7,
                                "evasionRunMetres": 32,
                                "ptbNeutral": 100,
                                "ptbAll": 3
                            },
                            "playerTookTheField": true,
                            "shirtNum": 7
                        },
                        {
                            "playerFirstName": "Leeson",
                            "playerId": 500614,
                            "playerLastName": "Ah Mau",
                            "playerName": "Leeson Ah Mau",
                            "playerPosition": "Prop 1",
                            "playerPositionId": 500008,
                            "playerStats": {
                                "allRunMetres": 78,
                                "allRuns": 7,
                                "decoys": 3,
                                "fantasyPointsTotal": 27,
                                "hitUps": 7,
                                "mins": 31,
                                "supports": 9,
                                "tackles": 20,
                                "hitupRunMeters": 78,
                                "ptbNeutral": 100,
                                "ptbAll": 7
                            },
                            "playerTookTheField": true,
                            "shirtNum": 8
                        },
                        {
                            "playerFirstName": "Mitch",
                            "playerId": 500636,
                            "playerLastName": "Rein",
                            "playerName": "Mitch Rein",
                            "playerPosition": "Hooker",
                            "playerPositionId": 500009,
                            "playerStats": {
                                "allRunMetres": 39,
                                "allRuns": 6,
                                "chargedDown": 1,
                                "dummyHalfRuns": 5,
                                "fantasyPointsTotal": 54,
                                "hitUps": 1,
                                "ineffectiveTackles": 5,
                                "kickMetres": 44,
                                "kicks": 2,
                                "linebreakAssists": 1,
                                "mins": 54,
                                "offloads": 1,
                                "supports": 1,
                                "tackleBreaks": 2,
                                "tackles": 34,
                                "tryAssists": 1,
                                "hitupRunMeters": 7,
                                "dummyHalfRunMetres": 32,
                                "ptbNeutral": 100,
                                "ptbAll": 4
                            },
                            "playerTookTheField": true,
                            "shirtNum": 9
                        },
                        {
                            "playerFirstName": "Ben",
                            "playerId": 500618,
                            "playerLastName": "Creagh",
                            "playerName": "Ben Creagh",
                            "playerPosition": "Prop 2",
                            "playerPositionId": 500010,
                            "playerStats": {
                                "allRunMetres": 106,
                                "allRuns": 10,
                                "fantasyPointsTotal": 30,
                                "hitUps": 9,
                                "ineffectiveTackles": 3,
                                "kickReturnMetres": 10,
                                "kickReturns": 1,
                                "mins": 48,
                                "missedTackles": 2,
                                "offloads": 1,
                                "oneOnOneTackles": 1,
                                "penalties": 1,
                                "supports": 4,
                                "tackles": 24,
                                "hitupRunMeters": 96,
                                "ptbFast": 22.22,
                                "ptbNeutral": 77.78,
                                "ptbAll": 9
                            },
                            "playerTookTheField": true,
                            "shirtNum": 24
                        },
                        {
                            "playerFirstName": "Tyson",
                            "playerId": 500622,
                            "playerLastName": "Frizell",
                            "playerName": "Tyson Frizell",
                            "playerPosition": "2nd Row 1",
                            "playerPositionId": 500011,
                            "playerStats": {
                                "allRunMetres": 96,
                                "allRuns": 8,
                                "decoys": 4,
                                "fantasyPointsTotal": 76,
                                "hitUps": 7,
                                "ineffectiveTackles": 1,
                                "linebreaks": 1,
                                "mins": 80,
                                "missedTackles": 2,
                                "offloads": 1,
                                "onReport": 1,
                                "oneOnOneTackles": 3,
                                "penalties": 1,
                                "supports": 3,
                                "tackleBreaks": 4,
                                "tackles": 42,
                                "tries": 1,
                                "tryCause": 1,
                                "trySaves": 1,
                                "hitupRunMeters": 87,
                                "evasionRuns": 1,
                                "evasionRunMetres": 9,
                                "ptbNeutral": 80,
                                "ptbSlow": 20,
                                "ptbAll": 5
                            },
                            "playerTookTheField": true,
                            "shirtNum": 11
                        },
                        {
                            "playerFirstName": "Joel",
                            "playerId": 500640,
                            "playerLastName": "Thompson",
                            "playerName": "Joel Thompson",
                            "playerPosition": "2nd Row 2",
                            "playerPositionId": 500012,
                            "playerStats": {
                                "allRunMetres": 89,
                                "allRuns": 9,
                                "decoys": 3,
                                "fantasyPointsTotal": 56,
                                "hitUps": 9,
                                "ineffectiveTackles": 1,
                                "linebreaks": 1,
                                "mins": 76,
                                "missedTackles": 1,
                                "oneOnOneTackles": 3,
                                "penalties": 1,
                                "supports": 3,
                                "tackleBreaks": 3,
                                "tackles": 31,
                                "tries": 1,
                                "hitupRunMeters": 89,
                                "ptbFast": 20,
                                "ptbNeutral": 80,
                                "ptbAll": 10
                            },
                            "playerTookTheField": true,
                            "shirtNum": 12
                        },
                        {
                            "playerFirstName": "Trent",
                            "playerId": 500632,
                            "playerLastName": "Merrin",
                            "playerName": "Trent Merrin",
                            "playerPosition": "Lock",
                            "playerPositionId": 500013,
                            "playerStats": {
                                "allRunMetres": 106,
                                "allRuns": 12,
                                "decoys": 7,
                                "errors": 1,
                                "fantasyPointsTotal": 42,
                                "hitUps": 10,
                                "kickReturnMetres": 14,
                                "kickReturns": 2,
                                "mins": 54,
                                "missedTackles": 4,
                                "oneOnOneTackles": 1,
                                "supports": 3,
                                "tackleBreaks": 1,
                                "tackles": 39,
                                "hitupRunMeters": 92,
                                "ptbFast": 27.27,
                                "ptbNeutral": 63.64,
                                "ptbSlow": 9.09,
                                "ptbAll": 11
                            },
                            "playerTookTheField": true,
                            "shirtNum": 13
                        },
                        {
                            "playerFirstName": "George",
                            "playerId": 500034,
                            "playerLastName": "Rose",
                            "playerName": "George Rose",
                            "playerPosition": "Interchange",
                            "playerPositionId": 500014,
                            "playerStats": {
                                "allRunMetres": 71,
                                "allRuns": 7,
                                "fantasyPointsTotal": 16,
                                "hitUps": 4,
                                "kickReturnMetres": 20,
                                "kickReturns": 2,
                                "mins": 22,
                                "missedTackles": 2,
                                "offloads": 1,
                                "supports": 1,
                                "tackles": 11,
                                "hitupRunMeters": 44,
                                "evasionRuns": 1,
                                "evasionRunMetres": 7,
                                "ptbNeutral": 100,
                                "ptbAll": 5
                            },
                            "playerTookTheField": true,
                            "shirtNum": 14
                        },
                        {
                            "playerFirstName": "Jack",
                            "playerId": 500619,
                            "playerLastName": "de Belin",
                            "playerName": "Jack de Belin",
                            "playerPosition": "Interchange",
                            "playerPositionId": 500014,
                            "playerStats": {
                                "allRunMetres": 160,
                                "allRuns": 16,
                                "decoys": 6,
                                "errors": 1,
                                "fantasyPointsTotal": 50,
                                "hitUps": 14,
                                "ineffectiveTackles": 1,
                                "mins": 60,
                                "missedTackles": 2,
                                "offloads": 3,
                                "supports": 6,
                                "tackles": 34,
                                "hitupRunMeters": 154,
                                "evasionRuns": 2,
                                "evasionRunMetres": 6,
                                "ptbFast": 9.09,
                                "ptbNeutral": 81.82,
                                "ptbSlow": 9.09,
                                "ptbAll": 11
                            },
                            "playerTookTheField": true,
                            "shirtNum": 15
                        },
                        {
                            "playerFirstName": "Jake",
                            "playerId": 501088,
                            "playerLastName": "Marketo",
                            "playerName": "Jake Marketo",
                            "playerPosition": "Interchange",
                            "playerPositionId": 500014,
                            "playerStats": {
                                "allRunMetres": 67,
                                "allRuns": 6,
                                "decoys": 2,
                                "fantasyPointsTotal": 21,
                                "hitUps": 6,
                                "ineffectiveTackles": 2,
                                "mins": 37,
                                "missedTackles": 2,
                                "oneOnOneTackles": 1,
                                "penalties": 1,
                                "supports": 2,
                                "tackles": 21,
                                "hitupRunMeters": 67,
                                "ptbNeutral": 100,
                                "ptbAll": 7
                            },
                            "playerTookTheField": true,
                            "shirtNum": 16
                        },
                        {
                            "playerFirstName": "Heath",
                            "playerId": 501749,
                            "playerLastName": "L'Estrange",
                            "playerName": "Heath L'Estrange",
                            "playerPosition": "Interchange",
                            "playerPositionId": 500014,
                            "playerStats": {
                                "allRunMetres": 12,
                                "allRuns": 2,
                                "dummyHalfRuns": 2,
                                "fantasyPointsTotal": 17,
                                "mins": 26,
                                "oneOnOneTackles": 2,
                                "tackles": 16,
                                "dummyHalfRunMetres": 12,
                                "ptbNeutral": 100,
                                "ptbAll": 1
                            },
                            "playerTookTheField": true,
                            "shirtNum": 17
                        }
                    ]
                },
                "teamName": "St. George Illawarra Dragons",
                "teamNickName": "Dragons",
                "teamStats": {
                    "allRunMetres": 1492,
                    "allRuns": 165,
                    "bombKicks": 2,
                    "bombKickMetres": 67,
                    "bombKicksDefused": 2,
                    "chargedDown": 1,
                    "completeSets": 27,
                    "completionPercentage": 68,
                    "conversions": 5,
                    "conversionsAttempts": 5,
                    "decoys": 28,
                    "dummyHalfRuns": 14,
                    "errors": 11,
                    "fieldGoals": 1,
                    "fieldGoalsAttempts": 1,
                    "hitUps": 68,
                    "incompleteSets": 13,
                    "ineffectiveTackles": 23,
                    "kickMetres": 543,
                    "kickReturnMetres": 167,
                    "kickReturns": 19,
                    "kicks": 20,
                    "kicksDefused": 13,
                    "lineDropouts": 3,
                    "linebreakAssists": 4,
                    "linebreaks": 5,
                    "missedTackles": 30,
                    "onReports": 1,
                    "oneOnOneTackles": 19,
                    "penalties": 4,
                    "points": 31,
                    "pointsConceded": 6,
                    "possession": 47,
                    "scrumWins": 4,
                    "supports": 85,
                    "tackleBreaks": 20,
                    "tackles": 358,
                    "sets": 40,
                    "tries": 5,
                    "triesConceded": 1,
                    "tryAssists": 5,
                    "offloads": 10,
                    "trySaves": 5,
                    "hitupRunMeters": 724,
                    "evasionRuns": 64,
                    "evasionRunMetres": 496,
                    "dummyHalfRunMetres": 105,
                    "ptbFast": 8,
                    "ptbNeutral": 86,
                    "ptbSlow": 6,
                    "ptbTotal": 136
                }
            },
            {
                "score": {
                    "conversions": 1,
                    "points": 6,
                    "tries": 1
                },
                "team1stHalfScore": 0,
                "team2ndHalfScore": 6,
                "teamAbbr": "CBY",
                "teamFinalScore": 6,
                "teamFullTimeScore": 6,
                "teamHalfTimeScore": 0,
                "teamId": 500010,
                "teamLineup": {
                    "injuriesAndSuspensions": {
                        "injury": [],
                        "suspension": []
                    },
                    "insAndOuts": {
                        "inOut": [
                            {
                                "inOut": "In",
                                "playerFirstName": "Antonio",
                                "playerId": "501829",
                                "playerLastName": "Kaufusi",
                                "playerName": "Antonio Kaufusi"
                            },
                            {
                                "inOut": "Out",
                                "playerFirstName": "Brett",
                                "playerId": "500633",
                                "playerLastName": "Morris",
                                "playerName": "Brett Morris"
                            },
                            {
                                "inOut": "In",
                                "playerFirstName": "Chase",
                                "playerId": "500239",
                                "playerLastName": "Stanley",
                                "playerName": "Chase Stanley"
                            },
                            {
                                "inOut": "In",
                                "playerFirstName": "Corey",
                                "playerId": "500240",
                                "playerLastName": "Thompson",
                                "playerName": "Corey Thompson"
                            },
                            {
                                "inOut": "Out",
                                "playerFirstName": "David",
                                "playerId": "500228",
                                "playerLastName": "Klemmer",
                                "playerName": "David Klemmer"
                            },
                            {
                                "inOut": "Out",
                                "playerFirstName": "James",
                                "playerId": "500223",
                                "playerLastName": "Graham",
                                "playerName": "James Graham"
                            },
                            {
                                "inOut": "In",
                                "playerFirstName": "Lloyd",
                                "playerId": "500145",
                                "playerLastName": "Perrett",
                                "playerName": "Lloyd Perrett"
                            },
                            {
                                "inOut": "Out",
                                "playerFirstName": "Sam",
                                "playerId": "500227",
                                "playerLastName": "Kasiano",
                                "playerName": "Sam Kasiano"
                            },
                            {
                                "inOut": "In",
                                "playerFirstName": "Tim",
                                "playerId": "500218",
                                "playerLastName": "Browne",
                                "playerName": "Tim Browne"
                            },
                            {
                                "inOut": "Out",
                                "playerFirstName": "Timoteo",
                                "playerId": "500229",
                                "playerLastName": "Lafai",
                                "playerName": "Timoteo Lafai"
                            }
                        ]
                    },
                    "teamPlayer": [
                        {
                            "playerFirstName": "Sam",
                            "playerId": 500234,
                            "playerLastName": "Perrett",
                            "playerName": "Sam Perrett",
                            "playerPosition": "Fullback",
                            "playerPositionId": 500001,
                            "playerStats": {
                                "allRunMetres": 161,
                                "allRuns": 17,
                                "decoys": 8,
                                "dummyHalfRuns": 2,
                                "errors": 2,
                                "fantasyPointsTotal": 29,
                                "ineffectiveTackles": 1,
                                "kickReturnMetres": 72,
                                "kickReturns": 5,
                                "mins": 80,
                                "offloads": 3,
                                "oneOnOneTackles": 2,
                                "supports": 12,
                                "tackleBreaks": 2,
                                "tackles": 5,
                                "tryCause": 1,
                                "evasionRuns": 10,
                                "evasionRunMetres": 77,
                                "dummyHalfRunMetres": 12,
                                "ptbFast": 25,
                                "ptbNeutral": 66.67,
                                "ptbSlow": 8.33,
                                "ptbAll": 12
                            },
                            "playerTookTheField": true,
                            "shirtNum": 1
                        },
                        {
                            "playerFirstName": "Curtis",
                            "playerId": 500294,
                            "playerLastName": "Rona",
                            "playerName": "Curtis Rona",
                            "playerPosition": "Winger 1",
                            "playerPositionId": 500002,
                            "playerStats": {
                                "allRunMetres": 63,
                                "allRuns": 10,
                                "fantasyPointsTotal": 13,
                                "kickReturnMetres": 9,
                                "kickReturns": 2,
                                "kicksDefused": 2,
                                "mins": 80,
                                "missedTackles": 1,
                                "offloads": 2,
                                "oneOnOneTackles": 1,
                                "penalties": 1,
                                "supports": 12,
                                "tackles": 5,
                                "tryCause": 2,
                                "evasionRuns": 8,
                                "evasionRunMetres": 54,
                                "ptbNeutral": 100,
                                "ptbAll": 8
                            },
                            "playerTookTheField": true,
                            "shirtNum": 2
                        },
                        {
                            "playerFirstName": "Josh",
                            "playerId": 500232,
                            "playerLastName": "Morris",
                            "playerName": "Josh Morris",
                            "playerPosition": "Centre 1",
                            "playerPositionId": 500003,
                            "playerStats": {
                                "allRunMetres": 100,
                                "allRuns": 12,
                                "decoys": 2,
                                "dummyHalfRuns": 1,
                                "fantasyPointsTotal": 46,
                                "ineffectiveTackles": 2,
                                "linebreaks": 1,
                                "mins": 80,
                                "missedTackles": 3,
                                "offloads": 3,
                                "oneOnOneTackles": 2,
                                "supports": 16,
                                "tackleBreaks": 5,
                                "tackles": 9,
                                "tries": 1,
                                "tryCause": 3,
                                "evasionRuns": 11,
                                "evasionRunMetres": 98,
                                "dummyHalfRunMetres": 2,
                                "ptbNeutral": 100,
                                "ptbAll": 7
                            },
                            "playerTookTheField": true,
                            "shirtNum": 3
                        },
                        {
                            "playerFirstName": "Chase",
                            "playerId": 500239,
                            "playerLastName": "Stanley",
                            "playerName": "Chase Stanley",
                            "playerPosition": "Centre 2",
                            "playerPositionId": 500004,
                            "playerStats": {
                                "allRunMetres": 109,
                                "allRuns": 14,
                                "decoys": 3,
                                "dummyHalfRuns": 1,
                                "errors": 1,
                                "fantasyPointsTotal": 29,
                                "hitUps": 3,
                                "ineffectiveTackles": 2,
                                "kickMetres": 10,
                                "kicks": 1,
                                "mins": 80,
                                "missedTackles": 2,
                                "offloads": 4,
                                "oneOnOneTackles": 2,
                                "supports": 9,
                                "tackles": 17,
                                "tryCause": 1,
                                "hitupRunMeters": 24,
                                "evasionRuns": 10,
                                "evasionRunMetres": 77,
                                "dummyHalfRunMetres": 8,
                                "ptbFast": 12.5,
                                "ptbNeutral": 87.5,
                                "ptbAll": 8
                            },
                            "playerTookTheField": true,
                            "shirtNum": 17
                        },
                        {
                            "playerFirstName": "Corey",
                            "playerId": 500240,
                            "playerLastName": "Thompson",
                            "playerName": "Corey Thompson",
                            "playerPosition": "Winger 2",
                            "playerPositionId": 500005,
                            "playerStats": {
                                "allRunMetres": 121,
                                "allRuns": 12,
                                "bombKicksDefused": 2,
                                "dummyHalfRuns": 1,
                                "fantasyPointsTotal": 39,
                                "kickReturnMetres": 47,
                                "kickReturns": 4,
                                "kicksDefused": 3,
                                "mins": 80,
                                "missedTackles": 1,
                                "offloads": 1,
                                "oneOnOneTackles": 2,
                                "supports": 11,
                                "tackleBreaks": 6,
                                "tackles": 6,
                                "tryCause": 1,
                                "evasionRuns": 7,
                                "evasionRunMetres": 60,
                                "dummyHalfRunMetres": 14,
                                "ptbFast": 30,
                                "ptbNeutral": 70,
                                "ptbAll": 10
                            },
                            "playerTookTheField": true,
                            "shirtNum": 5
                        },
                        {
                            "playerFirstName": "Moses",
                            "playerId": 500243,
                            "playerLastName": "Mbye",
                            "playerName": "Moses Mbye",
                            "playerPosition": "Five-eighth",
                            "playerPositionId": 500006,
                            "playerStats": {
                                "allRunMetres": 33,
                                "allRuns": 3,
                                "bombKicks": 1,
                                "bombKickMetres": 13,
                                "decoys": 1,
                                "errors": 1,
                                "fantasyPointsTotal": 22,
                                "ineffectiveTackles": 1,
                                "kickMetres": 39,
                                "kicks": 7,
                                "mins": 58,
                                "missedTackles": 1,
                                "offloads": 1,
                                "oneOnOneTackles": 1,
                                "supports": 3,
                                "tackles": 20,
                                "tryCause": 1,
                                "evasionRuns": 3,
                                "evasionRunMetres": 33,
                                "ptbNeutral": 100,
                                "ptbAll": 2
                            },
                            "playerTookTheField": true,
                            "shirtNum": 4
                        },
                        {
                            "playerFirstName": "Trent",
                            "playerId": 500224,
                            "playerLastName": "Hodkinson",
                            "playerName": "Trent Hodkinson",
                            "playerPosition": "Halfback",
                            "playerPositionId": 500007,
                            "playerStats": {
                                "allRunMetres": 29,
                                "allRuns": 7,
                                "bombKicks": 1,
                                "bombKickMetres": 25,
                                "conversions": 1,
                                "conversionsAttempts": 1,
                                "errors": 3,
                                "fantasyPointsTotal": 17,
                                "ineffectiveTackles": 1,
                                "kickMetres": 134,
                                "kicks": 5,
                                "lineDropouts": 1,
                                "mins": 80,
                                "missedTackles": 4,
                                "offloads": 1,
                                "oneOnOneTackles": 1,
                                "supports": 1,
                                "tackles": 19,
                                "tryCause": 2,
                                "evasionRuns": 7,
                                "evasionRunMetres": 29,
                                "ptbFast": 50,
                                "ptbNeutral": 50,
                                "ptbAll": 2
                            },
                            "playerTookTheField": true,
                            "shirtNum": 7
                        },
                        {
                            "playerFirstName": "Aiden",
                            "playerId": 500241,
                            "playerLastName": "Tolman",
                            "playerName": "Aiden Tolman",
                            "playerPosition": "Prop 1",
                            "playerPositionId": 500008,
                            "playerStats": {
                                "allRunMetres": 211,
                                "allRuns": 24,
                                "decoys": 9,
                                "fantasyPointsTotal": 68,
                                "hitUps": 21,
                                "ineffectiveTackles": 1,
                                "kickReturnMetres": 32,
                                "kickReturns": 2,
                                "mins": 74,
                                "offloads": 1,
                                "oneOnOneTackles": 2,
                                "supports": 19,
                                "tackles": 45,
                                "hitupRunMeters": 172,
                                "evasionRuns": 1,
                                "evasionRunMetres": 7,
                                "ptbFast": 13.64,
                                "ptbNeutral": 81.82,
                                "ptbSlow": 4.55,
                                "ptbAll": 22
                            },
                            "playerTookTheField": true,
                            "shirtNum": 8
                        },
                        {
                            "playerFirstName": "Michael",
                            "playerId": 500803,
                            "playerLastName": "Lichaa",
                            "playerName": "Michael Lichaa",
                            "playerPosition": "Hooker",
                            "playerPositionId": 500009,
                            "playerStats": {
                                "allRunMetres": 17,
                                "allRuns": 2,
                                "dummyHalfRuns": 2,
                                "fantasyPointsTotal": 27,
                                "ineffectiveTackles": 3,
                                "mins": 53,
                                "penalties": 1,
                                "supports": 1,
                                "tackles": 28,
                                "dummyHalfRunMetres": 17
                            },
                            "playerTookTheField": true,
                            "shirtNum": 9
                        },
                        {
                            "playerFirstName": "Antonio",
                            "playerId": 501829,
                            "playerLastName": "Kaufusi",
                            "playerName": "Antonio Kaufusi",
                            "playerPosition": "Prop 2",
                            "playerPositionId": 500010,
                            "playerStats": {
                                "allRunMetres": 72,
                                "allRuns": 9,
                                "decoys": 7,
                                "fantasyPointsTotal": 19,
                                "hitUps": 8,
                                "ineffectiveTackles": 2,
                                "mins": 38,
                                "missedTackles": 1,
                                "offloads": 1,
                                "supports": 4,
                                "tackles": 12,
                                "hitupRunMeters": 72,
                                "evasionRuns": 1,
                                "ptbFast": 42.86,
                                "ptbNeutral": 57.14,
                                "ptbAll": 7
                            },
                            "playerTookTheField": true,
                            "shirtNum": 15
                        },
                        {
                            "playerFirstName": "Josh",
                            "playerId": 500226,
                            "playerLastName": "Jackson",
                            "playerName": "Josh Jackson",
                            "playerPosition": "2nd Row 1",
                            "playerPositionId": 500011,
                            "playerStats": {
                                "allRunMetres": 131,
                                "allRuns": 16,
                                "decoys": 9,
                                "dummyHalfRuns": 1,
                                "fantasyPointsTotal": 56,
                                "hitUps": 14,
                                "ineffectiveTackles": 2,
                                "mins": 73,
                                "missedTackles": 2,
                                "oneOnOneTackles": 4,
                                "supports": 7,
                                "tackleBreaks": 3,
                                "tackles": 38,
                                "tryCause": 1,
                                "hitupRunMeters": 118,
                                "evasionRuns": 1,
                                "evasionRunMetres": 4,
                                "dummyHalfRunMetres": 9,
                                "ptbFast": 15.38,
                                "ptbNeutral": 76.92,
                                "ptbSlow": 7.69,
                                "ptbAll": 13
                            },
                            "playerTookTheField": true,
                            "shirtNum": 11
                        },
                        {
                            "playerFirstName": "Tony",
                            "playerId": 500242,
                            "playerLastName": "Williams",
                            "playerName": "Tony Williams",
                            "playerPosition": "2nd Row 2",
                            "playerPositionId": 500012,
                            "playerStats": {
                                "allRunMetres": 152,
                                "allRuns": 18,
                                "decoys": 7,
                                "fantasyPointsTotal": 48,
                                "hitUps": 17,
                                "ineffectiveTackles": 1,
                                "kickMetres": 10,
                                "kicks": 1,
                                "linebreakAssists": 1,
                                "mins": 67,
                                "offloads": 3,
                                "penalties": 1,
                                "supports": 6,
                                "tackleBreaks": 3,
                                "tackles": 13,
                                "tryAssists": 1,
                                "hitupRunMeters": 148,
                                "evasionRuns": 1,
                                "evasionRunMetres": 4,
                                "ptbFast": 13.33,
                                "ptbNeutral": 80,
                                "ptbSlow": 6.67,
                                "ptbAll": 15
                            },
                            "playerTookTheField": true,
                            "shirtNum": 12
                        },
                        {
                            "playerFirstName": "Greg",
                            "playerId": 500220,
                            "playerLastName": "Eastwood",
                            "playerName": "Greg Eastwood",
                            "playerPosition": "Lock",
                            "playerPositionId": 500013,
                            "playerStats": {
                                "allRunMetres": 73,
                                "allRuns": 9,
                                "decoys": 5,
                                "fantasyPointsTotal": 28,
                                "hitUps": 8,
                                "ineffectiveTackles": 1,
                                "mins": 46,
                                "oneOnOneTackles": 1,
                                "supports": 2,
                                "tackles": 21,
                                "hitupRunMeters": 67,
                                "evasionRuns": 1,
                                "evasionRunMetres": 6,
                                "ptbFast": 25,
                                "ptbNeutral": 62.5,
                                "ptbSlow": 12.5,
                                "ptbAll": 8
                            },
                            "playerTookTheField": true,
                            "shirtNum": 13
                        },
                        {
                            "playerFirstName": "Josh",
                            "playerId": 500237,
                            "playerLastName": "Reynolds",
                            "playerName": "Josh Reynolds",
                            "playerPosition": "Interchange",
                            "playerPositionId": 500014,
                            "playerStats": {
                                "allRunMetres": 65,
                                "allRuns": 10,
                                "fantasyPointsTotal": 34,
                                "kickMetres": 74,
                                "kicks": 6,
                                "mins": 49,
                                "missedTackles": 2,
                                "oneOnOneTackles": 3,
                                "supports": 4,
                                "tackleBreaks": 6,
                                "tackles": 11,
                                "tryCause": 1,
                                "evasionRuns": 10,
                                "evasionRunMetres": 65,
                                "ptbNeutral": 75,
                                "ptbSlow": 25,
                                "ptbAll": 4
                            },
                            "playerTookTheField": true,
                            "shirtNum": 6
                        },
                        {
                            "playerFirstName": "Tim",
                            "playerId": 500218,
                            "playerLastName": "Browne",
                            "playerName": "Tim Browne",
                            "playerPosition": "Interchange",
                            "playerPositionId": 500014,
                            "playerStats": {
                                "allRunMetres": 115,
                                "allRuns": 11,
                                "decoys": 3,
                                "fantasyPointsTotal": 44,
                                "hitUps": 6,
                                "kickReturnMetres": 37,
                                "kickReturns": 2,
                                "mins": 36,
                                "missedTackles": 1,
                                "oneOnOneTackles": 1,
                                "supports": 7,
                                "tackleBreaks": 4,
                                "tackles": 23,
                                "hitupRunMeters": 68,
                                "evasionRuns": 3,
                                "evasionRunMetres": 10,
                                "ptbFast": 14.29,
                                "ptbNeutral": 85.71,
                                "ptbAll": 7
                            },
                            "playerTookTheField": true,
                            "shirtNum": 10
                        },
                        {
                            "playerFirstName": "Lloyd",
                            "playerId": 500145,
                            "playerLastName": "Perrett",
                            "playerName": "Lloyd Perrett",
                            "playerPosition": "Interchange",
                            "playerPositionId": 500014,
                            "playerStats": {
                                "allRunMetres": 128,
                                "allRuns": 14,
                                "decoys": 4,
                                "fantasyPointsTotal": 35,
                                "hitUps": 13,
                                "mins": 36,
                                "missedTackles": 1,
                                "penalties": 1,
                                "supports": 3,
                                "tackles": 27,
                                "hitupRunMeters": 118,
                                "evasionRuns": 1,
                                "evasionRunMetres": 10,
                                "ptbFast": 6.67,
                                "ptbNeutral": 93.33,
                                "ptbAll": 15
                            },
                            "playerTookTheField": true,
                            "shirtNum": 14
                        },
                        {
                            "playerFirstName": "Frank",
                            "playerId": 500236,
                            "playerLastName": "Pritchard",
                            "playerName": "Frank Pritchard",
                            "playerPosition": "Interchange",
                            "playerPositionId": 500014,
                            "playerStats": {
                                "allRunMetres": 93,
                                "allRuns": 10,
                                "chargeDowns": 1,
                                "decoys": 4,
                                "dummyHalfRuns": 1,
                                "fantasyPointsTotal": 14,
                                "hitUps": 9,
                                "mins": 30,
                                "missedTackles": 1,
                                "oneOnOneTackles": 1,
                                "supports": 1,
                                "tackleBreaks": 1,
                                "tackles": 4,
                                "hitupRunMeters": 89,
                                "dummyHalfRunMetres": 4,
                                "ptbNeutral": 88.89,
                                "ptbSlow": 11.11,
                                "ptbAll": 9
                            },
                            "playerTookTheField": true,
                            "shirtNum": 16
                        }
                    ]
                },
                "teamName": "Canterbury-Bankstown Bulldogs",
                "teamNickName": "Bulldogs",
                "teamStats": {
                    "allRunMetres": 1672,
                    "allRuns": 198,
                    "bombKicks": 2,
                    "bombKickMetres": 38,
                    "bombKicksDefused": 2,
                    "chargeDowns": 1,
                    "completeSets": 29,
                    "completionPercentage": 76,
                    "conversions": 1,
                    "conversionsAttempts": 1,
                    "decoys": 62,
                    "dummyHalfRuns": 9,
                    "errors": 7,
                    "hitUps": 99,
                    "incompleteSets": 9,
                    "ineffectiveTackles": 17,
                    "kickMetres": 266,
                    "kickReturnMetres": 197,
                    "kickReturns": 15,
                    "kicks": 20,
                    "kicksDefused": 5,
                    "lineDropouts": 1,
                    "linebreakAssists": 1,
                    "linebreaks": 1,
                    "missedTackles": 20,
                    "oneOnOneTackles": 23,
                    "penalties": 4,
                    "points": 6,
                    "pointsConceded": 31,
                    "possession": 53,
                    "scrumWins": 8,
                    "supports": 118,
                    "tackleBreaks": 30,
                    "tackles": 303,
                    "sets": 38,
                    "tries": 1,
                    "triesConceded": 5,
                    "tryAssists": 1,
                    "offloads": 20,
                    "hitupRunMeters": 876,
                    "evasionRuns": 75,
                    "evasionRunMetres": 534,
                    "dummyHalfRunMetres": 65,
                    "ptbFast": 15,
                    "ptbNeutral": 81,
                    "ptbSlow": 5,
                    "ptbTotal": 149
                }
            }
        ]
    }
}