{
    "vod": [
        {
            "id": "pyd3NqMjE6LU2JVjRN-CECBjuHFuaArz",
            "contentId": 832492,
            "title": "Rd 5: Eels v Panthers (Hls)",
            "description": "Highlights of the match between the Eels and Panthers from Pirtek Stadium",
            "publishDate": "2016-04-03T18:22:20+10:00",
            "publisher": "NRL Chief",
            "thumbnailUrl": "http://bigpondvideo.com/web/images/content/20160403181508a_89x50.jpg",
            "largeThumbnailUrl": "http://bigpondvideo.com/web/images/content/20160403181508a_326x184.jpg",
            "programType": "Highlights",
            "programCategory": "Match",
            "priority": null,
            "lastUpdateDate": "2016-04-03T18:57:33+10:00",
            "isPremium": false,
            "club": [
                500031,
                500014
            ]
        },
        {
            "id": "E2OHRqMjE6xVYmFWUCdGhppH9jE5HbRt",
            "contentId": 832509,
            "title": "Rd 5 Press Conference: Panthers",
            "description": "The Panthers coach faces the media following the match",
            "publishDate": "2016-04-03T18:54:00+10:00",
            "publisher": "NRL Chief",
            "thumbnailUrl": "http://bigpondvideo.com/web/images/content/20160403182727a_89x50.jpg",
            "largeThumbnailUrl": "http://bigpondvideo.com/web/images/content/20160403182727a_326x184.jpg",
            "programType": "Press Conference",
            "programCategory": null,
            "priority": null,
            "lastUpdateDate": "2016-04-03T18:59:34+10:00",
            "isPremium": false,
            "club": [
                500031,
                500014
            ]
        },
        {
            "id": "VrNnRqMjE6uLwAbHtF-Caz_Vdh2y_iv6",
            "contentId": 832508,
            "title": "Rd 5 Press Conference: Eels",
            "description": "The Eels coach faces the media following the match",
            "publishDate": "2016-04-03T18:49:00+10:00",
            "publisher": "NRL Chief",
            "thumbnailUrl": "http://bigpondvideo.com/web/images/content/20160403183418a_89x50.jpg",
            "largeThumbnailUrl": "http://bigpondvideo.com/web/images/content/20160403183418a_326x184.jpg",
            "programType": "Press Conference",
            "programCategory": null,
            "priority": null,
            "lastUpdateDate": "2016-04-03T18:54:38+10:00",
            "isPremium": false,
            "club": [
                500031,
                500014
            ]
        },
        {
            "id": "xjcnNqMjE6YHzxA_uitC3a--9twO-btq",
            "contentId": 832205,
            "title": "Rd 5: TRY Bryce Cartwright (80th min)",
            "description": "The Panthers steal the win as Bryce Cartwright dives over of the back of Jamie Soward cross kick",
            "publishDate": "2016-04-03T18:03:00+10:00",
            "publisher": "NRL Chief",
            "thumbnailUrl": "http://bigpondvideo.com/web/images/content/20160403180519a_89x50.jpg",
            "largeThumbnailUrl": "http://bigpondvideo.com/web/images/content/20160403180519a_326x184.jpg",
            "programType": "Instant Replay",
            "programCategory": "Score",
            "priority": 1,
            "lastUpdateDate": "2016-04-03T18:10:35+10:00",
            "isPremium": true,
            "club": [
                500031,
                500014
            ]
        },
        {
            "id": "1ocXNqMjE6rKznfFXszBBwGdJAQKsvz-",
            "contentId": 832204,
            "title": "Rd 5: TRY Josh Mansour (76th min)",
            "description": "The Panthers strike back as Josh Mansour dives over in the corner",
            "publishDate": "2016-04-03T17:58:00+10:00",
            "publisher": "NRL Chief",
            "thumbnailUrl": "http://bigpondvideo.com/web/images/content/20160403175824a_89x50.jpg",
            "largeThumbnailUrl": "http://bigpondvideo.com/web/images/content/20160403175824a_326x184.jpg",
            "programType": "Instant Replay",
            "programCategory": "Score",
            "priority": 2,
            "lastUpdateDate": "2016-04-03T18:07:20+10:00",
            "isPremium": true,
            "club": [
                500031,
                500014
            ]
        },
        {
            "id": "4xbXNqMjE65TfivEGMLx1fHGZnEGhUnA",
            "contentId": 832203,
            "title": "Rd 5: GOAL Michael Gordon (67th min)",
            "description": "Conversion sees the Eels lead 18-12",
            "publishDate": "2016-04-03T17:46:00+10:00",
            "publisher": "NRL Chief",
            "thumbnailUrl": "http://bigpondvideo.com/web/images/content/20160403174839a_89x50.jpg",
            "largeThumbnailUrl": "http://bigpondvideo.com/web/images/content/20160403174839a_326x184.jpg",
            "programType": "Instant Replay",
            "programCategory": "Score",
            "priority": 3,
            "lastUpdateDate": "2016-04-03T18:05:19+10:00",
            "isPremium": true,
            "club": [
                500031,
                500014
            ]
        },
        {
            "id": "4ybHNqMjE60jdoy__fYNLh1GN62edJEM",
            "contentId": 832202,
            "title": "Rd 5: TRY Isaac De Gois (66th min)",
            "description": "The Eels take the lead as Isaac De Gois is on hand to clean up the kick back inside to score",
            "publishDate": "2016-04-03T17:45:00+10:00",
            "publisher": "NRL Chief",
            "thumbnailUrl": "http://bigpondvideo.com/web/images/content/20160403174719a_89x50.jpg",
            "largeThumbnailUrl": "http://bigpondvideo.com/web/images/content/20160403174719a_326x184.jpg",
            "programType": "Instant Replay",
            "programCategory": "Score",
            "priority": 4,
            "lastUpdateDate": "2016-04-03T18:04:19+10:00",
            "isPremium": true,
            "club": [
                500031,
                500014
            ]
        },
        {
            "id": "pia3NqMjE6GN5tFRB3Wua6JbBle8T5zi",
            "contentId": 832201,
            "title": "Rd 5: PENALTY GOAL Michael Gordon (65th min)",
            "description": "Penalty goal to the Eels locks this match up at 12-all",
            "publishDate": "2016-04-03T17:43:00+10:00",
            "publisher": "NRL Chief",
            "thumbnailUrl": "http://bigpondvideo.com/web/images/content/20160403174459a_89x50.jpg",
            "largeThumbnailUrl": "http://bigpondvideo.com/web/images/content/20160403174459a_326x184.jpg",
            "programType": "Instant Replay",
            "programCategory": "Score",
            "priority": 5,
            "lastUpdateDate": "2016-04-03T18:04:19+10:00",
            "isPremium": true,
            "club": [
                500031,
                500014
            ]
        },
        {
            "id": "wxZ3NqMjE6aykwRa1JmvpQzOD5RR888P",
            "contentId": 832200,
            "title": "Rd 5: TRY Michael Gordon (52nd min)",
            "description": "The Eels strike back as Michael Gordon crosses off the back of a Panthers error",
            "publishDate": "2016-04-03T17:31:00+10:00",
            "publisher": "NRL Chief",
            "thumbnailUrl": "http://bigpondvideo.com/web/images/content/20160403173124a_89x50.jpg",
            "largeThumbnailUrl": "http://bigpondvideo.com/web/images/content/20160403173124a_326x184.jpg",
            "programType": "Instant Replay",
            "programCategory": "Score",
            "priority": 6,
            "lastUpdateDate": "2016-04-03T18:04:19+10:00",
            "isPremium": true,
            "club": [
                500031,
                500014
            ]
        },
        {
            "id": "8yZHNqMjE6BpQgZkEGu-eNudMJt2qEbn",
            "contentId": 832199,
            "title": "Rd 5: GOAL Jamie Soward (45th min)",
            "description": "Conversion sees the Panthers lead 12-6",
            "publishDate": "2016-04-03T17:21:00+10:00",
            "publisher": "NRL Chief",
            "thumbnailUrl": "http://bigpondvideo.com/web/images/content/20160403172241a_89x50.jpg",
            "largeThumbnailUrl": "http://bigpondvideo.com/web/images/content/20160403172241a_326x184.jpg",
            "programType": "Instant Replay",
            "programCategory": "Score",
            "priority": 7,
            "lastUpdateDate": "2016-04-03T18:04:19+10:00",
            "isPremium": true,
            "club": [
                500031,
                500014
            ]
        },
        {
            "id": "g3Y3NqMjE6Tr7vZ92NWvf0h_lJL4zJSD",
            "contentId": 832198,
            "title": "Rd 5: TRY Peter Wallace (43rd min)",
            "description": "The Panthers take the lead as Peter Wallace dives over from dummy half",
            "publishDate": "2016-04-03T17:20:00+10:00",
            "publisher": "NRL Chief",
            "thumbnailUrl": "http://bigpondvideo.com/web/images/content/20160403172045a_89x50.jpg",
            "largeThumbnailUrl": "http://bigpondvideo.com/web/images/content/20160403172045a_326x184.jpg",
            "programType": "Instant Replay",
            "programCategory": "Score",
            "priority": 8,
            "lastUpdateDate": "2016-04-03T18:03:37+10:00",
            "isPremium": true,
            "club": [
                500031,
                500014
            ]
        },
        {
            "id": "ltNXNqMjE6wfIff4b2G8MTKx5a8nSD29",
            "contentId": 832197,
            "title": "Rd 5: GOAL Jamie Soward (38th min)",
            "description": "Conversion locks this match up at 6-all",
            "publishDate": "2016-04-03T16:59:00+10:00",
            "publisher": "NRL Chief",
            "thumbnailUrl": "http://bigpondvideo.com/web/images/content/20160403170041a_89x50.jpg",
            "largeThumbnailUrl": "http://bigpondvideo.com/web/images/content/20160403170041a_326x184.jpg",
            "programType": "Instant Replay",
            "programCategory": "Score",
            "priority": null,
            "lastUpdateDate": "2016-04-03T17:04:02+10:00",
            "isPremium": true,
            "club": [
                500031,
                500014
            ]
        },
        {
            "id": "10NHNqMjE605ExJoe94lOkl9Gvsj8xr6",
            "contentId": 832196,
            "title": "Rd 5: TRY Bryce Cartwright (37th min)",
            "description": "The Panthers open their scoring through a try to Bryce Cartwright",
            "publishDate": "2016-04-03T16:58:00+10:00",
            "publisher": "NRL Chief",
            "thumbnailUrl": "http://bigpondvideo.com/web/images/content/20160403165811a_89x50.jpg",
            "largeThumbnailUrl": "http://bigpondvideo.com/web/images/content/20160403165811a_326x184.jpg",
            "programType": "Instant Replay",
            "programCategory": "Score",
            "priority": 9,
            "lastUpdateDate": "2016-04-03T18:03:37+10:00",
            "isPremium": true,
            "club": [
                500031,
                500014
            ]
        },
        {
            "id": "tneXJqMjE6dGyg3G0aHaf6WOCh2qWOyv",
            "contentId": 832195,
            "title": "Rd 5: GOAL Michael Gordon (25th min)",
            "description": "Conversion sees the Eels lead 6-0",
            "publishDate": "2016-04-03T16:44:00+10:00",
            "publisher": "NRL Chief",
            "thumbnailUrl": "http://bigpondvideo.com/web/images/content/20160403164603a_89x50.jpg",
            "largeThumbnailUrl": "http://bigpondvideo.com/web/images/content/20160403164603a_326x184.jpg",
            "programType": "Instant Replay",
            "programCategory": "Score",
            "priority": null,
            "lastUpdateDate": "2016-04-03T16:49:58+10:00",
            "isPremium": true,
            "club": [
                500031,
                500014
            ]
        },
        {
            "id": "9weHJqMjE6i66cbQFhwjmwdT1C7l1f9t",
            "contentId": 832194,
            "title": "Rd 5: TRY Junior Paulo (23rd min)",
            "description": "The Eels open the scoring in this match through a try to Junior Paulo",
            "publishDate": "2016-04-03T16:43:00+10:00",
            "publisher": "NRL Chief",
            "thumbnailUrl": "http://bigpondvideo.com/web/images/content/20160403164436a_89x50.jpg",
            "largeThumbnailUrl": "http://bigpondvideo.com/web/images/content/20160403164436a_326x184.jpg",
            "programType": "Instant Replay",
            "programCategory": "Score",
            "priority": 10,
            "lastUpdateDate": "2016-04-03T18:03:37+10:00",
            "isPremium": true,
            "club": [
                500031,
                500014
            ]
        }
    ],
    "scores": [
        {
            "gameState": "First Half",
            "gameStateId": 3,
            "gameTime": "0:22:49",
            "gameSeconds": 1369,
            "playerId": 500687,
            "playerName": "Junior Paulo",
            "scoreMethod": "Try",
            "statEvent": "Try",
            "statId": 38,
            "statValue": 4,
            "vidRef": 43300,
            "homeScore": 4,
            "commentary": "22:49, Try by Junior Paulo(Parramatta Eels)",
            "tackleNum": 3,
            "teamId": 500031,
            "teamName": "Parramatta Eels",
            "homeTeamAbbrv": "PAR",
            "awayTeamAbbrv": "PEN"
        },
        {
            "gameState": "First Half",
            "gameStateId": 3,
            "gameTime": "0:24:15",
            "gameSeconds": 1455,
            "playerId": 500797,
            "playerName": "Michael Gordon",
            "scoreMethod": "Conversion",
            "statEvent": "Conversion-Made",
            "statId": 1,
            "statValue": 2,
            "vidRef": 45460,
            "homeScore": 6,
            "commentary": "24:15, Conversion-Made by Michael Gordon(Parramatta Eels)",
            "tackleNum": -1,
            "teamId": 500031,
            "teamName": "Parramatta Eels",
            "homeTeamAbbrv": "PAR",
            "awayTeamAbbrv": "PEN"
        },
        {
            "gameState": "Second Half",
            "gameStateId": 5,
            "gameTime": "0:52:02",
            "gameSeconds": 3122,
            "playerId": 500797,
            "playerName": "Michael Gordon",
            "scoreMethod": "Try",
            "statEvent": "Try",
            "statId": 38,
            "statValue": 4,
            "vidRef": 94716,
            "homeScore": 10,
            "awayScore": 12,
            "commentary": "52:02, Try by Michael Gordon(Parramatta Eels)",
            "teamId": 500031,
            "teamName": "Parramatta Eels",
            "homeTeamAbbrv": "PAR",
            "awayTeamAbbrv": "PEN"
        },
        {
            "gameState": "Second Half",
            "gameStateId": 5,
            "gameTime": "1:04:01",
            "gameSeconds": 3841,
            "playerId": 500797,
            "playerName": "Michael Gordon",
            "scoreMethod": "Penalty Goal",
            "statEvent": "Penalty Shot-Made",
            "statId": 67,
            "statValue": 2,
            "vidRef": 112682,
            "homeScore": 12,
            "awayScore": 12,
            "commentary": "64:01, Penalty Shot-Made by Michael Gordon(Parramatta Eels)",
            "tackleNum": -1,
            "teamId": 500031,
            "teamName": "Parramatta Eels",
            "homeTeamAbbrv": "PAR",
            "awayTeamAbbrv": "PEN"
        },
        {
            "gameState": "Second Half",
            "gameStateId": 5,
            "gameTime": "1:05:24",
            "gameSeconds": 3924,
            "playerId": 500789,
            "playerName": "Isaac De Gois",
            "scoreMethod": "Try",
            "statEvent": "Try",
            "statId": 38,
            "statValue": 4,
            "vidRef": 114760,
            "homeScore": 16,
            "awayScore": 12,
            "commentary": "65:24, Try by Isaac De Gois(Parramatta Eels)",
            "tackleNum": 1,
            "teamId": 500031,
            "teamName": "Parramatta Eels",
            "homeTeamAbbrv": "PAR",
            "awayTeamAbbrv": "PEN"
        },
        {
            "gameState": "Second Half",
            "gameStateId": 5,
            "gameTime": "1:06:16",
            "gameSeconds": 3976,
            "playerId": 500797,
            "playerName": "Michael Gordon",
            "scoreMethod": "Conversion",
            "statEvent": "Conversion-Made",
            "statId": 1,
            "statValue": 2,
            "vidRef": 118681,
            "homeScore": 18,
            "awayScore": 12,
            "commentary": "66:16, Conversion-Made by Michael Gordon(Parramatta Eels)",
            "tackleNum": -1,
            "teamId": 500031,
            "teamName": "Parramatta Eels",
            "homeTeamAbbrv": "PAR",
            "awayTeamAbbrv": "PEN"
        },
        {
            "gameState": "First Half",
            "gameStateId": 3,
            "gameTime": "0:36:22",
            "gameSeconds": 2182,
            "playerId": 500499,
            "playerName": "Bryce Cartwright",
            "scoreMethod": "Try",
            "statEvent": "Try",
            "statId": 38,
            "statValue": 4,
            "vidRef": 64823,
            "homeScore": 6,
            "awayScore": 4,
            "commentary": "36:22, Try by Bryce Cartwright(Penrith Panthers)",
            "tackleNum": 2,
            "teamId": 500014,
            "teamName": "Penrith Panthers",
            "homeTeamAbbrv": "PAR",
            "awayTeamAbbrv": "PEN"
        },
        {
            "gameState": "First Half",
            "gameStateId": 3,
            "gameTime": "0:37:09",
            "gameSeconds": 2229,
            "playerId": 501259,
            "playerName": "Jamie Soward",
            "scoreMethod": "Conversion",
            "statEvent": "Conversion-Made",
            "statId": 1,
            "statValue": 2,
            "vidRef": 65992,
            "homeScore": 6,
            "awayScore": 6,
            "commentary": "37:09, Conversion-Made by Jamie Soward(Penrith Panthers)",
            "tackleNum": -1,
            "teamId": 500014,
            "teamName": "Penrith Panthers",
            "homeTeamAbbrv": "PAR",
            "awayTeamAbbrv": "PEN"
        },
        {
            "gameState": "Second Half",
            "gameStateId": 5,
            "gameTime": "0:42:51",
            "gameSeconds": 2571,
            "playerId": 500956,
            "playerName": "Peter Wallace",
            "scoreMethod": "Try",
            "statEvent": "Try",
            "statId": 38,
            "statValue": 4,
            "vidRef": 77166,
            "homeScore": 6,
            "awayScore": 10,
            "commentary": "42:51, Try by Peter Wallace(Penrith Panthers)",
            "tackleNum": 6,
            "teamId": 500014,
            "teamName": "Penrith Panthers",
            "homeTeamAbbrv": "PAR",
            "awayTeamAbbrv": "PEN"
        },
        {
            "gameState": "Second Half",
            "gameStateId": 5,
            "gameTime": "0:44:00",
            "gameSeconds": 2640,
            "playerId": 501259,
            "playerName": "Jamie Soward",
            "scoreMethod": "Conversion",
            "statEvent": "Conversion-Made",
            "statId": 1,
            "statValue": 2,
            "vidRef": 78880,
            "homeScore": 6,
            "awayScore": 12,
            "commentary": "44:00, Conversion-Made by Jamie Soward(Penrith Panthers)",
            "tackleNum": -1,
            "teamId": 500014,
            "teamName": "Penrith Panthers",
            "homeTeamAbbrv": "PAR",
            "awayTeamAbbrv": "PEN"
        },
        {
            "gameState": "Second Half",
            "gameStateId": 5,
            "gameTime": "1:15:17",
            "gameSeconds": 4517,
            "playerId": 500352,
            "playerName": "Josh Mansour",
            "scoreMethod": "Try",
            "statEvent": "Try",
            "statId": 38,
            "statValue": 4,
            "vidRef": 133156,
            "homeScore": 18,
            "awayScore": 16,
            "commentary": "75:17, Try by Josh Mansour(Penrith Panthers)",
            "tackleNum": 2,
            "teamId": 500014,
            "teamName": "Penrith Panthers",
            "homeTeamAbbrv": "PAR",
            "awayTeamAbbrv": "PEN"
        },
        {
            "gameState": "Second Half",
            "gameStateId": 5,
            "gameTime": "1:20:00",
            "gameSeconds": 4800,
            "playerId": 500499,
            "playerName": "Bryce Cartwright",
            "scoreMethod": "Try",
            "statEvent": "Try",
            "statId": 38,
            "statValue": 4,
            "vidRef": 142375,
            "homeScore": 18,
            "awayScore": 20,
            "commentary": "80:00, Try by Bryce Cartwright(Penrith Panthers)",
            "tackleNum": 3,
            "teamId": 500014,
            "teamName": "Penrith Panthers",
            "homeTeamAbbrv": "PAR",
            "awayTeamAbbrv": "PEN"
        }
    ]
}