{
    "vod": [
        {
            "id": "prbjF4NTE638bT7vhImkWbAInvyPS3ne",
            "contentId": 876883,
            "title": "FW 2: Cowboys v Broncos (1)",
            "description": "1st half replay of the match between the Cowboys and Broncos",
            "publishDate": "2016-09-17T10:00:01+10:00",
            "publisher": "NRL Chief",
            "thumbnailUrl": "http://bigpondvideo.com/web/images/content/20160916220635a_89x50.jpg",
            "largeThumbnailUrl": "http://bigpondvideo.com/web/images/content/20160916220635a_326x184.jpg",
            "programType": "Matches",
            "programCategory": "Replay: 1st Half",
            "priority": null,
            "lastUpdateDate": "2016-09-16T23:56:09+10:00",
            "isPremium": true,
            "club": [
                500011,
                500012
            ]
        },
        {
            "id": "A0cDF4NTE68qgHMl0VpCpHZn7eeEAiqi",
            "contentId": 876884,
            "title": "FW 2: Cowboys v Broncos (2)",
            "description": "2nd half replay of the match between the Cowboys and Broncos",
            "publishDate": "2016-09-17T10:00:00+10:00",
            "publisher": "NRL Chief",
            "thumbnailUrl": "http://bigpondvideo.com/web/images/content/20160916220654a_89x50.jpg",
            "largeThumbnailUrl": "http://bigpondvideo.com/web/images/content/20160916220654a_326x184.jpg",
            "programType": "Matches",
            "programCategory": "Replay: 2nd Half",
            "priority": null,
            "lastUpdateDate": "2016-09-17T00:07:12+10:00",
            "isPremium": true,
            "club": [
                500011,
                500012
            ]
        },
        {
            "id": "44ODB4NTE6CzooSkVAHDnb4FtwyD4-8p",
            "contentId": 876861,
            "title": "FW 2: Cowboys v Broncos (Hls)",
            "description": "Highlights of the match between the Cowboys and Broncos from 1300Smiles Stadium",
            "publishDate": "2016-09-16T22:20:20+10:00",
            "publisher": "NRL Chief",
            "thumbnailUrl": "http://bigpondvideo.com/web/images/content/20160916222002a_89x50.jpg",
            "largeThumbnailUrl": "http://bigpondvideo.com/web/images/content/20160916222002a_326x184.jpg",
            "programType": "Highlights",
            "programCategory": "Match",
            "priority": null,
            "lastUpdateDate": "2016-09-16T22:48:54+10:00",
            "isPremium": false,
            "club": [
                500011,
                500012
            ]
        },
        {
            "id": "p1cjF4NTE6p-qKPlelJ4o2k5MISyEVtS",
            "contentId": 876868,
            "title": "FW 2 Press Conference: Cowboys",
            "description": "The Cowboys coach faces the media following the match",
            "publishDate": "2016-09-16T23:29:00+10:00",
            "publisher": "NRL Chief",
            "thumbnailUrl": "http://bigpondvideo.com/web/images/content/20160916230504a_89x50.jpg",
            "largeThumbnailUrl": "http://bigpondvideo.com/web/images/content/20160916230504a_326x184.jpg",
            "programType": "Press Conference",
            "programCategory": null,
            "priority": null,
            "lastUpdateDate": "2016-09-16T23:35:05+10:00",
            "isPremium": false,
            "club": [
                500011,
                500012
            ]
        },
        {
            "id": "BwODF4NTE6NAcI6TRpYWFBRRjv36iYXd",
            "contentId": 876869,
            "title": "FW 2 Press Conference: Broncos",
            "description": "The Broncos coach faces the media following the match",
            "publishDate": "2016-09-16T23:10:00+10:00",
            "publisher": "NRL Chief",
            "thumbnailUrl": "http://bigpondvideo.com/web/images/content/20160916230053a_89x50.jpg",
            "largeThumbnailUrl": "http://bigpondvideo.com/web/images/content/20160916230053a_326x184.jpg",
            "programType": "Press Conference",
            "programCategory": null,
            "priority": null,
            "lastUpdateDate": "2016-09-16T23:14:59+10:00",
            "isPremium": false,
            "club": [
                500011,
                500012
            ]
        },
        {
            "id": "x2dXl3NTE6j9AsxqB6cxAte8QfoLI-XG",
            "contentId": 876918,
            "title": "FW 2: GOAL Johnathan Thurston (85th min)",
            "description": "Conversion sees the Cowboys lead 26-20",
            "publishDate": "2016-09-16T21:56:00+10:00",
            "publisher": "NRL Chief",
            "thumbnailUrl": "http://bigpondvideo.com/web/images/content/20160916215717a_89x50.jpg",
            "largeThumbnailUrl": "http://bigpondvideo.com/web/images/content/20160916215717a_326x184.jpg",
            "programType": "Instant Replay",
            "programCategory": "Score",
            "priority": 1,
            "lastUpdateDate": "2016-09-16T22:06:43+10:00",
            "isPremium": true,
            "club": [
                500011,
                500012
            ]
        },
        {
            "id": "NvdHl3NTE6zq_KIUb8wUR5UCPaNBCw4B",
            "contentId": 876917,
            "title": "FW 2: TRY Michael Morgan (85th min)",
            "description": "The Cowboys strike first in extra time as JT does it all to send his partner in crime Michael Morgan over",
            "publishDate": "2016-09-16T21:55:00+10:00",
            "publisher": "NRL Chief",
            "thumbnailUrl": "http://bigpondvideo.com/web/images/content/20160916215556a_89x50.jpg",
            "largeThumbnailUrl": "http://bigpondvideo.com/web/images/content/20160916215556a_326x184.jpg",
            "programType": "Instant Replay",
            "programCategory": "Score",
            "priority": 2,
            "lastUpdateDate": "2016-09-16T22:06:43+10:00",
            "isPremium": true,
            "club": [
                500011,
                500012
            ]
        },
        {
            "id": "90b3l3NTE6Mq8IFKTHUSV_I-sK7RCY2k",
            "contentId": 876916,
            "title": "FW 2: PENALTY GOAL Johnathan Thurston (79th min)",
            "description": "Penalty goal to the Cowboys locks this match up at 18-all",
            "publishDate": "2016-09-16T21:44:00+10:00",
            "publisher": "NRL Chief",
            "thumbnailUrl": "http://bigpondvideo.com/web/images/content/20160916214518a_89x50.jpg",
            "largeThumbnailUrl": "http://bigpondvideo.com/web/images/content/20160916214518a_326x184.jpg",
            "programType": "Instant Replay",
            "programCategory": "Score",
            "priority": 3,
            "lastUpdateDate": "2016-09-16T22:06:43+10:00",
            "isPremium": true,
            "club": [
                500011,
                500012
            ]
        },
        {
            "id": "tsa3l3NTE6jguzoUaQ1d0NexSfoY23oZ",
            "contentId": 876915,
            "title": "FW 2: GOAL Jordan Kahu (71st min)",
            "description": "Conversion gives the Broncos a 20-18 lead",
            "publishDate": "2016-09-16T21:33:00+10:00",
            "publisher": "NRL Chief",
            "thumbnailUrl": "http://bigpondvideo.com/web/images/content/20160916213419a_89x50.jpg",
            "largeThumbnailUrl": "http://bigpondvideo.com/web/images/content/20160916213419a_326x184.jpg",
            "programType": "Instant Replay",
            "programCategory": "Score",
            "priority": null,
            "lastUpdateDate": "2016-09-16T21:38:36+10:00",
            "isPremium": true,
            "club": [
                500011,
                500012
            ]
        },
        {
            "id": "13anl3NTE64fE-GwWL113mnnZRoULtE8",
            "contentId": 876914,
            "title": "FW 2: TRY Corey Oates (69th min)",
            "description": "The Broncos turn the tide as Corey Oates gallops into open pastures to creoss for his 18th try for the year",
            "publishDate": "2016-09-16T21:32:00+10:00",
            "publisher": "NRL Chief",
            "thumbnailUrl": "http://bigpondvideo.com/web/images/content/20160916213345a_89x50.jpg",
            "largeThumbnailUrl": "http://bigpondvideo.com/web/images/content/20160916213345a_326x184.jpg",
            "programType": "Instant Replay",
            "programCategory": "Score",
            "priority": 4,
            "lastUpdateDate": "2016-09-16T22:06:43+10:00",
            "isPremium": true,
            "club": [
                500011,
                500012
            ]
        },
        {
            "id": "t5Znl3NTE6rwtplWdSdFMJ4hDclVbhXh",
            "contentId": 876913,
            "title": "FW 2: GOAL Johnathan Thurston (64th min)",
            "description": "Conversion sees the Cowboys lead 18-14",
            "publishDate": "2016-09-16T21:25:00+10:00",
            "publisher": "NRL Chief",
            "thumbnailUrl": "http://bigpondvideo.com/web/images/content/20160916212731a_89x50.jpg",
            "largeThumbnailUrl": "http://bigpondvideo.com/web/images/content/20160916212731a_326x184.jpg",
            "programType": "Instant Replay",
            "programCategory": "Score",
            "priority": null,
            "lastUpdateDate": "2016-09-16T21:31:34+10:00",
            "isPremium": true,
            "club": [
                500011,
                500012
            ]
        },
        {
            "id": "x4ZXl3NTE6mnRZMu-RqypfUDZycv7r-8",
            "contentId": 876912,
            "title": "FW 2: TRY Justin O'Neill (62nd min)",
            "description": "The Cowboys hit the lead as Justin O'Neill scores his 2nd try in a matter of mins",
            "publishDate": "2016-09-16T21:24:00+10:00",
            "publisher": "NRL Chief",
            "thumbnailUrl": "http://bigpondvideo.com/web/images/content/20160916212604a_89x50.jpg",
            "largeThumbnailUrl": "http://bigpondvideo.com/web/images/content/20160916212604a_326x184.jpg",
            "programType": "Instant Replay",
            "programCategory": "Score",
            "priority": 5,
            "lastUpdateDate": "2016-09-16T22:05:42+10:00",
            "isPremium": true,
            "club": [
                500011,
                500012
            ]
        },
        {
            "id": "ZjZHl3NTE6ysz2pAn9-cfIHLP1ofXwX8",
            "contentId": 876910,
            "title": "FW 2: GOAL Johnathan Thurston (59th min)",
            "description": "Conversion sees the Cowboys trail by 2",
            "publishDate": "2016-09-16T21:20:00+10:00",
            "publisher": "NRL Chief",
            "thumbnailUrl": "http://bigpondvideo.com/web/images/content/20160916212223a_89x50.jpg",
            "largeThumbnailUrl": "http://bigpondvideo.com/web/images/content/20160916212223a_326x184.jpg",
            "programType": "Instant Replay",
            "programCategory": "Score",
            "priority": null,
            "lastUpdateDate": "2016-09-16T21:26:32+10:00",
            "isPremium": true,
            "club": [
                500011,
                500012
            ]
        },
        {
            "id": "NoY3l3NTE6tGWL-qdfPa49eTrmOt4vmI",
            "contentId": 876909,
            "title": "FW 2: TRY Justin O'Neill (57th min)",
            "description": "The Cowboys set up another barnstorming finish as Justin O'Neill goes in under the posts",
            "publishDate": "2016-09-16T21:19:00+10:00",
            "publisher": "NRL Chief",
            "thumbnailUrl": "http://bigpondvideo.com/web/images/content/20160916212044a_89x50.jpg",
            "largeThumbnailUrl": "http://bigpondvideo.com/web/images/content/20160916212044a_326x184.jpg",
            "programType": "Instant Replay",
            "programCategory": "Score",
            "priority": 6,
            "lastUpdateDate": "2016-09-16T22:05:42+10:00",
            "isPremium": true,
            "club": [
                500011,
                500012
            ]
        },
        {
            "id": "40d3h3NTE6YW57U3TNuN9n83Wi5nlE-5",
            "contentId": 876908,
            "title": "FW 2: GOAL Jordan Kahu (40th min)",
            "description": "Conversion sees the Broncos lead 14-6",
            "publishDate": "2016-09-16T20:44:00+10:00",
            "publisher": "NRL Chief",
            "thumbnailUrl": "http://bigpondvideo.com/web/images/content/20160916204450a_89x50.jpg",
            "largeThumbnailUrl": "http://bigpondvideo.com/web/images/content/20160916204450a_326x184.jpg",
            "programType": "Instant Replay",
            "programCategory": "Score",
            "priority": null,
            "lastUpdateDate": "2016-09-16T20:49:22+10:00",
            "isPremium": true,
            "club": [
                500011,
                500012
            ]
        },
        {
            "id": "psdnh3NTE67aXNrAHR9UTLkvd9T6Fsis",
            "contentId": 876905,
            "title": "FW 2: TRY Jordan Kahu (39th min)",
            "description": "The Broncos strike on the stroke of half time as Jordan Kahu is on hand to clean up a Lachlan Coote error",
            "publishDate": "2016-09-16T20:43:00+10:00",
            "publisher": "NRL Chief",
            "thumbnailUrl": "http://bigpondvideo.com/web/images/content/20160916204351a_89x50.jpg",
            "largeThumbnailUrl": "http://bigpondvideo.com/web/images/content/20160916204351a_326x184.jpg",
            "programType": "Instant Replay",
            "programCategory": "Score",
            "priority": 7,
            "lastUpdateDate": "2016-09-16T22:04:42+10:00",
            "isPremium": true,
            "club": [
                500011,
                500012
            ]
        },
        {
            "id": "tzdXh3NTE6GXWt5lEQ8A7_AJ_AfbzujU",
            "contentId": 876904,
            "title": "FW 2: PENALTY GOAL Johnathan Thurston (34th min)",
            "description": "Penalty goal to the Cowboys sees them trail by 2",
            "publishDate": "2016-09-16T20:37:00+10:00",
            "publisher": "NRL Chief",
            "thumbnailUrl": "http://bigpondvideo.com/web/images/content/20160916204202a_89x50.jpg",
            "largeThumbnailUrl": "http://bigpondvideo.com/web/images/content/20160916204202a_326x184.jpg",
            "programType": "Instant Replay",
            "programCategory": "Score",
            "priority": 8,
            "lastUpdateDate": "2016-09-16T22:04:42+10:00",
            "isPremium": true,
            "club": [
                500011,
                500012
            ]
        },
        {
            "id": "owbXh3NTE6KgqxjbmfCNjNnu8UewWJ4z",
            "contentId": 876903,
            "title": "FW 2: TRY Coen Hess (19th min)",
            "description": "The Cowboys get their first try of the evening through a fantastic try to Coen Hess",
            "publishDate": "2016-09-16T20:22:10+10:00",
            "publisher": "NRL Chief",
            "thumbnailUrl": "http://bigpondvideo.com/web/images/content/20160916202350a_89x50.jpg",
            "largeThumbnailUrl": "http://bigpondvideo.com/web/images/content/20160916202350a_326x184.jpg",
            "programType": "Instant Replay",
            "programCategory": "Score",
            "priority": 9,
            "lastUpdateDate": "2016-09-16T22:04:42+10:00",
            "isPremium": true,
            "club": [
                500011,
                500012
            ]
        },
        {
            "id": "w4aXh3NTE63CmLGgBciVl6ULO4PNTeWn",
            "contentId": 876902,
            "title": "FW 2: PENALTY GOAL Jordan Kahu (12th min)",
            "description": "Penalty goal to the Broncos gives them a 8-0 lead",
            "publishDate": "2016-09-16T20:14:00+10:00",
            "publisher": "NRL Chief",
            "thumbnailUrl": "http://bigpondvideo.com/web/images/content/20160916201624a_89x50.jpg",
            "largeThumbnailUrl": "http://bigpondvideo.com/web/images/content/20160916201624a_326x184.jpg",
            "programType": "Instant Replay",
            "programCategory": "Score",
            "priority": null,
            "lastUpdateDate": "2016-09-16T20:55:25+10:00",
            "isPremium": true,
            "club": [
                500011,
                500012
            ]
        },
        {
            "id": "Q2Z3h3NTE6byQO7MwRq15IHON-o31B1B",
            "contentId": 876901,
            "title": "FW 2: GOAL Jordan Kahu (5th min)",
            "description": "Conversion sees the Broncos lead 6-0",
            "publishDate": "2016-09-16T20:08:25+10:00",
            "publisher": "NRL Chief",
            "thumbnailUrl": "http://bigpondvideo.com/web/images/content/20160916200938a_89x50.jpg",
            "largeThumbnailUrl": "http://bigpondvideo.com/web/images/content/20160916200938a_326x184.jpg",
            "programType": "Instant Replay",
            "programCategory": "Score",
            "priority": null,
            "lastUpdateDate": "2016-09-16T21:06:28+10:00",
            "isPremium": true,
            "club": [
                500011,
                500012
            ]
        },
        {
            "id": "5yZnh3NTE60v38rZKn9n8bYh8B7tTVPf",
            "contentId": 876900,
            "title": "FW 2: TRY Andrew McCullough (4th min)",
            "description": "The Broncos get the first try of the night through Andrew McCullough, his 1st for the season",
            "publishDate": "2016-09-16T20:07:10+10:00",
            "publisher": "NRL Chief",
            "thumbnailUrl": "http://bigpondvideo.com/web/images/content/20160916200818a_89x50.jpg",
            "largeThumbnailUrl": "http://bigpondvideo.com/web/images/content/20160916200818a_326x184.jpg",
            "programType": "Instant Replay",
            "programCategory": "Score",
            "priority": 10,
            "lastUpdateDate": "2016-09-16T22:03:42+10:00",
            "isPremium": true,
            "club": [
                500011,
                500012
            ]
        }
    ],
    "scores": [
        {
            "gameState": "First Half",
            "gameStateId": 3,
            "gameTime": "0:18:15",
            "gameSeconds": 1095,
            "GameMinutes": "18:15",
            "playerId": 500405,
            "playerName": "Coen Hess",
            "scoreMethod": "Try",
            "statEvent": "Try",
            "statId": 38,
            "statValue": 4,
            "vidRef": 28822,
            "homeScore": 4,
            "awayScore": 8,
            "commentary": "Try by Coen Hess",
            "tackleNum": 2,
            "teamId": 500012,
            "teamName": "North Queensland Cowboys",
            "homeTeamAbbrv": "NQL",
            "awayTeamAbbrv": "BRI"
        },
        {
            "gameState": "First Half",
            "gameStateId": 3,
            "gameTime": "0:33:37",
            "gameSeconds": 2017,
            "GameMinutes": "33:37",
            "playerId": 500304,
            "playerName": "Johnathan Thurston",
            "scoreMethod": "Penalty Goal",
            "statEvent": "Penalty Shot-Made",
            "statId": 67,
            "statValue": 2,
            "vidRef": 52423,
            "homeScore": 6,
            "awayScore": 8,
            "commentary": "Penalty Shot-Made by Johnathan Thurston",
            "tackleNum": -1,
            "teamId": 500012,
            "teamName": "North Queensland Cowboys",
            "homeTeamAbbrv": "NQL",
            "awayTeamAbbrv": "BRI"
        },
        {
            "gameState": "Second Half",
            "gameStateId": 5,
            "gameTime": "0:57:06",
            "gameSeconds": 3426,
            "GameMinutes": "57:06",
            "playerId": 500605,
            "playerName": "Justin O'Neill",
            "scoreMethod": "Try",
            "statEvent": "Try",
            "statId": 38,
            "statValue": 4,
            "vidRef": 91584,
            "homeScore": 10,
            "awayScore": 14,
            "commentary": "Try by Justin O'Neill",
            "tackleNum": 4,
            "teamId": 500012,
            "teamName": "North Queensland Cowboys",
            "homeTeamAbbrv": "NQL",
            "awayTeamAbbrv": "BRI"
        },
        {
            "gameState": "Second Half",
            "gameStateId": 5,
            "gameTime": "0:58:23",
            "gameSeconds": 3503,
            "GameMinutes": "58:23",
            "playerId": 500304,
            "playerName": "Johnathan Thurston",
            "scoreMethod": "Conversion",
            "statEvent": "Conversion-Made",
            "statId": 1,
            "statValue": 2,
            "vidRef": 93506,
            "homeScore": 12,
            "awayScore": 14,
            "commentary": "Conversion-Made by Johnathan Thurston",
            "tackleNum": -1,
            "teamId": 500012,
            "teamName": "North Queensland Cowboys",
            "homeTeamAbbrv": "NQL",
            "awayTeamAbbrv": "BRI"
        },
        {
            "gameState": "Second Half",
            "gameStateId": 5,
            "gameTime": "1:01:45",
            "gameSeconds": 3705,
            "GameMinutes": "61:45",
            "playerId": 500605,
            "playerName": "Justin O'Neill",
            "scoreMethod": "Try",
            "statEvent": "Try",
            "statId": 38,
            "statValue": 4,
            "vidRef": 98547,
            "homeScore": 16,
            "awayScore": 14,
            "commentary": "Try by Justin O'Neill",
            "tackleNum": 4,
            "teamId": 500012,
            "teamName": "North Queensland Cowboys",
            "homeTeamAbbrv": "NQL",
            "awayTeamAbbrv": "BRI"
        },
        {
            "gameState": "Second Half",
            "gameStateId": 5,
            "gameTime": "1:03:08",
            "gameSeconds": 3788,
            "GameMinutes": "63:08",
            "playerId": 500304,
            "playerName": "Johnathan Thurston",
            "scoreMethod": "Conversion",
            "statEvent": "Conversion-Made",
            "statId": 1,
            "statValue": 2,
            "vidRef": 101710,
            "homeScore": 18,
            "awayScore": 14,
            "commentary": "Conversion-Made by Johnathan Thurston",
            "tackleNum": -1,
            "teamId": 500012,
            "teamName": "North Queensland Cowboys",
            "homeTeamAbbrv": "NQL",
            "awayTeamAbbrv": "BRI"
        },
        {
            "gameState": "Second Half",
            "gameStateId": 5,
            "gameTime": "1:18:52",
            "gameSeconds": 4732,
            "GameMinutes": "78:52",
            "playerId": 500304,
            "playerName": "Johnathan Thurston",
            "scoreMethod": "Penalty Goal",
            "statEvent": "Penalty Shot-Made",
            "statId": 67,
            "statValue": 2,
            "vidRef": 128930,
            "homeScore": 20,
            "awayScore": 20,
            "commentary": "Penalty Shot-Made by Johnathan Thurston",
            "tackleNum": -1,
            "teamId": 500012,
            "teamName": "North Queensland Cowboys",
            "homeTeamAbbrv": "NQL",
            "awayTeamAbbrv": "BRI"
        },
        {
            "gameState": "Extra Time",
            "gameStateId": 6,
            "gameTime": "1:24:21",
            "gameSeconds": 5061,
            "GameMinutes": "84:21",
            "playerId": 500292,
            "playerName": "Michael Morgan",
            "scoreMethod": "Try",
            "statEvent": "Try",
            "statId": 38,
            "statValue": 4,
            "vidRef": 145091,
            "homeScore": 24,
            "awayScore": 20,
            "commentary": "Try by Michael Morgan",
            "tackleNum": 5,
            "teamId": 500012,
            "teamName": "North Queensland Cowboys",
            "homeTeamAbbrv": "NQL",
            "awayTeamAbbrv": "BRI"
        },
        {
            "gameState": "Extra Time",
            "gameStateId": 6,
            "gameTime": "1:24:57",
            "gameSeconds": 5097,
            "GameMinutes": "84:57",
            "playerId": 500304,
            "playerName": "Johnathan Thurston",
            "scoreMethod": "Conversion",
            "statEvent": "Conversion-Made",
            "statId": 1,
            "statValue": 2,
            "vidRef": 147843,
            "homeScore": 26,
            "awayScore": 20,
            "commentary": "Conversion-Made by Johnathan Thurston",
            "tackleNum": -1,
            "teamId": 500012,
            "teamName": "North Queensland Cowboys",
            "homeTeamAbbrv": "NQL",
            "awayTeamAbbrv": "BRI"
        },
        {
            "gameState": "First Half",
            "gameStateId": 3,
            "gameTime": "0:03:33",
            "gameSeconds": 213,
            "GameMinutes": "03:33",
            "playerId": 500261,
            "playerName": "Andrew McCullough",
            "scoreMethod": "Try",
            "statEvent": "Try",
            "statId": 38,
            "statValue": 4,
            "vidRef": 6755,
            "awayScore": 4,
            "commentary": "Try by Andrew McCullough",
            "tackleNum": 3,
            "teamId": 500011,
            "teamName": "Brisbane Broncos",
            "homeTeamAbbrv": "NQL",
            "awayTeamAbbrv": "BRI"
        },
        {
            "gameState": "First Half",
            "gameStateId": 3,
            "gameTime": "0:04:26",
            "gameSeconds": 266,
            "GameMinutes": "04:26",
            "playerId": 500258,
            "playerName": "Jordan Kahu",
            "scoreMethod": "Conversion",
            "statEvent": "Conversion-Made",
            "statId": 1,
            "statValue": 2,
            "vidRef": 8079,
            "awayScore": 6,
            "commentary": "Conversion-Made by Jordan Kahu",
            "tackleNum": -1,
            "teamId": 500011,
            "teamName": "Brisbane Broncos",
            "homeTeamAbbrv": "NQL",
            "awayTeamAbbrv": "BRI"
        },
        {
            "gameState": "First Half",
            "gameStateId": 3,
            "gameTime": "0:11:07",
            "gameSeconds": 667,
            "GameMinutes": "11:07",
            "playerId": 500258,
            "playerName": "Jordan Kahu",
            "scoreMethod": "Penalty Goal",
            "statEvent": "Penalty Shot-Made",
            "statId": 67,
            "statValue": 2,
            "vidRef": 18110,
            "awayScore": 8,
            "commentary": "Penalty Shot-Made by Jordan Kahu",
            "tackleNum": -1,
            "teamId": 500011,
            "teamName": "Brisbane Broncos",
            "homeTeamAbbrv": "NQL",
            "awayTeamAbbrv": "BRI"
        },
        {
            "gameState": "First Half",
            "gameStateId": 3,
            "gameTime": "0:38:20",
            "gameSeconds": 2300,
            "GameMinutes": "38:20",
            "playerId": 500258,
            "playerName": "Jordan Kahu",
            "scoreMethod": "Try",
            "statEvent": "Try",
            "statId": 38,
            "statValue": 4,
            "vidRef": 59495,
            "homeScore": 6,
            "awayScore": 12,
            "commentary": "Try by Jordan Kahu",
            "tackleNum": 1,
            "teamId": 500011,
            "teamName": "Brisbane Broncos",
            "homeTeamAbbrv": "NQL",
            "awayTeamAbbrv": "BRI"
        },
        {
            "gameState": "First Half",
            "gameStateId": 3,
            "gameTime": "0:39:38",
            "gameSeconds": 2378,
            "GameMinutes": "39:38",
            "playerId": 500258,
            "playerName": "Jordan Kahu",
            "scoreMethod": "Conversion",
            "statEvent": "Conversion-Made",
            "statId": 1,
            "statValue": 2,
            "vidRef": 62273,
            "homeScore": 6,
            "awayScore": 14,
            "commentary": "Conversion-Made by Jordan Kahu",
            "tackleNum": -1,
            "teamId": 500011,
            "teamName": "Brisbane Broncos",
            "homeTeamAbbrv": "NQL",
            "awayTeamAbbrv": "BRI"
        },
        {
            "gameState": "Second Half",
            "gameStateId": 5,
            "gameTime": "1:08:51",
            "gameSeconds": 4131,
            "GameMinutes": "68:51",
            "playerId": 500266,
            "playerName": "Corey Oates",
            "scoreMethod": "Try",
            "statEvent": "Try",
            "statId": 38,
            "statValue": 4,
            "vidRef": 111128,
            "homeScore": 18,
            "awayScore": 18,
            "commentary": "Try by Corey Oates",
            "tackleNum": 3,
            "teamId": 500011,
            "teamName": "Brisbane Broncos",
            "homeTeamAbbrv": "NQL",
            "awayTeamAbbrv": "BRI"
        },
        {
            "gameState": "Second Half",
            "gameStateId": 5,
            "gameTime": "1:10:20",
            "gameSeconds": 4220,
            "GameMinutes": "70:20",
            "playerId": 500258,
            "playerName": "Jordan Kahu",
            "scoreMethod": "Conversion",
            "statEvent": "Conversion-Made",
            "statId": 1,
            "statValue": 2,
            "vidRef": 113739,
            "homeScore": 18,
            "awayScore": 20,
            "commentary": "Conversion-Made by Jordan Kahu",
            "tackleNum": -1,
            "teamId": 500011,
            "teamName": "Brisbane Broncos",
            "homeTeamAbbrv": "NQL",
            "awayTeamAbbrv": "BRI"
        }
    ],
    "twitter": [
        {
            "id": "776747760112455680",
            "gameSeconds": 4680
        },
        {
            "id": "776740298307186688",
            "gameSeconds": 2820
        },
        {
            "id": "776740104521908224",
            "gameSeconds": 2820
        },
        {
            "id": "776724445847130112",
            "gameSeconds": 180
        },
        {
            "id": "776724418605092864",
            "gameSeconds": 180
        }
    ]
}