{
    "vod": [
        {
            "id": "dveXlyYTE6HysSseRWM2MIENhSNyqjsh",
            "contentId": 903792,
            "title": "Rd 7: Broncos v Titans (Hls)",
            "description": "Highlights of the Round 7 clash between the Broncos and Titans",
            "publishDate": "2017-04-14T22:04:00+10:00",
            "publisher": "NRL Chief",
            "thumbnailUrl": "http://bpvideos.telstra.insnw.net/web/images/20170414215922a_89x50.jpg",
            "largeThumbnailUrl": "http://bpvideos.telstra.insnw.net/web/images/20170414215922a_326x184.jpg",
            "programType": "Highlights",
            "programCategory": "Match",
            "priority": null,
            "lastUpdateDate": "2017-04-14T22:13:22+10:00",
            "isPremium": false,
            "club": [
                500011,
                500004
            ]
        },
        {
            "id": "QzazBzYTE6t4llw6GQXPo8rTRbZrkgvB",
            "contentId": 903772,
            "title": "Rd 7 Press Conference: Broncos",
            "description": "Broncos coach Wayne Bennett answers the media's questions following their Round 7 clash",
            "publishDate": "2017-04-14T22:52:00+10:00",
            "publisher": "NRL Chief",
            "thumbnailUrl": "http://bpvideos.telstra.insnw.net/web/images/20170414222756a_89x50.jpg",
            "largeThumbnailUrl": "http://bpvideos.telstra.insnw.net/web/images/20170414222756a_326x184.jpg",
            "programType": "Press Conference",
            "programCategory": null,
            "priority": null,
            "lastUpdateDate": "2017-04-14T23:21:37+10:00",
            "isPremium": false,
            "club": [
                500011,
                500004
            ]
        },
        {
            "id": "5kdHlyYTE6EsU8j7avjKoqdDRBMrb0Um",
            "contentId": 904799,
            "title": "Rd 7: TRY James Roberts (78th min)",
            "description": "James Roberts streaks away for his third try of the night, to win it for the Broncos",
            "publishDate": "2017-04-14T21:45:13+10:00",
            "publisher": "NRL Chief",
            "thumbnailUrl": "http://bpvideos.telstra.insnw.net/web/images/20170414214415a_89x50.jpg",
            "largeThumbnailUrl": "http://bpvideos.telstra.insnw.net/web/images/20170414214415a_326x184.jpg",
            "programType": "Instant Replay",
            "programCategory": "Score",
            "priority": null,
            "lastUpdateDate": "2017-04-14T21:51:16+10:00",
            "isPremium": true,
            "club": [
                500011,
                500004
            ]
        },
        {
            "id": "FocnlyYTE6JsnMQdWxk63QT6yYlR9kQY",
            "contentId": 904797,
            "title": "Rd 7: GOAL Ashley Taylor (72nd min)",
            "description": "Ashley Taylor converts the try of Kane Elgey to give the Titans the lead",
            "publishDate": "2017-04-14T21:37:32+10:00",
            "publisher": "NRL Chief",
            "thumbnailUrl": "http://bpvideos.telstra.insnw.net/web/images/20170414213606a_89x50.jpg",
            "largeThumbnailUrl": "http://bpvideos.telstra.insnw.net/web/images/20170414213606a_326x184.jpg",
            "programType": "Instant Replay",
            "programCategory": "Score",
            "priority": null,
            "lastUpdateDate": "2017-04-14T21:43:14+10:00",
            "isPremium": true,
            "club": [
                500011,
                500004
            ]
        },
        {
            "id": "5xcXlyYTE6CWpvWXYZtSUeohXUr4jbp9",
            "contentId": 904796,
            "title": "Rd 7: TRY Kane Elgey (71st min)",
            "description": "Kane Elgey wins the race to the ball to score for the Titans",
            "publishDate": "2017-04-14T21:34:42+10:00",
            "publisher": "NRL Chief",
            "thumbnailUrl": "http://bpvideos.telstra.insnw.net/web/images/20170414213457a_89x50.jpg",
            "largeThumbnailUrl": "http://bpvideos.telstra.insnw.net/web/images/20170414213457a_326x184.jpg",
            "programType": "Instant Replay",
            "programCategory": "Score",
            "priority": null,
            "lastUpdateDate": "2017-04-14T21:40:13+10:00",
            "isPremium": true,
            "club": [
                500011,
                500004
            ]
        },
        {
            "id": "Bpb3lyYTE6UopbvJ9a4xI6u2C7wtwRG1",
            "contentId": 904794,
            "title": "Rd 7: TRY Anthony Milford (63rd min)",
            "description": "Anthony Milford scores a screamer of a try for the Broncos",
            "publishDate": "2017-04-14T21:26:35+10:00",
            "publisher": "NRL Chief",
            "thumbnailUrl": "http://bpvideos.telstra.insnw.net/web/images/20170414212635a_89x50.jpg",
            "largeThumbnailUrl": "http://bpvideos.telstra.insnw.net/web/images/20170414212635a_326x184.jpg",
            "programType": "Instant Replay",
            "programCategory": "Score",
            "priority": null,
            "lastUpdateDate": "2017-04-14T21:32:11+10:00",
            "isPremium": true,
            "club": [
                500011,
                500004
            ]
        },
        {
            "id": "FwbnlyYTE6DdWgsTHKXTAY1Cebhl0-t4",
            "contentId": 904791,
            "title": "Rd 7: GOAL Jordan Kahu (59th min)",
            "description": "Jordan Kahu converts the try of Kodi Nikorima",
            "publishDate": "2017-04-14T21:23:02+10:00",
            "publisher": "NRL Chief",
            "thumbnailUrl": "http://bpvideos.telstra.insnw.net/web/images/20170414212256a_89x50.jpg",
            "largeThumbnailUrl": "http://bpvideos.telstra.insnw.net/web/images/20170414212256a_326x184.jpg",
            "programType": "Instant Replay",
            "programCategory": "Score",
            "priority": null,
            "lastUpdateDate": "2017-04-14T21:29:10+10:00",
            "isPremium": true,
            "club": [
                500011,
                500004
            ]
        },
        {
            "id": "x5bXlyYTE6UTmP_dZ-7_8_Y-ofoFDx9_",
            "contentId": 904790,
            "title": "Rd 7: TRY Kodi Nikorima (57th min)",
            "description": "Kodi Nikorima scampers over for the Broncos",
            "publishDate": "2017-04-14T21:20:22+10:00",
            "publisher": "NRL Chief",
            "thumbnailUrl": "http://bpvideos.telstra.insnw.net/web/images/20170414212014a_89x50.jpg",
            "largeThumbnailUrl": "http://bpvideos.telstra.insnw.net/web/images/20170414212014a_326x184.jpg",
            "programType": "Instant Replay",
            "programCategory": "Score",
            "priority": null,
            "lastUpdateDate": "2017-04-14T21:26:09+10:00",
            "isPremium": true,
            "club": [
                500011,
                500004
            ]
        },
        {
            "id": "MzYnlyYTE6vyKvFDkIVwZXTmL98cWoR5",
            "contentId": 904785,
            "title": "Rd 7: TRY Chris Grevsmuhl (36th min)",
            "description": "Chris Grevsmuhl finishes an amazing Titans try",
            "publishDate": "2017-04-14T20:48:31+10:00",
            "publisher": "NRL Chief",
            "thumbnailUrl": "http://bpvideos.telstra.insnw.net/web/images/20170414204251a_89x50.jpg",
            "largeThumbnailUrl": "http://bpvideos.telstra.insnw.net/web/images/20170414204251a_326x184.jpg",
            "programType": "Instant Replay",
            "programCategory": "Score",
            "priority": null,
            "lastUpdateDate": "2017-04-14T21:13:06+10:00",
            "isPremium": true,
            "club": [
                500011,
                500004
            ]
        },
        {
            "id": "luN3lyYTE6Md4brYctIZhJ5yED2F9l1D",
            "contentId": 904782,
            "title": "Rd 7: GOAL Jordan Kahu (32nd min)",
            "description": "Jordan Kahu converts the second try of James Roberts",
            "publishDate": "2017-04-14T20:38:23+10:00",
            "publisher": "NRL Chief",
            "thumbnailUrl": "http://bpvideos.telstra.insnw.net/web/images/20170414203828a_89x50.jpg",
            "largeThumbnailUrl": "http://bpvideos.telstra.insnw.net/web/images/20170414203828a_326x184.jpg",
            "programType": "Instant Replay",
            "programCategory": "Score",
            "priority": null,
            "lastUpdateDate": "2017-04-14T20:43:58+10:00",
            "isPremium": true,
            "club": [
                500011,
                500004
            ]
        },
        {
            "id": "hoN3lyYTE6NrH47KwvcAdBdgFZABDozs",
            "contentId": 904781,
            "title": "Rd 7: TRY James Roberts (31st min)",
            "description": "James Roberts crosses for his second try of the night",
            "publishDate": "2017-04-14T20:37:24+10:00",
            "publisher": "NRL Chief",
            "thumbnailUrl": "http://bpvideos.telstra.insnw.net/web/images/20170414203730a_89x50.jpg",
            "largeThumbnailUrl": "http://bpvideos.telstra.insnw.net/web/images/20170414203730a_326x184.jpg",
            "programType": "Instant Replay",
            "programCategory": "Score",
            "priority": null,
            "lastUpdateDate": "2017-04-14T20:42:58+10:00",
            "isPremium": true,
            "club": [
                500011,
                500004
            ]
        },
        {
            "id": "J5NHlyYTE6Yy7dnsw_gv4L0OjhNreQmR",
            "contentId": 904779,
            "title": "Rd 7: TRY James Roberts (21st min)",
            "description": "James Roberts crosses to open the Broncos' account for the day",
            "publishDate": "2017-04-14T20:26:43+10:00",
            "publisher": "NRL Chief",
            "thumbnailUrl": "http://bpvideos.telstra.insnw.net/web/images/20170414202656a_89x50.jpg",
            "largeThumbnailUrl": "http://bpvideos.telstra.insnw.net/web/images/20170414202656a_326x184.jpg",
            "programType": "Instant Replay",
            "programCategory": "Score",
            "priority": null,
            "lastUpdateDate": "2017-04-14T20:39:57+10:00",
            "isPremium": true,
            "club": [
                500011,
                500004
            ]
        },
        {
            "id": "g0NHlyYTE6AHVDAaLJvzoSfgjhxDy-K4",
            "contentId": 904778,
            "title": "Rd 7: GOAL Ashley Taylor (16th min)",
            "description": "Ashley Taylor converts the try of Ryan James",
            "publishDate": "2017-04-14T20:24:03+10:00",
            "publisher": "NRL Chief",
            "thumbnailUrl": "http://bpvideos.telstra.insnw.net/web/images/20170414202237a_89x50.jpg",
            "largeThumbnailUrl": "http://bpvideos.telstra.insnw.net/web/images/20170414202237a_326x184.jpg",
            "programType": "Instant Replay",
            "programCategory": "Score",
            "priority": null,
            "lastUpdateDate": "2017-04-14T20:29:55+10:00",
            "isPremium": true,
            "club": [
                500011,
                500004
            ]
        },
        {
            "id": "R1MnlyYTE6AOjDgEFawmLKlpCrFAgRvq",
            "contentId": 904777,
            "title": "Rd 7: TRY Ryan James (14th min)",
            "description": "Ryan James barges over for the Titans",
            "publishDate": "2017-04-14T20:21:38+10:00",
            "publisher": "NRL Chief",
            "thumbnailUrl": "http://bpvideos.telstra.insnw.net/web/images/20170414202055a_89x50.jpg",
            "largeThumbnailUrl": "http://bpvideos.telstra.insnw.net/web/images/20170414202055a_326x184.jpg",
            "programType": "Instant Replay",
            "programCategory": "Score",
            "priority": null,
            "lastUpdateDate": "2017-04-14T20:26:54+10:00",
            "isPremium": true,
            "club": [
                500011,
                500004
            ]
        },
        {
            "id": "ttMnlyYTE6B9HH8bInVL3teWSa8yxse6",
            "contentId": 904776,
            "title": "Rd 7: GOAL Ashley Taylor (12th min)",
            "description": "Ashley Taylor converts the try of Anthony Don",
            "publishDate": "2017-04-14T20:20:49+10:00",
            "publisher": "NRL Chief",
            "thumbnailUrl": "http://bpvideos.telstra.insnw.net/web/images/20170414202032a_89x50.jpg",
            "largeThumbnailUrl": "http://bpvideos.telstra.insnw.net/web/images/20170414202032a_326x184.jpg",
            "programType": "Instant Replay",
            "programCategory": "Score",
            "priority": null,
            "lastUpdateDate": "2017-04-14T20:25:54+10:00",
            "isPremium": true,
            "club": [
                500011,
                500004
            ]
        },
        {
            "id": "NkMXlyYTE6r3aVU62e-BUcDHQVJxlINF",
            "contentId": 904775,
            "title": "Rd 7: TRY Anthony Don (10th min)",
            "description": "Anthony Don opens the scoring for the Titans",
            "publishDate": "2017-04-14T20:15:43+10:00",
            "publisher": "NRL Chief",
            "thumbnailUrl": "http://bpvideos.telstra.insnw.net/web/images/20170414201540a_89x50.jpg",
            "largeThumbnailUrl": "http://bpvideos.telstra.insnw.net/web/images/20170414201540a_326x184.jpg",
            "programType": "Instant Replay",
            "programCategory": "Score",
            "priority": null,
            "lastUpdateDate": "2017-04-14T20:21:53+10:00",
            "isPremium": true,
            "club": [
                500011,
                500004
            ]
        }
    ],
    "scores": [
        {
            "gameState": "First Half",
            "gameStateId": 3,
            "gameTime": "0:20:33",
            "gameSeconds": 1233,
            "GameMinutes": "20:33",
            "playerId": 500517,
            "playerName": "James Roberts",
            "scoreMethod": "Try",
            "statEvent": "Try",
            "statId": 38,
            "statValue": 4,
            "vidRef": 36306,
            "homeScore": 4,
            "awayScore": 12,
            "commentary": "Try by James Roberts",
            "tackleNum": 6,
            "teamId": 500011,
            "teamName": "Brisbane Broncos",
            "homeTeamAbbrv": "BRI",
            "awayTeamAbbrv": "GLD"
        },
        {
            "gameState": "First Half",
            "gameStateId": 3,
            "gameTime": "0:30:00",
            "gameSeconds": 1800,
            "GameMinutes": "30:00",
            "playerId": 500517,
            "playerName": "James Roberts",
            "scoreMethod": "Try",
            "statEvent": "Try",
            "statId": 38,
            "statValue": 4,
            "vidRef": 50944,
            "homeScore": 8,
            "awayScore": 12,
            "commentary": "Try by James Roberts",
            "tackleNum": 1,
            "teamId": 500011,
            "teamName": "Brisbane Broncos",
            "homeTeamAbbrv": "BRI",
            "awayTeamAbbrv": "GLD"
        },
        {
            "gameState": "First Half",
            "gameStateId": 3,
            "gameTime": "0:31:35",
            "gameSeconds": 1895,
            "GameMinutes": "31:35",
            "playerId": 500258,
            "playerName": "Jordan Kahu",
            "scoreMethod": "Conversion",
            "statEvent": "Conversion-Made",
            "statId": 1,
            "statValue": 2,
            "vidRef": 53849,
            "homeScore": 10,
            "awayScore": 12,
            "commentary": "Conversion-Made by Jordan Kahu",
            "tackleNum": -1,
            "teamId": 500011,
            "teamName": "Brisbane Broncos",
            "homeTeamAbbrv": "BRI",
            "awayTeamAbbrv": "GLD"
        },
        {
            "gameState": "Second Half",
            "gameStateId": 5,
            "gameTime": "0:56:43",
            "gameSeconds": 3403,
            "GameMinutes": "56:43",
            "playerId": 500265,
            "playerName": "Kodi Nikorima",
            "scoreMethod": "Try",
            "statEvent": "Try",
            "statId": 38,
            "statValue": 4,
            "vidRef": 97278,
            "homeScore": 14,
            "awayScore": 16,
            "commentary": "Try by Kodi Nikorima",
            "tackleNum": 4,
            "teamId": 500011,
            "teamName": "Brisbane Broncos",
            "homeTeamAbbrv": "BRI",
            "awayTeamAbbrv": "GLD"
        },
        {
            "gameState": "Second Half",
            "gameStateId": 5,
            "gameTime": "0:58:12",
            "gameSeconds": 3492,
            "GameMinutes": "58:12",
            "playerId": 500258,
            "playerName": "Jordan Kahu",
            "scoreMethod": "Conversion",
            "statEvent": "Conversion-Made",
            "statId": 1,
            "statValue": 2,
            "vidRef": 99675,
            "homeScore": 16,
            "awayScore": 16,
            "commentary": "Conversion-Made by Jordan Kahu",
            "tackleNum": -1,
            "teamId": 500011,
            "teamName": "Brisbane Broncos",
            "homeTeamAbbrv": "BRI",
            "awayTeamAbbrv": "GLD"
        },
        {
            "gameState": "Second Half",
            "gameStateId": 5,
            "gameTime": "1:02:24",
            "gameSeconds": 3744,
            "GameMinutes": "62:24",
            "playerId": 500326,
            "playerName": "Anthony Milford",
            "scoreMethod": "Try",
            "statEvent": "Try",
            "statId": 38,
            "statValue": 4,
            "vidRef": 105983,
            "homeScore": 20,
            "awayScore": 16,
            "commentary": "Try by Anthony Milford",
            "teamId": 500011,
            "teamName": "Brisbane Broncos",
            "homeTeamAbbrv": "BRI",
            "awayTeamAbbrv": "GLD"
        },
        {
            "gameState": "Second Half",
            "gameStateId": 5,
            "gameTime": "1:17:54",
            "gameSeconds": 4674,
            "GameMinutes": "77:54",
            "playerId": 500517,
            "playerName": "James Roberts",
            "scoreMethod": "Try",
            "statEvent": "Try",
            "statId": 38,
            "statValue": 4,
            "vidRef": 133472,
            "homeScore": 24,
            "awayScore": 22,
            "commentary": "Try by James Roberts",
            "tackleNum": 1,
            "teamId": 500011,
            "teamName": "Brisbane Broncos",
            "homeTeamAbbrv": "BRI",
            "awayTeamAbbrv": "GLD"
        },
        {
            "gameState": "First Half",
            "gameStateId": 3,
            "gameTime": "0:09:55",
            "gameSeconds": 595,
            "GameMinutes": "09:55",
            "playerId": 500067,
            "playerName": "Anthony Don",
            "scoreMethod": "Try",
            "statEvent": "Try",
            "statId": 38,
            "statValue": 4,
            "vidRef": 18049,
            "awayScore": 4,
            "commentary": "Try by Anthony Don",
            "tackleNum": 1,
            "teamId": 500004,
            "teamName": "Gold Coast Titans",
            "homeTeamAbbrv": "BRI",
            "awayTeamAbbrv": "GLD"
        },
        {
            "gameState": "First Half",
            "gameStateId": 3,
            "gameTime": "0:11:17",
            "gameSeconds": 677,
            "GameMinutes": "11:17",
            "playerId": 500272,
            "playerName": "Ashley Taylor",
            "scoreMethod": "Conversion",
            "statEvent": "Conversion-Made",
            "statId": 1,
            "statValue": 2,
            "vidRef": 20715,
            "awayScore": 6,
            "commentary": "Conversion-Made by Ashley Taylor",
            "tackleNum": -1,
            "teamId": 500004,
            "teamName": "Gold Coast Titans",
            "homeTeamAbbrv": "BRI",
            "awayTeamAbbrv": "GLD"
        },
        {
            "gameState": "First Half",
            "gameStateId": 3,
            "gameTime": "0:13:47",
            "gameSeconds": 827,
            "GameMinutes": "13:47",
            "playerId": 500072,
            "playerName": "Ryan James",
            "scoreMethod": "Try",
            "statEvent": "Try",
            "statId": 38,
            "statValue": 4,
            "vidRef": 24462,
            "awayScore": 10,
            "commentary": "Try by Ryan James",
            "tackleNum": 5,
            "teamId": 500004,
            "teamName": "Gold Coast Titans",
            "homeTeamAbbrv": "BRI",
            "awayTeamAbbrv": "GLD"
        },
        {
            "gameState": "First Half",
            "gameStateId": 3,
            "gameTime": "0:15:15",
            "gameSeconds": 915,
            "GameMinutes": "15:15",
            "playerId": 500272,
            "playerName": "Ashley Taylor",
            "scoreMethod": "Conversion",
            "statEvent": "Conversion-Made",
            "statId": 1,
            "statValue": 2,
            "vidRef": 26743,
            "awayScore": 12,
            "commentary": "Conversion-Made by Ashley Taylor",
            "tackleNum": -1,
            "teamId": 500004,
            "teamName": "Gold Coast Titans",
            "homeTeamAbbrv": "BRI",
            "awayTeamAbbrv": "GLD"
        },
        {
            "gameState": "First Half",
            "gameStateId": 3,
            "gameTime": "0:35:23",
            "gameSeconds": 2123,
            "GameMinutes": "35:23",
            "playerId": 500106,
            "playerName": "Chris Grevsmuhl",
            "scoreMethod": "Try",
            "statEvent": "Try",
            "statId": 38,
            "statValue": 4,
            "vidRef": 60588,
            "homeScore": 10,
            "awayScore": 16,
            "commentary": "Try by Chris Grevsmuhl",
            "tackleNum": 6,
            "teamId": 500004,
            "teamName": "Gold Coast Titans",
            "homeTeamAbbrv": "BRI",
            "awayTeamAbbrv": "GLD"
        },
        {
            "gameState": "Second Half",
            "gameStateId": 5,
            "gameTime": "1:10:00",
            "gameSeconds": 4200,
            "GameMinutes": "70:00",
            "playerId": 501357,
            "playerName": "Kane Elgey",
            "scoreMethod": "Try",
            "statEvent": "Try",
            "statId": 38,
            "statValue": 4,
            "vidRef": 119714,
            "homeScore": 20,
            "awayScore": 20,
            "commentary": "Try by Kane Elgey",
            "tackleNum": 6,
            "teamId": 500004,
            "teamName": "Gold Coast Titans",
            "homeTeamAbbrv": "BRI",
            "awayTeamAbbrv": "GLD"
        },
        {
            "gameState": "Second Half",
            "gameStateId": 5,
            "gameTime": "1:11:15",
            "gameSeconds": 4275,
            "GameMinutes": "71:15",
            "playerId": 500272,
            "playerName": "Ashley Taylor",
            "scoreMethod": "Conversion",
            "statEvent": "Conversion-Made",
            "statId": 1,
            "statValue": 2,
            "vidRef": 121635,
            "homeScore": 20,
            "awayScore": 22,
            "commentary": "Conversion-Made by Ashley Taylor",
            "tackleNum": -1,
            "teamId": 500004,
            "teamName": "Gold Coast Titans",
            "homeTeamAbbrv": "BRI",
            "awayTeamAbbrv": "GLD"
        }
    ],
    "twitter": [
        {
            "id": "852849340070608898",
            "gameSeconds": 4440
        },
        {
            "id": "852849024147181568",
            "gameSeconds": 4440
        },
        {
            "id": "852848101861740545",
            "gameSeconds": 4200
        },
        {
            "id": "852847882914775040",
            "gameSeconds": 4200
        },
        {
            "id": "852847731655688193",
            "gameSeconds": 4080
        },
        {
            "id": "852847510754172928",
            "gameSeconds": 4080
        },
        {
            "id": "852835048591998978",
            "gameSeconds": 2160
        },
        {
            "id": "852834836569915393",
            "gameSeconds": 2160
        },
        {
            "id": "852826977438359553",
            "gameSeconds": 360
        },
        {
            "id": "852826680510914560",
            "gameSeconds": 360
        }
    ]
}