{
    "vod": [
        {
            "id": "pia3M3dDpV1JYCWQEHunEDm6C4PWlfAc",
            "contentId": 733622,
            "title": "Rd 4: Wests Tigers v Bulldogs (2)",
            "description": "2nd half replay of the match between the Wests Tigers & Bulldogs",
            "publishDate": "2015-03-28T09:30:00+11:00",
            "publisher": "NRL Chief",
            "thumbnailUrl": "http://bigpondvideo.com/Web/Images/Content/20150327220924a_89x50.jpg",
            "largeThumbnailUrl": "http://bigpondvideo.com/Web/Images/Content/20150327220924a_326x184.jpg",
            "programType": "Matches",
            "programCategory": "Replay: 2nd Half",
            "priority": null,
            "lastUpdateDate": "2015-03-28T00:19:30+11:00",
            "isPremium": true,
            "club": [
                500010,
                500023
            ]
        },
        {
            "id": "hjaHM3dDpUpSH8dKwjiFY9h7a0yr6S7X",
            "contentId": 733621,
            "title": "Rd 4: Wests Tigers v Bulldogs (1)",
            "description": "1st half replay of the match between the Wests Tigers & Bulldogs",
            "publishDate": "2015-03-28T09:30:00+11:00",
            "publisher": "NRL Chief",
            "thumbnailUrl": "http://bigpondvideo.com/Web/Images/Content/20150327220841a_89x50.jpg",
            "largeThumbnailUrl": "http://bigpondvideo.com/Web/Images/Content/20150327220841a_326x184.jpg",
            "programType": "Matches",
            "programCategory": "Replay: 1st Half",
            "priority": null,
            "lastUpdateDate": "2015-03-28T00:12:26+11:00",
            "isPremium": true,
            "club": [
                500010,
                500023
            ]
        },
        {
            "id": "d5MnI3dDryTMOCeDOqVf10Ot-UdVKi2v",
            "contentId": 733563,
            "title": "Rd 4: Wests Tigers v Bulldogs (Hls)",
            "description": "Highlights of the match between the Wests Tigers & Bulldogs from ANZ Stadium.",
            "publishDate": "2015-03-27T22:01:00+11:00",
            "publisher": "NRL Chief",
            "thumbnailUrl": "http://bigpondvideo.com/Web/Images/Content/20150327220117a_89x50.jpg",
            "largeThumbnailUrl": "http://bigpondvideo.com/Web/Images/Content/20150327220117a_326x184.jpg",
            "programType": "Highlights",
            "programCategory": "Match",
            "priority": null,
            "lastUpdateDate": "2015-03-27T22:06:16+11:00",
            "isPremium": false,
            "club": [
                500010,
                500023
            ]
        },
        {
            "id": "FvY3I3dDpAyvxYT75AFiUDKImYu-cFQ8",
            "contentId": 733600,
            "title": "Rd 4 Press Conference: Wests Tigers",
            "description": "The Wests Tigers coach faces the media following the match",
            "publishDate": "2015-03-27T22:24:00+11:00",
            "publisher": "NRL Chief",
            "thumbnailUrl": "http://bigpondvideo.com/Web/Images/Content/20150327222310a_89x50.jpg",
            "largeThumbnailUrl": "http://bigpondvideo.com/Web/Images/Content/20150327222310a_326x184.jpg",
            "programType": "Press Conference",
            "programCategory": null,
            "priority": null,
            "lastUpdateDate": "2015-03-27T22:33:31+11:00",
            "isPremium": false,
            "club": [
                500010,
                500023
            ]
        },
        {
            "id": "12N3I3dDoYNJs_raT5PKsIB6PqOr4ucR",
            "contentId": 733602,
            "title": "Rd 4 Press Conference: Bulldogs",
            "description": "The Bulldogs coach faces the media following the match",
            "publishDate": "2015-03-27T22:14:00+11:00",
            "publisher": "NRL Chief",
            "thumbnailUrl": "http://bigpondvideo.com/Web/Images/Content/20150327220855a_89x50.jpg",
            "largeThumbnailUrl": "http://bigpondvideo.com/Web/Images/Content/20150327220855a_326x184.jpg",
            "programType": "Press Conference",
            "programCategory": null,
            "priority": null,
            "lastUpdateDate": "2015-03-27T22:30:29+11:00",
            "isPremium": false,
            "club": [
                500010,
                500023
            ]
        },
        {
            "id": "FkdXE3dDrdErqNbVG47nrD0E7OY55aDu",
            "contentId": 734141,
            "title": "Rd 4: FIELD GOAL Moses Mbye (84th min)",
            "description": "Bulldogs pull it out in golden point as Moses Mbye snaps a match winning field goal",
            "publishDate": "2015-03-27T21:41:00+11:00",
            "publisher": "NRL Chief",
            "thumbnailUrl": "http://bigpondvideo.com/Web/Images/Content/20150327213934a_89x50.jpg",
            "largeThumbnailUrl": "http://bigpondvideo.com/Web/Images/Content/20150327213934a_326x184.jpg",
            "programType": "Instant Replay",
            "programCategory": "Score",
            "priority": 1,
            "lastUpdateDate": "2015-03-27T22:02:13+11:00",
            "isPremium": true,
            "club": [
                500010,
                500023
            ]
        },
        {
            "id": "5qbXE3dDqxcrskn7udiFaKUtDKlZJ7rE",
            "contentId": 734139,
            "title": "Rd 4: GOAL Trent Hodkinson (77th min)",
            "description": "Conversion locks the score up at 24-all with only mins left on the clock",
            "publishDate": "2015-03-27T21:28:10+11:00",
            "publisher": "NRL Chief",
            "thumbnailUrl": "http://bigpondvideo.com/Web/Images/Content/20150327212807a_89x50.jpg",
            "largeThumbnailUrl": "http://bigpondvideo.com/Web/Images/Content/20150327212807a_326x184.jpg",
            "programType": "Instant Replay",
            "programCategory": "Score",
            "priority": 2,
            "lastUpdateDate": "2015-03-27T22:01:13+11:00",
            "isPremium": true,
            "club": [
                500010,
                500023
            ]
        },
        {
            "id": "drbHE3dDqAv2lT_oye1aBTXQpww5u7LZ",
            "contentId": 734137,
            "title": "Rd 4: TRY Josh Morris (75th min)",
            "description": "Bulldogs set up a grandstand finish as Josh Morris scores a fantastic try for the visitors",
            "publishDate": "2015-03-27T21:27:00+11:00",
            "publisher": "NRL Chief",
            "thumbnailUrl": "http://bigpondvideo.com/Web/Images/Content/20150327212657a_89x50.jpg",
            "largeThumbnailUrl": "http://bigpondvideo.com/Web/Images/Content/20150327212657a_326x184.jpg",
            "programType": "Instant Replay",
            "programCategory": "Score",
            "priority": 3,
            "lastUpdateDate": "2015-03-27T22:01:13+11:00",
            "isPremium": true,
            "club": [
                500010,
                500023
            ]
        },
        {
            "id": "E2aHE3dDpVyCeEcqOA8mZZkS2FWQZjkp",
            "contentId": 734136,
            "title": "Rd 4: GOAL Trent Hodkinson (68th min)",
            "description": "Conversion sees the Bulldogs trail by 6",
            "publishDate": "2015-03-27T21:19:10+11:00",
            "publisher": "NRL Chief",
            "thumbnailUrl": "http://bigpondvideo.com/Web/Images/Content/20150327211857a_89x50.jpg",
            "largeThumbnailUrl": "http://bigpondvideo.com/Web/Images/Content/20150327211857a_326x184.jpg",
            "programType": "Instant Replay",
            "programCategory": "Score",
            "priority": null,
            "lastUpdateDate": "2015-03-27T21:24:54+11:00",
            "isPremium": true,
            "club": [
                500010,
                500023
            ]
        },
        {
            "id": "BwZ3E3dDpnJHM-4Cz4Na2YE2Yvup8oOE",
            "contentId": 734138,
            "title": "Rd 4: TRY Curtis Rona (67th min)",
            "description": "Great cut out pass by big Sam Kasiano send Curtis Rona over for a double",
            "publishDate": "2015-03-27T21:18:00+11:00",
            "publisher": "NRL Chief",
            "thumbnailUrl": "http://bigpondvideo.com/Web/Images/Content/20150327211803a_89x50.jpg",
            "largeThumbnailUrl": "http://bigpondvideo.com/Web/Images/Content/20150327211803a_326x184.jpg",
            "programType": "Instant Replay",
            "programCategory": "Score",
            "priority": 4,
            "lastUpdateDate": "2015-03-27T22:00:12+11:00",
            "isPremium": true,
            "club": [
                500010,
                500023
            ]
        },
        {
            "id": "xhYnE3dDqCF4n0hU1DYJm079rdGlJseR",
            "contentId": 734135,
            "title": "Rd 4: GOAL Trent Hodkinson (59th min)",
            "description": "Conversion sees the Bulldogs trail 24-12",
            "publishDate": "2015-03-27T21:10:00+11:00",
            "publisher": "NRL Chief",
            "thumbnailUrl": "http://bigpondvideo.com/Web/Images/Content/20150327210950a_89x50.jpg",
            "largeThumbnailUrl": "http://bigpondvideo.com/Web/Images/Content/20150327210950a_326x184.jpg",
            "programType": "Instant Replay",
            "programCategory": "Score",
            "priority": null,
            "lastUpdateDate": "2015-03-27T21:13:46+11:00",
            "isPremium": true,
            "club": [
                500010,
                500023
            ]
        },
        {
            "id": "Z2YXE3dDqTXnW9lR8m13tymLW0SRtox1",
            "contentId": 734127,
            "title": "Rd 4: TRY Michael Lichaa (58th min)",
            "description": "Bulldogs strike back through a try to Michael Lichaa",
            "publishDate": "2015-03-27T21:09:00+11:00",
            "publisher": "NRL Chief",
            "thumbnailUrl": "http://bigpondvideo.com/Web/Images/Content/20150327210941a_89x50.jpg",
            "largeThumbnailUrl": "http://bigpondvideo.com/Web/Images/Content/20150327210941a_326x184.jpg",
            "programType": "Instant Replay",
            "programCategory": "Score",
            "priority": 5,
            "lastUpdateDate": "2015-03-27T21:59:12+11:00",
            "isPremium": true,
            "club": [
                500010,
                500023
            ]
        },
        {
            "id": "k0OXE3dDrL5-NNE9tb8Y7UCARo0RhKGJ",
            "contentId": 734132,
            "title": "Rd 4: GOAL Mitchell Moses (57th min)",
            "description": "Conversion sees the Wests Tigers lead 24-6",
            "publishDate": "2015-03-27T21:07:10+11:00",
            "publisher": "NRL Chief",
            "thumbnailUrl": "http://bigpondvideo.com/Web/Images/Content/20150327210723a_89x50.jpg",
            "largeThumbnailUrl": "http://bigpondvideo.com/Web/Images/Content/20150327210723a_326x184.jpg",
            "programType": "Instant Replay",
            "programCategory": "Score",
            "priority": null,
            "lastUpdateDate": "2015-03-27T21:14:47+11:00",
            "isPremium": true,
            "club": [
                500010,
                500023
            ]
        },
        {
            "id": "h0OHE3dDr9jtBbkPGRcZ0o-PMI1Wn-7g",
            "contentId": 734133,
            "title": "Rd 4: TRY James Tedesco (56th min)",
            "description": "Luke Brooks masterclass as he kicks back against the grain for James Tedesco to cross for his double",
            "publishDate": "2015-03-27T21:06:00+11:00",
            "publisher": "NRL Chief",
            "thumbnailUrl": "http://bigpondvideo.com/Web/Images/Content/20150327210518a_89x50.jpg",
            "largeThumbnailUrl": "http://bigpondvideo.com/Web/Images/Content/20150327210518a_326x184.jpg",
            "programType": "Instant Replay",
            "programCategory": "Score",
            "priority": 6,
            "lastUpdateDate": "2015-03-27T21:59:12+11:00",
            "isPremium": true,
            "club": [
                500010,
                500023
            ]
        },
        {
            "id": "N5NXE3dDp9mVHaDxYdr8ncZe4w50xiQb",
            "contentId": 734134,
            "title": "Rd 4: GOAL Mitchell Moses (50th min)",
            "description": "Conversion sees the Wests Tigers lead by 12",
            "publishDate": "2015-03-27T21:01:00+11:00",
            "publisher": "NRL Chief",
            "thumbnailUrl": "http://bigpondvideo.com/Web/Images/Content/20150327210131a_89x50.jpg",
            "largeThumbnailUrl": "http://bigpondvideo.com/Web/Images/Content/20150327210131a_326x184.jpg",
            "programType": "Instant Replay",
            "programCategory": "Score",
            "priority": null,
            "lastUpdateDate": "2015-03-27T21:11:45+11:00",
            "isPremium": true,
            "club": [
                500010,
                500023
            ]
        },
        {
            "id": "ltNXE3dDppGqVM1vORAGOhlmFYGss7VN",
            "contentId": 734124,
            "title": "Rd 4: TRY James Tedesco (49th min)",
            "description": "Wests Tigers go back to back as this time Luke Brooks plays provider for James Tedesco to score",
            "publishDate": "2015-03-27T20:59:00+11:00",
            "publisher": "NRL Chief",
            "thumbnailUrl": "http://bigpondvideo.com/Web/Images/Content/20150327205840a_89x50.jpg",
            "largeThumbnailUrl": "http://bigpondvideo.com/Web/Images/Content/20150327205840a_326x184.jpg",
            "programType": "Instant Replay",
            "programCategory": "Score",
            "priority": 7,
            "lastUpdateDate": "2015-03-27T21:59:12+11:00",
            "isPremium": true,
            "club": [
                500010,
                500023
            ]
        },
        {
            "id": "E4NXE3dDo1s0JT2bk_jSO2B6nPy9TunT",
            "contentId": 734129,
            "title": "Rd 4: GOAL Mitchell Moses (48th min)",
            "description": "Conversion sees the Wests Tigers lead 12-6",
            "publishDate": "2015-03-27T20:57:00+11:00",
            "publisher": "NRL Chief",
            "thumbnailUrl": "http://bigpondvideo.com/Web/Images/Content/20150327205648a_89x50.jpg",
            "largeThumbnailUrl": "http://bigpondvideo.com/Web/Images/Content/20150327205648a_326x184.jpg",
            "programType": "Instant Replay",
            "programCategory": "Score",
            "priority": null,
            "lastUpdateDate": "2015-03-27T21:02:40+11:00",
            "isPremium": true,
            "club": [
                500010,
                500023
            ]
        },
        {
            "id": "ozNHE3dDqgIc531ItY_uoXwXl9gIscY3",
            "contentId": 734128,
            "title": "Rd 4: TRY Luke Brooks (46th min)",
            "description": "Luke Brooks cleans up a poor kick from the Bulldogs and races away 80m to score",
            "publishDate": "2015-03-27T20:55:00+11:00",
            "publisher": "NRL Chief",
            "thumbnailUrl": "http://bigpondvideo.com/Web/Images/Content/20150327205615a_89x50.jpg",
            "largeThumbnailUrl": "http://bigpondvideo.com/Web/Images/Content/20150327205615a_326x184.jpg",
            "programType": "Instant Replay",
            "programCategory": "Score",
            "priority": 8,
            "lastUpdateDate": "2015-03-27T21:58:11+11:00",
            "isPremium": true,
            "club": [
                500010,
                500023
            ]
        },
        {
            "id": "JhbXA3dDqrV0vc1UZSf4KYjvS31iE8tj",
            "contentId": 734130,
            "title": "Rd 4: GOAL Trent Hodkinson (18th min)",
            "description": "Conversion locks the score up at 6-all",
            "publishDate": "2015-03-27T20:08:00+11:00",
            "publisher": "NRL Chief",
            "thumbnailUrl": "http://bigpondvideo.com/Web/Images/Content/20150327200826a_89x50.jpg",
            "largeThumbnailUrl": "http://bigpondvideo.com/Web/Images/Content/20150327200826a_326x184.jpg",
            "programType": "Instant Replay",
            "programCategory": "Score",
            "priority": null,
            "lastUpdateDate": "2015-03-27T20:13:15+11:00",
            "isPremium": true,
            "club": [
                500010,
                500023
            ]
        },
        {
            "id": "02bXA3dDryRv2yyuBMS4sgvmkoQrEu-Z",
            "contentId": 734125,
            "title": "Rd 4: TRY Curtis Rona (16th min)",
            "description": "Bulldogs strike back after a fantastic ball by Frank Pritchard sends Curtis Rona over",
            "publishDate": "2015-03-27T20:06:00+11:00",
            "publisher": "NRL Chief",
            "thumbnailUrl": "http://bigpondvideo.com/Web/Images/Content/20150327200703a_89x50.jpg",
            "largeThumbnailUrl": "http://bigpondvideo.com/Web/Images/Content/20150327200703a_326x184.jpg",
            "programType": "Instant Replay",
            "programCategory": "Score",
            "priority": 9,
            "lastUpdateDate": "2015-03-27T21:57:11+11:00",
            "isPremium": true,
            "club": [
                500010,
                500023
            ]
        },
        {
            "id": "JzaXA3dDrsJxpy7Vx8Op00Vf0Edy7zhq",
            "contentId": 734126,
            "title": "Rd 4: GOAL Mitchell Moses (7th min)",
            "description": "Conversion sees the Wests Tigers lead 6-0",
            "publishDate": "2015-03-27T19:56:10+11:00",
            "publisher": "NRL Chief",
            "thumbnailUrl": "http://bigpondvideo.com/Web/Images/Content/20150327195535a_89x50.jpg",
            "largeThumbnailUrl": "http://bigpondvideo.com/Web/Images/Content/20150327195535a_326x184.jpg",
            "programType": "Instant Replay",
            "programCategory": "Score",
            "priority": null,
            "lastUpdateDate": "2015-03-27T20:08:13+11:00",
            "isPremium": true,
            "club": [
                500010,
                500023
            ]
        },
        {
            "id": "1xaXA3dDqODjotpbGEQZqAR8ZLm5oMPF",
            "contentId": 734121,
            "title": "Rd 4: TRY Kyle Lovett (5th min)",
            "description": "Wests Tigers open the scoring in this match as a great ball from Luke Brooks sends Kyle Lovett over to score",
            "publishDate": "2015-03-27T19:55:00+11:00",
            "publisher": "NRL Chief",
            "thumbnailUrl": "http://bigpondvideo.com/Web/Images/Content/20150327195512a_89x50.jpg",
            "largeThumbnailUrl": "http://bigpondvideo.com/Web/Images/Content/20150327195512a_326x184.jpg",
            "programType": "Instant Replay",
            "programCategory": "Score",
            "priority": 10,
            "lastUpdateDate": "2015-03-27T21:46:06+11:00",
            "isPremium": true,
            "club": [
                500010,
                500023
            ]
        }
    ],
    "scores": [
        {
            "gameState": "First Half",
            "gameStateId": 3,
            "gameTime": "0:04:33",
            "gameSeconds": 273,
            "playerId": 500480,
            "playerName": "Kyle Lovett",
            "scoreMethod": "Try",
            "statId": 38,
            "statValue": 4,
            "vidRef": 8613,
            "homeScore": 4,
            "teamId": 500023,
            "teamName": "Wests Tigers",
            "homeTeamAbbrv": "WST",
            "awayTeamAbbrv": "CBY"
        },
        {
            "gameState": "First Half",
            "gameStateId": 3,
            "gameTime": "0:06:00",
            "gameSeconds": 360,
            "playerId": 500485,
            "playerName": "Mitchell Moses",
            "scoreMethod": "Conversion",
            "statId": 1,
            "statValue": 2,
            "vidRef": 10801,
            "homeScore": 6,
            "teamId": 500023,
            "teamName": "Wests Tigers",
            "homeTeamAbbrv": "WST",
            "awayTeamAbbrv": "CBY"
        },
        {
            "gameState": "Second Half",
            "gameStateId": 5,
            "gameTime": "0:45:30",
            "gameSeconds": 2730,
            "playerId": 500646,
            "playerName": "Luke Brooks",
            "scoreMethod": "Try",
            "statId": 38,
            "statValue": 4,
            "vidRef": 82362,
            "homeScore": 10,
            "awayScore": 6,
            "teamId": 500023,
            "teamName": "Wests Tigers",
            "homeTeamAbbrv": "WST",
            "awayTeamAbbrv": "CBY"
        },
        {
            "gameState": "Second Half",
            "gameStateId": 5,
            "gameTime": "0:47:02",
            "gameSeconds": 2822,
            "playerId": 500485,
            "playerName": "Mitchell Moses",
            "scoreMethod": "Conversion",
            "statId": 1,
            "statValue": 2,
            "vidRef": 84660,
            "homeScore": 12,
            "awayScore": 6,
            "teamId": 500023,
            "teamName": "Wests Tigers",
            "homeTeamAbbrv": "WST",
            "awayTeamAbbrv": "CBY"
        },
        {
            "gameState": "Second Half",
            "gameStateId": 5,
            "gameTime": "0:48:13",
            "gameSeconds": 2893,
            "playerId": 500663,
            "playerName": "James Tedesco",
            "scoreMethod": "Try",
            "statId": 38,
            "statValue": 4,
            "vidRef": 86438,
            "homeScore": 16,
            "awayScore": 6,
            "teamId": 500023,
            "teamName": "Wests Tigers",
            "homeTeamAbbrv": "WST",
            "awayTeamAbbrv": "CBY"
        },
        {
            "gameState": "Second Half",
            "gameStateId": 5,
            "gameTime": "0:49:51",
            "gameSeconds": 2991,
            "playerId": 500485,
            "playerName": "Mitchell Moses",
            "scoreMethod": "Conversion",
            "statId": 1,
            "statValue": 2,
            "vidRef": 88887,
            "homeScore": 18,
            "awayScore": 6,
            "teamId": 500023,
            "teamName": "Wests Tigers",
            "homeTeamAbbrv": "WST",
            "awayTeamAbbrv": "CBY"
        },
        {
            "gameState": "Second Half",
            "gameStateId": 5,
            "gameTime": "0:55:23",
            "gameSeconds": 3323,
            "playerId": 500663,
            "playerName": "James Tedesco",
            "scoreMethod": "Try",
            "statId": 38,
            "statValue": 4,
            "vidRef": 97189,
            "homeScore": 22,
            "awayScore": 6,
            "teamId": 500023,
            "teamName": "Wests Tigers",
            "homeTeamAbbrv": "WST",
            "awayTeamAbbrv": "CBY"
        },
        {
            "gameState": "Second Half",
            "gameStateId": 5,
            "gameTime": "0:56:52",
            "gameSeconds": 3412,
            "playerId": 500485,
            "playerName": "Mitchell Moses",
            "scoreMethod": "Conversion",
            "statId": 1,
            "statValue": 2,
            "vidRef": 99403,
            "homeScore": 24,
            "awayScore": 6,
            "teamId": 500023,
            "teamName": "Wests Tigers",
            "homeTeamAbbrv": "WST",
            "awayTeamAbbrv": "CBY"
        },
        {
            "gameState": "First Half",
            "gameStateId": 3,
            "gameTime": "0:15:08",
            "gameSeconds": 908,
            "playerId": 500294,
            "playerName": "Curtis Rona",
            "scoreMethod": "Try",
            "statId": 38,
            "statValue": 4,
            "vidRef": 24505,
            "homeScore": 6,
            "awayScore": 4,
            "teamId": 500010,
            "teamName": "Canterbury-Bankstown Bulldogs",
            "homeTeamAbbrv": "WST",
            "awayTeamAbbrv": "CBY"
        },
        {
            "gameState": "First Half",
            "gameStateId": 3,
            "gameTime": "0:16:23",
            "gameSeconds": 983,
            "playerId": 500224,
            "playerName": "Trent Hodkinson",
            "scoreMethod": "Conversion",
            "statId": 1,
            "statValue": 2,
            "vidRef": 28174,
            "homeScore": 6,
            "awayScore": 6,
            "teamId": 500010,
            "teamName": "Canterbury-Bankstown Bulldogs",
            "homeTeamAbbrv": "WST",
            "awayTeamAbbrv": "CBY"
        },
        {
            "gameState": "Second Half",
            "gameStateId": 5,
            "gameTime": "0:58:04",
            "gameSeconds": 3484,
            "playerId": 500803,
            "playerName": "Michael Lichaa",
            "scoreMethod": "Try",
            "statId": 38,
            "statValue": 4,
            "vidRef": 102562,
            "homeScore": 24,
            "awayScore": 10,
            "teamId": 500010,
            "teamName": "Canterbury-Bankstown Bulldogs",
            "homeTeamAbbrv": "WST",
            "awayTeamAbbrv": "CBY"
        },
        {
            "gameState": "Second Half",
            "gameStateId": 5,
            "gameTime": "0:58:52",
            "gameSeconds": 3532,
            "playerId": 500224,
            "playerName": "Trent Hodkinson",
            "scoreMethod": "Conversion",
            "statId": 1,
            "statValue": 2,
            "vidRef": 103761,
            "homeScore": 24,
            "awayScore": 12,
            "teamId": 500010,
            "teamName": "Canterbury-Bankstown Bulldogs",
            "homeTeamAbbrv": "WST",
            "awayTeamAbbrv": "CBY"
        },
        {
            "gameState": "Second Half",
            "gameStateId": 5,
            "gameTime": "1:06:42",
            "gameSeconds": 4002,
            "playerId": 500294,
            "playerName": "Curtis Rona",
            "scoreMethod": "Try",
            "statId": 38,
            "statValue": 4,
            "vidRef": 116227,
            "homeScore": 24,
            "awayScore": 16,
            "teamId": 500010,
            "teamName": "Canterbury-Bankstown Bulldogs",
            "homeTeamAbbrv": "WST",
            "awayTeamAbbrv": "CBY"
        },
        {
            "gameState": "Second Half",
            "gameStateId": 5,
            "gameTime": "1:07:55",
            "gameSeconds": 4075,
            "playerId": 500224,
            "playerName": "Trent Hodkinson",
            "scoreMethod": "Conversion",
            "statId": 1,
            "statValue": 2,
            "vidRef": 118059,
            "homeScore": 24,
            "awayScore": 18,
            "teamId": 500010,
            "teamName": "Canterbury-Bankstown Bulldogs",
            "homeTeamAbbrv": "WST",
            "awayTeamAbbrv": "CBY"
        },
        {
            "gameState": "Second Half",
            "gameStateId": 5,
            "gameTime": "1:14:25",
            "gameSeconds": 4465,
            "playerId": 500232,
            "playerName": "Josh Morris",
            "scoreMethod": "Try",
            "statId": 38,
            "statValue": 4,
            "vidRef": 129559,
            "homeScore": 24,
            "awayScore": 22,
            "teamId": 500010,
            "teamName": "Canterbury-Bankstown Bulldogs",
            "homeTeamAbbrv": "WST",
            "awayTeamAbbrv": "CBY"
        },
        {
            "gameState": "Second Half",
            "gameStateId": 5,
            "gameTime": "1:16:05",
            "gameSeconds": 4565,
            "playerId": 500224,
            "playerName": "Trent Hodkinson",
            "scoreMethod": "Conversion",
            "statId": 1,
            "statValue": 2,
            "vidRef": 132057,
            "homeScore": 24,
            "awayScore": 24,
            "teamId": 500010,
            "teamName": "Canterbury-Bankstown Bulldogs",
            "homeTeamAbbrv": "WST",
            "awayTeamAbbrv": "CBY"
        },
        {
            "gameState": "Extra Time",
            "gameStateId": 6,
            "gameTime": "1:23:36",
            "gameSeconds": 5016,
            "playerId": 500243,
            "playerName": "Moses Mbye",
            "scoreMethod": "Field Goal",
            "statId": 69,
            "statValue": 1,
            "vidRef": 148062,
            "homeScore": 24,
            "awayScore": 25,
            "teamId": 500010,
            "teamName": "Canterbury-Bankstown Bulldogs",
            "homeTeamAbbrv": "WST",
            "awayTeamAbbrv": "CBY"
        }
    ]
}