{
    "vod": [
        {
            "id": "Jyc2pmYzE6vCMaGORdgIsJs-OlwCIeFI",
            "contentId": 934348,
            "title": "Rd 25: Sharks v Roosters (Hls)",
            "description": "Highlights of the clash between the Sharks & Roosters",
            "publishDate": "2017-08-26T21:22:40+10:00",
            "publisher": "NRL Chief",
            "thumbnailUrl": "http://bpvideos.telstra.insnw.net/web/images/20170826212043a_89x50.jpg",
            "largeThumbnailUrl": "http://bpvideos.telstra.insnw.net/web/images/20170826212043a_326x184.jpg",
            "programType": "Highlights",
            "programCategory": "Match",
            "priority": null,
            "lastUpdateDate": "2017-08-26T21:27:15+10:00",
            "isPremium": false,
            "club": [
                500028,
                500001
            ]
        },
        {
            "id": "oxM2tmYzE6mxzVvDRhbGbHxQdPKGN7kt",
            "contentId": 934754,
            "title": "Rd 25 Press Conference: Roosters",
            "description": "Roosters coach Trent Robinson speaks with the media following his side's Round 25 clash",
            "publishDate": "2017-08-26T21:58:55+10:00",
            "publisher": "NRL Chief",
            "thumbnailUrl": "http://bpvideos.telstra.insnw.net/web/images/20170826215849a_89x50.jpg",
            "largeThumbnailUrl": "http://bpvideos.telstra.insnw.net/web/images/20170826215849a_326x184.jpg",
            "programType": "Press Conference",
            "programCategory": null,
            "priority": null,
            "lastUpdateDate": "2017-08-26T22:04:24+10:00",
            "isPremium": false,
            "club": [
                500028,
                500001
            ]
        },
        {
            "id": "51MmtmYzE6duEP__xyc3Oitm3lbIyXvj",
            "contentId": 934755,
            "title": "Rd 25 Press Conference: Sharks",
            "description": "Sharks coach Shane Flanagan speaks with the media following his side's Round 25 clash",
            "publishDate": "2017-08-26T21:58:35+10:00",
            "publisher": "NRL Chief",
            "thumbnailUrl": "http://bpvideos.telstra.insnw.net/web/images/20170826215819a_89x50.jpg",
            "largeThumbnailUrl": "http://bpvideos.telstra.insnw.net/web/images/20170826215819a_326x184.jpg",
            "programType": "Press Conference",
            "programCategory": null,
            "priority": null,
            "lastUpdateDate": "2017-08-26T22:03:23+10:00",
            "isPremium": false,
            "club": [
                500028,
                500001
            ]
        },
        {
            "id": "NwcWpmYzE63Go8-fj75yRM9dvY5kHfkw",
            "contentId": 934950,
            "title": "Rd 25: PENALTY GOAL Michael Gordon (79th min)",
            "description": "Michael Gordon kicks the Roosters to victory",
            "publishDate": "2017-08-26T21:13:48+10:00",
            "publisher": "NRL Chief",
            "thumbnailUrl": "http://bpvideos.telstra.insnw.net/web/images/20170826211345a_89x50.jpg",
            "largeThumbnailUrl": "http://bpvideos.telstra.insnw.net/web/images/20170826211345a_326x184.jpg",
            "programType": "Instant Replay",
            "programCategory": "Score",
            "priority": null,
            "lastUpdateDate": "2017-08-26T21:17:13+10:00",
            "isPremium": true,
            "club": [
                500028,
                500001
            ]
        },
        {
            "id": "Z0b2pmYzE6LH3X41K2TKSnV6nvK-WIKJ",
            "contentId": 934949,
            "title": "Rd 25: GOAL James Maloney (73rd min)",
            "description": "James Maloney converts to level the scores",
            "publishDate": "2017-08-26T21:06:32+10:00",
            "publisher": "NRL Chief",
            "thumbnailUrl": "http://bpvideos.telstra.insnw.net/web/images/20170826210548a_89x50.jpg",
            "largeThumbnailUrl": "http://bpvideos.telstra.insnw.net/web/images/20170826210548a_326x184.jpg",
            "programType": "Instant Replay",
            "programCategory": "Score",
            "priority": null,
            "lastUpdateDate": "2017-08-26T21:11:11+10:00",
            "isPremium": true,
            "club": [
                500028,
                500001
            ]
        },
        {
            "id": "xqb2pmYzE6PUaPWj7SDh-mVEm4nBMEhf",
            "contentId": 934948,
            "title": "Rd 25: TRY Luke Lewis (72nd min)",
            "description": "Luke Lewis crosses to draw his side closer to the Roosters",
            "publishDate": "2017-08-26T21:04:52+10:00",
            "publisher": "NRL Chief",
            "thumbnailUrl": "http://bpvideos.telstra.insnw.net/web/images/20170826210448a_89x50.jpg",
            "largeThumbnailUrl": "http://bpvideos.telstra.insnw.net/web/images/20170826210448a_326x184.jpg",
            "programType": "Instant Replay",
            "programCategory": "Score",
            "priority": null,
            "lastUpdateDate": "2017-08-26T21:09:11+10:00",
            "isPremium": true,
            "club": [
                500028,
                500001
            ]
        },
        {
            "id": "VzampmYzE6jCF17ByQPN5sp3Ao2AJCLr",
            "contentId": 934937,
            "title": "Rd 25: PENALTY GOAL Michael Gordon (55th min)",
            "description": "Michael Gordon kicks the Roosters out to a six-point lead",
            "publishDate": "2017-08-26T20:46:15+10:00",
            "publisher": "NRL Chief",
            "thumbnailUrl": "http://bpvideos.telstra.insnw.net/web/images/20170826204629a_89x50.jpg",
            "largeThumbnailUrl": "http://bpvideos.telstra.insnw.net/web/images/20170826204629a_326x184.jpg",
            "programType": "Instant Replay",
            "programCategory": "Score",
            "priority": null,
            "lastUpdateDate": "2017-08-26T20:51:07+10:00",
            "isPremium": true,
            "club": [
                500028,
                500001
            ]
        },
        {
            "id": "lwYWpmYzE6XGOxAeXdk67jyTsGdsIpso",
            "contentId": 934922,
            "title": "Rd 25: GOAL James Maloney (33rd min)",
            "description": "James Maloney converts the try of Valentine Holmes",
            "publishDate": "2017-08-26T20:09:53+10:00",
            "publisher": "NRL Chief",
            "thumbnailUrl": "http://bpvideos.telstra.insnw.net/web/images/20170826200900a_89x50.jpg",
            "largeThumbnailUrl": "http://bpvideos.telstra.insnw.net/web/images/20170826200900a_326x184.jpg",
            "programType": "Instant Replay",
            "programCategory": "Score",
            "priority": null,
            "lastUpdateDate": "2017-08-26T20:13:59+10:00",
            "isPremium": true,
            "club": [
                500028,
                500001
            ]
        },
        {
            "id": "I3YWpmYzE6m0x3UO1KV_Re7tqEgNcnME",
            "contentId": 934921,
            "title": "Rd 25: TRY Valentine Holmes (32nd min)",
            "description": "Valentine Holmes scores an incredible try for the Sharks",
            "publishDate": "2017-08-26T20:08:40+10:00",
            "publisher": "NRL Chief",
            "thumbnailUrl": "http://bpvideos.telstra.insnw.net/web/images/20170826200842a_89x50.jpg",
            "largeThumbnailUrl": "http://bpvideos.telstra.insnw.net/web/images/20170826200842a_326x184.jpg",
            "programType": "Instant Replay",
            "programCategory": "Score",
            "priority": null,
            "lastUpdateDate": "2017-08-26T20:12:58+10:00",
            "isPremium": true,
            "club": [
                500028,
                500001
            ]
        },
        {
            "id": "hvOWpmYzE62TH2AD82DS4EmPhdC0JKXB",
            "contentId": 934915,
            "title": "Rd 25: TRY Blake Ferguson (27th min)",
            "description": "Blake Ferguson scores his side's second try",
            "publishDate": "2017-08-26T20:06:32+10:00",
            "publisher": "NRL Chief",
            "thumbnailUrl": "http://bpvideos.telstra.insnw.net/web/images/20170826200616a_89x50.jpg",
            "largeThumbnailUrl": "http://bpvideos.telstra.insnw.net/web/images/20170826200616a_326x184.jpg",
            "programType": "Instant Replay",
            "programCategory": "Score",
            "priority": null,
            "lastUpdateDate": "2017-08-26T20:09:58+10:00",
            "isPremium": true,
            "club": [
                500028,
                500001
            ]
        },
        {
            "id": "l0NmpmYzE6vue0qdw8C4y7iz5qv_7Ook",
            "contentId": 934907,
            "title": "Rd 25: GOAL Michael Gordon (18th min)",
            "description": "Michael Gordon converts the try of Isaac Liu",
            "publishDate": "2017-08-26T19:52:55+10:00",
            "publisher": "NRL Chief",
            "thumbnailUrl": "http://bpvideos.telstra.insnw.net/web/images/20170826195244a_89x50.jpg",
            "largeThumbnailUrl": "http://bpvideos.telstra.insnw.net/web/images/20170826195244a_326x184.jpg",
            "programType": "Instant Replay",
            "programCategory": "Score",
            "priority": null,
            "lastUpdateDate": "2017-08-26T19:56:54+10:00",
            "isPremium": true,
            "club": [
                500028,
                500001
            ]
        },
        {
            "id": "F4NmpmYzE6xmEGiwx--oUW7Q-ZZhGKQj",
            "contentId": 934908,
            "title": "Rd 25: TRY Isaac Liu (17th min)",
            "description": "Isaac Liu barges over for the first four-pointer",
            "publishDate": "2017-08-26T19:52:50+10:00",
            "publisher": "NRL Chief",
            "thumbnailUrl": "http://bpvideos.telstra.insnw.net/web/images/20170826195225a_89x50.jpg",
            "largeThumbnailUrl": "http://bpvideos.telstra.insnw.net/web/images/20170826195225a_326x184.jpg",
            "programType": "Instant Replay",
            "programCategory": "Score",
            "priority": null,
            "lastUpdateDate": "2017-08-26T19:56:54+10:00",
            "isPremium": true,
            "club": [
                500028,
                500001
            ]
        },
        {
            "id": "tuNmpmYzE6OQJnHpYLg4Df73OltesGVS",
            "contentId": 934909,
            "title": "Rd 25: PENALTY GOAL Michael Gordon (12th min)",
            "description": "Michael Gordon draws the two sides level",
            "publishDate": "2017-08-26T19:46:04+10:00",
            "publisher": "NRL Chief",
            "thumbnailUrl": "http://bpvideos.telstra.insnw.net/web/images/20170826195154a_89x50.jpg",
            "largeThumbnailUrl": "http://bpvideos.telstra.insnw.net/web/images/20170826195154a_326x184.jpg",
            "programType": "Instant Replay",
            "programCategory": "Score",
            "priority": null,
            "lastUpdateDate": "2017-08-26T19:55:54+10:00",
            "isPremium": true,
            "club": [
                500028,
                500001
            ]
        },
        {
            "id": "4xNGpmYzE607SP-GtXkstKBsjLm-4EiZ",
            "contentId": 934902,
            "title": "Rd 25: PENALTY GOAL James Maloney (8th min)",
            "description": "James Maloney kicks the Sharks off the mark",
            "publishDate": "2017-08-26T19:43:07+10:00",
            "publisher": "NRL Chief",
            "thumbnailUrl": "http://bpvideos.telstra.insnw.net/web/images/20170826194245a_89x50.jpg",
            "largeThumbnailUrl": "http://bpvideos.telstra.insnw.net/web/images/20170826194245a_326x184.jpg",
            "programType": "Instant Replay",
            "programCategory": "Score",
            "priority": null,
            "lastUpdateDate": "2017-08-26T19:46:51+10:00",
            "isPremium": true,
            "club": [
                500028,
                500001
            ]
        }
    ],
    "scores": [
        {
            "gameState": "First Half",
            "gameStateId": 3,
            "gameTime": "0:07:40",
            "gameSeconds": 460,
            "GameMinutes": "07:40",
            "playerId": 500006,
            "playerName": "James Maloney",
            "scoreMethod": "Penalty Goal",
            "statEvent": "Penalty Shot-Made",
            "statId": 67,
            "statValue": 2,
            "vidRef": 11553,
            "homeScore": 2,
            "commentary": "Penalty Shot-Made by James Maloney",
            "tackleNum": -1,
            "teamId": 500028,
            "teamName": "Cronulla-Sutherland Sharks",
            "homeTeamAbbrv": "CRO",
            "awayTeamAbbrv": "SYD"
        },
        {
            "gameState": "First Half",
            "gameStateId": 3,
            "gameTime": "0:31:37",
            "gameSeconds": 1897,
            "GameMinutes": "31:37",
            "playerId": 500845,
            "playerName": "Valentine Holmes",
            "scoreMethod": "Try",
            "statEvent": "Try",
            "statId": 38,
            "statValue": 4,
            "vidRef": 49034,
            "homeScore": 6,
            "awayScore": 12,
            "commentary": "Try by Valentine Holmes",
            "tackleNum": 5,
            "teamId": 500028,
            "teamName": "Cronulla-Sutherland Sharks",
            "homeTeamAbbrv": "CRO",
            "awayTeamAbbrv": "SYD"
        },
        {
            "gameState": "First Half",
            "gameStateId": 3,
            "gameTime": "0:32:44",
            "gameSeconds": 1964,
            "GameMinutes": "32:44",
            "playerId": 500006,
            "playerName": "James Maloney",
            "scoreMethod": "Conversion",
            "statEvent": "Conversion-Made",
            "statId": 1,
            "statValue": 2,
            "vidRef": 51995,
            "homeScore": 8,
            "awayScore": 12,
            "commentary": "Conversion-Made by James Maloney",
            "tackleNum": -1,
            "teamId": 500028,
            "teamName": "Cronulla-Sutherland Sharks",
            "homeTeamAbbrv": "CRO",
            "awayTeamAbbrv": "SYD"
        },
        {
            "gameState": "Second Half",
            "gameStateId": 5,
            "gameTime": "1:11:25",
            "gameSeconds": 4285,
            "GameMinutes": "71:25",
            "playerId": 500802,
            "playerName": "Luke Lewis",
            "scoreMethod": "Try",
            "statEvent": "Try",
            "statId": 38,
            "statValue": 4,
            "vidRef": 113975,
            "homeScore": 12,
            "awayScore": 14,
            "commentary": "Try by Luke Lewis",
            "tackleNum": 3,
            "teamId": 500028,
            "teamName": "Cronulla-Sutherland Sharks",
            "homeTeamAbbrv": "CRO",
            "awayTeamAbbrv": "SYD"
        },
        {
            "gameState": "Second Half",
            "gameStateId": 5,
            "gameTime": "1:12:53",
            "gameSeconds": 4373,
            "GameMinutes": "72:53",
            "playerId": 500006,
            "playerName": "James Maloney",
            "scoreMethod": "Conversion",
            "statEvent": "Conversion-Made",
            "statId": 1,
            "statValue": 2,
            "vidRef": 116255,
            "homeScore": 14,
            "awayScore": 14,
            "commentary": "Conversion-Made by James Maloney",
            "tackleNum": -1,
            "teamId": 500028,
            "teamName": "Cronulla-Sutherland Sharks",
            "homeTeamAbbrv": "CRO",
            "awayTeamAbbrv": "SYD"
        },
        {
            "gameState": "First Half",
            "gameStateId": 3,
            "gameTime": "0:11:40",
            "gameSeconds": 700,
            "GameMinutes": "11:40",
            "playerId": 500797,
            "playerName": "Michael Gordon",
            "scoreMethod": "Penalty Goal",
            "statEvent": "Penalty Shot-Made",
            "statId": 67,
            "statValue": 2,
            "vidRef": 17549,
            "homeScore": 2,
            "awayScore": 2,
            "commentary": "Penalty Shot-Made by Michael Gordon",
            "tackleNum": -1,
            "teamId": 500001,
            "teamName": "Sydney Roosters",
            "homeTeamAbbrv": "CRO",
            "awayTeamAbbrv": "SYD"
        },
        {
            "gameState": "First Half",
            "gameStateId": 3,
            "gameTime": "0:15:54",
            "gameSeconds": 954,
            "GameMinutes": "15:54",
            "playerId": 500038,
            "playerName": "Isaac Liu",
            "scoreMethod": "Try",
            "statEvent": "Try",
            "statId": 38,
            "statValue": 4,
            "vidRef": 23897,
            "homeScore": 2,
            "awayScore": 6,
            "commentary": "Try by Isaac Liu",
            "tackleNum": 4,
            "teamId": 500001,
            "teamName": "Sydney Roosters",
            "homeTeamAbbrv": "CRO",
            "awayTeamAbbrv": "SYD"
        },
        {
            "gameState": "First Half",
            "gameStateId": 3,
            "gameTime": "0:17:16",
            "gameSeconds": 1036,
            "GameMinutes": "17:16",
            "playerId": 500797,
            "playerName": "Michael Gordon",
            "scoreMethod": "Conversion",
            "statEvent": "Conversion-Made",
            "statId": 1,
            "statValue": 2,
            "vidRef": 26750,
            "homeScore": 2,
            "awayScore": 8,
            "commentary": "Conversion-Made by Michael Gordon",
            "tackleNum": -1,
            "teamId": 500001,
            "teamName": "Sydney Roosters",
            "homeTeamAbbrv": "CRO",
            "awayTeamAbbrv": "SYD"
        },
        {
            "gameState": "First Half",
            "gameStateId": 3,
            "gameTime": "0:26:16",
            "gameSeconds": 1576,
            "GameMinutes": "26:16",
            "playerId": 501569,
            "playerName": "Blake Ferguson",
            "scoreMethod": "Try",
            "statEvent": "Try",
            "statId": 38,
            "statValue": 4,
            "vidRef": 40251,
            "homeScore": 2,
            "awayScore": 12,
            "commentary": "Try by Blake Ferguson",
            "tackleNum": 4,
            "teamId": 500001,
            "teamName": "Sydney Roosters",
            "homeTeamAbbrv": "CRO",
            "awayTeamAbbrv": "SYD"
        },
        {
            "gameState": "Second Half",
            "gameStateId": 5,
            "gameTime": "0:54:05",
            "gameSeconds": 3245,
            "GameMinutes": "54:05",
            "playerId": 500797,
            "playerName": "Michael Gordon",
            "scoreMethod": "Penalty Goal",
            "statEvent": "Penalty Shot-Made",
            "statId": 67,
            "statValue": 2,
            "vidRef": 85840,
            "homeScore": 8,
            "awayScore": 14,
            "commentary": "Penalty Shot-Made by Michael Gordon",
            "tackleNum": -1,
            "teamId": 500001,
            "teamName": "Sydney Roosters",
            "homeTeamAbbrv": "CRO",
            "awayTeamAbbrv": "SYD"
        },
        {
            "gameState": "Second Half",
            "gameStateId": 5,
            "gameTime": "1:19:44",
            "gameSeconds": 4784,
            "GameMinutes": "79:44",
            "playerId": 500797,
            "playerName": "Michael Gordon",
            "scoreMethod": "Penalty Goal",
            "statEvent": "Penalty Shot-Made",
            "statId": 67,
            "statValue": 2,
            "vidRef": 126834,
            "homeScore": 14,
            "awayScore": 16,
            "commentary": "Penalty Shot-Made by Michael Gordon",
            "tackleNum": -1,
            "teamId": 500001,
            "teamName": "Sydney Roosters",
            "homeTeamAbbrv": "CRO",
            "awayTeamAbbrv": "SYD"
        }
    ],
    "twitter": [
        {
            "id": "901385762326716416",
            "gameSeconds": 1920
        },
        {
            "id": "901385434420305920",
            "gameSeconds": 1920
        },
        {
            "id": "901381873401643009",
            "gameSeconds": 960
        },
        {
            "id": "901381647848710145",
            "gameSeconds": 960
        }
    ]
}