{
    "vod": [
        {
            "id": "VrZGhtYTE6XUZ-VcGlpExIkDyRfGl1n5",
            "contentId": 900962,
            "title": "Rd 5: Wests Tigers v Dragons (Hls)",
            "description": "Highlights of the Round 5 clash between Wests Tigers and Dragons",
            "publishDate": "2017-04-02T18:16:00+10:00",
            "publisher": "NRL Chief",
            "thumbnailUrl": "http://bpvideos.telstra.insnw.net/web/images/20170402180358a_89x50.png",
            "largeThumbnailUrl": "http://bpvideos.telstra.insnw.net/web/images/20170402180358a_326x184.png",
            "programType": "Highlights",
            "programCategory": "Match",
            "priority": null,
            "lastUpdateDate": "2017-04-02T18:24:39+10:00",
            "isPremium": false,
            "club": [
                500022,
                500023
            ]
        },
        {
            "id": "c0aGhtYTE6Mu7pFzAqp0_bU05-ZR-wB7",
            "contentId": 900999,
            "title": "Rd 5 Press Conference: Dragons",
            "description": "Dragons coach Paul McGregor answers the media's post-game questions",
            "publishDate": "2017-04-02T18:34:00+10:00",
            "publisher": "NRL Chief",
            "thumbnailUrl": "http://bpvideos.telstra.insnw.net/web/images/20170402183303a_89x50.jpg",
            "largeThumbnailUrl": "http://bpvideos.telstra.insnw.net/web/images/20170402183303a_326x184.jpg",
            "programType": "Press Conference",
            "programCategory": null,
            "priority": null,
            "lastUpdateDate": "2017-04-02T18:45:45+10:00",
            "isPremium": false,
            "club": [
                500022,
                500023
            ]
        },
        {
            "id": "JqZ2htYTE6WFgW8C2EeQMnR3sUbwaAdP",
            "contentId": 901002,
            "title": "Rd 5 Press Conference: Wests Tigers",
            "description": "Wests Tigers interim coach Andrew Webster answers the media's post-game questions",
            "publishDate": "2017-04-02T18:32:00+10:00",
            "publisher": "NRL Chief",
            "thumbnailUrl": "http://bpvideos.telstra.insnw.net/web/images/20170402182602a_89x50.jpg",
            "largeThumbnailUrl": "http://bpvideos.telstra.insnw.net/web/images/20170402182602a_326x184.jpg",
            "programType": "Press Conference",
            "programCategory": null,
            "priority": null,
            "lastUpdateDate": "2017-04-02T18:39:42+10:00",
            "isPremium": false,
            "club": [
                500022,
                500023
            ]
        },
        {
            "id": "o2MWhtYTE6VrWg_OkjqD3m12MA5xDXWE",
            "contentId": 902089,
            "title": "Rd 5: PENALTY GOAL Leeson Ah Mau (80th min)",
            "description": "Leeson Ah Mau puts the final two points on the Dragons' tally",
            "publishDate": "2017-04-02T18:02:55+10:00",
            "publisher": "NRL Chief",
            "thumbnailUrl": "http://bpvideos.telstra.insnw.net/web/images/20170402180241a_89x50.jpg",
            "largeThumbnailUrl": "http://bpvideos.telstra.insnw.net/web/images/20170402180241a_326x184.jpg",
            "programType": "Instant Replay",
            "programCategory": "Score",
            "priority": null,
            "lastUpdateDate": "2017-04-02T18:07:35+10:00",
            "isPremium": true,
            "club": [
                500022,
                500023
            ]
        },
        {
            "id": "pxeWdtYTE6cAjOXoxXB9Dt6mrE55hTkT",
            "contentId": 902088,
            "title": "Rd 5: GOAL Gareth Widdop (76th min)",
            "description": "Gareth Widdop converts the try of Nene Macdonald",
            "publishDate": "2017-04-02T17:56:39+10:00",
            "publisher": "NRL Chief",
            "thumbnailUrl": "http://bpvideos.telstra.insnw.net/web/images/20170402175439a_89x50.jpg",
            "largeThumbnailUrl": "http://bpvideos.telstra.insnw.net/web/images/20170402175439a_326x184.jpg",
            "programType": "Instant Replay",
            "programCategory": "Score",
            "priority": null,
            "lastUpdateDate": "2017-04-02T18:02:34+10:00",
            "isPremium": true,
            "club": [
                500022,
                500023
            ]
        },
        {
            "id": "9reWdtYTE6OxK_QZQxJg6__ta3MRlLZv",
            "contentId": 902087,
            "title": "Rd 5: TRY Nene Macdonald (74th min)",
            "description": "Nene Macdonald extends the Dragons' lead out wide",
            "publishDate": "2017-04-02T17:56:29+10:00",
            "publisher": "NRL Chief",
            "thumbnailUrl": "http://bpvideos.telstra.insnw.net/web/images/20170402175407a_89x50.jpg",
            "largeThumbnailUrl": "http://bpvideos.telstra.insnw.net/web/images/20170402175407a_326x184.jpg",
            "programType": "Instant Replay",
            "programCategory": "Score",
            "priority": null,
            "lastUpdateDate": "2017-04-02T18:01:34+10:00",
            "isPremium": true,
            "club": [
                500022,
                500023
            ]
        },
        {
            "id": "9zdWdtYTE6Hyf2F4_kCkiouNg7LbTAWE",
            "contentId": 902081,
            "title": "Rd 5: GOAL Gareth Widdop (60th min)",
            "description": "Gareth Widdop converts the try of Tim Lafai",
            "publishDate": "2017-04-02T17:38:32+10:00",
            "publisher": "NRL Chief",
            "thumbnailUrl": "http://bpvideos.telstra.insnw.net/web/images/20170402173746a_89x50.jpg",
            "largeThumbnailUrl": "http://bpvideos.telstra.insnw.net/web/images/20170402173746a_326x184.jpg",
            "programType": "Instant Replay",
            "programCategory": "Score",
            "priority": null,
            "lastUpdateDate": "2017-04-02T17:52:32+10:00",
            "isPremium": true,
            "club": [
                500022,
                500023
            ]
        },
        {
            "id": "ZndWdtYTE6EKDWNEyPRcm9OSjvRp-q1u",
            "contentId": 902080,
            "title": "Rd 5: TRY Tim Lafai (58th min)",
            "description": "Tim Lafai chases down a Gareth Widdop grubber to score",
            "publishDate": "2017-04-02T17:36:02+10:00",
            "publisher": "NRL Chief",
            "thumbnailUrl": "http://bpvideos.telstra.insnw.net/web/images/20170402173650a_89x50.jpg",
            "largeThumbnailUrl": "http://bpvideos.telstra.insnw.net/web/images/20170402173650a_326x184.jpg",
            "programType": "Instant Replay",
            "programCategory": "Score",
            "priority": null,
            "lastUpdateDate": "2017-04-02T17:52:32+10:00",
            "isPremium": true,
            "club": [
                500022,
                500023
            ]
        },
        {
            "id": "M2c2dtYTE6VTAbKKFNy665UjpvwOmtLA",
            "contentId": 902073,
            "title": "Rd 5: GOAL Mitchell Moses (50th min)",
            "description": "Mitchell Moses converts the try of Kevin Naiqama",
            "publishDate": "2017-04-02T17:29:22+10:00",
            "publisher": "NRL Chief",
            "thumbnailUrl": "http://bpvideos.telstra.insnw.net/web/images/20170402172913a_89x50.jpg",
            "largeThumbnailUrl": "http://bpvideos.telstra.insnw.net/web/images/20170402172913a_326x184.jpg",
            "programType": "Instant Replay",
            "programCategory": "Score",
            "priority": null,
            "lastUpdateDate": "2017-04-02T17:34:27+10:00",
            "isPremium": true,
            "club": [
                500022,
                500023
            ]
        },
        {
            "id": "BycmdtYTE6oMjY-V41DrSRtnINu4S0T8",
            "contentId": 902072,
            "title": "Rd 5: TRY Kevin Naiqama (49th min)",
            "description": "Kevin Naiqama scores the Tigers' long-awaited first points",
            "publishDate": "2017-04-02T17:26:31+10:00",
            "publisher": "NRL Chief",
            "thumbnailUrl": "http://bpvideos.telstra.insnw.net/web/images/20170402172653a_89x50.jpg",
            "largeThumbnailUrl": "http://bpvideos.telstra.insnw.net/web/images/20170402172653a_326x184.jpg",
            "programType": "Instant Replay",
            "programCategory": "Score",
            "priority": null,
            "lastUpdateDate": "2017-04-02T17:33:27+10:00",
            "isPremium": true,
            "club": [
                500022,
                500023
            ]
        },
        {
            "id": "5kamdtYTE6a7fNUEXFGdHAI8mX6l8ros",
            "contentId": 902052,
            "title": "Rd 5: TRY Jason Nightingale (32nd min)",
            "description": "Jason Nightingale crosses for a first-half hat-trick",
            "publishDate": "2017-04-02T16:53:56+10:00",
            "publisher": "NRL Chief",
            "thumbnailUrl": "http://bpvideos.telstra.insnw.net/web/images/20170402165330a_89x50.jpg",
            "largeThumbnailUrl": "http://bpvideos.telstra.insnw.net/web/images/20170402165330a_326x184.jpg",
            "programType": "Instant Replay",
            "programCategory": "Score",
            "priority": null,
            "lastUpdateDate": "2017-04-02T16:59:19+10:00",
            "isPremium": true,
            "club": [
                500022,
                500023
            ]
        },
        {
            "id": "Y4ZWdtYTE6HISPsCxKmUYCkkXEwRqCQD",
            "contentId": 902048,
            "title": "Rd 5: TRY Jason Nightingale (12th min)",
            "description": "Jason Nightingale scores a quick time double for the Red V",
            "publishDate": "2017-04-02T16:31:30+10:00",
            "publisher": "NRL Chief",
            "thumbnailUrl": "http://bpvideos.telstra.insnw.net/web/images/20170402163201a_89x50.jpg",
            "largeThumbnailUrl": "http://bpvideos.telstra.insnw.net/web/images/20170402163201a_326x184.jpg",
            "programType": "Instant Replay",
            "programCategory": "Score",
            "priority": null,
            "lastUpdateDate": "2017-04-02T16:37:15+10:00",
            "isPremium": true,
            "club": [
                500022,
                500023
            ]
        },
        {
            "id": "luYmdtYTE6W-NWYJBijIpSTRCBi1aRDX",
            "contentId": 902042,
            "title": "Rd 5: GOAL Gareth Widdop (8th min)",
            "description": "Gareth Widdop converts the try of Jason Nightingale",
            "publishDate": "2017-04-02T16:25:56+10:00",
            "publisher": "NRL Chief",
            "thumbnailUrl": "http://bpvideos.telstra.insnw.net/web/images/20170402162435a_89x50.jpg",
            "largeThumbnailUrl": "http://bpvideos.telstra.insnw.net/web/images/20170402162435a_326x184.jpg",
            "programType": "Instant Replay",
            "programCategory": "Score",
            "priority": null,
            "lastUpdateDate": "2017-04-02T16:30:13+10:00",
            "isPremium": true,
            "club": [
                500022,
                500023
            ]
        },
        {
            "id": "RtYWdtYTE6TsQRHoL2GJxiVL4Ft0HVmd",
            "contentId": 902040,
            "title": "Rd 5: TRY Jason Nightingale (7th min)",
            "description": "Jason Nightingale scores the first try for the Dragons",
            "publishDate": "2017-04-02T16:22:54+10:00",
            "publisher": "NRL Chief",
            "thumbnailUrl": "http://bpvideos.telstra.insnw.net/web/images/20170402162236a_89x50.jpg",
            "largeThumbnailUrl": "http://bpvideos.telstra.insnw.net/web/images/20170402162236a_326x184.jpg",
            "programType": "Instant Replay",
            "programCategory": "Score",
            "priority": null,
            "lastUpdateDate": "2017-04-02T16:29:12+10:00",
            "isPremium": true,
            "club": [
                500022,
                500023
            ]
        }
    ],
    "scores": [
        {
            "gameState": "Second Half",
            "gameStateId": 5,
            "gameTime": "0:48:11",
            "gameSeconds": 2891,
            "GameMinutes": "48:11",
            "playerId": 500041,
            "playerName": "Kevin Naiqama",
            "scoreMethod": "Try",
            "statEvent": "Try",
            "statId": 38,
            "statValue": 4,
            "vidRef": 81555,
            "homeScore": 4,
            "awayScore": 14,
            "commentary": "Try by Kevin Naiqama",
            "teamId": 500023,
            "teamName": "Wests Tigers",
            "homeTeamAbbrv": "WST",
            "awayTeamAbbrv": "SGI"
        },
        {
            "gameState": "Second Half",
            "gameStateId": 5,
            "gameTime": "0:49:14",
            "gameSeconds": 2954,
            "GameMinutes": "49:14",
            "playerId": 500485,
            "playerName": "Mitchell Moses",
            "scoreMethod": "Conversion",
            "statEvent": "Conversion-Made",
            "statId": 1,
            "statValue": 2,
            "vidRef": 83106,
            "homeScore": 6,
            "awayScore": 14,
            "commentary": "Conversion-Made by Mitchell Moses",
            "tackleNum": -1,
            "teamId": 500023,
            "teamName": "Wests Tigers",
            "homeTeamAbbrv": "WST",
            "awayTeamAbbrv": "SGI"
        },
        {
            "gameState": "First Half",
            "gameStateId": 3,
            "gameTime": "0:06:25",
            "gameSeconds": 385,
            "GameMinutes": "06:25",
            "playerId": 500634,
            "playerName": "Jason Nightingale",
            "scoreMethod": "Try",
            "statEvent": "Try",
            "statId": 38,
            "statValue": 4,
            "vidRef": 10458,
            "awayScore": 4,
            "commentary": "Try by Jason Nightingale",
            "tackleNum": 5,
            "teamId": 500022,
            "teamName": "St. George Illawarra Dragons",
            "homeTeamAbbrv": "WST",
            "awayTeamAbbrv": "SGI"
        },
        {
            "gameState": "First Half",
            "gameStateId": 3,
            "gameTime": "0:07:46",
            "gameSeconds": 466,
            "GameMinutes": "07:46",
            "playerId": 500641,
            "playerName": "Gareth Widdop",
            "scoreMethod": "Conversion",
            "statEvent": "Conversion-Made",
            "statId": 1,
            "statValue": 2,
            "vidRef": 12487,
            "awayScore": 6,
            "commentary": "Conversion-Made by Gareth Widdop",
            "tackleNum": -1,
            "teamId": 500022,
            "teamName": "St. George Illawarra Dragons",
            "homeTeamAbbrv": "WST",
            "awayTeamAbbrv": "SGI"
        },
        {
            "gameState": "First Half",
            "gameStateId": 3,
            "gameTime": "0:11:47",
            "gameSeconds": 707,
            "GameMinutes": "11:47",
            "playerId": 500634,
            "playerName": "Jason Nightingale",
            "scoreMethod": "Try",
            "statEvent": "Try",
            "statId": 38,
            "statValue": 4,
            "vidRef": 18530,
            "awayScore": 10,
            "commentary": "Try by Jason Nightingale",
            "tackleNum": 3,
            "teamId": 500022,
            "teamName": "St. George Illawarra Dragons",
            "homeTeamAbbrv": "WST",
            "awayTeamAbbrv": "SGI"
        },
        {
            "gameState": "First Half",
            "gameStateId": 3,
            "gameTime": "0:31:44",
            "gameSeconds": 1904,
            "GameMinutes": "31:44",
            "playerId": 500634,
            "playerName": "Jason Nightingale",
            "scoreMethod": "Try",
            "statEvent": "Try",
            "statId": 38,
            "statValue": 4,
            "vidRef": 52474,
            "awayScore": 14,
            "commentary": "Try by Jason Nightingale",
            "tackleNum": 3,
            "teamId": 500022,
            "teamName": "St. George Illawarra Dragons",
            "homeTeamAbbrv": "WST",
            "awayTeamAbbrv": "SGI"
        },
        {
            "gameState": "Second Half",
            "gameStateId": 5,
            "gameTime": "0:58:08",
            "gameSeconds": 3488,
            "GameMinutes": "58:08",
            "playerId": 500229,
            "playerName": "Timoteo Lafai",
            "scoreMethod": "Try",
            "statEvent": "Try",
            "statId": 38,
            "statValue": 4,
            "vidRef": 97275,
            "homeScore": 6,
            "awayScore": 18,
            "commentary": "Try by Timoteo Lafai",
            "tackleNum": 3,
            "teamId": 500022,
            "teamName": "St. George Illawarra Dragons",
            "homeTeamAbbrv": "WST",
            "awayTeamAbbrv": "SGI"
        },
        {
            "gameState": "Second Half",
            "gameStateId": 5,
            "gameTime": "0:59:33",
            "gameSeconds": 3573,
            "GameMinutes": "59:33",
            "playerId": 500641,
            "playerName": "Gareth Widdop",
            "scoreMethod": "Conversion",
            "statEvent": "Conversion-Made",
            "statId": 1,
            "statValue": 2,
            "vidRef": 99853,
            "homeScore": 6,
            "awayScore": 20,
            "commentary": "Conversion-Made by Gareth Widdop",
            "tackleNum": -1,
            "teamId": 500022,
            "teamName": "St. George Illawarra Dragons",
            "homeTeamAbbrv": "WST",
            "awayTeamAbbrv": "SGI"
        },
        {
            "gameState": "Second Half",
            "gameStateId": 5,
            "gameTime": "1:13:44",
            "gameSeconds": 4424,
            "GameMinutes": "73:44",
            "playerId": 500206,
            "playerName": "Nene Macdonald",
            "scoreMethod": "Try",
            "statEvent": "Try",
            "statId": 38,
            "statValue": 4,
            "vidRef": 123427,
            "homeScore": 6,
            "awayScore": 24,
            "commentary": "Try by Nene Macdonald",
            "tackleNum": 3,
            "teamId": 500022,
            "teamName": "St. George Illawarra Dragons",
            "homeTeamAbbrv": "WST",
            "awayTeamAbbrv": "SGI"
        },
        {
            "gameState": "Second Half",
            "gameStateId": 5,
            "gameTime": "1:15:08",
            "gameSeconds": 4508,
            "GameMinutes": "75:08",
            "playerId": 500641,
            "playerName": "Gareth Widdop",
            "scoreMethod": "Conversion",
            "statEvent": "Conversion-Made",
            "statId": 1,
            "statValue": 2,
            "vidRef": 125927,
            "homeScore": 6,
            "awayScore": 26,
            "commentary": "Conversion-Made by Gareth Widdop",
            "tackleNum": -1,
            "teamId": 500022,
            "teamName": "St. George Illawarra Dragons",
            "homeTeamAbbrv": "WST",
            "awayTeamAbbrv": "SGI"
        },
        {
            "gameState": "Second Half",
            "gameStateId": 5,
            "gameTime": "1:19:56",
            "gameSeconds": 4796,
            "GameMinutes": "79:56",
            "playerId": 500614,
            "playerName": "Leeson Ah Mau",
            "scoreMethod": "Penalty Goal",
            "statEvent": "Penalty Shot-Made",
            "statId": 67,
            "statValue": 2,
            "vidRef": 133607,
            "homeScore": 6,
            "awayScore": 28,
            "commentary": "Penalty Shot-Made by Leeson Ah Mau",
            "tackleNum": -1,
            "teamId": 500022,
            "teamName": "St. George Illawarra Dragons",
            "homeTeamAbbrv": "WST",
            "awayTeamAbbrv": "SGI"
        }
    ],
    "twitter": [
        {
            "id": "848429774338785280",
            "gameSeconds": 2280
        },
        {
            "id": "848429670773084160",
            "gameSeconds": 2280
        },
        {
            "id": "848424350868832257",
            "gameSeconds": 1140
        },
        {
            "id": "848424184296292352",
            "gameSeconds": 1140
        },
        {
            "id": "848419896014774272",
            "gameSeconds": 300
        },
        {
            "id": "848419671447486464",
            "gameSeconds": 300
        }
    ]
}