{
    "vod": [
        {
            "id": "tyb2J3NDE6fYfuQEh8ztedxBzIWZ36CE",
            "contentId": 865128,
            "title": "Rd 20: Titans v Eels (Hls)",
            "description": "Highlights of the match between the Titans and Eel from Cbus Super Stadium",
            "publishDate": "2016-07-23T19:40:00+10:00",
            "publisher": "NRL Chief",
            "thumbnailUrl": "http://bigpondvideo.com/web/images/content/20160723194048a_89x50.jpg",
            "largeThumbnailUrl": "http://bigpondvideo.com/web/images/content/20160723194048a_326x184.jpg",
            "programType": "Highlights",
            "programCategory": "Match",
            "priority": null,
            "lastUpdateDate": "2016-07-23T19:45:11+10:00",
            "isPremium": false,
            "club": [
                500031,
                500004
            ]
        },
        {
            "id": "Y1MWN3NDE6-fhcKi7mwhj254zT2L7-1g",
            "contentId": 865135,
            "title": "Rd 20 Press Conference: Titans",
            "description": "The Titans coach faces the media following the match",
            "publishDate": "2016-07-23T20:20:00+10:00",
            "publisher": "NRL Chief",
            "thumbnailUrl": "http://bigpondvideo.com/web/images/content/20160723195024a_89x50.jpg",
            "largeThumbnailUrl": "http://bigpondvideo.com/web/images/content/20160723195024a_326x184.jpg",
            "programType": "Press Conference",
            "programCategory": null,
            "priority": null,
            "lastUpdateDate": "2016-07-23T20:25:21+10:00",
            "isPremium": false,
            "club": [
                500031,
                500004
            ]
        },
        {
            "id": "BkdWJ3NDE6i0VMkOVgL303hmWlYJS7wn",
            "contentId": 865136,
            "title": "Rd 20 Press Conference: Eels",
            "description": "The Eels coach faces the media following the match",
            "publishDate": "2016-07-23T20:03:00+10:00",
            "publisher": "NRL Chief",
            "thumbnailUrl": "http://bigpondvideo.com/web/images/content/20160723194847a_89x50.jpg",
            "largeThumbnailUrl": "http://bigpondvideo.com/web/images/content/20160723194847a_326x184.jpg",
            "programType": "Press Conference",
            "programCategory": null,
            "priority": null,
            "lastUpdateDate": "2016-07-23T20:07:16+10:00",
            "isPremium": false,
            "club": [
                500031,
                500004
            ]
        },
        {
            "id": "JkbWJ3NDE6NwvaHtWacVe-gGwkfxGYAm",
            "contentId": 864633,
            "title": "Rd 20: GOAL Ashley Taylor (80th min)",
            "description": "Conversion gives u a full time scoreline of 34-14 to the Titans",
            "publishDate": "2016-07-23T19:24:00+10:00",
            "publisher": "NRL Chief",
            "thumbnailUrl": "http://bigpondvideo.com/web/images/content/20160723192419a_89x50.jpg",
            "largeThumbnailUrl": "http://bigpondvideo.com/web/images/content/20160723192419a_326x184.jpg",
            "programType": "Instant Replay",
            "programCategory": "Score",
            "priority": null,
            "lastUpdateDate": "2016-07-23T19:33:08+10:00",
            "isPremium": true,
            "club": [
                500031,
                500004
            ]
        },
        {
            "id": "w3bWJ3NDE6mgn7ARGXPBa15jn6Lg0V6Q",
            "contentId": 864632,
            "title": "Rd 20: TRY Ashley Taylor (80th min)",
            "description": "The Titans finish it in style as Ashley Taylor takes the intercept and races away to score",
            "publishDate": "2016-07-23T19:23:00+10:00",
            "publisher": "NRL Chief",
            "thumbnailUrl": "http://bigpondvideo.com/web/images/content/20160723192408a_89x50.jpg",
            "largeThumbnailUrl": "http://bigpondvideo.com/web/images/content/20160723192408a_326x184.jpg",
            "programType": "Instant Replay",
            "programCategory": "Score",
            "priority": 1,
            "lastUpdateDate": "2016-07-23T19:33:08+10:00",
            "isPremium": true,
            "club": [
                500031,
                500004
            ]
        },
        {
            "id": "RvamJ3NDE6WOSgt56wQF-dZwl1JxNOic",
            "contentId": 864631,
            "title": "Rd 20: GOAL Michael Gordon (75th min)",
            "description": "Conversion sees the visitors trail 28-14",
            "publishDate": "2016-07-23T19:16:00+10:00",
            "publisher": "NRL Chief",
            "thumbnailUrl": "http://bigpondvideo.com/web/images/content/20160723192007a_89x50.jpg",
            "largeThumbnailUrl": "http://bigpondvideo.com/web/images/content/20160723192007a_326x184.jpg",
            "programType": "Instant Replay",
            "programCategory": "Score",
            "priority": null,
            "lastUpdateDate": "2016-07-23T19:24:06+10:00",
            "isPremium": true,
            "club": [
                500031,
                500004
            ]
        },
        {
            "id": "9tamJ3NDE6s94QacrfgzX_qlwuVmuFyz",
            "contentId": 864630,
            "title": "Rd 20: TRY Jeff Robson (75th min)",
            "description": "The Eels get a late one through Jeff Robson",
            "publishDate": "2016-07-23T19:15:00+10:00",
            "publisher": "NRL Chief",
            "thumbnailUrl": "http://bigpondvideo.com/web/images/content/20160723191626a_89x50.jpg",
            "largeThumbnailUrl": "http://bigpondvideo.com/web/images/content/20160723191626a_326x184.jpg",
            "programType": "Instant Replay",
            "programCategory": "Score",
            "priority": 2,
            "lastUpdateDate": "2016-07-23T19:24:06+10:00",
            "isPremium": true,
            "club": [
                500031,
                500004
            ]
        },
        {
            "id": "g2cGJ3NDE6VN_wwIlWYJxZOllQhMHaBy",
            "contentId": 864629,
            "title": "Rd 20: GOAL Ashley Taylor (72nd min)",
            "description": "Conversion takes the Titans out to a 28-8 lead",
            "publishDate": "2016-07-23T19:11:20+10:00",
            "publisher": "NRL Chief",
            "thumbnailUrl": "http://bigpondvideo.com/web/images/content/20160723191433a_89x50.jpg",
            "largeThumbnailUrl": "http://bigpondvideo.com/web/images/content/20160723191433a_326x184.jpg",
            "programType": "Instant Replay",
            "programCategory": "Score",
            "priority": null,
            "lastUpdateDate": "2016-07-23T19:47:12+10:00",
            "isPremium": true,
            "club": [
                500031,
                500004
            ]
        },
        {
            "id": "9maWJ3NDE6vzbWMfLJluTPLrQN6I-eLR",
            "contentId": 864628,
            "title": "Rd 20: TRY Chris McQueen (71st min)",
            "description": "The Titans go further in front as Chris McQueen crosses for a double",
            "publishDate": "2016-07-23T19:10:00+10:00",
            "publisher": "NRL Chief",
            "thumbnailUrl": "http://bigpondvideo.com/web/images/content/20160723191317a_89x50.jpg",
            "largeThumbnailUrl": "http://bigpondvideo.com/web/images/content/20160723191317a_326x184.jpg",
            "programType": "Instant Replay",
            "programCategory": "Score",
            "priority": 3,
            "lastUpdateDate": "2016-07-23T19:24:06+10:00",
            "isPremium": true,
            "club": [
                500031,
                500004
            ]
        },
        {
            "id": "5laGJ3NDE6Z-RiC3FPWD__5GJZl1cV4V",
            "contentId": 864626,
            "title": "Rd 20: GOAL Ashley Taylor (68th min)",
            "description": "Conversion sees the Titans lead 22-8",
            "publishDate": "2016-07-23T19:06:00+10:00",
            "publisher": "NRL Chief",
            "thumbnailUrl": "http://bigpondvideo.com/web/images/content/20160723190831a_89x50.jpg",
            "largeThumbnailUrl": "http://bigpondvideo.com/web/images/content/20160723190831a_326x184.jpg",
            "programType": "Instant Replay",
            "programCategory": "Score",
            "priority": null,
            "lastUpdateDate": "2016-07-23T19:11:02+10:00",
            "isPremium": true,
            "club": [
                500031,
                500004
            ]
        },
        {
            "id": "B0Z2J3NDE6ge6b7njn1jI42rEeQx9o_G",
            "contentId": 864625,
            "title": "Rd 20: TRY Nene Macdonald (66th min)",
            "description": "The Titans extend their lead through a try to Nene Macdonald",
            "publishDate": "2016-07-23T19:05:00+10:00",
            "publisher": "NRL Chief",
            "thumbnailUrl": "http://bigpondvideo.com/web/images/content/20160723190653a_89x50.jpg",
            "largeThumbnailUrl": "http://bigpondvideo.com/web/images/content/20160723190653a_326x184.jpg",
            "programType": "Instant Replay",
            "programCategory": "Score",
            "priority": 4,
            "lastUpdateDate": "2016-07-23T19:24:06+10:00",
            "isPremium": true,
            "club": [
                500031,
                500004
            ]
        },
        {
            "id": "JoZWJ3NDE6D697CseyhP0ZMWs1Z0pnKB",
            "contentId": 864623,
            "title": "Rd 20: TRY Bevan French (58th min)",
            "description": "The Eels strike back as Bevan French crosses for his 10th try for the season",
            "publishDate": "2016-07-23T18:57:00+10:00",
            "publisher": "NRL Chief",
            "thumbnailUrl": "http://bigpondvideo.com/web/images/content/20160723185700a_89x50.jpg",
            "largeThumbnailUrl": "http://bigpondvideo.com/web/images/content/20160723185700a_326x184.jpg",
            "programType": "Instant Replay",
            "programCategory": "Score",
            "priority": 5,
            "lastUpdateDate": "2016-07-23T19:24:06+10:00",
            "isPremium": true,
            "club": [
                500031,
                500004
            ]
        },
        {
            "id": "4xY2J3NDE699FT_2A60y8-GOyDH67VP4",
            "contentId": 864622,
            "title": "Rd 20: PENALTY GOAL Ashley Taylor (46th min)",
            "description": "Penalty goal to the Titans takes them out to a 12 point lead",
            "publishDate": "2016-07-23T18:44:00+10:00",
            "publisher": "NRL Chief",
            "thumbnailUrl": "http://bigpondvideo.com/web/images/content/20160723184639a_89x50.jpg",
            "largeThumbnailUrl": "http://bigpondvideo.com/web/images/content/20160723184639a_326x184.jpg",
            "programType": "Instant Replay",
            "programCategory": "Score",
            "priority": 6,
            "lastUpdateDate": "2016-07-23T19:24:06+10:00",
            "isPremium": true,
            "club": [
                500031,
                500004
            ]
        },
        {
            "id": "9zNWJ3NDE630K5njL0bJvmDcY65M91gO",
            "contentId": 864621,
            "title": "Rd 20: TRY Kenny Edwards (36th min)",
            "description": "The Eels open their scoring as Kenny Edwards powers over from close range",
            "publishDate": "2016-07-23T18:20:00+10:00",
            "publisher": "NRL Chief",
            "thumbnailUrl": "http://bigpondvideo.com/web/images/content/20160723181951a_89x50.jpg",
            "largeThumbnailUrl": "http://bigpondvideo.com/web/images/content/20160723181951a_326x184.jpg",
            "programType": "Instant Replay",
            "programCategory": "Score",
            "priority": 7,
            "lastUpdateDate": "2016-07-23T19:23:05+10:00",
            "isPremium": true,
            "club": [
                500031,
                500004
            ]
        },
        {
            "id": "1tMWJ3NDE6JftzVv2fnsdnA4-Ip52sVF",
            "contentId": 864620,
            "title": "Rd 20: GOAL Ashley Taylor (20th min)",
            "description": "Conversion sees the Titans lead 14-0",
            "publishDate": "2016-07-23T18:01:00+10:00",
            "publisher": "NRL Chief",
            "thumbnailUrl": "http://bigpondvideo.com/web/images/content/20160723180256a_89x50.jpg",
            "largeThumbnailUrl": "http://bigpondvideo.com/web/images/content/20160723180256a_326x184.jpg",
            "programType": "Instant Replay",
            "programCategory": "Score",
            "priority": null,
            "lastUpdateDate": "2016-07-23T18:05:47+10:00",
            "isPremium": true,
            "club": [
                500031,
                500004
            ]
        },
        {
            "id": "JvMWJ3NDE6nA-lIWyWxIUOY1D0fPSGE3",
            "contentId": 864619,
            "title": "Rd 20: TRY Chris McQueen (19th min)",
            "description": "The Titans are in again as Chris McQueen proves too strong close to the line",
            "publishDate": "2016-07-23T18:00:00+10:00",
            "publisher": "NRL Chief",
            "thumbnailUrl": "http://bigpondvideo.com/web/images/content/20160723180243a_89x50.jpg",
            "largeThumbnailUrl": "http://bigpondvideo.com/web/images/content/20160723180243a_326x184.jpg",
            "programType": "Instant Replay",
            "programCategory": "Score",
            "priority": 8,
            "lastUpdateDate": "2016-07-23T19:23:05+10:00",
            "isPremium": true,
            "club": [
                500031,
                500004
            ]
        },
        {
            "id": "FxeWF3NDE6J3fUuTqQCKmyNBDAHdJ-fG",
            "contentId": 864618,
            "title": "Rd 20: TRY Anthony Don (12th min)",
            "description": "Beware the 2nd kick as Nene Macdonald kicks for Anthony Don who gets a dream bounce to score the 2nd try for the Titans",
            "publishDate": "2016-07-23T17:54:10+10:00",
            "publisher": "NRL Chief",
            "thumbnailUrl": "http://bigpondvideo.com/web/images/content/20160723175540a_89x50.jpg",
            "largeThumbnailUrl": "http://bigpondvideo.com/web/images/content/20160723175540a_326x184.jpg",
            "programType": "Instant Replay",
            "programCategory": "Score",
            "priority": 9,
            "lastUpdateDate": "2016-07-23T19:23:05+10:00",
            "isPremium": true,
            "club": [
                500031,
                500004
            ]
        },
        {
            "id": "d3d2F3NDE6wF-xN0z4f1119TVurhq3j-",
            "contentId": 864616,
            "title": "Rd 20: TRY Konrad Hurrell (6th min)",
            "description": "The Titans open the scoring in this match through a try to Konrad Hurrell",
            "publishDate": "2016-07-23T17:47:00+10:00",
            "publisher": "NRL Chief",
            "thumbnailUrl": "http://bigpondvideo.com/web/images/content/20160723175020a_89x50.jpg",
            "largeThumbnailUrl": "http://bigpondvideo.com/web/images/content/20160723175020a_326x184.jpg",
            "programType": "Instant Replay",
            "programCategory": "Score",
            "priority": 10,
            "lastUpdateDate": "2016-07-23T19:23:05+10:00",
            "isPremium": true,
            "club": [
                500031,
                500004
            ]
        }
    ],
    "scores": [
        {
            "gameState": "First Half",
            "gameStateId": 3,
            "gameTime": "0:05:47",
            "gameSeconds": 347,
            "GameMinutes": "05:47",
            "playerId": 500703,
            "playerName": "Konrad Hurrell",
            "scoreMethod": "Try",
            "statEvent": "Try",
            "statId": 38,
            "statValue": 4,
            "vidRef": 11366,
            "homeScore": 4,
            "commentary": "Try by Konrad Hurrell",
            "tackleNum": 3,
            "teamId": 500004,
            "teamName": "Gold Coast Titans",
            "homeTeamAbbrv": "GLD",
            "awayTeamAbbrv": "PAR"
        },
        {
            "gameState": "First Half",
            "gameStateId": 3,
            "gameTime": "0:11:42",
            "gameSeconds": 702,
            "GameMinutes": "11:42",
            "playerId": 500067,
            "playerName": "Anthony Don",
            "scoreMethod": "Try",
            "statEvent": "Try",
            "statId": 38,
            "statValue": 4,
            "vidRef": 22319,
            "homeScore": 8,
            "commentary": "Try by Anthony Don",
            "tackleNum": 6,
            "teamId": 500004,
            "teamName": "Gold Coast Titans",
            "homeTeamAbbrv": "GLD",
            "awayTeamAbbrv": "PAR"
        },
        {
            "gameState": "First Half",
            "gameStateId": 3,
            "gameTime": "0:18:02",
            "gameSeconds": 1082,
            "GameMinutes": "18:02",
            "playerId": 500090,
            "playerName": "Chris McQueen",
            "scoreMethod": "Try",
            "statEvent": "Try",
            "statId": 38,
            "statValue": 4,
            "vidRef": 31820,
            "homeScore": 12,
            "commentary": "Try by Chris McQueen",
            "tackleNum": 3,
            "teamId": 500004,
            "teamName": "Gold Coast Titans",
            "homeTeamAbbrv": "GLD",
            "awayTeamAbbrv": "PAR"
        },
        {
            "gameState": "First Half",
            "gameStateId": 3,
            "gameTime": "0:19:35",
            "gameSeconds": 1175,
            "GameMinutes": "19:35",
            "playerId": 500272,
            "playerName": "Ashley Taylor",
            "scoreMethod": "Conversion",
            "statEvent": "Conversion-Made",
            "statId": 1,
            "statValue": 2,
            "vidRef": 34129,
            "homeScore": 14,
            "commentary": "Conversion-Made by Ashley Taylor",
            "tackleNum": -1,
            "teamId": 500004,
            "teamName": "Gold Coast Titans",
            "homeTeamAbbrv": "GLD",
            "awayTeamAbbrv": "PAR"
        },
        {
            "gameState": "Second Half",
            "gameStateId": 5,
            "gameTime": "0:45:35",
            "gameSeconds": 2735,
            "GameMinutes": "45:35",
            "playerId": 500272,
            "playerName": "Ashley Taylor",
            "scoreMethod": "Penalty Goal",
            "statEvent": "Penalty Shot-Made",
            "statId": 67,
            "statValue": 2,
            "vidRef": 76331,
            "homeScore": 16,
            "awayScore": 4,
            "commentary": "Penalty Shot-Made by Ashley Taylor",
            "tackleNum": -1,
            "teamId": 500004,
            "teamName": "Gold Coast Titans",
            "homeTeamAbbrv": "GLD",
            "awayTeamAbbrv": "PAR"
        },
        {
            "gameState": "Second Half",
            "gameStateId": 5,
            "gameTime": "1:05:33",
            "gameSeconds": 3933,
            "GameMinutes": "65:33",
            "playerId": 500206,
            "playerName": "Nene Macdonald",
            "scoreMethod": "Try",
            "statEvent": "Try",
            "statId": 38,
            "statValue": 4,
            "vidRef": 109572,
            "homeScore": 20,
            "awayScore": 8,
            "commentary": "Try by Nene Macdonald",
            "tackleNum": 6,
            "teamId": 500004,
            "teamName": "Gold Coast Titans",
            "homeTeamAbbrv": "GLD",
            "awayTeamAbbrv": "PAR"
        },
        {
            "gameState": "Second Half",
            "gameStateId": 5,
            "gameTime": "1:07:04",
            "gameSeconds": 4024,
            "GameMinutes": "67:04",
            "playerId": 500272,
            "playerName": "Ashley Taylor",
            "scoreMethod": "Conversion",
            "statEvent": "Conversion-Made",
            "statId": 1,
            "statValue": 2,
            "vidRef": 111839,
            "homeScore": 22,
            "awayScore": 8,
            "commentary": "Conversion-Made by Ashley Taylor",
            "tackleNum": -1,
            "teamId": 500004,
            "teamName": "Gold Coast Titans",
            "homeTeamAbbrv": "GLD",
            "awayTeamAbbrv": "PAR"
        },
        {
            "gameState": "Second Half",
            "gameStateId": 5,
            "gameTime": "1:10:19",
            "gameSeconds": 4219,
            "GameMinutes": "70:19",
            "playerId": 500090,
            "playerName": "Chris McQueen",
            "scoreMethod": "Try",
            "statEvent": "Try",
            "statId": 38,
            "statValue": 4,
            "vidRef": 117791,
            "homeScore": 26,
            "awayScore": 8,
            "commentary": "Try by Chris McQueen",
            "tackleNum": 5,
            "teamId": 500004,
            "teamName": "Gold Coast Titans",
            "homeTeamAbbrv": "GLD",
            "awayTeamAbbrv": "PAR"
        },
        {
            "gameState": "Second Half",
            "gameStateId": 5,
            "gameTime": "1:11:36",
            "gameSeconds": 4296,
            "GameMinutes": "71:36",
            "playerId": 500272,
            "playerName": "Ashley Taylor",
            "scoreMethod": "Conversion",
            "statEvent": "Conversion-Made",
            "statId": 1,
            "statValue": 2,
            "vidRef": 119753,
            "homeScore": 28,
            "awayScore": 8,
            "commentary": "Conversion-Made by Ashley Taylor",
            "tackleNum": -1,
            "teamId": 500004,
            "teamName": "Gold Coast Titans",
            "homeTeamAbbrv": "GLD",
            "awayTeamAbbrv": "PAR"
        },
        {
            "gameState": "Second Half",
            "gameStateId": 5,
            "gameTime": "1:19:28",
            "gameSeconds": 4768,
            "GameMinutes": "79:28",
            "playerId": 500272,
            "playerName": "Ashley Taylor",
            "scoreMethod": "Try",
            "statEvent": "Try",
            "statId": 38,
            "statValue": 4,
            "vidRef": 132747,
            "homeScore": 32,
            "awayScore": 14,
            "commentary": "Try by Ashley Taylor",
            "tackleNum": 1,
            "teamId": 500004,
            "teamName": "Gold Coast Titans",
            "homeTeamAbbrv": "GLD",
            "awayTeamAbbrv": "PAR"
        },
        {
            "gameState": "Second Half",
            "gameStateId": 5,
            "gameTime": "1:20:00",
            "gameSeconds": 4800,
            "GameMinutes": "80:00",
            "playerId": 500272,
            "playerName": "Ashley Taylor",
            "scoreMethod": "Conversion",
            "statEvent": "Conversion-Made",
            "statId": 1,
            "statValue": 2,
            "vidRef": 134097,
            "homeScore": 34,
            "awayScore": 14,
            "commentary": "Conversion-Made by Ashley Taylor",
            "tackleNum": -1,
            "teamId": 500004,
            "teamName": "Gold Coast Titans",
            "homeTeamAbbrv": "GLD",
            "awayTeamAbbrv": "PAR"
        },
        {
            "gameState": "First Half",
            "gameStateId": 3,
            "gameTime": "0:35:54",
            "gameSeconds": 2154,
            "GameMinutes": "35:54",
            "playerId": 500667,
            "playerName": "Kenny Edwards",
            "scoreMethod": "Try",
            "statEvent": "Try",
            "statId": 38,
            "statValue": 4,
            "vidRef": 59104,
            "homeScore": 14,
            "awayScore": 4,
            "commentary": "Try by Kenny Edwards",
            "tackleNum": 5,
            "teamId": 500031,
            "teamName": "Parramatta Eels",
            "homeTeamAbbrv": "GLD",
            "awayTeamAbbrv": "PAR"
        },
        {
            "gameState": "Second Half",
            "gameStateId": 5,
            "gameTime": "0:57:27",
            "gameSeconds": 3447,
            "GameMinutes": "57:27",
            "playerId": 503601,
            "playerName": "Bevan French",
            "scoreMethod": "Try",
            "statEvent": "Try",
            "statId": 38,
            "statValue": 4,
            "vidRef": 96147,
            "homeScore": 16,
            "awayScore": 8,
            "commentary": "Try by Bevan French",
            "tackleNum": 6,
            "teamId": 500031,
            "teamName": "Parramatta Eels",
            "homeTeamAbbrv": "GLD",
            "awayTeamAbbrv": "PAR"
        },
        {
            "gameState": "Second Half",
            "gameStateId": 5,
            "gameTime": "1:14:01",
            "gameSeconds": 4441,
            "GameMinutes": "74:01",
            "playerId": 500808,
            "playerName": "Jeff Robson",
            "scoreMethod": "Try",
            "statEvent": "Try",
            "statId": 38,
            "statValue": 4,
            "vidRef": 123877,
            "homeScore": 28,
            "awayScore": 12,
            "commentary": "Try by Jeff Robson",
            "tackleNum": 5,
            "teamId": 500031,
            "teamName": "Parramatta Eels",
            "homeTeamAbbrv": "GLD",
            "awayTeamAbbrv": "PAR"
        },
        {
            "gameState": "Second Half",
            "gameStateId": 5,
            "gameTime": "1:14:44",
            "gameSeconds": 4484,
            "GameMinutes": "74:44",
            "playerId": 500797,
            "playerName": "Michael Gordon",
            "scoreMethod": "Conversion",
            "statEvent": "Conversion-Made",
            "statId": 1,
            "statValue": 2,
            "vidRef": 124943,
            "homeScore": 28,
            "awayScore": 14,
            "commentary": "Conversion-Made by Michael Gordon",
            "tackleNum": -1,
            "teamId": 500031,
            "teamName": "Parramatta Eels",
            "homeTeamAbbrv": "GLD",
            "awayTeamAbbrv": "PAR"
        }
    ]
}