{
    "vod": [
        {
            "id": "R2d2JiNTE6Y5Wr6T55-BfSRSRq0Zqmaz",
            "contentId": 869963,
            "title": "Rd 23: Knights v Panthers (Hls)",
            "description": "Highlights of the match between the Knights and Panthers from Hunter Stadium",
            "publishDate": "2016-08-14T16:02:00+10:00",
            "publisher": "NRL Chief",
            "thumbnailUrl": "http://bigpondvideo.com/web/images/content/20160814155636a_89x50.jpg",
            "largeThumbnailUrl": "http://bigpondvideo.com/web/images/content/20160814155636a_326x184.jpg",
            "programType": "Highlights",
            "programCategory": "Match",
            "priority": null,
            "lastUpdateDate": "2016-08-14T16:08:03+10:00",
            "isPremium": false,
            "club": [
                500003,
                500014
            ]
        },
        {
            "id": "UxaGNiNTE6E8qBD9GjNzu6IEjBX_cimU",
            "contentId": 869976,
            "title": "Rd 23 Press Conference: Knights",
            "description": "The Knights coach faces the media following the match",
            "publishDate": "2016-08-14T17:05:00+10:00",
            "publisher": "NRL Chief",
            "thumbnailUrl": "http://bigpondvideo.com/web/images/content/20160814164905a_89x50.jpg",
            "largeThumbnailUrl": "http://bigpondvideo.com/web/images/content/20160814164905a_326x184.jpg",
            "programType": "Press Conference",
            "programCategory": null,
            "priority": null,
            "lastUpdateDate": "2016-08-14T17:13:36+10:00",
            "isPremium": false,
            "club": [
                500003,
                500014
            ]
        },
        {
            "id": "c1ZGNiNTE6ER1KrMJpCn0D2WHLe_pX9z",
            "contentId": 869977,
            "title": "Rd 23 Press Conference: Panthers",
            "description": "The Panthers coach faces the media following the match",
            "publishDate": "2016-08-14T16:55:00+10:00",
            "publisher": "NRL Chief",
            "thumbnailUrl": "http://bigpondvideo.com/web/images/content/20160814164913a_89x50.jpg",
            "largeThumbnailUrl": "http://bigpondvideo.com/web/images/content/20160814164913a_326x184.jpg",
            "programType": "Press Conference",
            "programCategory": null,
            "priority": null,
            "lastUpdateDate": "2016-08-14T17:00:31+10:00",
            "isPremium": false,
            "club": [
                500003,
                500014
            ]
        },
        {
            "id": "pmdWJiNTE6TAR6-Mos2W_mBariSR1v4O",
            "contentId": 869639,
            "title": "Rd 23: GOAL Nathan Cleary (80th min)",
            "description": "Conversion sees the full time score Panthers 42 Knights 6",
            "publishDate": "2016-08-14T15:52:00+10:00",
            "publisher": "NRL Chief",
            "thumbnailUrl": "http://bigpondvideo.com/web/images/content/20160814155459a_89x50.jpg",
            "largeThumbnailUrl": "http://bigpondvideo.com/web/images/content/20160814155459a_326x184.jpg",
            "programType": "Instant Replay",
            "programCategory": "Score",
            "priority": 1,
            "lastUpdateDate": "2016-08-14T15:58:16+10:00",
            "isPremium": true,
            "club": [
                500003,
                500014
            ]
        },
        {
            "id": "I5dWJiNTE6EMXoRuMdorJZ8bblg-YU-8",
            "contentId": 869637,
            "title": "Rd 23: TRY Josh Mansour (80th min)",
            "description": "The Panthers finish this match in style as Josh Mansour gets the first & last tries of the match",
            "publishDate": "2016-08-14T15:51:00+10:00",
            "publisher": "NRL Chief",
            "thumbnailUrl": "http://bigpondvideo.com/web/images/content/20160814155204a_89x50.jpg",
            "largeThumbnailUrl": "http://bigpondvideo.com/web/images/content/20160814155204a_326x184.jpg",
            "programType": "Instant Replay",
            "programCategory": "Score",
            "priority": 2,
            "lastUpdateDate": "2016-08-14T15:57:16+10:00",
            "isPremium": true,
            "club": [
                500003,
                500014
            ]
        },
        {
            "id": "ZjcmJiNTE6gEi5uq3gSldxPCyBDdTaeU",
            "contentId": 869636,
            "title": "Rd 23: GOAL Nathan Cleary (71st min)",
            "description": "Conversion sees the Panthers lead 36-6",
            "publishDate": "2016-08-14T15:41:00+10:00",
            "publisher": "NRL Chief",
            "thumbnailUrl": "http://bigpondvideo.com/web/images/content/20160814154140a_89x50.jpg",
            "largeThumbnailUrl": "http://bigpondvideo.com/web/images/content/20160814154140a_326x184.jpg",
            "programType": "Instant Replay",
            "programCategory": "Score",
            "priority": null,
            "lastUpdateDate": "2016-08-14T15:45:13+10:00",
            "isPremium": true,
            "club": [
                500003,
                500014
            ]
        },
        {
            "id": "ZhcmJiNTE6g5DGrmYVTa4Agr7ziB8hqB",
            "contentId": 869635,
            "title": "Rd 23: TRY Dallin Watene-Zelezniak (70th min)",
            "description": "Great ball from Matt Moylan send Dallin Watene-Zelezniak over for a quick double",
            "publishDate": "2016-08-14T15:40:00+10:00",
            "publisher": "NRL Chief",
            "thumbnailUrl": "http://bigpondvideo.com/web/images/content/20160814154130a_89x50.jpg",
            "largeThumbnailUrl": "http://bigpondvideo.com/web/images/content/20160814154130a_326x184.jpg",
            "programType": "Instant Replay",
            "programCategory": "Score",
            "priority": 3,
            "lastUpdateDate": "2016-08-14T15:55:15+10:00",
            "isPremium": true,
            "club": [
                500003,
                500014
            ]
        },
        {
            "id": "VpcGJiNTE6jHzu7p_nNcdZ5Zh7xaKnHy",
            "contentId": 869634,
            "title": "Rd 23: GOAL Nathan Cleary (67th min)",
            "description": "Conversion sees the Panthers lead by 24",
            "publishDate": "2016-08-14T15:35:00+10:00",
            "publisher": "NRL Chief",
            "thumbnailUrl": "http://bigpondvideo.com/web/images/content/20160814153716a_89x50.jpg",
            "largeThumbnailUrl": "http://bigpondvideo.com/web/images/content/20160814153716a_326x184.jpg",
            "programType": "Instant Replay",
            "programCategory": "Score",
            "priority": null,
            "lastUpdateDate": "2016-08-14T15:40:11+10:00",
            "isPremium": true,
            "club": [
                500003,
                500014
            ]
        },
        {
            "id": "VrcGJiNTE6BkKpF1z6rwZgjyhtLe5qrr",
            "contentId": 869632,
            "title": "Rd 23: TRY Dallin Watene-Zelezniak (65th min)",
            "description": "The Panthers go further in front as Dallin Watene-Zelezniak crosses for his 8th try for the season",
            "publishDate": "2016-08-14T15:34:00+10:00",
            "publisher": "NRL Chief",
            "thumbnailUrl": "http://bigpondvideo.com/web/images/content/20160814153610a_89x50.jpg",
            "largeThumbnailUrl": "http://bigpondvideo.com/web/images/content/20160814153610a_326x184.jpg",
            "programType": "Instant Replay",
            "programCategory": "Score",
            "priority": 4,
            "lastUpdateDate": "2016-08-14T15:55:15+10:00",
            "isPremium": true,
            "club": [
                500003,
                500014
            ]
        },
        {
            "id": "84bmJiNTE60yIR3inRe6gaimWJe0AEkR",
            "contentId": 869631,
            "title": "Rd 23: GOAL Nathan Cleary (60th min)",
            "description": "Conversion sees the Panthers lead 24-6",
            "publishDate": "2016-08-14T15:28:00+10:00",
            "publisher": "NRL Chief",
            "thumbnailUrl": "http://bigpondvideo.com/web/images/content/20160814152914a_89x50.jpg",
            "largeThumbnailUrl": "http://bigpondvideo.com/web/images/content/20160814152914a_326x184.jpg",
            "programType": "Instant Replay",
            "programCategory": "Score",
            "priority": null,
            "lastUpdateDate": "2016-08-14T15:32:09+10:00",
            "isPremium": true,
            "club": [
                500003,
                500014
            ]
        },
        {
            "id": "Q2bmJiNTE6IUVYWRzhHvtxkwNN6nf7az",
            "contentId": 869630,
            "title": "Rd 23: TRY Tyrone Peachey (59th min)",
            "description": "The Panthers punish a Knights error as Tyrone Peachey crosses under the posts",
            "publishDate": "2016-08-14T15:27:00+10:00",
            "publisher": "NRL Chief",
            "thumbnailUrl": "http://bigpondvideo.com/web/images/content/20160814152811a_89x50.jpg",
            "largeThumbnailUrl": "http://bigpondvideo.com/web/images/content/20160814152811a_326x184.jpg",
            "programType": "Instant Replay",
            "programCategory": "Score",
            "priority": 5,
            "lastUpdateDate": "2016-08-14T15:54:15+10:00",
            "isPremium": true,
            "club": [
                500003,
                500014
            ]
        },
        {
            "id": "JibWJiNTE6cEk3vUoo8Bs1rZoGqBXJB6",
            "contentId": 869629,
            "title": "Rd 23: GOAL Nathan Cleary (57th min)",
            "description": "Conversion sees the visitors lead by 12",
            "publishDate": "2016-08-14T15:25:00+10:00",
            "publisher": "NRL Chief",
            "thumbnailUrl": "http://bigpondvideo.com/web/images/content/20160814152517a_89x50.jpg",
            "largeThumbnailUrl": "http://bigpondvideo.com/web/images/content/20160814152517a_326x184.jpg",
            "programType": "Instant Replay",
            "programCategory": "Score",
            "priority": null,
            "lastUpdateDate": "2016-08-14T15:29:08+10:00",
            "isPremium": true,
            "club": [
                500003,
                500014
            ]
        },
        {
            "id": "I5bWJiNTE6nYfUV617bSfKPsPE4WFXo3",
            "contentId": 869628,
            "title": "Rd 23: TRY Waqa Blake (55th min)",
            "description": "The Panthers extend their lead as it opens up for Waqa Blake to step his way through to score",
            "publishDate": "2016-08-14T15:24:00+10:00",
            "publisher": "NRL Chief",
            "thumbnailUrl": "http://bigpondvideo.com/web/images/content/20160814152502a_89x50.jpg",
            "largeThumbnailUrl": "http://bigpondvideo.com/web/images/content/20160814152502a_326x184.jpg",
            "programType": "Instant Replay",
            "programCategory": "Score",
            "priority": 6,
            "lastUpdateDate": "2016-08-14T15:54:15+10:00",
            "isPremium": true,
            "club": [
                500003,
                500014
            ]
        },
        {
            "id": "NhamJiNTE6UuLZe0cJWP23HXjWF9R80e",
            "contentId": 869627,
            "title": "Rd 23: GOAL Nathan Cleary (46th min)",
            "description": "Conversion sees the Panthers lead 12-6",
            "publishDate": "2016-08-14T15:13:00+10:00",
            "publisher": "NRL Chief",
            "thumbnailUrl": "http://bigpondvideo.com/web/images/content/20160814151411a_89x50.jpg",
            "largeThumbnailUrl": "http://bigpondvideo.com/web/images/content/20160814151411a_326x184.jpg",
            "programType": "Instant Replay",
            "programCategory": "Score",
            "priority": null,
            "lastUpdateDate": "2016-08-14T15:17:06+10:00",
            "isPremium": true,
            "club": [
                500003,
                500014
            ]
        },
        {
            "id": "NjamJiNTE6WYOBZ9Rm-L_5tU1dRyMIYl",
            "contentId": 869626,
            "title": "Rd 23: TRY Matt Moylan (44th min)",
            "description": "The Panthers get first points in the 2nd half as they cut the Knights up the middle to see Matt Moylan cross",
            "publishDate": "2016-08-14T15:12:00+10:00",
            "publisher": "NRL Chief",
            "thumbnailUrl": "http://bigpondvideo.com/web/images/content/20160814151348a_89x50.jpg",
            "largeThumbnailUrl": "http://bigpondvideo.com/web/images/content/20160814151348a_326x184.jpg",
            "programType": "Instant Replay",
            "programCategory": "Score",
            "priority": 7,
            "lastUpdateDate": "2016-08-14T15:54:15+10:00",
            "isPremium": true,
            "club": [
                500003,
                500014
            ]
        },
        {
            "id": "9oY2JiNTE6WmsY65vIEY8vNIVJ7SP5Va",
            "contentId": 869623,
            "title": "Rd 23: PENALTY GOAL Nathan Cleary (40th min)",
            "description": "Penalty goal to the Panthers locks this match up at 6-all",
            "publishDate": "2016-08-14T14:50:00+10:00",
            "publisher": "NRL Chief",
            "thumbnailUrl": "http://bigpondvideo.com/web/images/content/20160814145157a_89x50.jpg",
            "largeThumbnailUrl": "http://bigpondvideo.com/web/images/content/20160814145157a_326x184.jpg",
            "programType": "Instant Replay",
            "programCategory": "Score",
            "priority": 8,
            "lastUpdateDate": "2016-08-14T15:54:15+10:00",
            "isPremium": true,
            "club": [
                500003,
                500014
            ]
        },
        {
            "id": "9uYWJiNTE6L3CIqDfpmhKnB7O9MDilba",
            "contentId": 869622,
            "title": "Rd 23: GOAL Trent Hodkinson (31st min)",
            "description": "Conversion sees the Knights leas 6-4",
            "publishDate": "2016-08-14T14:41:00+10:00",
            "publisher": "NRL Chief",
            "thumbnailUrl": "http://bigpondvideo.com/web/images/content/20160814144256a_89x50.jpg",
            "largeThumbnailUrl": "http://bigpondvideo.com/web/images/content/20160814144256a_326x184.jpg",
            "programType": "Instant Replay",
            "programCategory": "Score",
            "priority": null,
            "lastUpdateDate": "2016-08-14T14:47:59+10:00",
            "isPremium": true,
            "club": [
                500003,
                500014
            ]
        },
        {
            "id": "VrOWJiNTE6CkDePwt4n0XjBcBIk2-wBF",
            "contentId": 869621,
            "title": "Rd 23: TRY Brendan Elliot (30th min)",
            "description": "The Knights hit back as Brendan Elliot picks up his 6th try for the season",
            "publishDate": "2016-08-14T14:40:00+10:00",
            "publisher": "NRL Chief",
            "thumbnailUrl": "http://bigpondvideo.com/web/images/content/20160814144121a_89x50.jpg",
            "largeThumbnailUrl": "http://bigpondvideo.com/web/images/content/20160814144121a_326x184.jpg",
            "programType": "Instant Replay",
            "programCategory": "Score",
            "priority": 9,
            "lastUpdateDate": "2016-08-14T15:54:15+10:00",
            "isPremium": true,
            "club": [
                500003,
                500014
            ]
        },
        {
            "id": "NwMmJiNTE6aplyiwePMmVry6Bw8Bh4HE",
            "contentId": 869620,
            "title": "Rd 23: TRY Josh Mansour (13th min)",
            "description": "The Panthers open the scoring in this match through a try to Josh Mansour",
            "publishDate": "2016-08-14T14:21:00+10:00",
            "publisher": "NRL Chief",
            "thumbnailUrl": "http://bigpondvideo.com/web/images/content/20160814142202a_89x50.jpg",
            "largeThumbnailUrl": "http://bigpondvideo.com/web/images/content/20160814142202a_326x184.jpg",
            "programType": "Instant Replay",
            "programCategory": "Score",
            "priority": 10,
            "lastUpdateDate": "2016-08-14T15:53:16+10:00",
            "isPremium": true,
            "club": [
                500003,
                500014
            ]
        }
    ],
    "scores": [
        {
            "gameState": "First Half",
            "gameStateId": 3,
            "gameTime": "0:29:29",
            "gameSeconds": 1769,
            "GameMinutes": "29:29",
            "playerId": 500200,
            "playerName": "Brendan Elliot",
            "scoreMethod": "Try",
            "statEvent": "Try",
            "statId": 38,
            "statValue": 4,
            "vidRef": 47637,
            "homeScore": 4,
            "awayScore": 4,
            "commentary": "Try by Brendan Elliot",
            "tackleNum": 6,
            "teamId": 500003,
            "teamName": "Newcastle Knights",
            "homeTeamAbbrv": "NEW",
            "awayTeamAbbrv": "PEN"
        },
        {
            "gameState": "First Half",
            "gameStateId": 3,
            "gameTime": "0:30:53",
            "gameSeconds": 1853,
            "GameMinutes": "30:53",
            "playerId": 500224,
            "playerName": "Trent Hodkinson",
            "scoreMethod": "Conversion",
            "statEvent": "Conversion-Made",
            "statId": 1,
            "statValue": 2,
            "vidRef": 49980,
            "homeScore": 6,
            "awayScore": 4,
            "commentary": "Conversion-Made by Trent Hodkinson",
            "tackleNum": -1,
            "teamId": 500003,
            "teamName": "Newcastle Knights",
            "homeTeamAbbrv": "NEW",
            "awayTeamAbbrv": "PEN"
        },
        {
            "gameState": "First Half",
            "gameStateId": 3,
            "gameTime": "0:11:32",
            "gameSeconds": 692,
            "GameMinutes": "11:32",
            "playerId": 500352,
            "playerName": "Josh Mansour",
            "scoreMethod": "Try",
            "statEvent": "Try",
            "statId": 38,
            "statValue": 4,
            "vidRef": 19095,
            "awayScore": 4,
            "commentary": "Try by Josh Mansour",
            "tackleNum": 6,
            "teamId": 500014,
            "teamName": "Penrith Panthers",
            "homeTeamAbbrv": "NEW",
            "awayTeamAbbrv": "PEN"
        },
        {
            "gameState": "First Half",
            "gameStateId": 3,
            "gameTime": "0:39:14",
            "gameSeconds": 2354,
            "GameMinutes": "39:14",
            "playerId": 504120,
            "playerName": "Nathan Cleary",
            "scoreMethod": "Penalty Goal",
            "statEvent": "Penalty Shot-Made",
            "statId": 67,
            "statValue": 2,
            "vidRef": 63888,
            "homeScore": 6,
            "awayScore": 6,
            "commentary": "Penalty Shot-Made by Nathan Cleary",
            "tackleNum": -1,
            "teamId": 500014,
            "teamName": "Penrith Panthers",
            "homeTeamAbbrv": "NEW",
            "awayTeamAbbrv": "PEN"
        },
        {
            "gameState": "Second Half",
            "gameStateId": 5,
            "gameTime": "0:43:48",
            "gameSeconds": 2628,
            "GameMinutes": "43:48",
            "playerId": 500356,
            "playerName": "Matt Moylan",
            "scoreMethod": "Try",
            "statEvent": "Try",
            "statId": 38,
            "statValue": 4,
            "vidRef": 73598,
            "homeScore": 6,
            "awayScore": 10,
            "commentary": "Try by Matt Moylan",
            "tackleNum": 5,
            "teamId": 500014,
            "teamName": "Penrith Panthers",
            "homeTeamAbbrv": "NEW",
            "awayTeamAbbrv": "PEN"
        },
        {
            "gameState": "Second Half",
            "gameStateId": 5,
            "gameTime": "0:45:03",
            "gameSeconds": 2703,
            "GameMinutes": "45:03",
            "playerId": 504120,
            "playerName": "Nathan Cleary",
            "scoreMethod": "Conversion",
            "statEvent": "Conversion-Made",
            "statId": 1,
            "statValue": 2,
            "vidRef": 75483,
            "homeScore": 6,
            "awayScore": 12,
            "commentary": "Conversion-Made by Nathan Cleary",
            "tackleNum": -1,
            "teamId": 500014,
            "teamName": "Penrith Panthers",
            "homeTeamAbbrv": "NEW",
            "awayTeamAbbrv": "PEN"
        },
        {
            "gameState": "Second Half",
            "gameStateId": 5,
            "gameTime": "0:54:58",
            "gameSeconds": 3298,
            "GameMinutes": "54:58",
            "playerId": 500496,
            "playerName": "Waqa Blake",
            "scoreMethod": "Try",
            "statEvent": "Try",
            "statId": 38,
            "statValue": 4,
            "vidRef": 90352,
            "homeScore": 6,
            "awayScore": 16,
            "commentary": "Try by Waqa Blake",
            "tackleNum": 6,
            "teamId": 500014,
            "teamName": "Penrith Panthers",
            "homeTeamAbbrv": "NEW",
            "awayTeamAbbrv": "PEN"
        },
        {
            "gameState": "Second Half",
            "gameStateId": 5,
            "gameTime": "0:56:19",
            "gameSeconds": 3379,
            "GameMinutes": "56:19",
            "playerId": 504120,
            "playerName": "Nathan Cleary",
            "scoreMethod": "Conversion",
            "statEvent": "Conversion-Made",
            "statId": 1,
            "statValue": 2,
            "vidRef": 92698,
            "homeScore": 6,
            "awayScore": 18,
            "commentary": "Conversion-Made by Nathan Cleary",
            "tackleNum": -1,
            "teamId": 500014,
            "teamName": "Penrith Panthers",
            "homeTeamAbbrv": "NEW",
            "awayTeamAbbrv": "PEN"
        },
        {
            "gameState": "Second Half",
            "gameStateId": 5,
            "gameTime": "0:58:13",
            "gameSeconds": 3493,
            "GameMinutes": "58:13",
            "playerId": 501184,
            "playerName": "Tyrone Peachey",
            "scoreMethod": "Try",
            "statEvent": "Try",
            "statId": 38,
            "statValue": 4,
            "vidRef": 95544,
            "homeScore": 6,
            "awayScore": 22,
            "commentary": "Try by Tyrone Peachey",
            "tackleNum": 1,
            "teamId": 500014,
            "teamName": "Penrith Panthers",
            "homeTeamAbbrv": "NEW",
            "awayTeamAbbrv": "PEN"
        },
        {
            "gameState": "Second Half",
            "gameStateId": 5,
            "gameTime": "0:59:33",
            "gameSeconds": 3573,
            "GameMinutes": "59:33",
            "playerId": 504120,
            "playerName": "Nathan Cleary",
            "scoreMethod": "Conversion",
            "statEvent": "Conversion-Made",
            "statId": 1,
            "statValue": 2,
            "vidRef": 97557,
            "homeScore": 6,
            "awayScore": 24,
            "commentary": "Conversion-Made by Nathan Cleary",
            "tackleNum": -1,
            "teamId": 500014,
            "teamName": "Penrith Panthers",
            "homeTeamAbbrv": "NEW",
            "awayTeamAbbrv": "PEN"
        },
        {
            "gameState": "Second Half",
            "gameStateId": 5,
            "gameTime": "1:04:44",
            "gameSeconds": 3884,
            "GameMinutes": "64:44",
            "playerId": 500532,
            "playerName": "Dallin Watene Zelezniak",
            "scoreMethod": "Try",
            "statEvent": "Try",
            "statId": 38,
            "statValue": 4,
            "vidRef": 107431,
            "homeScore": 6,
            "awayScore": 28,
            "commentary": "Try by Dallin Watene Zelezniak",
            "tackleNum": 6,
            "teamId": 500014,
            "teamName": "Penrith Panthers",
            "homeTeamAbbrv": "NEW",
            "awayTeamAbbrv": "PEN"
        },
        {
            "gameState": "Second Half",
            "gameStateId": 5,
            "gameTime": "1:06:07",
            "gameSeconds": 3967,
            "GameMinutes": "66:07",
            "playerId": 504120,
            "playerName": "Nathan Cleary",
            "scoreMethod": "Conversion",
            "statEvent": "Conversion-Made",
            "statId": 1,
            "statValue": 2,
            "vidRef": 109641,
            "homeScore": 6,
            "awayScore": 30,
            "commentary": "Conversion-Made by Nathan Cleary",
            "tackleNum": -1,
            "teamId": 500014,
            "teamName": "Penrith Panthers",
            "homeTeamAbbrv": "NEW",
            "awayTeamAbbrv": "PEN"
        },
        {
            "gameState": "Second Half",
            "gameStateId": 5,
            "gameTime": "1:09:31",
            "gameSeconds": 4171,
            "GameMinutes": "69:31",
            "playerId": 500532,
            "playerName": "Dallin Watene Zelezniak",
            "scoreMethod": "Try",
            "statEvent": "Try",
            "statId": 38,
            "statValue": 4,
            "vidRef": 115646,
            "homeScore": 6,
            "awayScore": 34,
            "commentary": "Try by Dallin Watene Zelezniak",
            "tackleNum": 1,
            "teamId": 500014,
            "teamName": "Penrith Panthers",
            "homeTeamAbbrv": "NEW",
            "awayTeamAbbrv": "PEN"
        },
        {
            "gameState": "Second Half",
            "gameStateId": 5,
            "gameTime": "1:10:46",
            "gameSeconds": 4246,
            "GameMinutes": "70:46",
            "playerId": 504120,
            "playerName": "Nathan Cleary",
            "scoreMethod": "Conversion",
            "statEvent": "Conversion-Made",
            "statId": 1,
            "statValue": 2,
            "vidRef": 117524,
            "homeScore": 6,
            "awayScore": 36,
            "commentary": "Conversion-Made by Nathan Cleary",
            "tackleNum": -1,
            "teamId": 500014,
            "teamName": "Penrith Panthers",
            "homeTeamAbbrv": "NEW",
            "awayTeamAbbrv": "PEN"
        },
        {
            "gameState": "Second Half",
            "gameStateId": 5,
            "gameTime": "1:19:55",
            "gameSeconds": 4795,
            "GameMinutes": "79:55",
            "playerId": 500352,
            "playerName": "Josh Mansour",
            "scoreMethod": "Try",
            "statEvent": "Try",
            "statId": 38,
            "statValue": 4,
            "vidRef": 131723,
            "homeScore": 6,
            "awayScore": 40,
            "commentary": "Try by Josh Mansour",
            "tackleNum": 1,
            "teamId": 500014,
            "teamName": "Penrith Panthers",
            "homeTeamAbbrv": "NEW",
            "awayTeamAbbrv": "PEN"
        },
        {
            "gameState": "Second Half",
            "gameStateId": 5,
            "gameTime": "1:19:59",
            "gameSeconds": 4799,
            "GameMinutes": "79:59",
            "playerId": 504120,
            "playerName": "Nathan Cleary",
            "scoreMethod": "Conversion",
            "statEvent": "Conversion-Made",
            "statId": 1,
            "statValue": 2,
            "vidRef": 134074,
            "homeScore": 6,
            "awayScore": 42,
            "commentary": "Conversion-Made by Nathan Cleary",
            "tackleNum": -1,
            "teamId": 500014,
            "teamName": "Penrith Panthers",
            "homeTeamAbbrv": "NEW",
            "awayTeamAbbrv": "PEN"
        }
    ]
}