{
    "vod": [
        {
            "id": "hvM3FvYTE6khZPmHNPZ3YI1nrXWlledo",
            "contentId": 902608,
            "title": "Rd 6: Panthers v Rabbitohs (Hls)",
            "description": "Highlights of the Round 6 clash between the Panthers and Rabbitohs",
            "publishDate": "2017-04-07T21:54:00+10:00",
            "publisher": "NRL Chief",
            "thumbnailUrl": "http://bpvideos.telstra.insnw.net/web/images/20170407215445a_89x50.jpg",
            "largeThumbnailUrl": "http://bpvideos.telstra.insnw.net/web/images/20170407215445a_326x184.jpg",
            "programType": "Highlights",
            "programCategory": "Match",
            "priority": null,
            "lastUpdateDate": "2017-04-07T22:01:24+10:00",
            "isPremium": false,
            "club": [
                500014,
                500005
            ]
        },
        {
            "id": "Fwa3FvYTE6iqxjThldtwZcatKGNG_Sd7",
            "contentId": 902572,
            "title": "Rd 6 Press Conference: Panthers",
            "description": "Panthers coach Anthony Griffin answer's the media's questions",
            "publishDate": "2017-04-07T22:39:00+10:00",
            "publisher": "NRL Chief",
            "thumbnailUrl": "http://bpvideos.telstra.insnw.net/web/images/20170407223302a_89x50.jpg",
            "largeThumbnailUrl": "http://bpvideos.telstra.insnw.net/web/images/20170407223302a_326x184.jpg",
            "programType": "Press Conference",
            "programCategory": null,
            "priority": null,
            "lastUpdateDate": "2017-04-07T22:48:34+10:00",
            "isPremium": false,
            "club": [
                500014,
                500005
            ]
        },
        {
            "id": "82anFvYTE6_pQPpxlL2zdeBOKHxtE5bd",
            "contentId": 902573,
            "title": "Rd 6 Press Conference: Rabbitohs",
            "description": "Rabbitohs coach Michael Maguire answers the media's questions",
            "publishDate": "2017-04-07T22:34:00+10:00",
            "publisher": "NRL Chief",
            "thumbnailUrl": "http://bpvideos.telstra.insnw.net/web/images/20170407223228a_89x50.jpg",
            "largeThumbnailUrl": "http://bpvideos.telstra.insnw.net/web/images/20170407223228a_326x184.jpg",
            "programType": "Press Conference",
            "programCategory": null,
            "priority": null,
            "lastUpdateDate": "2017-04-07T22:47:34+10:00",
            "isPremium": false,
            "club": [
                500014,
                500005
            ]
        }
    ],
    "scores": [
        {
            "gameState": "First Half",
            "gameStateId": 3,
            "gameTime": "0:14:31",
            "gameSeconds": 871,
            "GameMinutes": "14:31",
            "playerId": 500532,
            "playerName": "Dallin Watene Zelezniak",
            "scoreMethod": "Try",
            "statEvent": "Try",
            "statId": 38,
            "statValue": 4,
            "vidRef": 26219,
            "homeScore": 4,
            "awayScore": 8,
            "commentary": "Try by Dallin Watene Zelezniak",
            "tackleNum": 1,
            "utcTime": "2017-04-07T10:13:58Z",
            "teamId": 500014,
            "teamName": "Penrith Panthers",
            "homeTeamAbbrv": "PEN",
            "awayTeamAbbrv": "SOU"
        },
        {
            "gameState": "First Half",
            "gameStateId": 3,
            "gameTime": "0:15:20",
            "gameSeconds": 920,
            "GameMinutes": "15:20",
            "playerId": 504120,
            "playerName": "Nathan Cleary",
            "scoreMethod": "Conversion",
            "statEvent": "Conversion-Made",
            "statId": 1,
            "statValue": 2,
            "vidRef": 27450,
            "homeScore": 6,
            "awayScore": 8,
            "commentary": "Conversion-Made by Nathan Cleary",
            "tackleNum": -1,
            "utcTime": "2017-04-07T10:14:47Z",
            "teamId": 500014,
            "teamName": "Penrith Panthers",
            "homeTeamAbbrv": "PEN",
            "awayTeamAbbrv": "SOU"
        },
        {
            "gameState": "First Half",
            "gameStateId": 3,
            "gameTime": "0:27:08",
            "gameSeconds": 1628,
            "GameMinutes": "27:08",
            "playerId": 501241,
            "playerName": "Corey Harawira-Naera",
            "scoreMethod": "Try",
            "statEvent": "Try",
            "statId": 38,
            "statValue": 4,
            "vidRef": 48747,
            "homeScore": 10,
            "awayScore": 8,
            "commentary": "Try by Corey Harawira-Naera",
            "tackleNum": 2,
            "utcTime": "2017-04-07T10:28:59Z",
            "teamId": 500014,
            "teamName": "Penrith Panthers",
            "homeTeamAbbrv": "PEN",
            "awayTeamAbbrv": "SOU"
        },
        {
            "gameState": "First Half",
            "gameStateId": 3,
            "gameTime": "0:28:36",
            "gameSeconds": 1716,
            "GameMinutes": "28:36",
            "playerId": 504120,
            "playerName": "Nathan Cleary",
            "scoreMethod": "Conversion",
            "statEvent": "Conversion-Made",
            "statId": 1,
            "statValue": 2,
            "vidRef": 50955,
            "homeScore": 12,
            "awayScore": 8,
            "commentary": "Conversion-Made by Nathan Cleary",
            "tackleNum": -1,
            "utcTime": "2017-04-07T10:30:27Z",
            "teamId": 500014,
            "teamName": "Penrith Panthers",
            "homeTeamAbbrv": "PEN",
            "awayTeamAbbrv": "SOU"
        },
        {
            "gameState": "First Half",
            "gameStateId": 3,
            "gameTime": "0:31:23",
            "gameSeconds": 1883,
            "GameMinutes": "31:23",
            "playerId": 504120,
            "playerName": "Nathan Cleary",
            "scoreMethod": "Penalty Goal",
            "statEvent": "Penalty Shot-Made",
            "statId": 67,
            "statValue": 2,
            "vidRef": 55128,
            "homeScore": 14,
            "awayScore": 8,
            "commentary": "Penalty Shot-Made by Nathan Cleary",
            "tackleNum": -1,
            "utcTime": "2017-04-07T10:33:14Z",
            "teamId": 500014,
            "teamName": "Penrith Panthers",
            "homeTeamAbbrv": "PEN",
            "awayTeamAbbrv": "SOU"
        },
        {
            "gameState": "Second Half",
            "gameStateId": 5,
            "gameTime": "1:15:28",
            "gameSeconds": 4528,
            "GameMinutes": "75:28",
            "playerId": 502128,
            "playerName": "Michael Oldfield",
            "scoreMethod": "Try",
            "statEvent": "Try",
            "statId": 38,
            "statValue": 4,
            "vidRef": 146372,
            "homeScore": 18,
            "awayScore": 20,
            "commentary": "Try by Michael Oldfield",
            "tackleNum": 6,
            "utcTime": "2017-04-07T11:34:04Z",
            "teamId": 500014,
            "teamName": "Penrith Panthers",
            "homeTeamAbbrv": "PEN",
            "awayTeamAbbrv": "SOU"
        },
        {
            "gameState": "Second Half",
            "gameStateId": 5,
            "gameTime": "1:16:53",
            "gameSeconds": 4613,
            "GameMinutes": "76:53",
            "playerId": 504120,
            "playerName": "Nathan Cleary",
            "scoreMethod": "Conversion",
            "statEvent": "Conversion-Made",
            "statId": 1,
            "statValue": 2,
            "vidRef": 148506,
            "homeScore": 20,
            "awayScore": 20,
            "commentary": "Conversion-Made by Nathan Cleary",
            "tackleNum": -1,
            "utcTime": "2017-04-07T11:35:29Z",
            "teamId": 500014,
            "teamName": "Penrith Panthers",
            "homeTeamAbbrv": "PEN",
            "awayTeamAbbrv": "SOU"
        },
        {
            "gameState": "First Half",
            "gameStateId": 3,
            "gameTime": "0:04:08",
            "gameSeconds": 248,
            "GameMinutes": "04:08",
            "playerId": 500086,
            "playerName": "Adam Reynolds",
            "scoreMethod": "Penalty Goal",
            "statEvent": "Penalty Shot-Made",
            "statId": 67,
            "statValue": 2,
            "vidRef": 7943,
            "awayScore": 2,
            "commentary": "Penalty Shot-Made by Adam Reynolds",
            "tackleNum": -1,
            "utcTime": "2017-04-07T10:01:47Z",
            "teamId": 500005,
            "teamName": "South Sydney Rabbitohs",
            "homeTeamAbbrv": "PEN",
            "awayTeamAbbrv": "SOU"
        },
        {
            "gameState": "First Half",
            "gameStateId": 3,
            "gameTime": "0:06:12",
            "gameSeconds": 372,
            "GameMinutes": "06:12",
            "playerId": 500092,
            "playerName": "Sam Burgess",
            "scoreMethod": "Try",
            "statEvent": "Try",
            "statId": 38,
            "statValue": 4,
            "vidRef": 11048,
            "awayScore": 6,
            "commentary": "Try by Sam Burgess",
            "tackleNum": 3,
            "utcTime": "2017-04-07T10:03:51Z",
            "teamId": 500005,
            "teamName": "South Sydney Rabbitohs",
            "homeTeamAbbrv": "PEN",
            "awayTeamAbbrv": "SOU"
        },
        {
            "gameState": "First Half",
            "gameStateId": 3,
            "gameTime": "0:07:33",
            "gameSeconds": 453,
            "GameMinutes": "07:33",
            "playerId": 500086,
            "playerName": "Adam Reynolds",
            "scoreMethod": "Conversion",
            "statEvent": "Conversion-Made",
            "statId": 1,
            "statValue": 2,
            "vidRef": 13083,
            "awayScore": 8,
            "commentary": "Conversion-Made by Adam Reynolds",
            "tackleNum": -1,
            "utcTime": "2017-04-07T10:05:12Z",
            "teamId": 500005,
            "teamName": "South Sydney Rabbitohs",
            "homeTeamAbbrv": "PEN",
            "awayTeamAbbrv": "SOU"
        },
        {
            "gameState": "First Half",
            "gameStateId": 3,
            "gameTime": "0:35:55",
            "gameSeconds": 2155,
            "GameMinutes": "35:55",
            "playerId": 500611,
            "playerName": "Cody Walker",
            "scoreMethod": "Try",
            "statEvent": "Try",
            "statId": 38,
            "statValue": 4,
            "vidRef": 62728,
            "homeScore": 14,
            "awayScore": 12,
            "commentary": "Try by Cody Walker",
            "tackleNum": 3,
            "utcTime": "2017-04-07T10:38:18Z",
            "teamId": 500005,
            "teamName": "South Sydney Rabbitohs",
            "homeTeamAbbrv": "PEN",
            "awayTeamAbbrv": "SOU"
        },
        {
            "gameState": "First Half",
            "gameStateId": 3,
            "gameTime": "0:37:19",
            "gameSeconds": 2239,
            "GameMinutes": "37:19",
            "playerId": 500086,
            "playerName": "Adam Reynolds",
            "scoreMethod": "Conversion",
            "statEvent": "Conversion-Made",
            "statId": 1,
            "statValue": 2,
            "vidRef": 64868,
            "homeScore": 14,
            "awayScore": 14,
            "commentary": "Conversion-Made by Adam Reynolds",
            "tackleNum": -1,
            "utcTime": "2017-04-07T10:39:44Z",
            "teamId": 500005,
            "teamName": "South Sydney Rabbitohs",
            "homeTeamAbbrv": "PEN",
            "awayTeamAbbrv": "SOU"
        },
        {
            "gameState": "Second Half",
            "gameStateId": 5,
            "gameTime": "0:44:54",
            "gameSeconds": 2694,
            "GameMinutes": "44:54",
            "playerId": 500086,
            "playerName": "Adam Reynolds",
            "scoreMethod": "Try",
            "statEvent": "Try",
            "statId": 38,
            "statValue": 4,
            "vidRef": 100531,
            "homeScore": 14,
            "awayScore": 18,
            "commentary": "Try by Adam Reynolds",
            "tackleNum": 5,
            "utcTime": "2017-04-07T11:03:30Z",
            "teamId": 500005,
            "teamName": "South Sydney Rabbitohs",
            "homeTeamAbbrv": "PEN",
            "awayTeamAbbrv": "SOU"
        },
        {
            "gameState": "Second Half",
            "gameStateId": 5,
            "gameTime": "0:46:16",
            "gameSeconds": 2776,
            "GameMinutes": "46:16",
            "playerId": 500086,
            "playerName": "Adam Reynolds",
            "scoreMethod": "Conversion",
            "statEvent": "Conversion-Made",
            "statId": 1,
            "statValue": 2,
            "vidRef": 102581,
            "homeScore": 14,
            "awayScore": 20,
            "commentary": "Conversion-Made by Adam Reynolds",
            "tackleNum": -1,
            "utcTime": "2017-04-07T11:04:52Z",
            "teamId": 500005,
            "teamName": "South Sydney Rabbitohs",
            "homeTeamAbbrv": "PEN",
            "awayTeamAbbrv": "SOU"
        },
        {
            "gameState": "Second Half",
            "gameStateId": 5,
            "gameTime": "1:19:18",
            "gameSeconds": 4758,
            "GameMinutes": "79:18",
            "playerId": 500086,
            "playerName": "Adam Reynolds",
            "scoreMethod": "Field Goal",
            "statEvent": "Drop Goal-Made",
            "statId": 69,
            "statValue": 1,
            "vidRef": 152647,
            "homeScore": 20,
            "awayScore": 21,
            "commentary": "Drop Goal-Made by Adam Reynolds",
            "tackleNum": 5,
            "utcTime": "2017-04-07T11:38:15Z",
            "teamId": 500005,
            "teamName": "South Sydney Rabbitohs",
            "homeTeamAbbrv": "PEN",
            "awayTeamAbbrv": "SOU"
        }
    ],
    "twitter": [
        {
            "id": "850298567847665664",
            "gameSeconds": 2220
        },
        {
            "id": "850298352268853248",
            "gameSeconds": 2220
        },
        {
            "id": "850295857630945280",
            "gameSeconds": 1380
        },
        {
            "id": "850295477694210048",
            "gameSeconds": 1380
        },
        {
            "id": "850291462256246784",
            "gameSeconds": 900
        },
        {
            "id": "850291139110252547",
            "gameSeconds": 900
        }
    ]
}