{
    "competitionId": 111,
    "competitionName": "NRL Telstra Premiership",
    "gameId": 20151111540,
    "gameInfo": {
        "assistantReferee1Id": 500028,
        "numberOfPeriods": 2,
        "assistantReferee1Name": "Steve Carrall",
        "assistantReferee2Id": 500073,
        "assistantReferee2Name": "Lawrence McDonnell",
        "gameDate": "2015-06-20",
        "gameHashTag": "#NRLBulldogsPanthers",
        "gameNumber": 4,
        "gameSeconds": 4800,
        "gameTime": "1:20:00",
        "groundConditionId": 1,
        "groundConditionName": "N/A",
        "referee1Id": 500067,
        "referee1Name": "Grant Atkins",
        "referee2Id": 500011,
        "referee2Name": "Adam Devcich",
        "startTime": "2015-06-20T19:30:00",
        "startTimeUTC": "2015-06-20T09:30:00Z",
        "venueId": 500002,
        "venueName": "ANZ Stadium",
        "videoReferee1Id": 500203,
        "videoReferee1Name": "Ben Galea",
        "videoReferee2Id": 500030,
        "videoReferee2Name": "Steve Clark"
    },
    "gameState": "Final",
    "gameStateId": 8,
    "roundId": 15,
    "seasonId": 2015,
    "teams": {
        "teamsMatch": [
            {
                "isHomeTeam": true,
                "score": {
                    "conversions": 4,
                    "points": 24,
                    "tries": 4
                },
                "team1stHalfScore": 12,
                "team2ndHalfScore": 12,
                "teamAbbr": "CBY",
                "teamFinalScore": 24,
                "teamFullTimeScore": 24,
                "teamHalfTimeScore": 12,
                "teamId": 500010,
                "teamLineup": {
                    "injuriesAndSuspensions": {
                        "injury": [
                            {
                                "injuryDescription": "Hamstring, Round 19",
                                "playerFirstName": "James",
                                "playerId": "500223",
                                "playerLastName": "Graham",
                                "playerName": "James Graham"
                            },
                            {
                                "injuryDescription": "Ankle, Indefinite",
                                "playerFirstName": "Pat",
                                "playerId": "500233",
                                "playerLastName": "O'Hanlon",
                                "playerName": "Pat O'Hanlon"
                            },
                            {
                                "injuryDescription": "Pectoral, Season",
                                "playerFirstName": "Tony",
                                "playerId": "500242",
                                "playerLastName": "Williams",
                                "playerName": "Tony Williams"
                            }
                        ],
                        "suspension": []
                    },
                    "insAndOuts": {
                        "inOut": [
                            {
                                "inOut": "Out",
                                "playerFirstName": "Antonio",
                                "playerId": "501829",
                                "playerLastName": "Kaufusi",
                                "playerName": "Antonio Kaufusi"
                            },
                            {
                                "inOut": "Out",
                                "playerFirstName": "Chase",
                                "playerId": "500239",
                                "playerLastName": "Stanley",
                                "playerName": "Chase Stanley"
                            },
                            {
                                "inOut": "Out",
                                "playerFirstName": "Danny",
                                "playerId": "500131",
                                "playerLastName": "Fualalo",
                                "playerName": "Danny Fualalo"
                            },
                            {
                                "inOut": "In",
                                "playerFirstName": "David",
                                "playerId": "500228",
                                "playerLastName": "Klemmer",
                                "playerName": "David Klemmer"
                            },
                            {
                                "inOut": "In",
                                "playerFirstName": "Josh",
                                "playerId": "500226",
                                "playerLastName": "Jackson",
                                "playerName": "Josh Jackson"
                            },
                            {
                                "inOut": "In",
                                "playerFirstName": "Josh",
                                "playerId": "500232",
                                "playerLastName": "Morris",
                                "playerName": "Josh Morris"
                            }
                        ]
                    },
                    "teamPlayer": [
                        {
                            "playerFirstName": "Sam",
                            "playerId": 500234,
                            "playerLastName": "Perrett",
                            "playerName": "Sam Perrett",
                            "playerPosition": "Fullback",
                            "playerPositionId": 500001,
                            "playerStats": {
                                "allRunMetres": 131,
                                "allRuns": 15,
                                "bombKicksDefused": 3,
                                "bombKicksNotDefused": 1,
                                "decoys": 3,
                                "dummyHalfRuns": 5,
                                "fantasyPointsTotal": 64,
                                "ineffectiveTackles": 1,
                                "kickReturnMetres": 11,
                                "kickReturns": 1,
                                "kicksDefused": 4,
                                "kicksNotDefused": 2,
                                "linebreakAssists": 1,
                                "linebreaks": 2,
                                "mins": 80,
                                "missedTackles": 1,
                                "points": 8,
                                "supports": 7,
                                "tackleBreaks": 4,
                                "tackles": 6,
                                "tries": 2,
                                "tryAssists": 1,
                                "tryCause": 1,
                                "evasionRuns": 9,
                                "evasionRunMetres": 87,
                                "dummyHalfRunMetres": 33,
                                "ptbFast": 7.69,
                                "ptbNeutral": 92.31,
                                "ptbAll": 13
                            },
                            "playerTookTheField": true,
                            "shirtNum": 1
                        },
                        {
                            "playerFirstName": "Curtis",
                            "playerId": 500294,
                            "playerLastName": "Rona",
                            "playerName": "Curtis Rona",
                            "playerPosition": "Winger 1",
                            "playerPositionId": 500002,
                            "playerStats": {
                                "allRunMetres": 88,
                                "allRuns": 9,
                                "bombKicksDefused": 1,
                                "dummyHalfRuns": 1,
                                "fantasyPointsTotal": 28,
                                "ineffectiveTackles": 2,
                                "kickReturnMetres": 15,
                                "kickReturns": 2,
                                "kicksDefused": 2,
                                "kicksNotDefused": 1,
                                "linebreaks": 1,
                                "mins": 80,
                                "missedTackles": 2,
                                "points": 4,
                                "supports": 6,
                                "tackleBreaks": 1,
                                "tackles": 7,
                                "tries": 1,
                                "tryCause": 1,
                                "evasionRuns": 6,
                                "evasionRunMetres": 63,
                                "dummyHalfRunMetres": 10,
                                "ptbFast": 12.5,
                                "ptbNeutral": 87.5,
                                "ptbAll": 8
                            },
                            "playerTookTheField": true,
                            "shirtNum": 2
                        },
                        {
                            "playerFirstName": "Josh",
                            "playerId": 500232,
                            "playerLastName": "Morris",
                            "playerName": "Josh Morris",
                            "playerPosition": "Centre 1",
                            "playerPositionId": 500003,
                            "playerStats": {
                                "allRunMetres": 103,
                                "allRuns": 14,
                                "decoys": 1,
                                "dummyHalfRuns": 1,
                                "errors": 1,
                                "fantasyPointsTotal": 33,
                                "ineffectiveTackles": 6,
                                "kickReturnMetres": 1,
                                "kickReturns": 1,
                                "linebreakAssists": 1,
                                "mins": 80,
                                "missedTackles": 2,
                                "offloads": 2,
                                "supports": 3,
                                "tackleBreaks": 2,
                                "tackles": 12,
                                "tryAssists": 1,
                                "evasionRuns": 12,
                                "evasionRunMetres": 91,
                                "dummyHalfRunMetres": 11,
                                "ptbFast": 9.09,
                                "ptbNeutral": 81.82,
                                "ptbSlow": 9.09,
                                "ptbAll": 11
                            },
                            "playerTookTheField": true,
                            "shirtNum": 20
                        },
                        {
                            "playerFirstName": "Timoteo",
                            "playerId": 500229,
                            "playerLastName": "Lafai",
                            "playerName": "Timoteo Lafai",
                            "playerPosition": "Centre 2",
                            "playerPositionId": 500004,
                            "playerStats": {
                                "allRunMetres": 54,
                                "allRuns": 10,
                                "dummyHalfRuns": 1,
                                "errors": 2,
                                "fantasyPointsTotal": 22,
                                "mins": 80,
                                "missedTackles": 1,
                                "oneOnOneSteal": 1,
                                "oneOnOneTackles": 2,
                                "supports": 4,
                                "tackleBreaks": 2,
                                "tackles": 17,
                                "evasionRuns": 9,
                                "evasionRunMetres": 52,
                                "dummyHalfRunMetres": 2,
                                "ptbFast": 11.11,
                                "ptbNeutral": 88.89,
                                "ptbAll": 9
                            },
                            "playerTookTheField": true,
                            "shirtNum": 4
                        },
                        {
                            "playerFirstName": "Corey",
                            "playerId": 500240,
                            "playerLastName": "Thompson",
                            "playerName": "Corey Thompson",
                            "playerPosition": "Winger 2",
                            "playerPositionId": 500005,
                            "playerStats": {
                                "allRunMetres": 50,
                                "allRuns": 7,
                                "bombKicksDefused": 1,
                                "fantasyPointsTotal": 31,
                                "ineffectiveTackles": 1,
                                "kickReturnMetres": 24,
                                "kickReturns": 4,
                                "kicksDefused": 4,
                                "mins": 80,
                                "missedTackles": 1,
                                "oneOnOneTackles": 3,
                                "penalties": 1,
                                "supports": 2,
                                "tackleBreaks": 2,
                                "tackles": 10,
                                "trySaves": 2,
                                "evasionRuns": 3,
                                "evasionRunMetres": 26,
                                "ptbNeutral": 100,
                                "ptbAll": 7
                            },
                            "playerTookTheField": true,
                            "shirtNum": 5
                        },
                        {
                            "playerFirstName": "Josh",
                            "playerId": 500237,
                            "playerLastName": "Reynolds",
                            "playerName": "Josh Reynolds",
                            "playerPosition": "Five-eighth",
                            "playerPositionId": 500006,
                            "playerStats": {
                                "allRunMetres": 41,
                                "allRuns": 6,
                                "bombKicks": 1,
                                "bombKickMetres": 36,
                                "fantasyPointsTotal": 42,
                                "fieldGoalsAttempts": 1,
                                "fieldGoalsMissed": 1,
                                "kickMetres": 282,
                                "kicks": 10,
                                "mins": 70,
                                "missedTackles": 2,
                                "oneOnOneTackles": 1,
                                "penalties": 1,
                                "points": 4,
                                "sinBins": 1,
                                "tackleBreaks": 1,
                                "tackles": 24,
                                "tries": 1,
                                "evasionRuns": 6,
                                "evasionRunMetres": 41,
                                "ptbFast": 16.67,
                                "ptbNeutral": 66.67,
                                "ptbSlow": 16.67,
                                "ptbAll": 6
                            },
                            "playerTookTheField": true,
                            "shirtNum": 6
                        },
                        {
                            "playerFirstName": "Moses",
                            "playerId": 500243,
                            "playerLastName": "Mbye",
                            "playerName": "Moses Mbye",
                            "playerPosition": "Halfback",
                            "playerPositionId": 500007,
                            "playerStats": {
                                "allRunMetres": 49,
                                "allRuns": 5,
                                "bombKicks": 1,
                                "bombKickMetres": 32,
                                "conversions": 4,
                                "conversionsAttempts": 4,
                                "dummyHalfRuns": 1,
                                "errors": 2,
                                "fantasyPointsTotal": 36,
                                "goalConversionRate": 100,
                                "allGoals": 4,
                                "allGoalsAttempted": 4,
                                "ineffectiveTackles": 1,
                                "kickMetres": 258,
                                "kicks": 13,
                                "kicksNotDefused": 1,
                                "lineDropouts": 1,
                                "mins": 80,
                                "missedTackles": 2,
                                "oneOnOneTackles": 2,
                                "points": 8,
                                "supports": 7,
                                "tackleBreaks": 1,
                                "tackles": 17,
                                "evasionRuns": 4,
                                "evasionRunMetres": 42,
                                "dummyHalfRunMetres": 7,
                                "ptbFast": 50,
                                "ptbNeutral": 50,
                                "ptbAll": 2
                            },
                            "playerTookTheField": true,
                            "shirtNum": 7
                        },
                        {
                            "playerFirstName": "Aiden",
                            "playerId": 500241,
                            "playerLastName": "Tolman",
                            "playerName": "Aiden Tolman",
                            "playerPosition": "Prop 1",
                            "playerPositionId": 500008,
                            "playerStats": {
                                "allRunMetres": 139,
                                "allRuns": 18,
                                "decoys": 2,
                                "dummyHalfRuns": 1,
                                "fantasyPointsTotal": 46,
                                "hitUps": 16,
                                "kickReturnMetres": 16,
                                "kickReturns": 1,
                                "mins": 58,
                                "missedTackles": 1,
                                "oneOnOneTackles": 1,
                                "penalties": 2,
                                "supports": 14,
                                "tackleBreaks": 1,
                                "tackles": 36,
                                "hitupRunMeters": 114,
                                "dummyHalfRunMetres": 9,
                                "ptbFast": 38.89,
                                "ptbNeutral": 61.11,
                                "ptbAll": 18
                            },
                            "playerTookTheField": true,
                            "shirtNum": 8,
                            "isCaptain": true
                        },
                        {
                            "playerFirstName": "Michael",
                            "playerId": 500803,
                            "playerLastName": "Lichaa",
                            "playerName": "Michael Lichaa",
                            "playerPosition": "Hooker",
                            "playerPositionId": 500009,
                            "playerStats": {
                                "allRunMetres": 60,
                                "allRuns": 7,
                                "dummyHalfRuns": 6,
                                "fantasyPointsTotal": 46,
                                "hitUps": 1,
                                "ineffectiveTackles": 3,
                                "mins": 80,
                                "missedTackles": 3,
                                "offloads": 1,
                                "tackleBreaks": 1,
                                "tackles": 41,
                                "tryCause": 1,
                                "hitupRunMeters": 17,
                                "dummyHalfRunMetres": 43,
                                "ptbNeutral": 100,
                                "ptbAll": 5
                            },
                            "playerTookTheField": true,
                            "shirtNum": 9
                        },
                        {
                            "playerFirstName": "Sam",
                            "playerId": 500227,
                            "playerLastName": "Kasiano",
                            "playerName": "Sam Kasiano",
                            "playerPosition": "Prop 2",
                            "playerPositionId": 500010,
                            "playerStats": {
                                "allRunMetres": 85,
                                "allRuns": 10,
                                "decoys": 7,
                                "errors": 2,
                                "fantasyPointsTotal": 24,
                                "hitUps": 10,
                                "mins": 44,
                                "missedTackles": 1,
                                "offloads": 2,
                                "supports": 8,
                                "tackleBreaks": 1,
                                "tackles": 15,
                                "hitupRunMeters": 85,
                                "ptbFast": 57.14,
                                "ptbNeutral": 42.86,
                                "ptbAll": 7
                            },
                            "playerTookTheField": true,
                            "shirtNum": 10
                        },
                        {
                            "playerFirstName": "Josh",
                            "playerId": 500226,
                            "playerLastName": "Jackson",
                            "playerName": "Josh Jackson",
                            "playerPosition": "2nd Row 1",
                            "playerPositionId": 500011,
                            "playerStats": {
                                "allRunMetres": 113,
                                "allRuns": 15,
                                "decoys": 2,
                                "dummyHalfRuns": 1,
                                "errors": 1,
                                "fantasyPointsTotal": 47,
                                "hitUps": 14,
                                "ineffectiveTackles": 1,
                                "mins": 71,
                                "missedTackles": 1,
                                "offloads": 1,
                                "onReport": 1,
                                "oneOnOneTackles": 2,
                                "penalties": 2,
                                "supports": 5,
                                "tackleBreaks": 2,
                                "tackles": 36,
                                "hitupRunMeters": 108,
                                "dummyHalfRunMetres": 5,
                                "ptbFast": 33.33,
                                "ptbNeutral": 66.67,
                                "ptbAll": 12
                            },
                            "playerTookTheField": true,
                            "shirtNum": 21
                        },
                        {
                            "playerFirstName": "Frank",
                            "playerId": 500236,
                            "playerLastName": "Pritchard",
                            "playerName": "Frank Pritchard",
                            "playerPosition": "2nd Row 2",
                            "playerPositionId": 500012,
                            "playerStats": {
                                "allRunMetres": 84,
                                "allRuns": 10,
                                "decoys": 3,
                                "fantasyPointsTotal": 18,
                                "hitUps": 9,
                                "ineffectiveTackles": 1,
                                "mins": 54,
                                "missedTackles": 2,
                                "offloads": 1,
                                "supports": 7,
                                "tackles": 12,
                                "tryCause": 1,
                                "hitupRunMeters": 79,
                                "evasionRuns": 1,
                                "evasionRunMetres": 5,
                                "ptbNeutral": 100,
                                "ptbAll": 8
                            },
                            "playerTookTheField": true,
                            "shirtNum": 12
                        },
                        {
                            "playerFirstName": "Greg",
                            "playerId": 500220,
                            "playerLastName": "Eastwood",
                            "playerName": "Greg Eastwood",
                            "playerPosition": "Lock",
                            "playerPositionId": 500013,
                            "playerStats": {
                                "allRunMetres": 106,
                                "allRuns": 11,
                                "decoys": 6,
                                "fantasyPointsTotal": 35,
                                "hitUps": 11,
                                "mins": 51,
                                "missedTackles": 1,
                                "onReport": 1,
                                "oneOnOneTackles": 3,
                                "supports": 8,
                                "tackles": 27,
                                "hitupRunMeters": 106,
                                "ptbFast": 25,
                                "ptbNeutral": 66.67,
                                "ptbSlow": 8.33,
                                "ptbAll": 12
                            },
                            "playerTookTheField": true,
                            "shirtNum": 13
                        },
                        {
                            "playerFirstName": "Lloyd",
                            "playerId": 500145,
                            "playerLastName": "Perrett",
                            "playerName": "Lloyd Perrett",
                            "playerPosition": "Interchange",
                            "playerPositionId": 500014,
                            "playerStats": {
                                "allRunMetres": 78,
                                "allRuns": 8,
                                "decoys": 1,
                                "errors": 1,
                                "fantasyPointsTotal": 18,
                                "hitUps": 8,
                                "ineffectiveTackles": 1,
                                "mins": 20,
                                "missedTackles": 1,
                                "supports": 1,
                                "tackles": 15,
                                "hitupRunMeters": 78,
                                "ptbFast": 14.29,
                                "ptbNeutral": 85.71,
                                "ptbAll": 7
                            },
                            "playerTookTheField": true,
                            "shirtNum": 15
                        },
                        {
                            "playerFirstName": "Tim",
                            "playerId": 500218,
                            "playerLastName": "Browne",
                            "playerName": "Tim Browne",
                            "playerPosition": "Interchange",
                            "playerPositionId": 500014,
                            "playerStats": {
                                "allRunMetres": 77,
                                "allRuns": 8,
                                "decoys": 5,
                                "fantasyPointsTotal": 25,
                                "hitUps": 6,
                                "ineffectiveTackles": 1,
                                "kickReturnMetres": 33,
                                "kickReturns": 2,
                                "mins": 29,
                                "oneOnOneTackles": 1,
                                "supports": 6,
                                "tackleBreaks": 1,
                                "tackles": 15,
                                "hitupRunMeters": 44,
                                "ptbNeutral": 100,
                                "ptbAll": 8
                            },
                            "playerTookTheField": true,
                            "shirtNum": 16
                        },
                        {
                            "playerFirstName": "David",
                            "playerId": 500228,
                            "playerLastName": "Klemmer",
                            "playerName": "David Klemmer",
                            "playerPosition": "Interchange",
                            "playerPositionId": 500014,
                            "playerStats": {
                                "allRunMetres": 130,
                                "allRuns": 13,
                                "decoys": 4,
                                "fantasyPointsTotal": 29,
                                "hitUps": 13,
                                "ineffectiveTackles": 1,
                                "mins": 38,
                                "oneOnOneTackles": 1,
                                "penalties": 2,
                                "supports": 2,
                                "tackleBreaks": 1,
                                "tackles": 17,
                                "hitupRunMeters": 130,
                                "ptbFast": 23.08,
                                "ptbNeutral": 76.92,
                                "ptbAll": 13
                            },
                            "playerTookTheField": true,
                            "shirtNum": 22
                        },
                        {
                            "playerFirstName": "Shaun",
                            "playerId": 500140,
                            "playerLastName": "Lane",
                            "playerName": "Shaun Lane",
                            "playerPosition": "Interchange",
                            "playerPositionId": 500014,
                            "playerStats": {
                                "allRunMetres": 83,
                                "allRuns": 8,
                                "decoys": 3,
                                "fantasyPointsTotal": 26,
                                "hitUps": 7,
                                "intercepts": 1,
                                "mins": 35,
                                "offloads": 1,
                                "oneOnOneTackles": 3,
                                "supports": 3,
                                "tackles": 16,
                                "hitupRunMeters": 72,
                                "evasionRuns": 1,
                                "evasionRunMetres": 11,
                                "ptbFast": 33.33,
                                "ptbNeutral": 66.67,
                                "ptbAll": 6
                            },
                            "playerTookTheField": true,
                            "shirtNum": 23
                        }
                    ]
                },
                "teamName": "Canterbury-Bankstown Bulldogs",
                "teamNickName": "Bulldogs",
                "teamStats": {
                    "allRunMetres": 1471,
                    "allRuns": 174,
                    "bombKicks": 2,
                    "bombKickMetres": 68,
                    "bombKicksDefused": 5,
                    "bombKicksNotDefused": 1,
                    "completeSets": 31,
                    "completionPercentage": 82,
                    "conversions": 4,
                    "conversionsAttempts": 4,
                    "decoys": 37,
                    "dummyHalfRuns": 17,
                    "errors": 10,
                    "fieldGoalsAttempts": 1,
                    "fieldGoalsMissed": 1,
                    "goalConversionRate": 100,
                    "allGoals": 4,
                    "allGoalsAttempted": 4,
                    "hitUps": 95,
                    "incompleteSets": 7,
                    "ineffectiveTackles": 19,
                    "intercepts": 1,
                    "kickMetres": 540,
                    "kickReturnMetres": 100,
                    "kickReturns": 11,
                    "kicks": 23,
                    "kicksDefused": 10,
                    "kicksNotDefused": 4,
                    "lineDropouts": 1,
                    "linebreakAssists": 2,
                    "linebreaks": 3,
                    "missedTackles": 21,
                    "offloads": 8,
                    "onReports": 2,
                    "oneOnOneTackles": 19,
                    "penalties": 8,
                    "points": 24,
                    "pointsConceded": 12,
                    "possession": 50,
                    "scrumWins": 6,
                    "sinBins": 1,
                    "supports": 83,
                    "tackleBreaks": 20,
                    "tackles": 323,
                    "sets": 38,
                    "tries": 4,
                    "triesConceded": 2,
                    "tryAssists": 2,
                    "trySaves": 2,
                    "hitupRunMeters": 832,
                    "evasionRuns": 51,
                    "evasionRunMetres": 418,
                    "dummyHalfRunMetres": 121,
                    "ptbFast": 20,
                    "ptbNeutral": 78,
                    "ptbSlow": 2,
                    "ptbTotal": 152
                }
            },
            {
                "score": {
                    "conversions": 2,
                    "points": 12,
                    "tries": 2
                },
                "team1stHalfScore": 6,
                "team2ndHalfScore": 6,
                "teamAbbr": "PEN",
                "teamFinalScore": 12,
                "teamFullTimeScore": 12,
                "teamHalfTimeScore": 6,
                "teamId": 500014,
                "teamLineup": {
                    "injuriesAndSuspensions": {
                        "injury": [
                            {
                                "injuryDescription": "Broken Leg, Round 15",
                                "playerFirstName": "Brent",
                                "playerId": "500027",
                                "playerLastName": "Kite",
                                "playerName": "Brent Kite"
                            },
                            {
                                "injuryDescription": "Shoulder, Round 15",
                                "playerFirstName": "Apisai",
                                "playerId": "500109",
                                "playerLastName": "Koroisau",
                                "playerName": "Apisai Koroisau"
                            },
                            {
                                "injuryDescription": "Knee, Indefinite",
                                "playerFirstName": "Josh",
                                "playerId": "500352",
                                "playerLastName": "Mansour",
                                "playerName": "Josh Mansour"
                            },
                            {
                                "injuryDescription": "Ankle, Round 19",
                                "playerFirstName": "Matt",
                                "playerId": "500356",
                                "playerLastName": "Moylan",
                                "playerName": "Matt Moylan"
                            },
                            {
                                "injuryDescription": "Leg, Round 19",
                                "playerFirstName": "George",
                                "playerId": "500511",
                                "playerLastName": "Jennings",
                                "playerName": "George Jennings"
                            },
                            {
                                "injuryDescription": "Ankle, Round 15",
                                "playerFirstName": "Ben",
                                "playerId": "500657",
                                "playerLastName": "Murdoch-Masila",
                                "playerName": "Ben Murdoch-Masila"
                            },
                            {
                                "injuryDescription": "Knee, Indefinite",
                                "playerFirstName": "Robert",
                                "playerId": "501252",
                                "playerLastName": "Jennings",
                                "playerName": "Robert Jennings"
                            },
                            {
                                "injuryDescription": "Knee, Season",
                                "playerFirstName": "Jamal",
                                "playerId": "501452",
                                "playerLastName": "Idris",
                                "playerName": "Jamal Idris"
                            }
                        ],
                        "suspension": []
                    },
                    "insAndOuts": {
                        "inOut": []
                    },
                    "teamPlayer": [
                        {
                            "playerFirstName": "Dallin",
                            "playerId": 500532,
                            "playerLastName": "Watene Zelezniak",
                            "playerName": "Dallin Watene Zelezniak",
                            "playerPosition": "Fullback",
                            "playerPositionId": 500001,
                            "playerStats": {
                                "allRunMetres": 216,
                                "allRuns": 23,
                                "bombKicksDefused": 2,
                                "dummyHalfRuns": 2,
                                "errors": 4,
                                "fantasyPointsTotal": 26,
                                "kickReturnMetres": 64,
                                "kickReturns": 8,
                                "kicksDefused": 3,
                                "mins": 80,
                                "offloads": 2,
                                "oneOnOneLost": 1,
                                "penalties": 2,
                                "supports": 6,
                                "tackleBreaks": 3,
                                "tackles": 1,
                                "tryCause": 1,
                                "evasionRuns": 13,
                                "evasionRunMetres": 139,
                                "dummyHalfRunMetres": 13,
                                "ptbFast": 10.53,
                                "ptbNeutral": 84.21,
                                "ptbSlow": 5.26,
                                "ptbAll": 19
                            },
                            "playerTookTheField": true,
                            "shirtNum": 1
                        },
                        {
                            "playerFirstName": "Waqa",
                            "playerId": 500496,
                            "playerLastName": "Blake",
                            "playerName": "Waqa Blake",
                            "playerPosition": "Winger 1",
                            "playerPositionId": 500002,
                            "playerStats": {
                                "allRunMetres": 93,
                                "allRuns": 12,
                                "dummyHalfRuns": 2,
                                "errors": 2,
                                "fantasyPointsTotal": 15,
                                "kickReturnMetres": 27,
                                "kickReturns": 3,
                                "kicks": 1,
                                "kicksDefused": 1,
                                "kicksNotDefused": 1,
                                "mins": 80,
                                "oneOnOneTackles": 2,
                                "supports": 9,
                                "tackleBreaks": 1,
                                "tackles": 6,
                                "evasionRuns": 7,
                                "evasionRunMetres": 61,
                                "dummyHalfRunMetres": 5,
                                "ptbFast": 10,
                                "ptbNeutral": 90,
                                "ptbAll": 10
                            },
                            "playerTookTheField": true,
                            "shirtNum": 2
                        },
                        {
                            "playerFirstName": "Dean",
                            "playerId": 500368,
                            "playerLastName": "Whare",
                            "playerName": "Dean Whare",
                            "playerPosition": "Centre 1",
                            "playerPositionId": 500003,
                            "playerStats": {
                                "allRunMetres": 98,
                                "allRuns": 13,
                                "decoys": 3,
                                "dummyHalfRuns": 2,
                                "errors": 1,
                                "fantasyPointsTotal": 30,
                                "ineffectiveTackles": 2,
                                "interceptedPass": 1,
                                "linebreakAssists": 1,
                                "mins": 80,
                                "missedTackles": 2,
                                "offloads": 6,
                                "onReport": 1,
                                "oneOnOneTackles": 1,
                                "penalties": 1,
                                "supports": 3,
                                "tackleBreaks": 1,
                                "tackles": 12,
                                "evasionRuns": 11,
                                "evasionRunMetres": 82,
                                "dummyHalfRunMetres": 16,
                                "ptbNeutral": 100,
                                "ptbAll": 6
                            },
                            "playerTookTheField": true,
                            "shirtNum": 3
                        },
                        {
                            "playerFirstName": "Isaah",
                            "playerId": 500534,
                            "playerLastName": "Yeo",
                            "playerName": "Isaah Yeo",
                            "playerPosition": "Centre 2",
                            "playerPositionId": 500004,
                            "playerStats": {
                                "allRunMetres": 121,
                                "allRuns": 12,
                                "errors": 1,
                                "fantasyPointsTotal": 41,
                                "mins": 80,
                                "missedTackles": 2,
                                "offloads": 1,
                                "oneOnOneTackles": 1,
                                "penalties": 1,
                                "supports": 11,
                                "tackleBreaks": 3,
                                "tackles": 26,
                                "tryCause": 1,
                                "evasionRuns": 12,
                                "evasionRunMetres": 121,
                                "ptbFast": 18.18,
                                "ptbNeutral": 81.82,
                                "ptbAll": 11
                            },
                            "playerTookTheField": true,
                            "shirtNum": 4
                        },
                        {
                            "playerFirstName": "David",
                            "playerId": 500363,
                            "playerLastName": "Simmons",
                            "playerName": "David Simmons",
                            "playerPosition": "Winger 2",
                            "playerPositionId": 500005,
                            "playerStats": {
                                "allRunMetres": 152,
                                "allRuns": 13,
                                "fantasyPointsTotal": 34,
                                "hitUps": 1,
                                "kickReturnMetres": 15,
                                "kickReturns": 2,
                                "kicks": 1,
                                "kicksDefused": 1,
                                "kicksNotDefused": 1,
                                "linebreaks": 1,
                                "mins": 80,
                                "missedTackles": 2,
                                "offloads": 1,
                                "oneOnOneTackles": 2,
                                "supports": 5,
                                "tackleBreaks": 3,
                                "tackles": 7,
                                "tryCause": 2,
                                "hitupRunMeters": 8,
                                "evasionRuns": 10,
                                "evasionRunMetres": 129,
                                "ptbFast": 16.67,
                                "ptbNeutral": 83.33,
                                "ptbAll": 12
                            },
                            "playerTookTheField": true,
                            "shirtNum": 5
                        },
                        {
                            "playerFirstName": "Jamie",
                            "playerId": 501259,
                            "playerLastName": "Soward",
                            "playerName": "Jamie Soward",
                            "playerPosition": "Five-eighth",
                            "playerPositionId": 500006,
                            "playerStats": {
                                "allRunMetres": 37,
                                "allRuns": 4,
                                "bombKicks": 4,
                                "bombKickMetres": 102,
                                "conversions": 2,
                                "conversionsAttempts": 2,
                                "fantasyPointsTotal": 23,
                                "goalConversionRate": 100,
                                "allGoals": 2,
                                "allGoalsAttempted": 2,
                                "kickMetres": 162,
                                "kicks": 7,
                                "mins": 80,
                                "missedTackles": 3,
                                "oneOnOneTackles": 2,
                                "points": 4,
                                "supports": 8,
                                "tackleBreaks": 1,
                                "tackles": 11,
                                "tryCause": 2,
                                "evasionRuns": 4,
                                "evasionRunMetres": 37,
                                "ptbNeutral": 100,
                                "ptbAll": 2
                            },
                            "playerTookTheField": true,
                            "shirtNum": 6
                        },
                        {
                            "playerFirstName": "Peter",
                            "playerId": 500956,
                            "playerLastName": "Wallace",
                            "playerName": "Peter Wallace",
                            "playerPosition": "Halfback",
                            "playerPositionId": 500007,
                            "playerStats": {
                                "allRunMetres": 46,
                                "allRuns": 4,
                                "bombKicks": 2,
                                "bombKickMetres": 38,
                                "decoys": 1,
                                "errors": 1,
                                "fantasyPointsTotal": 30,
                                "ineffectiveTackles": 2,
                                "kickMetres": 119,
                                "kicks": 7,
                                "mins": 80,
                                "missedTackles": 1,
                                "oneOnOneTackles": 1,
                                "supports": 6,
                                "tackles": 25,
                                "tryCause": 1,
                                "evasionRuns": 4,
                                "evasionRunMetres": 46,
                                "ptbFast": 33.33,
                                "ptbNeutral": 66.67,
                                "ptbAll": 3
                            },
                            "playerTookTheField": true,
                            "shirtNum": 7,
                            "isCaptain": true
                        },
                        {
                            "playerFirstName": "Nigel",
                            "playerId": 500360,
                            "playerLastName": "Plum",
                            "playerName": "Nigel Plum",
                            "playerPosition": "Prop 1",
                            "playerPositionId": 500008,
                            "playerStats": {
                                "allRunMetres": 96,
                                "allRuns": 11,
                                "decoys": 1,
                                "fantasyPointsTotal": 32,
                                "hitUps": 11,
                                "ineffectiveTackles": 1,
                                "mins": 39,
                                "oneOnOneTackles": 1,
                                "supports": 6,
                                "tackles": 23,
                                "hitupRunMeters": 96,
                                "ptbFast": 27.27,
                                "ptbNeutral": 72.73,
                                "ptbAll": 11
                            },
                            "playerTookTheField": true,
                            "shirtNum": 16
                        },
                        {
                            "playerFirstName": "Apisai",
                            "playerId": 500109,
                            "playerLastName": "Koroisau",
                            "playerName": "Apisai Koroisau",
                            "playerPosition": "Hooker",
                            "playerPositionId": 500009,
                            "playerStats": {
                                "allRunMetres": 34,
                                "allRuns": 5,
                                "dummyHalfRuns": 3,
                                "fantasyPointsTotal": 44,
                                "hitUps": 2,
                                "ineffectiveTackles": 1,
                                "linebreakAssists": 1,
                                "mins": 41,
                                "missedTackles": 2,
                                "offloads": 1,
                                "oneOnOneTackles": 2,
                                "supports": 2,
                                "tackles": 36,
                                "tryAssists": 1,
                                "tryCause": 1,
                                "hitupRunMeters": 22,
                                "dummyHalfRunMetres": 12,
                                "ptbNeutral": 100,
                                "ptbAll": 3
                            },
                            "playerTookTheField": true,
                            "shirtNum": 21
                        },
                        {
                            "playerFirstName": "Sam",
                            "playerId": 500354,
                            "playerLastName": "McKendry",
                            "playerName": "Sam McKendry",
                            "playerPosition": "Prop 2",
                            "playerPositionId": 500010,
                            "playerStats": {
                                "allRunMetres": 113,
                                "allRuns": 10,
                                "decoys": 1,
                                "fantasyPointsTotal": 35,
                                "hitUps": 9,
                                "kickReturnMetres": 16,
                                "kickReturns": 1,
                                "mins": 43,
                                "missedTackles": 3,
                                "penalties": 1,
                                "supports": 4,
                                "tackleBreaks": 1,
                                "tackles": 29,
                                "hitupRunMeters": 97,
                                "ptbFast": 25,
                                "ptbNeutral": 75,
                                "ptbAll": 8
                            },
                            "playerTookTheField": true,
                            "shirtNum": 10
                        },
                        {
                            "playerFirstName": "Lewis",
                            "playerId": 500341,
                            "playerLastName": "Brown",
                            "playerName": "Lewis Brown",
                            "playerPosition": "2nd Row 1",
                            "playerPositionId": 500011,
                            "playerStats": {
                                "allRunMetres": 110,
                                "allRuns": 11,
                                "decoys": 4,
                                "dummyHalfRuns": 1,
                                "errors": 3,
                                "fantasyPointsTotal": 28,
                                "hitUps": 9,
                                "kickMetres": 10,
                                "kicks": 1,
                                "mins": 59,
                                "missedTackles": 2,
                                "offloads": 1,
                                "supports": 9,
                                "tackles": 25,
                                "hitupRunMeters": 93,
                                "evasionRuns": 1,
                                "evasionRunMetres": 8,
                                "dummyHalfRunMetres": 9,
                                "ptbNeutral": 87.5,
                                "ptbSlow": 12.5,
                                "ptbAll": 8
                            },
                            "playerTookTheField": true,
                            "shirtNum": 11
                        },
                        {
                            "playerFirstName": "Bryce",
                            "playerId": 500499,
                            "playerLastName": "Cartwright",
                            "playerName": "Bryce Cartwright",
                            "playerPosition": "2nd Row 2",
                            "playerPositionId": 500012,
                            "playerStats": {
                                "allRunMetres": 139,
                                "allRuns": 13,
                                "decoys": 6,
                                "errors": 1,
                                "fantasyPointsTotal": 77,
                                "hitUps": 10,
                                "ineffectiveTackles": 1,
                                "kickMetres": 75,
                                "kicks": 5,
                                "linebreaks": 1,
                                "mins": 65,
                                "offloads": 3,
                                "points": 8,
                                "supports": 1,
                                "tackleBreaks": 3,
                                "tackles": 28,
                                "tries": 2,
                                "hitupRunMeters": 102,
                                "evasionRuns": 3,
                                "evasionRunMetres": 37,
                                "ptbNeutral": 80,
                                "ptbSlow": 20,
                                "ptbAll": 5
                            },
                            "playerTookTheField": true,
                            "shirtNum": 17
                        },
                        {
                            "playerFirstName": "Elijah",
                            "playerId": 500970,
                            "playerLastName": "Taylor",
                            "playerName": "Elijah Taylor",
                            "playerPosition": "Lock",
                            "playerPositionId": 500013,
                            "playerStats": {
                                "allRunMetres": 74,
                                "allRuns": 7,
                                "decoys": 5,
                                "fantasyPointsTotal": 73,
                                "hitUps": 6,
                                "ineffectiveTackles": 2,
                                "linebreaks": 1,
                                "mins": 70,
                                "missedTackles": 1,
                                "oneOnOneTackles": 1,
                                "supports": 5,
                                "tackleBreaks": 2,
                                "tackles": 58,
                                "hitupRunMeters": 68,
                                "evasionRuns": 1,
                                "evasionRunMetres": 6,
                                "ptbNeutral": 100,
                                "ptbAll": 5
                            },
                            "playerTookTheField": true,
                            "shirtNum": 13
                        },
                        {
                            "playerFirstName": "Reagan",
                            "playerId": 500498,
                            "playerLastName": "Campbell-Gillard",
                            "playerName": "Reagan Campbell-Gillard",
                            "playerPosition": "Interchange",
                            "playerPositionId": 500014,
                            "playerStats": {
                                "allRunMetres": 120,
                                "allRuns": 13,
                                "decoys": 4,
                                "fantasyPointsTotal": 25,
                                "hitUps": 11,
                                "kickReturnMetres": 20,
                                "kickReturns": 2,
                                "mins": 37,
                                "missedTackles": 1,
                                "penalties": 2,
                                "supports": 3,
                                "tackles": 19,
                                "tryCause": 1,
                                "hitupRunMeters": 100,
                                "ptbNeutral": 100,
                                "ptbAll": 12
                            },
                            "playerTookTheField": true,
                            "shirtNum": 8
                        },
                        {
                            "playerFirstName": "James",
                            "playerId": 500362,
                            "playerLastName": "Segeyaro",
                            "playerName": "James Segeyaro",
                            "playerPosition": "Interchange",
                            "playerPositionId": 500014,
                            "playerStats": {
                                "allRunMetres": 36,
                                "allRuns": 3,
                                "decoys": 1,
                                "dummyHalfRuns": 3,
                                "errors": 1,
                                "fantasyPointsTotal": 30,
                                "ineffectiveTackles": 2,
                                "kickMetres": 18,
                                "kicks": 1,
                                "mins": 39,
                                "missedTackles": 1,
                                "tackleBreaks": 1,
                                "tackles": 28,
                                "dummyHalfRunMetres": 36,
                                "ptbNeutral": 100,
                                "ptbAll": 2
                            },
                            "playerTookTheField": true,
                            "shirtNum": 9
                        },
                        {
                            "playerFirstName": "Tyrone",
                            "playerId": 501184,
                            "playerLastName": "Peachey",
                            "playerName": "Tyrone Peachey",
                            "playerPosition": "Interchange",
                            "playerPositionId": 500014,
                            "playerStats": {
                                "allRunMetres": 132,
                                "allRuns": 13,
                                "decoys": 5,
                                "dummyHalfRuns": 1,
                                "fantasyPointsTotal": 39,
                                "hitUps": 9,
                                "kicksNotDefused": 1,
                                "mins": 50,
                                "oneOnOneTackles": 1,
                                "supports": 4,
                                "tackleBreaks": 2,
                                "tackles": 20,
                                "tryCause": 1,
                                "hitupRunMeters": 95,
                                "evasionRuns": 3,
                                "evasionRunMetres": 25,
                                "dummyHalfRunMetres": 12,
                                "ptbFast": 10,
                                "ptbNeutral": 90,
                                "ptbAll": 10
                            },
                            "playerTookTheField": true,
                            "shirtNum": 14
                        },
                        {
                            "playerFirstName": "Jeremy",
                            "playerId": 500351,
                            "playerLastName": "Latimore",
                            "playerName": "Jeremy Latimore",
                            "playerPosition": "Interchange",
                            "playerPositionId": 500014,
                            "playerStats": {
                                "allRunMetres": 121,
                                "allRuns": 13,
                                "decoys": 8,
                                "fantasyPointsTotal": 44,
                                "hitUps": 12,
                                "ineffectiveTackles": 2,
                                "kickReturnMetres": 14,
                                "kickReturns": 1,
                                "mins": 37,
                                "offloads": 1,
                                "oneOnOneTackles": 1,
                                "supports": 2,
                                "tackles": 30,
                                "hitupRunMeters": 107,
                                "ptbFast": 8.33,
                                "ptbNeutral": 91.67,
                                "ptbAll": 12
                            },
                            "playerTookTheField": true,
                            "shirtNum": 15
                        }
                    ]
                },
                "teamName": "Penrith Panthers",
                "teamNickName": "Panthers",
                "teamStats": {
                    "allRunMetres": 1741,
                    "allRuns": 180,
                    "bombKicks": 6,
                    "bombKickMetres": 140,
                    "bombKicksDefused": 2,
                    "completeSets": 27,
                    "completionPercentage": 68,
                    "conversions": 2,
                    "conversionsAttempts": 2,
                    "decoys": 39,
                    "dummyHalfRuns": 14,
                    "errors": 14,
                    "goalConversionRate": 100,
                    "allGoals": 2,
                    "allGoalsAttempted": 2,
                    "hitUps": 80,
                    "incompleteSets": 13,
                    "ineffectiveTackles": 13,
                    "interceptedPass": 1,
                    "kickMetres": 383,
                    "kickReturnMetres": 156,
                    "kickReturns": 17,
                    "kicks": 23,
                    "kicksDefused": 5,
                    "kicksNotDefused": 3,
                    "linebreakAssists": 2,
                    "linebreaks": 3,
                    "missedTackles": 20,
                    "offloads": 16,
                    "onReports": 1,
                    "oneOnOneTackles": 15,
                    "penalties": 7,
                    "points": 12,
                    "pointsConceded": 24,
                    "possession": 50,
                    "scrumWins": 3,
                    "supports": 84,
                    "tackleBreaks": 21,
                    "tackles": 384,
                    "sets": 40,
                    "tries": 2,
                    "triesConceded": 4,
                    "tryAssists": 1,
                    "hitupRunMeters": 790,
                    "evasionRuns": 69,
                    "evasionRunMetres": 691,
                    "dummyHalfRunMetres": 104,
                    "ptbFast": 11,
                    "ptbNeutral": 87,
                    "ptbSlow": 2,
                    "ptbTotal": 139
                }
            }
        ]
    }
}