{
    "vod": [
        {
            "id": "YxazQyMzE6p4vadXvqeaQ0W58rLfMtUn",
            "contentId": 839324,
            "title": "Rd 8: Bulldogs v Titans (Hls)",
            "description": "Highlights of the match between the Bulldogs and Titans from ANZ Stadium",
            "publishDate": "2016-04-23T17:15:00+10:00",
            "publisher": "NRL Chief",
            "thumbnailUrl": "http://bigpondvideo.com/web/images/content/20160423171519a_89x50.jpg",
            "largeThumbnailUrl": "http://bigpondvideo.com/web/images/content/20160423171519a_326x184.jpg",
            "programType": "Highlights",
            "programCategory": "Match",
            "priority": null,
            "lastUpdateDate": "2016-04-23T17:19:24+10:00",
            "isPremium": false,
            "club": [
                500010,
                500004
            ]
        },
        {
            "id": "J0eTQyMzE6tAdWS2aIwY9nNFjjaifMXD",
            "contentId": 839337,
            "title": "Rd 8 Press Conference: Titans",
            "description": "The Titans coach faces the media following the match",
            "publishDate": "2016-04-23T17:39:00+10:00",
            "publisher": "NRL Chief",
            "thumbnailUrl": "http://bigpondvideo.com/web/images/content/20160423173156a_89x50.jpg",
            "largeThumbnailUrl": "http://bigpondvideo.com/web/images/content/20160423173156a_326x184.jpg",
            "programType": "Press Conference",
            "programCategory": null,
            "priority": null,
            "lastUpdateDate": "2016-04-23T17:42:30+10:00",
            "isPremium": false,
            "club": [
                500010,
                500004
            ]
        },
        {
            "id": "tkeTQyMzE6TyzImbDAaXn5huLpd_ey_1",
            "contentId": 839335,
            "title": "Rd 8 Press Conference: Bulldogs",
            "description": "The Bulldogs coach faces the media following the match",
            "publishDate": "2016-04-23T17:37:00+10:00",
            "publisher": "NRL Chief",
            "thumbnailUrl": "http://bigpondvideo.com/web/images/content/20160423173148a_89x50.jpg",
            "largeThumbnailUrl": "http://bigpondvideo.com/web/images/content/20160423173148a_326x184.jpg",
            "programType": "Press Conference",
            "programCategory": null,
            "priority": null,
            "lastUpdateDate": "2016-04-23T17:41:29+10:00",
            "isPremium": false,
            "club": [
                500010,
                500004
            ]
        },
        {
            "id": "kxNDQyMzE6Tb4_7bfGMWvOsofIcOWs-K",
            "contentId": 838679,
            "title": "Rd 8: FIELD GOAL Josh Reynolds (84th min)",
            "description": "Josh Reynolds wins the game for the Bulldogs in golden point as he slots the one pointer",
            "publishDate": "2016-04-23T16:54:00+10:00",
            "publisher": "NRL Chief",
            "thumbnailUrl": "http://bigpondvideo.com/web/images/content/20160423165641a_89x50.jpg",
            "largeThumbnailUrl": "http://bigpondvideo.com/web/images/content/20160423165641a_326x184.jpg",
            "programType": "Instant Replay",
            "programCategory": "Score",
            "priority": 1,
            "lastUpdateDate": "2016-04-23T16:59:20+10:00",
            "isPremium": true,
            "club": [
                500010,
                500004
            ]
        },
        {
            "id": "tudDMyMzE6N6vIu7E3lgWm65koVUUkl2",
            "contentId": 838669,
            "title": "Rd 8: GOAL Tyrone Roberts (72nd min)",
            "description": "Conversion sees the score locked up at 20-all",
            "publishDate": "2016-04-23T16:39:00+10:00",
            "publisher": "NRL Chief",
            "thumbnailUrl": "http://bigpondvideo.com/web/images/content/20160423164059a_89x50.jpg",
            "largeThumbnailUrl": "http://bigpondvideo.com/web/images/content/20160423164059a_326x184.jpg",
            "programType": "Instant Replay",
            "programCategory": "Score",
            "priority": 2,
            "lastUpdateDate": "2016-04-23T16:56:19+10:00",
            "isPremium": true,
            "club": [
                500010,
                500004
            ]
        },
        {
            "id": "hqdDMyMzE6a9--oWEjft-PYN-acbU2mr",
            "contentId": 838668,
            "title": "Rd 8: TRY Josh Hoffman (71st min)",
            "description": "Kick goes sour for the Bulldogs as Josh Hoffman takes the ball and races away to score",
            "publishDate": "2016-04-23T16:38:00+10:00",
            "publisher": "NRL Chief",
            "thumbnailUrl": "http://bigpondvideo.com/web/images/content/20160423163949a_89x50.jpg",
            "largeThumbnailUrl": "http://bigpondvideo.com/web/images/content/20160423163949a_326x184.jpg",
            "programType": "Instant Replay",
            "programCategory": "Score",
            "priority": 3,
            "lastUpdateDate": "2016-04-23T16:56:19+10:00",
            "isPremium": true,
            "club": [
                500010,
                500004
            ]
        },
        {
            "id": "5xbzMyMzE6y4PkR6jO5PuuWTEdnZ1FkV",
            "contentId": 838667,
            "title": "Rd 8: GOAL Tyrone Roberts (64th min)",
            "description": "Conversion from touch sees the Titans trail by 6",
            "publishDate": "2016-04-23T16:30:00+10:00",
            "publisher": "NRL Chief",
            "thumbnailUrl": "http://bigpondvideo.com/web/images/content/20160423163143a_89x50.jpg",
            "largeThumbnailUrl": "http://bigpondvideo.com/web/images/content/20160423163143a_326x184.jpg",
            "programType": "Instant Replay",
            "programCategory": "Score",
            "priority": null,
            "lastUpdateDate": "2016-04-23T16:35:13+10:00",
            "isPremium": true,
            "club": [
                500010,
                500004
            ]
        },
        {
            "id": "FhbzMyMzE6AcArHPXzFFQvXdIznztx5R",
            "contentId": 838666,
            "title": "Rd 8: TRY David Mead (63rd min)",
            "description": "The Titans strike back as David Mead slides over in the corner",
            "publishDate": "2016-04-23T16:29:00+10:00",
            "publisher": "NRL Chief",
            "thumbnailUrl": "http://bigpondvideo.com/web/images/content/20160423163125a_89x50.jpg",
            "largeThumbnailUrl": "http://bigpondvideo.com/web/images/content/20160423163125a_326x184.jpg",
            "programType": "Instant Replay",
            "programCategory": "Score",
            "priority": 4,
            "lastUpdateDate": "2016-04-23T16:56:19+10:00",
            "isPremium": true,
            "club": [
                500010,
                500004
            ]
        },
        {
            "id": "w2azMyMzE6-VT5yqwjNECtUsk5vETkh0",
            "contentId": 838653,
            "title": "Rd 8: GOAL Kerrod Holland (54th min)",
            "description": "Conversion sees the Bulldogs lead 20-8",
            "publishDate": "2016-04-23T16:19:00+10:00",
            "publisher": "NRL Chief",
            "thumbnailUrl": "http://bigpondvideo.com/web/images/content/20160423162021a_89x50.jpg",
            "largeThumbnailUrl": "http://bigpondvideo.com/web/images/content/20160423162021a_326x184.jpg",
            "programType": "Instant Replay",
            "programCategory": "Score",
            "priority": null,
            "lastUpdateDate": "2016-04-23T16:25:11+10:00",
            "isPremium": true,
            "club": [
                500010,
                500004
            ]
        },
        {
            "id": "8wazMyMzE6yJcNB1blbxGD9slNYtybs6",
            "contentId": 838652,
            "title": "Rd 8: TRY Josh Jackson (53rd min)",
            "description": "Josh Reynolds puts in on a plate for Josh Jackson to dive over untouched to score the 4th try for the Bulldogs",
            "publishDate": "2016-04-23T16:18:00+10:00",
            "publisher": "NRL Chief",
            "thumbnailUrl": "http://bigpondvideo.com/web/images/content/20160423161911a_89x50.jpg",
            "largeThumbnailUrl": "http://bigpondvideo.com/web/images/content/20160423161911a_326x184.jpg",
            "programType": "Instant Replay",
            "programCategory": "Score",
            "priority": 5,
            "lastUpdateDate": "2016-04-23T16:56:18+10:00",
            "isPremium": true,
            "club": [
                500010,
                500004
            ]
        },
        {
            "id": "JrODMyMzE6RbQXKZgX-Y1xf6IZ24AAsh",
            "contentId": 838650,
            "title": "Rd 8: GOAL Kerrod Holland (38th min)",
            "description": "Conversion sees the Dogs leas 14-8",
            "publishDate": "2016-04-23T15:46:00+10:00",
            "publisher": "NRL Chief",
            "thumbnailUrl": "http://bigpondvideo.com/web/images/content/20160423154832a_89x50.jpg",
            "largeThumbnailUrl": "http://bigpondvideo.com/web/images/content/20160423154832a_326x184.jpg",
            "programType": "Instant Replay",
            "programCategory": "Score",
            "priority": null,
            "lastUpdateDate": "2016-04-23T15:52:04+10:00",
            "isPremium": true,
            "club": [
                500010,
                500004
            ]
        },
        {
            "id": "p2NzMyMzE6LJBocm34lpGXIZMZW3iQ6o",
            "contentId": 838649,
            "title": "Rd 8: TRY Will Hopoate (36th min)",
            "description": "Moses Mbye strolls into space and offloads to Will Hopoate who is in support to score for the Bulldogs",
            "publishDate": "2016-04-23T15:44:00+10:00",
            "publisher": "NRL Chief",
            "thumbnailUrl": "http://bigpondvideo.com/web/images/content/20160423154723a_89x50.jpg",
            "largeThumbnailUrl": "http://bigpondvideo.com/web/images/content/20160423154723a_326x184.jpg",
            "programType": "Instant Replay",
            "programCategory": "Score",
            "priority": 6,
            "lastUpdateDate": "2016-04-23T16:55:19+10:00",
            "isPremium": true,
            "club": [
                500010,
                500004
            ]
        },
        {
            "id": "RsNTMyMzE6cJKq0BvN4eBGehokSJC_Vz",
            "contentId": 838648,
            "title": "Rd 8: PENALTY GOAL Tyrone Roberts (34th min)",
            "description": "Penalty goal to the Titans locks this match up at 8-all",
            "publishDate": "2016-04-23T15:43:00+10:00",
            "publisher": "NRL Chief",
            "thumbnailUrl": "http://bigpondvideo.com/web/images/content/20160423154437a_89x50.jpg",
            "largeThumbnailUrl": "http://bigpondvideo.com/web/images/content/20160423154437a_326x184.jpg",
            "programType": "Instant Replay",
            "programCategory": "Score",
            "priority": 7,
            "lastUpdateDate": "2016-04-23T16:55:19+10:00",
            "isPremium": true,
            "club": [
                500010,
                500004
            ]
        },
        {
            "id": "VqMTMyMzE6yiMfUZS6UMADn25M3seOuu",
            "contentId": 838646,
            "title": "Rd 8: TRY Sam Perrett (24th min)",
            "description": "Sam Perrett does some great work to pull in the pass and slide his way over for the 2nd try for the Bulldogs",
            "publishDate": "2016-04-23T15:33:00+10:00",
            "publisher": "NRL Chief",
            "thumbnailUrl": "http://bigpondvideo.com/web/images/content/20160423153417a_89x50.jpg",
            "largeThumbnailUrl": "http://bigpondvideo.com/web/images/content/20160423153417a_326x184.jpg",
            "programType": "Instant Replay",
            "programCategory": "Score",
            "priority": 8,
            "lastUpdateDate": "2016-04-23T16:55:19+10:00",
            "isPremium": true,
            "club": [
                500010,
                500004
            ]
        },
        {
            "id": "sweDIyMzE6_NnkaN6j_ol0q2imzcEF4a",
            "contentId": 838645,
            "title": "Rd 8: TRY Curtis Rona (14th min)",
            "description": "The Bulldogs strike back as Curtis Rona crosses in the corner for this 3rd for the year",
            "publishDate": "2016-04-23T15:22:00+10:00",
            "publisher": "NRL Chief",
            "thumbnailUrl": "http://bigpondvideo.com/web/images/content/20160423152400a_89x50.jpg",
            "largeThumbnailUrl": "http://bigpondvideo.com/web/images/content/20160423152400a_326x184.jpg",
            "programType": "Instant Replay",
            "programCategory": "Score",
            "priority": 9,
            "lastUpdateDate": "2016-04-23T16:55:19+10:00",
            "isPremium": true,
            "club": [
                500010,
                500004
            ]
        },
        {
            "id": "U1dzIyMzE6Y7s8RSRYci-QXL6wVvQRQ5",
            "contentId": 838642,
            "title": "Rd 8: GOAL Tyrone Roberts (11th min)",
            "description": "Conversion sees the Titans lead 6-0",
            "publishDate": "2016-04-23T15:19:00+10:00",
            "publisher": "NRL Chief",
            "thumbnailUrl": "http://bigpondvideo.com/web/images/content/20160423152120a_89x50.jpg",
            "largeThumbnailUrl": "http://bigpondvideo.com/web/images/content/20160423152120a_326x184.jpg",
            "programType": "Instant Replay",
            "programCategory": "Score",
            "priority": null,
            "lastUpdateDate": "2016-04-23T15:24:58+10:00",
            "isPremium": true,
            "club": [
                500010,
                500004
            ]
        },
        {
            "id": "dxdjIyMzE6GtNwzvlx-vcPwsRqeNPOhT",
            "contentId": 838641,
            "title": "Rd 8: TRY Zeb Taia (9th min)",
            "description": "The Titans open the scoring in this match through a try to Zeb Taia, his 5th for the year",
            "publishDate": "2016-04-23T15:18:00+10:00",
            "publisher": "NRL Chief",
            "thumbnailUrl": "http://bigpondvideo.com/web/images/content/20160423152030a_89x50.jpg",
            "largeThumbnailUrl": "http://bigpondvideo.com/web/images/content/20160423152030a_326x184.jpg",
            "programType": "Instant Replay",
            "programCategory": "Score",
            "priority": 10,
            "lastUpdateDate": "2016-04-23T16:55:19+10:00",
            "isPremium": true,
            "club": [
                500010,
                500004
            ]
        }
    ],
    "scores": [
        {
            "gameState": "First Half",
            "gameStateId": 3,
            "gameTime": "0:13:44",
            "gameSeconds": 824,
            "playerId": 500294,
            "playerName": "Curtis Rona",
            "scoreMethod": "Try",
            "statEvent": "Try",
            "statId": 38,
            "statValue": 4,
            "vidRef": 23913,
            "homeScore": 4,
            "awayScore": 6,
            "commentary": "13:44, Try by Curtis Rona(Canterbury-Bankstown Bulldogs)",
            "teamId": 500010,
            "teamName": "Canterbury-Bankstown Bulldogs",
            "homeTeamAbbrv": "CBY",
            "awayTeamAbbrv": "GLD"
        },
        {
            "gameState": "First Half",
            "gameStateId": 3,
            "gameTime": "0:23:08",
            "gameSeconds": 1388,
            "playerId": 500234,
            "playerName": "Sam Perrett",
            "scoreMethod": "Try",
            "statEvent": "Try",
            "statId": 38,
            "statValue": 4,
            "vidRef": 38011,
            "homeScore": 8,
            "awayScore": 6,
            "commentary": "23:08, Try by Sam Perrett(Canterbury-Bankstown Bulldogs)",
            "tackleNum": 2,
            "teamId": 500010,
            "teamName": "Canterbury-Bankstown Bulldogs",
            "homeTeamAbbrv": "CBY",
            "awayTeamAbbrv": "GLD"
        },
        {
            "gameState": "First Half",
            "gameStateId": 3,
            "gameTime": "0:35:44",
            "gameSeconds": 2144,
            "playerId": 500672,
            "playerName": "Will Hopoate",
            "scoreMethod": "Try",
            "statEvent": "Try",
            "statId": 38,
            "statValue": 4,
            "vidRef": 57038,
            "homeScore": 12,
            "awayScore": 8,
            "commentary": "35:44, Try by Will Hopoate(Canterbury-Bankstown Bulldogs)",
            "tackleNum": 1,
            "teamId": 500010,
            "teamName": "Canterbury-Bankstown Bulldogs",
            "homeTeamAbbrv": "CBY",
            "awayTeamAbbrv": "GLD"
        },
        {
            "gameState": "First Half",
            "gameStateId": 3,
            "gameTime": "0:37:05",
            "gameSeconds": 2225,
            "playerId": 503388,
            "playerName": "Kerrod Holland",
            "scoreMethod": "Conversion",
            "statEvent": "Conversion-Made",
            "statId": 1,
            "statValue": 2,
            "vidRef": 59061,
            "homeScore": 14,
            "awayScore": 8,
            "commentary": "37:05, Conversion-Made by Kerrod Holland(Canterbury-Bankstown Bulldogs)",
            "tackleNum": -1,
            "teamId": 500010,
            "teamName": "Canterbury-Bankstown Bulldogs",
            "homeTeamAbbrv": "CBY",
            "awayTeamAbbrv": "GLD"
        },
        {
            "gameState": "Second Half",
            "gameStateId": 5,
            "gameTime": "0:52:25",
            "gameSeconds": 3145,
            "playerId": 500226,
            "playerName": "Josh Jackson",
            "scoreMethod": "Try",
            "statEvent": "Try",
            "statId": 38,
            "statValue": 4,
            "vidRef": 85617,
            "homeScore": 18,
            "awayScore": 8,
            "commentary": "52:25, Try by Josh Jackson(Canterbury-Bankstown Bulldogs)",
            "tackleNum": 4,
            "teamId": 500010,
            "teamName": "Canterbury-Bankstown Bulldogs",
            "homeTeamAbbrv": "CBY",
            "awayTeamAbbrv": "GLD"
        },
        {
            "gameState": "Second Half",
            "gameStateId": 5,
            "gameTime": "0:53:43",
            "gameSeconds": 3223,
            "playerId": 503388,
            "playerName": "Kerrod Holland",
            "scoreMethod": "Conversion",
            "statEvent": "Conversion-Made",
            "statId": 1,
            "statValue": 2,
            "vidRef": 87947,
            "homeScore": 20,
            "awayScore": 8,
            "commentary": "53:43, Conversion-Made by Kerrod Holland(Canterbury-Bankstown Bulldogs)",
            "tackleNum": -1,
            "teamId": 500010,
            "teamName": "Canterbury-Bankstown Bulldogs",
            "homeTeamAbbrv": "CBY",
            "awayTeamAbbrv": "GLD"
        },
        {
            "gameState": "Extra Time",
            "gameStateId": 6,
            "gameTime": "1:23:28",
            "gameSeconds": 5008,
            "playerId": 500237,
            "playerName": "Josh Reynolds",
            "scoreMethod": "Field Goal",
            "statEvent": "Drop Goal-Made",
            "statId": 69,
            "statValue": 1,
            "vidRef": 141300,
            "homeScore": 21,
            "awayScore": 20,
            "commentary": "83:28, Drop Goal-Made by Josh Reynolds(Canterbury-Bankstown Bulldogs)",
            "tackleNum": 6,
            "teamId": 500010,
            "teamName": "Canterbury-Bankstown Bulldogs",
            "homeTeamAbbrv": "CBY",
            "awayTeamAbbrv": "GLD"
        },
        {
            "gameState": "First Half",
            "gameStateId": 3,
            "gameTime": "0:08:52",
            "gameSeconds": 532,
            "playerId": 502133,
            "playerName": "Zeb Taia",
            "scoreMethod": "Try",
            "statEvent": "Try",
            "statId": 38,
            "statValue": 4,
            "vidRef": 15407,
            "awayScore": 4,
            "commentary": "08:52, Try by Zeb Taia(Gold Coast Titans)",
            "tackleNum": 6,
            "teamId": 500004,
            "teamName": "Gold Coast Titans",
            "homeTeamAbbrv": "CBY",
            "awayTeamAbbrv": "GLD"
        },
        {
            "gameState": "First Half",
            "gameStateId": 3,
            "gameTime": "0:10:19",
            "gameSeconds": 619,
            "playerId": 500046,
            "playerName": "Tyrone Roberts",
            "scoreMethod": "Conversion",
            "statEvent": "Conversion-Made",
            "statId": 1,
            "statValue": 2,
            "vidRef": 17589,
            "awayScore": 6,
            "commentary": "10:19, Conversion-Made by Tyrone Roberts(Gold Coast Titans)",
            "tackleNum": -1,
            "teamId": 500004,
            "teamName": "Gold Coast Titans",
            "homeTeamAbbrv": "CBY",
            "awayTeamAbbrv": "GLD"
        },
        {
            "gameState": "First Half",
            "gameStateId": 3,
            "gameTime": "0:33:17",
            "gameSeconds": 1997,
            "playerId": 500046,
            "playerName": "Tyrone Roberts",
            "scoreMethod": "Penalty Goal",
            "statEvent": "Penalty Shot-Made",
            "statId": 67,
            "statValue": 2,
            "vidRef": 53370,
            "homeScore": 8,
            "awayScore": 8,
            "commentary": "33:17, Penalty Shot-Made by Tyrone Roberts(Gold Coast Titans)",
            "tackleNum": -1,
            "teamId": 500004,
            "teamName": "Gold Coast Titans",
            "homeTeamAbbrv": "CBY",
            "awayTeamAbbrv": "GLD"
        },
        {
            "gameState": "Second Half",
            "gameStateId": 5,
            "gameTime": "1:02:24",
            "gameSeconds": 3744,
            "playerId": 500831,
            "playerName": "David Mead",
            "scoreMethod": "Try",
            "statEvent": "Try",
            "statId": 38,
            "statValue": 4,
            "vidRef": 102757,
            "homeScore": 20,
            "awayScore": 12,
            "commentary": "62:24, Try by David Mead(Gold Coast Titans)",
            "tackleNum": 3,
            "teamId": 500004,
            "teamName": "Gold Coast Titans",
            "homeTeamAbbrv": "CBY",
            "awayTeamAbbrv": "GLD"
        },
        {
            "gameState": "Second Half",
            "gameStateId": 5,
            "gameTime": "1:03:36",
            "gameSeconds": 3816,
            "playerId": 500046,
            "playerName": "Tyrone Roberts",
            "scoreMethod": "Conversion",
            "statEvent": "Conversion-Made",
            "statId": 1,
            "statValue": 2,
            "vidRef": 104574,
            "homeScore": 20,
            "awayScore": 14,
            "commentary": "63:36, Conversion-Made by Tyrone Roberts(Gold Coast Titans)",
            "tackleNum": -1,
            "teamId": 500004,
            "teamName": "Gold Coast Titans",
            "homeTeamAbbrv": "CBY",
            "awayTeamAbbrv": "GLD"
        },
        {
            "gameState": "Second Half",
            "gameStateId": 5,
            "gameTime": "1:10:13",
            "gameSeconds": 4213,
            "playerId": 500256,
            "playerName": "Josh Hoffman",
            "scoreMethod": "Try",
            "statEvent": "Try",
            "statId": 38,
            "statValue": 4,
            "vidRef": 115848,
            "homeScore": 20,
            "awayScore": 18,
            "commentary": "70:13, Try by Josh Hoffman(Gold Coast Titans)",
            "tackleNum": 1,
            "teamId": 500004,
            "teamName": "Gold Coast Titans",
            "homeTeamAbbrv": "CBY",
            "awayTeamAbbrv": "GLD"
        },
        {
            "gameState": "Second Half",
            "gameStateId": 5,
            "gameTime": "1:11:26",
            "gameSeconds": 4286,
            "playerId": 500046,
            "playerName": "Tyrone Roberts",
            "scoreMethod": "Conversion",
            "statEvent": "Conversion-Made",
            "statId": 1,
            "statValue": 2,
            "vidRef": 117683,
            "homeScore": 20,
            "awayScore": 20,
            "commentary": "71:26, Conversion-Made by Tyrone Roberts(Gold Coast Titans)",
            "tackleNum": -1,
            "teamId": 500004,
            "teamName": "Gold Coast Titans",
            "homeTeamAbbrv": "CBY",
            "awayTeamAbbrv": "GLD"
        }
    ]
}