{
    "competitionId": 111,
    "competitionName": "NRL Telstra Premiership",
    "roundNumber": 30,
    "ladderposition": [
        {
            "position": 1,
            "teamId": 500021,
            "teamName": "Melbourne Storm",
            "teamNickName": "Storm",
            "gamesPlayed": 24,
            "wins": 20,
            "draws": 0,
            "losses": 4,
            "byes": 2,
            "competitionPoints": 44,
            "pointsFor": 633,
            "pointsAgainst": 336,
            "pointsDifference": 297,
            "homeWins": 9,
            "homeDraws": 0,
            "homeLosses": 3,
            "awayWins": 11,
            "awayLosses": 1,
            "recentFormList": {
                "recentForm1": "W",
                "recentForm2": "W",
                "recentForm3": "W",
                "recentForm4": "W",
                "recentForm5": "W"
            },
            "recentForm": "WWWWW",
            "seasonForm": "WWWWWWWBLWLWWWBWLWWWLWWWWW",
            "premiershipOdds": "1.30",
            "premiershipOddsStatus": "A",
            "premiershipOddsOutcomeID": 255173195,
            "awayDraws": 0,
            "group": 0,
            "triesFor": 112,
            "triesConceded": 57,
            "goalsFor": 92,
            "goalsConceded": 52,
            "fieldGoalsFor": 1,
            "fieldGoalsConceded": 4,
            "fivePointTries": 0,
            "playersUsed": 31,
            "averageLosingMargin": 7,
            "averageWinningMargin": 16.2,
            "goldenPoint": 2,
            "closeGames": 10,
            "dayRecord": "6-2-1",
            "nightRecord": "14-0-3",
            "currentStreak": "7W"
        },
        {
            "position": 2,
            "teamId": 500001,
            "teamName": "Sydney Roosters",
            "teamNickName": "Roosters",
            "gamesPlayed": 24,
            "wins": 17,
            "draws": 0,
            "losses": 7,
            "byes": 2,
            "competitionPoints": 38,
            "pointsFor": 500,
            "pointsAgainst": 428,
            "pointsDifference": 72,
            "homeWins": 10,
            "homeDraws": 0,
            "homeLosses": 2,
            "awayWins": 7,
            "awayLosses": 5,
            "recentFormList": {
                "recentForm1": "W",
                "recentForm2": "W",
                "recentForm3": "W",
                "recentForm4": "L",
                "recentForm5": "L"
            },
            "recentForm": "WWWLL",
            "seasonForm": "WWWLLWWBWLWBWWLWWLWWLLWWWW",
            "awayDraws": 0,
            "group": 0,
            "triesFor": 85,
            "triesConceded": 72,
            "goalsFor": 78,
            "goalsConceded": 70,
            "fieldGoalsFor": 4,
            "fieldGoalsConceded": 0,
            "fivePointTries": 0,
            "playersUsed": 26,
            "averageLosingMargin": 13.1,
            "averageWinningMargin": 9.6,
            "goldenPoint": 2,
            "closeGames": 14,
            "dayRecord": "5-2-4",
            "nightRecord": "12-0-3",
            "currentStreak": "3W"
        },
        {
            "position": 3,
            "teamId": 500011,
            "teamName": "Brisbane Broncos",
            "teamNickName": "Broncos",
            "gamesPlayed": 24,
            "wins": 16,
            "draws": 0,
            "losses": 8,
            "byes": 2,
            "competitionPoints": 36,
            "pointsFor": 597,
            "pointsAgainst": 433,
            "pointsDifference": 164,
            "homeWins": 9,
            "homeDraws": 0,
            "homeLosses": 3,
            "awayWins": 7,
            "awayLosses": 5,
            "recentFormList": {
                "recentForm1": "W",
                "recentForm2": "L",
                "recentForm3": "W",
                "recentForm4": "W",
                "recentForm5": "W"
            },
            "recentForm": "WLWWW",
            "seasonForm": "WLWWWLWWBLWBWLLWWWWWWLWLLW",
            "awayDraws": 0,
            "group": 0,
            "triesFor": 103,
            "triesConceded": 76,
            "goalsFor": 91,
            "goalsConceded": 64,
            "fieldGoalsFor": 3,
            "fieldGoalsConceded": 1,
            "fivePointTries": 0,
            "playersUsed": 26,
            "averageLosingMargin": 11,
            "averageWinningMargin": 15.8,
            "goldenPoint": 1,
            "closeGames": 8,
            "dayRecord": "0-2-0",
            "nightRecord": "16-0-8",
            "currentStreak": "1W"
        },
        {
            "position": 4,
            "teamId": 500031,
            "teamName": "Parramatta Eels",
            "teamNickName": "Eels",
            "gamesPlayed": 24,
            "wins": 16,
            "draws": 0,
            "losses": 8,
            "byes": 2,
            "competitionPoints": 36,
            "pointsFor": 496,
            "pointsAgainst": 457,
            "pointsDifference": 39,
            "homeWins": 8,
            "homeDraws": 0,
            "homeLosses": 4,
            "awayWins": 8,
            "awayLosses": 4,
            "recentFormList": {
                "recentForm1": "W",
                "recentForm2": "W",
                "recentForm3": "W",
                "recentForm4": "L",
                "recentForm5": "W"
            },
            "recentForm": "WWWLW",
            "seasonForm": "WWWLWWWBWWBWLWWLLWWWLLLLWW",
            "awayDraws": 0,
            "group": 0,
            "triesFor": 85,
            "triesConceded": 78,
            "goalsFor": 77,
            "goalsConceded": 72,
            "fieldGoalsFor": 2,
            "fieldGoalsConceded": 1,
            "fivePointTries": 0,
            "playersUsed": 27,
            "averageLosingMargin": 17.4,
            "averageWinningMargin": 11.1,
            "goldenPoint": 1,
            "closeGames": 7,
            "dayRecord": "5-2-2",
            "nightRecord": "11-0-6",
            "currentStreak": "3W"
        },
        {
            "position": 5,
            "teamId": 500028,
            "teamName": "Cronulla-Sutherland Sharks",
            "teamNickName": "Sharks",
            "gamesPlayed": 24,
            "wins": 15,
            "draws": 0,
            "losses": 9,
            "byes": 2,
            "competitionPoints": 34,
            "pointsFor": 476,
            "pointsAgainst": 407,
            "pointsDifference": 69,
            "homeWins": 5,
            "homeDraws": 0,
            "homeLosses": 7,
            "awayWins": 10,
            "awayLosses": 2,
            "recentFormList": {
                "recentForm1": "W",
                "recentForm2": "L",
                "recentForm3": "W",
                "recentForm4": "L",
                "recentForm5": "L"
            },
            "recentForm": "WLWLL",
            "seasonForm": "WLWLLWWLBWLWLBWWWWLWWWWLWL",
            "awayDraws": 0,
            "group": 0,
            "triesFor": 78,
            "triesConceded": 66,
            "goalsFor": 80,
            "goalsConceded": 71,
            "fieldGoalsFor": 4,
            "fieldGoalsConceded": 1,
            "fivePointTries": 0,
            "playersUsed": 26,
            "averageLosingMargin": 11.3,
            "averageWinningMargin": 11.4,
            "closeGames": 10,
            "dayRecord": "5-2-1",
            "nightRecord": "10-0-8",
            "currentStreak": "1W"
        },
        {
            "position": 6,
            "teamId": 500002,
            "teamName": "Manly-Warringah Sea Eagles",
            "teamNickName": "Sea Eagles",
            "gamesPlayed": 24,
            "wins": 14,
            "draws": 0,
            "losses": 10,
            "byes": 2,
            "competitionPoints": 32,
            "pointsFor": 552,
            "pointsAgainst": 512,
            "pointsDifference": 40,
            "homeWins": 7,
            "homeDraws": 0,
            "homeLosses": 5,
            "awayWins": 7,
            "awayLosses": 5,
            "recentFormList": {
                "recentForm1": "W",
                "recentForm2": "W",
                "recentForm3": "L",
                "recentForm4": "L",
                "recentForm5": "W"
            },
            "recentForm": "WWLLW",
            "seasonForm": "WWLLWLLWLWWBWWBWLWWLLWWWLL",
            "awayDraws": 0,
            "group": 0,
            "triesFor": 99,
            "triesConceded": 87,
            "goalsFor": 76,
            "goalsConceded": 81,
            "fieldGoalsFor": 4,
            "fieldGoalsConceded": 2,
            "fivePointTries": 0,
            "playersUsed": 27,
            "averageLosingMargin": 15.7,
            "averageWinningMargin": 14.1,
            "goldenPoint": 3,
            "closeGames": 8,
            "dayRecord": "7-2-7",
            "nightRecord": "7-0-3",
            "currentStreak": "2W"
        },
        {
            "position": 7,
            "teamId": 500014,
            "teamName": "Penrith Panthers",
            "teamNickName": "Panthers",
            "gamesPlayed": 24,
            "wins": 13,
            "draws": 0,
            "losses": 11,
            "byes": 2,
            "competitionPoints": 30,
            "pointsFor": 504,
            "pointsAgainst": 459,
            "pointsDifference": 45,
            "homeWins": 8,
            "homeDraws": 0,
            "homeLosses": 4,
            "awayWins": 5,
            "awayLosses": 7,
            "recentFormList": {
                "recentForm1": "L",
                "recentForm2": "L",
                "recentForm3": "W",
                "recentForm4": "W",
                "recentForm5": "W"
            },
            "recentForm": "LLWWW",
            "seasonForm": "LLWWWWWWWLLBWWBWWLLLLLWLWL",
            "awayDraws": 0,
            "group": 0,
            "triesFor": 83,
            "triesConceded": 81,
            "goalsFor": 86,
            "goalsConceded": 67,
            "fieldGoalsFor": 0,
            "fieldGoalsConceded": 1,
            "fivePointTries": 0,
            "playersUsed": 28,
            "averageLosingMargin": 13.7,
            "averageWinningMargin": 15.1,
            "closeGames": 7,
            "dayRecord": "7-2-6",
            "nightRecord": "6-0-5",
            "currentStreak": "2L"
        },
        {
            "position": 8,
            "teamId": 500012,
            "teamName": "North Queensland Cowboys",
            "teamNickName": "Cowboys",
            "gamesPlayed": 24,
            "wins": 13,
            "draws": 0,
            "losses": 11,
            "byes": 2,
            "competitionPoints": 30,
            "pointsFor": 467,
            "pointsAgainst": 443,
            "pointsDifference": 24,
            "homeWins": 6,
            "homeDraws": 0,
            "homeLosses": 6,
            "awayWins": 7,
            "awayLosses": 5,
            "recentFormList": {
                "recentForm1": "L",
                "recentForm2": "W",
                "recentForm3": "L",
                "recentForm4": "L",
                "recentForm5": "L"
            },
            "recentForm": "LWLLL",
            "seasonForm": "LWLLLLWWBWWLWWBLWLWLLWWLWW",
            "premiershipOdds": "3.65",
            "premiershipOddsStatus": "A",
            "premiershipOddsOutcomeID": 255173193,
            "awayDraws": 0,
            "group": 0,
            "triesFor": 78,
            "triesConceded": 77,
            "goalsFor": 76,
            "goalsConceded": 67,
            "fieldGoalsFor": 3,
            "fieldGoalsConceded": 1,
            "fivePointTries": 0,
            "playersUsed": 32,
            "averageLosingMargin": 10.5,
            "averageWinningMargin": 10.7,
            "goldenPoint": 3,
            "closeGames": 8,
            "dayRecord": "2-2-0",
            "nightRecord": "11-0-11",
            "currentStreak": "1L"
        },
        {
            "position": 9,
            "teamId": 500022,
            "teamName": "St. George Illawarra Dragons",
            "teamNickName": "Dragons",
            "gamesPlayed": 24,
            "wins": 12,
            "draws": 0,
            "losses": 12,
            "byes": 2,
            "competitionPoints": 28,
            "pointsFor": 533,
            "pointsAgainst": 450,
            "pointsDifference": 83,
            "homeWins": 7,
            "homeDraws": 0,
            "homeLosses": 5,
            "awayWins": 5,
            "awayLosses": 7,
            "recentFormList": {
                "recentForm1": "L",
                "recentForm2": "W",
                "recentForm3": "L",
                "recentForm4": "W",
                "recentForm5": "L"
            },
            "recentForm": "LWLWL",
            "seasonForm": "LWLWLLWLBLWLLWBWLLLWWWWWLW",
            "awayDraws": 0,
            "group": 0,
            "triesFor": 91,
            "triesConceded": 80,
            "goalsFor": 84,
            "goalsConceded": 64,
            "fieldGoalsFor": 1,
            "fieldGoalsConceded": 2,
            "fivePointTries": 0,
            "playersUsed": 25,
            "averageLosingMargin": 8.7,
            "averageWinningMargin": 15.6,
            "goldenPoint": 2,
            "closeGames": 10,
            "dayRecord": "8-2-6",
            "nightRecord": "4-0-6",
            "currentStreak": "1L"
        },
        {
            "position": 10,
            "teamId": 500013,
            "teamName": "Canberra Raiders",
            "teamNickName": "Raiders",
            "gamesPlayed": 24,
            "wins": 11,
            "draws": 0,
            "losses": 13,
            "byes": 2,
            "competitionPoints": 26,
            "pointsFor": 558,
            "pointsAgainst": 497,
            "pointsDifference": 61,
            "homeWins": 6,
            "homeDraws": 0,
            "homeLosses": 6,
            "awayWins": 5,
            "awayLosses": 7,
            "recentFormList": {
                "recentForm1": "L",
                "recentForm2": "W",
                "recentForm3": "L",
                "recentForm4": "W",
                "recentForm5": "W"
            },
            "recentForm": "LWLWW",
            "seasonForm": "LWLWWWLWBLLBLLWWLLLWWWLWLL",
            "awayDraws": 0,
            "group": 0,
            "triesFor": 95,
            "triesConceded": 84,
            "goalsFor": 89,
            "goalsConceded": 79,
            "fieldGoalsFor": 0,
            "fieldGoalsConceded": 3,
            "fivePointTries": 0,
            "playersUsed": 25,
            "averageLosingMargin": 9,
            "averageWinningMargin": 16.2,
            "goldenPoint": 4,
            "closeGames": 10,
            "dayRecord": "3-2-3",
            "nightRecord": "8-0-10",
            "currentStreak": "1L"
        },
        {
            "position": 11,
            "teamId": 500010,
            "teamName": "Canterbury-Bankstown Bulldogs",
            "teamNickName": "Bulldogs",
            "gamesPlayed": 24,
            "wins": 10,
            "draws": 0,
            "losses": 14,
            "byes": 2,
            "competitionPoints": 24,
            "pointsFor": 360,
            "pointsAgainst": 455,
            "pointsDifference": -95,
            "homeWins": 7,
            "homeDraws": 0,
            "homeLosses": 5,
            "awayWins": 3,
            "awayLosses": 9,
            "recentFormList": {
                "recentForm1": "W",
                "recentForm2": "W",
                "recentForm3": "W",
                "recentForm4": "L",
                "recentForm5": "L"
            },
            "recentForm": "WWWLL",
            "seasonForm": "WWWLLLLBWLLBWLLLLWLWWWLWLL",
            "awayDraws": 0,
            "group": 0,
            "triesFor": 65,
            "triesConceded": 75,
            "goalsFor": 50,
            "goalsConceded": 75,
            "fieldGoalsFor": 0,
            "fieldGoalsConceded": 5,
            "fivePointTries": 0,
            "playersUsed": 25,
            "averageLosingMargin": 13.5,
            "averageWinningMargin": 9.4,
            "goldenPoint": 1,
            "closeGames": 10,
            "dayRecord": "6-2-4",
            "nightRecord": "4-0-10",
            "currentStreak": "3W"
        },
        {
            "position": 12,
            "teamId": 500005,
            "teamName": "South Sydney Rabbitohs",
            "teamNickName": "Rabbitohs",
            "gamesPlayed": 24,
            "wins": 9,
            "draws": 0,
            "losses": 15,
            "byes": 2,
            "competitionPoints": 22,
            "pointsFor": 464,
            "pointsAgainst": 564,
            "pointsDifference": -100,
            "homeWins": 4,
            "homeDraws": 0,
            "homeLosses": 8,
            "awayWins": 5,
            "awayLosses": 7,
            "recentFormList": {
                "recentForm1": "L",
                "recentForm2": "L",
                "recentForm3": "W",
                "recentForm4": "W",
                "recentForm5": "W"
            },
            "recentForm": "LLWWW",
            "seasonForm": "LLWWWLLLLWBWLBLLWLLLWLLWWL",
            "awayDraws": 0,
            "group": 0,
            "triesFor": 78,
            "triesConceded": 95,
            "goalsFor": 75,
            "goalsConceded": 91,
            "fieldGoalsFor": 2,
            "fieldGoalsConceded": 2,
            "fivePointTries": 0,
            "playersUsed": 30,
            "averageLosingMargin": 15,
            "averageWinningMargin": 13.9,
            "closeGames": 8,
            "dayRecord": "2-2-3",
            "nightRecord": "7-0-12",
            "currentStreak": "2L"
        },
        {
            "position": 13,
            "teamId": 500032,
            "teamName": "New Zealand Warriors",
            "teamNickName": "Warriors",
            "gamesPlayed": 24,
            "wins": 7,
            "draws": 0,
            "losses": 17,
            "byes": 2,
            "competitionPoints": 18,
            "pointsFor": 444,
            "pointsAgainst": 575,
            "pointsDifference": -131,
            "homeWins": 6,
            "homeDraws": 0,
            "homeLosses": 6,
            "awayWins": 1,
            "awayLosses": 11,
            "recentFormList": {
                "recentForm1": "L",
                "recentForm2": "L",
                "recentForm3": "L",
                "recentForm4": "L",
                "recentForm5": "L"
            },
            "recentForm": "LLLLL",
            "seasonForm": "LLLLLLLLBLWBWLWLLWLLWWLLLW",
            "awayDraws": 0,
            "group": 0,
            "triesFor": 78,
            "triesConceded": 98,
            "goalsFor": 65,
            "goalsConceded": 90,
            "fieldGoalsFor": 2,
            "fieldGoalsConceded": 3,
            "fivePointTries": 0,
            "playersUsed": 30,
            "averageLosingMargin": 11.8,
            "averageWinningMargin": 10,
            "goldenPoint": 1,
            "closeGames": 6,
            "dayRecord": "5-2-5",
            "nightRecord": "2-0-12",
            "currentStreak": "9L"
        },
        {
            "position": 14,
            "teamId": 500023,
            "teamName": "Wests Tigers",
            "teamNickName": "Wests Tigers",
            "gamesPlayed": 24,
            "wins": 7,
            "draws": 0,
            "losses": 17,
            "byes": 2,
            "competitionPoints": 18,
            "pointsFor": 413,
            "pointsAgainst": 571,
            "pointsDifference": -158,
            "homeWins": 3,
            "homeDraws": 0,
            "homeLosses": 9,
            "awayWins": 4,
            "awayLosses": 8,
            "recentFormList": {
                "recentForm1": "W",
                "recentForm2": "L",
                "recentForm3": "L",
                "recentForm4": "W",
                "recentForm5": "L"
            },
            "recentForm": "WLLWL",
            "seasonForm": "WLLWLWLLBWLLLLBLLLWLWLLLLW",
            "awayDraws": 0,
            "group": 0,
            "triesFor": 70,
            "triesConceded": 104,
            "goalsFor": 66,
            "goalsConceded": 77,
            "fieldGoalsFor": 1,
            "fieldGoalsConceded": 1,
            "fivePointTries": 0,
            "playersUsed": 32,
            "averageLosingMargin": 14.6,
            "averageWinningMargin": 13,
            "closeGames": 8,
            "dayRecord": "4-2-10",
            "nightRecord": "3-0-7",
            "currentStreak": "1W"
        },
        {
            "position": 15,
            "teamId": 500004,
            "teamName": "Gold Coast Titans",
            "teamNickName": "Titans",
            "gamesPlayed": 24,
            "wins": 7,
            "draws": 0,
            "losses": 17,
            "byes": 2,
            "competitionPoints": 18,
            "pointsFor": 448,
            "pointsAgainst": 638,
            "pointsDifference": -190,
            "homeWins": 4,
            "homeDraws": 0,
            "homeLosses": 8,
            "awayWins": 3,
            "awayLosses": 9,
            "recentFormList": {
                "recentForm1": "L",
                "recentForm2": "L",
                "recentForm3": "L",
                "recentForm4": "L",
                "recentForm5": "L"
            },
            "recentForm": "LLLLL",
            "seasonForm": "LLLLLLLWBWWLLLBLWWWLLLLWLL",
            "awayDraws": 0,
            "group": 0,
            "triesFor": 83,
            "triesConceded": 112,
            "goalsFor": 58,
            "goalsConceded": 95,
            "fieldGoalsFor": 0,
            "fieldGoalsConceded": 0,
            "fivePointTries": 0,
            "playersUsed": 34,
            "averageLosingMargin": 16.5,
            "averageWinningMargin": 12.9,
            "closeGames": 6,
            "dayRecord": "1-2-8",
            "nightRecord": "6-0-9",
            "currentStreak": "7L"
        },
        {
            "position": 16,
            "teamId": 500003,
            "teamName": "Newcastle Knights",
            "teamNickName": "Knights",
            "gamesPlayed": 24,
            "wins": 5,
            "draws": 0,
            "losses": 19,
            "byes": 2,
            "competitionPoints": 14,
            "pointsFor": 428,
            "pointsAgainst": 648,
            "pointsDifference": -220,
            "homeWins": 4,
            "homeDraws": 0,
            "homeLosses": 8,
            "awayWins": 1,
            "awayLosses": 11,
            "recentFormList": {
                "recentForm1": "L",
                "recentForm2": "L",
                "recentForm3": "L",
                "recentForm4": "W",
                "recentForm5": "W"
            },
            "recentForm": "LLLWW",
            "seasonForm": "LLLWWWLLLLLBLLBLWLLLLLLLWL",
            "awayDraws": 0,
            "group": 0,
            "triesFor": 72,
            "triesConceded": 113,
            "goalsFor": 69,
            "goalsConceded": 97,
            "fieldGoalsFor": 2,
            "fieldGoalsConceded": 2,
            "fivePointTries": 0,
            "playersUsed": 31,
            "averageLosingMargin": 14.9,
            "averageWinningMargin": 12.8,
            "closeGames": 6,
            "dayRecord": "4-2-10",
            "nightRecord": "1-0-9",
            "currentStreak": "3L"
        }
    ],
    "seasonId": 2017
}