{
    "vod": [
        {
            "id": "w2ZmhmYzE6u57yONlLEHn5vQmHGy33Yh",
            "contentId": 934346,
            "title": "Rd 25: Titans v Bulldogs (Hls)",
            "description": "Highlights of the clash between the Titans & Bulldogs",
            "publishDate": "2017-08-26T17:00:20+10:00",
            "publisher": "NRL Chief",
            "thumbnailUrl": "http://bpvideos.telstra.insnw.net/web/images/20170826164651a_89x50.jpg",
            "largeThumbnailUrl": "http://bpvideos.telstra.insnw.net/web/images/20170826164651a_326x184.jpg",
            "programType": "Highlights",
            "programCategory": "Match",
            "priority": null,
            "lastUpdateDate": "2017-08-26T17:05:14+10:00",
            "isPremium": false,
            "club": [
                500010,
                500004
            ]
        },
        {
            "id": "M3eWhmYzE6pL6KoRl61WLkPsGepJdRYl",
            "contentId": 934611,
            "title": "Rd 25 Press Conference: Titans",
            "description": "Titans caretaker coach Terry Matterson speaks with the media following his side's Round 25 clash",
            "publishDate": "2017-08-26T18:09:00+10:00",
            "publisher": "NRL Chief",
            "thumbnailUrl": "http://bpvideos.telstra.insnw.net/web/images/20170826180855a_89x50.jpg",
            "largeThumbnailUrl": "http://bpvideos.telstra.insnw.net/web/images/20170826180855a_326x184.jpg",
            "programType": "Press Conference",
            "programCategory": null,
            "priority": null,
            "lastUpdateDate": "2017-08-26T18:15:30+10:00",
            "isPremium": false,
            "club": [
                500010,
                500004
            ]
        },
        {
            "id": "9pdGhmYzE6KaEfkJNN35gQv0u-dm-TEs",
            "contentId": 934612,
            "title": "Rd 25 Press Conference: Bulldogs",
            "description": "Bulldogs coach Des Hasler speaks with the media following his side's Round 25 clash",
            "publishDate": "2017-08-26T17:49:00+10:00",
            "publisher": "NRL Chief",
            "thumbnailUrl": "http://bpvideos.telstra.insnw.net/web/images/20170826174935a_89x50.jpg",
            "largeThumbnailUrl": "http://bpvideos.telstra.insnw.net/web/images/20170826174935a_326x184.jpg",
            "programType": "Press Conference",
            "programCategory": null,
            "priority": null,
            "lastUpdateDate": "2017-08-26T17:54:24+10:00",
            "isPremium": false,
            "club": [
                500010,
                500004
            ]
        },
        {
            "id": "hlZGhmYzE6rIWBMT3g8IuajoxX8IXm0v",
            "contentId": 934804,
            "title": "Rd 25: TRY Phillip Sami (78th min)",
            "description": "Phillip Sami crosses for a consolation try for the Titans",
            "publishDate": "2017-08-26T16:52:33+10:00",
            "publisher": "NRL Chief",
            "thumbnailUrl": "http://bpvideos.telstra.insnw.net/web/images/20170826165107a_89x50.jpg",
            "largeThumbnailUrl": "http://bpvideos.telstra.insnw.net/web/images/20170826165107a_326x184.jpg",
            "programType": "Instant Replay",
            "programCategory": "Score",
            "priority": null,
            "lastUpdateDate": "2017-08-26T16:56:12+10:00",
            "isPremium": true,
            "club": [
                500010,
                500004
            ]
        },
        {
            "id": "tyY2hmYzE66AN3tYsxhxTdaV3jBTxFh6",
            "contentId": 934803,
            "title": "Rd 25: TRY Josh Morris (76th min)",
            "description": "Josh Morris scores one of the easier tries of his career",
            "publishDate": "2017-08-26T16:49:20+10:00",
            "publisher": "NRL Chief",
            "thumbnailUrl": "http://bpvideos.telstra.insnw.net/web/images/20170826164924a_89x50.jpg",
            "largeThumbnailUrl": "http://bpvideos.telstra.insnw.net/web/images/20170826164924a_326x184.jpg",
            "programType": "Instant Replay",
            "programCategory": "Score",
            "priority": null,
            "lastUpdateDate": "2017-08-26T16:54:12+10:00",
            "isPremium": true,
            "club": [
                500010,
                500004
            ]
        },
        {
            "id": "RrYmhmYzE6AoJc_vfPKzdDc80zHs-lgL",
            "contentId": 934800,
            "title": "Rd 25: PENALTY GOAL Adam Elliott (72nd min)",
            "description": "Adam Elliott kicks the Bulldogs out to a 12-point lead",
            "publishDate": "2017-08-26T16:44:35+10:00",
            "publisher": "NRL Chief",
            "thumbnailUrl": "http://bpvideos.telstra.insnw.net/web/images/20170826164418a_89x50.jpg",
            "largeThumbnailUrl": "http://bpvideos.telstra.insnw.net/web/images/20170826164418a_326x184.jpg",
            "programType": "Instant Replay",
            "programCategory": "Score",
            "priority": null,
            "lastUpdateDate": "2017-08-26T16:49:10+10:00",
            "isPremium": true,
            "club": [
                500010,
                500004
            ]
        },
        {
            "id": "ZtNWhmYzE6Tkf471ME-JO8tMFv0d7nlI",
            "contentId": 934792,
            "title": "Rd 25: TRY Anthony Don (53rd min)",
            "description": "Anthony Don crosses to keep the Titans in the hunt",
            "publishDate": "2017-08-26T16:20:53+10:00",
            "publisher": "NRL Chief",
            "thumbnailUrl": "http://bpvideos.telstra.insnw.net/web/images/20170826162054a_89x50.jpg",
            "largeThumbnailUrl": "http://bpvideos.telstra.insnw.net/web/images/20170826162054a_326x184.jpg",
            "programType": "Instant Replay",
            "programCategory": "Score",
            "priority": null,
            "lastUpdateDate": "2017-08-26T16:25:05+10:00",
            "isPremium": true,
            "club": [
                500010,
                500004
            ]
        },
        {
            "id": "NrM2hmYzE6KN_hIJMmCn8m1-Sd5VIExH",
            "contentId": 934789,
            "title": "Rd 25: GOAL Tyrone Roberts (46th min)",
            "description": "Tyrone Roberts converts his own try",
            "publishDate": "2017-08-26T16:10:22+10:00",
            "publisher": "NRL Chief",
            "thumbnailUrl": "http://bpvideos.telstra.insnw.net/web/images/20170826161001a_89x50.jpg",
            "largeThumbnailUrl": "http://bpvideos.telstra.insnw.net/web/images/20170826161001a_326x184.jpg",
            "programType": "Instant Replay",
            "programCategory": "Score",
            "priority": null,
            "lastUpdateDate": "2017-08-26T16:14:03+10:00",
            "isPremium": true,
            "club": [
                500010,
                500004
            ]
        },
        {
            "id": "E2M2hmYzE6jSnUUgJzPHXZXzm2LF5_Lr",
            "contentId": 934787,
            "title": "Rd 25: TRY Tyrone Roberts (45th min)",
            "description": "Tyrone Roberts crosses out wide to register first points for the home side",
            "publishDate": "2017-08-26T16:09:21+10:00",
            "publisher": "NRL Chief",
            "thumbnailUrl": "http://bpvideos.telstra.insnw.net/web/images/20170826160815a_89x50.jpg",
            "largeThumbnailUrl": "http://bpvideos.telstra.insnw.net/web/images/20170826160815a_326x184.jpg",
            "programType": "Instant Replay",
            "programCategory": "Score",
            "priority": null,
            "lastUpdateDate": "2017-08-26T16:13:02+10:00",
            "isPremium": true,
            "club": [
                500010,
                500004
            ]
        },
        {
            "id": "9nd2dmYzE6MbbcqeW8uAxcD-kfdaOVie",
            "contentId": 934778,
            "title": "Rd 25: TRY William Hopoate (35th min)",
            "description": "William Hopoate backs up for a first half double",
            "publishDate": "2017-08-26T15:44:23+10:00",
            "publisher": "NRL Chief",
            "thumbnailUrl": "http://bpvideos.telstra.insnw.net/web/images/20170826154334a_89x50.jpg",
            "largeThumbnailUrl": "http://bpvideos.telstra.insnw.net/web/images/20170826154334a_326x184.jpg",
            "programType": "Instant Replay",
            "programCategory": "Score",
            "priority": null,
            "lastUpdateDate": "2017-08-26T15:47:57+10:00",
            "isPremium": true,
            "club": [
                500010,
                500004
            ]
        },
        {
            "id": "NmdGdmYzE69IEg9vKCfh11hLoaBOlaRd",
            "contentId": 934769,
            "title": "Rd 25: TRY Marcelo Montoya (23rd min)",
            "description": "Marcelo Montoya scores to make the Bulldogs' lead out to 16 points",
            "publishDate": "2017-08-26T15:31:22+10:00",
            "publisher": "NRL Chief",
            "thumbnailUrl": "http://bpvideos.telstra.insnw.net/web/images/20170826153139a_89x50.jpg",
            "largeThumbnailUrl": "http://bpvideos.telstra.insnw.net/web/images/20170826153139a_326x184.jpg",
            "programType": "Instant Replay",
            "programCategory": "Score",
            "priority": null,
            "lastUpdateDate": "2017-08-26T15:35:54+10:00",
            "isPremium": true,
            "club": [
                500010,
                500004
            ]
        },
        {
            "id": "E4c2dmYzE6tMBmK8tKuCmMn0YkdQKljX",
            "contentId": 934764,
            "title": "Rd 25: GOAL Adam Elliott (20th min)",
            "description": "Adam Elliott converts the try of David Klemmer",
            "publishDate": "2017-08-26T15:27:08+10:00",
            "publisher": "NRL Chief",
            "thumbnailUrl": "http://bpvideos.telstra.insnw.net/web/images/20170826152647a_89x50.jpg",
            "largeThumbnailUrl": "http://bpvideos.telstra.insnw.net/web/images/20170826152647a_326x184.jpg",
            "programType": "Instant Replay",
            "programCategory": "Score",
            "priority": null,
            "lastUpdateDate": "2017-08-26T15:30:53+10:00",
            "isPremium": true,
            "club": [
                500010,
                500004
            ]
        },
        {
            "id": "hldWdmYzE61aJn3aBdGZ_AAVVpfPaJdd",
            "contentId": 934772,
            "title": "Rd 25: TRY David Klemmer (19th min)",
            "description": "The Bulldogs forward crashes over",
            "publishDate": "2017-08-26T15:26:12+10:00",
            "publisher": "NRL Chief",
            "thumbnailUrl": "http://bpvideos.telstra.insnw.net/web/images/20170826153608a_89x50.jpg",
            "largeThumbnailUrl": "http://bpvideos.telstra.insnw.net/web/images/20170826153608a_326x184.jpg",
            "programType": "Instant Replay",
            "programCategory": "Score",
            "priority": null,
            "lastUpdateDate": "2017-08-26T15:39:55+10:00",
            "isPremium": true,
            "club": [
                500010,
                500004
            ]
        },
        {
            "id": "FxcWdmYzE6EWrPCi-WXkP1p2G9myb16Y",
            "contentId": 934760,
            "title": "Rd 25: GOAL Moses Mbye (15th min)",
            "description": "Moses Mbye converts the try of William Hopoate",
            "publishDate": "2017-08-26T15:23:13+10:00",
            "publisher": "NRL Chief",
            "thumbnailUrl": "http://bpvideos.telstra.insnw.net/web/images/20170826152249a_89x50.jpg",
            "largeThumbnailUrl": "http://bpvideos.telstra.insnw.net/web/images/20170826152249a_326x184.jpg",
            "programType": "Instant Replay",
            "programCategory": "Score",
            "priority": null,
            "lastUpdateDate": "2017-08-26T15:26:51+10:00",
            "isPremium": true,
            "club": [
                500010,
                500004
            ]
        },
        {
            "id": "tjcWdmYzE6Cl0f9Av1iwi5zJO-fLudP8",
            "contentId": 934759,
            "title": "Rd 25: TRY William Hopoate (14th min)",
            "description": "William Hopoate crosses for his first try of 2017",
            "publishDate": "2017-08-26T15:20:53+10:00",
            "publisher": "NRL Chief",
            "thumbnailUrl": "http://bpvideos.telstra.insnw.net/web/images/20170826152000a_89x50.jpg",
            "largeThumbnailUrl": "http://bpvideos.telstra.insnw.net/web/images/20170826152000a_326x184.jpg",
            "programType": "Instant Replay",
            "programCategory": "Score",
            "priority": null,
            "lastUpdateDate": "2017-08-26T15:24:51+10:00",
            "isPremium": true,
            "club": [
                500010,
                500004
            ]
        }
    ],
    "scores": [
        {
            "gameState": "Second Half",
            "gameStateId": 5,
            "gameTime": "0:44:02",
            "gameSeconds": 2642,
            "GameMinutes": "44:02",
            "playerId": 500046,
            "playerName": "Tyrone Roberts",
            "scoreMethod": "Try",
            "statEvent": "Try",
            "statId": 38,
            "statValue": 4,
            "vidRef": 75004,
            "homeScore": 4,
            "awayScore": 20,
            "commentary": "Try by Tyrone Roberts",
            "tackleNum": 1,
            "teamId": 500004,
            "teamName": "Gold Coast Titans",
            "homeTeamAbbrv": "GLD",
            "awayTeamAbbrv": "CBY"
        },
        {
            "gameState": "Second Half",
            "gameStateId": 5,
            "gameTime": "0:45:33",
            "gameSeconds": 2733,
            "GameMinutes": "45:33",
            "playerId": 500046,
            "playerName": "Tyrone Roberts",
            "scoreMethod": "Conversion",
            "statEvent": "Conversion-Made",
            "statId": 1,
            "statValue": 2,
            "vidRef": 77769,
            "homeScore": 6,
            "awayScore": 20,
            "commentary": "Conversion-Made by Tyrone Roberts",
            "tackleNum": -1,
            "teamId": 500004,
            "teamName": "Gold Coast Titans",
            "homeTeamAbbrv": "GLD",
            "awayTeamAbbrv": "CBY"
        },
        {
            "gameState": "Second Half",
            "gameStateId": 5,
            "gameTime": "0:52:34",
            "gameSeconds": 3154,
            "GameMinutes": "52:34",
            "playerId": 500067,
            "playerName": "Anthony Don",
            "scoreMethod": "Try",
            "statEvent": "Try",
            "statId": 38,
            "statValue": 4,
            "vidRef": 93094,
            "homeScore": 10,
            "awayScore": 20,
            "commentary": "Try by Anthony Don",
            "tackleNum": 6,
            "teamId": 500004,
            "teamName": "Gold Coast Titans",
            "homeTeamAbbrv": "GLD",
            "awayTeamAbbrv": "CBY"
        },
        {
            "gameState": "Second Half",
            "gameStateId": 5,
            "gameTime": "1:17:47",
            "gameSeconds": 4667,
            "GameMinutes": "77:47",
            "playerId": 505918,
            "playerName": "Phillip Sami",
            "scoreMethod": "Try",
            "statEvent": "Try",
            "statId": 38,
            "statValue": 4,
            "vidRef": 140436,
            "homeScore": 14,
            "awayScore": 26,
            "commentary": "Try by Phillip Sami",
            "tackleNum": 4,
            "teamId": 500004,
            "teamName": "Gold Coast Titans",
            "homeTeamAbbrv": "GLD",
            "awayTeamAbbrv": "CBY"
        },
        {
            "gameState": "First Half",
            "gameStateId": 3,
            "gameTime": "0:13:12",
            "gameSeconds": 792,
            "GameMinutes": "13:12",
            "playerId": 500672,
            "playerName": "Will Hopoate",
            "scoreMethod": "Try",
            "statEvent": "Try",
            "statId": 38,
            "statValue": 4,
            "vidRef": 22533,
            "awayScore": 4,
            "commentary": "Try by Will Hopoate",
            "tackleNum": 4,
            "teamId": 500010,
            "teamName": "Canterbury-Bankstown Bulldogs",
            "homeTeamAbbrv": "GLD",
            "awayTeamAbbrv": "CBY"
        },
        {
            "gameState": "First Half",
            "gameStateId": 3,
            "gameTime": "0:14:45",
            "gameSeconds": 885,
            "GameMinutes": "14:45",
            "playerId": 500243,
            "playerName": "Moses Mbye",
            "scoreMethod": "Conversion",
            "statEvent": "Conversion-Made",
            "statId": 1,
            "statValue": 2,
            "vidRef": 25036,
            "awayScore": 6,
            "commentary": "Conversion-Made by Moses Mbye",
            "tackleNum": -1,
            "teamId": 500010,
            "teamName": "Canterbury-Bankstown Bulldogs",
            "homeTeamAbbrv": "GLD",
            "awayTeamAbbrv": "CBY"
        },
        {
            "gameState": "First Half",
            "gameStateId": 3,
            "gameTime": "0:17:55",
            "gameSeconds": 1075,
            "GameMinutes": "17:55",
            "playerId": 500228,
            "playerName": "David Klemmer",
            "scoreMethod": "Try",
            "statEvent": "Try",
            "statId": 38,
            "statValue": 4,
            "vidRef": 31462,
            "awayScore": 10,
            "commentary": "Try by David Klemmer",
            "tackleNum": 6,
            "teamId": 500010,
            "teamName": "Canterbury-Bankstown Bulldogs",
            "homeTeamAbbrv": "GLD",
            "awayTeamAbbrv": "CBY"
        },
        {
            "gameState": "First Half",
            "gameStateId": 3,
            "gameTime": "0:19:25",
            "gameSeconds": 1165,
            "GameMinutes": "19:25",
            "playerId": 500128,
            "playerName": "Adam Elliott",
            "scoreMethod": "Conversion",
            "statEvent": "Conversion-Made",
            "statId": 1,
            "statValue": 2,
            "vidRef": 33920,
            "awayScore": 12,
            "commentary": "Conversion-Made by Adam Elliott",
            "tackleNum": -1,
            "teamId": 500010,
            "teamName": "Canterbury-Bankstown Bulldogs",
            "homeTeamAbbrv": "GLD",
            "awayTeamAbbrv": "CBY"
        },
        {
            "gameState": "First Half",
            "gameStateId": 3,
            "gameTime": "0:22:05",
            "gameSeconds": 1325,
            "GameMinutes": "22:05",
            "playerId": 502487,
            "playerName": "Marcelo Montoya",
            "scoreMethod": "Try",
            "statEvent": "Try",
            "statId": 38,
            "statValue": 4,
            "vidRef": 37923,
            "awayScore": 16,
            "commentary": "Try by Marcelo Montoya",
            "tackleNum": 5,
            "teamId": 500010,
            "teamName": "Canterbury-Bankstown Bulldogs",
            "homeTeamAbbrv": "GLD",
            "awayTeamAbbrv": "CBY"
        },
        {
            "gameState": "First Half",
            "gameStateId": 3,
            "gameTime": "0:34:44",
            "gameSeconds": 2084,
            "GameMinutes": "34:44",
            "playerId": 500672,
            "playerName": "Will Hopoate",
            "scoreMethod": "Try",
            "statEvent": "Try",
            "statId": 38,
            "statValue": 4,
            "vidRef": 59017,
            "awayScore": 20,
            "commentary": "Try by Will Hopoate",
            "tackleNum": 5,
            "teamId": 500010,
            "teamName": "Canterbury-Bankstown Bulldogs",
            "homeTeamAbbrv": "GLD",
            "awayTeamAbbrv": "CBY"
        },
        {
            "gameState": "Second Half",
            "gameStateId": 5,
            "gameTime": "1:11:51",
            "gameSeconds": 4311,
            "GameMinutes": "71:51",
            "playerId": 500128,
            "playerName": "Adam Elliott",
            "scoreMethod": "Penalty Goal",
            "statEvent": "Penalty Shot-Made",
            "statId": 67,
            "statValue": 2,
            "vidRef": 129158,
            "homeScore": 10,
            "awayScore": 22,
            "commentary": "Penalty Shot-Made by Adam Elliott",
            "tackleNum": -1,
            "teamId": 500010,
            "teamName": "Canterbury-Bankstown Bulldogs",
            "homeTeamAbbrv": "GLD",
            "awayTeamAbbrv": "CBY"
        },
        {
            "gameState": "Second Half",
            "gameStateId": 5,
            "gameTime": "1:15:28",
            "gameSeconds": 4528,
            "GameMinutes": "75:28",
            "playerId": 500232,
            "playerName": "Josh Morris",
            "scoreMethod": "Try",
            "statEvent": "Try",
            "statId": 38,
            "statValue": 4,
            "vidRef": 136256,
            "homeScore": 10,
            "awayScore": 26,
            "commentary": "Try by Josh Morris",
            "tackleNum": 1,
            "teamId": 500010,
            "teamName": "Canterbury-Bankstown Bulldogs",
            "homeTeamAbbrv": "GLD",
            "awayTeamAbbrv": "CBY"
        }
    ],
    "twitter": [
        {
            "id": "901334863512453120",
            "gameSeconds": 4200
        },
        {
            "id": "901334633836564480",
            "gameSeconds": 4200
        },
        {
            "id": "901334522062553089",
            "gameSeconds": 4200
        },
        {
            "id": "901332228348665857",
            "gameSeconds": 3960
        },
        {
            "id": "901331896260362240",
            "gameSeconds": 3960
        },
        {
            "id": "901328562220785664",
            "gameSeconds": 3180
        },
        {
            "id": "901328212524883968",
            "gameSeconds": 3180
        },
        {
            "id": "901325506649260034",
            "gameSeconds": 1980
        },
        {
            "id": "901325180454043648",
            "gameSeconds": 1980
        }
    ]
}