{
    "competitionId": 111,
    "competitionName": "NRL Telstra Premiership",
    "gameId": 20161111660,
    "gameInfo": {
        "assistantReferee1Id": 500013,
        "numberOfPeriods": 2,
        "assistantReferee1Name": "Brett Suttor",
        "assistantReferee2Id": 500115,
        "assistantReferee2Name": "Rohan Best",
        "gameDate": "2016-06-26",
        "gameHashTag": "#NRLStormTigers",
        "gameNumber": 6,
        "gameSeconds": 4800,
        "gameMinutes": "80:00",
        "gameTime": "1:20:00",
        "groundConditionId": 1,
        "groundConditionName": "N/A",
        "referee1Id": 500022,
        "referee1Name": "Jared Maxwell",
        "referee2Id": 500019,
        "referee2Name": "Adam Gee",
        "startTime": "2016-06-26T16:00:00",
        "startTimeUTC": "2016-06-26T06:00:00Z",
        "venueId": 500023,
        "venueName": "AAMI Park",
        "videoReferee1Id": 500203,
        "videoReferee1Name": "Ben Galea",
        "videoReferee2Id": 500036,
        "videoReferee2Name": "Jason Robinson",
        "weatherId": 2,
        "weatherName": "Fine",
        "broadcastChannel": null,
        "venueLatitude": -37.8253,
        "venueLongitude": 144.9839,
        "broadcastInfo": {
            "radioNetwork": []
        }
    },
    "gameState": "Final",
    "gameStateId": 8,
    "roundId": 16,
    "roundName": "Round 16",
    "seasonId": 2016,
    "teams": {
        "teamsMatch": [
            {
                "isHomeTeam": true,
                "score": {
                    "conversions": 4,
                    "points": 29,
                    "fieldGoals": 1,
                    "penaltyGoals": 2,
                    "tries": 4
                },
                "team1stHalfScore": 26,
                "team2ndHalfScore": 3,
                "teamAbbr": "MEL",
                "teamFinalScore": 29,
                "teamFullTimeScore": 29,
                "teamHalfTimeScore": 26,
                "teamId": 500021,
                "teamLineup": {
                    "teamLineUpStatusID": 4,
                    "teamLineUpStatus": "Final",
                    "injuriesAndSuspensions": {
                        "injury": [],
                        "suspension": []
                    },
                    "insAndOuts": {
                        "inOut": [
                            {
                                "inOut": "Out",
                                "playerFirstName": "Brodie",
                                "playerId": "505328",
                                "playerLastName": "Croft",
                                "playerName": "Brodie Croft"
                            },
                            {
                                "inOut": "In",
                                "playerFirstName": "Cameron",
                                "playerId": "500609",
                                "playerLastName": "Smith",
                                "playerName": "Cameron Smith"
                            },
                            {
                                "inOut": "In",
                                "playerFirstName": "Cooper",
                                "playerId": "500587",
                                "playerLastName": "Cronk",
                                "playerName": "Cooper Cronk"
                            },
                            {
                                "inOut": "Out",
                                "playerFirstName": "Slade",
                                "playerId": "500592",
                                "playerLastName": "Griffin",
                                "playerName": "Slade Griffin"
                            }
                        ]
                    },
                    "teamPlayer": [
                        {
                            "playerFirstName": "Young",
                            "playerId": 500610,
                            "playerLastName": "Tonumaipea",
                            "playerName": "Young Tonumaipea",
                            "playerPosition": "Fullback",
                            "playerPositionId": 500001,
                            "playerStats": {
                                "allRunMetres": 136,
                                "allRuns": 16,
                                "bombKicksNotDefused": 1,
                                "dummyHalfRuns": 2,
                                "errors": 1,
                                "fantasyPointsTotal": 20,
                                "kickReturnMetres": 29,
                                "kickReturns": 2,
                                "kicksDefused": 2,
                                "kicksNotDefused": 2,
                                "mins": 80,
                                "missedTackles": 1,
                                "offloads": 2,
                                "passes": 15,
                                "passesPerRun": 0.94,
                                "oneOnOneTackles": 1,
                                "supports": 2,
                                "tackleBreaks": 1,
                                "tackles": 2,
                                "evasionRuns": 12,
                                "evasionRunMetres": 85,
                                "dummyHalfRunMetres": 22,
                                "ptbAll": 12,
                                "receipts": 30,
                                "postContactMetres": 34,
                                "dummyPasses": 5,
                                "lineEngagedRuns": 2,
                                "ptbOneToTwo": 2,
                                "ptbTwoToThree": 6,
                                "ptbThreeToFour": 2,
                                "ptbFourToFive": 2,
                                "doubles": 1,
                                "effectiveTacklePercentage": 66.7,
                                "stint1": 4800
                            },
                            "playerTookTheField": true,
                            "shirtNum": 22,
                            "playerFirstInitial": "Y",
                            "playerPositionAbbrev": "FB",
                            "onTheField": true,
                            "fantasyPrice": 232000,
                            "fantasySeasonPriceChange": 52000,
                            "fantasyRoundPriceChange": 9000
                        },
                        {
                            "playerFirstName": "Suliasi",
                            "playerId": 502107,
                            "playerLastName": "Vunivalu",
                            "playerName": "Suliasi Vunivalu",
                            "playerPosition": "Winger 1",
                            "playerPositionId": 500002,
                            "playerStats": {
                                "allRunMetres": 120,
                                "allRuns": 12,
                                "bombKicksDefused": 1,
                                "dummyHalfRuns": 1,
                                "errors": 2,
                                "fantasyPointsTotal": 28,
                                "kickReturnMetres": 39,
                                "kickReturns": 3,
                                "kicksDefused": 3,
                                "kicksNotDefused": 2,
                                "linebreaks": 1,
                                "mins": 80,
                                "passes": 3,
                                "passesPerRun": 0.25,
                                "supports": 9,
                                "tackleBreaks": 4,
                                "tackles": 1,
                                "tryCause": 1,
                                "evasionRuns": 8,
                                "evasionRunMetres": 67,
                                "dummyHalfRunMetres": 14,
                                "ptbAll": 10,
                                "receipts": 19,
                                "postContactMetres": 35,
                                "ptbOneToTwo": 1,
                                "ptbTwoToThree": 4,
                                "ptbThreeToFour": 2,
                                "ptbFourToFive": 2,
                                "ptbFivePlus": 1,
                                "effectiveTacklePercentage": 100,
                                "stint1": 4800
                            },
                            "playerTookTheField": true,
                            "shirtNum": 2,
                            "playerFirstInitial": "S",
                            "playerPositionAbbrev": "WG",
                            "onTheField": true,
                            "fantasyPrice": 290000
                        },
                        {
                            "playerFirstName": "Cheyse",
                            "playerId": 501260,
                            "playerLastName": "Blair",
                            "playerName": "Cheyse Blair",
                            "playerPosition": "Centre 1",
                            "playerPositionId": 500003,
                            "playerStats": {
                                "allRunMetres": 56,
                                "allRuns": 9,
                                "bombKicksNotDefused": 1,
                                "fantasyPointsTotal": 18,
                                "hitUps": 2,
                                "ineffectiveTackles": 1,
                                "kickMetres": 1,
                                "kicks": 1,
                                "kicksNotDefused": 1,
                                "linebreakAssists": 1,
                                "mins": 80,
                                "missedTackles": 1,
                                "offloads": 1,
                                "passes": 5,
                                "passesPerRun": 0.56,
                                "oneOnOneTackles": 3,
                                "penalties": 1,
                                "supports": 2,
                                "tackles": 13,
                                "tryCause": 2,
                                "hitupRunMeters": 12,
                                "evasionRuns": 7,
                                "evasionRunMetres": 44,
                                "ptbAll": 6,
                                "receipts": 14,
                                "chipKick": 1,
                                "postContactMetres": 17,
                                "lineEngagedRuns": 1,
                                "ptbOneToTwo": 1,
                                "ptbTwoToThree": 1,
                                "ptbThreeToFour": 3,
                                "ptbFourToFive": 1,
                                "doubles": 2,
                                "effectiveTacklePercentage": 86.7,
                                "foulPlayPenalties": 1,
                                "stint1": 4800
                            },
                            "playerTookTheField": true,
                            "shirtNum": 3,
                            "playerFirstInitial": "C",
                            "playerPositionAbbrev": "CT",
                            "onTheField": true,
                            "fantasyPrice": 256000,
                            "fantasySeasonPriceChange": 88000,
                            "fantasyRoundPriceChange": 5000
                        },
                        {
                            "playerFirstName": "Ryan",
                            "playerId": 500682,
                            "playerLastName": "Morgan",
                            "playerName": "Ryan Morgan",
                            "playerPosition": "Centre 2",
                            "playerPositionId": 500004,
                            "playerStats": {
                                "allRunMetres": 84,
                                "allRuns": 5,
                                "decoys": 3,
                                "fantasyPointsTotal": 29,
                                "kickReturnMetres": 18,
                                "kickReturns": 1,
                                "kicksDefused": 1,
                                "mins": 80,
                                "missedTackles": 1,
                                "passes": 1,
                                "passesPerRun": 0.2,
                                "oneOnOneTackles": 1,
                                "supports": 8,
                                "tackleBreaks": 3,
                                "tackles": 13,
                                "tryCause": 1,
                                "evasionRuns": 4,
                                "evasionRunMetres": 66,
                                "ptbAll": 6,
                                "receipts": 7,
                                "postContactMetres": 36,
                                "kickPressures": 1,
                                "ptbTwoToThree": 2,
                                "ptbThreeToFour": 1,
                                "ptbFourToFive": 2,
                                "ptbFivePlus": 1,
                                "doubles": 2,
                                "effectiveTacklePercentage": 92.9,
                                "stint1": 4800
                            },
                            "playerTookTheField": true,
                            "shirtNum": 4,
                            "playerFirstInitial": "R",
                            "playerPositionAbbrev": "CT",
                            "onTheField": true,
                            "fantasyPrice": 254000,
                            "fantasySeasonPriceChange": 47000,
                            "fantasyRoundPriceChange": 12000
                        },
                        {
                            "playerFirstName": "Marika",
                            "playerId": 500653,
                            "playerLastName": "Koroibete",
                            "playerName": "Marika Koroibete",
                            "playerPosition": "Winger 2",
                            "playerPositionId": 500005,
                            "playerStats": {
                                "allRunMetres": 285,
                                "allRuns": 13,
                                "dummyHalfRuns": 1,
                                "errors": 4,
                                "fantasyPointsTotal": 54,
                                "kickReturnMetres": 70,
                                "kickReturns": 1,
                                "linebreaks": 2,
                                "mins": 80,
                                "missedTackles": 1,
                                "offloads": 2,
                                "passes": 1,
                                "passesPerRun": 0.08,
                                "penalties": 1,
                                "points": 4,
                                "supports": 1,
                                "tackleBreaks": 5,
                                "tackles": 3,
                                "tries": 1,
                                "tryCause": 2,
                                "evasionRuns": 11,
                                "evasionRunMetres": 209,
                                "dummyHalfRunMetres": 6,
                                "ptbAll": 8,
                                "receipts": 16,
                                "postContactMetres": 37,
                                "ptbOneToTwo": 1,
                                "ptbTwoToThree": 2,
                                "ptbThreeToFour": 5,
                                "effectiveTacklePercentage": 75,
                                "foulPlayPenalties": 1,
                                "stint1": 4800
                            },
                            "playerTookTheField": true,
                            "shirtNum": 5,
                            "playerFirstInitial": "M",
                            "playerPositionAbbrev": "WG",
                            "onTheField": true,
                            "fantasyPrice": 263000,
                            "fantasySeasonPriceChange": -66000,
                            "fantasyRoundPriceChange": -2000
                        },
                        {
                            "playerFirstName": "Tohu",
                            "playerId": 500594,
                            "playerLastName": "Harris",
                            "playerName": "Tohu Harris",
                            "playerPosition": "Five-Eighth",
                            "playerPositionId": 500006,
                            "playerStats": {
                                "allRunMetres": 120,
                                "allRuns": 14,
                                "fantasyPointsTotal": 67,
                                "hitUps": 11,
                                "ineffectiveTackles": 3,
                                "kicksDefused": 1,
                                "linebreakAssists": 1,
                                "linebreaks": 1,
                                "mins": 80,
                                "offloads": 2,
                                "passes": 17,
                                "passesPerRun": 1.21,
                                "oneOnOneTackles": 1,
                                "points": 4,
                                "supports": 10,
                                "tackleBreaks": 3,
                                "tackles": 22,
                                "tries": 1,
                                "tryAssists": 1,
                                "tryCause": 2,
                                "hitupRunMeters": 96,
                                "evasionRuns": 3,
                                "evasionRunMetres": 24,
                                "ptbAll": 11,
                                "receipts": 31,
                                "postContactMetres": 39,
                                "dummyPasses": 1,
                                "lineEngagedRuns": 1,
                                "ptbThreeToFour": 8,
                                "ptbFourToFive": 2,
                                "ptbFivePlus": 1,
                                "doubles": 6,
                                "effectiveTacklePercentage": 88,
                                "stint1": 4800
                            },
                            "playerTookTheField": true,
                            "shirtNum": 12,
                            "playerFirstInitial": "T",
                            "playerPositionAbbrev": "FE",
                            "onTheField": true,
                            "fantasyPrice": 466000,
                            "fantasySeasonPriceChange": 38000,
                            "fantasyRoundPriceChange": -36000
                        },
                        {
                            "playerFirstName": "Cooper",
                            "playerId": 500587,
                            "playerLastName": "Cronk",
                            "playerName": "Cooper Cronk",
                            "playerPosition": "Halfback",
                            "playerPositionId": 500007,
                            "playerStats": {
                                "allRunMetres": 19,
                                "allRuns": 6,
                                "bombKicks": 2,
                                "bombKickMetres": 40,
                                "chargedDown": 1,
                                "decoys": 1,
                                "fantasyPointsTotal": 32,
                                "fieldGoalConversionRate": 50,
                                "fieldGoals": 1,
                                "fieldGoalsAttempts": 2,
                                "fieldGoalsMissed": 1,
                                "ineffectiveTackles": 2,
                                "kickMetres": 175,
                                "kickReturns": 1,
                                "kicks": 7,
                                "kicksDefused": 1,
                                "linebreakAssists": 1,
                                "mins": 80,
                                "missedTackles": 1,
                                "offloads": 1,
                                "passes": 33,
                                "passesPerRun": 5.5,
                                "oneOnOneTackles": 1,
                                "points": 1,
                                "supports": 4,
                                "tackles": 10,
                                "tryAssists": 1,
                                "tryCause": 1,
                                "evasionRuns": 5,
                                "evasionRunMetres": 19,
                                "ptbAll": 4,
                                "receipts": 47,
                                "crossFieldKick": 2,
                                "postContactMetres": 3,
                                "dummyPasses": 1,
                                "kickPressures": 1,
                                "lineEngagedRuns": 1,
                                "ptbThreeToFour": 2,
                                "ptbFourToFive": 1,
                                "ptbFivePlus": 1,
                                "longKicksSpace": 1,
                                "effectiveTacklePercentage": 76.9,
                                "stint1": 4800
                            },
                            "playerTookTheField": true,
                            "shirtNum": 7,
                            "playerFirstInitial": "C",
                            "playerPositionAbbrev": "HB",
                            "onTheField": true,
                            "fantasyPrice": 430000,
                            "fantasySeasonPriceChange": 40000
                        },
                        {
                            "playerFirstName": "Jesse",
                            "playerId": 500584,
                            "playerLastName": "Bromwich",
                            "playerName": "Jesse Bromwich",
                            "playerPosition": "Prop 1",
                            "playerPositionId": 500008,
                            "playerStats": {
                                "allRunMetres": 101,
                                "allRuns": 13,
                                "decoys": 5,
                                "errors": 1,
                                "fantasyPointsTotal": 41,
                                "hitUps": 11,
                                "ineffectiveTackles": 1,
                                "kickReturnMetres": 27,
                                "kickReturns": 2,
                                "mins": 59,
                                "missedTackles": 1,
                                "offloads": 3,
                                "passes": 5,
                                "passesPerRun": 0.38,
                                "penalties": 1,
                                "supports": 2,
                                "tackleBreaks": 1,
                                "tackles": 28,
                                "hitupRunMeters": 74,
                                "ptbAll": 10,
                                "receipts": 18,
                                "postContactMetres": 37,
                                "ptbThreeToFour": 8,
                                "ptbFourToFive": 1,
                                "ptbFivePlus": 1,
                                "doubles": 2,
                                "effectiveTacklePercentage": 93.3,
                                "ptbPenalties": 1,
                                "stint1": 1855,
                                "stint2": 1698
                            },
                            "playerTookTheField": true,
                            "shirtNum": 8,
                            "playerFirstInitial": "J",
                            "playerPositionAbbrev": "PR",
                            "onTheField": true,
                            "fantasyPrice": 456000,
                            "fantasySeasonPriceChange": -14000,
                            "fantasyRoundPriceChange": -14000
                        },
                        {
                            "playerFirstName": "Cameron",
                            "playerId": 500609,
                            "playerLastName": "Smith",
                            "playerName": "Cameron Smith",
                            "playerPosition": "Hooker",
                            "playerPositionId": 500009,
                            "playerStats": {
                                "allRunMetres": 46,
                                "allRuns": 4,
                                "chargeDowns": 1,
                                "conversions": 4,
                                "conversionsAttempts": 4,
                                "dummyHalfRuns": 4,
                                "fantasyPointsTotal": 60,
                                "goalConversionRate": 100,
                                "allGoals": 6,
                                "allGoalsAttempted": 6,
                                "ineffectiveTackles": 1,
                                "kickMetres": 98,
                                "kicks": 4,
                                "lineDropouts": 1,
                                "linebreakAssists": 1,
                                "mins": 80,
                                "missedTackles": 2,
                                "passes": 96,
                                "passesPerRun": 24,
                                "oneOnOneTackles": 1,
                                "penalties": 1,
                                "penaltyGoals": 2,
                                "penaltyGoalsAttempts": 2,
                                "points": 12,
                                "tackles": 39,
                                "tryAssists": 1,
                                "tryCause": 1,
                                "dummyHalfRunMetres": 46,
                                "ptbAll": 3,
                                "receipts": 99,
                                "crossFieldKick": 2,
                                "postContactMetres": 12,
                                "dummyPasses": 6,
                                "kickPressures": 3,
                                "ptbThreeToFour": 2,
                                "ptbFourToFive": 1,
                                "doubles": 5,
                                "effectiveTacklePercentage": 92.9,
                                "ptbPenalties": 1,
                                "stint1": 4800
                            },
                            "playerTookTheField": true,
                            "shirtNum": 9,
                            "playerFirstInitial": "C",
                            "playerPositionAbbrev": "HK",
                            "onTheField": true,
                            "fantasyPrice": 589000,
                            "fantasySeasonPriceChange": 41000
                        },
                        {
                            "playerFirstName": "Jordan",
                            "playerId": 500602,
                            "playerLastName": "McLean",
                            "playerName": "Jordan McLean",
                            "playerPosition": "Prop 2",
                            "playerPositionId": 500010,
                            "playerStats": {
                                "allRunMetres": 119,
                                "allRuns": 12,
                                "decoys": 3,
                                "fantasyPointsTotal": 32,
                                "hitUps": 11,
                                "kickReturnMetres": 14,
                                "kickReturns": 1,
                                "mins": 39,
                                "offloads": 1,
                                "passes": 3,
                                "passesPerRun": 0.25,
                                "oneOnOneTackles": 1,
                                "tackleBreaks": 1,
                                "tackles": 16,
                                "hitupRunMeters": 105,
                                "ptbAll": 9,
                                "receipts": 15,
                                "postContactMetres": 55,
                                "ptbTwoToThree": 8,
                                "ptbFourToFive": 1,
                                "doubles": 2,
                                "effectiveTacklePercentage": 100,
                                "stint1": 1611,
                                "stint2": 697
                            },
                            "playerTookTheField": true,
                            "shirtNum": 10,
                            "playerFirstInitial": "J",
                            "playerPositionAbbrev": "PR",
                            "fantasyPrice": 275000,
                            "fantasyRoundPriceChange": 4000
                        },
                        {
                            "playerFirstName": "Kevin",
                            "playerId": 500606,
                            "playerLastName": "Proctor",
                            "playerName": "Kevin Proctor",
                            "playerPosition": "2nd Row 1",
                            "playerPositionId": 500011,
                            "playerStats": {
                                "allRunMetres": 118,
                                "allRuns": 10,
                                "decoys": 5,
                                "fantasyPointsTotal": 33,
                                "hitUps": 10,
                                "ineffectiveTackles": 1,
                                "mins": 80,
                                "missedTackles": 1,
                                "passes": 2,
                                "passesPerRun": 0.2,
                                "oneOnOneTackles": 1,
                                "penalties": 2,
                                "supports": 6,
                                "tackleBreaks": 1,
                                "tackles": 25,
                                "tryCause": 1,
                                "hitupRunMeters": 118,
                                "ptbAll": 10,
                                "receipts": 12,
                                "postContactMetres": 52,
                                "ptbOneToTwo": 1,
                                "ptbTwoToThree": 3,
                                "ptbThreeToFour": 4,
                                "ptbFourToFive": 2,
                                "doubles": 3,
                                "effectiveTacklePercentage": 92.6,
                                "ptbPenalties": 1,
                                "foulPlayPenalties": 1,
                                "stint1": 4800
                            },
                            "playerTookTheField": true,
                            "shirtNum": 11,
                            "playerFirstInitial": "K",
                            "playerPositionAbbrev": "2R",
                            "onTheField": true,
                            "fantasyPrice": 459000,
                            "fantasySeasonPriceChange": 62000,
                            "fantasyRoundPriceChange": 14000
                        },
                        {
                            "playerFirstName": "Felise",
                            "playerId": 500598,
                            "playerLastName": "Kaufusi",
                            "playerName": "Felise Kaufusi",
                            "playerPosition": "2nd Row 2",
                            "playerPositionId": 500012,
                            "playerStats": {
                                "allRunMetres": 76,
                                "allRuns": 8,
                                "decoys": 5,
                                "fantasyPointsTotal": 48,
                                "hitUps": 7,
                                "ineffectiveTackles": 2,
                                "linebreaks": 2,
                                "mins": 55,
                                "missedTackles": 2,
                                "points": 8,
                                "supports": 6,
                                "tackleBreaks": 1,
                                "tackles": 18,
                                "tries": 2,
                                "tryCause": 1,
                                "hitupRunMeters": 70,
                                "evasionRuns": 1,
                                "evasionRunMetres": 6,
                                "ptbAll": 6,
                                "receipts": 8,
                                "postContactMetres": 28,
                                "ptbThreeToFour": 6,
                                "doubles": 2,
                                "effectiveTacklePercentage": 81.8,
                                "stint1": 3101,
                                "stint2": 186
                            },
                            "playerTookTheField": true,
                            "shirtNum": 15,
                            "playerFirstInitial": "F",
                            "playerPositionAbbrev": "2R",
                            "fantasyPrice": 137000,
                            "fantasySeasonPriceChange": -29000,
                            "fantasyRoundPriceChange": -7000
                        },
                        {
                            "playerFirstName": "Dale",
                            "playerId": 500222,
                            "playerLastName": "Finucane",
                            "playerName": "Dale Finucane",
                            "playerPosition": "Lock",
                            "playerPositionId": 500013,
                            "playerStats": {
                                "allRunMetres": 115,
                                "allRuns": 11,
                                "decoys": 9,
                                "fantasyPointsTotal": 38,
                                "hitUps": 11,
                                "mins": 73,
                                "missedTackles": 2,
                                "passes": 4,
                                "passesPerRun": 0.36,
                                "oneOnOneTackles": 2,
                                "supports": 5,
                                "tackleBreaks": 1,
                                "tackles": 28,
                                "hitupRunMeters": 115,
                                "ptbAll": 11,
                                "receipts": 15,
                                "postContactMetres": 53,
                                "dummyPasses": 3,
                                "kickPressures": 4,
                                "ptbTwoToThree": 4,
                                "ptbThreeToFour": 7,
                                "doubles": 4,
                                "effectiveTacklePercentage": 93.3,
                                "stint1": 4049,
                                "stint2": 321
                            },
                            "playerTookTheField": true,
                            "shirtNum": 13,
                            "playerFirstInitial": "D",
                            "playerPositionAbbrev": "LK",
                            "onTheField": true,
                            "fantasyPrice": 428000,
                            "fantasySeasonPriceChange": 59000,
                            "fantasyRoundPriceChange": -12000
                        },
                        {
                            "playerFirstName": "Nelson",
                            "playerId": 501281,
                            "playerLastName": "Asofa-Solomona",
                            "playerName": "Nelson Asofa-Solomona",
                            "playerPosition": "Interchange",
                            "playerPositionId": 500014,
                            "playerStats": {
                                "allRunMetres": 52,
                                "allRuns": 5,
                                "decoys": 4,
                                "errors": 1,
                                "fantasyPointsTotal": 25,
                                "hitUps": 4,
                                "kickReturnMetres": 15,
                                "kickReturns": 1,
                                "mins": 25,
                                "missedTackles": 1,
                                "offloads": 1,
                                "oneOnOneTackles": 1,
                                "tackleBreaks": 2,
                                "tackles": 16,
                                "hitupRunMeters": 37,
                                "ptbAll": 3,
                                "receipts": 5,
                                "postContactMetres": 20,
                                "ptbTwoToThree": 1,
                                "ptbThreeToFour": 2,
                                "doubles": 1,
                                "effectiveTacklePercentage": 94.1,
                                "stint1": 1503
                            },
                            "playerTookTheField": true,
                            "shirtNum": 14,
                            "playerFirstInitial": "N",
                            "playerPositionAbbrev": "INT",
                            "fantasyPrice": 277000,
                            "fantasySeasonPriceChange": 59000,
                            "fantasyRoundPriceChange": -2000
                        },
                        {
                            "playerFirstName": "Kenneath",
                            "playerId": 500585,
                            "playerLastName": "Bromwich",
                            "playerName": "Kenneath Bromwich",
                            "playerPosition": "Interchange",
                            "playerPositionId": 500014,
                            "playerStats": {
                                "allRunMetres": 14,
                                "allRuns": 2,
                                "dummyHalfRuns": 1,
                                "fantasyPointsTotal": 19,
                                "hitUps": 1,
                                "ineffectiveTackles": 1,
                                "mins": 28,
                                "missedTackles": 1,
                                "passes": 1,
                                "passesPerRun": 0.5,
                                "tackles": 20,
                                "hitupRunMeters": 9,
                                "dummyHalfRunMetres": 5,
                                "ptbAll": 2,
                                "receipts": 3,
                                "postContactMetres": 4,
                                "kickPressures": 1,
                                "ptbThreeToFour": 1,
                                "ptbFourToFive": 1,
                                "doubles": 5,
                                "effectiveTacklePercentage": 90.9,
                                "stint1": 1685
                            },
                            "playerTookTheField": true,
                            "shirtNum": 16,
                            "playerFirstInitial": "K",
                            "playerPositionAbbrev": "INT",
                            "onTheField": true,
                            "fantasyPrice": 252000,
                            "fantasySeasonPriceChange": -13000,
                            "fantasyRoundPriceChange": 9000
                        },
                        {
                            "playerFirstName": "Ben",
                            "playerId": 500593,
                            "playerLastName": "Hampton",
                            "playerName": "Ben Hampton",
                            "playerPosition": "Interchange",
                            "playerPositionId": 500014,
                            "playerStats": {
                                "allRunMetres": 27,
                                "allRuns": 3,
                                "decoys": 2,
                                "fantasyPointsTotal": 3,
                                "ineffectiveTackles": 2,
                                "mins": 13,
                                "missedTackles": 2,
                                "oneOnOneTackles": 1,
                                "tackles": 5,
                                "evasionRuns": 3,
                                "evasionRunMetres": 27,
                                "ptbAll": 3,
                                "receipts": 3,
                                "postContactMetres": 8,
                                "kickPressures": 1,
                                "ptbTwoToThree": 3,
                                "effectiveTacklePercentage": 55.6,
                                "stint1": 751
                            },
                            "playerTookTheField": true,
                            "shirtNum": 17,
                            "playerFirstInitial": "B",
                            "playerPositionAbbrev": "INT",
                            "onTheField": true,
                            "fantasyPrice": 186000,
                            "fantasySeasonPriceChange": -96000,
                            "fantasyRoundPriceChange": -4000
                        },
                        {
                            "playerFirstName": "Christian",
                            "playerId": 500786,
                            "playerLastName": "Welch",
                            "playerName": "Christian Welch",
                            "playerPosition": "Interchange",
                            "playerPositionId": 500014,
                            "playerStats": {
                                "allRunMetres": 28,
                                "allRuns": 4,
                                "decoys": 5,
                                "fantasyPointsTotal": 30,
                                "hitUps": 3,
                                "mins": 29,
                                "missedTackles": 1,
                                "offloads": 2,
                                "passes": 2,
                                "passesPerRun": 0.5,
                                "oneOnOneTackles": 1,
                                "penalties": 1,
                                "supports": 1,
                                "tackles": 28,
                                "hitupRunMeters": 22,
                                "evasionRuns": 1,
                                "evasionRunMetres": 6,
                                "ptbAll": 1,
                                "receipts": 5,
                                "postContactMetres": 7,
                                "kickPressures": 3,
                                "lineEngagedRuns": 1,
                                "ptbTwoToThree": 1,
                                "doubles": 6,
                                "effectiveTacklePercentage": 96.6,
                                "ptbPenalties": 1,
                                "stint1": 1741
                            },
                            "playerTookTheField": true,
                            "shirtNum": 21,
                            "playerFirstInitial": "C",
                            "playerPositionAbbrev": "INT",
                            "fantasyPrice": 163000,
                            "fantasySeasonPriceChange": 29000,
                            "fantasyRoundPriceChange": 3000
                        }
                    ]
                },
                "teamName": "Melbourne Storm",
                "teamNickName": "Storm",
                "teamStats": {
                    "allRunMetres": 1517,
                    "allRuns": 147,
                    "bombKicks": 2,
                    "bombKickMetres": 40,
                    "bombKicksDefused": 1,
                    "bombKicksNotDefused": 2,
                    "chargeDowns": 1,
                    "chargedDown": 1,
                    "completeSets": 25,
                    "completionPercentage": 74,
                    "conversions": 4,
                    "conversionsAttempts": 4,
                    "decoys": 42,
                    "dummyHalfRuns": 9,
                    "errors": 9,
                    "fieldGoalConversionRate": 50,
                    "fieldGoals": 1,
                    "fieldGoalsAttempts": 2,
                    "fieldGoalsMissed": 1,
                    "goalConversionRate": 100,
                    "allGoals": 6,
                    "allGoalsAttempted": 6,
                    "hitUps": 71,
                    "incompleteSets": 9,
                    "ineffectiveTackles": 14,
                    "kickMetres": 274,
                    "kickReturnMetres": 212,
                    "kickReturns": 12,
                    "kicks": 12,
                    "kicksDefused": 8,
                    "kicksNotDefused": 5,
                    "lineDropouts": 1,
                    "linebreakAssists": 4,
                    "linebreaks": 6,
                    "missedTackles": 18,
                    "offloads": 15,
                    "oneOnOneTackles": 15,
                    "passes": 188,
                    "passesPerRun": 1.28,
                    "penalties": 7,
                    "penaltyGoals": 2,
                    "penaltyGoalsAttempts": 2,
                    "points": 29,
                    "pointsConceded": 20,
                    "possession": 49,
                    "scrumWins": 5,
                    "supports": 56,
                    "tackleBreaks": 23,
                    "tackles": 287,
                    "sets": 34,
                    "tries": 4,
                    "triesConceded": 4,
                    "tryAssists": 3,
                    "tryCause": 12,
                    "hitupRunMeters": 658,
                    "evasionRuns": 55,
                    "evasionRunMetres": 553,
                    "dummyHalfRunMetres": 94,
                    "ptbTotal": 115,
                    "twoManTackles": 56,
                    "threeManTackles": 48,
                    "fourManPlusTackles": 4,
                    "tryScoringPercentage": 16,
                    "shiftsLeft": 12,
                    "shiftsRight": 12,
                    "receipts": 347,
                    "chipKick": 1,
                    "crossFieldKick": 4,
                    "postContactMetres": 476,
                    "dummyPasses": 16,
                    "kickPressures": 14,
                    "lineEngagedRuns": 6,
                    "ptbOneToTwo": 6,
                    "ptbTwoToThree": 35,
                    "ptbThreeToFour": 53,
                    "ptbFourToFive": 16,
                    "ptbFivePlus": 5,
                    "interchangeUsed": 8,
                    "doubles": 41,
                    "longKicksSpace": 1,
                    "effectiveTacklePercentage": 90,
                    "ptbPenalties": 4,
                    "foulPlayPenalties": 3,
                    "averageSetDistance": 44.6,
                    "completeSets1stHalf": 16,
                    "completeSets2ndHalf": 9,
                    "completionPercentage1stHalf": 80,
                    "completionPercentage2ndHalf": 64.29,
                    "incompleteSets1stHalf": 4,
                    "incompleteSets2ndHalf": 5,
                    "incompletionPercentage1stHalf": 20,
                    "incompletionPercentage2ndHalf": 35.71
                },
                "teamHexColour": "500180",
                "teamHexColour2": "feba35"
            },
            {
                "score": {
                    "conversions": 2,
                    "points": 20,
                    "tries": 4
                },
                "team1stHalfScore": 0,
                "team2ndHalfScore": 20,
                "teamAbbr": "WST",
                "teamFinalScore": 20,
                "teamFullTimeScore": 20,
                "teamHalfTimeScore": 0,
                "teamId": 500023,
                "teamLineup": {
                    "teamLineUpStatusID": 4,
                    "teamLineUpStatus": "Final",
                    "injuriesAndSuspensions": {
                        "injury": [],
                        "suspension": []
                    },
                    "insAndOuts": {
                        "inOut": []
                    },
                    "teamPlayer": [
                        {
                            "playerFirstName": "James",
                            "playerId": 500663,
                            "playerLastName": "Tedesco",
                            "playerName": "James Tedesco",
                            "playerPosition": "Fullback",
                            "playerPositionId": 500001,
                            "playerStats": {
                                "allRunMetres": 159,
                                "allRuns": 15,
                                "decoys": 1,
                                "errors": 2,
                                "fantasyPointsTotal": 57,
                                "kickMetres": 6,
                                "kickReturnMetres": 22,
                                "kickReturns": 2,
                                "kicks": 1,
                                "linebreaks": 1,
                                "mins": 80,
                                "missedTackles": 1,
                                "offloads": 3,
                                "passes": 2,
                                "passesPerRun": 0.13,
                                "oneOnOneTackles": 1,
                                "points": 4,
                                "supports": 5,
                                "tackleBreaks": 6,
                                "tackles": 7,
                                "tries": 1,
                                "trySaves": 1,
                                "evasionRuns": 13,
                                "evasionRunMetres": 137,
                                "ptbAll": 9,
                                "receipts": 20,
                                "grubberKick": 1,
                                "postContactMetres": 39,
                                "dummyPasses": 1,
                                "kickPressures": 1,
                                "ptbThreeToFour": 2,
                                "ptbFourToFive": 6,
                                "ptbFivePlus": 1,
                                "doubles": 1,
                                "effectiveTacklePercentage": 87.5,
                                "stint1": 4800
                            },
                            "playerTookTheField": true,
                            "shirtNum": 1,
                            "playerFirstInitial": "J",
                            "playerPositionAbbrev": "FB",
                            "onTheField": true,
                            "fantasyPrice": 414000,
                            "fantasySeasonPriceChange": -68000
                        },
                        {
                            "playerFirstName": "David",
                            "playerId": 500658,
                            "playerLastName": "Nofoaluma",
                            "playerName": "David Nofoaluma",
                            "playerPosition": "Winger 1",
                            "playerPositionId": 500002,
                            "playerStats": {
                                "allRunMetres": 110,
                                "allRuns": 15,
                                "bombKicksDefused": 1,
                                "bombKicksNotDefused": 1,
                                "dummyHalfRuns": 8,
                                "errors": 2,
                                "fantasyPointsTotal": 39,
                                "ineffectiveTackles": 2,
                                "kickReturnMetres": 2,
                                "kickReturns": 1,
                                "kicksDefused": 2,
                                "kicksNotDefused": 1,
                                "linebreaks": 1,
                                "mins": 80,
                                "missedTackles": 2,
                                "offloads": 4,
                                "passes": 5,
                                "passesPerRun": 0.33,
                                "oneOnOneTackles": 1,
                                "points": 4,
                                "supports": 7,
                                "tackleBreaks": 3,
                                "tackles": 5,
                                "tries": 1,
                                "tryCause": 1,
                                "evasionRuns": 6,
                                "evasionRunMetres": 49,
                                "dummyHalfRunMetres": 59,
                                "ptbAll": 8,
                                "receipts": 23,
                                "postContactMetres": 35,
                                "ptbTwoToThree": 1,
                                "ptbThreeToFour": 4,
                                "ptbFourToFive": 2,
                                "ptbFivePlus": 1,
                                "effectiveTacklePercentage": 55.6,
                                "stint1": 4800
                            },
                            "playerTookTheField": true,
                            "shirtNum": 2,
                            "playerFirstInitial": "D",
                            "playerPositionAbbrev": "WG",
                            "onTheField": true,
                            "fantasyPrice": 318000,
                            "fantasySeasonPriceChange": -29000
                        },
                        {
                            "playerFirstName": "Tim",
                            "playerId": 500660,
                            "playerLastName": "Simona",
                            "playerName": "Tim Simona",
                            "playerPosition": "Centre 1",
                            "playerPositionId": 500003,
                            "playerStats": {
                                "allRunMetres": 101,
                                "allRuns": 9,
                                "decoys": 1,
                                "errors": 1,
                                "fantasyPointsTotal": 42,
                                "ineffectiveTackles": 1,
                                "kickMetres": 28,
                                "kickReturnMetres": 15,
                                "kickReturns": 1,
                                "kicks": 1,
                                "linebreaks": 1,
                                "mins": 80,
                                "missedTackles": 2,
                                "offloads": 1,
                                "passes": 5,
                                "passesPerRun": 0.56,
                                "oneOnOneTackles": 2,
                                "points": 4,
                                "supports": 5,
                                "tackles": 23,
                                "tries": 1,
                                "evasionRuns": 8,
                                "evasionRunMetres": 86,
                                "ptbAll": 7,
                                "receipts": 16,
                                "grubberKick": 1,
                                "postContactMetres": 22,
                                "ptbOneToTwo": 1,
                                "ptbTwoToThree": 4,
                                "ptbThreeToFour": 1,
                                "ptbFourToFive": 1,
                                "doubles": 4,
                                "effectiveTacklePercentage": 88.5,
                                "stint1": 4800
                            },
                            "playerTookTheField": true,
                            "shirtNum": 3,
                            "playerFirstInitial": "T",
                            "playerPositionAbbrev": "CT",
                            "onTheField": true,
                            "fantasyPrice": 254000,
                            "fantasySeasonPriceChange": -26000
                        },
                        {
                            "playerFirstName": "Kevin",
                            "playerId": 500041,
                            "playerLastName": "Naiqama",
                            "playerName": "Kevin Naiqama",
                            "playerPosition": "Centre 2",
                            "playerPositionId": 500004,
                            "playerStats": {
                                "allRunMetres": 70,
                                "allRuns": 10,
                                "decoys": 1,
                                "dummyHalfRuns": 1,
                                "errors": 1,
                                "fantasyPointsTotal": 28,
                                "ineffectiveTackles": 3,
                                "kicksNotDefused": 1,
                                "linebreakAssists": 1,
                                "mins": 80,
                                "missedTackles": 1,
                                "passes": 4,
                                "passesPerRun": 0.4,
                                "oneOnOneTackles": 1,
                                "supports": 4,
                                "tackleBreaks": 1,
                                "tackles": 10,
                                "tryAssists": 1,
                                "tryCause": 1,
                                "trySaves": 1,
                                "evasionRuns": 9,
                                "evasionRunMetres": 62,
                                "dummyHalfRunMetres": 8,
                                "ptbAll": 9,
                                "receipts": 13,
                                "postContactMetres": 20,
                                "lineEngagedRuns": 1,
                                "ptbTwoToThree": 4,
                                "ptbThreeToFour": 4,
                                "ptbFourToFive": 1,
                                "doubles": 1,
                                "effectiveTacklePercentage": 71.4,
                                "stint1": 4800
                            },
                            "playerTookTheField": true,
                            "shirtNum": 4,
                            "playerFirstInitial": "K",
                            "playerPositionAbbrev": "CT",
                            "onTheField": true,
                            "fantasyPrice": 332000,
                            "fantasySeasonPriceChange": 94000
                        },
                        {
                            "playerFirstName": "Jordan",
                            "playerId": 502193,
                            "playerLastName": "Rankin",
                            "playerName": "Jordan Rankin",
                            "playerPosition": "Winger 2",
                            "playerPositionId": 500005,
                            "playerStats": {
                                "allRunMetres": 52,
                                "allRuns": 5,
                                "dummyHalfRuns": 1,
                                "errors": 1,
                                "fantasyPointsTotal": 7,
                                "kickReturnMetres": 29,
                                "kickReturns": 2,
                                "kicksNotDefused": 1,
                                "mins": 80,
                                "missedTackles": 2,
                                "offloads": 1,
                                "passes": 4,
                                "passesPerRun": 0.8,
                                "oneOnOneTackles": 2,
                                "supports": 8,
                                "tackles": 6,
                                "evasionRuns": 2,
                                "evasionRunMetres": 23,
                                "ptbAll": 4,
                                "receipts": 9,
                                "postContactMetres": 7,
                                "ptbTwoToThree": 2,
                                "ptbThreeToFour": 1,
                                "ptbFourToFive": 1,
                                "effectiveTacklePercentage": 75,
                                "stint1": 4800
                            },
                            "playerTookTheField": true,
                            "shirtNum": 5,
                            "playerFirstInitial": "J",
                            "playerPositionAbbrev": "WG",
                            "onTheField": true,
                            "fantasyPrice": 250000,
                            "fantasySeasonPriceChange": 71000
                        },
                        {
                            "playerFirstName": "Mitchell",
                            "playerId": 500485,
                            "playerLastName": "Moses",
                            "playerName": "Mitchell Moses",
                            "playerPosition": "Five-Eighth",
                            "playerPositionId": 500006,
                            "playerStats": {
                                "allRunMetres": 26,
                                "allRuns": 5,
                                "bombKicks": 1,
                                "bombKickMetres": 12,
                                "chargeDowns": 1,
                                "chargedDown": 1,
                                "conversions": 2,
                                "conversionsAttempts": 4,
                                "conversionsMissed": 2,
                                "errors": 1,
                                "fantasyPointsTotal": 10,
                                "goalConversionRate": 50,
                                "allGoals": 2,
                                "allGoalsMissed": 2,
                                "allGoalsAttempted": 4,
                                "ineffectiveTackles": 5,
                                "kickMetres": 20,
                                "kicks": 3,
                                "mins": 80,
                                "missedTackles": 5,
                                "passes": 29,
                                "passesPerRun": 5.8,
                                "oneOnOneTackles": 2,
                                "points": 4,
                                "tackleBreaks": 1,
                                "tackles": 12,
                                "tryCause": 2,
                                "evasionRuns": 5,
                                "evasionRunMetres": 26,
                                "ptbAll": 2,
                                "receipts": 29,
                                "grubberKick": 1,
                                "postContactMetres": 4,
                                "dummyPasses": 1,
                                "lineEngagedRuns": 3,
                                "ptbFourToFive": 1,
                                "ptbFivePlus": 1,
                                "doubles": 2,
                                "effectiveTacklePercentage": 54.5,
                                "stint1": 4800
                            },
                            "playerTookTheField": true,
                            "shirtNum": 6,
                            "playerFirstInitial": "M",
                            "playerPositionAbbrev": "FE",
                            "onTheField": true,
                            "fantasyPrice": 300000,
                            "fantasySeasonPriceChange": 10000
                        },
                        {
                            "playerFirstName": "Luke",
                            "playerId": 500646,
                            "playerLastName": "Brooks",
                            "playerName": "Luke Brooks",
                            "playerPosition": "Halfback",
                            "playerPositionId": 500007,
                            "playerStats": {
                                "allRunMetres": 59,
                                "allRuns": 9,
                                "bombKicks": 2,
                                "bombKickMetres": 47,
                                "fantasyPointsTotal": 80,
                                "ineffectiveTackles": 1,
                                "kickDead": 1,
                                "kickMetres": 332,
                                "kicks": 14,
                                "linebreakAssists": 1,
                                "linebreaks": 1,
                                "mins": 80,
                                "missedTackles": 2,
                                "offloads": 3,
                                "passes": 30,
                                "passesPerRun": 3.33,
                                "oneOnOneTackles": 3,
                                "penalties": 1,
                                "points": 4,
                                "supports": 6,
                                "tackleBreaks": 6,
                                "tackles": 20,
                                "tries": 1,
                                "tryAssists": 1,
                                "evasionRuns": 9,
                                "evasionRunMetres": 59,
                                "ptbAll": 2,
                                "receipts": 49,
                                "chipKick": 2,
                                "grubberKick": 2,
                                "crossFieldKick": 2,
                                "postContactMetres": 4,
                                "dummyPasses": 5,
                                "lineEngagedRuns": 2,
                                "ptbThreeToFour": 2,
                                "doubles": 4,
                                "longKicksSpace": 1,
                                "effectiveTacklePercentage": 87,
                                "generalPlayPenalties": 1,
                                "stint1": 4800
                            },
                            "playerTookTheField": true,
                            "shirtNum": 7,
                            "playerFirstInitial": "L",
                            "playerPositionAbbrev": "HB",
                            "onTheField": true,
                            "fantasyPrice": 281000,
                            "fantasySeasonPriceChange": -17000
                        },
                        {
                            "playerFirstName": "Aaron",
                            "playerId": 500665,
                            "playerLastName": "Woods",
                            "playerName": "Aaron Woods",
                            "playerPosition": "Prop 1",
                            "playerPositionId": 500008,
                            "playerStats": {
                                "allRunMetres": 123,
                                "allRuns": 15,
                                "decoys": 3,
                                "fantasyPointsTotal": 40,
                                "hitUps": 10,
                                "kickReturnMetres": 30,
                                "kickReturns": 2,
                                "mins": 53,
                                "offloads": 1,
                                "passes": 3,
                                "passesPerRun": 0.2,
                                "supports": 1,
                                "tackles": 26,
                                "hitupRunMeters": 82,
                                "evasionRuns": 3,
                                "evasionRunMetres": 11,
                                "ptbAll": 11,
                                "receipts": 15,
                                "postContactMetres": 36,
                                "dummyPasses": 1,
                                "kickPressures": 1,
                                "lineEngagedRuns": 3,
                                "ptbOneToTwo": 1,
                                "ptbTwoToThree": 2,
                                "ptbThreeToFour": 4,
                                "ptbFourToFive": 2,
                                "ptbFivePlus": 2,
                                "doubles": 5,
                                "effectiveTacklePercentage": 100,
                                "stint1": 1801,
                                "stint2": 1397
                            },
                            "playerTookTheField": true,
                            "shirtNum": 8,
                            "playerFirstInitial": "A",
                            "playerPositionAbbrev": "PR",
                            "onTheField": true,
                            "fantasyPrice": 409000,
                            "fantasySeasonPriceChange": -31000
                        },
                        {
                            "playerFirstName": "Elijah",
                            "playerId": 500970,
                            "playerLastName": "Taylor",
                            "playerName": "Elijah Taylor",
                            "playerPosition": "Hooker",
                            "playerPositionId": 500009,
                            "playerStats": {
                                "allRunMetres": 57,
                                "allRuns": 7,
                                "decoys": 1,
                                "dummyHalfRuns": 3,
                                "errors": 2,
                                "fantasyPointsTotal": 38,
                                "hitUps": 3,
                                "ineffectiveTackles": 4,
                                "kicksDefused": 1,
                                "mins": 80,
                                "missedTackles": 1,
                                "offloads": 1,
                                "passes": 79,
                                "passesPerRun": 11.29,
                                "penalties": 1,
                                "supports": 2,
                                "tackles": 38,
                                "hitupRunMeters": 18,
                                "evasionRuns": 1,
                                "evasionRunMetres": 5,
                                "dummyHalfRunMetres": 34,
                                "ptbAll": 6,
                                "receipts": 82,
                                "postContactMetres": 25,
                                "lineEngagedRuns": 1,
                                "ptbTwoToThree": 2,
                                "ptbThreeToFour": 3,
                                "ptbFourToFive": 1,
                                "doubles": 10,
                                "effectiveTacklePercentage": 88.4,
                                "ptbPenalties": 1,
                                "stint1": 4800
                            },
                            "playerTookTheField": true,
                            "shirtNum": 13,
                            "playerFirstInitial": "E",
                            "playerPositionAbbrev": "HK",
                            "onTheField": true,
                            "fantasyPrice": 408000,
                            "fantasySeasonPriceChange": -33000
                        },
                        {
                            "playerFirstName": "Tim",
                            "playerId": 500347,
                            "playerLastName": "Grant",
                            "playerName": "Tim Grant",
                            "playerPosition": "Prop 2",
                            "playerPositionId": 500010,
                            "playerStats": {
                                "allRunMetres": 98,
                                "allRuns": 11,
                                "decoys": 3,
                                "fantasyPointsTotal": 28,
                                "hitUps": 11,
                                "mins": 61,
                                "missedTackles": 2,
                                "passes": 2,
                                "passesPerRun": 0.18,
                                "penalties": 1,
                                "supports": 1,
                                "tackles": 25,
                                "tryCause": 1,
                                "hitupRunMeters": 98,
                                "ptbAll": 10,
                                "receipts": 13,
                                "postContactMetres": 36,
                                "dummyPasses": 1,
                                "ptbTwoToThree": 4,
                                "ptbThreeToFour": 3,
                                "ptbFourToFive": 2,
                                "ptbFivePlus": 1,
                                "doubles": 1,
                                "effectiveTacklePercentage": 92.6,
                                "offsidePenalties": 1,
                                "stint1": 3681
                            },
                            "playerTookTheField": true,
                            "shirtNum": 14,
                            "playerFirstInitial": "T",
                            "playerPositionAbbrev": "PR",
                            "fantasyPrice": 323000,
                            "fantasySeasonPriceChange": 41000
                        },
                        {
                            "playerFirstName": "Josh",
                            "playerId": 500882,
                            "playerLastName": "Aloiai",
                            "playerName": "Josh Aloiai",
                            "playerPosition": "2nd Row 1",
                            "playerPositionId": 500011,
                            "playerStats": {
                                "allRunMetres": 33,
                                "allRuns": 3,
                                "fantasyPointsTotal": 17,
                                "hitUps": 2,
                                "kickReturnMetres": 11,
                                "kickReturns": 1,
                                "mins": 32,
                                "missedTackles": 1,
                                "passes": 1,
                                "passesPerRun": 0.33,
                                "penalties": 1,
                                "supports": 1,
                                "tackles": 18,
                                "tryCause": 2,
                                "hitupRunMeters": 22,
                                "ptbAll": 3,
                                "receipts": 4,
                                "postContactMetres": 11,
                                "ptbTwoToThree": 1,
                                "ptbFourToFive": 2,
                                "doubles": 2,
                                "effectiveTacklePercentage": 94.7,
                                "ptbPenalties": 1,
                                "stint1": 1404,
                                "stint2": 524
                            },
                            "playerTookTheField": true,
                            "shirtNum": 11,
                            "playerFirstInitial": "J",
                            "playerPositionAbbrev": "2R",
                            "onTheField": true,
                            "fantasyPrice": 185000,
                            "fantasySeasonPriceChange": 55000
                        },
                        {
                            "playerFirstName": "Chris",
                            "playerId": 500654,
                            "playerLastName": "Lawrence",
                            "playerName": "Chris Lawrence",
                            "playerPosition": "2nd Row 2",
                            "playerPositionId": 500012,
                            "playerStats": {
                                "allRunMetres": 92,
                                "allRuns": 11,
                                "decoys": 7,
                                "fantasyPointsTotal": 36,
                                "hitUps": 11,
                                "ineffectiveTackles": 1,
                                "mins": 80,
                                "missedTackles": 3,
                                "offloads": 1,
                                "passes": 7,
                                "passesPerRun": 0.64,
                                "oneOnOneTackles": 1,
                                "supports": 3,
                                "tackles": 31,
                                "tryCause": 1,
                                "hitupRunMeters": 92,
                                "ptbAll": 10,
                                "receipts": 18,
                                "postContactMetres": 31,
                                "kickPressures": 1,
                                "ptbTwoToThree": 2,
                                "ptbThreeToFour": 5,
                                "ptbFourToFive": 3,
                                "doubles": 3,
                                "effectiveTacklePercentage": 88.6,
                                "stint1": 4800
                            },
                            "playerTookTheField": true,
                            "shirtNum": 12,
                            "playerFirstInitial": "C",
                            "playerPositionAbbrev": "2R",
                            "onTheField": true,
                            "fantasyPrice": 345000,
                            "fantasySeasonPriceChange": 66000
                        },
                        {
                            "playerFirstName": "Sauaso",
                            "playerId": 500662,
                            "playerLastName": "Sue",
                            "playerName": "Sauaso Sue",
                            "playerPosition": "Lock",
                            "playerPositionId": 500013,
                            "playerStats": {
                                "allRunMetres": 48,
                                "allRuns": 5,
                                "decoys": 2,
                                "fantasyPointsTotal": 25,
                                "hitUps": 5,
                                "mins": 42,
                                "missedTackles": 1,
                                "offloads": 1,
                                "passes": 2,
                                "passesPerRun": 0.4,
                                "oneOnOneTackles": 1,
                                "penalties": 2,
                                "supports": 2,
                                "tackles": 25,
                                "hitupRunMeters": 48,
                                "ptbAll": 4,
                                "receipts": 7,
                                "postContactMetres": 22,
                                "kickPressures": 3,
                                "ptbThreeToFour": 2,
                                "ptbFourToFive": 2,
                                "doubles": 4,
                                "effectiveTacklePercentage": 96.2,
                                "ptbPenalties": 2,
                                "stint1": 1404,
                                "stint2": 1119
                            },
                            "playerTookTheField": true,
                            "shirtNum": 10,
                            "playerFirstInitial": "S",
                            "playerPositionAbbrev": "LK",
                            "onTheField": true,
                            "fantasyPrice": 306000,
                            "fantasySeasonPriceChange": -19000
                        },
                        {
                            "playerFirstName": "Dene",
                            "playerId": 500959,
                            "playerLastName": "Halatau",
                            "playerName": "Dene Halatau",
                            "playerPosition": "Interchange",
                            "playerPositionId": 500014,
                            "playerStats": {
                                "fantasyPointsTotal": 4,
                                "mins": 11,
                                "passes": 14,
                                "tackles": 4,
                                "receipts": 14,
                                "doubles": 1,
                                "effectiveTacklePercentage": 100,
                                "stint1": 678
                            },
                            "playerTookTheField": true,
                            "shirtNum": 9,
                            "playerFirstInitial": "D",
                            "playerPositionAbbrev": "INT",
                            "fantasyPrice": 215000,
                            "fantasySeasonPriceChange": -23000
                        },
                        {
                            "playerFirstName": "Ava",
                            "playerId": 500659,
                            "playerLastName": "Seumanufagai",
                            "playerName": "Ava Seumanufagai",
                            "playerPosition": "Interchange",
                            "playerPositionId": 500014,
                            "playerStats": {
                                "allRunMetres": 139,
                                "allRuns": 14,
                                "decoys": 1,
                                "fantasyPointsTotal": 27,
                                "hitUps": 12,
                                "ineffectiveTackles": 1,
                                "kickReturnMetres": 31,
                                "kickReturns": 2,
                                "mins": 41,
                                "passes": 2,
                                "passesPerRun": 0.14,
                                "supports": 4,
                                "tackles": 14,
                                "hitupRunMeters": 108,
                                "ptbAll": 13,
                                "receipts": 16,
                                "postContactMetres": 38,
                                "ptbOneToTwo": 1,
                                "ptbTwoToThree": 5,
                                "ptbThreeToFour": 5,
                                "ptbFourToFive": 2,
                                "doubles": 2,
                                "effectiveTacklePercentage": 93.3,
                                "stint1": 2474
                            },
                            "playerTookTheField": true,
                            "shirtNum": 15,
                            "playerFirstInitial": "A",
                            "playerPositionAbbrev": "INT",
                            "fantasyPrice": 287000,
                            "fantasySeasonPriceChange": 17000
                        },
                        {
                            "playerFirstName": "Kyle",
                            "playerId": 500480,
                            "playerLastName": "Lovett",
                            "playerName": "Kyle Lovett",
                            "playerPosition": "Interchange",
                            "playerPositionId": 500014,
                            "playerStats": {
                                "allRunMetres": 115,
                                "allRuns": 15,
                                "decoys": 4,
                                "fantasyPointsTotal": 35,
                                "hitUps": 15,
                                "ineffectiveTackles": 2,
                                "mins": 57,
                                "passes": 2,
                                "passesPerRun": 0.13,
                                "penalties": 1,
                                "supports": 4,
                                "tackleBreaks": 1,
                                "tackles": 23,
                                "hitupRunMeters": 115,
                                "ptbAll": 15,
                                "receipts": 17,
                                "postContactMetres": 34,
                                "ptbTwoToThree": 2,
                                "ptbThreeToFour": 8,
                                "ptbFourToFive": 5,
                                "doubles": 8,
                                "effectiveTacklePercentage": 92,
                                "ptbPenalties": 1,
                                "stint1": 3394
                            },
                            "playerTookTheField": true,
                            "shirtNum": 17,
                            "playerFirstInitial": "K",
                            "playerPositionAbbrev": "INT",
                            "onTheField": true,
                            "fantasyPrice": 325000,
                            "fantasySeasonPriceChange": -7000
                        },
                        {
                            "playerFirstName": "JJ",
                            "playerId": 503451,
                            "playerLastName": "Felise",
                            "playerName": "JJ Felise",
                            "playerPosition": "Interchange",
                            "playerPositionId": 500014,
                            "playerStats": {
                                "allRunMetres": 65,
                                "allRuns": 7,
                                "decoys": 3,
                                "fantasyPointsTotal": 11,
                                "hitUps": 7,
                                "mins": 22,
                                "supports": 1,
                                "tackles": 5,
                                "hitupRunMeters": 65,
                                "ptbAll": 7,
                                "receipts": 7,
                                "postContactMetres": 21,
                                "ptbOneToTwo": 1,
                                "ptbTwoToThree": 2,
                                "ptbThreeToFour": 3,
                                "ptbFourToFive": 1,
                                "doubles": 1,
                                "effectiveTacklePercentage": 100,
                                "stint1": 1320
                            },
                            "playerTookTheField": true,
                            "shirtNum": 20,
                            "playerFirstInitial": "J",
                            "playerPositionAbbrev": "INT",
                            "fantasyPrice": 161000
                        }
                    ]
                },
                "teamName": "Wests Tigers",
                "teamNickName": "Wests Tigers",
                "teamStats": {
                    "allRunMetres": 1346,
                    "allRuns": 156,
                    "bombKicks": 3,
                    "bombKickMetres": 59,
                    "bombKicksDefused": 1,
                    "bombKicksNotDefused": 1,
                    "chargeDowns": 1,
                    "chargedDown": 1,
                    "completeSets": 29,
                    "completionPercentage": 81,
                    "conversions": 2,
                    "conversionsAttempts": 4,
                    "conversionsMissed": 2,
                    "decoys": 27,
                    "dummyHalfRuns": 13,
                    "errors": 11,
                    "goalConversionRate": 50,
                    "allGoals": 2,
                    "allGoalsAttempted": 4,
                    "allGoalsMissed": 2,
                    "hitUps": 76,
                    "incompleteSets": 7,
                    "ineffectiveTackles": 20,
                    "kickDead": 1,
                    "kickMetres": 386,
                    "kickReturnMetres": 140,
                    "kickReturns": 11,
                    "kicks": 19,
                    "kicksDefused": 3,
                    "kicksNotDefused": 3,
                    "linebreakAssists": 2,
                    "linebreaks": 4,
                    "missedTackles": 23,
                    "offloads": 16,
                    "oneOnOneTackles": 14,
                    "passes": 191,
                    "passesPerRun": 1.22,
                    "penalties": 7,
                    "points": 20,
                    "pointsConceded": 29,
                    "possession": 51,
                    "scrumWins": 6,
                    "supports": 54,
                    "tackleBreaks": 18,
                    "tackles": 292,
                    "sets": 36,
                    "tries": 4,
                    "triesConceded": 4,
                    "tryAssists": 2,
                    "tryCause": 8,
                    "trySaves": 2,
                    "hitupRunMeters": 647,
                    "evasionRuns": 56,
                    "evasionRunMetres": 457,
                    "dummyHalfRunMetres": 102,
                    "ptbTotal": 120,
                    "twoManTackles": 54,
                    "threeManTackles": 49,
                    "fourManPlusTackles": 3,
                    "tryScoringPercentage": 13.79,
                    "shiftsLeft": 16,
                    "shiftsRight": 6,
                    "receipts": 352,
                    "chipKick": 2,
                    "grubberKick": 5,
                    "crossFieldKick": 2,
                    "postContactMetres": 386,
                    "dummyPasses": 9,
                    "kickPressures": 6,
                    "lineEngagedRuns": 10,
                    "ptbOneToTwo": 4,
                    "ptbTwoToThree": 31,
                    "ptbThreeToFour": 47,
                    "ptbFourToFive": 32,
                    "ptbFivePlus": 6,
                    "interchangeUsed": 6,
                    "interchangeLeft": 2,
                    "doubles": 49,
                    "longKicksSpace": 1,
                    "effectiveTacklePercentage": 87.2,
                    "ptbPenalties": 5,
                    "generalPlayPenalties": 1,
                    "offsidePenalties": 1,
                    "averageSetDistance": 37.4,
                    "completeSets1stHalf": 8,
                    "completeSets2ndHalf": 21,
                    "completionPercentage1stHalf": 57.14,
                    "completionPercentage2ndHalf": 95.45,
                    "incompleteSets1stHalf": 6,
                    "incompleteSets2ndHalf": 1,
                    "incompletionPercentage1stHalf": 42.86,
                    "incompletionPercentage2ndHalf": 4.55
                },
                "teamHexColour": "ff7f00",
                "teamHexColour2": "000000"
            }
        ]
    }
}