{
    "competitionId": 111,
    "competitionName": "NRL Telstra Premiership",
    "gameId": 20161110450,
    "gameInfo": {
        "assistantReferee1Id": 500020,
        "numberOfPeriods": 2,
        "assistantReferee1Name": "Jason Walsh",
        "assistantReferee2Id": 500072,
        "assistantReferee2Name": "Kasey Badger",
        "gameDate": "2016-03-27",
        "gameHashTag": "#NRLDragonsPanthers",
        "gameNumber": 5,
        "gameSeconds": 4800,
        "gameMinutes": "80:00",
        "gameTime": "1:20:00",
        "groundConditionId": 1,
        "groundConditionName": "N/A",
        "referee1Id": 500039,
        "referee1Name": "Ashley Klein",
        "referee2Id": 500019,
        "referee2Name": "Adam Gee",
        "startTime": "2016-03-27T16:00:00",
        "startTimeUTC": "2016-03-27T05:00:00Z",
        "venueId": 500019,
        "venueName": "WIN Stadium",
        "videoReferee2Id": 500036,
        "videoReferee2Name": "Jason Robinson",
        "weatherId": 9,
        "weatherName": "Light Rain",
        "broadcastChannel": null,
        "venueLatitude": -34.4278,
        "venueLongitude": 150.9025,
        "broadcastInfo": {
            "radioNetwork": []
        }
    },
    "gameState": "Final",
    "gameStateId": 8,
    "roundId": 4,
    "roundName": "Round 4",
    "seasonId": 2016,
    "teams": {
        "teamsMatch": [
            {
                "isHomeTeam": true,
                "score": {
                    "conversions": 2,
                    "points": 14,
                    "penaltyGoals": 1,
                    "tries": 2
                },
                "team1stHalfScore": 2,
                "team2ndHalfScore": 12,
                "teamAbbr": "SGI",
                "teamFinalScore": 14,
                "teamFullTimeScore": 14,
                "teamHalfTimeScore": 2,
                "teamId": 500022,
                "teamLineup": {
                    "teamLineUpStatusID": 4,
                    "teamLineUpStatus": "Final",
                    "injuriesAndSuspensions": {
                        "injury": [],
                        "suspension": []
                    },
                    "insAndOuts": {
                        "inOut": [
                            {
                                "inOut": "Out",
                                "playerFirstName": "Ben",
                                "playerId": "500618",
                                "playerLastName": "Creagh",
                                "playerName": "Ben Creagh"
                            },
                            {
                                "inOut": "In",
                                "playerFirstName": "Jake",
                                "playerId": "501088",
                                "playerLastName": "Marketo",
                                "playerName": "Jake Marketo"
                            }
                        ]
                    },
                    "teamPlayer": [
                        {
                            "playerFirstName": "Josh",
                            "playerId": 500621,
                            "playerLastName": "Dugan",
                            "playerName": "Josh Dugan",
                            "playerPosition": "Fullback",
                            "playerPositionId": 500001,
                            "playerStats": {
                                "allRunMetres": 209,
                                "allRuns": 22,
                                "fantasyPointsTotal": 87,
                                "hitUps": 4,
                                "ineffectiveTackles": 1,
                                "kickMetres": 3,
                                "kickReturnMetres": 32,
                                "kickReturns": 4,
                                "kicks": 1,
                                "lineDropouts": 1,
                                "linebreaks": 2,
                                "mins": 80,
                                "missedTackles": 2,
                                "offloads": 2,
                                "passes": 3,
                                "passesPerRun": 0.14,
                                "oneOnOneTackles": 2,
                                "penalties": 1,
                                "points": 4,
                                "supports": 10,
                                "tackleBreaks": 15,
                                "tackles": 8,
                                "tries": 1,
                                "tryCause": 1,
                                "hitupRunMeters": 30,
                                "evasionRuns": 14,
                                "evasionRunMetres": 147,
                                "ptbAll": 18,
                                "receipts": 26,
                                "chipKick": 1,
                                "postContactMetres": 60,
                                "dummyPasses": 1,
                                "ptbTwoToThree": 4,
                                "ptbThreeToFour": 6,
                                "ptbFourToFive": 5,
                                "ptbFivePlus": 3,
                                "doubles": 3,
                                "effectiveTacklePercentage": 72.7,
                                "ptbPenalties": 1
                            },
                            "playerTookTheField": true,
                            "shirtNum": 1,
                            "playerFirstInitial": "J",
                            "playerPositionAbbrev": "FB"
                        },
                        {
                            "playerFirstName": "Peter",
                            "playerId": 500630,
                            "playerLastName": "Mata'utia",
                            "playerName": "Peter Mata'utia",
                            "playerPosition": "Winger 1",
                            "playerPositionId": 500002,
                            "playerStats": {
                                "allRunMetres": 103,
                                "allRuns": 15,
                                "errors": 1,
                                "fantasyPointsTotal": 17,
                                "kickReturnMetres": 6,
                                "kickReturns": 1,
                                "kicksDefused": 2,
                                "mins": 80,
                                "missedTackles": 3,
                                "offloads": 4,
                                "passes": 5,
                                "passesPerRun": 0.33,
                                "oneOnOneTackles": 1,
                                "supports": 6,
                                "tackles": 5,
                                "tryCause": 2,
                                "evasionRuns": 14,
                                "evasionRunMetres": 97,
                                "ptbAll": 9,
                                "receipts": 20,
                                "postContactMetres": 28,
                                "dummyPasses": 1,
                                "ptbOneToTwo": 1,
                                "ptbTwoToThree": 5,
                                "ptbThreeToFour": 2,
                                "ptbFivePlus": 1,
                                "effectiveTacklePercentage": 62.5
                            },
                            "playerTookTheField": true,
                            "shirtNum": 2,
                            "playerFirstInitial": "P",
                            "playerPositionAbbrev": "WG"
                        },
                        {
                            "playerFirstName": "Euan",
                            "playerId": 500441,
                            "playerLastName": "Aitken",
                            "playerName": "Euan Aitken",
                            "playerPosition": "Centre 1",
                            "playerPositionId": 500003,
                            "playerStats": {
                                "allRunMetres": 88,
                                "allRuns": 10,
                                "dummyHalfRuns": 1,
                                "fantasyPointsTotal": 42,
                                "ineffectiveTackles": 2,
                                "linebreaks": 1,
                                "mins": 63,
                                "missedTackles": 2,
                                "oneOnOneTackles": 1,
                                "points": 4,
                                "supports": 1,
                                "tackleBreaks": 3,
                                "tackles": 17,
                                "tries": 1,
                                "tryCause": 1,
                                "evasionRuns": 9,
                                "evasionRunMetres": 80,
                                "dummyHalfRunMetres": 8,
                                "ptbAll": 9,
                                "receipts": 10,
                                "postContactMetres": 18,
                                "ptbTwoToThree": 5,
                                "ptbThreeToFour": 2,
                                "ptbFourToFive": 1,
                                "ptbFivePlus": 1,
                                "doubles": 2,
                                "effectiveTacklePercentage": 81
                            },
                            "playerTookTheField": true,
                            "shirtNum": 3,
                            "playerFirstInitial": "E",
                            "playerPositionAbbrev": "CT"
                        },
                        {
                            "playerFirstName": "Timoteo",
                            "playerId": 500229,
                            "playerLastName": "Lafai",
                            "playerName": "Timoteo Lafai",
                            "playerPosition": "Centre 2",
                            "playerPositionId": 500004,
                            "playerStats": {
                                "allRunMetres": 105,
                                "allRuns": 14,
                                "decoys": 1,
                                "dummyHalfRuns": 4,
                                "fantasyPointsTotal": 42,
                                "hitUps": 2,
                                "ineffectiveTackles": 2,
                                "mins": 80,
                                "offloads": 1,
                                "passes": 3,
                                "passesPerRun": 0.21,
                                "oneOnOneTackles": 1,
                                "supports": 6,
                                "tackleBreaks": 6,
                                "tackles": 12,
                                "hitupRunMeters": 13,
                                "evasionRuns": 8,
                                "evasionRunMetres": 45,
                                "dummyHalfRunMetres": 47,
                                "ptbAll": 14,
                                "receipts": 18,
                                "postContactMetres": 41,
                                "kickPressures": 1,
                                "ptbTwoToThree": 4,
                                "ptbThreeToFour": 9,
                                "ptbFourToFive": 1,
                                "doubles": 2,
                                "effectiveTacklePercentage": 85.7
                            },
                            "playerTookTheField": true,
                            "shirtNum": 4,
                            "playerFirstInitial": "T",
                            "playerPositionAbbrev": "CT"
                        },
                        {
                            "playerFirstName": "Jason",
                            "playerId": 500634,
                            "playerLastName": "Nightingale",
                            "playerName": "Jason Nightingale",
                            "playerPosition": "Winger 2",
                            "playerPositionId": 500005,
                            "playerStats": {
                                "allRunMetres": 119,
                                "allRuns": 17,
                                "bombKicksDefused": 3,
                                "bombKicksNotDefused": 2,
                                "dummyHalfRuns": 3,
                                "fantasyPointsTotal": 46,
                                "ineffectiveTackles": 1,
                                "intercepts": 1,
                                "kickReturnMetres": 21,
                                "kickReturns": 4,
                                "kicksDefused": 5,
                                "kicksNotDefused": 2,
                                "mins": 80,
                                "offloads": 6,
                                "passes": 13,
                                "passesPerRun": 0.76,
                                "oneOnOneTackles": 1,
                                "penalties": 1,
                                "supports": 9,
                                "tackleBreaks": 5,
                                "tackles": 5,
                                "evasionRuns": 10,
                                "evasionRunMetres": 72,
                                "dummyHalfRunMetres": 26,
                                "ptbAll": 13,
                                "receipts": 32,
                                "postContactMetres": 42,
                                "dummyPasses": 2,
                                "kickPressures": 1,
                                "ptbZeroToOne": 1,
                                "ptbOneToTwo": 4,
                                "ptbTwoToThree": 3,
                                "ptbThreeToFour": 5,
                                "doubles": 1,
                                "effectiveTacklePercentage": 83.3,
                                "ptbPenalties": 1
                            },
                            "playerTookTheField": true,
                            "shirtNum": 5,
                            "playerFirstInitial": "J",
                            "playerPositionAbbrev": "WG"
                        },
                        {
                            "playerFirstName": "Gareth",
                            "playerId": 500641,
                            "playerLastName": "Widdop",
                            "playerName": "Gareth Widdop",
                            "playerPosition": "Five-Eighth",
                            "playerPositionId": 500006,
                            "playerStats": {
                                "allRunMetres": 109,
                                "allRuns": 15,
                                "bombKicks": 2,
                                "bombKickMetres": 68,
                                "conversions": 2,
                                "conversionsAttempts": 2,
                                "dummyHalfRuns": 1,
                                "fantasyPointsTotal": 55,
                                "goalConversionRate": 100,
                                "allGoals": 3,
                                "allGoalsAttempted": 3,
                                "ineffectiveTackles": 3,
                                "kickMetres": 403,
                                "kickReturnMetres": 5,
                                "kickReturns": 1,
                                "kicks": 12,
                                "kicksDefused": 1,
                                "linebreakAssists": 1,
                                "mins": 80,
                                "missedTackles": 6,
                                "offloads": 1,
                                "passes": 29,
                                "passesPerRun": 1.93,
                                "penaltyGoals": 1,
                                "penaltyGoalsAttempts": 1,
                                "points": 6,
                                "supports": 7,
                                "tackleBreaks": 4,
                                "tackles": 9,
                                "tryAssists": 1,
                                "evasionRuns": 13,
                                "evasionRunMetres": 94,
                                "dummyHalfRunMetres": 10,
                                "ptbAll": 8,
                                "receipts": 51,
                                "grubberKick": 3,
                                "postContactMetres": 29,
                                "dummyPasses": 4,
                                "lineEngagedRuns": 5,
                                "ptbFourToFive": 6,
                                "ptbFivePlus": 2,
                                "longKicksSpace": 3,
                                "effectiveTacklePercentage": 50
                            },
                            "playerTookTheField": true,
                            "shirtNum": 6,
                            "playerFirstInitial": "G",
                            "playerPositionAbbrev": "FE"
                        },
                        {
                            "playerFirstName": "Josh",
                            "playerId": 500972,
                            "playerLastName": "McCrone",
                            "playerName": "Josh McCrone",
                            "playerPosition": "Halfback",
                            "playerPositionId": 500007,
                            "playerStats": {
                                "allRunMetres": 47,
                                "allRuns": 6,
                                "dummyHalfRuns": 2,
                                "errors": 1,
                                "fantasyPointsTotal": 22,
                                "ineffectiveTackles": 3,
                                "kickMetres": 155,
                                "kicks": 5,
                                "linebreakAssists": 1,
                                "mins": 80,
                                "missedTackles": 6,
                                "passes": 24,
                                "passesPerRun": 4,
                                "oneOnOneTackles": 4,
                                "penalties": 2,
                                "supports": 18,
                                "tackles": 22,
                                "tryAssists": 1,
                                "tryCause": 1,
                                "evasionRuns": 4,
                                "evasionRunMetres": 28,
                                "dummyHalfRunMetres": 19,
                                "ptbAll": 3,
                                "receipts": 34,
                                "chipKick": 1,
                                "postContactMetres": 10,
                                "dummyPasses": 1,
                                "kickPressures": 1,
                                "lineEngagedRuns": 2,
                                "ptbTwoToThree": 1,
                                "ptbFourToFive": 2,
                                "doubles": 2,
                                "longKicksSpace": 3,
                                "effectiveTacklePercentage": 71,
                                "ptbPenalties": 2
                            },
                            "playerTookTheField": true,
                            "shirtNum": 7,
                            "playerFirstInitial": "J",
                            "playerPositionAbbrev": "HB"
                        },
                        {
                            "playerFirstName": "Leeson",
                            "playerId": 500614,
                            "playerLastName": "Ah Mau",
                            "playerName": "Leeson Ah Mau",
                            "playerPosition": "Prop 1",
                            "playerPositionId": 500008,
                            "playerStats": {
                                "allRunMetres": 81,
                                "allRuns": 8,
                                "decoys": 1,
                                "fantasyPointsTotal": 35,
                                "hitUps": 6,
                                "kickReturnMetres": 23,
                                "kickReturns": 2,
                                "mins": 45,
                                "passes": 1,
                                "passesPerRun": 0.12,
                                "supports": 6,
                                "tackles": 27,
                                "hitupRunMeters": 58,
                                "ptbAll": 7,
                                "receipts": 9,
                                "postContactMetres": 30,
                                "ptbTwoToThree": 1,
                                "ptbThreeToFour": 4,
                                "ptbFourToFive": 2,
                                "doubles": 3,
                                "effectiveTacklePercentage": 100
                            },
                            "playerTookTheField": true,
                            "shirtNum": 8,
                            "playerFirstInitial": "L",
                            "playerPositionAbbrev": "PR"
                        },
                        {
                            "playerFirstName": "Mitch",
                            "playerId": 500636,
                            "playerLastName": "Rein",
                            "playerName": "Mitch Rein",
                            "playerPosition": "Hooker",
                            "playerPositionId": 500009,
                            "playerStats": {
                                "allRunMetres": 84,
                                "allRuns": 11,
                                "dummyHalfRuns": 8,
                                "errors": 1,
                                "fantasyPointsTotal": 57,
                                "hitUps": 3,
                                "ineffectiveTackles": 2,
                                "kickMetres": 42,
                                "kicks": 2,
                                "mins": 80,
                                "missedTackles": 4,
                                "passes": 108,
                                "passesPerRun": 9.82,
                                "oneOnOneTackles": 1,
                                "supports": 2,
                                "tackleBreaks": 3,
                                "tackles": 48,
                                "tryCause": 1,
                                "hitupRunMeters": 35,
                                "dummyHalfRunMetres": 49,
                                "ptbAll": 4,
                                "receipts": 110,
                                "grubberKick": 1,
                                "postContactMetres": 12,
                                "dummyPasses": 16,
                                "kickPressures": 2,
                                "lineEngagedRuns": 3,
                                "ptbOneToTwo": 1,
                                "ptbThreeToFour": 1,
                                "ptbFivePlus": 2,
                                "doubles": 13,
                                "effectiveTacklePercentage": 88.9
                            },
                            "playerTookTheField": true,
                            "shirtNum": 9,
                            "playerFirstInitial": "M",
                            "playerPositionAbbrev": "HK"
                        },
                        {
                            "playerFirstName": "Russell",
                            "playerId": 502631,
                            "playerLastName": "Packer",
                            "playerName": "Russell Packer",
                            "playerPosition": "Prop 2",
                            "playerPositionId": 500010,
                            "playerStats": {
                                "allRunMetres": 84,
                                "allRuns": 11,
                                "decoys": 2,
                                "errors": 1,
                                "fantasyPointsTotal": 30,
                                "hitUps": 10,
                                "ineffectiveTackles": 3,
                                "kickReturnMetres": 11,
                                "kickReturns": 1,
                                "mins": 35,
                                "missedTackles": 1,
                                "offloads": 1,
                                "passes": 1,
                                "passesPerRun": 0.09,
                                "oneOnOneTackles": 1,
                                "penalties": 2,
                                "tackleBreaks": 1,
                                "tackles": 25,
                                "tryCause": 1,
                                "hitupRunMeters": 73,
                                "ptbAll": 9,
                                "receipts": 12,
                                "postContactMetres": 35,
                                "kickPressures": 3,
                                "ptbTwoToThree": 4,
                                "ptbThreeToFour": 3,
                                "ptbFourToFive": 2,
                                "doubles": 8,
                                "effectiveTacklePercentage": 86.2,
                                "ptbPenalties": 1,
                                "generalPlayPenalties": 1
                            },
                            "playerTookTheField": true,
                            "shirtNum": 10,
                            "playerFirstInitial": "R",
                            "playerPositionAbbrev": "PR"
                        },
                        {
                            "playerFirstName": "Tyson",
                            "playerId": 500622,
                            "playerLastName": "Frizell",
                            "playerName": "Tyson Frizell",
                            "playerPosition": "2nd Row 1",
                            "playerPositionId": 500011,
                            "playerStats": {
                                "allRunMetres": 89,
                                "allRuns": 12,
                                "decoys": 2,
                                "errors": 1,
                                "fantasyPointsTotal": 48,
                                "hitUps": 12,
                                "ineffectiveTackles": 2,
                                "mins": 64,
                                "missedTackles": 1,
                                "offloads": 1,
                                "supports": 7,
                                "tackleBreaks": 4,
                                "tackles": 30,
                                "hitupRunMeters": 89,
                                "ptbAll": 10,
                                "receipts": 12,
                                "postContactMetres": 30,
                                "kickPressures": 1,
                                "ptbOneToTwo": 1,
                                "ptbTwoToThree": 2,
                                "ptbThreeToFour": 4,
                                "ptbFourToFive": 3,
                                "doubles": 5,
                                "effectiveTacklePercentage": 90.9
                            },
                            "playerTookTheField": true,
                            "shirtNum": 11,
                            "playerFirstInitial": "T",
                            "playerPositionAbbrev": "2R"
                        },
                        {
                            "playerFirstName": "Joel",
                            "playerId": 500640,
                            "playerLastName": "Thompson",
                            "playerName": "Joel Thompson",
                            "playerPosition": "2nd Row 2",
                            "playerPositionId": 500012,
                            "playerStats": {
                                "allRunMetres": 91,
                                "allRuns": 10,
                                "decoys": 9,
                                "errors": 1,
                                "fantasyPointsTotal": 37,
                                "hitUps": 10,
                                "ineffectiveTackles": 2,
                                "mins": 80,
                                "missedTackles": 1,
                                "onReport": 1,
                                "passes": 1,
                                "passesPerRun": 0.1,
                                "oneOnOneTackles": 1,
                                "penalties": 1,
                                "supports": 8,
                                "tackleBreaks": 2,
                                "tackles": 28,
                                "hitupRunMeters": 91,
                                "ptbAll": 8,
                                "receipts": 10,
                                "postContactMetres": 27,
                                "ptbTwoToThree": 1,
                                "ptbThreeToFour": 4,
                                "ptbFourToFive": 1,
                                "ptbFivePlus": 2,
                                "doubles": 5,
                                "effectiveTacklePercentage": 90.3,
                                "foulPlayPenalties": 1
                            },
                            "playerTookTheField": true,
                            "shirtNum": 12,
                            "playerFirstInitial": "J",
                            "playerPositionAbbrev": "2R"
                        },
                        {
                            "playerFirstName": "Jack",
                            "playerId": 500619,
                            "playerLastName": "de Belin",
                            "playerName": "Jack de Belin",
                            "playerPosition": "Lock",
                            "playerPositionId": 500013,
                            "playerStats": {
                                "allRunMetres": 98,
                                "allRuns": 13,
                                "decoys": 9,
                                "fantasyPointsTotal": 71,
                                "hitUps": 11,
                                "ineffectiveTackles": 3,
                                "mins": 80,
                                "passes": 6,
                                "passesPerRun": 0.46,
                                "oneOnOneTackles": 1,
                                "supports": 9,
                                "tackleBreaks": 4,
                                "tackles": 50,
                                "hitupRunMeters": 90,
                                "evasionRuns": 2,
                                "evasionRunMetres": 8,
                                "ptbAll": 11,
                                "receipts": 17,
                                "postContactMetres": 29,
                                "kickPressures": 4,
                                "lineEngagedRuns": 2,
                                "ptbTwoToThree": 1,
                                "ptbThreeToFour": 8,
                                "ptbFourToFive": 1,
                                "ptbFivePlus": 1,
                                "doubles": 9,
                                "effectiveTacklePercentage": 94.3
                            },
                            "playerTookTheField": true,
                            "shirtNum": 13,
                            "playerFirstInitial": "J",
                            "playerPositionAbbrev": "LK"
                        },
                        {
                            "playerFirstName": "Mike",
                            "playerId": 501282,
                            "playerLastName": "Cooper",
                            "playerName": "Mike Cooper",
                            "playerPosition": "Interchange",
                            "playerPositionId": 500014,
                            "playerStats": {
                                "allRunMetres": 102,
                                "allRuns": 15,
                                "decoys": 6,
                                "fantasyPointsTotal": 49,
                                "hitUps": 15,
                                "ineffectiveTackles": 1,
                                "linebreakAssists": 1,
                                "mins": 65,
                                "missedTackles": 2,
                                "onReport": 1,
                                "passes": 3,
                                "passesPerRun": 0.2,
                                "penalties": 1,
                                "supports": 6,
                                "tackleBreaks": 2,
                                "tackles": 37,
                                "tryCause": 1,
                                "hitupRunMeters": 102,
                                "ptbAll": 14,
                                "receipts": 17,
                                "postContactMetres": 28,
                                "kickPressures": 1,
                                "ptbTwoToThree": 3,
                                "ptbThreeToFour": 5,
                                "ptbFourToFive": 5,
                                "ptbFivePlus": 1,
                                "doubles": 4,
                                "effectiveTacklePercentage": 92.5,
                                "foulPlayPenalties": 1
                            },
                            "playerTookTheField": true,
                            "shirtNum": 15,
                            "playerFirstInitial": "M",
                            "playerPositionAbbrev": "INT"
                        },
                        {
                            "playerFirstName": "Will",
                            "playerId": 500631,
                            "playerLastName": "Matthews",
                            "playerName": "Will Matthews",
                            "playerPosition": "Interchange",
                            "playerPositionId": 500014,
                            "playerStats": {
                                "allRunMetres": 58,
                                "allRuns": 11,
                                "decoys": 7,
                                "errors": 1,
                                "fantasyPointsTotal": 30,
                                "hitUps": 9,
                                "intercepts": 1,
                                "kickReturns": 1,
                                "mins": 32,
                                "missedTackles": 1,
                                "offloads": 3,
                                "passes": 1,
                                "passesPerRun": 0.09,
                                "oneOnOneTackles": 2,
                                "supports": 4,
                                "tackleBreaks": 2,
                                "tackles": 17,
                                "hitupRunMeters": 54,
                                "evasionRuns": 1,
                                "evasionRunMetres": 4,
                                "ptbAll": 5,
                                "receipts": 11,
                                "postContactMetres": 19,
                                "kickPressures": 1,
                                "lineEngagedRuns": 1,
                                "ptbTwoToThree": 4,
                                "ptbFivePlus": 1,
                                "doubles": 6,
                                "effectiveTacklePercentage": 94.4
                            },
                            "playerTookTheField": true,
                            "shirtNum": 16,
                            "playerFirstInitial": "W",
                            "playerPositionAbbrev": "INT"
                        },
                        {
                            "playerFirstName": "Siliva",
                            "playerId": 501394,
                            "playerLastName": "Havili",
                            "playerName": "Siliva Havili",
                            "playerPosition": "Interchange",
                            "playerPositionId": 500014,
                            "playerStats": [],
                            "shirtNum": 17,
                            "playerFirstInitial": "S",
                            "playerPositionAbbrev": "INT"
                        },
                        {
                            "playerFirstName": "Jake",
                            "playerId": 501088,
                            "playerLastName": "Marketo",
                            "playerName": "Jake Marketo",
                            "playerPosition": "Interchange",
                            "playerPositionId": 500014,
                            "playerStats": {
                                "allRunMetres": 28,
                                "allRuns": 4,
                                "decoys": 4,
                                "fantasyPointsTotal": 12,
                                "hitUps": 4,
                                "ineffectiveTackles": 1,
                                "mins": 16,
                                "passes": 1,
                                "passesPerRun": 0.25,
                                "supports": 2,
                                "tackles": 10,
                                "hitupRunMeters": 28,
                                "ptbAll": 4,
                                "receipts": 5,
                                "postContactMetres": 8,
                                "ptbTwoToThree": 2,
                                "ptbThreeToFour": 1,
                                "ptbFourToFive": 1,
                                "doubles": 4,
                                "effectiveTacklePercentage": 90.9
                            },
                            "playerTookTheField": true,
                            "shirtNum": 18,
                            "playerFirstInitial": "J",
                            "playerPositionAbbrev": "INT"
                        }
                    ]
                },
                "teamName": "St. George Illawarra Dragons",
                "teamNickName": "Dragons",
                "teamStats": {
                    "allRunMetres": 1499,
                    "allRuns": 194,
                    "bombKicks": 2,
                    "bombKickMetres": 68,
                    "bombKicksDefused": 3,
                    "bombKicksNotDefused": 2,
                    "completeSets": 33,
                    "completionPercentage": 82,
                    "conversions": 2,
                    "conversionsAttempts": 2,
                    "decoys": 41,
                    "dummyHalfRuns": 19,
                    "errors": 7,
                    "goalConversionRate": 100,
                    "allGoals": 3,
                    "allGoalsAttempted": 3,
                    "hitUps": 86,
                    "incompleteSets": 7,
                    "ineffectiveTackles": 26,
                    "intercepts": 2,
                    "kickMetres": 603,
                    "kickReturnMetres": 99,
                    "kickReturns": 14,
                    "kicks": 20,
                    "kicksDefused": 8,
                    "kicksNotDefused": 2,
                    "lineDropouts": 1,
                    "linebreakAssists": 3,
                    "linebreaks": 3,
                    "missedTackles": 29,
                    "offloads": 19,
                    "onReports": 2,
                    "oneOnOneTackles": 16,
                    "passes": 199,
                    "passesPerRun": 1.03,
                    "penalties": 8,
                    "penaltyGoals": 1,
                    "penaltyGoalsAttempts": 1,
                    "points": 14,
                    "pointsConceded": 12,
                    "possession": 50,
                    "scrumWins": 6,
                    "supports": 101,
                    "tackleBreaks": 51,
                    "tackles": 350,
                    "sets": 40,
                    "tries": 2,
                    "triesConceded": 2,
                    "tryAssists": 2,
                    "tryCause": 8,
                    "hitupRunMeters": 664,
                    "evasionRuns": 75,
                    "evasionRunMetres": 576,
                    "dummyHalfRunMetres": 160,
                    "ptbTotal": 146,
                    "twoManTackles": 86,
                    "threeManTackles": 31,
                    "fourManPlusTackles": 2,
                    "tryScoringPercentage": 6.06,
                    "shiftsLeft": 9,
                    "shiftsRight": 7,
                    "receipts": 394,
                    "chipKick": 2,
                    "grubberKick": 4,
                    "postContactMetres": 447,
                    "dummyPasses": 25,
                    "kickPressures": 15,
                    "lineEngagedRuns": 13,
                    "ptbZeroToOne": 1,
                    "ptbOneToTwo": 7,
                    "ptbTwoToThree": 40,
                    "ptbThreeToFour": 54,
                    "ptbFourToFive": 30,
                    "ptbFivePlus": 14,
                    "interchangeUsed": 7,
                    "interchangeLeft": 1,
                    "doubles": 67,
                    "longKicksSpace": 6,
                    "effectiveTacklePercentage": 86.4,
                    "ptbPenalties": 5,
                    "generalPlayPenalties": 1,
                    "foulPlayPenalties": 2,
                    "averageSetDistance": 37.5,
                    "completeSets1stHalf": 18,
                    "completeSets2ndHalf": 15,
                    "completionPercentage1stHalf": 75,
                    "completionPercentage2ndHalf": 93.75,
                    "incompleteSets1stHalf": 6,
                    "incompleteSets2ndHalf": 1,
                    "incompletionPercentage1stHalf": 25,
                    "incompletionPercentage2ndHalf": 6.25
                },
                "teamHexColour": "e82c2a",
                "teamHexColour2": "A21F1D"
            },
            {
                "score": {
                    "conversions": 1,
                    "points": 12,
                    "penaltyGoals": 1,
                    "tries": 2
                },
                "team1stHalfScore": 0,
                "team2ndHalfScore": 12,
                "teamAbbr": "PEN",
                "teamFinalScore": 12,
                "teamFullTimeScore": 12,
                "teamHalfTimeScore": 0,
                "teamId": 500014,
                "teamLineup": {
                    "teamLineUpStatusID": 4,
                    "teamLineUpStatus": "Final",
                    "injuriesAndSuspensions": {
                        "injury": [],
                        "suspension": []
                    },
                    "insAndOuts": {
                        "inOut": [
                            {
                                "inOut": "Out",
                                "playerFirstName": "Elijah",
                                "playerId": "500970",
                                "playerLastName": "Taylor",
                                "playerName": "Elijah Taylor"
                            },
                            {
                                "inOut": "Out",
                                "playerFirstName": "Jeremy",
                                "playerId": "500351",
                                "playerLastName": "Latimore",
                                "playerName": "Jeremy Latimore"
                            },
                            {
                                "inOut": "In",
                                "playerFirstName": "Trent",
                                "playerId": "500632",
                                "playerLastName": "Merrin",
                                "playerName": "Trent Merrin"
                            },
                            {
                                "inOut": "In",
                                "playerFirstName": "Waqa",
                                "playerId": "500496",
                                "playerLastName": "Blake",
                                "playerName": "Waqa Blake"
                            }
                        ]
                    },
                    "teamPlayer": [
                        {
                            "playerFirstName": "Will",
                            "playerId": 501253,
                            "playerLastName": "Smith",
                            "playerName": "Will Smith",
                            "playerPosition": "Fullback",
                            "playerPositionId": 500001,
                            "playerStats": {
                                "allRunMetres": 134,
                                "allRuns": 17,
                                "bombKicksDefused": 1,
                                "errors": 1,
                                "fantasyPointsTotal": 28,
                                "hitUps": 1,
                                "ineffectiveTackles": 1,
                                "kickMetres": 14,
                                "kickReturnMetres": 112,
                                "kickReturns": 12,
                                "kicks": 1,
                                "kicksDefused": 1,
                                "mins": 70,
                                "missedTackles": 1,
                                "offloads": 1,
                                "passes": 6,
                                "passesPerRun": 0.35,
                                "oneOnOneTackles": 1,
                                "penalties": 2,
                                "supports": 8,
                                "tackleBreaks": 2,
                                "tackles": 9,
                                "trySaves": 1,
                                "hitupRunMeters": 7,
                                "evasionRuns": 4,
                                "evasionRunMetres": 15,
                                "ptbAll": 13,
                                "receipts": 23,
                                "grubberKick": 1,
                                "postContactMetres": 27,
                                "dummyPasses": 1,
                                "lineEngagedRuns": 1,
                                "ptbTwoToThree": 1,
                                "ptbThreeToFour": 4,
                                "ptbFourToFive": 3,
                                "ptbFivePlus": 5,
                                "doubles": 1,
                                "effectiveTacklePercentage": 81.8,
                                "ptbPenalties": 1,
                                "offsidePenalties": 1
                            },
                            "playerTookTheField": true,
                            "shirtNum": 1,
                            "playerFirstInitial": "W",
                            "playerPositionAbbrev": "FB"
                        },
                        {
                            "playerFirstName": "Josh",
                            "playerId": 500352,
                            "playerLastName": "Mansour",
                            "playerName": "Josh Mansour",
                            "playerPosition": "Winger 1",
                            "playerPositionId": 500002,
                            "playerStats": {
                                "allRunMetres": 255,
                                "allRuns": 20,
                                "bombKicksDefused": 1,
                                "decoys": 2,
                                "dummyHalfRuns": 2,
                                "fantasyPointsTotal": 66,
                                "hitUps": 2,
                                "kickReturnMetres": 52,
                                "kickReturns": 1,
                                "kicksDefused": 1,
                                "linebreaks": 2,
                                "mins": 80,
                                "offloads": 1,
                                "passes": 7,
                                "passesPerRun": 0.35,
                                "oneOnOneTackles": 1,
                                "points": 4,
                                "supports": 9,
                                "tackleBreaks": 5,
                                "tackles": 7,
                                "tries": 1,
                                "hitupRunMeters": 12,
                                "evasionRuns": 15,
                                "evasionRunMetres": 178,
                                "dummyHalfRunMetres": 13,
                                "ptbAll": 17,
                                "receipts": 28,
                                "postContactMetres": 87,
                                "dummyPasses": 1,
                                "ptbOneToTwo": 1,
                                "ptbTwoToThree": 11,
                                "ptbThreeToFour": 2,
                                "ptbFourToFive": 2,
                                "ptbFivePlus": 1,
                                "doubles": 1,
                                "effectiveTacklePercentage": 100
                            },
                            "playerTookTheField": true,
                            "shirtNum": 2,
                            "playerFirstInitial": "J",
                            "playerPositionAbbrev": "WG"
                        },
                        {
                            "playerFirstName": "Waqa",
                            "playerId": 500496,
                            "playerLastName": "Blake",
                            "playerName": "Waqa Blake",
                            "playerPosition": "Centre 1",
                            "playerPositionId": 500003,
                            "playerStats": {
                                "allRunMetres": 76,
                                "allRuns": 9,
                                "errors": 1,
                                "fantasyPointsTotal": 10,
                                "hitUps": 4,
                                "ineffectiveTackles": 4,
                                "interceptedPass": 1,
                                "kickMetres": 12,
                                "kicks": 1,
                                "mins": 80,
                                "missedTackles": 5,
                                "offloads": 1,
                                "passes": 4,
                                "passesPerRun": 0.44,
                                "oneOnOneTackles": 4,
                                "penalties": 1,
                                "supports": 5,
                                "tackleBreaks": 1,
                                "tackles": 12,
                                "hitupRunMeters": 41,
                                "evasionRuns": 5,
                                "evasionRunMetres": 35,
                                "ptbAll": 7,
                                "receipts": 13,
                                "grubberKick": 1,
                                "postContactMetres": 18,
                                "ptbOneToTwo": 1,
                                "ptbTwoToThree": 3,
                                "ptbThreeToFour": 3,
                                "effectiveTacklePercentage": 57.1,
                                "generalPlayPenalties": 1
                            },
                            "playerTookTheField": true,
                            "shirtNum": 3,
                            "playerFirstInitial": "W",
                            "playerPositionAbbrev": "CT"
                        },
                        {
                            "playerFirstName": "Peta",
                            "playerId": 500579,
                            "playerLastName": "Hiku",
                            "playerName": "Peta Hiku",
                            "playerPosition": "Centre 2",
                            "playerPositionId": 500004,
                            "playerStats": {
                                "allRunMetres": 169,
                                "allRuns": 19,
                                "dummyHalfRuns": 2,
                                "fantasyPointsTotal": 35,
                                "hitUps": 1,
                                "ineffectiveTackles": 2,
                                "kickReturnMetres": 13,
                                "kickReturns": 1,
                                "kicksDefused": 1,
                                "mins": 80,
                                "missedTackles": 6,
                                "offloads": 2,
                                "passes": 3,
                                "passesPerRun": 0.16,
                                "oneOnOneTackles": 1,
                                "penalties": 2,
                                "points": 4,
                                "supports": 8,
                                "tackleBreaks": 4,
                                "tackles": 10,
                                "tries": 1,
                                "tryCause": 1,
                                "hitupRunMeters": 10,
                                "evasionRuns": 15,
                                "evasionRunMetres": 128,
                                "dummyHalfRunMetres": 18,
                                "ptbAll": 13,
                                "receipts": 19,
                                "postContactMetres": 43,
                                "ptbTwoToThree": 6,
                                "ptbThreeToFour": 4,
                                "ptbFourToFive": 3,
                                "doubles": 3,
                                "effectiveTacklePercentage": 55.6,
                                "ptbPenalties": 1,
                                "generalPlayPenalties": 1
                            },
                            "playerTookTheField": true,
                            "shirtNum": 4,
                            "playerFirstInitial": "P",
                            "playerPositionAbbrev": "CT"
                        },
                        {
                            "playerFirstName": "Dallin",
                            "playerId": 500532,
                            "playerLastName": "Watene Zelezniak",
                            "playerName": "Dallin Watene Zelezniak",
                            "playerPosition": "Winger 2",
                            "playerPositionId": 500005,
                            "playerStats": {
                                "allRunMetres": 155,
                                "allRuns": 14,
                                "dummyHalfRuns": 1,
                                "errors": 3,
                                "fantasyPointsTotal": 25,
                                "hitUps": 2,
                                "kickReturnMetres": 21,
                                "kickReturns": 2,
                                "linebreaks": 1,
                                "mins": 80,
                                "missedTackles": 1,
                                "passes": 4,
                                "passesPerRun": 0.29,
                                "supports": 3,
                                "tackleBreaks": 3,
                                "tackles": 5,
                                "hitupRunMeters": 14,
                                "evasionRuns": 9,
                                "evasionRunMetres": 111,
                                "dummyHalfRunMetres": 9,
                                "ptbAll": 12,
                                "receipts": 20,
                                "postContactMetres": 32,
                                "ptbOneToTwo": 1,
                                "ptbTwoToThree": 6,
                                "ptbThreeToFour": 2,
                                "ptbFourToFive": 1,
                                "ptbFivePlus": 2,
                                "doubles": 1,
                                "effectiveTacklePercentage": 83.3
                            },
                            "playerTookTheField": true,
                            "shirtNum": 5,
                            "playerFirstInitial": "D",
                            "playerPositionAbbrev": "WG"
                        },
                        {
                            "playerFirstName": "Te Maire",
                            "playerId": 501293,
                            "playerLastName": "Martin",
                            "playerName": "Te Maire Martin",
                            "playerPosition": "Five-Eighth",
                            "playerPositionId": 500006,
                            "playerStats": {
                                "allRunMetres": 25,
                                "allRuns": 4,
                                "decoys": 1,
                                "errors": 2,
                                "fantasyPointsTotal": 26,
                                "ineffectiveTackles": 4,
                                "mins": 80,
                                "missedTackles": 1,
                                "passes": 15,
                                "passesPerRun": 3.75,
                                "oneOnOneTackles": 2,
                                "supports": 12,
                                "tackleBreaks": 2,
                                "tackles": 24,
                                "evasionRuns": 4,
                                "evasionRunMetres": 25,
                                "ptbAll": 3,
                                "receipts": 20,
                                "postContactMetres": 7,
                                "dummyPasses": 3,
                                "ptbThreeToFour": 1,
                                "ptbFourToFive": 1,
                                "ptbFivePlus": 1,
                                "doubles": 4,
                                "effectiveTacklePercentage": 82.8
                            },
                            "playerTookTheField": true,
                            "shirtNum": 6,
                            "playerFirstInitial": "T",
                            "playerPositionAbbrev": "FE"
                        },
                        {
                            "playerFirstName": "Jamie",
                            "playerId": 501259,
                            "playerLastName": "Soward",
                            "playerName": "Jamie Soward",
                            "playerPosition": "Halfback",
                            "playerPositionId": 500007,
                            "playerStats": {
                                "allRunMetres": 39,
                                "allRuns": 7,
                                "bombKicks": 5,
                                "bombKickMetres": 118,
                                "conversions": 1,
                                "conversionsAttempts": 2,
                                "conversionsMissed": 1,
                                "fantasyPointsTotal": 47,
                                "goalConversionRate": 66.67,
                                "allGoals": 2,
                                "allGoalsMissed": 1,
                                "allGoalsAttempted": 3,
                                "ineffectiveTackles": 4,
                                "kickMetres": 405,
                                "kicks": 16,
                                "kicksDefused": 1,
                                "linebreakAssists": 2,
                                "mins": 80,
                                "missedTackles": 6,
                                "offloads": 3,
                                "passes": 28,
                                "passesPerRun": 4,
                                "penalties": 2,
                                "penaltyGoals": 1,
                                "penaltyGoalsAttempts": 1,
                                "points": 4,
                                "supports": 7,
                                "tackleBreaks": 1,
                                "tackles": 12,
                                "tryAssists": 1,
                                "tryCause": 2,
                                "trySaves": 1,
                                "evasionRuns": 7,
                                "evasionRunMetres": 39,
                                "ptbAll": 2,
                                "receipts": 49,
                                "forcedDropOutKicker": 1,
                                "grubberKick": 2,
                                "crossFieldKick": 3,
                                "postContactMetres": 12,
                                "dummyPasses": 3,
                                "kickPressures": 2,
                                "lineEngagedRuns": 2,
                                "ptbThreeToFour": 2,
                                "doubles": 1,
                                "longKicksSpace": 1,
                                "effectiveTacklePercentage": 54.5,
                                "ptbPenalties": 2
                            },
                            "playerTookTheField": true,
                            "shirtNum": 7,
                            "playerFirstInitial": "J",
                            "playerPositionAbbrev": "HB"
                        },
                        {
                            "playerFirstName": "Sam",
                            "playerId": 500354,
                            "playerLastName": "McKendry",
                            "playerName": "Sam McKendry",
                            "playerPosition": "Prop 1",
                            "playerPositionId": 500008,
                            "playerStats": {
                                "allRunMetres": 73,
                                "allRuns": 9,
                                "decoys": 3,
                                "fantasyPointsTotal": 27,
                                "hitUps": 9,
                                "ineffectiveTackles": 2,
                                "mins": 34,
                                "missedTackles": 1,
                                "offloads": 1,
                                "oneOnOneTackles": 1,
                                "supports": 5,
                                "tackles": 20,
                                "hitupRunMeters": 73,
                                "ptbAll": 8,
                                "receipts": 9,
                                "postContactMetres": 26,
                                "dummyPasses": 2,
                                "ptbOneToTwo": 3,
                                "ptbTwoToThree": 3,
                                "ptbThreeToFour": 2,
                                "doubles": 6,
                                "effectiveTacklePercentage": 87
                            },
                            "playerTookTheField": true,
                            "shirtNum": 8,
                            "playerFirstInitial": "S",
                            "playerPositionAbbrev": "PR"
                        },
                        {
                            "playerFirstName": "Peter",
                            "playerId": 500956,
                            "playerLastName": "Wallace",
                            "playerName": "Peter Wallace",
                            "playerPosition": "Hooker",
                            "playerPositionId": 500009,
                            "playerStats": {
                                "allRunMetres": 17,
                                "allRuns": 4,
                                "dummyHalfRuns": 4,
                                "errors": 1,
                                "fantasyPointsTotal": 33,
                                "kickMetres": 7,
                                "kicks": 1,
                                "mins": 80,
                                "missedTackles": 1,
                                "passes": 119,
                                "passesPerRun": 29.75,
                                "oneOnOneTackles": 4,
                                "penalties": 1,
                                "supports": 6,
                                "tackles": 38,
                                "dummyHalfRunMetres": 17,
                                "ptbAll": 1,
                                "receipts": 123,
                                "crossFieldKick": 1,
                                "postContactMetres": 2,
                                "dummyPasses": 1,
                                "kickPressures": 3,
                                "lineEngagedRuns": 1,
                                "ptbThreeToFour": 1,
                                "doubles": 4,
                                "effectiveTacklePercentage": 97.4,
                                "ptbPenalties": 1
                            },
                            "playerTookTheField": true,
                            "shirtNum": 9,
                            "playerFirstInitial": "P",
                            "playerPositionAbbrev": "HK"
                        },
                        {
                            "playerFirstName": "Reagan",
                            "playerId": 500498,
                            "playerLastName": "Campbell-Gillard",
                            "playerName": "Reagan Campbell-Gillard",
                            "playerPosition": "Prop 2",
                            "playerPositionId": 500010,
                            "playerStats": {
                                "allRunMetres": 118,
                                "allRuns": 12,
                                "decoys": 2,
                                "fantasyPointsTotal": 29,
                                "hitUps": 10,
                                "ineffectiveTackles": 2,
                                "kickReturnMetres": 36,
                                "kickReturns": 2,
                                "mins": 49,
                                "missedTackles": 4,
                                "offloads": 1,
                                "supports": 8,
                                "tackleBreaks": 3,
                                "tackles": 15,
                                "hitupRunMeters": 82,
                                "ptbAll": 11,
                                "receipts": 12,
                                "postContactMetres": 40,
                                "kickPressures": 1,
                                "ptbTwoToThree": 2,
                                "ptbThreeToFour": 6,
                                "ptbFourToFive": 3,
                                "effectiveTacklePercentage": 71.4
                            },
                            "playerTookTheField": true,
                            "shirtNum": 10,
                            "playerFirstInitial": "R",
                            "playerPositionAbbrev": "PR"
                        },
                        {
                            "playerFirstName": "Bryce",
                            "playerId": 500499,
                            "playerLastName": "Cartwright",
                            "playerName": "Bryce Cartwright",
                            "playerPosition": "2nd Row 1",
                            "playerPositionId": 500011,
                            "playerStats": {
                                "allRunMetres": 65,
                                "allRuns": 7,
                                "decoys": 1,
                                "errors": 2,
                                "fantasyPointsTotal": 14,
                                "hitUps": 7,
                                "interceptedPass": 1,
                                "mins": 40,
                                "missedTackles": 3,
                                "passes": 1,
                                "passesPerRun": 0.14,
                                "oneOnOneTackles": 3,
                                "penalties": 1,
                                "supports": 2,
                                "tackleBreaks": 1,
                                "tackles": 17,
                                "hitupRunMeters": 65,
                                "ptbAll": 5,
                                "receipts": 9,
                                "postContactMetres": 20,
                                "dummyPasses": 1,
                                "ptbTwoToThree": 1,
                                "ptbThreeToFour": 1,
                                "ptbFivePlus": 3,
                                "doubles": 3,
                                "effectiveTacklePercentage": 85,
                                "ptbPenalties": 1
                            },
                            "playerTookTheField": true,
                            "shirtNum": 11,
                            "playerFirstInitial": "B",
                            "playerPositionAbbrev": "2R"
                        },
                        {
                            "playerFirstName": "Isaah",
                            "playerId": 500534,
                            "playerLastName": "Yeo",
                            "playerName": "Isaah Yeo",
                            "playerPosition": "2nd Row 2",
                            "playerPositionId": 500012,
                            "playerStats": {
                                "allRunMetres": 87,
                                "allRuns": 9,
                                "decoys": 5,
                                "errors": 1,
                                "fantasyPointsTotal": 43,
                                "hitUps": 8,
                                "ineffectiveTackles": 4,
                                "mins": 80,
                                "missedTackles": 1,
                                "offloads": 1,
                                "passes": 4,
                                "passesPerRun": 0.44,
                                "oneOnOneTackles": 1,
                                "supports": 8,
                                "tackles": 37,
                                "hitupRunMeters": 78,
                                "evasionRuns": 1,
                                "evasionRunMetres": 9,
                                "ptbAll": 7,
                                "receipts": 12,
                                "postContactMetres": 30,
                                "dummyPasses": 1,
                                "kickPressures": 1,
                                "lineEngagedRuns": 1,
                                "ptbThreeToFour": 4,
                                "ptbFourToFive": 2,
                                "ptbFivePlus": 1,
                                "doubles": 9,
                                "effectiveTacklePercentage": 88.1
                            },
                            "playerTookTheField": true,
                            "shirtNum": 12,
                            "playerFirstInitial": "I",
                            "playerPositionAbbrev": "2R"
                        },
                        {
                            "playerFirstName": "Trent",
                            "playerId": 500632,
                            "playerLastName": "Merrin",
                            "playerName": "Trent Merrin",
                            "playerPosition": "Lock",
                            "playerPositionId": 500013,
                            "playerStats": {
                                "allRunMetres": 142,
                                "allRuns": 17,
                                "decoys": 1,
                                "fantasyPointsTotal": 52,
                                "hitUps": 17,
                                "linebreaks": 1,
                                "mins": 59,
                                "missedTackles": 4,
                                "offloads": 2,
                                "passes": 2,
                                "passesPerRun": 0.12,
                                "oneOnOneTackles": 1,
                                "penalties": 1,
                                "supports": 2,
                                "tackleBreaks": 3,
                                "tackles": 31,
                                "hitupRunMeters": 142,
                                "ptbAll": 14,
                                "receipts": 18,
                                "postContactMetres": 36,
                                "dummyPasses": 1,
                                "kickPressures": 2,
                                "ptbOneToTwo": 1,
                                "ptbTwoToThree": 6,
                                "ptbThreeToFour": 5,
                                "ptbFourToFive": 2,
                                "doubles": 4,
                                "effectiveTacklePercentage": 88.6,
                                "ptbPenalties": 1
                            },
                            "playerTookTheField": true,
                            "shirtNum": 13,
                            "playerFirstInitial": "T",
                            "playerPositionAbbrev": "LK"
                        },
                        {
                            "playerFirstName": "Tyrone",
                            "playerId": 501184,
                            "playerLastName": "Peachey",
                            "playerName": "Tyrone Peachey",
                            "playerPosition": "Interchange",
                            "playerPositionId": 500014,
                            "playerStats": {
                                "allRunMetres": 102,
                                "allRuns": 12,
                                "decoys": 2,
                                "dummyHalfRuns": 2,
                                "fantasyPointsTotal": 25,
                                "hitUps": 8,
                                "ineffectiveTackles": 2,
                                "mins": 60,
                                "missedTackles": 6,
                                "passes": 9,
                                "passesPerRun": 0.75,
                                "oneOnOneTackles": 2,
                                "tackleBreaks": 2,
                                "tackles": 21,
                                "tryCause": 1,
                                "hitupRunMeters": 75,
                                "evasionRuns": 2,
                                "evasionRunMetres": 8,
                                "dummyHalfRunMetres": 19,
                                "ptbAll": 9,
                                "receipts": 17,
                                "postContactMetres": 28,
                                "dummyPasses": 2,
                                "kickPressures": 2,
                                "lineEngagedRuns": 2,
                                "ptbTwoToThree": 5,
                                "ptbThreeToFour": 3,
                                "ptbFourToFive": 1,
                                "doubles": 3,
                                "effectiveTacklePercentage": 72.4
                            },
                            "playerTookTheField": true,
                            "shirtNum": 14,
                            "playerFirstInitial": "T",
                            "playerPositionAbbrev": "INT"
                        },
                        {
                            "playerFirstName": "Leilani",
                            "playerId": 501254,
                            "playerLastName": "Latu",
                            "playerName": "Leilani Latu",
                            "playerPosition": "Interchange",
                            "playerPositionId": 500014,
                            "playerStats": {
                                "allRunMetres": 66,
                                "allRuns": 9,
                                "decoys": 1,
                                "fantasyPointsTotal": 30,
                                "hitUps": 7,
                                "ineffectiveTackles": 1,
                                "linebreakAssists": 1,
                                "mins": 35,
                                "missedTackles": 2,
                                "passes": 7,
                                "passesPerRun": 0.78,
                                "oneOnOneTackles": 1,
                                "tackleBreaks": 1,
                                "tackles": 23,
                                "hitupRunMeters": 53,
                                "evasionRuns": 2,
                                "evasionRunMetres": 13,
                                "ptbAll": 8,
                                "receipts": 15,
                                "postContactMetres": 16,
                                "lineEngagedRuns": 2,
                                "ptbTwoToThree": 1,
                                "ptbThreeToFour": 4,
                                "ptbFourToFive": 2,
                                "ptbFivePlus": 1,
                                "doubles": 10,
                                "effectiveTacklePercentage": 88.5
                            },
                            "playerTookTheField": true,
                            "shirtNum": 15,
                            "playerFirstInitial": "L",
                            "playerPositionAbbrev": "INT"
                        },
                        {
                            "playerFirstName": "Suaia",
                            "playerId": 500713,
                            "playerLastName": "Matagi",
                            "playerName": "Suaia Matagi",
                            "playerPosition": "Interchange",
                            "playerPositionId": 500014,
                            "playerStats": {
                                "allRunMetres": 84,
                                "allRuns": 6,
                                "fantasyPointsTotal": 24,
                                "hitUps": 4,
                                "kickReturnMetres": 23,
                                "kickReturns": 2,
                                "linebreaks": 1,
                                "mins": 26,
                                "missedTackles": 4,
                                "passes": 3,
                                "passesPerRun": 0.5,
                                "oneOnOneTackles": 1,
                                "supports": 1,
                                "tackleBreaks": 1,
                                "tackles": 17,
                                "hitupRunMeters": 61,
                                "ptbAll": 5,
                                "receipts": 8,
                                "postContactMetres": 23,
                                "dummyPasses": 1,
                                "kickPressures": 2,
                                "ptbTwoToThree": 1,
                                "ptbThreeToFour": 3,
                                "ptbFourToFive": 1,
                                "doubles": 3,
                                "effectiveTacklePercentage": 81
                            },
                            "playerTookTheField": true,
                            "shirtNum": 16,
                            "playerFirstInitial": "S",
                            "playerPositionAbbrev": "INT"
                        },
                        {
                            "playerFirstName": "James",
                            "playerId": 502580,
                            "playerLastName": "Fisher-Harris",
                            "playerName": "James Fisher-Harris",
                            "playerPosition": "Interchange",
                            "playerPositionId": 500014,
                            "playerStats": {
                                "allRunMetres": 45,
                                "allRuns": 6,
                                "fantasyPointsTotal": 13,
                                "hitUps": 6,
                                "ineffectiveTackles": 1,
                                "kicksDefused": 1,
                                "mins": 26,
                                "missedTackles": 5,
                                "offloads": 1,
                                "passes": 1,
                                "passesPerRun": 0.17,
                                "oneOnOneTackles": 1,
                                "supports": 5,
                                "tackles": 11,
                                "tryAssists": 1,
                                "tryCause": 1,
                                "hitupRunMeters": 45,
                                "ptbAll": 6,
                                "receipts": 8,
                                "postContactMetres": 23,
                                "ptbTwoToThree": 4,
                                "ptbThreeToFour": 1,
                                "ptbFivePlus": 1,
                                "doubles": 1,
                                "effectiveTacklePercentage": 64.7
                            },
                            "playerTookTheField": true,
                            "shirtNum": 20,
                            "playerFirstInitial": "J",
                            "playerPositionAbbrev": "INT"
                        }
                    ]
                },
                "teamName": "Penrith Panthers",
                "teamNickName": "Panthers",
                "teamStats": {
                    "allRunMetres": 1653,
                    "allRuns": 181,
                    "bombKicks": 5,
                    "bombKickMetres": 118,
                    "bombKicksDefused": 2,
                    "completeSets": 30,
                    "completionPercentage": 77,
                    "conversions": 1,
                    "conversionsAttempts": 2,
                    "conversionsMissed": 1,
                    "decoys": 18,
                    "dummyHalfRuns": 11,
                    "errors": 11,
                    "goalConversionRate": 66.67,
                    "allGoals": 2,
                    "allGoalsAttempted": 3,
                    "allGoalsMissed": 1,
                    "hitUps": 86,
                    "incompleteSets": 9,
                    "ineffectiveTackles": 27,
                    "interceptedPass": 2,
                    "kickMetres": 438,
                    "kickReturnMetres": 257,
                    "kickReturns": 20,
                    "kicks": 19,
                    "kicksDefused": 5,
                    "linebreakAssists": 3,
                    "linebreaks": 5,
                    "missedTackles": 51,
                    "offloads": 14,
                    "oneOnOneTackles": 24,
                    "passes": 213,
                    "passesPerRun": 1.18,
                    "penalties": 10,
                    "penaltyGoals": 1,
                    "penaltyGoalsAttempts": 1,
                    "points": 12,
                    "pointsConceded": 14,
                    "possession": 50,
                    "scrumWins": 8,
                    "supports": 89,
                    "tackleBreaks": 29,
                    "tackles": 309,
                    "sets": 39,
                    "tries": 2,
                    "triesConceded": 2,
                    "tryAssists": 2,
                    "tryCause": 5,
                    "trySaves": 2,
                    "hitupRunMeters": 759,
                    "evasionRuns": 64,
                    "evasionRunMetres": 561,
                    "dummyHalfRunMetres": 76,
                    "ptbTotal": 141,
                    "twoManTackles": 56,
                    "threeManTackles": 64,
                    "fourManPlusTackles": 6,
                    "tryScoringPercentage": 6.67,
                    "shiftsLeft": 10,
                    "shiftsRight": 10,
                    "receipts": 403,
                    "forcedDropOutKicker": 1,
                    "grubberKick": 4,
                    "crossFieldKick": 4,
                    "postContactMetres": 471,
                    "dummyPasses": 17,
                    "kickPressures": 13,
                    "lineEngagedRuns": 9,
                    "ptbOneToTwo": 7,
                    "ptbTwoToThree": 50,
                    "ptbThreeToFour": 48,
                    "ptbFourToFive": 21,
                    "ptbFivePlus": 15,
                    "interchangeUsed": 7,
                    "interchangeLeft": 1,
                    "doubles": 54,
                    "longKicksSpace": 1,
                    "effectiveTacklePercentage": 79.8,
                    "ptbPenalties": 7,
                    "generalPlayPenalties": 2,
                    "offsidePenalties": 1,
                    "averageSetDistance": 42.4,
                    "completeSets1stHalf": 14,
                    "completeSets2ndHalf": 16,
                    "completionPercentage1stHalf": 70,
                    "completionPercentage2ndHalf": 84.21,
                    "incompleteSets1stHalf": 6,
                    "incompleteSets2ndHalf": 3,
                    "incompletionPercentage1stHalf": 30,
                    "incompletionPercentage2ndHalf": 15.79
                },
                "teamHexColour": "00687d",
                "teamHexColour2": "00343E"
            }
        ]
    }
}