{
    "vod": [
        {
            "id": "IwZ2hsYjE6xEQ-u_0-MCrFWMBr-q0OE8",
            "contentId": 917951,
            "title": "Rd 15: Rabbitohs v Titans (Hls)",
            "description": "Highlights of the Round 15 clash between the Rabbitohs & Titans",
            "publishDate": "2017-06-16T21:58:00+10:00",
            "publisher": "NRL Chief",
            "thumbnailUrl": "http://bpvideos.telstra.insnw.net/web/images/20170616215439a_89x50.jpg",
            "largeThumbnailUrl": "http://bpvideos.telstra.insnw.net/web/images/20170616215439a_326x184.jpg",
            "programType": "Highlights",
            "programCategory": "Match",
            "priority": null,
            "lastUpdateDate": "2017-06-16T22:03:27+10:00",
            "isPremium": false,
            "club": [
                500005,
                500004
            ]
        },
        {
            "id": "g3cmhsYjE6RpYe5WkR9oEaYtDWeodoQd",
            "contentId": 917997,
            "title": "Rd 15 Press Conference: Titans",
            "description": "Titans coach Neil Henry answers the media's questions following their Round 15 clash",
            "publishDate": "2017-06-16T22:42:00+10:00",
            "publisher": "NRL Chief",
            "thumbnailUrl": "http://bpvideos.telstra.insnw.net/web/images/20170616224153a_89x50.jpg",
            "largeThumbnailUrl": "http://bpvideos.telstra.insnw.net/web/images/20170616224153a_326x184.jpg",
            "programType": "Press Conference",
            "programCategory": null,
            "priority": null,
            "lastUpdateDate": "2017-06-16T22:47:50+10:00",
            "isPremium": false,
            "club": [
                500005,
                500004
            ]
        },
        {
            "id": "kxcGhsYjE6eGJYKTfK0Nu-XozzdcLJ-S",
            "contentId": 917996,
            "title": "Rd 15 Press Conference: Rabbitohs",
            "description": "Rabbitohs coach Michael Maguire answers the media's questions following their Round 15 clash",
            "publishDate": "2017-06-16T22:35:00+10:00",
            "publisher": "NRL Chief",
            "thumbnailUrl": "http://bpvideos.telstra.insnw.net/web/images/20170616223549a_89x50.jpg",
            "largeThumbnailUrl": "http://bpvideos.telstra.insnw.net/web/images/20170616223549a_326x184.jpg",
            "programType": "Press Conference",
            "programCategory": null,
            "priority": null,
            "lastUpdateDate": "2017-06-16T22:40:35+10:00",
            "isPremium": false,
            "club": [
                500005,
                500004
            ]
        },
        {
            "id": "xrY2hsYjE6lXd45WeYAN0CfDh3RqoiTB",
            "contentId": 918899,
            "title": "Rd 15: TRY Angus Crichton (79th min)",
            "description": "Crichton powers through the Titans defense to score his 3rd try",
            "publishDate": "2017-06-16T21:46:00+10:00",
            "publisher": "NRL Chief",
            "thumbnailUrl": "http://bpvideos.telstra.insnw.net/web/images/20170616214605a_89x50.jpg",
            "largeThumbnailUrl": "http://bpvideos.telstra.insnw.net/web/images/20170616214605a_326x184.jpg",
            "programType": "Instant Replay",
            "programCategory": "Score",
            "priority": null,
            "lastUpdateDate": "2017-06-16T21:50:24+10:00",
            "isPremium": true,
            "club": [
                500005,
                500004
            ]
        },
        {
            "id": "V2N2hsYjE60vKcxZV4tFXBu0zAsAr3dF",
            "contentId": 918896,
            "title": "Rd 15: TRY Alex Johnston (66th min)",
            "description": "Johnstone leaps for his 2nd try",
            "publishDate": "2017-06-16T21:27:08+10:00",
            "publisher": "NRL Chief",
            "thumbnailUrl": "http://bpvideos.telstra.insnw.net/web/images/20170616212727a_89x50.jpg",
            "largeThumbnailUrl": "http://bpvideos.telstra.insnw.net/web/images/20170616212727a_326x184.jpg",
            "programType": "Instant Replay",
            "programCategory": "Score",
            "priority": null,
            "lastUpdateDate": "2017-06-16T21:31:20+10:00",
            "isPremium": true,
            "club": [
                500005,
                500004
            ]
        },
        {
            "id": "A1N2hsYjE6nLWUAjf3Gq5FpNd8jQ7GmD",
            "contentId": 918895,
            "title": "Rd 15: GOAL Adam Reynolds (63rd min)",
            "description": "Reynolds converts Goodwin's try",
            "publishDate": "2017-06-16T21:24:00+10:00",
            "publisher": "NRL Chief",
            "thumbnailUrl": "http://bpvideos.telstra.insnw.net/web/images/20170616212501a_89x50.jpg",
            "largeThumbnailUrl": "http://bpvideos.telstra.insnw.net/web/images/20170616212501a_326x184.jpg",
            "programType": "Instant Replay",
            "programCategory": "Score",
            "priority": null,
            "lastUpdateDate": "2017-06-16T21:29:19+10:00",
            "isPremium": true,
            "club": [
                500005,
                500004
            ]
        },
        {
            "id": "BpNmhsYjE6D-ZOG-mNNXn_vtAOylUScR",
            "contentId": 918894,
            "title": "Rd 15: TRY Bryson Goodwin (61st min)",
            "description": "A few offloads & a determined run sees Souths score again",
            "publishDate": "2017-06-16T21:22:00+10:00",
            "publisher": "NRL Chief",
            "thumbnailUrl": "http://bpvideos.telstra.insnw.net/web/images/20170616212301a_89x50.jpg",
            "largeThumbnailUrl": "http://bpvideos.telstra.insnw.net/web/images/20170616212301a_326x184.jpg",
            "programType": "Instant Replay",
            "programCategory": "Score",
            "priority": null,
            "lastUpdateDate": "2017-06-16T21:26:18+10:00",
            "isPremium": true,
            "club": [
                500005,
                500004
            ]
        },
        {
            "id": "9rMmhsYjE6NvA_WAPkTS-xzS6T2hZd4T",
            "contentId": 918889,
            "title": "Rd 15: GOAL Adam Reynolds (52nd min)",
            "description": "Reynolds take the lead, converting Crichton's try",
            "publishDate": "2017-06-16T21:11:00+10:00",
            "publisher": "NRL Chief",
            "thumbnailUrl": "http://bpvideos.telstra.insnw.net/web/images/20170616211124a_89x50.jpg",
            "largeThumbnailUrl": "http://bpvideos.telstra.insnw.net/web/images/20170616211124a_326x184.jpg",
            "programType": "Instant Replay",
            "programCategory": "Score",
            "priority": null,
            "lastUpdateDate": "2017-06-16T21:15:16+10:00",
            "isPremium": true,
            "club": [
                500005,
                500004
            ]
        },
        {
            "id": "l0MWhsYjE6mlla6C7KfN-9m2aOCOC7aE",
            "contentId": 918888,
            "title": "Rd 15: TRY Angus Crichton (51st min)",
            "description": "Crichton accelerates through the hole to tie scores at 20",
            "publishDate": "2017-06-16T21:10:00+10:00",
            "publisher": "NRL Chief",
            "thumbnailUrl": "http://bpvideos.telstra.insnw.net/web/images/20170616211008a_89x50.jpg",
            "largeThumbnailUrl": "http://bpvideos.telstra.insnw.net/web/images/20170616211008a_326x184.jpg",
            "programType": "Instant Replay",
            "programCategory": "Score",
            "priority": null,
            "lastUpdateDate": "2017-06-16T21:14:15+10:00",
            "isPremium": true,
            "club": [
                500005,
                500004
            ]
        },
        {
            "id": "ZpMGhsYjE6SNTJ5VD_PF7189onL3GzRq",
            "contentId": 918887,
            "title": "Rd 15: GOAL Adam Reynolds (46th min)",
            "description": "Reynolds converts Walker's try",
            "publishDate": "2017-06-16T21:05:00+10:00",
            "publisher": "NRL Chief",
            "thumbnailUrl": "http://bpvideos.telstra.insnw.net/web/images/20170616210512a_89x50.jpg",
            "largeThumbnailUrl": "http://bpvideos.telstra.insnw.net/web/images/20170616210512a_326x184.jpg",
            "programType": "Instant Replay",
            "programCategory": "Score",
            "priority": null,
            "lastUpdateDate": "2017-06-16T21:09:14+10:00",
            "isPremium": true,
            "club": [
                500005,
                500004
            ]
        },
        {
            "id": "80MGhsYjE6wu3aD-YCeM3pEK7zgvZaxF",
            "contentId": 918886,
            "title": "Rd 15: TRY Cody Walker (45th min)",
            "description": "Walker finishes off a nice try",
            "publishDate": "2017-06-16T21:03:00+10:00",
            "publisher": "NRL Chief",
            "thumbnailUrl": "http://bpvideos.telstra.insnw.net/web/images/20170616210406a_89x50.jpg",
            "largeThumbnailUrl": "http://bpvideos.telstra.insnw.net/web/images/20170616210406a_326x184.jpg",
            "programType": "Instant Replay",
            "programCategory": "Score",
            "priority": null,
            "lastUpdateDate": "2017-06-16T21:08:14+10:00",
            "isPremium": true,
            "club": [
                500005,
                500004
            ]
        },
        {
            "id": "VjcmdsYjE67_7ABE2QI3TaEEELBKY943",
            "contentId": 918882,
            "title": "Rd 15: GOAL Ash Taylor (40th min)",
            "description": "Taylor converts Greenwood's try",
            "publishDate": "2017-06-16T20:44:00+10:00",
            "publisher": "NRL Chief",
            "thumbnailUrl": "http://bpvideos.telstra.insnw.net/web/images/20170616204350a_89x50.jpg",
            "largeThumbnailUrl": "http://bpvideos.telstra.insnw.net/web/images/20170616204350a_326x184.jpg",
            "programType": "Instant Replay",
            "programCategory": "Score",
            "priority": null,
            "lastUpdateDate": "2017-06-16T20:48:10+10:00",
            "isPremium": true,
            "club": [
                500005,
                500004
            ]
        },
        {
            "id": "A0cmdsYjE6FU8uSps943g4XfPZITyb-H",
            "contentId": 918881,
            "title": "Rd 15: TRY Joe Greenwood (39th min)",
            "description": "Greenwood reaches out for a try",
            "publishDate": "2017-06-16T20:42:00+10:00",
            "publisher": "NRL Chief",
            "thumbnailUrl": "http://bpvideos.telstra.insnw.net/web/images/20170616204214a_89x50.jpg",
            "largeThumbnailUrl": "http://bpvideos.telstra.insnw.net/web/images/20170616204214a_326x184.jpg",
            "programType": "Instant Replay",
            "programCategory": "Score",
            "priority": null,
            "lastUpdateDate": "2017-06-16T20:47:09+10:00",
            "isPremium": true,
            "club": [
                500005,
                500004
            ]
        },
        {
            "id": "twb2dsYjE61uXjVMpdIYP06VdzAOQ4Tt",
            "contentId": 918879,
            "title": "Rd 15: TRY Alex Johnstone (35th min)",
            "description": "Souths go out the back through the hands to the winger",
            "publishDate": "2017-06-16T20:36:00+10:00",
            "publisher": "NRL Chief",
            "thumbnailUrl": "http://bpvideos.telstra.insnw.net/web/images/20170616203707a_89x50.jpg",
            "largeThumbnailUrl": "http://bpvideos.telstra.insnw.net/web/images/20170616203707a_326x184.jpg",
            "programType": "Instant Replay",
            "programCategory": "Score",
            "priority": null,
            "lastUpdateDate": "2017-06-16T20:41:08+10:00",
            "isPremium": true,
            "club": [
                500005,
                500004
            ]
        },
        {
            "id": "VhbmdsYjE6cJOwQO1vbX8dCyQUTHznks",
            "contentId": 918878,
            "title": "Rd 15: GOAL Adam Reynolds (30th min)",
            "description": "Reynolds converts Crichton's try",
            "publishDate": "2017-06-16T20:32:00+10:00",
            "publisher": "NRL Chief",
            "thumbnailUrl": "http://bpvideos.telstra.insnw.net/web/images/20170616203229a_89x50.jpg",
            "largeThumbnailUrl": "http://bpvideos.telstra.insnw.net/web/images/20170616203229a_326x184.jpg",
            "programType": "Instant Replay",
            "programCategory": "Score",
            "priority": null,
            "lastUpdateDate": "2017-06-16T20:36:07+10:00",
            "isPremium": true,
            "club": [
                500005,
                500004
            ]
        },
        {
            "id": "90bWdsYjE6uCRsi6i1JE8T9Jyfqiigc1",
            "contentId": 918877,
            "title": "Rd 15: TRY Angus Crichton (29th min)",
            "description": "Crichtong charges through the Titans line",
            "publishDate": "2017-06-16T20:30:00+10:00",
            "publisher": "NRL Chief",
            "thumbnailUrl": "http://bpvideos.telstra.insnw.net/web/images/20170616203034a_89x50.jpg",
            "largeThumbnailUrl": "http://bpvideos.telstra.insnw.net/web/images/20170616203034a_326x184.jpg",
            "programType": "Instant Replay",
            "programCategory": "Score",
            "priority": null,
            "lastUpdateDate": "2017-06-16T20:35:06+10:00",
            "isPremium": true,
            "club": [
                500005,
                500004
            ]
        },
        {
            "id": "91amdsYjE693yzJQe7K8AB33vPHbdK07",
            "contentId": 918875,
            "title": "Rd 15: GOAL Ash Taylor (19th min)",
            "description": "Taylor converts Proctor's try",
            "publishDate": "2017-06-16T20:20:00+10:00",
            "publisher": "NRL Chief",
            "thumbnailUrl": "http://bpvideos.telstra.insnw.net/web/images/20170616202036a_89x50.jpg",
            "largeThumbnailUrl": "http://bpvideos.telstra.insnw.net/web/images/20170616202036a_326x184.jpg",
            "programType": "Instant Replay",
            "programCategory": "Score",
            "priority": null,
            "lastUpdateDate": "2017-06-16T20:25:04+10:00",
            "isPremium": true,
            "club": [
                500005,
                500004
            ]
        },
        {
            "id": "FhamdsYjE6zg0tZ9XGj0-U20RjvKGc53",
            "contentId": 918874,
            "title": "Rd 15: TRY Kevin Proctor (17th min)",
            "description": "Proctor picks up a ricochet for a 4 pointer",
            "publishDate": "2017-06-16T20:19:00+10:00",
            "publisher": "NRL Chief",
            "thumbnailUrl": "http://bpvideos.telstra.insnw.net/web/images/20170616201910a_89x50.jpg",
            "largeThumbnailUrl": "http://bpvideos.telstra.insnw.net/web/images/20170616201910a_326x184.jpg",
            "programType": "Instant Replay",
            "programCategory": "Score",
            "priority": null,
            "lastUpdateDate": "2017-06-16T20:23:04+10:00",
            "isPremium": true,
            "club": [
                500005,
                500004
            ]
        },
        {
            "id": "VxZmdsYjE6CcZae7sX2xkukhxO4iCCki",
            "contentId": 918872,
            "title": "Rd 15: PENALTY GOAL Ash Taylor (9th min)",
            "description": "Taylor extends the lead to 8",
            "publishDate": "2017-06-16T20:09:00+10:00",
            "publisher": "NRL Chief",
            "thumbnailUrl": "http://bpvideos.telstra.insnw.net/web/images/20170616200905a_89x50.jpg",
            "largeThumbnailUrl": "http://bpvideos.telstra.insnw.net/web/images/20170616200905a_326x184.jpg",
            "programType": "Instant Replay",
            "programCategory": "Score",
            "priority": null,
            "lastUpdateDate": "2017-06-16T20:13:01+10:00",
            "isPremium": true,
            "club": [
                500005,
                500004
            ]
        },
        {
            "id": "RsZWdsYjE6sKYI2SDEu0prX7baapQwPo",
            "contentId": 918870,
            "title": "Rd 15: GOAL Ash Taylor (4th min)",
            "description": "Taylor converts Politoni's try",
            "publishDate": "2017-06-16T20:05:27+10:00",
            "publisher": "NRL Chief",
            "thumbnailUrl": "http://bpvideos.telstra.insnw.net/web/images/20170616200526a_89x50.jpg",
            "largeThumbnailUrl": "http://bpvideos.telstra.insnw.net/web/images/20170616200526a_326x184.jpg",
            "programType": "Instant Replay",
            "programCategory": "Score",
            "priority": null,
            "lastUpdateDate": "2017-06-16T20:09:00+10:00",
            "isPremium": true,
            "club": [
                500005,
                500004
            ]
        },
        {
            "id": "ViZWdsYjE6J1ijgu_FZDuH93ymrSoB8O",
            "contentId": 918869,
            "title": "Rd 15: TRY Pat Politoni (3rd min)",
            "description": "Politoni gets a try in his Titans debut",
            "publishDate": "2017-06-16T20:03:00+10:00",
            "publisher": "NRL Chief",
            "thumbnailUrl": "http://bpvideos.telstra.insnw.net/web/images/20170616200333a_89x50.jpg",
            "largeThumbnailUrl": "http://bpvideos.telstra.insnw.net/web/images/20170616200333a_326x184.jpg",
            "programType": "Instant Replay",
            "programCategory": "Score",
            "priority": null,
            "lastUpdateDate": "2017-06-16T20:08:00+10:00",
            "isPremium": true,
            "club": [
                500005,
                500004
            ]
        }
    ],
    "scores": [
        {
            "gameState": "First Half",
            "gameStateId": 3,
            "gameTime": "0:28:21",
            "gameSeconds": 1701,
            "GameMinutes": "28:21",
            "playerId": 503240,
            "playerName": "Angus Crichton",
            "scoreMethod": "Try",
            "statEvent": "Try",
            "statId": 38,
            "statValue": 4,
            "vidRef": 46563,
            "homeScore": 4,
            "awayScore": 14,
            "commentary": "Try by Angus Crichton",
            "tackleNum": 4,
            "teamId": 500005,
            "teamName": "South Sydney Rabbitohs",
            "homeTeamAbbrv": "SOU",
            "awayTeamAbbrv": "GLD"
        },
        {
            "gameState": "First Half",
            "gameStateId": 3,
            "gameTime": "0:29:39",
            "gameSeconds": 1779,
            "GameMinutes": "29:39",
            "playerId": 500086,
            "playerName": "Adam Reynolds",
            "scoreMethod": "Conversion",
            "statEvent": "Conversion-Made",
            "statId": 1,
            "statValue": 2,
            "vidRef": 48506,
            "homeScore": 6,
            "awayScore": 14,
            "commentary": "Conversion-Made by Adam Reynolds",
            "tackleNum": -1,
            "teamId": 500005,
            "teamName": "South Sydney Rabbitohs",
            "homeTeamAbbrv": "SOU",
            "awayTeamAbbrv": "GLD"
        },
        {
            "gameState": "First Half",
            "gameStateId": 3,
            "gameTime": "0:34:14",
            "gameSeconds": 2054,
            "GameMinutes": "34:14",
            "playerId": 500108,
            "playerName": "Alex Johnston",
            "scoreMethod": "Try",
            "statEvent": "Try",
            "statId": 38,
            "statValue": 4,
            "vidRef": 55380,
            "homeScore": 10,
            "awayScore": 14,
            "commentary": "Try by Alex Johnston",
            "tackleNum": 2,
            "teamId": 500005,
            "teamName": "South Sydney Rabbitohs",
            "homeTeamAbbrv": "SOU",
            "awayTeamAbbrv": "GLD"
        },
        {
            "gameState": "Second Half",
            "gameStateId": 5,
            "gameTime": "0:44:10",
            "gameSeconds": 2650,
            "GameMinutes": "44:10",
            "playerId": 500611,
            "playerName": "Cody Walker",
            "scoreMethod": "Try",
            "statEvent": "Try",
            "statId": 38,
            "statValue": 4,
            "vidRef": 73597,
            "homeScore": 14,
            "awayScore": 20,
            "commentary": "Try by Cody Walker",
            "tackleNum": 4,
            "teamId": 500005,
            "teamName": "South Sydney Rabbitohs",
            "homeTeamAbbrv": "SOU",
            "awayTeamAbbrv": "GLD"
        },
        {
            "gameState": "Second Half",
            "gameStateId": 5,
            "gameTime": "0:45:23",
            "gameSeconds": 2723,
            "GameMinutes": "45:23",
            "playerId": 500086,
            "playerName": "Adam Reynolds",
            "scoreMethod": "Conversion",
            "statEvent": "Conversion-Made",
            "statId": 1,
            "statValue": 2,
            "vidRef": 75425,
            "homeScore": 16,
            "awayScore": 20,
            "commentary": "Conversion-Made by Adam Reynolds",
            "tackleNum": -1,
            "teamId": 500005,
            "teamName": "South Sydney Rabbitohs",
            "homeTeamAbbrv": "SOU",
            "awayTeamAbbrv": "GLD"
        },
        {
            "gameState": "Second Half",
            "gameStateId": 5,
            "gameTime": "0:50:15",
            "gameSeconds": 3015,
            "GameMinutes": "50:15",
            "playerId": 503240,
            "playerName": "Angus Crichton",
            "scoreMethod": "Try",
            "statEvent": "Try",
            "statId": 38,
            "statValue": 4,
            "vidRef": 82707,
            "homeScore": 20,
            "awayScore": 20,
            "commentary": "Try by Angus Crichton",
            "tackleNum": 2,
            "teamId": 500005,
            "teamName": "South Sydney Rabbitohs",
            "homeTeamAbbrv": "SOU",
            "awayTeamAbbrv": "GLD"
        },
        {
            "gameState": "Second Half",
            "gameStateId": 5,
            "gameTime": "0:51:40",
            "gameSeconds": 3100,
            "GameMinutes": "51:40",
            "playerId": 500086,
            "playerName": "Adam Reynolds",
            "scoreMethod": "Conversion",
            "statEvent": "Conversion-Made",
            "statId": 1,
            "statValue": 2,
            "vidRef": 84834,
            "homeScore": 22,
            "awayScore": 20,
            "commentary": "Conversion-Made by Adam Reynolds",
            "tackleNum": -1,
            "teamId": 500005,
            "teamName": "South Sydney Rabbitohs",
            "homeTeamAbbrv": "SOU",
            "awayTeamAbbrv": "GLD"
        },
        {
            "gameState": "Second Half",
            "gameStateId": 5,
            "gameTime": "1:00:44",
            "gameSeconds": 3644,
            "GameMinutes": "60:44",
            "playerId": 500082,
            "playerName": "Bryson Goodwin",
            "scoreMethod": "Try",
            "statEvent": "Try",
            "statId": 38,
            "statValue": 4,
            "vidRef": 102369,
            "homeScore": 26,
            "awayScore": 20,
            "commentary": "Try by Bryson Goodwin",
            "tackleNum": 3,
            "teamId": 500005,
            "teamName": "South Sydney Rabbitohs",
            "homeTeamAbbrv": "SOU",
            "awayTeamAbbrv": "GLD"
        },
        {
            "gameState": "Second Half",
            "gameStateId": 5,
            "gameTime": "1:02:13",
            "gameSeconds": 3733,
            "GameMinutes": "62:13",
            "playerId": 500086,
            "playerName": "Adam Reynolds",
            "scoreMethod": "Conversion",
            "statEvent": "Conversion-Made",
            "statId": 1,
            "statValue": 2,
            "vidRef": 104651,
            "homeScore": 28,
            "awayScore": 20,
            "commentary": "Conversion-Made by Adam Reynolds",
            "tackleNum": -1,
            "teamId": 500005,
            "teamName": "South Sydney Rabbitohs",
            "homeTeamAbbrv": "SOU",
            "awayTeamAbbrv": "GLD"
        },
        {
            "gameState": "Second Half",
            "gameStateId": 5,
            "gameTime": "1:05:17",
            "gameSeconds": 3917,
            "GameMinutes": "65:17",
            "playerId": 500108,
            "playerName": "Alex Johnston",
            "scoreMethod": "Try",
            "statEvent": "Try",
            "statId": 38,
            "statValue": 4,
            "vidRef": 109310,
            "homeScore": 32,
            "awayScore": 20,
            "commentary": "Try by Alex Johnston",
            "tackleNum": 5,
            "teamId": 500005,
            "teamName": "South Sydney Rabbitohs",
            "homeTeamAbbrv": "SOU",
            "awayTeamAbbrv": "GLD"
        },
        {
            "gameState": "Second Half",
            "gameStateId": 5,
            "gameTime": "1:18:04",
            "gameSeconds": 4684,
            "GameMinutes": "78:04",
            "playerId": 503240,
            "playerName": "Angus Crichton",
            "scoreMethod": "Try",
            "statEvent": "Try",
            "statId": 38,
            "statValue": 4,
            "vidRef": 135723,
            "homeScore": 36,
            "awayScore": 20,
            "commentary": "Try by Angus Crichton",
            "tackleNum": 4,
            "teamId": 500005,
            "teamName": "South Sydney Rabbitohs",
            "homeTeamAbbrv": "SOU",
            "awayTeamAbbrv": "GLD"
        },
        {
            "gameState": "First Half",
            "gameStateId": 3,
            "gameTime": "0:02:01",
            "gameSeconds": 121,
            "GameMinutes": "02:01",
            "playerId": 501349,
            "playerName": "Pat Politoni",
            "scoreMethod": "Try",
            "statEvent": "Try",
            "statId": 38,
            "statValue": 4,
            "vidRef": 3057,
            "awayScore": 4,
            "commentary": "Try by Pat Politoni",
            "tackleNum": 2,
            "teamId": 500004,
            "teamName": "Gold Coast Titans",
            "homeTeamAbbrv": "SOU",
            "awayTeamAbbrv": "GLD"
        },
        {
            "gameState": "First Half",
            "gameStateId": 3,
            "gameTime": "0:03:27",
            "gameSeconds": 207,
            "GameMinutes": "03:27",
            "playerId": 500272,
            "playerName": "Ashley Taylor",
            "scoreMethod": "Conversion",
            "statEvent": "Conversion-Made",
            "statId": 1,
            "statValue": 2,
            "vidRef": 5213,
            "awayScore": 6,
            "commentary": "Conversion-Made by Ashley Taylor",
            "tackleNum": -1,
            "teamId": 500004,
            "teamName": "Gold Coast Titans",
            "homeTeamAbbrv": "SOU",
            "awayTeamAbbrv": "GLD"
        },
        {
            "gameState": "First Half",
            "gameStateId": 3,
            "gameTime": "0:08:47",
            "gameSeconds": 527,
            "GameMinutes": "08:47",
            "playerId": 500272,
            "playerName": "Ashley Taylor",
            "scoreMethod": "Penalty Goal",
            "statEvent": "Penalty Shot-Made",
            "statId": 67,
            "statValue": 2,
            "vidRef": 13204,
            "awayScore": 8,
            "commentary": "Penalty Shot-Made by Ashley Taylor",
            "tackleNum": -1,
            "teamId": 500004,
            "teamName": "Gold Coast Titans",
            "homeTeamAbbrv": "SOU",
            "awayTeamAbbrv": "GLD"
        },
        {
            "gameState": "First Half",
            "gameStateId": 3,
            "gameTime": "0:16:56",
            "gameSeconds": 1016,
            "GameMinutes": "16:56",
            "playerId": 500606,
            "playerName": "Kevin Proctor",
            "scoreMethod": "Try",
            "statEvent": "Try",
            "statId": 38,
            "statValue": 4,
            "vidRef": 26863,
            "awayScore": 12,
            "commentary": "Try by Kevin Proctor",
            "tackleNum": 6,
            "teamId": 500004,
            "teamName": "Gold Coast Titans",
            "homeTeamAbbrv": "SOU",
            "awayTeamAbbrv": "GLD"
        },
        {
            "gameState": "First Half",
            "gameStateId": 3,
            "gameTime": "0:18:05",
            "gameSeconds": 1085,
            "GameMinutes": "18:05",
            "playerId": 500272,
            "playerName": "Ashley Taylor",
            "scoreMethod": "Conversion",
            "statEvent": "Conversion-Made",
            "statId": 1,
            "statValue": 2,
            "vidRef": 29541,
            "awayScore": 14,
            "commentary": "Conversion-Made by Ashley Taylor",
            "tackleNum": -1,
            "teamId": 500004,
            "teamName": "Gold Coast Titans",
            "homeTeamAbbrv": "SOU",
            "awayTeamAbbrv": "GLD"
        },
        {
            "gameState": "First Half",
            "gameStateId": 3,
            "gameTime": "0:38:23",
            "gameSeconds": 2303,
            "GameMinutes": "38:23",
            "playerId": 502328,
            "playerName": "Joe Greenwood",
            "scoreMethod": "Try",
            "statEvent": "Try",
            "statId": 38,
            "statValue": 4,
            "vidRef": 62143,
            "homeScore": 10,
            "awayScore": 18,
            "commentary": "Try by Joe Greenwood",
            "tackleNum": 5,
            "teamId": 500004,
            "teamName": "Gold Coast Titans",
            "homeTeamAbbrv": "SOU",
            "awayTeamAbbrv": "GLD"
        },
        {
            "gameState": "First Half",
            "gameStateId": 3,
            "gameTime": "0:39:49",
            "gameSeconds": 2389,
            "GameMinutes": "39:49",
            "playerId": 500272,
            "playerName": "Ashley Taylor",
            "scoreMethod": "Conversion",
            "statEvent": "Conversion-Made",
            "statId": 1,
            "statValue": 2,
            "vidRef": 65969,
            "homeScore": 10,
            "awayScore": 20,
            "commentary": "Conversion-Made by Ashley Taylor",
            "tackleNum": -1,
            "teamId": 500004,
            "teamName": "Gold Coast Titans",
            "homeTeamAbbrv": "SOU",
            "awayTeamAbbrv": "GLD"
        }
    ],
    "twitter": [
        {
            "id": "875676201708277760",
            "gameSeconds": 3900
        },
        {
            "id": "875676103397957632",
            "gameSeconds": 3900
        },
        {
            "id": "875673625361121280",
            "gameSeconds": 3420
        },
        {
            "id": "875673509690621952",
            "gameSeconds": 3420
        },
        {
            "id": "875664991965151232",
            "gameSeconds": 2280
        },
        {
            "id": "875664775140659200",
            "gameSeconds": 2280
        },
        {
            "id": "875660118511108097",
            "gameSeconds": 1320
        },
        {
            "id": "875659969198047233",
            "gameSeconds": 1320
        },
        {
            "id": "875658630279733249",
            "gameSeconds": 1020
        },
        {
            "id": "875658484267614208",
            "gameSeconds": 1020
        },
        {
            "id": "875658040841691136",
            "gameSeconds": 720
        },
        {
            "id": "875657711953731585",
            "gameSeconds": 720
        }
    ]
}