{
    "competitionId": 111,
    "competitionName": "NRL Telstra Premiership",
    "gameId": 20171110320,
    "gameInfo": {
        "assistantReferee1Id": 500174,
        "assistantReferee1Name": "Tim Roby",
        "assistantReferee2Id": 500100,
        "assistantReferee2Name": "Anthony Elliott",
        "gameDate": "2017-03-17",
        "gameHashTag": "#NRLBulldogsWarriors",
        "gameNumber": 2,
        "gameSeconds": 4800,
        "gameMinutes": "80:00",
        "gameTime": "1:20:00",
        "groundConditionId": 2,
        "groundConditionName": "Good",
        "numberOfPeriods": 2,
        "referee1Id": 500008,
        "referee1Name": "Gavin Badger",
        "referee2Id": 500069,
        "referee2Name": "Jon Stone",
        "startTime": "2017-03-17T20:00:00",
        "startTimeUTC": "2017-03-17T07:00:00Z",
        "venueId": 500131,
        "venueName": "Forsyth Barr Stadium",
        "videoReferee1Id": 500033,
        "videoReferee1Name": "Steve Chiddy",
        "seniorReviewOfficialId": 500232,
        "seniorReviewOfficialName": "Luke Patten",
        "broadcastChannel": "FOX",
        "broadcastScheduledTimeUTC": "2017-03-17T06:50:00Z",
        "broadcastScheduledTime": "2017-03-17T19:50:00",
        "venueLatitude": -45.869389,
        "venueLongitude": 170.524187,
        "broadcastInfo": {
            "radioNetwork": []
        }
    },
    "gameState": "Final",
    "gameStateId": 8,
    "roundId": 3,
    "roundName": "Round 3",
    "seasonId": 2017,
    "teams": {
        "teamsMatch": [
            {
                "isHomeTeam": true,
                "score": {
                    "conversions": 3,
                    "points": 24,
                    "penaltyGoals": 1,
                    "tries": 4,
                    "allGoals": 4
                },
                "team1stHalfScore": 10,
                "team2ndHalfScore": 14,
                "teamAbbr": "CBY",
                "teamFinalScore": 24,
                "teamFullTimeScore": 24,
                "teamHalfTimeScore": 10,
                "teamId": 500010,
                "teamLineup": {
                    "teamLineUpStatusID": 4,
                    "teamLineUpStatus": "Final",
                    "injuriesAndSuspensions": {
                        "injury": [],
                        "suspension": []
                    },
                    "insAndOuts": {
                        "inOut": [
                            {
                                "inOut": "In",
                                "playerFirstName": "Brad",
                                "playerId": "501317",
                                "playerLastName": "Abbey",
                                "playerName": "Brad Abbey"
                            },
                            {
                                "inOut": "Out",
                                "playerFirstName": "Kerrod",
                                "playerId": "503388",
                                "playerLastName": "Holland",
                                "playerName": "Kerrod Holland"
                            },
                            {
                                "inOut": "In",
                                "playerFirstName": "Marcelo",
                                "playerId": "502487",
                                "playerLastName": "Montoya",
                                "playerName": "Marcelo Montoya"
                            },
                            {
                                "inOut": "Out",
                                "playerFirstName": "Will",
                                "playerId": "500672",
                                "playerLastName": "Hopoate",
                                "playerName": "Will Hopoate"
                            }
                        ]
                    },
                    "teamPlayer": [
                        {
                            "playerFirstName": "Brad",
                            "playerId": 501317,
                            "playerLastName": "Abbey",
                            "playerName": "Brad Abbey",
                            "playerPosition": "Fullback",
                            "playerPositionId": 500001,
                            "playerStats": {
                                "allRunMetres": 96,
                                "allRuns": 13,
                                "bombKicksDefused": 1,
                                "bombKicksNotDefused": 1,
                                "decoys": 3,
                                "dummyHalfRuns": 2,
                                "errors": 2,
                                "fantasyPointsTotal": 16,
                                "kickReturnMetres": 33,
                                "kickReturns": 4,
                                "kicksDefused": 3,
                                "kicksNotDefused": 3,
                                "mins": 80,
                                "missedTackles": 1,
                                "passes": 15,
                                "passesPerRun": 1.15,
                                "oneOnOneTackles": 1,
                                "supports": 29,
                                "tackleBreaks": 1,
                                "tackles": 7,
                                "evasionRuns": 7,
                                "evasionRunMetres": 42,
                                "dummyHalfRunMetres": 21,
                                "ptbAll": 11,
                                "receipts": 30,
                                "postContactMetres": 26,
                                "dummyPasses": 2,
                                "lineEngagedRuns": 1,
                                "ptbAverage": 3.77,
                                "ptbZeroToOne": 1,
                                "ptbThreeToFour": 6,
                                "ptbFourToFive": 3,
                                "ptbFivePlus": 1,
                                "ptbOpp20m": 1,
                                "effectiveTacklePercentage": 87.5,
                                "stint1": 4800,
                                "kickReceiptRuns": 4,
                                "kickReceiptMetres": 33
                            },
                            "playerTookTheField": true,
                            "shirtNum": 1,
                            "playerFirstInitial": "B",
                            "playerPositionAbbrev": "FB",
                            "onTheField": true,
                            "fantasyPrice": 138000
                        },
                        {
                            "playerFirstName": "Brett",
                            "playerId": 500633,
                            "playerLastName": "Morris",
                            "playerName": "Brett Morris",
                            "playerPosition": "Winger 1",
                            "playerPositionId": 500002,
                            "playerStats": {
                                "allRunMetres": 113,
                                "allRuns": 12,
                                "bombKicksDefused": 2,
                                "bombKicksNotDefused": 1,
                                "dummyHalfRuns": 4,
                                "fantasyPointsTotal": 61,
                                "ineffectiveTackles": 1,
                                "kickReturnMetres": 18,
                                "kickReturns": 4,
                                "kicksDefused": 5,
                                "kicksNotDefused": 3,
                                "linebreaks": 2,
                                "mins": 80,
                                "passes": 2,
                                "passesPerRun": 0.17,
                                "oneOnOneTackles": 3,
                                "points": 8,
                                "supports": 20,
                                "tackleBreaks": 5,
                                "tackles": 6,
                                "tries": 2,
                                "evasionRuns": 4,
                                "evasionRunMetres": 65,
                                "dummyHalfRunMetres": 30,
                                "ptbAll": 11,
                                "receipts": 15,
                                "postContactMetres": 27,
                                "dummyPasses": 5,
                                "ptbAverage": 3.28,
                                "ptbOneToTwo": 2,
                                "ptbTwoToThree": 3,
                                "ptbThreeToFour": 2,
                                "ptbFourToFive": 3,
                                "ptbFivePlus": 1,
                                "ptbOpp20m": 1,
                                "effectiveTacklePercentage": 85.7,
                                "stint1": 4800,
                                "kickReceiptRuns": 4,
                                "kickReceiptMetres": 18
                            },
                            "playerTookTheField": true,
                            "shirtNum": 2,
                            "playerFirstInitial": "B",
                            "playerPositionAbbrev": "WG",
                            "onTheField": true,
                            "fantasyPrice": 356000,
                            "fantasySeasonPriceChange": -3000,
                            "fantasyRoundPriceChange": -1000
                        },
                        {
                            "playerFirstName": "Josh",
                            "playerId": 500232,
                            "playerLastName": "Morris",
                            "playerName": "Josh Morris",
                            "playerPosition": "Centre 1",
                            "playerPositionId": 500003,
                            "playerStats": {
                                "allRunMetres": 125,
                                "allRuns": 11,
                                "decoys": 1,
                                "errors": 1,
                                "fantasyPointsTotal": 41,
                                "ineffectiveTackles": 1,
                                "kickMetres": 21,
                                "kicks": 1,
                                "linebreakAssists": 1,
                                "mins": 80,
                                "passes": 3,
                                "passesPerRun": 0.27,
                                "oneOnOneTackles": 2,
                                "supports": 11,
                                "tackleBreaks": 2,
                                "tackles": 17,
                                "tryAssists": 1,
                                "evasionRuns": 11,
                                "evasionRunMetres": 125,
                                "ptbAll": 8,
                                "receipts": 14,
                                "chipKick": 1,
                                "postContactMetres": 46,
                                "dummyPasses": 1,
                                "lineEngagedRuns": 1,
                                "ptbAverage": 3.48,
                                "ptbTwoToThree": 3,
                                "ptbThreeToFour": 4,
                                "ptbFivePlus": 1,
                                "ptbOpp20m": 1,
                                "doubles": 3,
                                "effectiveTacklePercentage": 94.4,
                                "stint1": 4800
                            },
                            "playerTookTheField": true,
                            "shirtNum": 3,
                            "playerFirstInitial": "J",
                            "playerPositionAbbrev": "CT",
                            "onTheField": true,
                            "fantasyPrice": 301000,
                            "fantasySeasonPriceChange": 3000,
                            "fantasyRoundPriceChange": 9000
                        },
                        {
                            "playerFirstName": "Brenko",
                            "playerId": 500321,
                            "playerLastName": "Lee",
                            "playerName": "Brenko Lee",
                            "playerPosition": "Centre 2",
                            "playerPositionId": 500004,
                            "playerStats": {
                                "allRunMetres": 101,
                                "allRuns": 13,
                                "decoys": 1,
                                "dummyHalfRuns": 1,
                                "errors": 2,
                                "fantasyPointsTotal": 29,
                                "hitUps": 1,
                                "linebreakAssists": 1,
                                "mins": 80,
                                "missedTackles": 1,
                                "offloads": 3,
                                "passes": 7,
                                "passesPerRun": 0.54,
                                "oneOnOneTackles": 2,
                                "supports": 19,
                                "tackleBreaks": 2,
                                "tackles": 6,
                                "tryAssists": 1,
                                "hitupRunMeters": 4,
                                "evasionRuns": 11,
                                "evasionRunMetres": 83,
                                "dummyHalfRunMetres": 14,
                                "ptbAll": 7,
                                "receipts": 18,
                                "postContactMetres": 29,
                                "dummyPasses": 1,
                                "kickPressures": 1,
                                "lineEngagedRuns": 1,
                                "ptbAverage": 3.03,
                                "ptbTwoToThree": 3,
                                "ptbThreeToFour": 4,
                                "ptbOpp20m": 1,
                                "effectiveTacklePercentage": 85.7,
                                "stint1": 4800
                            },
                            "playerTookTheField": true,
                            "shirtNum": 4,
                            "playerFirstInitial": "B",
                            "playerPositionAbbrev": "CT",
                            "onTheField": true,
                            "fantasyPrice": 324000,
                            "fantasySeasonPriceChange": 28000,
                            "fantasyRoundPriceChange": 12000
                        },
                        {
                            "playerFirstName": "Marcelo",
                            "playerId": 502487,
                            "playerLastName": "Montoya",
                            "playerName": "Marcelo Montoya",
                            "playerPosition": "Winger 2",
                            "playerPositionId": 500005,
                            "playerStats": {
                                "allRunMetres": 101,
                                "allRuns": 10,
                                "dummyHalfRuns": 1,
                                "fantasyPointsTotal": 33,
                                "kickReturnMetres": 19,
                                "kickReturns": 2,
                                "kicksDefused": 1,
                                "linebreaks": 1,
                                "mins": 80,
                                "passes": 5,
                                "passesPerRun": 0.5,
                                "oneOnOneTackles": 1,
                                "points": 4,
                                "supports": 17,
                                "tackleBreaks": 1,
                                "tackles": 7,
                                "tries": 1,
                                "evasionRuns": 7,
                                "evasionRunMetres": 69,
                                "dummyHalfRunMetres": 13,
                                "ptbAll": 9,
                                "receipts": 15,
                                "postContactMetres": 24,
                                "ptbAverage": 3.17,
                                "ptbTwoToThree": 3,
                                "ptbThreeToFour": 5,
                                "ptbFourToFive": 1,
                                "ptbOpp20m": 1,
                                "effectiveTacklePercentage": 100,
                                "stint1": 4800,
                                "kickReceiptRuns": 2,
                                "kickReceiptMetres": 19
                            },
                            "playerTookTheField": true,
                            "shirtNum": 5,
                            "playerFirstInitial": "M",
                            "playerPositionAbbrev": "WG",
                            "onTheField": true,
                            "fantasyPrice": 138000
                        },
                        {
                            "playerFirstName": "Josh",
                            "playerId": 500237,
                            "playerLastName": "Reynolds",
                            "playerName": "Josh Reynolds",
                            "playerPosition": "Five-Eighth",
                            "playerPositionId": 500006,
                            "playerStats": {
                                "allRunMetres": 53,
                                "allRuns": 8,
                                "bombKicks": 1,
                                "bombKickMetres": 21,
                                "decoys": 1,
                                "fantasyPointsTotal": 44,
                                "kickMetres": 362,
                                "kicks": 12,
                                "kicksNotDefused": 1,
                                "mins": 80,
                                "missedTackles": 1,
                                "passes": 26,
                                "passesPerRun": 3.25,
                                "oneOnOneTackles": 2,
                                "penalties": 1,
                                "supports": 18,
                                "tackleBreaks": 1,
                                "tackles": 22,
                                "tryCause": 1,
                                "evasionRuns": 8,
                                "evasionRunMetres": 53,
                                "ptbAll": 4,
                                "receipts": 43,
                                "forcedDropOutKicker": 1,
                                "grubberKick": 1,
                                "crossFieldKick": 1,
                                "postContactMetres": 8,
                                "dummyPasses": 5,
                                "kickPressures": 2,
                                "lineEngagedRuns": 4,
                                "ptbAverage": 3.71,
                                "ptbOneToTwo": 1,
                                "ptbFourToFive": 3,
                                "ptbOpp20m": 2,
                                "longKicksSpace": 1,
                                "effectiveTacklePercentage": 95.7,
                                "ptbPenalties": 1,
                                "stint1": 4800
                            },
                            "playerTookTheField": true,
                            "shirtNum": 6,
                            "playerFirstInitial": "J",
                            "playerPositionAbbrev": "FE",
                            "onTheField": true,
                            "fantasyPrice": 424000,
                            "fantasySeasonPriceChange": -5000,
                            "fantasyRoundPriceChange": -12000
                        },
                        {
                            "playerFirstName": "Moses",
                            "playerId": 500243,
                            "playerLastName": "Mbye",
                            "playerName": "Moses Mbye",
                            "playerPosition": "Halfback",
                            "playerPositionId": 500007,
                            "playerStats": {
                                "allRunMetres": 65,
                                "allRuns": 5,
                                "bombKicks": 2,
                                "bombKickMetres": 52,
                                "conversions": 3,
                                "conversionsAttempts": 4,
                                "conversionsMissed": 1,
                                "errors": 1,
                                "fantasyPointsTotal": 49,
                                "goalConversionRate": 80,
                                "allGoals": 4,
                                "allGoalsMissed": 1,
                                "allGoalsAttempted": 5,
                                "ineffectiveTackles": 1,
                                "kickMetres": 117,
                                "kicks": 5,
                                "lineDropouts": 2,
                                "linebreaks": 1,
                                "mins": 80,
                                "missedTackles": 5,
                                "passes": 29,
                                "passesPerRun": 5.8,
                                "oneOnOneTackles": 3,
                                "penalties": 1,
                                "penaltyGoals": 1,
                                "penaltyGoalsAttempts": 1,
                                "points": 12,
                                "supports": 10,
                                "tackleBreaks": 3,
                                "tackles": 23,
                                "tries": 1,
                                "tryCause": 1,
                                "evasionRuns": 5,
                                "evasionRunMetres": 65,
                                "ptbAll": 4,
                                "receipts": 40,
                                "grubberKick": 2,
                                "postContactMetres": 20,
                                "dummyPasses": 7,
                                "kickPressures": 6,
                                "ptbAverage": 3.48,
                                "ptbTwoToThree": 2,
                                "ptbThreeToFour": 1,
                                "ptbFivePlus": 1,
                                "ptbOpp20m": 2,
                                "doubles": 1,
                                "effectiveTacklePercentage": 79.3,
                                "ptbPenalties": 1,
                                "stint1": 4800
                            },
                            "playerTookTheField": true,
                            "shirtNum": 7,
                            "playerFirstInitial": "M",
                            "playerPositionAbbrev": "HB",
                            "onTheField": true,
                            "fantasyPrice": 380000,
                            "fantasySeasonPriceChange": -44000,
                            "fantasyRoundPriceChange": -27000
                        },
                        {
                            "playerFirstName": "Aiden",
                            "playerId": 500241,
                            "playerLastName": "Tolman",
                            "playerName": "Aiden Tolman",
                            "playerPosition": "Prop 1",
                            "playerPositionId": 500008,
                            "playerStats": {
                                "allRunMetres": 138,
                                "allRuns": 17,
                                "decoys": 12,
                                "fantasyPointsTotal": 39,
                                "hitUps": 17,
                                "mins": 58,
                                "passes": 5,
                                "passesPerRun": 0.29,
                                "oneOnOneTackles": 2,
                                "penalties": 1,
                                "supports": 21,
                                "tackles": 28,
                                "hitupRunMeters": 138,
                                "ptbAll": 16,
                                "receipts": 22,
                                "postContactMetres": 40,
                                "dummyPasses": 5,
                                "kickPressures": 5,
                                "ptbAverage": 3.2,
                                "ptbOneToTwo": 2,
                                "ptbTwoToThree": 5,
                                "ptbThreeToFour": 6,
                                "ptbFourToFive": 3,
                                "ptbOpp20m": 3,
                                "doubles": 3,
                                "effectiveTacklePercentage": 100,
                                "offsidePenalties": 1,
                                "stint1": 2832,
                                "stint2": 653
                            },
                            "playerTookTheField": true,
                            "shirtNum": 8,
                            "playerFirstInitial": "A",
                            "playerPositionAbbrev": "PR",
                            "onTheField": true,
                            "fantasyPrice": 431000,
                            "fantasySeasonPriceChange": -20000,
                            "fantasyRoundPriceChange": -13000
                        },
                        {
                            "playerFirstName": "Michael",
                            "playerId": 500803,
                            "playerLastName": "Lichaa",
                            "playerName": "Michael Lichaa",
                            "playerPosition": "Hooker",
                            "playerPositionId": 500009,
                            "playerStats": {
                                "allRunMetres": 57,
                                "allRuns": 5,
                                "dummyHalfRuns": 4,
                                "fantasyPointsTotal": 55,
                                "hitUps": 1,
                                "mins": 80,
                                "passes": 88,
                                "passesPerRun": 17.6,
                                "tackleBreaks": 2,
                                "tackles": 44,
                                "hitupRunMeters": 5,
                                "dummyHalfRunMetres": 52,
                                "ptbAll": 4,
                                "receipts": 91,
                                "postContactMetres": 14,
                                "dummyPasses": 9,
                                "kickPressures": 3,
                                "lineEngagedRuns": 1,
                                "ptbAverage": 3.7,
                                "ptbTwoToThree": 1,
                                "ptbThreeToFour": 2,
                                "ptbFourToFive": 1,
                                "doubles": 9,
                                "effectiveTacklePercentage": 100,
                                "stint1": 4800
                            },
                            "playerTookTheField": true,
                            "shirtNum": 9,
                            "playerFirstInitial": "M",
                            "playerPositionAbbrev": "HK",
                            "onTheField": true,
                            "fantasyPrice": 438000,
                            "fantasySeasonPriceChange": -18000,
                            "fantasyRoundPriceChange": -9000
                        },
                        {
                            "playerFirstName": "James",
                            "playerId": 500223,
                            "playerLastName": "Graham",
                            "playerName": "James Graham",
                            "playerPosition": "Prop 2",
                            "playerPositionId": 500010,
                            "playerStats": {
                                "allRunMetres": 139,
                                "allRuns": 14,
                                "decoys": 9,
                                "fantasyPointsTotal": 55,
                                "hitUps": 11,
                                "ineffectiveTackles": 1,
                                "kickReturnMetres": 10,
                                "kickReturns": 1,
                                "kicks": 1,
                                "mins": 58,
                                "passes": 7,
                                "passesPerRun": 0.5,
                                "oneOnOneTackles": 1,
                                "penalties": 1,
                                "supports": 6,
                                "tackleBreaks": 2,
                                "tackles": 38,
                                "hitupRunMeters": 116,
                                "evasionRuns": 2,
                                "evasionRunMetres": 13,
                                "ptbAll": 12,
                                "receipts": 19,
                                "crossFieldKick": 1,
                                "postContactMetres": 50,
                                "dummyPasses": 2,
                                "lineEngagedRuns": 2,
                                "ptbAverage": 3.31,
                                "ptbZeroToOne": 1,
                                "ptbTwoToThree": 1,
                                "ptbThreeToFour": 8,
                                "ptbFourToFive": 1,
                                "ptbFivePlus": 1,
                                "ptbOpp20m": 3,
                                "doubles": 4,
                                "effectiveTacklePercentage": 97.4,
                                "ptbPenalties": 1,
                                "stint1": 1508,
                                "stint2": 1968
                            },
                            "playerTookTheField": true,
                            "shirtNum": 10,
                            "isCaptain": true,
                            "playerFirstInitial": "J",
                            "playerPositionAbbrev": "PR",
                            "onTheField": true,
                            "fantasyPrice": 525000,
                            "fantasySeasonPriceChange": -16000,
                            "fantasyRoundPriceChange": -10000
                        },
                        {
                            "playerFirstName": "Josh",
                            "playerId": 500226,
                            "playerLastName": "Jackson",
                            "playerName": "Josh Jackson",
                            "playerPosition": "2nd Row 1",
                            "playerPositionId": 500011,
                            "playerStats": {
                                "allRunMetres": 78,
                                "allRuns": 9,
                                "decoys": 5,
                                "fantasyPointsTotal": 52,
                                "hitUps": 7,
                                "ineffectiveTackles": 2,
                                "kickReturnMetres": 7,
                                "kickReturns": 1,
                                "mins": 80,
                                "missedTackles": 1,
                                "offloads": 2,
                                "passes": 6,
                                "passesPerRun": 0.67,
                                "oneOnOneTackles": 4,
                                "penalties": 1,
                                "supports": 9,
                                "tackleBreaks": 1,
                                "tackles": 42,
                                "hitupRunMeters": 68,
                                "evasionRuns": 1,
                                "evasionRunMetres": 3,
                                "ptbAll": 7,
                                "receipts": 16,
                                "postContactMetres": 29,
                                "dummyPasses": 1,
                                "kickPressures": 4,
                                "lineEngagedRuns": 1,
                                "ptbAverage": 3.14,
                                "ptbOneToTwo": 1,
                                "ptbTwoToThree": 2,
                                "ptbThreeToFour": 3,
                                "ptbFourToFive": 1,
                                "doubles": 6,
                                "effectiveTacklePercentage": 93.3,
                                "foulPlayPenalties": 1,
                                "stint1": 4800
                            },
                            "playerTookTheField": true,
                            "shirtNum": 11,
                            "playerFirstInitial": "J",
                            "playerPositionAbbrev": "2R",
                            "onTheField": true,
                            "fantasyPrice": 409000,
                            "fantasySeasonPriceChange": -18000,
                            "fantasyRoundPriceChange": -19000
                        },
                        {
                            "playerFirstName": "Greg",
                            "playerId": 500220,
                            "playerLastName": "Eastwood",
                            "playerName": "Greg Eastwood",
                            "playerPosition": "2nd Row 2",
                            "playerPositionId": 500012,
                            "playerStats": {
                                "allRunMetres": 64,
                                "allRuns": 10,
                                "decoys": 5,
                                "fantasyPointsTotal": 29,
                                "hitUps": 10,
                                "mins": 56,
                                "missedTackles": 4,
                                "offloads": 3,
                                "passes": 2,
                                "passesPerRun": 0.2,
                                "penalties": 1,
                                "supports": 4,
                                "tackleBreaks": 2,
                                "tackles": 21,
                                "hitupRunMeters": 64,
                                "ptbAll": 8,
                                "receipts": 13,
                                "postContactMetres": 23,
                                "dummyPasses": 2,
                                "kickPressures": 6,
                                "ptbAverage": 3.77,
                                "ptbOneToTwo": 1,
                                "ptbThreeToFour": 4,
                                "ptbFourToFive": 2,
                                "ptbFivePlus": 1,
                                "doubles": 4,
                                "effectiveTacklePercentage": 84,
                                "offsidePenalties": 1,
                                "stint1": 3380
                            },
                            "playerTookTheField": true,
                            "shirtNum": 12,
                            "playerFirstInitial": "G",
                            "playerPositionAbbrev": "2R",
                            "fantasyPrice": 287000,
                            "fantasySeasonPriceChange": -37000,
                            "fantasyRoundPriceChange": -25000
                        },
                        {
                            "playerFirstName": "David",
                            "playerId": 500228,
                            "playerLastName": "Klemmer",
                            "playerName": "David Klemmer",
                            "playerPosition": "Lock",
                            "playerPositionId": 500013,
                            "playerStats": {
                                "allRunMetres": 201,
                                "allRuns": 20,
                                "decoys": 10,
                                "errors": 2,
                                "fantasyPointsTotal": 37,
                                "hitUps": 14,
                                "kickReturnMetres": 78,
                                "kickReturns": 5,
                                "mins": 63,
                                "passes": 7,
                                "passesPerRun": 0.35,
                                "penalties": 1,
                                "supports": 12,
                                "tackleBreaks": 1,
                                "tackles": 20,
                                "hitupRunMeters": 118,
                                "evasionRuns": 1,
                                "evasionRunMetres": 5,
                                "ptbAll": 17,
                                "receipts": 26,
                                "postContactMetres": 63,
                                "dummyPasses": 2,
                                "lineEngagedRuns": 1,
                                "ptbAverage": 3.98,
                                "ptbZeroToOne": 1,
                                "ptbThreeToFour": 8,
                                "ptbFourToFive": 6,
                                "ptbFivePlus": 2,
                                "ptbOpp20m": 3,
                                "doubles": 4,
                                "effectiveTacklePercentage": 100,
                                "foulPlayPenalties": 1,
                                "stint1": 2832,
                                "stint2": 948
                            },
                            "playerTookTheField": true,
                            "shirtNum": 13,
                            "playerFirstInitial": "D",
                            "playerPositionAbbrev": "LK",
                            "onTheField": true,
                            "fantasyPrice": 420000,
                            "fantasySeasonPriceChange": -6000,
                            "fantasyRoundPriceChange": -3000
                        },
                        {
                            "playerFirstName": "Sam",
                            "playerId": 500227,
                            "playerLastName": "Kasiano",
                            "playerName": "Sam Kasiano",
                            "playerPosition": "Interchange",
                            "playerPositionId": 500014,
                            "playerStats": {
                                "allRunMetres": 93,
                                "allRuns": 9,
                                "decoys": 7,
                                "fantasyPointsTotal": 24,
                                "hitUps": 8,
                                "mins": 28,
                                "offloads": 1,
                                "passes": 2,
                                "passesPerRun": 0.22,
                                "supports": 3,
                                "tackles": 13,
                                "hitupRunMeters": 83,
                                "evasionRuns": 1,
                                "evasionRunMetres": 10,
                                "ptbAll": 6,
                                "receipts": 10,
                                "postContactMetres": 35,
                                "dummyPasses": 3,
                                "kickPressures": 2,
                                "lineEngagedRuns": 1,
                                "ptbAverage": 3.26,
                                "ptbTwoToThree": 3,
                                "ptbThreeToFour": 2,
                                "ptbFivePlus": 1,
                                "ptbOpp20m": 1,
                                "doubles": 2,
                                "effectiveTacklePercentage": 100,
                                "stint1": 1645
                            },
                            "playerTookTheField": true,
                            "shirtNum": 14,
                            "playerFirstInitial": "S",
                            "playerPositionAbbrev": "INT",
                            "fantasyPrice": 227000,
                            "fantasySeasonPriceChange": -26000,
                            "fantasyRoundPriceChange": -20000
                        },
                        {
                            "playerFirstName": "Danny",
                            "playerId": 500131,
                            "playerLastName": "Fualalo",
                            "playerName": "Danny Fualalo",
                            "playerPosition": "Interchange",
                            "playerPositionId": 500014,
                            "playerStats": {
                                "allRunMetres": 33,
                                "allRuns": 4,
                                "fantasyPointsTotal": 18,
                                "hitUps": 4,
                                "ineffectiveTackles": 1,
                                "mins": 22,
                                "supports": 3,
                                "tackles": 15,
                                "hitupRunMeters": 33,
                                "ptbAll": 4,
                                "receipts": 4,
                                "postContactMetres": 12,
                                "dummyPasses": 1,
                                "ptbAverage": 3.14,
                                "ptbOneToTwo": 1,
                                "ptbThreeToFour": 3,
                                "doubles": 2,
                                "effectiveTacklePercentage": 93.8,
                                "stint1": 1315
                            },
                            "playerTookTheField": true,
                            "shirtNum": 15,
                            "playerFirstInitial": "D",
                            "playerPositionAbbrev": "INT",
                            "fantasyPrice": 169000,
                            "fantasySeasonPriceChange": 3000,
                            "fantasyRoundPriceChange": 1000
                        },
                        {
                            "playerFirstName": "Adam",
                            "playerId": 500128,
                            "playerLastName": "Elliot",
                            "playerName": "Adam Elliot",
                            "playerPosition": "Interchange",
                            "playerPositionId": 500014,
                            "playerStats": {
                                "allRunMetres": 8,
                                "allRuns": 1,
                                "decoys": 1,
                                "errors": 1,
                                "fantasyPointsTotal": 7,
                                "hitUps": 1,
                                "mins": 12,
                                "missedTackles": 1,
                                "supports": 2,
                                "tackles": 11,
                                "hitupRunMeters": 8,
                                "receipts": 1,
                                "postContactMetres": 3,
                                "doubles": 1,
                                "effectiveTacklePercentage": 91.7,
                                "stint1": 699
                            },
                            "playerTookTheField": true,
                            "shirtNum": 16,
                            "playerFirstInitial": "A",
                            "playerPositionAbbrev": "INT",
                            "fantasyPrice": 162000,
                            "fantasySeasonPriceChange": 19000,
                            "fantasyRoundPriceChange": 21000
                        },
                        {
                            "playerFirstName": "Raymond",
                            "playerId": 500916,
                            "playerLastName": "Faitala-Mariner",
                            "playerName": "Raymond Faitala-Mariner",
                            "playerPosition": "Interchange",
                            "playerPositionId": 500014,
                            "playerStats": {
                                "allRunMetres": 37,
                                "allRuns": 4,
                                "fantasyPointsTotal": 21,
                                "hitUps": 4,
                                "ineffectiveTackles": 2,
                                "mins": 24,
                                "offloads": 2,
                                "supports": 4,
                                "tackleBreaks": 1,
                                "tackles": 11,
                                "tryCause": 1,
                                "hitupRunMeters": 37,
                                "ptbAll": 2,
                                "receipts": 4,
                                "postContactMetres": 11,
                                "kickPressures": 2,
                                "ptbAverage": 2.98,
                                "ptbTwoToThree": 1,
                                "ptbThreeToFour": 1,
                                "doubles": 2,
                                "effectiveTacklePercentage": 84.6,
                                "stint1": 1419
                            },
                            "playerTookTheField": true,
                            "shirtNum": 17,
                            "playerFirstInitial": "R",
                            "playerPositionAbbrev": "INT",
                            "onTheField": true,
                            "fantasyPrice": 237000,
                            "fantasyRoundPriceChange": 4000
                        }
                    ]
                },
                "teamName": "Canterbury-Bankstown Bulldogs",
                "teamNickName": "Bulldogs",
                "teamStats": {
                    "allRunMetres": 1500,
                    "allRuns": 165,
                    "bombKicks": 3,
                    "bombKickMetres": 73,
                    "bombKicksDefused": 3,
                    "bombKicksNotDefused": 2,
                    "completeSets": 31,
                    "completionPercentage": 82,
                    "conversions": 3,
                    "conversionsAttempts": 4,
                    "conversionsMissed": 1,
                    "decoys": 55,
                    "dummyHalfRuns": 12,
                    "errors": 9,
                    "goalConversionRate": 80,
                    "allGoals": 4,
                    "allGoalsAttempted": 5,
                    "allGoalsMissed": 1,
                    "hitUps": 78,
                    "incompleteSets": 7,
                    "ineffectiveTackles": 9,
                    "kickMetres": 500,
                    "kickReturnMetres": 165,
                    "kickReturns": 17,
                    "kicks": 19,
                    "kicksDefused": 9,
                    "kicksNotDefused": 7,
                    "lineDropouts": 2,
                    "linebreakAssists": 2,
                    "linebreaks": 4,
                    "missedTackles": 14,
                    "offloads": 11,
                    "oneOnOneTackles": 21,
                    "passes": 204,
                    "passesPerRun": 1.24,
                    "penalties": 7,
                    "penaltyGoals": 1,
                    "penaltyGoalsAttempts": 1,
                    "points": 24,
                    "pointsConceded": 12,
                    "possession": 47,
                    "scrumWins": 4,
                    "supports": 188,
                    "tackleBreaks": 24,
                    "tackles": 331,
                    "sets": 38,
                    "tries": 4,
                    "triesConceded": 2,
                    "tryAssists": 2,
                    "tryCause": 3,
                    "hitupRunMeters": 674,
                    "evasionRuns": 58,
                    "evasionRunMetres": 532,
                    "dummyHalfRunMetres": 129,
                    "ptbTotal": 130,
                    "twoManTackles": 67,
                    "threeManTackles": 42,
                    "fourManPlusTackles": 2,
                    "tryScoringPercentage": 10.53,
                    "shiftsLeft": 14,
                    "shiftsRight": 12,
                    "receipts": 381,
                    "forcedDropOutKicker": 1,
                    "chipKick": 1,
                    "grubberKick": 3,
                    "crossFieldKick": 2,
                    "postContactMetres": 460,
                    "dummyPasses": 46,
                    "kickPressures": 31,
                    "lineEngagedRuns": 13,
                    "ptbAverage": 3.44,
                    "ptbZeroToOne": 3,
                    "ptbOneToTwo": 8,
                    "ptbTwoToThree": 27,
                    "ptbThreeToFour": 59,
                    "ptbFourToFive": 24,
                    "ptbFivePlus": 9,
                    "ptbOpp20m": 19,
                    "interchangeUsed": 7,
                    "interchangeLeft": 1,
                    "doubles": 41,
                    "longKicksSpace": 1,
                    "effectiveTacklePercentage": 93.5,
                    "ptbPenalties": 3,
                    "foulPlayPenalties": 2,
                    "offsidePenalties": 2,
                    "averageSetDistance": 39.5,
                    "completeSets1stHalf": 16,
                    "completeSets2ndHalf": 15,
                    "completionPercentage1stHalf": 84,
                    "completionPercentage2ndHalf": 79,
                    "incompleteSets1stHalf": 3,
                    "incompleteSets2ndHalf": 4,
                    "incompletionPercentage1stHalf": 16,
                    "incompletionPercentage2ndHalf": 21,
                    "kickReceiptRuns": 10,
                    "kickReceiptMetres": 70,
                    "averageOneManTackleTiming": 3.52,
                    "averageTwoManTackleTiming": 3.24,
                    "averageThreeManTackleTiming": 3.71,
                    "averageFourManTackleTiming": 4.6
                },
                "teamHexColour": "0055a5",
                "teamHexColour2": "b4b4be",
                "teamCoaches": {
                    "teamCoach": [
                        {
                            "coachId": 50016,
                            "coachName": "Des Hasler",
                            "coachRoleId": 12,
                            "coachRole": "Coach"
                        }
                    ]
                }
            },
            {
                "score": {
                    "conversions": 2,
                    "points": 12,
                    "tries": 2,
                    "allGoals": 2
                },
                "team1stHalfScore": 6,
                "team2ndHalfScore": 6,
                "teamAbbr": "WAR",
                "teamFinalScore": 12,
                "teamFullTimeScore": 12,
                "teamHalfTimeScore": 6,
                "teamId": 500032,
                "teamLineup": {
                    "teamLineUpStatusID": 4,
                    "teamLineUpStatus": "Final",
                    "injuriesAndSuspensions": {
                        "injury": [],
                        "suspension": []
                    },
                    "insAndOuts": {
                        "inOut": [
                            {
                                "inOut": "In",
                                "playerFirstName": "Manu",
                                "playerId": "500722",
                                "playerLastName": "Vatuvei",
                                "playerName": "Manu Vatuvei"
                            },
                            {
                                "inOut": "Out",
                                "playerFirstName": "Roger",
                                "playerId": "500005",
                                "playerLastName": "Tuivasa-Sheck",
                                "playerName": "Roger Tuivasa-Sheck"
                            }
                        ]
                    },
                    "teamPlayer": [
                        {
                            "playerFirstName": "Tuimoala",
                            "playerId": 500927,
                            "playerLastName": "Lolohea",
                            "playerName": "Tuimoala Lolohea",
                            "playerPosition": "Fullback",
                            "playerPositionId": 500001,
                            "playerStats": {
                                "allRunMetres": 121,
                                "allRuns": 15,
                                "bombKicksNotDefused": 1,
                                "decoys": 3,
                                "errors": 2,
                                "fantasyPointsTotal": 17,
                                "kickMetres": 54,
                                "kickReturnMetres": 80,
                                "kickReturns": 8,
                                "kicks": 3,
                                "kicksDefused": 2,
                                "kicksNotDefused": 1,
                                "mins": 80,
                                "missedTackles": 1,
                                "offloads": 1,
                                "passes": 7,
                                "passesPerRun": 0.47,
                                "supports": 19,
                                "tackleBreaks": 1,
                                "tackles": 2,
                                "evasionRuns": 7,
                                "evasionRunMetres": 41,
                                "ptbAll": 12,
                                "receipts": 27,
                                "grubberKick": 2,
                                "postContactMetres": 28,
                                "dummyPasses": 5,
                                "ptbAverage": 3.79,
                                "ptbTwoToThree": 1,
                                "ptbThreeToFour": 6,
                                "ptbFourToFive": 5,
                                "ptbOpp20m": 3,
                                "effectiveTacklePercentage": 66.7,
                                "stint1": 4800,
                                "kickReceiptRuns": 7,
                                "kickReceiptMetres": 73
                            },
                            "playerTookTheField": true,
                            "shirtNum": 21,
                            "playerFirstInitial": "T",
                            "playerPositionAbbrev": "FB",
                            "onTheField": true,
                            "fantasyPrice": 259000,
                            "fantasySeasonPriceChange": -4000,
                            "fantasyRoundPriceChange": 2000
                        },
                        {
                            "playerFirstName": "Ken",
                            "playerId": 500928,
                            "playerLastName": "Maumalo",
                            "playerName": "Ken Maumalo",
                            "playerPosition": "Winger 1",
                            "playerPositionId": 500002,
                            "playerStats": {
                                "allRunMetres": 109,
                                "allRuns": 15,
                                "bombKicksDefused": 2,
                                "decoys": 1,
                                "errors": 2,
                                "fantasyPointsTotal": 21,
                                "ineffectiveTackles": 1,
                                "kickMetres": 27,
                                "kickReturnMetres": 28,
                                "kickReturns": 6,
                                "kicks": 1,
                                "kicksDefused": 5,
                                "kicksNotDefused": 1,
                                "mins": 80,
                                "missedTackles": 2,
                                "offloads": 1,
                                "oneOnOneTackles": 1,
                                "supports": 12,
                                "tackleBreaks": 2,
                                "tackles": 5,
                                "tryCause": 1,
                                "evasionRuns": 9,
                                "evasionRunMetres": 81,
                                "ptbAll": 15,
                                "receipts": 18,
                                "forcedDropOutKicker": 1,
                                "grubberKick": 1,
                                "postContactMetres": 33,
                                "dummyPasses": 2,
                                "ptbAverage": 3.12,
                                "ptbOneToTwo": 4,
                                "ptbTwoToThree": 4,
                                "ptbThreeToFour": 4,
                                "ptbFourToFive": 2,
                                "ptbFivePlus": 1,
                                "doubles": 1,
                                "effectiveTacklePercentage": 62.5,
                                "stint1": 4800,
                                "kickReceiptRuns": 6,
                                "kickReceiptMetres": 28
                            },
                            "playerTookTheField": true,
                            "shirtNum": 2,
                            "playerFirstInitial": "K",
                            "playerPositionAbbrev": "WG",
                            "onTheField": true,
                            "fantasyPrice": 180000,
                            "fantasySeasonPriceChange": -11000,
                            "fantasyRoundPriceChange": -5000
                        },
                        {
                            "playerFirstName": "David",
                            "playerId": 500919,
                            "playerLastName": "Fusitua",
                            "playerName": "David Fusitua",
                            "playerPosition": "Centre 1",
                            "playerPositionId": 500003,
                            "playerStats": {
                                "allRunMetres": 78,
                                "allRuns": 9,
                                "decoys": 1,
                                "errors": 1,
                                "fantasyPointsTotal": 21,
                                "ineffectiveTackles": 1,
                                "mins": 80,
                                "missedTackles": 3,
                                "offloads": 1,
                                "passes": 6,
                                "passesPerRun": 0.67,
                                "oneOnOneTackles": 4,
                                "supports": 9,
                                "tackleBreaks": 3,
                                "tackles": 11,
                                "tryCause": 2,
                                "evasionRuns": 9,
                                "evasionRunMetres": 78,
                                "ptbAll": 7,
                                "receipts": 13,
                                "postContactMetres": 36,
                                "kickPressures": 1,
                                "ptbAverage": 3.49,
                                "ptbTwoToThree": 2,
                                "ptbThreeToFour": 3,
                                "ptbFourToFive": 2,
                                "ptbOpp20m": 2,
                                "effectiveTacklePercentage": 73.3,
                                "stint1": 4800
                            },
                            "playerTookTheField": true,
                            "shirtNum": 3,
                            "playerFirstInitial": "D",
                            "playerPositionAbbrev": "CT",
                            "onTheField": true,
                            "fantasyPrice": 353000,
                            "fantasySeasonPriceChange": 31000,
                            "fantasyRoundPriceChange": 7000
                        },
                        {
                            "playerFirstName": "Solomone",
                            "playerId": 500921,
                            "playerLastName": "Kata",
                            "playerName": "Solomone Kata",
                            "playerPosition": "Centre 2",
                            "playerPositionId": 500004,
                            "playerStats": {
                                "allRunMetres": 107,
                                "allRuns": 13,
                                "decoys": 2,
                                "dummyHalfRuns": 4,
                                "errors": 1,
                                "fantasyPointsTotal": 14,
                                "kicksDefused": 1,
                                "mins": 80,
                                "passes": 3,
                                "passesPerRun": 0.23,
                                "oneOnOneTackles": 1,
                                "penalties": 1,
                                "supports": 19,
                                "tackles": 7,
                                "tryCause": 1,
                                "evasionRuns": 9,
                                "evasionRunMetres": 89,
                                "dummyHalfRunMetres": 18,
                                "ptbAll": 12,
                                "receipts": 15,
                                "postContactMetres": 36,
                                "dummyPasses": 3,
                                "ptbAverage": 3.55,
                                "ptbOneToTwo": 2,
                                "ptbTwoToThree": 3,
                                "ptbThreeToFour": 5,
                                "ptbFivePlus": 2,
                                "ptbOpp20m": 3,
                                "effectiveTacklePercentage": 100,
                                "generalPlayPenalties": 1,
                                "foulPlayPenalties": 1,
                                "stint1": 4800
                            },
                            "playerTookTheField": true,
                            "shirtNum": 4,
                            "playerFirstInitial": "S",
                            "playerPositionAbbrev": "CT",
                            "onTheField": true,
                            "fantasyPrice": 352000,
                            "fantasySeasonPriceChange": -11000,
                            "fantasyRoundPriceChange": -7000
                        },
                        {
                            "playerFirstName": "Manu",
                            "playerId": 500722,
                            "playerLastName": "Vatuvei",
                            "playerName": "Manu Vatuvei",
                            "playerPosition": "Winger 2",
                            "playerPositionId": 500005,
                            "playerStats": {
                                "allRunMetres": 61,
                                "allRuns": 7,
                                "dummyHalfRuns": 1,
                                "errors": 1,
                                "fantasyPointsTotal": 9,
                                "hitUps": 1,
                                "kickReturnMetres": 6,
                                "kickReturns": 1,
                                "kicksDefused": 1,
                                "kicksNotDefused": 1,
                                "mins": 53,
                                "oneOnOneTackles": 1,
                                "supports": 5,
                                "tackles": 4,
                                "hitupRunMeters": 12,
                                "evasionRuns": 4,
                                "evasionRunMetres": 37,
                                "dummyHalfRunMetres": 6,
                                "ptbAll": 8,
                                "receipts": 9,
                                "postContactMetres": 26,
                                "kickPressures": 1,
                                "ptbAverage": 2.13,
                                "ptbZeroToOne": 2,
                                "ptbOneToTwo": 1,
                                "ptbTwoToThree": 3,
                                "ptbThreeToFour": 2,
                                "ptbOpp20m": 2,
                                "doubles": 1,
                                "effectiveTacklePercentage": 100,
                                "stint1": 3163
                            },
                            "playerTookTheField": true,
                            "shirtNum": 5,
                            "playerFirstInitial": "M",
                            "playerPositionAbbrev": "WG",
                            "fantasyPrice": 269000
                        },
                        {
                            "playerFirstName": "Ata",
                            "playerId": 501614,
                            "playerLastName": "Hingano",
                            "playerName": "Ata Hingano",
                            "playerPosition": "Five-Eighth",
                            "playerPositionId": 500006,
                            "playerStats": {
                                "allRunMetres": 48,
                                "allRuns": 10,
                                "decoys": 2,
                                "dummyHalfRuns": 1,
                                "fantasyPointsTotal": 24,
                                "ineffectiveTackles": 2,
                                "kickMetres": 90,
                                "kicks": 4,
                                "mins": 80,
                                "missedTackles": 5,
                                "offloads": 1,
                                "passes": 20,
                                "passesPerRun": 2,
                                "oneOnOneTackles": 2,
                                "penalties": 1,
                                "supports": 17,
                                "tackles": 26,
                                "tryCause": 1,
                                "evasionRuns": 9,
                                "evasionRunMetres": 40,
                                "dummyHalfRunMetres": 8,
                                "ptbAll": 7,
                                "receipts": 33,
                                "chipKick": 1,
                                "grubberKick": 1,
                                "crossFieldKick": 1,
                                "postContactMetres": 14,
                                "dummyPasses": 8,
                                "kickPressures": 2,
                                "lineEngagedRuns": 1,
                                "ptbAverage": 4.81,
                                "ptbThreeToFour": 2,
                                "ptbFourToFive": 2,
                                "ptbFivePlus": 3,
                                "ptbOpp20m": 4,
                                "doubles": 5,
                                "longKicksSpace": 1,
                                "effectiveTacklePercentage": 78.8,
                                "ptbPenalties": 1,
                                "stint1": 4800
                            },
                            "playerTookTheField": true,
                            "shirtNum": 6,
                            "playerFirstInitial": "A",
                            "playerPositionAbbrev": "FE",
                            "onTheField": true,
                            "fantasyPrice": 165000,
                            "fantasySeasonPriceChange": 22000,
                            "fantasyRoundPriceChange": 13000
                        },
                        {
                            "playerFirstName": "Shaun",
                            "playerId": 500705,
                            "playerLastName": "Johnson",
                            "playerName": "Shaun Johnson",
                            "playerPosition": "Halfback",
                            "playerPositionId": 500007,
                            "playerStats": {
                                "allRunMetres": 97,
                                "allRuns": 14,
                                "bombKicks": 5,
                                "bombKickMetres": 94,
                                "conversions": 2,
                                "conversionsAttempts": 2,
                                "dummyHalfRuns": 2,
                                "errors": 1,
                                "fantasyPointsTotal": 61,
                                "goalConversionRate": 100,
                                "allGoals": 2,
                                "allGoalsAttempted": 2,
                                "ineffectiveTackles": 4,
                                "kickMetres": 313,
                                "kicks": 15,
                                "linebreaks": 1,
                                "mins": 80,
                                "missedTackles": 2,
                                "passes": 41,
                                "passesPerRun": 2.93,
                                "oneOnOneTackles": 4,
                                "penalties": 1,
                                "points": 8,
                                "supports": 13,
                                "tackleBreaks": 5,
                                "tackles": 14,
                                "tries": 1,
                                "tryCause": 1,
                                "evasionRuns": 12,
                                "evasionRunMetres": 70,
                                "dummyHalfRunMetres": 27,
                                "ptbAll": 5,
                                "receipts": 62,
                                "chipKick": 1,
                                "grubberKick": 3,
                                "crossFieldKick": 2,
                                "postContactMetres": 13,
                                "dummyPasses": 16,
                                "kickPressures": 1,
                                "lineEngagedRuns": 4,
                                "ptbAverage": 4.25,
                                "ptbTwoToThree": 1,
                                "ptbThreeToFour": 1,
                                "ptbFourToFive": 2,
                                "ptbFivePlus": 1,
                                "ptbOpp20m": 2,
                                "doubles": 3,
                                "longKicksSpace": 1,
                                "effectiveTacklePercentage": 70,
                                "offsidePenalties": 1,
                                "stint1": 4800
                            },
                            "playerTookTheField": true,
                            "shirtNum": 7,
                            "playerFirstInitial": "S",
                            "playerPositionAbbrev": "HB",
                            "onTheField": true,
                            "fantasyPrice": 509000,
                            "fantasySeasonPriceChange": 25000,
                            "fantasyRoundPriceChange": 17000
                        },
                        {
                            "playerFirstName": "Albert",
                            "playerId": 500937,
                            "playerLastName": "Vete",
                            "playerName": "Albert Vete",
                            "playerPosition": "Prop 1",
                            "playerPositionId": 500008,
                            "playerStats": {
                                "allRunMetres": 110,
                                "allRuns": 12,
                                "decoys": 10,
                                "fantasyPointsTotal": 26,
                                "hitUps": 11,
                                "kickReturnMetres": 14,
                                "kickReturns": 1,
                                "mins": 37,
                                "missedTackles": 1,
                                "offloads": 2,
                                "passes": 4,
                                "passesPerRun": 0.33,
                                "supports": 6,
                                "tackles": 13,
                                "hitupRunMeters": 96,
                                "ptbAll": 10,
                                "receipts": 16,
                                "postContactMetres": 33,
                                "dummyPasses": 3,
                                "ptbAverage": 3.56,
                                "ptbTwoToThree": 3,
                                "ptbThreeToFour": 4,
                                "ptbFourToFive": 3,
                                "ptbOpp20m": 6,
                                "doubles": 2,
                                "effectiveTacklePercentage": 92.9,
                                "stint1": 1456,
                                "stint2": 759
                            },
                            "playerTookTheField": true,
                            "shirtNum": 8,
                            "playerFirstInitial": "A",
                            "playerPositionAbbrev": "PR",
                            "fantasyPrice": 290000,
                            "fantasySeasonPriceChange": 1000,
                            "fantasyRoundPriceChange": -5000
                        },
                        {
                            "playerFirstName": "Issac",
                            "playerId": 500088,
                            "playerLastName": "Luke",
                            "playerName": "Issac Luke",
                            "playerPosition": "Hooker",
                            "playerPositionId": 500009,
                            "playerStats": {
                                "allRunMetres": 27,
                                "allRuns": 2,
                                "decoys": 1,
                                "dummyHalfRuns": 2,
                                "errors": 2,
                                "fantasyPointsTotal": 18,
                                "kickMetres": 54,
                                "kicks": 1,
                                "lineDropouts": 1,
                                "mins": 80,
                                "missedTackles": 3,
                                "passes": 116,
                                "passesPerRun": 58,
                                "oneOnOneTackles": 1,
                                "penalties": 2,
                                "supports": 4,
                                "tackleBreaks": 1,
                                "tackles": 25,
                                "dummyHalfRunMetres": 27,
                                "ptbAll": 2,
                                "receipts": 119,
                                "postContactMetres": 10,
                                "dummyPasses": 8,
                                "kickPressures": 6,
                                "ptbAverage": 2.5,
                                "ptbOneToTwo": 1,
                                "ptbThreeToFour": 1,
                                "doubles": 4,
                                "longKicksSpace": 1,
                                "effectiveTacklePercentage": 89.3,
                                "foulPlayPenalties": 1,
                                "offsidePenalties": 1,
                                "stint1": 4800
                            },
                            "playerTookTheField": true,
                            "shirtNum": 9,
                            "playerFirstInitial": "I",
                            "playerPositionAbbrev": "HK",
                            "onTheField": true,
                            "fantasyPrice": 416000,
                            "fantasySeasonPriceChange": -43000,
                            "fantasyRoundPriceChange": -22000
                        },
                        {
                            "playerFirstName": "Jacob",
                            "playerId": 500708,
                            "playerLastName": "Lillyman",
                            "playerName": "Jacob Lillyman",
                            "playerPosition": "Prop 2",
                            "playerPositionId": 500010,
                            "playerStats": {
                                "allRunMetres": 177,
                                "allRuns": 20,
                                "decoys": 7,
                                "fantasyPointsTotal": 28,
                                "hitUps": 19,
                                "ineffectiveTackles": 1,
                                "kickReturnMetres": 10,
                                "kickReturns": 1,
                                "mins": 56,
                                "missedTackles": 2,
                                "passes": 5,
                                "passesPerRun": 0.25,
                                "penalties": 2,
                                "supports": 6,
                                "tackles": 19,
                                "tryCause": 1,
                                "hitupRunMeters": 167,
                                "ptbAll": 19,
                                "receipts": 25,
                                "postContactMetres": 52,
                                "dummyPasses": 2,
                                "kickPressures": 2,
                                "ptbAverage": 3.69,
                                "ptbTwoToThree": 2,
                                "ptbThreeToFour": 9,
                                "ptbFourToFive": 8,
                                "ptbOpp20m": 7,
                                "doubles": 2,
                                "effectiveTacklePercentage": 86.4,
                                "foulPlayPenalties": 1,
                                "offsidePenalties": 1,
                                "stint1": 1583,
                                "stint2": 1829
                            },
                            "playerTookTheField": true,
                            "shirtNum": 10,
                            "playerFirstInitial": "J",
                            "playerPositionAbbrev": "PR",
                            "onTheField": true,
                            "fantasyPrice": 329000,
                            "fantasySeasonPriceChange": -8000,
                            "fantasyRoundPriceChange": -2000
                        },
                        {
                            "playerFirstName": "Bodene",
                            "playerId": 500664,
                            "playerLastName": "Thompson",
                            "playerName": "Bodene Thompson",
                            "playerPosition": "2nd Row 1",
                            "playerPositionId": 500011,
                            "playerStats": {
                                "allRunMetres": 70,
                                "allRuns": 7,
                                "decoys": 3,
                                "fantasyPointsTotal": 40,
                                "hitUps": 7,
                                "ineffectiveTackles": 2,
                                "linebreakAssists": 1,
                                "mins": 67,
                                "missedTackles": 2,
                                "offloads": 1,
                                "passes": 2,
                                "passesPerRun": 0.29,
                                "points": 4,
                                "supports": 11,
                                "tackles": 20,
                                "tries": 1,
                                "tryAssists": 1,
                                "tryCause": 1,
                                "hitupRunMeters": 70,
                                "ptbAll": 6,
                                "receipts": 9,
                                "postContactMetres": 27,
                                "dummyPasses": 1,
                                "kickPressures": 1,
                                "ptbAverage": 3.74,
                                "ptbTwoToThree": 1,
                                "ptbThreeToFour": 3,
                                "ptbFourToFive": 2,
                                "ptbOpp20m": 3,
                                "doubles": 5,
                                "effectiveTacklePercentage": 83.3,
                                "stint1": 2401,
                                "stint2": 1636
                            },
                            "playerTookTheField": true,
                            "shirtNum": 11,
                            "playerFirstInitial": "B",
                            "playerPositionAbbrev": "2R",
                            "onTheField": true,
                            "fantasyPrice": 452000,
                            "fantasySeasonPriceChange": -64000,
                            "fantasyRoundPriceChange": -40000
                        },
                        {
                            "playerFirstName": "Ryan",
                            "playerId": 500596,
                            "playerLastName": "Hoffman",
                            "playerName": "Ryan Hoffman",
                            "playerPosition": "2nd Row 2",
                            "playerPositionId": 500012,
                            "playerStats": {
                                "allRunMetres": 84,
                                "allRuns": 10,
                                "decoys": 5,
                                "fantasyPointsTotal": 44,
                                "hitUps": 10,
                                "mins": 77,
                                "offloads": 1,
                                "passes": 1,
                                "passesPerRun": 0.1,
                                "oneOnOneTackles": 2,
                                "supports": 21,
                                "tackles": 34,
                                "hitupRunMeters": 84,
                                "ptbAll": 9,
                                "receipts": 11,
                                "postContactMetres": 37,
                                "kickPressures": 3,
                                "ptbAverage": 3.87,
                                "ptbTwoToThree": 3,
                                "ptbThreeToFour": 1,
                                "ptbFourToFive": 3,
                                "ptbFivePlus": 2,
                                "ptbOpp20m": 5,
                                "doubles": 4,
                                "effectiveTacklePercentage": 100,
                                "stint1": 2195,
                                "stint2": 2399
                            },
                            "playerTookTheField": true,
                            "shirtNum": 12,
                            "isCaptain": true,
                            "playerFirstInitial": "R",
                            "playerPositionAbbrev": "2R",
                            "onTheField": true,
                            "fantasyPrice": 345000,
                            "fantasySeasonPriceChange": 24000,
                            "fantasyRoundPriceChange": 5000
                        },
                        {
                            "playerFirstName": "Simon",
                            "playerId": 500712,
                            "playerLastName": "Mannering",
                            "playerName": "Simon Mannering",
                            "playerPosition": "Lock",
                            "playerPositionId": 500013,
                            "playerStats": {
                                "allRunMetres": 122,
                                "allRuns": 14,
                                "decoys": 11,
                                "fantasyPointsTotal": 61,
                                "hitUps": 13,
                                "ineffectiveTackles": 1,
                                "mins": 80,
                                "passes": 9,
                                "passesPerRun": 0.64,
                                "oneOnOneTackles": 5,
                                "supports": 10,
                                "tackles": 49,
                                "hitupRunMeters": 116,
                                "evasionRuns": 1,
                                "evasionRunMetres": 6,
                                "ptbAll": 13,
                                "receipts": 22,
                                "postContactMetres": 44,
                                "dummyPasses": 9,
                                "kickPressures": 1,
                                "lineEngagedRuns": 1,
                                "ptbAverage": 3.55,
                                "ptbTwoToThree": 4,
                                "ptbThreeToFour": 6,
                                "ptbFourToFive": 2,
                                "ptbFivePlus": 1,
                                "ptbOpp20m": 9,
                                "doubles": 4,
                                "effectiveTacklePercentage": 98,
                                "stint1": 4800
                            },
                            "playerTookTheField": true,
                            "shirtNum": 13,
                            "playerFirstInitial": "S",
                            "playerPositionAbbrev": "LK",
                            "onTheField": true,
                            "fantasyPrice": 515000,
                            "fantasySeasonPriceChange": -35000,
                            "fantasyRoundPriceChange": -17000
                        },
                        {
                            "playerFirstName": "Erin",
                            "playerId": 503685,
                            "playerLastName": "Clark",
                            "playerName": "Erin Clark",
                            "playerPosition": "Interchange",
                            "playerPositionId": 500014,
                            "playerStats": [],
                            "shirtNum": 14,
                            "playerFirstInitial": "E",
                            "playerPositionAbbrev": "INT",
                            "fantasyPrice": 138000
                        },
                        {
                            "playerFirstName": "Sam",
                            "playerId": 500926,
                            "playerLastName": "Lisone",
                            "playerName": "Sam Lisone",
                            "playerPosition": "Interchange",
                            "playerPositionId": 500014,
                            "playerStats": {
                                "allRunMetres": 67,
                                "allRuns": 8,
                                "decoys": 4,
                                "fantasyPointsTotal": 34,
                                "hitUps": 7,
                                "ineffectiveTackles": 1,
                                "mins": 41,
                                "missedTackles": 2,
                                "passes": 6,
                                "passesPerRun": 0.75,
                                "oneOnOneTackles": 2,
                                "supports": 6,
                                "tackleBreaks": 2,
                                "tackles": 26,
                                "tryCause": 1,
                                "hitupRunMeters": 58,
                                "evasionRuns": 1,
                                "evasionRunMetres": 9,
                                "ptbAll": 7,
                                "receipts": 13,
                                "postContactMetres": 22,
                                "dummyPasses": 1,
                                "kickPressures": 2,
                                "lineEngagedRuns": 1,
                                "ptbAverage": 2.61,
                                "ptbOneToTwo": 2,
                                "ptbTwoToThree": 4,
                                "ptbFourToFive": 1,
                                "ptbOpp20m": 2,
                                "doubles": 4,
                                "effectiveTacklePercentage": 89.7,
                                "stint1": 1670,
                                "stint2": 785
                            },
                            "playerTookTheField": true,
                            "shirtNum": 15,
                            "playerFirstInitial": "S",
                            "playerPositionAbbrev": "INT",
                            "onTheField": true,
                            "fantasyPrice": 250000,
                            "fantasySeasonPriceChange": 10000,
                            "fantasyRoundPriceChange": 9000
                        },
                        {
                            "playerFirstName": "Charlie",
                            "playerId": 500701,
                            "playerLastName": "Gubb",
                            "playerName": "Charlie Gubb",
                            "playerPosition": "Interchange",
                            "playerPositionId": 500014,
                            "playerStats": {
                                "allRunMetres": 66,
                                "allRuns": 7,
                                "decoys": 4,
                                "fantasyPointsTotal": 24,
                                "hitUps": 6,
                                "kickReturnMetres": 14,
                                "kickReturns": 1,
                                "mins": 26,
                                "supports": 4,
                                "tackles": 18,
                                "hitupRunMeters": 52,
                                "ptbAll": 7,
                                "receipts": 7,
                                "postContactMetres": 20,
                                "dummyPasses": 1,
                                "ptbAverage": 2.87,
                                "ptbOneToTwo": 1,
                                "ptbTwoToThree": 2,
                                "ptbThreeToFour": 4,
                                "ptbOpp20m": 1,
                                "doubles": 2,
                                "effectiveTacklePercentage": 100,
                                "stint1": 1515
                            },
                            "playerTookTheField": true,
                            "shirtNum": 16,
                            "playerFirstInitial": "C",
                            "playerPositionAbbrev": "INT",
                            "fantasyPrice": 229000,
                            "fantasySeasonPriceChange": 29000,
                            "fantasyRoundPriceChange": 12000
                        },
                        {
                            "playerFirstName": "Bunty",
                            "playerId": 501744,
                            "playerLastName": "Afoa",
                            "playerName": "Bunty Afoa",
                            "playerPosition": "Interchange",
                            "playerPositionId": 500014,
                            "playerStats": {
                                "allRunMetres": 55,
                                "allRuns": 7,
                                "decoys": 6,
                                "fantasyPointsTotal": 28,
                                "hitUps": 7,
                                "ineffectiveTackles": 1,
                                "mins": 43,
                                "missedTackles": 1,
                                "passes": 3,
                                "passesPerRun": 0.43,
                                "oneOnOneTackles": 1,
                                "supports": 9,
                                "tackles": 25,
                                "hitupRunMeters": 55,
                                "ptbAll": 8,
                                "receipts": 11,
                                "postContactMetres": 23,
                                "kickPressures": 1,
                                "ptbAverage": 4.97,
                                "ptbThreeToFour": 2,
                                "ptbFourToFive": 3,
                                "ptbFivePlus": 3,
                                "ptbOpp20m": 6,
                                "doubles": 5,
                                "effectiveTacklePercentage": 92.6,
                                "stint1": 2605
                            },
                            "playerTookTheField": true,
                            "shirtNum": 17,
                            "playerFirstInitial": "B",
                            "playerPositionAbbrev": "INT",
                            "onTheField": true,
                            "fantasyPrice": 334000,
                            "fantasySeasonPriceChange": 33000,
                            "fantasyRoundPriceChange": 20000
                        }
                    ]
                },
                "teamName": "New Zealand Warriors",
                "teamNickName": "Warriors",
                "teamStats": {
                    "allRunMetres": 1400,
                    "allRuns": 170,
                    "bombKicks": 5,
                    "bombKickMetres": 94,
                    "bombKicksDefused": 2,
                    "bombKicksNotDefused": 1,
                    "completeSets": 32,
                    "completionPercentage": 80,
                    "conversions": 2,
                    "conversionsAttempts": 2,
                    "decoys": 60,
                    "dummyHalfRuns": 10,
                    "errors": 10,
                    "goalConversionRate": 100,
                    "allGoals": 2,
                    "allGoalsAttempted": 2,
                    "hitUps": 81,
                    "incompleteSets": 8,
                    "ineffectiveTackles": 14,
                    "kickMetres": 538,
                    "kickReturnMetres": 152,
                    "kickReturns": 18,
                    "kicks": 24,
                    "kicksDefused": 9,
                    "kicksNotDefused": 3,
                    "lineDropouts": 1,
                    "linebreakAssists": 1,
                    "linebreaks": 1,
                    "missedTackles": 24,
                    "offloads": 8,
                    "oneOnOneTackles": 24,
                    "passes": 223,
                    "passesPerRun": 1.31,
                    "penalties": 7,
                    "points": 12,
                    "pointsConceded": 24,
                    "possession": 53,
                    "scrumWins": 6,
                    "supports": 171,
                    "tackleBreaks": 14,
                    "tackles": 298,
                    "sets": 40,
                    "tries": 2,
                    "triesConceded": 4,
                    "tryAssists": 1,
                    "tryCause": 9,
                    "hitupRunMeters": 710,
                    "evasionRuns": 61,
                    "evasionRunMetres": 450,
                    "dummyHalfRunMetres": 88,
                    "ptbTotal": 147,
                    "twoManTackles": 76,
                    "threeManTackles": 47,
                    "fourManPlusTackles": 3,
                    "tryScoringPercentage": 5,
                    "shiftsLeft": 12,
                    "shiftsRight": 14,
                    "receipts": 410,
                    "forcedDropOutKicker": 1,
                    "chipKick": 2,
                    "grubberKick": 7,
                    "crossFieldKick": 3,
                    "postContactMetres": 456,
                    "dummyPasses": 59,
                    "kickPressures": 21,
                    "lineEngagedRuns": 7,
                    "ptbAverage": 3.56,
                    "ptbZeroToOne": 2,
                    "ptbOneToTwo": 11,
                    "ptbTwoToThree": 33,
                    "ptbThreeToFour": 53,
                    "ptbFourToFive": 35,
                    "ptbFivePlus": 13,
                    "ptbOpp20m": 55,
                    "interchangeUsed": 6,
                    "interchangeLeft": 2,
                    "doubles": 42,
                    "longKicksSpace": 3,
                    "effectiveTacklePercentage": 88.7,
                    "ptbPenalties": 1,
                    "generalPlayPenalties": 1,
                    "foulPlayPenalties": 3,
                    "offsidePenalties": 3,
                    "averageSetDistance": 35,
                    "completeSets1stHalf": 17,
                    "completeSets2ndHalf": 15,
                    "completionPercentage1stHalf": 85,
                    "completionPercentage2ndHalf": 75,
                    "incompleteSets1stHalf": 3,
                    "incompleteSets2ndHalf": 5,
                    "incompletionPercentage1stHalf": 15,
                    "incompletionPercentage2ndHalf": 25,
                    "kickReceiptRuns": 13,
                    "kickReceiptMetres": 101,
                    "averageOneManTackleTiming": 3.83,
                    "averageTwoManTackleTiming": 3.46,
                    "averageThreeManTackleTiming": 3.53,
                    "averageFourManTackleTiming": 4.08
                },
                "teamHexColour": "cccccc",
                "teamHexColour2": "000000",
                "teamCoaches": {
                    "teamCoach": [
                        {
                            "coachId": 50015,
                            "coachName": "Stephen Kearney",
                            "coachRoleId": 12,
                            "coachRole": "Coach"
                        }
                    ]
                }
            }
        ]
    }
}