{
    "vod": [
        {
            "id": "Z3YjVtYTE6sRGE9z5bUvk0ddXEzVw0m6",
            "contentId": 900977,
            "title": "Rd 5: Storm v Panthers (2nd Half)",
            "description": "Second half replay of the clash between the Storm & Panthers",
            "publishDate": "2017-04-02T09:20:00+10:00",
            "publisher": "NRL Chief",
            "thumbnailUrl": "http://bpvideos.telstra.insnw.net/web/images/20170401220848a_89x50.jpg",
            "largeThumbnailUrl": "http://bpvideos.telstra.insnw.net/web/images/20170401220848a_326x184.jpg",
            "programType": "Matches",
            "programCategory": "Replay: 2nd Half",
            "priority": null,
            "lastUpdateDate": "2017-04-01T22:46:36+11:00",
            "isPremium": true,
            "club": [
                500021,
                500014
            ]
        },
        {
            "id": "prYjVtYTE6Wri-Y0oxTpOj513nXOkJZq",
            "contentId": 900967,
            "title": "Rd 5: Storm v Panthers (1st Half)",
            "description": "First half replay of the clash between the Storm & Panthers",
            "publishDate": "2017-04-02T09:19:00+10:00",
            "publisher": "NRL Chief",
            "thumbnailUrl": "http://bpvideos.telstra.insnw.net/web/images/20170401220803a_89x50.jpg",
            "largeThumbnailUrl": "http://bpvideos.telstra.insnw.net/web/images/20170401220803a_326x184.jpg",
            "programType": "Matches",
            "programCategory": "Replay: 1st Half",
            "priority": null,
            "lastUpdateDate": "2017-04-01T22:40:36+11:00",
            "isPremium": true,
            "club": [
                500021,
                500014
            ]
        },
        {
            "id": "c3NDVtYTE68gnfRe_ef13gbkNDhy4Ezn",
            "contentId": 900959,
            "title": "Rd 5: Storm v Panthers (Hls)",
            "description": "Highlights of the Round 5 clash between the Storm and Panthers",
            "publishDate": "2017-04-01T21:39:00+11:00",
            "publisher": "NRL Chief",
            "thumbnailUrl": "http://bpvideos.telstra.insnw.net/web/images/20170401212017a_89x50.jpg",
            "largeThumbnailUrl": "http://bpvideos.telstra.insnw.net/web/images/20170401212017a_326x184.jpg",
            "programType": "Highlights",
            "programCategory": "Match",
            "priority": null,
            "lastUpdateDate": "2017-04-01T21:48:24+11:00",
            "isPremium": false,
            "club": [
                500021,
                500014
            ]
        },
        {
            "id": "FjajVtYTE6GfDWUIG8wr9T9nCyxGzsY6",
            "contentId": 900997,
            "title": "Rd 5 Press Conference: Storm",
            "description": "Storm coach Craig Bellamy answers the media's post-game questions",
            "publishDate": "2017-04-01T22:38:00+11:00",
            "publisher": "NRL Chief",
            "thumbnailUrl": "http://bpvideos.telstra.insnw.net/web/images/20170401222159a_89x50.jpg",
            "largeThumbnailUrl": "http://bpvideos.telstra.insnw.net/web/images/20170401222159a_326x184.jpg",
            "programType": "Press Conference",
            "programCategory": null,
            "priority": null,
            "lastUpdateDate": "2017-04-01T22:52:38+11:00",
            "isPremium": false,
            "club": [
                500021,
                500014
            ]
        },
        {
            "id": "tyYTVtYTE6EZBClMclcGBZM85x6AIJQH",
            "contentId": 900996,
            "title": "Rd 5 Press Conference: Panthers",
            "description": "Panthers coach Anthony Griffin answers the media's post-game questions",
            "publishDate": "2017-04-01T22:05:00+11:00",
            "publisher": "NRL Chief",
            "thumbnailUrl": "http://bpvideos.telstra.insnw.net/web/images/20170401220034a_89x50.jpg",
            "largeThumbnailUrl": "http://bpvideos.telstra.insnw.net/web/images/20170401220034a_326x184.jpg",
            "programType": "Press Conference",
            "programCategory": null,
            "priority": null,
            "lastUpdateDate": "2017-04-01T22:16:30+11:00",
            "isPremium": false,
            "club": [
                500021,
                500014
            ]
        },
        {
            "id": "I5eDRtYTE6TNWZjiyimeiIXXRsvQ64-O",
            "contentId": 901898,
            "title": "Rd 5: TRY Suliasi Vunivalu (80th min)",
            "description": "Suliasi Vunivalu scores his second try for the Storm",
            "publishDate": "2017-04-01T21:19:42+11:00",
            "publisher": "NRL Chief",
            "thumbnailUrl": "http://bpvideos.telstra.insnw.net/web/images/20170401211831a_89x50.jpg",
            "largeThumbnailUrl": "http://bpvideos.telstra.insnw.net/web/images/20170401211831a_326x184.jpg",
            "programType": "Instant Replay",
            "programCategory": "Score",
            "priority": null,
            "lastUpdateDate": "2017-04-01T21:24:17+11:00",
            "isPremium": true,
            "club": [
                500021,
                500014
            ]
        },
        {
            "id": "Z1dTRtYTE6bS9ajCaODYr84IeOuvLA7v",
            "contentId": 901891,
            "title": "Rd 5: GOAL Cameron Smith (73rd min)",
            "description": "Cameron Smith kicks the Storm a further two points ahead",
            "publishDate": "2017-04-01T21:10:24+11:00",
            "publisher": "NRL Chief",
            "thumbnailUrl": "http://bpvideos.telstra.insnw.net/web/images/20170401211010a_89x50.jpg",
            "largeThumbnailUrl": "http://bpvideos.telstra.insnw.net/web/images/20170401211010a_326x184.jpg",
            "programType": "Instant Replay",
            "programCategory": "Score",
            "priority": null,
            "lastUpdateDate": "2017-04-01T21:16:15+11:00",
            "isPremium": true,
            "club": [
                500021,
                500014
            ]
        },
        {
            "id": "9rdTRtYTE6qx1rHO5KN8weDO4L3ki_R0",
            "contentId": 901893,
            "title": "Rd 5: TRY Josh Addo-Carr (71st min)",
            "description": "Josh Addo-Carr streaks away to score for the Storm",
            "publishDate": "2017-04-01T21:09:09+11:00",
            "publisher": "NRL Chief",
            "thumbnailUrl": "http://bpvideos.telstra.insnw.net/web/images/20170401210943a_89x50.jpg",
            "largeThumbnailUrl": "http://bpvideos.telstra.insnw.net/web/images/20170401210943a_326x184.jpg",
            "programType": "Instant Replay",
            "programCategory": "Score",
            "priority": null,
            "lastUpdateDate": "2017-04-01T21:15:15+11:00",
            "isPremium": true,
            "club": [
                500021,
                500014
            ]
        },
        {
            "id": "Q4czRtYTE65lwqbVoSTCPsFM1dTyrTX5",
            "contentId": 901888,
            "title": "Rd 5: PENALTY GOAL Cameron Smith (61st min)",
            "description": "Cameron Smith adds another two points to the Storm's lead",
            "publishDate": "2017-04-01T20:59:24+11:00",
            "publisher": "NRL Chief",
            "thumbnailUrl": "http://bpvideos.telstra.insnw.net/web/images/20170401205938a_89x50.jpg",
            "largeThumbnailUrl": "http://bpvideos.telstra.insnw.net/web/images/20170401205938a_326x184.jpg",
            "programType": "Instant Replay",
            "programCategory": "Score",
            "priority": null,
            "lastUpdateDate": "2017-04-01T21:05:13+11:00",
            "isPremium": true,
            "club": [
                500021,
                500014
            ]
        },
        {
            "id": "9wbjRtYTE6L5UQOItpVCiY2iBcU5t-Xl",
            "contentId": 901883,
            "title": "Rd 5: GOAL Cameron Smith (43rd min)",
            "description": "Cameron Smith converts the try of Cooper Cronk",
            "publishDate": "2017-04-01T20:43:12+11:00",
            "publisher": "NRL Chief",
            "thumbnailUrl": "http://bpvideos.telstra.insnw.net/web/images/20170401204232a_89x50.jpg",
            "largeThumbnailUrl": "http://bpvideos.telstra.insnw.net/web/images/20170401204232a_326x184.jpg",
            "programType": "Instant Replay",
            "programCategory": "Score",
            "priority": null,
            "lastUpdateDate": "2017-04-01T20:48:10+11:00",
            "isPremium": true,
            "club": [
                500021,
                500014
            ]
        },
        {
            "id": "FubjRtYTE6BkFLf1mrKPKysRSaZrDCy1",
            "contentId": 901882,
            "title": "Rd 5: TRY Cooper Cronk (42nd min)",
            "description": "The Storm halfback scores the first points of the second half",
            "publishDate": "2017-04-01T20:43:10+11:00",
            "publisher": "NRL Chief",
            "thumbnailUrl": "http://bpvideos.telstra.insnw.net/web/images/20170401204222a_89x50.jpg",
            "largeThumbnailUrl": "http://bpvideos.telstra.insnw.net/web/images/20170401204222a_326x184.jpg",
            "programType": "Instant Replay",
            "programCategory": "Score",
            "priority": null,
            "lastUpdateDate": "2017-04-01T20:48:10+11:00",
            "isPremium": true,
            "club": [
                500021,
                500014
            ]
        },
        {
            "id": "o1ZDRtYTE6_GR3enjn7AZhiWbsXi7rXE",
            "contentId": 901866,
            "title": "Rd 5: GOAL Nathan Cleary (28th min)",
            "description": "Nathan Cleary adds another two to the Panthers' tally",
            "publishDate": "2017-04-01T20:05:41+11:00",
            "publisher": "NRL Chief",
            "thumbnailUrl": "http://bpvideos.telstra.insnw.net/web/images/20170401200520a_89x50.jpg",
            "largeThumbnailUrl": "http://bpvideos.telstra.insnw.net/web/images/20170401200520a_326x184.jpg",
            "programType": "Instant Replay",
            "programCategory": "Score",
            "priority": null,
            "lastUpdateDate": "2017-04-01T20:11:01+11:00",
            "isPremium": true,
            "club": [
                500021,
                500014
            ]
        },
        {
            "id": "x3YzRtYTE6zKxIXDGo8ELuTYLOCGPpww",
            "contentId": 901865,
            "title": "Rd 5: TRY Te Maire Martin (26th min)",
            "description": "Te Maire Martin opens the Panthers' account for the evening",
            "publishDate": "2017-04-01T20:05:27+11:00",
            "publisher": "NRL Chief",
            "thumbnailUrl": "http://bpvideos.telstra.insnw.net/web/images/20170401200309a_89x50.jpg",
            "largeThumbnailUrl": "http://bpvideos.telstra.insnw.net/web/images/20170401200309a_326x184.jpg",
            "programType": "Instant Replay",
            "programCategory": "Score",
            "priority": null,
            "lastUpdateDate": "2017-04-01T20:11:01+11:00",
            "isPremium": true,
            "club": [
                500021,
                500014
            ]
        },
        {
            "id": "V1YTRtYTE6Ly2kqLZ__gLsq5mcH3RTWI",
            "contentId": 901851,
            "title": "Rd 5: GOAL Cameron Smith (21st min)",
            "description": "Cameron Smith converts the try of Will Chambers",
            "publishDate": "2017-04-01T19:58:41+11:00",
            "publisher": "NRL Chief",
            "thumbnailUrl": "http://bpvideos.telstra.insnw.net/web/images/20170401195829a_89x50.jpg",
            "largeThumbnailUrl": "http://bpvideos.telstra.insnw.net/web/images/20170401195829a_326x184.jpg",
            "programType": "Instant Replay",
            "programCategory": "Score",
            "priority": null,
            "lastUpdateDate": "2017-04-01T20:05:03+11:00",
            "isPremium": true,
            "club": [
                500021,
                500014
            ]
        },
        {
            "id": "VlYTRtYTE65c2XnU6LgBY6QlEP4bIGrk",
            "contentId": 901862,
            "title": "Rd 5: TRY Will Chambers (20th min)",
            "description": "Will Chambers extends the Storm's lead",
            "publishDate": "2017-04-01T19:58:30+11:00",
            "publisher": "NRL Chief",
            "thumbnailUrl": "http://bpvideos.telstra.insnw.net/web/images/20170401195818a_89x50.jpg",
            "largeThumbnailUrl": "http://bpvideos.telstra.insnw.net/web/images/20170401195818a_326x184.jpg",
            "programType": "Instant Replay",
            "programCategory": "Score",
            "priority": null,
            "lastUpdateDate": "2017-04-01T20:03:59+11:00",
            "isPremium": true,
            "club": [
                500021,
                500014
            ]
        },
        {
            "id": "c5dzNtYTE6EyBfBn6ZIY59GkV_RT9gV5",
            "contentId": 901850,
            "title": "Rd 5: TRY Suliasi Vunivalu (8th min)",
            "description": "Suliasi Vunivalu opens the scoring for the Melbourne Storm",
            "publishDate": "2017-04-01T19:43:55+11:00",
            "publisher": "NRL Chief",
            "thumbnailUrl": "http://bpvideos.telstra.insnw.net/web/images/20170401194302a_89x50.jpg",
            "largeThumbnailUrl": "http://bpvideos.telstra.insnw.net/web/images/20170401194302a_326x184.jpg",
            "programType": "Instant Replay",
            "programCategory": "Score",
            "priority": null,
            "lastUpdateDate": "2017-04-01T19:49:55+11:00",
            "isPremium": true,
            "club": [
                500021,
                500014
            ]
        }
    ],
    "scores": [
        {
            "gameState": "First Half",
            "gameStateId": 3,
            "gameTime": "0:07:12",
            "gameSeconds": 432,
            "GameMinutes": "07:12",
            "playerId": 502107,
            "playerName": "Suliasi Vunivalu",
            "scoreMethod": "Try",
            "statEvent": "Try",
            "statId": 38,
            "statValue": 4,
            "vidRef": 13995,
            "homeScore": 4,
            "commentary": "Try by Suliasi Vunivalu",
            "tackleNum": 6,
            "utcTime": "2017-04-01T08:39:13Z",
            "teamId": 500021,
            "teamName": "Melbourne Storm",
            "homeTeamAbbrv": "MEL",
            "awayTeamAbbrv": "PEN"
        },
        {
            "gameState": "First Half",
            "gameStateId": 3,
            "gameTime": "0:19:19",
            "gameSeconds": 1159,
            "GameMinutes": "19:19",
            "playerId": 500586,
            "playerName": "Will Chambers",
            "scoreMethod": "Try",
            "statEvent": "Try",
            "statId": 38,
            "statValue": 4,
            "vidRef": 33871,
            "homeScore": 10,
            "commentary": "Try by Will Chambers",
            "tackleNum": 4,
            "utcTime": "2017-04-01T08:52:28Z",
            "teamId": 500021,
            "teamName": "Melbourne Storm",
            "homeTeamAbbrv": "MEL",
            "awayTeamAbbrv": "PEN"
        },
        {
            "gameState": "First Half",
            "gameStateId": 3,
            "gameTime": "0:19:19",
            "gameSeconds": 1159,
            "GameMinutes": "19:19",
            "playerId": 500609,
            "playerName": "Cameron Smith",
            "scoreMethod": "Conversion",
            "statEvent": "Conversion-Made",
            "statId": 1,
            "statValue": 2,
            "vidRef": 35434,
            "homeScore": 10,
            "commentary": "Conversion-Made by Cameron Smith",
            "tackleNum": -1,
            "utcTime": "2017-04-01T08:53:30Z",
            "teamId": 500021,
            "teamName": "Melbourne Storm",
            "homeTeamAbbrv": "MEL",
            "awayTeamAbbrv": "PEN"
        },
        {
            "gameState": "Second Half",
            "gameStateId": 5,
            "gameTime": "0:41:06",
            "gameSeconds": 2466,
            "GameMinutes": "41:06",
            "playerId": 500587,
            "playerName": "Cooper Cronk",
            "scoreMethod": "Try",
            "statEvent": "Try",
            "statId": 38,
            "statValue": 4,
            "vidRef": 93997,
            "homeScore": 14,
            "awayScore": 6,
            "commentary": "Try by Cooper Cronk",
            "tackleNum": 3,
            "utcTime": "2017-04-01T09:32:33Z",
            "teamId": 500021,
            "teamName": "Melbourne Storm",
            "homeTeamAbbrv": "MEL",
            "awayTeamAbbrv": "PEN"
        },
        {
            "gameState": "Second Half",
            "gameStateId": 5,
            "gameTime": "0:42:24",
            "gameSeconds": 2544,
            "GameMinutes": "42:24",
            "playerId": 500609,
            "playerName": "Cameron Smith",
            "scoreMethod": "Conversion",
            "statEvent": "Conversion-Made",
            "statId": 1,
            "statValue": 2,
            "vidRef": 95935,
            "homeScore": 16,
            "awayScore": 6,
            "commentary": "Conversion-Made by Cameron Smith",
            "tackleNum": -1,
            "utcTime": "2017-04-01T09:33:50Z",
            "teamId": 500021,
            "teamName": "Melbourne Storm",
            "homeTeamAbbrv": "MEL",
            "awayTeamAbbrv": "PEN"
        },
        {
            "gameState": "Second Half",
            "gameStateId": 5,
            "gameTime": "1:00:41",
            "gameSeconds": 3641,
            "GameMinutes": "60:41",
            "playerId": 500609,
            "playerName": "Cameron Smith",
            "scoreMethod": "Penalty Goal",
            "statEvent": "Penalty Shot-Made",
            "statId": 67,
            "statValue": 2,
            "vidRef": 123380,
            "homeScore": 18,
            "awayScore": 6,
            "commentary": "Penalty Shot-Made by Cameron Smith",
            "tackleNum": -1,
            "utcTime": "2017-04-01T09:52:08Z",
            "teamId": 500021,
            "teamName": "Melbourne Storm",
            "homeTeamAbbrv": "MEL",
            "awayTeamAbbrv": "PEN"
        },
        {
            "gameState": "Second Half",
            "gameStateId": 5,
            "gameTime": "1:10:23",
            "gameSeconds": 4223,
            "GameMinutes": "70:23",
            "playerId": 501351,
            "playerName": "Josh Addo-Carr",
            "scoreMethod": "Try",
            "statEvent": "Try",
            "statId": 38,
            "statValue": 4,
            "vidRef": 143619,
            "homeScore": 22,
            "awayScore": 6,
            "commentary": "Try by Josh Addo-Carr",
            "tackleNum": 1,
            "utcTime": "2017-04-01T10:05:38Z",
            "teamId": 500021,
            "teamName": "Melbourne Storm",
            "homeTeamAbbrv": "MEL",
            "awayTeamAbbrv": "PEN"
        },
        {
            "gameState": "Second Half",
            "gameStateId": 5,
            "gameTime": "1:12:06",
            "gameSeconds": 4326,
            "GameMinutes": "72:06",
            "playerId": 500609,
            "playerName": "Cameron Smith",
            "scoreMethod": "Conversion",
            "statEvent": "Conversion-Made",
            "statId": 1,
            "statValue": 2,
            "vidRef": 146191,
            "homeScore": 24,
            "awayScore": 6,
            "commentary": "Conversion-Made by Cameron Smith",
            "tackleNum": -1,
            "utcTime": "2017-04-01T10:07:21Z",
            "teamId": 500021,
            "teamName": "Melbourne Storm",
            "homeTeamAbbrv": "MEL",
            "awayTeamAbbrv": "PEN"
        },
        {
            "gameState": "Second Half",
            "gameStateId": 5,
            "gameTime": "1:19:48",
            "gameSeconds": 4788,
            "GameMinutes": "79:48",
            "playerId": 502107,
            "playerName": "Suliasi Vunivalu",
            "scoreMethod": "Try",
            "statEvent": "Try",
            "statId": 38,
            "statValue": 4,
            "vidRef": 161439,
            "homeScore": 28,
            "awayScore": 6,
            "commentary": "Try by Suliasi Vunivalu",
            "tackleNum": 4,
            "utcTime": "2017-04-01T10:17:31Z",
            "teamId": 500021,
            "teamName": "Melbourne Storm",
            "homeTeamAbbrv": "MEL",
            "awayTeamAbbrv": "PEN"
        },
        {
            "gameState": "First Half",
            "gameStateId": 3,
            "gameTime": "0:25:39",
            "gameSeconds": 1539,
            "GameMinutes": "25:39",
            "playerId": 501293,
            "playerName": "Te Maire Martin",
            "scoreMethod": "Try",
            "statEvent": "Try",
            "statId": 38,
            "statValue": 4,
            "vidRef": 44937,
            "homeScore": 10,
            "awayScore": 4,
            "commentary": "Try by Te Maire Martin",
            "tackleNum": 5,
            "utcTime": "2017-04-01T08:59:50Z",
            "teamId": 500014,
            "teamName": "Penrith Panthers",
            "homeTeamAbbrv": "MEL",
            "awayTeamAbbrv": "PEN"
        },
        {
            "gameState": "First Half",
            "gameStateId": 3,
            "gameTime": "0:27:04",
            "gameSeconds": 1624,
            "GameMinutes": "27:04",
            "playerId": 504120,
            "playerName": "Nathan Cleary",
            "scoreMethod": "Conversion",
            "statEvent": "Conversion-Made",
            "statId": 1,
            "statValue": 2,
            "vidRef": 47185,
            "homeScore": 10,
            "awayScore": 6,
            "commentary": "Conversion-Made by Nathan Cleary",
            "tackleNum": -1,
            "utcTime": "2017-04-01T09:01:20Z",
            "teamId": 500014,
            "teamName": "Penrith Panthers",
            "homeTeamAbbrv": "MEL",
            "awayTeamAbbrv": "PEN"
        }
    ],
    "twitter": [
        {
            "id": "848119012655419392",
            "gameSeconds": 4740
        },
        {
            "id": "848115049478606848",
            "gameSeconds": 4200
        },
        {
            "id": "848113282674077697",
            "gameSeconds": 3780
        },
        {
            "id": "848112787591057408",
            "gameSeconds": 3780
        },
        {
            "id": "848096210242093056",
            "gameSeconds": 1200
        },
        {
            "id": "848096013772496896",
            "gameSeconds": 1200
        }
    ]
}