{
    "vod": [
        {
            "id": "NlNzJqYjE6PrI1nUx8t1pQ09miRoJI_f",
            "contentId": 916784,
            "title": "Rd 14: Panthers v Raiders (Hls)",
            "description": "Highlights of the Round 14 clash between the Panthers & Raiders",
            "publishDate": "2017-06-10T19:41:10+10:00",
            "publisher": "NRL Chief",
            "thumbnailUrl": "http://bpvideos.telstra.insnw.net/web/images/20170610193348a_89x50.jpg",
            "largeThumbnailUrl": "http://bpvideos.telstra.insnw.net/web/images/20170610193348a_326x184.jpg",
            "programType": "Highlights",
            "programCategory": "Match",
            "priority": null,
            "lastUpdateDate": "2017-06-10T19:45:57+10:00",
            "isPremium": false,
            "club": [
                500013,
                500014
            ]
        },
        {
            "id": "twZTJqYjE6xh2eqe1dNJLTL2AJtULqcP",
            "contentId": 917225,
            "title": "Rd 14 Press Conference: Raiders",
            "description": "Raiders coach Ricky Stuart speaks to the media following their Round 14 clash",
            "publishDate": "2017-06-10T20:17:30+10:00",
            "publisher": "NRL Chief",
            "thumbnailUrl": "http://bpvideos.telstra.insnw.net/web/images/20170610201729a_89x50.jpg",
            "largeThumbnailUrl": "http://bpvideos.telstra.insnw.net/web/images/20170610201729a_326x184.jpg",
            "programType": "Press Conference",
            "programCategory": null,
            "priority": null,
            "lastUpdateDate": "2017-06-10T20:23:06+10:00",
            "isPremium": false,
            "club": [
                500013,
                500014
            ]
        },
        {
            "id": "E1ZTJqYjE6IwlRgHFgjzue2pGnfPHwWy",
            "contentId": 917218,
            "title": "Rd 14 Press Conference: Panthers",
            "description": "Panthers coach Anthony Griffin speaks to the media following their Round 14 clash",
            "publishDate": "2017-06-10T20:14:00+10:00",
            "publisher": "NRL Chief",
            "thumbnailUrl": "http://bpvideos.telstra.insnw.net/web/images/20170610201429a_89x50.jpg",
            "largeThumbnailUrl": "http://bpvideos.telstra.insnw.net/web/images/20170610201429a_326x184.jpg",
            "programType": "Press Conference",
            "programCategory": null,
            "priority": null,
            "lastUpdateDate": "2017-06-10T20:20:05+10:00",
            "isPremium": false,
            "club": [
                500013,
                500014
            ]
        },
        {
            "id": "1zMzJqYjE6rNMboS4p8rF1sQWZrMh4Xm",
            "contentId": 917660,
            "title": "Rd 14: GOAL Nathan Cleary (80th min)",
            "description": "Nathan Cleary adds the two points to cap off a remarkable win",
            "publishDate": "2017-06-10T19:26:56+10:00",
            "publisher": "NRL Chief",
            "thumbnailUrl": "http://bpvideos.telstra.insnw.net/web/images/20170610192618a_89x50.jpg",
            "largeThumbnailUrl": "http://bpvideos.telstra.insnw.net/web/images/20170610192618a_326x184.jpg",
            "programType": "Instant Replay",
            "programCategory": "Score",
            "priority": null,
            "lastUpdateDate": "2017-06-10T19:30:54+10:00",
            "isPremium": true,
            "club": [
                500013,
                500014
            ]
        },
        {
            "id": "VxMzJqYjE6t8-j2FHemPVVnTbc03RVI3",
            "contentId": 917661,
            "title": "Rd 14: TRY Tyrone Peachey (80th min)",
            "description": "Tyrone Peachey scores an incredible try to snatch victory for the Panthers",
            "publishDate": "2017-06-10T19:26:17+10:00",
            "publisher": "NRL Chief",
            "thumbnailUrl": "http://bpvideos.telstra.insnw.net/web/images/20170610192606a_89x50.jpg",
            "largeThumbnailUrl": "http://bpvideos.telstra.insnw.net/web/images/20170610192606a_326x184.jpg",
            "programType": "Instant Replay",
            "programCategory": "Score",
            "priority": null,
            "lastUpdateDate": "2017-06-10T19:29:54+10:00",
            "isPremium": true,
            "club": [
                500013,
                500014
            ]
        },
        {
            "id": "8wMzJqYjE6L-gGCA5md4ct6IJLMsr9Zh",
            "contentId": 917658,
            "title": "Rd 14: GOAL Nathan Cleary (79th min)",
            "description": "Nathan Cleary converts the try of Cory Harawira-Naera",
            "publishDate": "2017-06-10T19:22:15+10:00",
            "publisher": "NRL Chief",
            "thumbnailUrl": "http://bpvideos.telstra.insnw.net/web/images/20170610192148a_89x50.jpg",
            "largeThumbnailUrl": "http://bpvideos.telstra.insnw.net/web/images/20170610192148a_326x184.jpg",
            "programType": "Instant Replay",
            "programCategory": "Score",
            "priority": null,
            "lastUpdateDate": "2017-06-10T19:26:53+10:00",
            "isPremium": true,
            "club": [
                500013,
                500014
            ]
        },
        {
            "id": "Y5MjJqYjE6FYk5gKIcUdD2WqvN45B8s0",
            "contentId": 917656,
            "title": "Rd 14: TRY Cory Harawira-Naera (79th min)",
            "description": "Cory Harawira-Naera scores to give the Panthers a sniff of victory",
            "publishDate": "2017-06-10T19:20:41+10:00",
            "publisher": "NRL Chief",
            "thumbnailUrl": "http://bpvideos.telstra.insnw.net/web/images/20170610192050a_89x50.jpg",
            "largeThumbnailUrl": "http://bpvideos.telstra.insnw.net/web/images/20170610192050a_326x184.jpg",
            "programType": "Instant Replay",
            "programCategory": "Score",
            "priority": null,
            "lastUpdateDate": "2017-06-10T19:24:52+10:00",
            "isPremium": true,
            "club": [
                500013,
                500014
            ]
        },
        {
            "id": "s5eDFqYjE69HHFdnWuG8MA5_TFVsku29",
            "contentId": 917653,
            "title": "Rd 14: TRY Nick Cotric (61st min)",
            "description": "Nick Cotric crosses for his second try",
            "publishDate": "2017-06-10T19:00:57+10:00",
            "publisher": "NRL Chief",
            "thumbnailUrl": "http://bpvideos.telstra.insnw.net/web/images/20170610190041a_89x50.jpg",
            "largeThumbnailUrl": "http://bpvideos.telstra.insnw.net/web/images/20170610190041a_326x184.jpg",
            "programType": "Instant Replay",
            "programCategory": "Score",
            "priority": null,
            "lastUpdateDate": "2017-06-10T19:04:48+10:00",
            "isPremium": true,
            "club": [
                500013,
                500014
            ]
        },
        {
            "id": "Y1eDFqYjE6ye2gl4Drs4d9ymr1xcVG9m",
            "contentId": 917652,
            "title": "Rd 14: GOAL Jarrod Croker (59th min)",
            "description": "Jarrod Croker converts his team mate's try",
            "publishDate": "2017-06-10T18:59:30+10:00",
            "publisher": "NRL Chief",
            "thumbnailUrl": "http://bpvideos.telstra.insnw.net/web/images/20170610190000a_89x50.jpg",
            "largeThumbnailUrl": "http://bpvideos.telstra.insnw.net/web/images/20170610190000a_326x184.jpg",
            "programType": "Instant Replay",
            "programCategory": "Score",
            "priority": null,
            "lastUpdateDate": "2017-06-10T19:03:48+10:00",
            "isPremium": true,
            "club": [
                500013,
                500014
            ]
        },
        {
            "id": "4zeDFqYjE6dV5IgpJkl5Duj9GzII2_J2",
            "contentId": 917651,
            "title": "Rd 14: TRY Joey Leilua (57th min)",
            "description": "Joey Leilua crosses for the Raiders",
            "publishDate": "2017-06-10T18:58:43+10:00",
            "publisher": "NRL Chief",
            "thumbnailUrl": "http://bpvideos.telstra.insnw.net/web/images/20170610185925a_89x50.jpg",
            "largeThumbnailUrl": "http://bpvideos.telstra.insnw.net/web/images/20170610185925a_326x184.jpg",
            "programType": "Instant Replay",
            "programCategory": "Score",
            "priority": null,
            "lastUpdateDate": "2017-06-10T19:02:47+10:00",
            "isPremium": true,
            "club": [
                500013,
                500014
            ]
        },
        {
            "id": "9jdTFqYjE6dfAVBIZpe4WJb-fISO93Au",
            "contentId": 917642,
            "title": "Rd 14: GOAL Jarrod Croker (46th min)",
            "description": "Jarrod Croker converts the try of Nick Cotric",
            "publishDate": "2017-06-10T18:42:13+10:00",
            "publisher": "NRL Chief",
            "thumbnailUrl": "http://bpvideos.telstra.insnw.net/web/images/20170610184207a_89x50.jpg",
            "largeThumbnailUrl": "http://bpvideos.telstra.insnw.net/web/images/20170610184207a_326x184.jpg",
            "programType": "Instant Replay",
            "programCategory": "Score",
            "priority": null,
            "lastUpdateDate": "2017-06-10T18:45:44+10:00",
            "isPremium": true,
            "club": [
                500013,
                500014
            ]
        },
        {
            "id": "40dTFqYjE6gftrQ9kIvYhZNrAB5TKlsI",
            "contentId": 917641,
            "title": "Rd 14: TRY Nick Cotric (45th min)",
            "description": "Nick Cotric hits back for the Raiders",
            "publishDate": "2017-06-10T18:41:43+10:00",
            "publisher": "NRL Chief",
            "thumbnailUrl": "http://bpvideos.telstra.insnw.net/web/images/20170610184133a_89x50.jpg",
            "largeThumbnailUrl": "http://bpvideos.telstra.insnw.net/web/images/20170610184133a_326x184.jpg",
            "programType": "Instant Replay",
            "programCategory": "Score",
            "priority": null,
            "lastUpdateDate": "2017-06-10T18:45:43+10:00",
            "isPremium": true,
            "club": [
                500013,
                500014
            ]
        },
        {
            "id": "ZqdDFqYjE6QeO0Po0k60A5HDzOkBQnB1",
            "contentId": 917638,
            "title": "Rd 14: GOAL Nathan Cleary (43rd min)",
            "description": "Nathan Cleary converts his own try",
            "publishDate": "2017-06-10T18:38:08+10:00",
            "publisher": "NRL Chief",
            "thumbnailUrl": "http://bpvideos.telstra.insnw.net/web/images/20170610183831a_89x50.jpg",
            "largeThumbnailUrl": "http://bpvideos.telstra.insnw.net/web/images/20170610183831a_326x184.jpg",
            "programType": "Instant Replay",
            "programCategory": "Score",
            "priority": null,
            "lastUpdateDate": "2017-06-10T18:41:42+10:00",
            "isPremium": true,
            "club": [
                500013,
                500014
            ]
        },
        {
            "id": "83dDFqYjE6gdWcViRuVG2FfJro5enp7y",
            "contentId": 917637,
            "title": "Rd 14: TRY Nathan Cleary (41st min)",
            "description": "Nathan Cleary streaks away to extend the Panthers' lead",
            "publishDate": "2017-06-10T18:37:22+10:00",
            "publisher": "NRL Chief",
            "thumbnailUrl": "http://bpvideos.telstra.insnw.net/web/images/20170610183717a_89x50.jpg",
            "largeThumbnailUrl": "http://bpvideos.telstra.insnw.net/web/images/20170610183717a_326x184.jpg",
            "programType": "Instant Replay",
            "programCategory": "Score",
            "priority": null,
            "lastUpdateDate": "2017-06-10T18:40:42+10:00",
            "isPremium": true,
            "club": [
                500013,
                500014
            ]
        },
        {
            "id": "R2bDFqYjE63PO7r1LIM5fLhxcWne5-ME",
            "contentId": 917622,
            "title": "Rd 14: GOAL Nathan Cleary (14th min)",
            "description": "Nathan Cleary adds the two extras to put the Panthers out in front",
            "publishDate": "2017-06-10T17:52:21+10:00",
            "publisher": "NRL Chief",
            "thumbnailUrl": "http://bpvideos.telstra.insnw.net/web/images/20170610175253a_89x50.jpg",
            "largeThumbnailUrl": "http://bpvideos.telstra.insnw.net/web/images/20170610175253a_326x184.jpg",
            "programType": "Instant Replay",
            "programCategory": "Score",
            "priority": null,
            "lastUpdateDate": "2017-06-10T17:56:32+10:00",
            "isPremium": true,
            "club": [
                500013,
                500014
            ]
        },
        {
            "id": "Y3bDFqYjE6BKg2nVAbLkyL8NKerWOOMj",
            "contentId": 917621,
            "title": "Rd 14: TRY Matt Moylan (12th min)",
            "description": "Matt Moylan scores to level the two sides, early in the first half",
            "publishDate": "2017-06-10T17:48:44+10:00",
            "publisher": "NRL Chief",
            "thumbnailUrl": "http://bpvideos.telstra.insnw.net/web/images/20170610174742a_89x50.jpg",
            "largeThumbnailUrl": "http://bpvideos.telstra.insnw.net/web/images/20170610174742a_326x184.jpg",
            "programType": "Instant Replay",
            "programCategory": "Score",
            "priority": null,
            "lastUpdateDate": "2017-06-10T17:52:31+10:00",
            "isPremium": true,
            "club": [
                500013,
                500014
            ]
        },
        {
            "id": "hqajFqYjE6cFm6H_X5MIbHJi_8gbRTa_",
            "contentId": 917616,
            "title": "Rd 14: TRY Jordan Rapana (4th min)",
            "description": "Jordan Rapana opens the scoring in Bathurst",
            "publishDate": "2017-06-10T17:39:43+10:00",
            "publisher": "NRL Chief",
            "thumbnailUrl": "http://bpvideos.telstra.insnw.net/web/images/20170610173929a_89x50.jpg",
            "largeThumbnailUrl": "http://bpvideos.telstra.insnw.net/web/images/20170610173929a_326x184.jpg",
            "programType": "Instant Replay",
            "programCategory": "Score",
            "priority": null,
            "lastUpdateDate": "2017-06-10T17:43:29+10:00",
            "isPremium": true,
            "club": [
                500013,
                500014
            ]
        }
    ],
    "scores": [
        {
            "gameState": "First Half",
            "gameStateId": 3,
            "gameTime": "0:11:39",
            "gameSeconds": 699,
            "GameMinutes": "11:39",
            "playerId": 500356,
            "playerName": "Matt Moylan",
            "scoreMethod": "Try",
            "statEvent": "Try",
            "statId": 38,
            "statValue": 4,
            "vidRef": 17931,
            "homeScore": 4,
            "awayScore": 4,
            "commentary": "Try by Matt Moylan",
            "tackleNum": 3,
            "teamId": 500014,
            "teamName": "Penrith Panthers",
            "homeTeamAbbrv": "PEN",
            "awayTeamAbbrv": "CAN"
        },
        {
            "gameState": "First Half",
            "gameStateId": 3,
            "gameTime": "0:13:03",
            "gameSeconds": 783,
            "GameMinutes": "13:03",
            "playerId": 504120,
            "playerName": "Nathan Cleary",
            "scoreMethod": "Conversion",
            "statEvent": "Conversion-Made",
            "statId": 1,
            "statValue": 2,
            "vidRef": 20738,
            "homeScore": 6,
            "awayScore": 4,
            "commentary": "Conversion-Made by Nathan Cleary",
            "tackleNum": -1,
            "teamId": 500014,
            "teamName": "Penrith Panthers",
            "homeTeamAbbrv": "PEN",
            "awayTeamAbbrv": "CAN"
        },
        {
            "gameState": "First Half",
            "gameStateId": 3,
            "gameTime": "0:40:50",
            "gameSeconds": 2450,
            "GameMinutes": "40:50",
            "playerId": 504120,
            "playerName": "Nathan Cleary",
            "scoreMethod": "Try",
            "statEvent": "Try",
            "statId": 38,
            "statValue": 4,
            "vidRef": 67604,
            "homeScore": 10,
            "awayScore": 4,
            "commentary": "Try by Nathan Cleary",
            "tackleNum": 5,
            "teamId": 500014,
            "teamName": "Penrith Panthers",
            "homeTeamAbbrv": "PEN",
            "awayTeamAbbrv": "CAN"
        },
        {
            "gameState": "Second Half",
            "gameStateId": 5,
            "gameTime": "0:42:23",
            "gameSeconds": 2543,
            "GameMinutes": "42:23",
            "playerId": 504120,
            "playerName": "Nathan Cleary",
            "scoreMethod": "Conversion",
            "statEvent": "Conversion-Made",
            "statId": 1,
            "statValue": 2,
            "vidRef": 69919,
            "homeScore": 12,
            "awayScore": 4,
            "commentary": "Conversion-Made by Nathan Cleary",
            "tackleNum": -1,
            "teamId": 500014,
            "teamName": "Penrith Panthers",
            "homeTeamAbbrv": "PEN",
            "awayTeamAbbrv": "CAN"
        },
        {
            "gameState": "Second Half",
            "gameStateId": 5,
            "gameTime": "1:18:09",
            "gameSeconds": 4689,
            "GameMinutes": "78:09",
            "playerId": 501241,
            "playerName": "Corey Harawira-Naera",
            "scoreMethod": "Try",
            "statEvent": "Try",
            "statId": 38,
            "statValue": 4,
            "vidRef": 133830,
            "homeScore": 16,
            "awayScore": 20,
            "commentary": "Try by Corey Harawira-Naera",
            "tackleNum": 5,
            "teamId": 500014,
            "teamName": "Penrith Panthers",
            "homeTeamAbbrv": "PEN",
            "awayTeamAbbrv": "CAN"
        },
        {
            "gameState": "Second Half",
            "gameStateId": 5,
            "gameTime": "1:18:41",
            "gameSeconds": 4721,
            "GameMinutes": "78:41",
            "playerId": 504120,
            "playerName": "Nathan Cleary",
            "scoreMethod": "Conversion",
            "statEvent": "Conversion-Made",
            "statId": 1,
            "statValue": 2,
            "vidRef": 134626,
            "homeScore": 18,
            "awayScore": 20,
            "commentary": "Conversion-Made by Nathan Cleary",
            "tackleNum": -1,
            "teamId": 500014,
            "teamName": "Penrith Panthers",
            "homeTeamAbbrv": "PEN",
            "awayTeamAbbrv": "CAN"
        },
        {
            "gameState": "Second Half",
            "gameStateId": 5,
            "gameTime": "1:19:40",
            "gameSeconds": 4780,
            "GameMinutes": "79:40",
            "playerId": 501184,
            "playerName": "Tyrone Peachey",
            "scoreMethod": "Try",
            "statEvent": "Try",
            "statId": 38,
            "statValue": 4,
            "vidRef": 137066,
            "homeScore": 22,
            "awayScore": 20,
            "commentary": "Try by Tyrone Peachey",
            "tackleNum": 5,
            "teamId": 500014,
            "teamName": "Penrith Panthers",
            "homeTeamAbbrv": "PEN",
            "awayTeamAbbrv": "CAN"
        },
        {
            "gameState": "Second Half",
            "gameStateId": 5,
            "gameTime": "1:20:00",
            "gameSeconds": 4800,
            "GameMinutes": "80:00",
            "playerId": 504120,
            "playerName": "Nathan Cleary",
            "scoreMethod": "Conversion",
            "statEvent": "Conversion-Made",
            "statId": 1,
            "statValue": 2,
            "vidRef": 139619,
            "homeScore": 24,
            "awayScore": 20,
            "commentary": "Conversion-Made by Nathan Cleary",
            "tackleNum": -1,
            "teamId": 500014,
            "teamName": "Penrith Panthers",
            "homeTeamAbbrv": "PEN",
            "awayTeamAbbrv": "CAN"
        },
        {
            "gameState": "First Half",
            "gameStateId": 3,
            "gameTime": "0:03:20",
            "gameSeconds": 200,
            "GameMinutes": "03:20",
            "playerId": 500330,
            "playerName": "Jordan Rapana",
            "scoreMethod": "Try",
            "statEvent": "Try",
            "statId": 38,
            "statValue": 4,
            "vidRef": 5255,
            "awayScore": 4,
            "commentary": "Try by Jordan Rapana",
            "tackleNum": 1,
            "teamId": 500013,
            "teamName": "Canberra Raiders",
            "homeTeamAbbrv": "PEN",
            "awayTeamAbbrv": "CAN"
        },
        {
            "gameState": "Second Half",
            "gameStateId": 5,
            "gameTime": "0:44:42",
            "gameSeconds": 2682,
            "GameMinutes": "44:42",
            "playerId": 504134,
            "playerName": "Nick Cotric",
            "scoreMethod": "Try",
            "statEvent": "Try",
            "statId": 38,
            "statValue": 4,
            "vidRef": 73385,
            "homeScore": 12,
            "awayScore": 8,
            "commentary": "Try by Nick Cotric",
            "tackleNum": 6,
            "teamId": 500013,
            "teamName": "Canberra Raiders",
            "homeTeamAbbrv": "PEN",
            "awayTeamAbbrv": "CAN"
        },
        {
            "gameState": "Second Half",
            "gameStateId": 5,
            "gameTime": "0:45:16",
            "gameSeconds": 2716,
            "GameMinutes": "45:16",
            "playerId": 500313,
            "playerName": "Jarrod Croker",
            "scoreMethod": "Conversion",
            "statEvent": "Conversion-Made",
            "statId": 1,
            "statValue": 2,
            "vidRef": 75969,
            "homeScore": 12,
            "awayScore": 10,
            "commentary": "Conversion-Made by Jarrod Croker",
            "tackleNum": -1,
            "teamId": 500013,
            "teamName": "Canberra Raiders",
            "homeTeamAbbrv": "PEN",
            "awayTeamAbbrv": "CAN"
        },
        {
            "gameState": "Second Half",
            "gameStateId": 5,
            "gameTime": "0:56:51",
            "gameSeconds": 3411,
            "GameMinutes": "56:51",
            "playerId": 500042,
            "playerName": "Joseph Leilua",
            "scoreMethod": "Try",
            "statEvent": "Try",
            "statId": 38,
            "statValue": 4,
            "vidRef": 97999,
            "homeScore": 12,
            "awayScore": 14,
            "commentary": "Try by Joseph Leilua",
            "tackleNum": 6,
            "teamId": 500013,
            "teamName": "Canberra Raiders",
            "homeTeamAbbrv": "PEN",
            "awayTeamAbbrv": "CAN"
        },
        {
            "gameState": "Second Half",
            "gameStateId": 5,
            "gameTime": "0:58:23",
            "gameSeconds": 3503,
            "GameMinutes": "58:23",
            "playerId": 500313,
            "playerName": "Jarrod Croker",
            "scoreMethod": "Conversion",
            "statEvent": "Conversion-Made",
            "statId": 1,
            "statValue": 2,
            "vidRef": 100846,
            "homeScore": 12,
            "awayScore": 16,
            "commentary": "Conversion-Made by Jarrod Croker",
            "tackleNum": -1,
            "teamId": 500013,
            "teamName": "Canberra Raiders",
            "homeTeamAbbrv": "PEN",
            "awayTeamAbbrv": "CAN"
        },
        {
            "gameState": "Second Half",
            "gameStateId": 5,
            "gameTime": "1:00:05",
            "gameSeconds": 3605,
            "GameMinutes": "60:05",
            "playerId": 504134,
            "playerName": "Nick Cotric",
            "scoreMethod": "Try",
            "statEvent": "Try",
            "statId": 38,
            "statValue": 4,
            "vidRef": 103379,
            "homeScore": 12,
            "awayScore": 20,
            "commentary": "Try by Nick Cotric",
            "tackleNum": 5,
            "teamId": 500013,
            "teamName": "Canberra Raiders",
            "homeTeamAbbrv": "PEN",
            "awayTeamAbbrv": "CAN"
        }
    ],
    "twitter": []
}