{
    "vod": [
        {
            "id": "M5eTFodzpiGrgOU4G2QsRMHnVivaREQv",
            "contentId": 789564,
            "title": "FW 1: Roosters v Storm (1)",
            "description": "1st half replay of the match between the Roosters & Storm",
            "publishDate": "2015-09-12T10:00:00+10:00",
            "publisher": "NRL Chief",
            "thumbnailUrl": "http://bigpondvideo.com/Web/Images/Content/20150911215520a_89x50.jpg",
            "largeThumbnailUrl": "http://bigpondvideo.com/Web/Images/Content/20150911215520a_326x184.jpg",
            "programType": "Matches",
            "programCategory": "Replay: 1st Half",
            "priority": null,
            "lastUpdateDate": "2015-09-11T23:30:17+10:00",
            "isPremium": true,
            "club": [
                500021,
                500001
            ]
        },
        {
            "id": "FhMDJodzrayVTuA7VSN2rScTR0F4I1tM",
            "contentId": 789565,
            "title": "FW 1: Roosters v Storm (2)",
            "description": "2nd half replay of the match between the Roosters & Storm",
            "publishDate": "2015-09-12T10:00:00+10:00",
            "publisher": "NRL Chief",
            "thumbnailUrl": "http://bigpondvideo.com/Web/Images/Content/20150911215601a_89x50.jpg",
            "largeThumbnailUrl": "http://bigpondvideo.com/Web/Images/Content/20150911215601a_326x184.jpg",
            "programType": "Matches",
            "programCategory": "Replay: 2nd Half",
            "priority": null,
            "lastUpdateDate": "2015-09-11T23:30:17+10:00",
            "isPremium": true,
            "club": [
                500021,
                500001
            ]
        },
        {
            "id": "B3NTFodzoUTdHukyhJ8WWE7pcWXoNQ32",
            "contentId": 789536,
            "title": "FW 1: Roosters v Storm (Hls)",
            "description": "Highlights of the match between the Roosters & Storm from Allianz Stadium",
            "publishDate": "2015-09-11T21:58:00+10:00",
            "publisher": "NRL Chief",
            "thumbnailUrl": "http://bigpondvideo.com/Web/Images/Content/20150911220428a_89x50.jpg",
            "largeThumbnailUrl": "http://bigpondvideo.com/Web/Images/Content/20150911220428a_326x184.jpg",
            "programType": "Highlights",
            "programCategory": "Match",
            "priority": null,
            "lastUpdateDate": "2015-09-11T22:05:58+10:00",
            "isPremium": false,
            "club": [
                500021,
                500001
            ]
        },
        {
            "id": "NheDFodzqOVrRdBRkbjihrdgcItV0Cuf",
            "contentId": 789554,
            "title": "FW 1 Press Conference: Roosters",
            "description": "The Roosters coach faces the media following the match",
            "publishDate": "2015-09-11T22:57:00+10:00",
            "publisher": "NRL Chief",
            "thumbnailUrl": "http://bigpondvideo.com/Web/Images/Content/20150911223407a_89x50.jpg",
            "largeThumbnailUrl": "http://bigpondvideo.com/Web/Images/Content/20150911223407a_326x184.jpg",
            "programType": "Press Conference",
            "programCategory": null,
            "priority": null,
            "lastUpdateDate": "2015-09-11T23:06:11+10:00",
            "isPremium": false,
            "club": [
                500021,
                500001
            ]
        },
        {
            "id": "ZmdTFodzoHy2rd5ICHLjAQ1pUVnnzxqB",
            "contentId": 789557,
            "title": "FW 1 Press Conference: Storm",
            "description": "The Storm coach faces the media following the match",
            "publishDate": "2015-09-11T22:52:00+10:00",
            "publisher": "NRL Chief",
            "thumbnailUrl": "http://bigpondvideo.com/Web/Images/Content/20150911223429a_89x50.jpg",
            "largeThumbnailUrl": "http://bigpondvideo.com/Web/Images/Content/20150911223429a_326x184.jpg",
            "programType": "Press Conference",
            "programCategory": null,
            "priority": null,
            "lastUpdateDate": "2015-09-11T23:05:12+10:00",
            "isPremium": false,
            "club": [
                500021,
                500001
            ]
        },
        {
            "id": "FweDBodzpGYj1p5lQ9IeeRg67PFY3TSQ",
            "contentId": 789730,
            "title": "FW 1: GOAL James Maloney (74th min)",
            "description": "Conversion sees the Roosters trail 20-18",
            "publishDate": "2015-09-11T21:38:00+10:00",
            "publisher": "NRL Chief",
            "thumbnailUrl": "http://bigpondvideo.com/Web/Images/Content/20150911214033a_89x50.jpg",
            "largeThumbnailUrl": "http://bigpondvideo.com/Web/Images/Content/20150911214033a_326x184.jpg",
            "programType": "Instant Replay",
            "programCategory": "Score",
            "priority": 1,
            "lastUpdateDate": "2015-09-11T21:55:56+10:00",
            "isPremium": true,
            "club": [
                500021,
                500001
            ]
        },
        {
            "id": "U5eDBodzoFMqHxPY8qTJZquMD9rCXQb6",
            "contentId": 789729,
            "title": "FW 1: TRY Blake Ferguson (73rd min)",
            "description": "The Roosters set up a grandstand finish as the come to the right and Blake Ferguson crosses out wide",
            "publishDate": "2015-09-11T21:37:00+10:00",
            "publisher": "NRL Chief",
            "thumbnailUrl": "http://bigpondvideo.com/Web/Images/Content/20150911213952a_89x50.jpg",
            "largeThumbnailUrl": "http://bigpondvideo.com/Web/Images/Content/20150911213952a_326x184.jpg",
            "programType": "Instant Replay",
            "programCategory": "Score",
            "priority": 2,
            "lastUpdateDate": "2015-09-11T21:54:56+10:00",
            "isPremium": true,
            "club": [
                500021,
                500001
            ]
        },
        {
            "id": "p3dzBodzoJC1Fr83PpU2fhaW9gRw4Qty",
            "contentId": 789728,
            "title": "FW 1: GOAL Cameron Smith (72nd min)",
            "description": "Fantastic conversion from touch takes the Storm out to an 8 point lead",
            "publishDate": "2015-09-11T21:36:00+10:00",
            "publisher": "NRL Chief",
            "thumbnailUrl": "http://bigpondvideo.com/Web/Images/Content/20150911213807a_89x50.jpg",
            "largeThumbnailUrl": "http://bigpondvideo.com/Web/Images/Content/20150911213807a_326x184.jpg",
            "programType": "Instant Replay",
            "programCategory": "Score",
            "priority": 3,
            "lastUpdateDate": "2015-09-11T21:54:56+10:00",
            "isPremium": true,
            "club": [
                500021,
                500001
            ]
        },
        {
            "id": "JtdzBodzr4BNj2d0J3s5gA_pgnPNh2Tn",
            "contentId": 789727,
            "title": "FW 1: TRY Tim Glasby (71st min)",
            "description": "The Storm extend their lead as Matt Duffie flies high to batt back the bomb and Tim Glasby gets  peach of a bounce to cross in the corner",
            "publishDate": "2015-09-11T21:35:00+10:00",
            "publisher": "NRL Chief",
            "thumbnailUrl": "http://bigpondvideo.com/Web/Images/Content/20150911213734a_89x50.jpg",
            "largeThumbnailUrl": "http://bigpondvideo.com/Web/Images/Content/20150911213734a_326x184.jpg",
            "programType": "Instant Replay",
            "programCategory": "Score",
            "priority": 4,
            "lastUpdateDate": "2015-09-11T21:53:55+10:00",
            "isPremium": true,
            "club": [
                500021,
                500001
            ]
        },
        {
            "id": "NvczBodzr1ZC0B1h6jGadI7W81ivlNKf",
            "contentId": 789726,
            "title": "FW 1: TRY Shaun Kenny-Dowall (65th min)",
            "description": "The Roosters strike back as Michael Jennings gets into open field beating defender after defender and then Jackson Hastings puts in a pin point kick for Shaun Kenny-Dowall to score",
            "publishDate": "2015-09-11T21:29:00+10:00",
            "publisher": "NRL Chief",
            "thumbnailUrl": "http://bigpondvideo.com/Web/Images/Content/20150911212905a_89x50.jpg",
            "largeThumbnailUrl": "http://bigpondvideo.com/Web/Images/Content/20150911212905a_326x184.jpg",
            "programType": "Instant Replay",
            "programCategory": "Score",
            "priority": 5,
            "lastUpdateDate": "2015-09-11T21:53:55+10:00",
            "isPremium": true,
            "club": [
                500021,
                500001
            ]
        },
        {
            "id": "lpbzBodzrngRKg9MB-MlGSplRGZ4omGf",
            "contentId": 789725,
            "title": "FW 1: GOAL Cameron Smith (56th min)",
            "description": "Conversion sees the Storm lead 14-8",
            "publishDate": "2015-09-11T21:18:00+10:00",
            "publisher": "NRL Chief",
            "thumbnailUrl": "http://bigpondvideo.com/Web/Images/Content/20150911211859a_89x50.jpg",
            "largeThumbnailUrl": "http://bigpondvideo.com/Web/Images/Content/20150911211859a_326x184.jpg",
            "programType": "Instant Replay",
            "programCategory": "Score",
            "priority": null,
            "lastUpdateDate": "2015-09-11T21:21:46+10:00",
            "isPremium": true,
            "club": [
                500021,
                500001
            ]
        },
        {
            "id": "1ubjBodzqFPOpZbKgJy8gy6pSV4_a7FC",
            "contentId": 789724,
            "title": "FW 1: TRY Kurt Mann (54th min)",
            "description": "The Storm regain the lead as the catch the Roosters defence short on the left as Kurt Mann crosses in the corner",
            "publishDate": "2015-09-11T21:16:00+10:00",
            "publisher": "NRL Chief",
            "thumbnailUrl": "http://bigpondvideo.com/Web/Images/Content/20150911211632a_89x50.jpg",
            "largeThumbnailUrl": "http://bigpondvideo.com/Web/Images/Content/20150911211632a_326x184.jpg",
            "programType": "Instant Replay",
            "programCategory": "Score",
            "priority": 6,
            "lastUpdateDate": "2015-09-11T21:52:58+10:00",
            "isPremium": true,
            "club": [
                500021,
                500001
            ]
        },
        {
            "id": "dpazBodzqy9Nyr7CuwnpwEA5yNHWCLAa",
            "contentId": 789723,
            "title": "FW 1: PENALTY GOAL Cameron Smith (48th min)",
            "description": "Penalty goal to the Storm locks this game up at 8-all",
            "publishDate": "2015-09-11T21:09:00+10:00",
            "publisher": "NRL Chief",
            "thumbnailUrl": "http://bigpondvideo.com/Web/Images/Content/20150911210930a_89x50.jpg",
            "largeThumbnailUrl": "http://bigpondvideo.com/Web/Images/Content/20150911210930a_326x184.jpg",
            "programType": "Instant Replay",
            "programCategory": "Score",
            "priority": 7,
            "lastUpdateDate": "2015-09-11T21:52:58+10:00",
            "isPremium": true,
            "club": [
                500021,
                500001
            ]
        },
        {
            "id": "llODBodzqHzVOmCWGovfDVAgO7XXdgMn",
            "contentId": 789722,
            "title": "FW 1: PENALTY GOAL James Maloney (32nd min)",
            "description": "Penalty goal to the Roosters takes them out to an 8-6 lead",
            "publishDate": "2015-09-11T20:37:00+10:00",
            "publisher": "NRL Chief",
            "thumbnailUrl": "http://bigpondvideo.com/Web/Images/Content/20150911203826a_89x50.jpg",
            "largeThumbnailUrl": "http://bigpondvideo.com/Web/Images/Content/20150911203826a_326x184.jpg",
            "programType": "Instant Replay",
            "programCategory": "Score",
            "priority": 8,
            "lastUpdateDate": "2015-09-11T21:51:54+10:00",
            "isPremium": true,
            "club": [
                500021,
                500001
            ]
        },
        {
            "id": "c5MzBodzrfVYBTWR6_V3wPzheCogqHDk",
            "contentId": 789721,
            "title": "FW 1: GOAL James Maloney (20th min)",
            "description": "Conversion locks this game up at 6-all",
            "publishDate": "2015-09-11T20:25:00+10:00",
            "publisher": "NRL Chief",
            "thumbnailUrl": "http://bigpondvideo.com/Web/Images/Content/20150911202516a_89x50.jpg",
            "largeThumbnailUrl": "http://bigpondvideo.com/Web/Images/Content/20150911202516a_326x184.jpg",
            "programType": "Instant Replay",
            "programCategory": "Score",
            "priority": null,
            "lastUpdateDate": "2015-09-11T20:27:34+10:00",
            "isPremium": true,
            "club": [
                500021,
                500001
            ]
        },
        {
            "id": "V3MjBodzrB55fOyptT1DwJKoQCK4Lnwg",
            "contentId": 789719,
            "title": "FW 1: TRY Sio Siua Taukeiaho (19th min)",
            "description": "The Roosters strike back through a try to Sio Siua Taukeiaho showing great strength to score",
            "publishDate": "2015-09-11T20:24:00+10:00",
            "publisher": "NRL Chief",
            "thumbnailUrl": "http://bigpondvideo.com/Web/Images/Content/20150911202402a_89x50.jpg",
            "largeThumbnailUrl": "http://bigpondvideo.com/Web/Images/Content/20150911202402a_326x184.jpg",
            "programType": "Instant Replay",
            "programCategory": "Score",
            "priority": 9,
            "lastUpdateDate": "2015-09-11T21:48:53+10:00",
            "isPremium": true,
            "club": [
                500021,
                500001
            ]
        },
        {
            "id": "9weXlndzrrJGayi14hlG1qnvqGm524BZ",
            "contentId": 789720,
            "title": "FW 1: GOAL Cameron Smith (12th min)",
            "description": "Conversion gives the Storm an early 6-0 lead",
            "publishDate": "2015-09-11T20:15:00+10:00",
            "publisher": "NRL Chief",
            "thumbnailUrl": "http://bigpondvideo.com/Web/Images/Content/20150911201556a_89x50.jpg",
            "largeThumbnailUrl": "http://bigpondvideo.com/Web/Images/Content/20150911201556a_326x184.jpg",
            "programType": "Instant Replay",
            "programCategory": "Score",
            "priority": null,
            "lastUpdateDate": "2015-09-11T20:19:32+10:00",
            "isPremium": true,
            "club": [
                500021,
                500001
            ]
        },
        {
            "id": "9keXlndzpmK6y2sUUJ_ODBsBRr9wQbwo",
            "contentId": 789717,
            "title": "FW 1: TRY Marika Koroibete (10th min)",
            "description": "The Storm open the scoring in this match through a try to Marika Koroibete who crosses in the left hand corner of Allianz Stadium",
            "publishDate": "2015-09-11T20:14:00+10:00",
            "publisher": "NRL Chief",
            "thumbnailUrl": "http://bigpondvideo.com/Web/Images/Content/20150911201424a_89x50.jpg",
            "largeThumbnailUrl": "http://bigpondvideo.com/Web/Images/Content/20150911201424a_326x184.jpg",
            "programType": "Instant Replay",
            "programCategory": "Score",
            "priority": 10,
            "lastUpdateDate": "2015-09-11T21:47:53+10:00",
            "isPremium": true,
            "club": [
                500021,
                500001
            ]
        }
    ],
    "scores": [
        {
            "gameState": "First Half",
            "gameStateId": 3,
            "gameTime": "0:18:06",
            "gameSeconds": 1086,
            "playerId": 501179,
            "playerName": "Sio Siua Taukeiaho",
            "scoreMethod": "Try",
            "statEvent": "Try",
            "statId": 38,
            "statValue": 4,
            "vidRef": 33516,
            "homeScore": 4,
            "awayScore": 6,
            "teamId": 500001,
            "teamName": "Sydney Roosters",
            "homeTeamAbbrv": "SYD",
            "awayTeamAbbrv": "MEL"
        },
        {
            "gameState": "First Half",
            "gameStateId": 3,
            "gameTime": "0:19:15",
            "gameSeconds": 1155,
            "playerId": 500006,
            "playerName": "James Maloney",
            "scoreMethod": "Conversion",
            "statEvent": "Conversion-Made",
            "statId": 1,
            "statValue": 2,
            "vidRef": 35248,
            "homeScore": 6,
            "awayScore": 6,
            "teamId": 500001,
            "teamName": "Sydney Roosters",
            "homeTeamAbbrv": "SYD",
            "awayTeamAbbrv": "MEL"
        },
        {
            "gameState": "First Half",
            "gameStateId": 3,
            "gameTime": "0:31:56",
            "gameSeconds": 1916,
            "playerId": 500006,
            "playerName": "James Maloney",
            "scoreMethod": "Penalty Goal",
            "statEvent": "Penalty Shot-Made",
            "statId": 67,
            "statValue": 2,
            "vidRef": 54275,
            "homeScore": 8,
            "awayScore": 6,
            "teamId": 500001,
            "teamName": "Sydney Roosters",
            "homeTeamAbbrv": "SYD",
            "awayTeamAbbrv": "MEL"
        },
        {
            "gameState": "Second Half",
            "gameStateId": 5,
            "gameTime": "1:04:31",
            "gameSeconds": 3871,
            "playerId": 500004,
            "playerName": "Shaun Kenny-Dowall",
            "scoreMethod": "Try",
            "statEvent": "Try",
            "statId": 38,
            "statValue": 4,
            "vidRef": 109665,
            "homeScore": 12,
            "awayScore": 14,
            "teamId": 500001,
            "teamName": "Sydney Roosters",
            "homeTeamAbbrv": "SYD",
            "awayTeamAbbrv": "MEL"
        },
        {
            "gameState": "Second Half",
            "gameStateId": 5,
            "gameTime": "1:12:41",
            "gameSeconds": 4361,
            "playerId": 501569,
            "playerName": "Blake Ferguson",
            "scoreMethod": "Try",
            "statEvent": "Try",
            "statId": 38,
            "statValue": 4,
            "vidRef": 125161,
            "homeScore": 16,
            "awayScore": 20,
            "teamId": 500001,
            "teamName": "Sydney Roosters",
            "homeTeamAbbrv": "SYD",
            "awayTeamAbbrv": "MEL"
        },
        {
            "gameState": "Second Half",
            "gameStateId": 5,
            "gameTime": "1:13:38",
            "gameSeconds": 4418,
            "playerId": 500006,
            "playerName": "James Maloney",
            "scoreMethod": "Conversion",
            "statEvent": "Conversion-Made",
            "statId": 1,
            "statValue": 2,
            "vidRef": 126596,
            "homeScore": 18,
            "awayScore": 20,
            "teamId": 500001,
            "teamName": "Sydney Roosters",
            "homeTeamAbbrv": "SYD",
            "awayTeamAbbrv": "MEL"
        },
        {
            "gameState": "First Half",
            "gameStateId": 3,
            "gameTime": "0:09:41",
            "gameSeconds": 581,
            "playerId": 500653,
            "playerName": "Marika Koroibete",
            "scoreMethod": "Try",
            "statEvent": "Try",
            "statId": 38,
            "statValue": 4,
            "vidRef": 19365,
            "awayScore": 4,
            "teamId": 500021,
            "teamName": "Melbourne Storm",
            "homeTeamAbbrv": "SYD",
            "awayTeamAbbrv": "MEL"
        },
        {
            "gameState": "First Half",
            "gameStateId": 3,
            "gameTime": "0:11:08",
            "gameSeconds": 668,
            "playerId": 500609,
            "playerName": "Cameron Smith",
            "scoreMethod": "Conversion",
            "statEvent": "Conversion-Made",
            "statId": 1,
            "statValue": 2,
            "vidRef": 21527,
            "awayScore": 6,
            "teamId": 500021,
            "teamName": "Melbourne Storm",
            "homeTeamAbbrv": "SYD",
            "awayTeamAbbrv": "MEL"
        },
        {
            "gameState": "Second Half",
            "gameStateId": 5,
            "gameTime": "0:47:44",
            "gameSeconds": 2864,
            "playerId": 500609,
            "playerName": "Cameron Smith",
            "scoreMethod": "Penalty Goal",
            "statEvent": "Penalty Shot-Made",
            "statId": 67,
            "statValue": 2,
            "vidRef": 82059,
            "homeScore": 8,
            "awayScore": 8,
            "teamId": 500021,
            "teamName": "Melbourne Storm",
            "homeTeamAbbrv": "SYD",
            "awayTeamAbbrv": "MEL"
        },
        {
            "gameState": "Second Half",
            "gameStateId": 5,
            "gameTime": "0:53:48",
            "gameSeconds": 3228,
            "playerId": 500601,
            "playerName": "Kurt Mann",
            "scoreMethod": "Try",
            "statEvent": "Try",
            "statId": 38,
            "statValue": 4,
            "vidRef": 93074,
            "homeScore": 8,
            "awayScore": 12,
            "teamId": 500021,
            "teamName": "Melbourne Storm",
            "homeTeamAbbrv": "SYD",
            "awayTeamAbbrv": "MEL"
        },
        {
            "gameState": "Second Half",
            "gameStateId": 5,
            "gameTime": "0:55:11",
            "gameSeconds": 3311,
            "playerId": 500609,
            "playerName": "Cameron Smith",
            "scoreMethod": "Conversion",
            "statEvent": "Conversion-Made",
            "statId": 1,
            "statValue": 2,
            "vidRef": 95259,
            "homeScore": 8,
            "awayScore": 14,
            "teamId": 500021,
            "teamName": "Melbourne Storm",
            "homeTeamAbbrv": "SYD",
            "awayTeamAbbrv": "MEL"
        },
        {
            "gameState": "Second Half",
            "gameStateId": 5,
            "gameTime": "1:10:04",
            "gameSeconds": 4204,
            "playerId": 500591,
            "playerName": "Tim Glasby",
            "scoreMethod": "Try",
            "statEvent": "Try",
            "statId": 38,
            "statValue": 4,
            "vidRef": 120928,
            "homeScore": 12,
            "awayScore": 18,
            "teamId": 500021,
            "teamName": "Melbourne Storm",
            "homeTeamAbbrv": "SYD",
            "awayTeamAbbrv": "MEL"
        },
        {
            "gameState": "Second Half",
            "gameStateId": 5,
            "gameTime": "1:11:26",
            "gameSeconds": 4286,
            "playerId": 500609,
            "playerName": "Cameron Smith",
            "scoreMethod": "Conversion",
            "statEvent": "Conversion-Made",
            "statId": 1,
            "statValue": 2,
            "vidRef": 123289,
            "homeScore": 12,
            "awayScore": 20,
            "teamId": 500021,
            "teamName": "Melbourne Storm",
            "homeTeamAbbrv": "SYD",
            "awayTeamAbbrv": "MEL"
        }
    ]
}