{
    "competitionId": 111,
    "competitionName": "NRL Telstra Premiership",
    "gameId": 20151112210,
    "gameInfo": {
        "assistantReferee1Id": 500020,
        "numberOfPeriods": 2,
        "assistantReferee1Name": "Jason Walsh",
        "gameDate": "2015-08-08",
        "gameHashTag": "#NRLWarriorsDragons",
        "gameNumber": 1,
        "gameSeconds": 4800,
        "gameMinutes": "80:00",
        "gameTime": "1:20:00",
        "groundConditionId": 1,
        "groundConditionName": "N/A",
        "referee1Id": 500008,
        "referee1Name": "Gavin Badger",
        "referee2Id": 500009,
        "referee2Name": "Alan Shortall",
        "startTime": "2015-08-08T17:00:00",
        "startTimeUTC": "2015-08-08T05:00:00Z",
        "venueId": 500062,
        "venueName": "Westpac Stadium",
        "videoReferee1Id": 500006,
        "videoReferee1Name": "Henry Perenara",
        "videoReferee2Id": 500001,
        "videoReferee2Name": "Shayne Hayne"
    },
    "gameState": "Final",
    "gameStateId": 8,
    "roundId": 22,
    "seasonId": 2015,
    "teams": {
        "teamsMatch": [
            {
                "isHomeTeam": true,
                "score": [],
                "team1stHalfScore": 0,
                "team2ndHalfScore": 0,
                "teamAbbr": "WAR",
                "teamFinalScore": 0,
                "teamFullTimeScore": 0,
                "teamHalfTimeScore": 0,
                "teamId": 500032,
                "teamLineup": {
                    "injuriesAndSuspensions": {
                        "injury": [
                            {
                                "injuryDescription": "Calf, Round 21",
                                "playerFirstName": "Ryan",
                                "playerId": "500596",
                                "playerLastName": "Hoffman",
                                "playerName": "Ryan Hoffman"
                            },
                            {
                                "injuryDescription": "Ankle, Indefinite",
                                "playerFirstName": "Bodene",
                                "playerId": "500664",
                                "playerLastName": "Thompson",
                                "playerName": "Bodene Thompson"
                            },
                            {
                                "injuryDescription": "Knee, Season",
                                "playerFirstName": "Ben",
                                "playerId": "500702",
                                "playerLastName": "Henry",
                                "playerName": "Ben Henry"
                            },
                            {
                                "injuryDescription": "Ankle, Season",
                                "playerFirstName": "Shaun",
                                "playerId": "500705",
                                "playerLastName": "Johnson",
                                "playerName": "Shaun Johnson"
                            },
                            {
                                "injuryDescription": "ACL, Season",
                                "playerFirstName": "Ngani",
                                "playerId": "500706",
                                "playerLastName": "Laumape",
                                "playerName": "Ngani Laumape"
                            },
                            {
                                "injuryDescription": "Knee, Season",
                                "playerFirstName": "Thomas",
                                "playerId": "500707",
                                "playerLastName": "Leuluai",
                                "playerName": "Thomas Leuluai"
                            },
                            {
                                "injuryDescription": "Knee, Indefinite",
                                "playerFirstName": "David",
                                "playerId": "500919",
                                "playerLastName": "Fusitua",
                                "playerName": "David Fusitua"
                            }
                        ],
                        "suspension": []
                    },
                    "insAndOuts": {
                        "inOut": [
                            {
                                "inOut": "In",
                                "playerFirstName": "Jonathan",
                                "playerId": "500815",
                                "playerLastName": "Wright",
                                "playerName": "Jonathan Wright"
                            },
                            {
                                "inOut": "Out",
                                "playerFirstName": "Konrad",
                                "playerId": "500703",
                                "playerLastName": "Hurrell",
                                "playerName": "Konrad Hurrell"
                            }
                        ]
                    },
                    "teamPlayer": [
                        {
                            "playerFirstName": "Sam",
                            "playerId": 501308,
                            "playerLastName": "Tomkins",
                            "playerName": "Sam Tomkins",
                            "playerPosition": "Fullback",
                            "playerPositionId": 500001,
                            "playerStats": {
                                "allRunMetres": 90,
                                "allRuns": 16,
                                "bombKicksDefused": 3,
                                "errors": 3,
                                "fantasyPointsTotal": 27,
                                "ineffectiveTackles": 1,
                                "kickMetres": 116,
                                "kickReturnMetres": 26,
                                "kickReturns": 5,
                                "kicks": 3,
                                "kicksDefused": 5,
                                "lineDropouts": 2,
                                "mins": 80,
                                "offloads": 2,
                                "supports": 5,
                                "tackleBreaks": 2,
                                "tackles": 4,
                                "tryCause": 1,
                                "evasionRuns": 11,
                                "evasionRunMetres": 64,
                                "ptbFast": 12.5,
                                "ptbNeutral": 87.5,
                                "ptbAll": 8
                            },
                            "playerTookTheField": true,
                            "shirtNum": 1
                        },
                        {
                            "playerFirstName": "Ken",
                            "playerId": 500928,
                            "playerLastName": "Maumalo",
                            "playerName": "Ken Maumalo",
                            "playerPosition": "Winger 1",
                            "playerPositionId": 500002,
                            "playerStats": {
                                "allRunMetres": 123,
                                "allRuns": 11,
                                "decoys": 2,
                                "errors": 3,
                                "fantasyPointsTotal": 25,
                                "hitUps": 1,
                                "ineffectiveTackles": 1,
                                "kickReturnMetres": 34,
                                "kickReturns": 4,
                                "kicksNotDefused": 1,
                                "linebreaks": 1,
                                "mins": 80,
                                "missedTackles": 2,
                                "offloads": 1,
                                "oneOnOneTackles": 1,
                                "supports": 7,
                                "tackleBreaks": 2,
                                "tackles": 11,
                                "hitupRunMeters": 14,
                                "evasionRuns": 6,
                                "evasionRunMetres": 75,
                                "ptbFast": 25,
                                "ptbNeutral": 75,
                                "ptbAll": 8
                            },
                            "playerTookTheField": true,
                            "shirtNum": 2
                        },
                        {
                            "playerFirstName": "Jonathan",
                            "playerId": 500815,
                            "playerLastName": "Wright",
                            "playerName": "Jonathan Wright",
                            "playerPosition": "Centre 1",
                            "playerPositionId": 500003,
                            "playerStats": {
                                "allRunMetres": 114,
                                "allRuns": 13,
                                "decoys": 2,
                                "fantasyPointsTotal": 57,
                                "hitUps": 1,
                                "ineffectiveTackles": 3,
                                "mins": 80,
                                "missedTackles": 1,
                                "offloads": 1,
                                "supports": 6,
                                "tackleBreaks": 8,
                                "tackles": 22,
                                "tryCause": 1,
                                "hitupRunMeters": 6,
                                "evasionRuns": 12,
                                "evasionRunMetres": 108,
                                "ptbFast": 18.18,
                                "ptbNeutral": 81.82,
                                "ptbAll": 11
                            },
                            "playerTookTheField": true,
                            "shirtNum": 3
                        },
                        {
                            "playerFirstName": "Solomone",
                            "playerId": 500921,
                            "playerLastName": "Kata",
                            "playerName": "Solomone Kata",
                            "playerPosition": "Centre 2",
                            "playerPositionId": 500004,
                            "playerStats": {
                                "allRunMetres": 82,
                                "allRuns": 11,
                                "decoys": 3,
                                "errors": 2,
                                "fantasyPointsTotal": 19,
                                "kicksDefused": 1,
                                "mins": 80,
                                "oneOnOneTackles": 1,
                                "supports": 5,
                                "tackleBreaks": 3,
                                "tackles": 5,
                                "tryCause": 2,
                                "evasionRuns": 11,
                                "evasionRunMetres": 82,
                                "ptbNeutral": 100,
                                "ptbAll": 9
                            },
                            "playerTookTheField": true,
                            "shirtNum": 4
                        },
                        {
                            "playerFirstName": "Manu",
                            "playerId": 500722,
                            "playerLastName": "Vatuvei",
                            "playerName": "Manu Vatuvei",
                            "playerPosition": "Winger 2",
                            "playerPositionId": 500005,
                            "playerStats": {
                                "allRunMetres": 106,
                                "allRuns": 10,
                                "decoys": 2,
                                "fantasyPointsTotal": 20,
                                "kickReturnMetres": 10,
                                "kickReturns": 1,
                                "mins": 60,
                                "missedTackles": 1,
                                "offloads": 1,
                                "oneOnOneTackles": 1,
                                "supports": 2,
                                "tackleBreaks": 2,
                                "tackles": 4,
                                "tryCause": 1,
                                "evasionRuns": 9,
                                "evasionRunMetres": 96,
                                "ptbFast": 22.22,
                                "ptbNeutral": 77.78,
                                "ptbAll": 9
                            },
                            "playerTookTheField": true,
                            "shirtNum": 5
                        },
                        {
                            "playerFirstName": "Chad",
                            "playerId": 501183,
                            "playerLastName": "Townsend",
                            "playerName": "Chad Townsend",
                            "playerPosition": "Five-eighth",
                            "playerPositionId": 500006,
                            "playerStats": {
                                "allRunMetres": 27,
                                "allRuns": 7,
                                "decoys": 2,
                                "dummyHalfRuns": 1,
                                "errors": 2,
                                "fantasyPointsTotal": 16,
                                "kickMetres": 173,
                                "kicks": 10,
                                "kicksDefused": 1,
                                "mins": 80,
                                "missedTackles": 7,
                                "offloads": 1,
                                "oneOnOneTackles": 1,
                                "penalties": 1,
                                "supports": 6,
                                "tackles": 23,
                                "tryCause": 2,
                                "evasionRuns": 6,
                                "evasionRunMetres": 24,
                                "dummyHalfRunMetres": 3,
                                "ptbNeutral": 100,
                                "ptbAll": 3
                            },
                            "playerTookTheField": true,
                            "shirtNum": 6
                        },
                        {
                            "playerFirstName": "Tuimoala",
                            "playerId": 500927,
                            "playerLastName": "Lolohea",
                            "playerName": "Tuimoala Lolohea",
                            "playerPosition": "Halfback",
                            "playerPositionId": 500007,
                            "playerStats": {
                                "allRunMetres": 50,
                                "allRuns": 6,
                                "decoys": 3,
                                "dummyHalfRuns": 2,
                                "errors": 2,
                                "fantasyPointsTotal": 20,
                                "kickMetres": 102,
                                "kicks": 4,
                                "mins": 80,
                                "missedTackles": 2,
                                "offloads": 1,
                                "oneOnOneTackles": 1,
                                "supports": 8,
                                "tackleBreaks": 1,
                                "tackles": 13,
                                "tryCause": 1,
                                "evasionRuns": 4,
                                "evasionRunMetres": 16,
                                "dummyHalfRunMetres": 34,
                                "ptbNeutral": 100,
                                "ptbAll": 2
                            },
                            "playerTookTheField": true,
                            "shirtNum": 7
                        },
                        {
                            "playerFirstName": "Jacob",
                            "playerId": 500708,
                            "playerLastName": "Lillyman",
                            "playerName": "Jacob Lillyman",
                            "playerPosition": "Prop 1",
                            "playerPositionId": 500008,
                            "playerStats": {
                                "allRunMetres": 92,
                                "allRuns": 11,
                                "decoys": 8,
                                "fantasyPointsTotal": 32,
                                "hitUps": 11,
                                "ineffectiveTackles": 1,
                                "mins": 54,
                                "missedTackles": 2,
                                "penalties": 1,
                                "supports": 4,
                                "tackles": 29,
                                "hitupRunMeters": 92,
                                "ptbFast": 9.09,
                                "ptbNeutral": 90.91,
                                "ptbAll": 11
                            },
                            "playerTookTheField": true,
                            "shirtNum": 8
                        },
                        {
                            "playerFirstName": "Nathan",
                            "playerId": 500700,
                            "playerLastName": "Friend",
                            "playerName": "Nathan Friend",
                            "playerPosition": "Hooker",
                            "playerPositionId": 500009,
                            "playerStats": {
                                "allRunMetres": 43,
                                "allRuns": 7,
                                "dummyHalfRuns": 6,
                                "fantasyPointsTotal": 45,
                                "hitUps": 1,
                                "ineffectiveTackles": 5,
                                "mins": 69,
                                "missedTackles": 1,
                                "offloads": 1,
                                "oneOnOneTackles": 1,
                                "penalties": 1,
                                "supports": 1,
                                "tackles": 43,
                                "tryCause": 1,
                                "hitupRunMeters": 7,
                                "dummyHalfRunMetres": 36,
                                "ptbNeutral": 85.71,
                                "ptbSlow": 14.29,
                                "ptbAll": 7
                            },
                            "playerTookTheField": true,
                            "shirtNum": 9
                        },
                        {
                            "playerFirstName": "Albert",
                            "playerId": 500937,
                            "playerLastName": "Vete",
                            "playerName": "Albert Vete",
                            "playerPosition": "Prop 2",
                            "playerPositionId": 500010,
                            "playerStats": {
                                "allRunMetres": 106,
                                "allRuns": 12,
                                "decoys": 7,
                                "fantasyPointsTotal": 41,
                                "hitUps": 12,
                                "ineffectiveTackles": 2,
                                "mins": 46,
                                "missedTackles": 2,
                                "offloads": 3,
                                "penalties": 1,
                                "supports": 1,
                                "tackleBreaks": 1,
                                "tackles": 28,
                                "hitupRunMeters": 106,
                                "ptbNeutral": 100,
                                "ptbAll": 11
                            },
                            "playerTookTheField": true,
                            "shirtNum": 10
                        },
                        {
                            "playerFirstName": "Ben",
                            "playerId": 500715,
                            "playerLastName": "Matulino",
                            "playerName": "Ben Matulino",
                            "playerPosition": "2nd Row 1",
                            "playerPositionId": 500011,
                            "playerStats": {
                                "allRunMetres": 144,
                                "allRuns": 16,
                                "decoys": 9,
                                "fantasyPointsTotal": 44,
                                "hitUps": 14,
                                "ineffectiveTackles": 2,
                                "kickReturnMetres": 13,
                                "kickReturns": 1,
                                "mins": 80,
                                "missedTackles": 1,
                                "offloads": 2,
                                "onReport": 1,
                                "oneOnOneTackles": 2,
                                "supports": 6,
                                "tackles": 28,
                                "hitupRunMeters": 125,
                                "evasionRuns": 1,
                                "evasionRunMetres": 6,
                                "ptbFast": 30.77,
                                "ptbNeutral": 61.54,
                                "ptbSlow": 7.69,
                                "ptbAll": 13
                            },
                            "playerTookTheField": true,
                            "shirtNum": 11
                        },
                        {
                            "playerFirstName": "Simon",
                            "playerId": 500712,
                            "playerLastName": "Mannering",
                            "playerName": "Simon Mannering",
                            "playerPosition": "2nd Row 2",
                            "playerPositionId": 500012,
                            "playerStats": {
                                "allRunMetres": 95,
                                "allRuns": 11,
                                "decoys": 12,
                                "fantasyPointsTotal": 39,
                                "hitUps": 10,
                                "ineffectiveTackles": 5,
                                "mins": 80,
                                "missedTackles": 3,
                                "offloads": 1,
                                "penalties": 1,
                                "supports": 5,
                                "tackles": 36,
                                "tryCause": 1,
                                "hitupRunMeters": 92,
                                "evasionRuns": 1,
                                "evasionRunMetres": 3,
                                "ptbFast": 11.11,
                                "ptbNeutral": 88.89,
                                "ptbAll": 9
                            },
                            "playerTookTheField": true,
                            "shirtNum": 12
                        },
                        {
                            "playerFirstName": "Sebastine",
                            "playerId": 500704,
                            "playerLastName": "Ikahihifo",
                            "playerName": "Sebastine Ikahihifo",
                            "playerPosition": "Lock",
                            "playerPositionId": 500013,
                            "playerStats": {
                                "allRunMetres": 46,
                                "allRuns": 5,
                                "decoys": 7,
                                "fantasyPointsTotal": 31,
                                "hitUps": 4,
                                "ineffectiveTackles": 3,
                                "kickReturnMetres": 15,
                                "kickReturns": 1,
                                "mins": 39,
                                "oneOnOneTackles": 2,
                                "penalties": 1,
                                "supports": 5,
                                "tackles": 29,
                                "hitupRunMeters": 31,
                                "ptbNeutral": 100,
                                "ptbAll": 5
                            },
                            "playerTookTheField": true,
                            "shirtNum": 13
                        },
                        {
                            "playerFirstName": "Siliva",
                            "playerId": 501394,
                            "playerLastName": "Havili",
                            "playerName": "Siliva Havili",
                            "playerPosition": "Interchange",
                            "playerPositionId": 500014,
                            "playerStats": {
                                "allRunMetres": 17,
                                "allRuns": 1,
                                "dummyHalfRuns": 1,
                                "fantasyPointsTotal": 4,
                                "mins": 11,
                                "missedTackles": 2,
                                "tackles": 7,
                                "dummyHalfRunMetres": 17,
                                "ptbNeutral": 100,
                                "ptbAll": 1
                            },
                            "playerTookTheField": true,
                            "shirtNum": 14
                        },
                        {
                            "playerFirstName": "Sam",
                            "playerId": 500926,
                            "playerLastName": "Lisone",
                            "playerName": "Sam Lisone",
                            "playerPosition": "Interchange",
                            "playerPositionId": 500014,
                            "playerStats": {
                                "allRunMetres": 54,
                                "allRuns": 6,
                                "decoys": 8,
                                "fantasyPointsTotal": 19,
                                "hitUps": 6,
                                "mins": 32,
                                "missedTackles": 2,
                                "oneOnOneTackles": 1,
                                "supports": 3,
                                "tackles": 18,
                                "tryCause": 1,
                                "hitupRunMeters": 54,
                                "ptbNeutral": 100,
                                "ptbAll": 6
                            },
                            "playerTookTheField": true,
                            "shirtNum": 15
                        },
                        {
                            "playerFirstName": "Charlie",
                            "playerId": 500701,
                            "playerLastName": "Gubb",
                            "playerName": "Charlie Gubb",
                            "playerPosition": "Interchange",
                            "playerPositionId": 500014,
                            "playerStats": {
                                "allRunMetres": 51,
                                "allRuns": 5,
                                "decoys": 1,
                                "fantasyPointsTotal": 20,
                                "hitUps": 5,
                                "ineffectiveTackles": 3,
                                "mins": 28,
                                "missedTackles": 1,
                                "supports": 5,
                                "tackles": 17,
                                "hitupRunMeters": 51,
                                "ptbFast": 25,
                                "ptbNeutral": 75,
                                "ptbAll": 4
                            },
                            "playerTookTheField": true,
                            "shirtNum": 16
                        },
                        {
                            "playerFirstName": "Raymond",
                            "playerId": 500916,
                            "playerLastName": "Faitala-Mariner",
                            "playerName": "Raymond Faitala-Mariner",
                            "playerPosition": "Interchange",
                            "playerPositionId": 500014,
                            "playerStats": {
                                "allRunMetres": 100,
                                "allRuns": 10,
                                "decoys": 5,
                                "fantasyPointsTotal": 35,
                                "hitUps": 10,
                                "mins": 61,
                                "oneOnOneTackles": 1,
                                "supports": 3,
                                "tackles": 25,
                                "tryCause": 1,
                                "hitupRunMeters": 100,
                                "ptbNeutral": 88.89,
                                "ptbSlow": 11.11,
                                "ptbAll": 9
                            },
                            "playerTookTheField": true,
                            "shirtNum": 17
                        }
                    ]
                },
                "teamName": "New Zealand Warriors",
                "teamNickName": "Warriors",
                "teamStats": {
                    "allRunMetres": 1338,
                    "allRuns": 158,
                    "bombKicksDefused": 3,
                    "completeSets": 25,
                    "completionPercentage": 71,
                    "decoys": 71,
                    "dummyHalfRuns": 10,
                    "errors": 12,
                    "hitUps": 75,
                    "incompleteSets": 10,
                    "ineffectiveTackles": 26,
                    "kickMetres": 391,
                    "kickReturnMetres": 97,
                    "kickReturns": 12,
                    "kicks": 17,
                    "kicksDefused": 7,
                    "kicksNotDefused": 1,
                    "lineDropouts": 2,
                    "linebreaks": 1,
                    "missedTackles": 27,
                    "offloads": 14,
                    "onReports": 1,
                    "oneOnOneTackles": 12,
                    "penalties": 6,
                    "pointsConceded": 36,
                    "possession": 50,
                    "scrumWins": 5,
                    "supports": 72,
                    "tackleBreaks": 19,
                    "tackles": 342,
                    "sets": 35,
                    "triesConceded": 6,
                    "hitupRunMeters": 677,
                    "evasionRuns": 61,
                    "evasionRunMetres": 474,
                    "dummyHalfRunMetres": 90,
                    "ptbFast": 11,
                    "ptbNeutral": 87,
                    "ptbSlow": 2,
                    "ptbTotal": 126
                }
            },
            {
                "score": {
                    "conversions": 4,
                    "points": 36,
                    "penaltyGoals": 2,
                    "tries": 6
                },
                "team1stHalfScore": 10,
                "team2ndHalfScore": 26,
                "teamAbbr": "SGI",
                "teamFinalScore": 36,
                "teamFullTimeScore": 36,
                "teamHalfTimeScore": 10,
                "teamId": 500022,
                "teamLineup": {
                    "injuriesAndSuspensions": {
                        "injury": [
                            {
                                "injuryDescription": "Back, Round 21",
                                "playerFirstName": "Dylan",
                                "playerId": "500084",
                                "playerLastName": "Farrell",
                                "playerName": "Dylan Farrell"
                            },
                            {
                                "injuryDescription": "Knee, Indefinite",
                                "playerFirstName": "Etonia",
                                "playerId": "500357",
                                "playerLastName": "Nabuli",
                                "playerName": "Etonia Nabuli"
                            },
                            {
                                "injuryDescription": "Knee, Season",
                                "playerFirstName": "Dan",
                                "playerId": "500627",
                                "playerLastName": "Hunt",
                                "playerName": "Dan Hunt"
                            },
                            {
                                "injuryDescription": "Hamstring, Round 21",
                                "playerFirstName": "Yaw",
                                "playerId": "500628",
                                "playerLastName": "Kiti Glymin",
                                "playerName": "Yaw Kiti Glymin"
                            },
                            {
                                "injuryDescription": "Ankle, Round 22",
                                "playerFirstName": "Rory ",
                                "playerId": "501503",
                                "playerLastName": "O'Brien",
                                "playerName": "Rory O'Brien"
                            }
                        ],
                        "suspension": []
                    },
                    "insAndOuts": {
                        "inOut": [
                            {
                                "inOut": "Out",
                                "playerFirstName": "Dylan",
                                "playerId": "500084",
                                "playerLastName": "Farrell",
                                "playerName": "Dylan Farrell"
                            },
                            {
                                "inOut": "Out",
                                "playerFirstName": "Jason",
                                "playerId": "500634",
                                "playerLastName": "Nightingale",
                                "playerName": "Jason Nightingale"
                            },
                            {
                                "inOut": "In",
                                "playerFirstName": "Justin",
                                "playerId": "500673",
                                "playerLastName": "Hunt",
                                "playerName": "Justin Hunt"
                            },
                            {
                                "inOut": "In",
                                "playerFirstName": "Trent",
                                "playerId": "500632",
                                "playerLastName": "Merrin",
                                "playerName": "Trent Merrin"
                            }
                        ]
                    },
                    "teamPlayer": [
                        {
                            "playerFirstName": "Josh",
                            "playerId": 500621,
                            "playerLastName": "Dugan",
                            "playerName": "Josh Dugan",
                            "playerPosition": "Fullback",
                            "playerPositionId": 500001,
                            "playerStats": {
                                "allRunMetres": 143,
                                "allRuns": 17,
                                "decoys": 2,
                                "errors": 1,
                                "fantasyPointsTotal": 51,
                                "kickMetres": 31,
                                "kickReturnMetres": 49,
                                "kickReturns": 5,
                                "kicks": 1,
                                "kicksDefused": 2,
                                "lineDropouts": 2,
                                "mins": 80,
                                "offloads": 1,
                                "oneOnOneTackles": 3,
                                "penalties": 1,
                                "supports": 7,
                                "tackleBreaks": 4,
                                "tackles": 14,
                                "trySaves": 2,
                                "evasionRuns": 12,
                                "evasionRunMetres": 94,
                                "ptbNeutral": 78.57,
                                "ptbSlow": 21.43,
                                "ptbAll": 14
                            },
                            "playerTookTheField": true,
                            "shirtNum": 1
                        },
                        {
                            "playerFirstName": "Justin",
                            "playerId": 500673,
                            "playerLastName": "Hunt",
                            "playerName": "Justin Hunt",
                            "playerPosition": "Winger 1",
                            "playerPositionId": 500002,
                            "playerStats": {
                                "allRunMetres": 80,
                                "allRuns": 8,
                                "decoys": 1,
                                "dummyHalfRuns": 1,
                                "errors": 1,
                                "fantasyPointsTotal": 27,
                                "ineffectiveTackles": 1,
                                "kickReturns": 1,
                                "kicksNotDefused": 1,
                                "linebreaks": 1,
                                "mins": 80,
                                "missedTackles": 1,
                                "oneOnOneTackles": 1,
                                "points": 4,
                                "supports": 2,
                                "tackleBreaks": 2,
                                "tackles": 5,
                                "tries": 1,
                                "evasionRuns": 6,
                                "evasionRunMetres": 68,
                                "dummyHalfRunMetres": 12,
                                "ptbNeutral": 100,
                                "ptbAll": 8
                            },
                            "playerTookTheField": true,
                            "shirtNum": 18
                        },
                        {
                            "playerFirstName": "Euan",
                            "playerId": 500441,
                            "playerLastName": "Aitken",
                            "playerName": "Euan Aitken",
                            "playerPosition": "Centre 1",
                            "playerPositionId": 500003,
                            "playerStats": {
                                "allRunMetres": 109,
                                "allRuns": 12,
                                "decoys": 1,
                                "dummyHalfRuns": 3,
                                "fantasyPointsTotal": 41,
                                "hitUps": 1,
                                "kickReturnMetres": 5,
                                "kickReturns": 1,
                                "linebreaks": 1,
                                "mins": 80,
                                "missedTackles": 1,
                                "offloads": 4,
                                "oneOnOneTackles": 1,
                                "penalties": 1,
                                "supports": 6,
                                "tackleBreaks": 1,
                                "tackles": 15,
                                "tryAssists": 1,
                                "hitupRunMeters": 10,
                                "evasionRuns": 7,
                                "evasionRunMetres": 76,
                                "dummyHalfRunMetres": 18,
                                "ptbFast": 14.29,
                                "ptbNeutral": 85.71,
                                "ptbAll": 7
                            },
                            "playerTookTheField": true,
                            "shirtNum": 3
                        },
                        {
                            "playerFirstName": "Will",
                            "playerId": 500631,
                            "playerLastName": "Matthews",
                            "playerName": "Will Matthews",
                            "playerPosition": "Centre 2",
                            "playerPositionId": 500004,
                            "playerStats": {
                                "decoys": 1,
                                "fantasyPointsTotal": 2,
                                "ineffectiveTackles": 1,
                                "mins": 11,
                                "missedTackles": 1,
                                "tackles": 4
                            },
                            "playerTookTheField": true,
                            "shirtNum": 16
                        },
                        {
                            "playerFirstName": "Peter",
                            "playerId": 500630,
                            "playerLastName": "Mata'utia",
                            "playerName": "Peter Mata'utia",
                            "playerPosition": "Winger 2",
                            "playerPositionId": 500005,
                            "playerStats": {
                                "allRunMetres": 115,
                                "allRuns": 11,
                                "dummyHalfRuns": 2,
                                "errors": 1,
                                "fantasyPointsTotal": 34,
                                "kickReturnMetres": 2,
                                "kickReturns": 1,
                                "kicksDefused": 3,
                                "mins": 80,
                                "missedTackles": 4,
                                "offloads": 3,
                                "oneOnOneTackles": 1,
                                "points": 4,
                                "supports": 5,
                                "tackleBreaks": 4,
                                "tackles": 4,
                                "tries": 1,
                                "evasionRuns": 8,
                                "evasionRunMetres": 104,
                                "dummyHalfRunMetres": 9,
                                "ptbFast": 14.29,
                                "ptbNeutral": 85.71,
                                "ptbAll": 7
                            },
                            "playerTookTheField": true,
                            "shirtNum": 4
                        },
                        {
                            "playerFirstName": "Gareth",
                            "playerId": 500641,
                            "playerLastName": "Widdop",
                            "playerName": "Gareth Widdop",
                            "playerPosition": "Five-eighth",
                            "playerPositionId": 500006,
                            "playerStats": {
                                "allRunMetres": 81,
                                "allRuns": 10,
                                "bombKicks": 2,
                                "bombKickMetres": 54,
                                "conversions": 4,
                                "conversionsAttempts": 6,
                                "conversionsMissed": 2,
                                "dummyHalfRuns": 2,
                                "errors": 1,
                                "fantasyPointsTotal": 76,
                                "goalConversionRate": 75,
                                "allGoals": 6,
                                "allGoalsMissed": 2,
                                "allGoalsAttempted": 8,
                                "ineffectiveTackles": 1,
                                "kickMetres": 348,
                                "kicks": 13,
                                "linebreakAssists": 1,
                                "linebreaks": 1,
                                "mins": 80,
                                "missedTackles": 2,
                                "offloads": 2,
                                "oneOnOneTackles": 2,
                                "penalties": 2,
                                "penaltyGoals": 2,
                                "penaltyGoalsAttempts": 2,
                                "points": 16,
                                "supports": 3,
                                "tackleBreaks": 2,
                                "tackles": 10,
                                "tries": 1,
                                "tryAssists": 1,
                                "trySaves": 2,
                                "evasionRuns": 8,
                                "evasionRunMetres": 79,
                                "dummyHalfRunMetres": 2,
                                "ptbNeutral": 100,
                                "ptbAll": 3
                            },
                            "playerTookTheField": true,
                            "shirtNum": 6
                        },
                        {
                            "playerFirstName": "Benji",
                            "playerId": 500948,
                            "playerLastName": "Marshall",
                            "playerName": "Benji Marshall",
                            "playerPosition": "Halfback",
                            "playerPositionId": 500007,
                            "playerStats": {
                                "allRunMetres": 10,
                                "allRuns": 1,
                                "bombKicks": 1,
                                "bombKickMetres": 40,
                                "errors": 1,
                                "fantasyPointsTotal": 8,
                                "kickMetres": 79,
                                "kicks": 2,
                                "linebreakAssists": 1,
                                "mins": 16,
                                "missedTackles": 2,
                                "tackles": 3,
                                "tryAssists": 1,
                                "evasionRuns": 1,
                                "evasionRunMetres": 10
                            },
                            "playerTookTheField": true,
                            "shirtNum": 7
                        },
                        {
                            "playerFirstName": "Leeson",
                            "playerId": 500614,
                            "playerLastName": "Ah Mau",
                            "playerName": "Leeson Ah Mau",
                            "playerPosition": "Prop 1",
                            "playerPositionId": 500008,
                            "playerStats": {
                                "allRunMetres": 202,
                                "allRuns": 20,
                                "decoys": 5,
                                "errors": 2,
                                "fantasyPointsTotal": 56,
                                "hitUps": 20,
                                "ineffectiveTackles": 4,
                                "linebreaks": 1,
                                "mins": 59,
                                "offloads": 2,
                                "supports": 7,
                                "tackleBreaks": 2,
                                "tackles": 26,
                                "hitupRunMeters": 202,
                                "ptbNeutral": 100,
                                "ptbAll": 16
                            },
                            "playerTookTheField": true,
                            "shirtNum": 8
                        },
                        {
                            "playerFirstName": "Mitch",
                            "playerId": 500636,
                            "playerLastName": "Rein",
                            "playerName": "Mitch Rein",
                            "playerPosition": "Hooker",
                            "playerPositionId": 500009,
                            "playerStats": {
                                "allRunMetres": 67,
                                "allRuns": 7,
                                "dummyHalfRuns": 6,
                                "fantasyPointsTotal": 87,
                                "hitUps": 1,
                                "ineffectiveTackles": 2,
                                "kickMetres": 92,
                                "kicks": 3,
                                "linebreakAssists": 2,
                                "linebreaks": 1,
                                "mins": 65,
                                "missedTackles": 3,
                                "offloads": 2,
                                "oneOnOneTackles": 1,
                                "points": 4,
                                "tackleBreaks": 4,
                                "tackles": 41,
                                "tries": 1,
                                "tryAssists": 2,
                                "hitupRunMeters": 2,
                                "dummyHalfRunMetres": 65,
                                "ptbFast": 33.33,
                                "ptbNeutral": 66.67,
                                "ptbAll": 3
                            },
                            "playerTookTheField": true,
                            "shirtNum": 9
                        },
                        {
                            "playerFirstName": "Jack",
                            "playerId": 500619,
                            "playerLastName": "de Belin",
                            "playerName": "Jack de Belin",
                            "playerPosition": "Prop 2",
                            "playerPositionId": 500010,
                            "playerStats": {
                                "allRunMetres": 139,
                                "allRuns": 14,
                                "decoys": 1,
                                "fantasyPointsTotal": 47,
                                "hitUps": 11,
                                "ineffectiveTackles": 2,
                                "kicksDefused": 2,
                                "kicksNotDefused": 1,
                                "mins": 80,
                                "missedTackles": 2,
                                "offloads": 1,
                                "penalties": 1,
                                "supports": 8,
                                "tackleBreaks": 2,
                                "tackles": 30,
                                "hitupRunMeters": 120,
                                "evasionRuns": 3,
                                "evasionRunMetres": 19,
                                "ptbNeutral": 100,
                                "ptbAll": 10
                            },
                            "playerTookTheField": true,
                            "shirtNum": 17
                        },
                        {
                            "playerFirstName": "Tyson",
                            "playerId": 500622,
                            "playerLastName": "Frizell",
                            "playerName": "Tyson Frizell",
                            "playerPosition": "2nd Row 1",
                            "playerPositionId": 500011,
                            "playerStats": {
                                "allRunMetres": 67,
                                "allRuns": 5,
                                "decoys": 3,
                                "fantasyPointsTotal": 46,
                                "hitUps": 4,
                                "ineffectiveTackles": 2,
                                "kicksNotDefused": 1,
                                "linebreaks": 1,
                                "mins": 80,
                                "missedTackles": 1,
                                "oneOnOneTackles": 1,
                                "penalties": 1,
                                "points": 4,
                                "supports": 5,
                                "tackles": 32,
                                "tries": 1,
                                "hitupRunMeters": 39,
                                "evasionRuns": 1,
                                "evasionRunMetres": 28,
                                "ptbNeutral": 100,
                                "ptbAll": 5
                            },
                            "playerTookTheField": true,
                            "shirtNum": 11
                        },
                        {
                            "playerFirstName": "Joel",
                            "playerId": 500640,
                            "playerLastName": "Thompson",
                            "playerName": "Joel Thompson",
                            "playerPosition": "2nd Row 2",
                            "playerPositionId": 500012,
                            "playerStats": {
                                "allRunMetres": 128,
                                "allRuns": 11,
                                "decoys": 7,
                                "fantasyPointsTotal": 40,
                                "hitUps": 10,
                                "ineffectiveTackles": 2,
                                "kickReturnMetres": 7,
                                "kickReturns": 1,
                                "mins": 80,
                                "oneOnOneTackles": 6,
                                "supports": 4,
                                "tackles": 28,
                                "hitupRunMeters": 121,
                                "ptbNeutral": 100,
                                "ptbAll": 11
                            },
                            "playerTookTheField": true,
                            "shirtNum": 12
                        },
                        {
                            "playerFirstName": "Mike",
                            "playerId": 501282,
                            "playerLastName": "Cooper",
                            "playerName": "Mike Cooper",
                            "playerPosition": "Lock",
                            "playerPositionId": 500013,
                            "playerStats": {
                                "allRunMetres": 125,
                                "allRuns": 15,
                                "decoys": 2,
                                "errors": 1,
                                "fantasyPointsTotal": 45,
                                "hitUps": 12,
                                "kickReturnMetres": 22,
                                "kickReturns": 3,
                                "mins": 56,
                                "supports": 9,
                                "tackleBreaks": 2,
                                "tackles": 29,
                                "hitupRunMeters": 103,
                                "ptbFast": 14.29,
                                "ptbNeutral": 85.71,
                                "ptbAll": 14
                            },
                            "playerTookTheField": true,
                            "shirtNum": 13
                        },
                        {
                            "playerFirstName": "Ben",
                            "playerId": 500618,
                            "playerLastName": "Creagh",
                            "playerName": "Ben Creagh",
                            "playerPosition": "Interchange",
                            "playerPositionId": 500014,
                            "playerStats": {
                                "allRunMetres": 162,
                                "allRuns": 15,
                                "decoys": 2,
                                "fantasyPointsTotal": 51,
                                "hitUps": 14,
                                "ineffectiveTackles": 3,
                                "kickReturnMetres": 15,
                                "kickReturns": 1,
                                "mins": 55,
                                "offloads": 1,
                                "supports": 4,
                                "tackles": 33,
                                "hitupRunMeters": 147,
                                "ptbNeutral": 100,
                                "ptbAll": 14
                            },
                            "playerTookTheField": true,
                            "shirtNum": 10
                        },
                        {
                            "playerFirstName": "Craig",
                            "playerId": 500623,
                            "playerLastName": "Garvey",
                            "playerName": "Craig Garvey",
                            "playerPosition": "Interchange",
                            "playerPositionId": 500014,
                            "playerStats": {
                                "allRunMetres": 16,
                                "allRuns": 3,
                                "dummyHalfRuns": 2,
                                "fantasyPointsTotal": 4,
                                "hitUps": 1,
                                "ineffectiveTackles": 1,
                                "mins": 15,
                                "oneOnOneTackles": 1,
                                "tackles": 3,
                                "hitupRunMeters": 7,
                                "dummyHalfRunMetres": 9,
                                "ptbNeutral": 100,
                                "ptbAll": 2
                            },
                            "playerTookTheField": true,
                            "shirtNum": 14
                        },
                        {
                            "playerFirstName": "Trent",
                            "playerId": 500632,
                            "playerLastName": "Merrin",
                            "playerName": "Trent Merrin",
                            "playerPosition": "Interchange",
                            "playerPositionId": 500014,
                            "playerStats": {
                                "allRunMetres": 197,
                                "allRuns": 19,
                                "decoys": 2,
                                "fantasyPointsTotal": 69,
                                "hitUps": 13,
                                "ineffectiveTackles": 2,
                                "kickReturnMetres": 62,
                                "kickReturns": 6,
                                "linebreaks": 1,
                                "mins": 54,
                                "offloads": 1,
                                "penalties": 1,
                                "supports": 1,
                                "tackleBreaks": 4,
                                "tackles": 34,
                                "hitupRunMeters": 135,
                                "ptbNeutral": 100,
                                "ptbAll": 17
                            },
                            "playerTookTheField": true,
                            "shirtNum": 15
                        },
                        {
                            "playerFirstName": "Jake",
                            "playerId": 501088,
                            "playerLastName": "Marketo",
                            "playerName": "Jake Marketo",
                            "playerPosition": "Interchange",
                            "playerPositionId": 500014,
                            "playerStats": {
                                "allRunMetres": 41,
                                "allRuns": 2,
                                "errors": 1,
                                "fantasyPointsTotal": 26,
                                "hitUps": 2,
                                "ineffectiveTackles": 1,
                                "intercepts": 1,
                                "mins": 69,
                                "missedTackles": 2,
                                "oneOnOneTackles": 2,
                                "points": 4,
                                "supports": 7,
                                "tackles": 20,
                                "tries": 1,
                                "hitupRunMeters": 41,
                                "ptbFast": 50,
                                "ptbNeutral": 50,
                                "ptbAll": 2
                            },
                            "playerTookTheField": true,
                            "shirtNum": 19
                        }
                    ]
                },
                "teamName": "St. George Illawarra Dragons",
                "teamNickName": "Dragons",
                "teamStats": {
                    "allRunMetres": 1680,
                    "allRuns": 170,
                    "bombKicks": 3,
                    "bombKickMetres": 94,
                    "completeSets": 30,
                    "completionPercentage": 79,
                    "conversions": 4,
                    "conversionsAttempts": 6,
                    "conversionsMissed": 2,
                    "decoys": 27,
                    "dummyHalfRuns": 16,
                    "errors": 9,
                    "goalConversionRate": 75,
                    "allGoals": 6,
                    "allGoalsAttempted": 8,
                    "allGoalsMissed": 2,
                    "hitUps": 89,
                    "incompleteSets": 8,
                    "ineffectiveTackles": 22,
                    "intercepts": 1,
                    "kickMetres": 550,
                    "kickReturnMetres": 163,
                    "kickReturns": 19,
                    "kicks": 19,
                    "kicksDefused": 7,
                    "kicksNotDefused": 3,
                    "lineDropouts": 2,
                    "linebreakAssists": 4,
                    "linebreaks": 7,
                    "missedTackles": 19,
                    "offloads": 17,
                    "oneOnOneTackles": 19,
                    "penalties": 7,
                    "penaltyGoals": 2,
                    "penaltyGoalsAttempts": 2,
                    "points": 36,
                    "possession": 50,
                    "scrumWins": 6,
                    "supports": 68,
                    "tackleBreaks": 27,
                    "tackles": 331,
                    "sets": 38,
                    "tries": 6,
                    "tryAssists": 5,
                    "trySaves": 4,
                    "hitupRunMeters": 926,
                    "evasionRuns": 46,
                    "evasionRunMetres": 477,
                    "dummyHalfRunMetres": 114,
                    "ptbFast": 5,
                    "ptbNeutral": 93,
                    "ptbSlow": 2,
                    "ptbTotal": 133
                }
            }
        ]
    }
}