{
    "vod": [
        {
            "id": "lleHVyYjE6Co7CP3KAv0E4PyD8LiHOsh",
            "contentId": 921659,
            "title": "Rd 17: Raiders v Cowboys (Hls)",
            "description": "Highlights of the Round 17 clash between the Raiders & Cowboys",
            "publishDate": "2017-07-01T21:31:05+10:00",
            "publisher": "NRL Chief",
            "thumbnailUrl": "http://bpvideos.telstra.insnw.net/web/images/20170701211941a_89x50.jpg",
            "largeThumbnailUrl": "http://bpvideos.telstra.insnw.net/web/images/20170701211941a_326x184.jpg",
            "programType": "Highlights",
            "programCategory": "Match",
            "priority": null,
            "lastUpdateDate": "2017-07-01T21:36:20+10:00",
            "isPremium": false,
            "club": [
                500013,
                500012
            ]
        },
        {
            "id": "FxNHZyYjE6wA9P0q4xVPo0MDwVXMgv7a",
            "contentId": 921684,
            "title": "Rd 17 Press Conference: Raiders",
            "description": "Raiders coach Ricky Stuart speaks with the media following their Round 17 clash",
            "publishDate": "2017-07-01T22:06:50+10:00",
            "publisher": "NRL Chief",
            "thumbnailUrl": "http://bpvideos.telstra.insnw.net/web/images/20170701220112a_89x50.jpg",
            "largeThumbnailUrl": "http://bpvideos.telstra.insnw.net/web/images/20170701220112a_326x184.jpg",
            "programType": "Press Conference",
            "programCategory": null,
            "priority": null,
            "lastUpdateDate": "2017-07-01T22:12:28+10:00",
            "isPremium": false,
            "club": [
                500013,
                500012
            ]
        },
        {
            "id": "5qM3ZyYjE68PTTUGeDJD16E3NYvbN0GL",
            "contentId": 921687,
            "title": "Rd 17 Press Conference: Cowboys",
            "description": "Cowboys coach Paul Green speaks with the media following their Round 17 clash",
            "publishDate": "2017-07-01T22:00:00+10:00",
            "publisher": "NRL Chief",
            "thumbnailUrl": "http://bpvideos.telstra.insnw.net/web/images/20170701220032a_89x50.jpg",
            "largeThumbnailUrl": "http://bpvideos.telstra.insnw.net/web/images/20170701220032a_326x184.jpg",
            "programType": "Press Conference",
            "programCategory": null,
            "priority": null,
            "lastUpdateDate": "2017-07-01T22:05:26+10:00",
            "isPremium": false,
            "club": [
                500013,
                500012
            ]
        },
        {
            "id": "gzdXVyYjE6Zfq4dXnljy2GNdOes_aTgF",
            "contentId": 922296,
            "title": "Rd 17: GOAL Ethan Lowe (76th min)",
            "description": "Ethan Lowe converts the try of Te Maire Martin",
            "publishDate": "2017-07-01T21:13:24+10:00",
            "publisher": "NRL Chief",
            "thumbnailUrl": "http://bpvideos.telstra.insnw.net/web/images/20170701211325a_89x50.jpg",
            "largeThumbnailUrl": "http://bpvideos.telstra.insnw.net/web/images/20170701211325a_326x184.jpg",
            "programType": "Instant Replay",
            "programCategory": "Score",
            "priority": 10,
            "lastUpdateDate": "2017-07-01T21:22:17+10:00",
            "isPremium": true,
            "club": [
                500013,
                500012
            ]
        },
        {
            "id": "h1dHVyYjE6iVyu5H26gmmCO8K0iJ1UhH",
            "contentId": 922295,
            "title": "Rd 17: TRY Te Maire Martin (74th min)",
            "description": "Te Maire Martin crosses for his second try to seal the win",
            "publishDate": "2017-07-01T21:12:51+10:00",
            "publisher": "NRL Chief",
            "thumbnailUrl": "http://bpvideos.telstra.insnw.net/web/images/20170701211202a_89x50.jpg",
            "largeThumbnailUrl": "http://bpvideos.telstra.insnw.net/web/images/20170701211202a_326x184.jpg",
            "programType": "Instant Replay",
            "programCategory": "Score",
            "priority": 9,
            "lastUpdateDate": "2017-07-01T21:22:17+10:00",
            "isPremium": true,
            "club": [
                500013,
                500012
            ]
        },
        {
            "id": "w1c3VyYjE6gUqBsEp0Kv3wAWJiISEOqK",
            "contentId": 922293,
            "title": "Rd 17: GOAL Aidan Sezer (68th min)",
            "description": "Aidan Sezer converts Nick Cotric's try",
            "publishDate": "2017-07-01T21:06:10+10:00",
            "publisher": "NRL Chief",
            "thumbnailUrl": "http://bpvideos.telstra.insnw.net/web/images/20170701210536a_89x50.jpg",
            "largeThumbnailUrl": "http://bpvideos.telstra.insnw.net/web/images/20170701210536a_326x184.jpg",
            "programType": "Instant Replay",
            "programCategory": "Score",
            "priority": null,
            "lastUpdateDate": "2017-07-01T21:10:13+10:00",
            "isPremium": true,
            "club": [
                500013,
                500012
            ]
        },
        {
            "id": "JvcnVyYjE6Q3kH20l1wxkKsXb6enhkF8",
            "contentId": 922290,
            "title": "Rd 17: TRY Nick Cotric (68th min)",
            "description": "Nick Cotric streaks away to keep the Raiders in the hunt",
            "publishDate": "2017-07-01T21:04:28+10:00",
            "publisher": "NRL Chief",
            "thumbnailUrl": "http://bpvideos.telstra.insnw.net/web/images/20170701210418a_89x50.jpg",
            "largeThumbnailUrl": "http://bpvideos.telstra.insnw.net/web/images/20170701210418a_326x184.jpg",
            "programType": "Instant Replay",
            "programCategory": "Score",
            "priority": 8,
            "lastUpdateDate": "2017-07-01T21:22:17+10:00",
            "isPremium": true,
            "club": [
                500013,
                500012
            ]
        },
        {
            "id": "EzcXVyYjE6Oh6XP6r2SBFgjC_NOjuLm8",
            "contentId": 922282,
            "title": "Rd 17: GOAL Ethan Lowe (60th min)",
            "description": "Ethan Lowe converts for a 13-point lead",
            "publishDate": "2017-07-01T20:57:03+10:00",
            "publisher": "NRL Chief",
            "thumbnailUrl": "http://bpvideos.telstra.insnw.net/web/images/20170701205643a_89x50.jpg",
            "largeThumbnailUrl": "http://bpvideos.telstra.insnw.net/web/images/20170701205643a_326x184.jpg",
            "programType": "Instant Replay",
            "programCategory": "Score",
            "priority": null,
            "lastUpdateDate": "2017-07-01T21:01:11+10:00",
            "isPremium": true,
            "club": [
                500013,
                500012
            ]
        },
        {
            "id": "9jcHVyYjE6nillQGvdRbtveHKB3qhAq0",
            "contentId": 922281,
            "title": "Rd 17: TRY Michael Morgan (59th min)",
            "description": "Michael Morgan scores a quickfire second try",
            "publishDate": "2017-07-01T20:56:51+10:00",
            "publisher": "NRL Chief",
            "thumbnailUrl": "http://bpvideos.telstra.insnw.net/web/images/20170701205557a_89x50.jpg",
            "largeThumbnailUrl": "http://bpvideos.telstra.insnw.net/web/images/20170701205557a_326x184.jpg",
            "programType": "Instant Replay",
            "programCategory": "Score",
            "priority": 7,
            "lastUpdateDate": "2017-07-01T21:22:17+10:00",
            "isPremium": true,
            "club": [
                500013,
                500012
            ]
        },
        {
            "id": "B1bnVyYjE6lp69aL9J1QlH0FuqT8cgBj",
            "contentId": 922278,
            "title": "Rd 17: TRY Michael Morgan (55th min)",
            "description": "Michael Morgan crosses to extend the Cowboys' lead",
            "publishDate": "2017-07-01T20:51:50+10:00",
            "publisher": "NRL Chief",
            "thumbnailUrl": "http://bpvideos.telstra.insnw.net/web/images/20170701205120a_89x50.jpg",
            "largeThumbnailUrl": "http://bpvideos.telstra.insnw.net/web/images/20170701205120a_326x184.jpg",
            "programType": "Instant Replay",
            "programCategory": "Score",
            "priority": 6,
            "lastUpdateDate": "2017-07-01T21:23:16+10:00",
            "isPremium": true,
            "club": [
                500013,
                500012
            ]
        },
        {
            "id": "hzbnVyYjE6zSiXm4XhUv8CZE0RYE2lT6",
            "contentId": 922280,
            "title": "Rd 17: GOAL Ethan Lowe (56th min)",
            "description": "Ethan Lowe converts the try of Michael Morgan",
            "publishDate": "2017-07-01T20:51:45+10:00",
            "publisher": "NRL Chief",
            "thumbnailUrl": "http://bpvideos.telstra.insnw.net/web/images/20170701205139a_89x50.jpg",
            "largeThumbnailUrl": "http://bpvideos.telstra.insnw.net/web/images/20170701205139a_326x184.jpg",
            "programType": "Instant Replay",
            "programCategory": "Score",
            "priority": null,
            "lastUpdateDate": "2017-07-01T20:55:09+10:00",
            "isPremium": true,
            "club": [
                500013,
                500012
            ]
        },
        {
            "id": "wzbXVyYjE6YZ0_Ya-BUbp2R2bNDHKwcP",
            "contentId": 922275,
            "title": "Rd 17: GOAL Aidan Sezer (46th min)",
            "description": "Aidan Sezer converts to bring the Raiders to within a point of the Cowboys",
            "publishDate": "2017-07-01T20:42:25+10:00",
            "publisher": "NRL Chief",
            "thumbnailUrl": "http://bpvideos.telstra.insnw.net/web/images/20170701204213a_89x50.jpg",
            "largeThumbnailUrl": "http://bpvideos.telstra.insnw.net/web/images/20170701204213a_326x184.jpg",
            "programType": "Instant Replay",
            "programCategory": "Score",
            "priority": null,
            "lastUpdateDate": "2017-07-01T20:46:07+10:00",
            "isPremium": true,
            "club": [
                500013,
                500012
            ]
        },
        {
            "id": "pvbHVyYjE6w-06afsCwItMg0NYlhMTUv",
            "contentId": 922273,
            "title": "Rd 17: TRY Joe Tapine (45th min)",
            "description": "Joe Tapine crosses to bring the Raiders closer to the lead",
            "publishDate": "2017-07-01T20:40:15+10:00",
            "publisher": "NRL Chief",
            "thumbnailUrl": "http://bpvideos.telstra.insnw.net/web/images/20170701204021a_89x50.jpg",
            "largeThumbnailUrl": "http://bpvideos.telstra.insnw.net/web/images/20170701204021a_326x184.jpg",
            "programType": "Instant Replay",
            "programCategory": "Score",
            "priority": 5,
            "lastUpdateDate": "2017-07-01T21:23:16+10:00",
            "isPremium": true,
            "club": [
                500013,
                500012
            ]
        },
        {
            "id": "xhaHVyYjE6iCrCTM0--pe32jApeGLqDK",
            "contentId": 922261,
            "title": "Rd 17: FIELD GOAL Lachlan Coote (40th min)",
            "description": "Lachlan Coote gives the Cowboys a seven-point lead at the break",
            "publishDate": "2017-07-01T20:20:52+10:00",
            "publisher": "NRL Chief",
            "thumbnailUrl": "http://bpvideos.telstra.insnw.net/web/images/20170701202018a_89x50.jpg",
            "largeThumbnailUrl": "http://bpvideos.telstra.insnw.net/web/images/20170701202018a_326x184.jpg",
            "programType": "Instant Replay",
            "programCategory": "Score",
            "priority": 4,
            "lastUpdateDate": "2017-07-01T21:23:16+10:00",
            "isPremium": true,
            "club": [
                500013,
                500012
            ]
        },
        {
            "id": "44ZnVyYjE6CrwS-h5ealiPgkVdOnK93M",
            "contentId": 922254,
            "title": "Rd 17: TRY Antonio Winterstein (30th min)",
            "description": "Antonio Winterstein crosses to extend the Cowboys' lead",
            "publishDate": "2017-07-01T20:10:57+10:00",
            "publisher": "NRL Chief",
            "thumbnailUrl": "http://bpvideos.telstra.insnw.net/web/images/20170701200922a_89x50.jpg",
            "largeThumbnailUrl": "http://bpvideos.telstra.insnw.net/web/images/20170701200922a_326x184.jpg",
            "programType": "Instant Replay",
            "programCategory": "Score",
            "priority": 3,
            "lastUpdateDate": "2017-07-01T21:23:16+10:00",
            "isPremium": true,
            "club": [
                500013,
                500012
            ]
        },
        {
            "id": "9zZHVyYjE6sogkQlmcZrNcTTsID_0sUR",
            "contentId": 922247,
            "title": "Rd 17: PENALTY GOAL Ethan Lowe (22nd min)",
            "description": "Ethan Lowe kicks the Cowboys to a two-point lead",
            "publishDate": "2017-07-01T20:04:35+10:00",
            "publisher": "NRL Chief",
            "thumbnailUrl": "http://bpvideos.telstra.insnw.net/web/images/20170701200422a_89x50.jpg",
            "largeThumbnailUrl": "http://bpvideos.telstra.insnw.net/web/images/20170701200422a_326x184.jpg",
            "programType": "Instant Replay",
            "programCategory": "Score",
            "priority": null,
            "lastUpdateDate": "2017-07-01T20:07:58+10:00",
            "isPremium": true,
            "club": [
                500013,
                500012
            ]
        },
        {
            "id": "1uYXVyYjE6gXblvxXxPWEAb00aYvqa0s",
            "contentId": 922244,
            "title": "Rd 17: GOAL Ethan Lowe (15th min)",
            "description": "Ethan Lowe converts for a level scoreline",
            "publishDate": "2017-07-01T19:52:09+10:00",
            "publisher": "NRL Chief",
            "thumbnailUrl": "http://bpvideos.telstra.insnw.net/web/images/20170701195219a_89x50.jpg",
            "largeThumbnailUrl": "http://bpvideos.telstra.insnw.net/web/images/20170701195219a_326x184.jpg",
            "programType": "Instant Replay",
            "programCategory": "Score",
            "priority": null,
            "lastUpdateDate": "2017-07-01T19:56:55+10:00",
            "isPremium": true,
            "club": [
                500013,
                500012
            ]
        },
        {
            "id": "FsYXVyYjE6JJyw9RIDK3M6ayJV9PlB6s",
            "contentId": 922243,
            "title": "Rd 17: TRY Te Maire Martin (13th min)",
            "description": "Te Maire Martin crosses in his first game for the Cowboys",
            "publishDate": "2017-07-01T19:52:06+10:00",
            "publisher": "NRL Chief",
            "thumbnailUrl": "http://bpvideos.telstra.insnw.net/web/images/20170701195011a_89x50.jpg",
            "largeThumbnailUrl": "http://bpvideos.telstra.insnw.net/web/images/20170701195011a_326x184.jpg",
            "programType": "Instant Replay",
            "programCategory": "Score",
            "priority": 2,
            "lastUpdateDate": "2017-07-01T21:24:17+10:00",
            "isPremium": true,
            "club": [
                500013,
                500012
            ]
        },
        {
            "id": "NsOHVyYjE6-7icBxRYGJQ8fpPE7WEk0V",
            "contentId": 922239,
            "title": "Rd 17: GOAL Jarrod Croker (4th min)",
            "description": "Jarrod Croker converts the try of Elliott Whitehead",
            "publishDate": "2017-07-01T19:41:26+10:00",
            "publisher": "NRL Chief",
            "thumbnailUrl": "http://bpvideos.telstra.insnw.net/web/images/20170701194033a_89x50.jpg",
            "largeThumbnailUrl": "http://bpvideos.telstra.insnw.net/web/images/20170701194033a_326x184.jpg",
            "programType": "Instant Replay",
            "programCategory": "Score",
            "priority": null,
            "lastUpdateDate": "2017-07-01T19:44:52+10:00",
            "isPremium": true,
            "club": [
                500013,
                500012
            ]
        },
        {
            "id": "MxOHVyYjE6WezxonyDYPuxZQm7chZteO",
            "contentId": 922238,
            "title": "Rd 17: TRY Elliott Whitehead (3rd min)",
            "description": "Elliott Whitehead scores the first try of the night",
            "publishDate": "2017-07-01T19:39:25+10:00",
            "publisher": "NRL Chief",
            "thumbnailUrl": "http://bpvideos.telstra.insnw.net/web/images/20170701193754a_89x50.jpg",
            "largeThumbnailUrl": "http://bpvideos.telstra.insnw.net/web/images/20170701193754a_326x184.jpg",
            "programType": "Instant Replay",
            "programCategory": "Score",
            "priority": 1,
            "lastUpdateDate": "2017-07-01T21:24:17+10:00",
            "isPremium": true,
            "club": [
                500013,
                500012
            ]
        }
    ],
    "scores": [
        {
            "gameState": "First Half",
            "gameStateId": 3,
            "gameTime": "0:02:17",
            "gameSeconds": 137,
            "GameMinutes": "02:17",
            "playerId": 502134,
            "playerName": "Elliott Whitehead",
            "scoreMethod": "Try",
            "statEvent": "Try",
            "statId": 38,
            "statValue": 4,
            "vidRef": 3493,
            "homeScore": 4,
            "commentary": "Try by Elliott Whitehead",
            "tackleNum": 1,
            "teamId": 500013,
            "teamName": "Canberra Raiders",
            "homeTeamAbbrv": "CAN",
            "awayTeamAbbrv": "NQL"
        },
        {
            "gameState": "First Half",
            "gameStateId": 3,
            "gameTime": "0:03:45",
            "gameSeconds": 225,
            "GameMinutes": "03:45",
            "playerId": 500313,
            "playerName": "Jarrod Croker",
            "scoreMethod": "Conversion",
            "statEvent": "Conversion-Made",
            "statId": 1,
            "statValue": 2,
            "vidRef": 8111,
            "homeScore": 6,
            "commentary": "Conversion-Made by Jarrod Croker",
            "tackleNum": -1,
            "teamId": 500013,
            "teamName": "Canberra Raiders",
            "homeTeamAbbrv": "CAN",
            "awayTeamAbbrv": "NQL"
        },
        {
            "gameState": "Second Half",
            "gameStateId": 5,
            "gameTime": "0:44:25",
            "gameSeconds": 2665,
            "GameMinutes": "44:25",
            "playerId": 500555,
            "playerName": "Joseph Tapine",
            "scoreMethod": "Try",
            "statEvent": "Try",
            "statId": 38,
            "statValue": 4,
            "vidRef": 75339,
            "homeScore": 10,
            "awayScore": 13,
            "commentary": "Try by Joseph Tapine",
            "tackleNum": 2,
            "teamId": 500013,
            "teamName": "Canberra Raiders",
            "homeTeamAbbrv": "CAN",
            "awayTeamAbbrv": "NQL"
        },
        {
            "gameState": "Second Half",
            "gameStateId": 5,
            "gameTime": "0:45:47",
            "gameSeconds": 2747,
            "GameMinutes": "45:47",
            "playerId": 500068,
            "playerName": "Aidan Sezer",
            "scoreMethod": "Conversion",
            "statEvent": "Conversion-Made",
            "statId": 1,
            "statValue": 2,
            "vidRef": 77374,
            "homeScore": 12,
            "awayScore": 13,
            "commentary": "Conversion-Made by Aidan Sezer",
            "tackleNum": -1,
            "teamId": 500013,
            "teamName": "Canberra Raiders",
            "homeTeamAbbrv": "CAN",
            "awayTeamAbbrv": "NQL"
        },
        {
            "gameState": "Second Half",
            "gameStateId": 5,
            "gameTime": "1:07:02",
            "gameSeconds": 4022,
            "GameMinutes": "67:02",
            "playerId": 504134,
            "playerName": "Nick Cotric",
            "scoreMethod": "Try",
            "statEvent": "Try",
            "statId": 38,
            "statValue": 4,
            "vidRef": 111041,
            "homeScore": 16,
            "awayScore": 25,
            "commentary": "Try by Nick Cotric",
            "tackleNum": 2,
            "teamId": 500013,
            "teamName": "Canberra Raiders",
            "homeTeamAbbrv": "CAN",
            "awayTeamAbbrv": "NQL"
        },
        {
            "gameState": "Second Half",
            "gameStateId": 5,
            "gameTime": "1:07:46",
            "gameSeconds": 4066,
            "GameMinutes": "67:46",
            "playerId": 500068,
            "playerName": "Aidan Sezer",
            "scoreMethod": "Conversion",
            "statEvent": "Conversion-Made",
            "statId": 1,
            "statValue": 2,
            "vidRef": 112130,
            "homeScore": 18,
            "awayScore": 25,
            "commentary": "Conversion-Made by Aidan Sezer",
            "tackleNum": -1,
            "teamId": 500013,
            "teamName": "Canberra Raiders",
            "homeTeamAbbrv": "CAN",
            "awayTeamAbbrv": "NQL"
        },
        {
            "gameState": "First Half",
            "gameStateId": 3,
            "gameTime": "0:12:41",
            "gameSeconds": 761,
            "GameMinutes": "12:41",
            "playerId": 501293,
            "playerName": "Te Maire Martin",
            "scoreMethod": "Try",
            "statEvent": "Try",
            "statId": 38,
            "statValue": 4,
            "vidRef": 23023,
            "homeScore": 6,
            "awayScore": 4,
            "commentary": "Try by Te Maire Martin",
            "tackleNum": 6,
            "teamId": 500012,
            "teamName": "North Queensland Cowboys",
            "homeTeamAbbrv": "CAN",
            "awayTeamAbbrv": "NQL"
        },
        {
            "gameState": "First Half",
            "gameStateId": 3,
            "gameTime": "0:14:11",
            "gameSeconds": 851,
            "GameMinutes": "14:11",
            "playerId": 500289,
            "playerName": "Ethan Lowe",
            "scoreMethod": "Conversion",
            "statEvent": "Conversion-Made",
            "statId": 1,
            "statValue": 2,
            "vidRef": 25274,
            "homeScore": 6,
            "awayScore": 6,
            "commentary": "Conversion-Made by Ethan Lowe",
            "tackleNum": -1,
            "teamId": 500012,
            "teamName": "North Queensland Cowboys",
            "homeTeamAbbrv": "CAN",
            "awayTeamAbbrv": "NQL"
        },
        {
            "gameState": "First Half",
            "gameStateId": 3,
            "gameTime": "0:21:15",
            "gameSeconds": 1275,
            "GameMinutes": "21:15",
            "playerId": 500289,
            "playerName": "Ethan Lowe",
            "scoreMethod": "Penalty Goal",
            "statEvent": "Penalty Shot-Made",
            "statId": 67,
            "statValue": 2,
            "vidRef": 35859,
            "homeScore": 6,
            "awayScore": 8,
            "commentary": "Penalty Shot-Made by Ethan Lowe",
            "tackleNum": -1,
            "teamId": 500012,
            "teamName": "North Queensland Cowboys",
            "homeTeamAbbrv": "CAN",
            "awayTeamAbbrv": "NQL"
        },
        {
            "gameState": "First Half",
            "gameStateId": 3,
            "gameTime": "0:29:36",
            "gameSeconds": 1776,
            "GameMinutes": "29:36",
            "playerId": 500305,
            "playerName": "Antonio Winterstein",
            "scoreMethod": "Try",
            "statEvent": "Try",
            "statId": 38,
            "statValue": 4,
            "vidRef": 51961,
            "homeScore": 6,
            "awayScore": 12,
            "commentary": "Try by Antonio Winterstein",
            "tackleNum": 6,
            "teamId": 500012,
            "teamName": "North Queensland Cowboys",
            "homeTeamAbbrv": "CAN",
            "awayTeamAbbrv": "NQL"
        },
        {
            "gameState": "First Half",
            "gameStateId": 3,
            "gameTime": "0:39:35",
            "gameSeconds": 2375,
            "GameMinutes": "39:35",
            "playerId": 500281,
            "playerName": "Lachlan Coote",
            "scoreMethod": "Field Goal",
            "statEvent": "Drop Goal-Made",
            "statId": 69,
            "statValue": 1,
            "vidRef": 67792,
            "homeScore": 6,
            "awayScore": 13,
            "commentary": "Drop Goal-Made by Lachlan Coote",
            "tackleNum": 6,
            "teamId": 500012,
            "teamName": "North Queensland Cowboys",
            "homeTeamAbbrv": "CAN",
            "awayTeamAbbrv": "NQL"
        },
        {
            "gameState": "Second Half",
            "gameStateId": 5,
            "gameTime": "0:54:17",
            "gameSeconds": 3257,
            "GameMinutes": "54:17",
            "playerId": 500292,
            "playerName": "Michael Morgan",
            "scoreMethod": "Try",
            "statEvent": "Try",
            "statId": 38,
            "statValue": 4,
            "vidRef": 90130,
            "homeScore": 12,
            "awayScore": 17,
            "commentary": "Try by Michael Morgan",
            "tackleNum": 4,
            "teamId": 500012,
            "teamName": "North Queensland Cowboys",
            "homeTeamAbbrv": "CAN",
            "awayTeamAbbrv": "NQL"
        },
        {
            "gameState": "Second Half",
            "gameStateId": 5,
            "gameTime": "0:55:39",
            "gameSeconds": 3339,
            "GameMinutes": "55:39",
            "playerId": 500289,
            "playerName": "Ethan Lowe",
            "scoreMethod": "Conversion",
            "statEvent": "Conversion-Made",
            "statId": 1,
            "statValue": 2,
            "vidRef": 92171,
            "homeScore": 12,
            "awayScore": 19,
            "commentary": "Conversion-Made by Ethan Lowe",
            "tackleNum": -1,
            "teamId": 500012,
            "teamName": "North Queensland Cowboys",
            "homeTeamAbbrv": "CAN",
            "awayTeamAbbrv": "NQL"
        },
        {
            "gameState": "Second Half",
            "gameStateId": 5,
            "gameTime": "0:58:48",
            "gameSeconds": 3528,
            "GameMinutes": "58:48",
            "playerId": 500292,
            "playerName": "Michael Morgan",
            "scoreMethod": "Try",
            "statEvent": "Try",
            "statId": 38,
            "statValue": 4,
            "vidRef": 96902,
            "homeScore": 12,
            "awayScore": 23,
            "commentary": "Try by Michael Morgan",
            "tackleNum": 1,
            "teamId": 500012,
            "teamName": "North Queensland Cowboys",
            "homeTeamAbbrv": "CAN",
            "awayTeamAbbrv": "NQL"
        },
        {
            "gameState": "Second Half",
            "gameStateId": 5,
            "gameTime": "0:59:51",
            "gameSeconds": 3591,
            "GameMinutes": "59:51",
            "playerId": 500289,
            "playerName": "Ethan Lowe",
            "scoreMethod": "Conversion",
            "statEvent": "Conversion-Made",
            "statId": 1,
            "statValue": 2,
            "vidRef": 100256,
            "homeScore": 12,
            "awayScore": 25,
            "commentary": "Conversion-Made by Ethan Lowe",
            "tackleNum": -1,
            "teamId": 500012,
            "teamName": "North Queensland Cowboys",
            "homeTeamAbbrv": "CAN",
            "awayTeamAbbrv": "NQL"
        },
        {
            "gameState": "Second Half",
            "gameStateId": 5,
            "gameTime": "1:13:57",
            "gameSeconds": 4437,
            "GameMinutes": "73:57",
            "playerId": 501293,
            "playerName": "Te Maire Martin",
            "scoreMethod": "Try",
            "statEvent": "Try",
            "statId": 38,
            "statValue": 4,
            "vidRef": 122508,
            "homeScore": 18,
            "awayScore": 29,
            "commentary": "Try by Te Maire Martin",
            "tackleNum": 5,
            "teamId": 500012,
            "teamName": "North Queensland Cowboys",
            "homeTeamAbbrv": "CAN",
            "awayTeamAbbrv": "NQL"
        },
        {
            "gameState": "Second Half",
            "gameStateId": 5,
            "gameTime": "1:15:27",
            "gameSeconds": 4527,
            "GameMinutes": "75:27",
            "playerId": 500289,
            "playerName": "Ethan Lowe",
            "scoreMethod": "Conversion",
            "statEvent": "Conversion-Made",
            "statId": 1,
            "statValue": 2,
            "vidRef": 125107,
            "homeScore": 18,
            "awayScore": 31,
            "commentary": "Conversion-Made by Ethan Lowe",
            "tackleNum": -1,
            "teamId": 500012,
            "teamName": "North Queensland Cowboys",
            "homeTeamAbbrv": "CAN",
            "awayTeamAbbrv": "NQL"
        }
    ],
    "twitter": [
        {
            "id": "881114962176778241",
            "gameSeconds": 180
        },
        {
            "id": "881104395722571776",
            "gameSeconds": 3480
        },
        {
            "id": "881103727326773248",
            "gameSeconds": 3480
        },
        {
            "id": "881085160837468160",
            "gameSeconds": 180
        },
        {
            "id": "881084711514193921",
            "gameSeconds": 180
        }
    ]
}