{
    "vod": [
        {
            "id": "E1NHc4dzrCXc4AHovYVJdOVtzDNi_sTY",
            "contentId": 785060,
            "title": "Rd 25: Sea Eagles v Roosters (1)",
            "description": "1st half replay of the match between the Sea Eagles & Roosters",
            "publishDate": "2015-08-29T09:30:00+10:00",
            "publisher": "NRL Chief",
            "thumbnailUrl": "http://bigpondvideo.com/Web/Images/Content/20150828220529a_89x50.jpg",
            "largeThumbnailUrl": "http://bigpondvideo.com/Web/Images/Content/20150828220529a_326x184.jpg",
            "programType": "Matches",
            "programCategory": "Replay: 1st Half",
            "priority": null,
            "lastUpdateDate": "2015-08-28T23:54:30+10:00",
            "isPremium": true,
            "club": [
                500002,
                500001
            ]
        },
        {
            "id": "lkNnc4dzqRDGuizzKc0pCzyFeMFxLQad",
            "contentId": 785061,
            "title": "Rd 25: Sea Eagles v Roosters (2)",
            "description": "2nd half replay of the match between the Sea Eagles & Roosters",
            "publishDate": "2015-08-29T09:30:00+10:00",
            "publisher": "NRL Chief",
            "thumbnailUrl": "http://bigpondvideo.com/Web/Images/Content/20150828220603a_89x50.jpg",
            "largeThumbnailUrl": "http://bigpondvideo.com/Web/Images/Content/20150828220603a_326x184.jpg",
            "programType": "Matches",
            "programCategory": "Replay: 2nd Half",
            "priority": null,
            "lastUpdateDate": "2015-08-28T23:55:30+10:00",
            "isPremium": true,
            "club": [
                500002,
                500001
            ]
        },
        {
            "id": "5jMHY4dzqTuymacDHDaRwo_gJkt2H4tN",
            "contentId": 784995,
            "title": "Rd 25: Sea Eagles v Roosters (Hls)",
            "description": "Highlights of the match between the Sea Eagles & Roosters from Brookvale Oval",
            "publishDate": "2015-08-28T22:03:00+10:00",
            "publisher": "NRL Chief",
            "thumbnailUrl": "http://bigpondvideo.com/Web/Images/Content/20150828220454a_89x50.jpg",
            "largeThumbnailUrl": "http://bigpondvideo.com/Web/Images/Content/20150828220454a_326x184.jpg",
            "programType": "Highlights",
            "programCategory": "Match",
            "priority": null,
            "lastUpdateDate": "2015-08-28T22:10:03+10:00",
            "isPremium": false,
            "club": [
                500002,
                500001
            ]
        },
        {
            "id": "B1Z3Y4dzrhrcd5GR_nYan3TsMDsZ_HnJ",
            "contentId": 785023,
            "title": "Rd 25 Press Conference: Sea Eagles",
            "description": "The Sea Eagles coach faces the media following the match",
            "publishDate": "2015-08-28T22:40:00+10:00",
            "publisher": "NRL Chief",
            "thumbnailUrl": "http://bigpondvideo.com/Web/Images/Content/20150828222330a_89x50.jpg",
            "largeThumbnailUrl": "http://bigpondvideo.com/Web/Images/Content/20150828222330a_326x184.jpg",
            "programType": "Press Conference",
            "programCategory": null,
            "priority": null,
            "lastUpdateDate": "2015-08-28T22:51:14+10:00",
            "isPremium": false,
            "club": [
                500002,
                500001
            ]
        },
        {
            "id": "tjZ3Y4dzotjBQOHP54PEssCAuQg_KQBy",
            "contentId": 785025,
            "title": "Rd 25 Press Conference: Roosters",
            "description": "The Roosters coach faces the media following the match",
            "publishDate": "2015-08-28T22:39:00+10:00",
            "publisher": "NRL Chief",
            "thumbnailUrl": "http://bigpondvideo.com/Web/Images/Content/20150828222124a_89x50.jpg",
            "largeThumbnailUrl": "http://bigpondvideo.com/Web/Images/Content/20150828222124a_326x184.jpg",
            "programType": "Press Conference",
            "programCategory": null,
            "priority": null,
            "lastUpdateDate": "2015-08-28T22:50:21+10:00",
            "isPremium": false,
            "club": [
                500002,
                500001
            ]
        },
        {
            "id": "Fib3U4dzpctugKsuH9FobT5PAYwveb13",
            "contentId": 785695,
            "title": "Rd 25: GOAL James Maloney (80th min)",
            "description": "Conversion takes the Roosters out to a 46-10 lead",
            "publishDate": "2015-08-28T21:43:00+10:00",
            "publisher": "NRL Chief",
            "thumbnailUrl": "http://bigpondvideo.com/Web/Images/Content/20150828214143a_89x50.jpg",
            "largeThumbnailUrl": "http://bigpondvideo.com/Web/Images/Content/20150828214143a_326x184.jpg",
            "programType": "Instant Replay",
            "programCategory": "Score",
            "priority": null,
            "lastUpdateDate": "2015-08-28T21:51:57+10:00",
            "isPremium": true,
            "club": [
                500002,
                500001
            ]
        },
        {
            "id": "wxb3U4dzr9kXcxwexiplJwxE4VOXyW7O",
            "contentId": 785694,
            "title": "Rd 25: TRY Isaac Liu (78th min)",
            "description": "It's RTS again running riot as he splits them up the middle and finds Isaac Liu in support to score a ripper for the Roosters",
            "publishDate": "2015-08-28T21:41:00+10:00",
            "publisher": "NRL Chief",
            "thumbnailUrl": "http://bigpondvideo.com/Web/Images/Content/20150828213959a_89x50.jpg",
            "largeThumbnailUrl": "http://bigpondvideo.com/Web/Images/Content/20150828213959a_326x184.jpg",
            "programType": "Instant Replay",
            "programCategory": "Score",
            "priority": 1,
            "lastUpdateDate": "2015-08-28T21:51:57+10:00",
            "isPremium": true,
            "club": [
                500002,
                500001
            ]
        },
        {
            "id": "93bHU4dzrLptsVH1nLtTMT4k9HrDukWl",
            "contentId": 785693,
            "title": "Rd 25: GOAL James Maloney (77th min)",
            "description": "Conversion sees the Rooster lead 40-10",
            "publishDate": "2015-08-28T21:38:00+10:00",
            "publisher": "NRL Chief",
            "thumbnailUrl": "http://bigpondvideo.com/Web/Images/Content/20150828213829a_89x50.jpg",
            "largeThumbnailUrl": "http://bigpondvideo.com/Web/Images/Content/20150828213829a_326x184.jpg",
            "programType": "Instant Replay",
            "programCategory": "Score",
            "priority": null,
            "lastUpdateDate": "2015-08-28T21:42:12+10:00",
            "isPremium": true,
            "club": [
                500002,
                500001
            ]
        },
        {
            "id": "trbHU4dzroVq1h76oOfUBhlQ6dZPxl9z",
            "contentId": 785692,
            "title": "Rd 25: TRY Daniel Tupou (75th min)",
            "description": "Again Roger Tuivasa-Sheck does some great work to play provider for Daniel Tupou to cross to get his third for the night",
            "publishDate": "2015-08-28T21:36:00+10:00",
            "publisher": "NRL Chief",
            "thumbnailUrl": "http://bigpondvideo.com/Web/Images/Content/20150828213730a_89x50.jpg",
            "largeThumbnailUrl": "http://bigpondvideo.com/Web/Images/Content/20150828213730a_326x184.jpg",
            "programType": "Instant Replay",
            "programCategory": "Score",
            "priority": 2,
            "lastUpdateDate": "2015-08-28T21:54:58+10:00",
            "isPremium": true,
            "club": [
                500002,
                500001
            ]
        },
        {
            "id": "84anU4dzoUaIw-Xx4D6mi3C5RbEhPwHj",
            "contentId": 785691,
            "title": "Rd 25: TRY Tom Symonds (69th min)",
            "description": "The Sea Eagles get a late one as Tom Symonds crosses out wide",
            "publishDate": "2015-08-28T21:29:00+10:00",
            "publisher": "NRL Chief",
            "thumbnailUrl": "http://bigpondvideo.com/Web/Images/Content/20150828213012a_89x50.jpg",
            "largeThumbnailUrl": "http://bigpondvideo.com/Web/Images/Content/20150828213012a_326x184.jpg",
            "programType": "Instant Replay",
            "programCategory": "Score",
            "priority": 3,
            "lastUpdateDate": "2015-08-28T21:54:58+10:00",
            "isPremium": true,
            "club": [
                500002,
                500001
            ]
        },
        {
            "id": "1vaHU4dzpHhFezP_zpa_7rvzVgsIPnFZ",
            "contentId": 785690,
            "title": "Rd 25: GOAL James Maloney (64th min)",
            "description": "Conversion sees the Roosters lead 34-6",
            "publishDate": "2015-08-28T21:24:00+10:00",
            "publisher": "NRL Chief",
            "thumbnailUrl": "http://bigpondvideo.com/Web/Images/Content/20150828212502a_89x50.jpg",
            "largeThumbnailUrl": "http://bigpondvideo.com/Web/Images/Content/20150828212502a_326x184.jpg",
            "programType": "Instant Replay",
            "programCategory": "Score",
            "priority": null,
            "lastUpdateDate": "2015-08-28T21:31:08+10:00",
            "isPremium": true,
            "club": [
                500002,
                500001
            ]
        },
        {
            "id": "ZqZ3U4dzrU-CgkHyko38CozUDB40Vs81",
            "contentId": 785689,
            "title": "Rd 25: TRY Daniel Tupou (62nd min)",
            "description": "The Roosters go back to back as its Daniel Tupou who crosses for a double",
            "publishDate": "2015-08-28T21:22:00+10:00",
            "publisher": "NRL Chief",
            "thumbnailUrl": "http://bigpondvideo.com/Web/Images/Content/20150828212341a_89x50.jpg",
            "largeThumbnailUrl": "http://bigpondvideo.com/Web/Images/Content/20150828212341a_326x184.jpg",
            "programType": "Instant Replay",
            "programCategory": "Score",
            "priority": 4,
            "lastUpdateDate": "2015-08-28T21:53:58+10:00",
            "isPremium": true,
            "club": [
                500002,
                500001
            ]
        },
        {
            "id": "JqZXU4dzrPQwlGC2HYBmLNbXkZE3t0sc",
            "contentId": 785688,
            "title": "Rd 25: GOAL James Maloney (61st min)",
            "description": "Conversion sees the Roosters lead 28-6",
            "publishDate": "2015-08-28T21:20:00+10:00",
            "publisher": "NRL Chief",
            "thumbnailUrl": "http://bigpondvideo.com/Web/Images/Content/20150828212125a_89x50.jpg",
            "largeThumbnailUrl": "http://bigpondvideo.com/Web/Images/Content/20150828212125a_326x184.jpg",
            "programType": "Instant Replay",
            "programCategory": "Score",
            "priority": null,
            "lastUpdateDate": "2015-08-28T21:25:06+10:00",
            "isPremium": true,
            "club": [
                500002,
                500001
            ]
        },
        {
            "id": "p5ZHU4dzpbU6p0Vz5GeaBrKCaAn4H_-g",
            "contentId": 785686,
            "title": "Rd 25: TRY Daniel Tupou (59th min)",
            "description": "The Roosters are in again as Daniel Tupou does some great aerial work to score",
            "publishDate": "2015-08-28T21:19:00+10:00",
            "publisher": "NRL Chief",
            "thumbnailUrl": "http://bigpondvideo.com/Web/Images/Content/20150828211953a_89x50.jpg",
            "largeThumbnailUrl": "http://bigpondvideo.com/Web/Images/Content/20150828211953a_326x184.jpg",
            "programType": "Instant Replay",
            "programCategory": "Score",
            "priority": 5,
            "lastUpdateDate": "2015-08-28T21:53:58+10:00",
            "isPremium": true,
            "club": [
                500002,
                500001
            ]
        },
        {
            "id": "lwNnU4dzrL6SjwbbQ9mw2IrI4_5LQaHB",
            "contentId": 785685,
            "title": "Rd 25: GOAL James Maloney (44th min)",
            "description": "Conversion sees the Roosters lead 22-6",
            "publishDate": "2015-08-28T21:04:00+10:00",
            "publisher": "NRL Chief",
            "thumbnailUrl": "http://bigpondvideo.com/Web/Images/Content/20150828210444a_89x50.jpg",
            "largeThumbnailUrl": "http://bigpondvideo.com/Web/Images/Content/20150828210444a_326x184.jpg",
            "programType": "Instant Replay",
            "programCategory": "Score",
            "priority": null,
            "lastUpdateDate": "2015-08-28T21:10:02+10:00",
            "isPremium": true,
            "club": [
                500002,
                500001
            ]
        },
        {
            "id": "FoNnU4dzrc-T6BAnLpMs35lk16oyYHqX",
            "contentId": 785684,
            "title": "Rd 25: TRY Brendan Elliot (43rd min)",
            "description": "Another right side raid by the Roosters and Roger Tuivasa-Sheck does some great work to send Brendan Elliot over for this third for the night",
            "publishDate": "2015-08-28T21:03:00+10:00",
            "publisher": "NRL Chief",
            "thumbnailUrl": "http://bigpondvideo.com/Web/Images/Content/20150828210348a_89x50.jpg",
            "largeThumbnailUrl": "http://bigpondvideo.com/Web/Images/Content/20150828210348a_326x184.jpg",
            "programType": "Instant Replay",
            "programCategory": "Score",
            "priority": 6,
            "lastUpdateDate": "2015-08-28T21:52:57+10:00",
            "isPremium": true,
            "club": [
                500002,
                500001
            ]
        },
        {
            "id": "1ydnQ4dzqJ9Q_0q4nRpACaONB7Vvx9NF",
            "contentId": 785683,
            "title": "Rd 25: GOAL Jamie Lyon (38th min)",
            "description": "Jamie Lyon converts from touch to see the Sea Eagles trail 16-6",
            "publishDate": "2015-08-28T20:41:00+10:00",
            "publisher": "NRL Chief",
            "thumbnailUrl": "http://bigpondvideo.com/Web/Images/Content/20150828204256a_89x50.jpg",
            "largeThumbnailUrl": "http://bigpondvideo.com/Web/Images/Content/20150828204256a_326x184.jpg",
            "programType": "Instant Replay",
            "programCategory": "Score",
            "priority": null,
            "lastUpdateDate": "2015-08-28T20:48:57+10:00",
            "isPremium": true,
            "club": [
                500002,
                500001
            ]
        },
        {
            "id": "todnQ4dzqB5_jT3k8gjt0UexQptp7sB4",
            "contentId": 785682,
            "title": "Rd 25: TRY Jamie Lyon (37th min)",
            "description": "The Sea Eagles strike back as Jamie Lyon does some great work to score in the corner",
            "publishDate": "2015-08-28T20:40:00+10:00",
            "publisher": "NRL Chief",
            "thumbnailUrl": "http://bigpondvideo.com/Web/Images/Content/20150828204243a_89x50.jpg",
            "largeThumbnailUrl": "http://bigpondvideo.com/Web/Images/Content/20150828204243a_326x184.jpg",
            "programType": "Instant Replay",
            "programCategory": "Score",
            "priority": 7,
            "lastUpdateDate": "2015-08-28T21:49:56+10:00",
            "isPremium": true,
            "club": [
                500002,
                500001
            ]
        },
        {
            "id": "Bvb3Q4dzpUXcaOo3nyASu-06MNv7NQMB",
            "contentId": 785681,
            "title": "Rd 25: GOAL James Maloney (27th min)",
            "description": "Conversion sees the visitors lead 16-0",
            "publishDate": "2015-08-28T20:29:00+10:00",
            "publisher": "NRL Chief",
            "thumbnailUrl": "http://bigpondvideo.com/Web/Images/Content/20150828203059a_89x50.jpg",
            "largeThumbnailUrl": "http://bigpondvideo.com/Web/Images/Content/20150828203059a_326x184.jpg",
            "programType": "Instant Replay",
            "programCategory": "Score",
            "priority": null,
            "lastUpdateDate": "2015-08-28T20:35:54+10:00",
            "isPremium": true,
            "club": [
                500002,
                500001
            ]
        },
        {
            "id": "k4b3Q4dzqPD5LAmVZYuVGOf_bd9yMPxW",
            "contentId": 785680,
            "title": "Rd 25: TRY Aidan Guerra (26th min)",
            "description": "The Roosters get their third try for the night as Aidan Guerra produces a smart piece of work to score",
            "publishDate": "2015-08-28T20:28:00+10:00",
            "publisher": "NRL Chief",
            "thumbnailUrl": "http://bigpondvideo.com/Web/Images/Content/20150828202825a_89x50.jpg",
            "largeThumbnailUrl": "http://bigpondvideo.com/Web/Images/Content/20150828202825a_326x184.jpg",
            "programType": "Instant Replay",
            "programCategory": "Score",
            "priority": 8,
            "lastUpdateDate": "2015-08-28T21:46:57+10:00",
            "isPremium": true,
            "club": [
                500002,
                500001
            ]
        },
        {
            "id": "p4anQ4dzrI8iMjcA2B7wqo6CXuVtrcIe",
            "contentId": 785678,
            "title": "Rd 25: GOAL James Maloney (19th min)",
            "description": "Conversion sees the Roosters lead 10-0",
            "publishDate": "2015-08-28T20:20:00+10:00",
            "publisher": "NRL Chief",
            "thumbnailUrl": "http://bigpondvideo.com/Web/Images/Content/20150828202054a_89x50.jpg",
            "largeThumbnailUrl": "http://bigpondvideo.com/Web/Images/Content/20150828202054a_326x184.jpg",
            "programType": "Instant Replay",
            "programCategory": "Score",
            "priority": null,
            "lastUpdateDate": "2015-08-28T20:27:53+10:00",
            "isPremium": true,
            "club": [
                500002,
                500001
            ]
        },
        {
            "id": "MyaXQ4dzr_IPMAyv4nr-b5lWUlVkgMn4",
            "contentId": 785676,
            "title": "Rd 25: TRY Brendan Elliot (17th min)",
            "description": "The Roosters are in again and its Brendan Elliot who crosses for an early double",
            "publishDate": "2015-08-28T20:18:00+10:00",
            "publisher": "NRL Chief",
            "thumbnailUrl": "http://bigpondvideo.com/Web/Images/Content/20150828201929a_89x50.jpg",
            "largeThumbnailUrl": "http://bigpondvideo.com/Web/Images/Content/20150828201929a_326x184.jpg",
            "programType": "Instant Replay",
            "programCategory": "Score",
            "priority": 9,
            "lastUpdateDate": "2015-08-28T21:46:57+10:00",
            "isPremium": true,
            "club": [
                500002,
                500001
            ]
        },
        {
            "id": "ptZXQ4dzph_9tK6Ro_CieJ48xSX0M1Dp",
            "contentId": 785674,
            "title": "Rd 25: TRY Brendan Elliot (9th min)",
            "description": "The Roosters open the scoring in this match through a try to Brendan Elliot in the right corner",
            "publishDate": "2015-08-28T20:10:00+10:00",
            "publisher": "NRL Chief",
            "thumbnailUrl": "http://bigpondvideo.com/Web/Images/Content/20150828201013a_89x50.jpg",
            "largeThumbnailUrl": "http://bigpondvideo.com/Web/Images/Content/20150828201013a_326x184.jpg",
            "programType": "Instant Replay",
            "programCategory": "Score",
            "priority": 10,
            "lastUpdateDate": "2015-08-28T21:46:52+10:00",
            "isPremium": true,
            "club": [
                500002,
                500001
            ]
        }
    ],
    "scores": [
        {
            "gameState": "First Half",
            "gameStateId": 3,
            "gameTime": "0:36:07",
            "gameSeconds": 2167,
            "playerId": 500020,
            "playerName": "Jamie Lyon",
            "scoreMethod": "Try",
            "statEvent": "Try",
            "statId": 38,
            "statValue": 4,
            "vidRef": 62247,
            "homeScore": 4,
            "awayScore": 16,
            "teamId": 500002,
            "teamName": "Manly-Warringah Sea Eagles",
            "homeTeamAbbrv": "MAN",
            "awayTeamAbbrv": "SYD"
        },
        {
            "gameState": "First Half",
            "gameStateId": 3,
            "gameTime": "0:37:05",
            "gameSeconds": 2225,
            "playerId": 500020,
            "playerName": "Jamie Lyon",
            "scoreMethod": "Conversion",
            "statEvent": "Conversion-Made",
            "statId": 1,
            "statValue": 2,
            "vidRef": 63691,
            "homeScore": 6,
            "awayScore": 16,
            "teamId": 500002,
            "teamName": "Manly-Warringah Sea Eagles",
            "homeTeamAbbrv": "MAN",
            "awayTeamAbbrv": "SYD"
        },
        {
            "gameState": "Second Half",
            "gameStateId": 5,
            "gameTime": "1:08:41",
            "gameSeconds": 4121,
            "playerId": 500033,
            "playerName": "Tom Symonds",
            "scoreMethod": "Try",
            "statEvent": "Try",
            "statId": 38,
            "statValue": 4,
            "vidRef": 115542,
            "homeScore": 10,
            "awayScore": 34,
            "teamId": 500002,
            "teamName": "Manly-Warringah Sea Eagles",
            "homeTeamAbbrv": "MAN",
            "awayTeamAbbrv": "SYD"
        },
        {
            "gameState": "First Half",
            "gameStateId": 3,
            "gameTime": "0:08:57",
            "gameSeconds": 537,
            "playerId": 500200,
            "playerName": "Brendan Elliot",
            "scoreMethod": "Try",
            "statEvent": "Try",
            "statId": 38,
            "statValue": 4,
            "vidRef": 16834,
            "awayScore": 4,
            "teamId": 500001,
            "teamName": "Sydney Roosters",
            "homeTeamAbbrv": "MAN",
            "awayTeamAbbrv": "SYD"
        },
        {
            "gameState": "First Half",
            "gameStateId": 3,
            "gameTime": "0:16:31",
            "gameSeconds": 991,
            "playerId": 500200,
            "playerName": "Brendan Elliot",
            "scoreMethod": "Try",
            "statEvent": "Try",
            "statId": 38,
            "statValue": 4,
            "vidRef": 29318,
            "awayScore": 8,
            "teamId": 500001,
            "teamName": "Sydney Roosters",
            "homeTeamAbbrv": "MAN",
            "awayTeamAbbrv": "SYD"
        },
        {
            "gameState": "First Half",
            "gameStateId": 3,
            "gameTime": "0:18:00",
            "gameSeconds": 1080,
            "playerId": 500006,
            "playerName": "James Maloney",
            "scoreMethod": "Conversion",
            "statEvent": "Conversion-Made",
            "statId": 1,
            "statValue": 2,
            "vidRef": 31853,
            "awayScore": 10,
            "teamId": 500001,
            "teamName": "Sydney Roosters",
            "homeTeamAbbrv": "MAN",
            "awayTeamAbbrv": "SYD"
        },
        {
            "gameState": "First Half",
            "gameStateId": 3,
            "gameTime": "0:25:20",
            "gameSeconds": 1520,
            "playerId": 500011,
            "playerName": "Aidan Guerra",
            "scoreMethod": "Try",
            "statEvent": "Try",
            "statId": 38,
            "statValue": 4,
            "vidRef": 44337,
            "awayScore": 14,
            "teamId": 500001,
            "teamName": "Sydney Roosters",
            "homeTeamAbbrv": "MAN",
            "awayTeamAbbrv": "SYD"
        },
        {
            "gameState": "First Half",
            "gameStateId": 3,
            "gameTime": "0:26:38",
            "gameSeconds": 1598,
            "playerId": 500006,
            "playerName": "James Maloney",
            "scoreMethod": "Conversion",
            "statEvent": "Conversion-Made",
            "statId": 1,
            "statValue": 2,
            "vidRef": 46283,
            "awayScore": 16,
            "teamId": 500001,
            "teamName": "Sydney Roosters",
            "homeTeamAbbrv": "MAN",
            "awayTeamAbbrv": "SYD"
        },
        {
            "gameState": "Second Half",
            "gameStateId": 5,
            "gameTime": "0:42:01",
            "gameSeconds": 2521,
            "playerId": 500200,
            "playerName": "Brendan Elliot",
            "scoreMethod": "Try",
            "statEvent": "Try",
            "statId": 38,
            "statValue": 4,
            "vidRef": 74679,
            "homeScore": 6,
            "awayScore": 20,
            "teamId": 500001,
            "teamName": "Sydney Roosters",
            "homeTeamAbbrv": "MAN",
            "awayTeamAbbrv": "SYD"
        },
        {
            "gameState": "Second Half",
            "gameStateId": 5,
            "gameTime": "0:43:30",
            "gameSeconds": 2610,
            "playerId": 500006,
            "playerName": "James Maloney",
            "scoreMethod": "Conversion",
            "statEvent": "Conversion-Made",
            "statId": 1,
            "statValue": 2,
            "vidRef": 76911,
            "homeScore": 6,
            "awayScore": 22,
            "teamId": 500001,
            "teamName": "Sydney Roosters",
            "homeTeamAbbrv": "MAN",
            "awayTeamAbbrv": "SYD"
        },
        {
            "gameState": "Second Half",
            "gameStateId": 5,
            "gameTime": "0:58:18",
            "gameSeconds": 3498,
            "playerId": 500002,
            "playerName": "Daniel Tupou",
            "scoreMethod": "Try",
            "statEvent": "Try",
            "statId": 38,
            "statValue": 4,
            "vidRef": 99114,
            "homeScore": 6,
            "awayScore": 26,
            "teamId": 500001,
            "teamName": "Sydney Roosters",
            "homeTeamAbbrv": "MAN",
            "awayTeamAbbrv": "SYD"
        },
        {
            "gameState": "Second Half",
            "gameStateId": 5,
            "gameTime": "1:00:07",
            "gameSeconds": 3607,
            "playerId": 500006,
            "playerName": "James Maloney",
            "scoreMethod": "Conversion",
            "statEvent": "Conversion-Made",
            "statId": 1,
            "statValue": 2,
            "vidRef": 101824,
            "homeScore": 6,
            "awayScore": 28,
            "teamId": 500001,
            "teamName": "Sydney Roosters",
            "homeTeamAbbrv": "MAN",
            "awayTeamAbbrv": "SYD"
        },
        {
            "gameState": "Second Half",
            "gameStateId": 5,
            "gameTime": "1:01:18",
            "gameSeconds": 3678,
            "playerId": 500002,
            "playerName": "Daniel Tupou",
            "scoreMethod": "Try",
            "statEvent": "Try",
            "statId": 38,
            "statValue": 4,
            "vidRef": 104472,
            "homeScore": 6,
            "awayScore": 32,
            "teamId": 500001,
            "teamName": "Sydney Roosters",
            "homeTeamAbbrv": "MAN",
            "awayTeamAbbrv": "SYD"
        },
        {
            "gameState": "Second Half",
            "gameStateId": 5,
            "gameTime": "1:02:58",
            "gameSeconds": 3778,
            "playerId": 500006,
            "playerName": "James Maloney",
            "scoreMethod": "Conversion",
            "statEvent": "Conversion-Made",
            "statId": 1,
            "statValue": 2,
            "vidRef": 106958,
            "homeScore": 6,
            "awayScore": 34,
            "teamId": 500001,
            "teamName": "Sydney Roosters",
            "homeTeamAbbrv": "MAN",
            "awayTeamAbbrv": "SYD"
        },
        {
            "gameState": "Second Half",
            "gameStateId": 5,
            "gameTime": "1:14:31",
            "gameSeconds": 4471,
            "playerId": 500002,
            "playerName": "Daniel Tupou",
            "scoreMethod": "Try",
            "statEvent": "Try",
            "statId": 38,
            "statValue": 4,
            "vidRef": 124277,
            "homeScore": 10,
            "awayScore": 38,
            "teamId": 500001,
            "teamName": "Sydney Roosters",
            "homeTeamAbbrv": "MAN",
            "awayTeamAbbrv": "SYD"
        },
        {
            "gameState": "Second Half",
            "gameStateId": 5,
            "gameTime": "1:15:51",
            "gameSeconds": 4551,
            "playerId": 500006,
            "playerName": "James Maloney",
            "scoreMethod": "Conversion",
            "statEvent": "Conversion-Made",
            "statId": 1,
            "statValue": 2,
            "vidRef": 126957,
            "homeScore": 10,
            "awayScore": 40,
            "teamId": 500001,
            "teamName": "Sydney Roosters",
            "homeTeamAbbrv": "MAN",
            "awayTeamAbbrv": "SYD"
        },
        {
            "gameState": "Second Half",
            "gameStateId": 5,
            "gameTime": "1:17:07",
            "gameSeconds": 4627,
            "playerId": 500038,
            "playerName": "Isaac Liu",
            "scoreMethod": "Try",
            "statEvent": "Try",
            "statId": 38,
            "statValue": 4,
            "vidRef": 128850,
            "homeScore": 10,
            "awayScore": 44,
            "teamId": 500001,
            "teamName": "Sydney Roosters",
            "homeTeamAbbrv": "MAN",
            "awayTeamAbbrv": "SYD"
        },
        {
            "gameState": "Second Half",
            "gameStateId": 5,
            "gameTime": "1:18:33",
            "gameSeconds": 4713,
            "playerId": 500006,
            "playerName": "James Maloney",
            "scoreMethod": "Conversion",
            "statEvent": "Conversion-Made",
            "statId": 1,
            "statValue": 2,
            "vidRef": 131019,
            "homeScore": 10,
            "awayScore": 46,
            "teamId": 500001,
            "teamName": "Sydney Roosters",
            "homeTeamAbbrv": "MAN",
            "awayTeamAbbrv": "SYD"
        }
    ]
}