{
    "competitionId": 111,
    "competitionName": "NRL Telstra Premiership",
    "gameId": 20151112040,
    "gameInfo": {
        "assistantReferee1Id": 500028,
        "numberOfPeriods": 2,
        "assistantReferee1Name": "Steve Carrall",
        "assistantReferee2Id": 500115,
        "assistantReferee2Name": "Rohan Best",
        "gameDate": "2015-07-25",
        "gameHashTag": "#NRLSouthsKnights",
        "gameNumber": 4,
        "gameSeconds": 4800,
        "gameMinutes": "80:00",
        "gameTime": "1:20:00",
        "groundConditionId": 1,
        "groundConditionName": "N/A",
        "referee1Id": 500006,
        "referee1Name": "Henry Perenara",
        "referee2Id": 500009,
        "referee2Name": "Alan Shortall",
        "startTime": "2015-07-25T19:30:00",
        "startTimeUTC": "2015-07-25T09:30:00Z",
        "venueId": 500002,
        "venueName": "ANZ Stadium",
        "videoReferee1Id": 500232,
        "videoReferee1Name": "Luke Patten",
        "videoReferee2Id": 500033,
        "videoReferee2Name": "Steve Chiddy"
    },
    "gameState": "Final",
    "gameStateId": 8,
    "roundId": 20,
    "seasonId": 2015,
    "teams": {
        "teamsMatch": [
            {
                "isHomeTeam": true,
                "score": {
                    "conversions": 6,
                    "points": 52,
                    "tries": 10
                },
                "team1stHalfScore": 36,
                "team2ndHalfScore": 16,
                "teamAbbr": "SOU",
                "teamFinalScore": 52,
                "teamFullTimeScore": 52,
                "teamHalfTimeScore": 36,
                "teamId": 500005,
                "teamLineup": {
                    "injuriesAndSuspensions": {
                        "injury": [],
                        "suspension": []
                    },
                    "insAndOuts": {
                        "inOut": [
                            {
                                "inOut": "Out",
                                "playerFirstName": "Aaron",
                                "playerId": "500105",
                                "playerLastName": "Gray",
                                "playerName": "Aaron Gray"
                            },
                            {
                                "inOut": "Out",
                                "playerFirstName": "Cameron",
                                "playerId": "500180",
                                "playerLastName": "McInnes",
                                "playerName": "Cameron McInnes"
                            },
                            {
                                "inOut": "In",
                                "playerFirstName": "Issac",
                                "playerId": "500088",
                                "playerLastName": "Luke",
                                "playerName": "Issac Luke"
                            },
                            {
                                "inOut": "In",
                                "playerFirstName": "Joel",
                                "playerId": "500113",
                                "playerLastName": "Reddy",
                                "playerName": "Joel Reddy"
                            }
                        ]
                    },
                    "teamPlayer": [
                        {
                            "playerFirstName": "Greg",
                            "playerId": 500080,
                            "playerLastName": "Inglis",
                            "playerName": "Greg Inglis",
                            "playerPosition": "Fullback",
                            "playerPositionId": 500001,
                            "playerStats": {
                                "allRunMetres": 206,
                                "allRuns": 22,
                                "bombKicksDefused": 2,
                                "decoys": 7,
                                "fantasyPointsTotal": 90,
                                "hitUps": 1,
                                "kickReturnMetres": 51,
                                "kickReturns": 5,
                                "kicksDefused": 2,
                                "linebreakAssists": 2,
                                "linebreaks": 3,
                                "mins": 80,
                                "missedTackles": 1,
                                "oneOnOneTackles": 1,
                                "points": 12,
                                "supports": 10,
                                "tackleBreaks": 7,
                                "tackles": 4,
                                "tries": 3,
                                "tryAssists": 1,
                                "hitupRunMeters": 6,
                                "evasionRuns": 16,
                                "evasionRunMetres": 149,
                                "ptbNeutral": 88.24,
                                "ptbSlow": 11.76,
                                "ptbAll": 17
                            },
                            "playerTookTheField": true,
                            "shirtNum": 1
                        },
                        {
                            "playerFirstName": "Alex",
                            "playerId": 500108,
                            "playerLastName": "Johnston",
                            "playerName": "Alex Johnston",
                            "playerPosition": "Winger 1",
                            "playerPositionId": 500002,
                            "playerStats": {
                                "allRunMetres": 64,
                                "allRuns": 7,
                                "bombKicksDefused": 1,
                                "bombKicksNotDefused": 1,
                                "decoys": 1,
                                "dummyHalfRuns": 1,
                                "errors": 1,
                                "fantasyPointsTotal": 56,
                                "ineffectiveTackles": 1,
                                "kickMetres": 33,
                                "kickReturnMetres": 1,
                                "kickReturns": 1,
                                "kicks": 1,
                                "kicksDefused": 1,
                                "kicksNotDefused": 1,
                                "linebreaks": 3,
                                "mins": 80,
                                "offloads": 1,
                                "points": 8,
                                "supports": 8,
                                "tackleBreaks": 3,
                                "tackles": 1,
                                "tries": 2,
                                "tryAssists": 2,
                                "evasionRuns": 5,
                                "evasionRunMetres": 55,
                                "dummyHalfRunMetres": 8,
                                "ptbFast": 20,
                                "ptbNeutral": 80,
                                "ptbAll": 5
                            },
                            "playerTookTheField": true,
                            "shirtNum": 2
                        },
                        {
                            "playerFirstName": "Dylan",
                            "playerId": 500083,
                            "playerLastName": "Walker",
                            "playerName": "Dylan Walker",
                            "playerPosition": "Centre 1",
                            "playerPositionId": 500003,
                            "playerStats": {
                                "allRunMetres": 102,
                                "allRuns": 13,
                                "decoys": 4,
                                "dummyHalfRuns": 1,
                                "fantasyPointsTotal": 66,
                                "ineffectiveTackles": 2,
                                "linebreaks": 1,
                                "mins": 80,
                                "missedTackles": 3,
                                "offloads": 2,
                                "oneOnOneTackles": 1,
                                "penalties": 1,
                                "points": 12,
                                "supports": 7,
                                "tackleBreaks": 6,
                                "tackles": 14,
                                "tries": 3,
                                "evasionRuns": 12,
                                "evasionRunMetres": 95,
                                "dummyHalfRunMetres": 7,
                                "ptbNeutral": 100,
                                "ptbAll": 5
                            },
                            "playerTookTheField": true,
                            "shirtNum": 3
                        },
                        {
                            "playerFirstName": "Bryson",
                            "playerId": 500082,
                            "playerLastName": "Goodwin",
                            "playerName": "Bryson Goodwin",
                            "playerPosition": "Centre 2",
                            "playerPositionId": 500004,
                            "playerStats": {
                                "allRunMetres": 116,
                                "allRuns": 12,
                                "dummyHalfRuns": 2,
                                "fantasyPointsTotal": 52,
                                "kickMetres": 52,
                                "kicks": 3,
                                "linebreaks": 2,
                                "mins": 80,
                                "missedTackles": 2,
                                "points": 4,
                                "supports": 14,
                                "tackleBreaks": 6,
                                "tackles": 9,
                                "tries": 1,
                                "evasionRuns": 10,
                                "evasionRunMetres": 104,
                                "dummyHalfRunMetres": 12,
                                "ptbFast": 20,
                                "ptbNeutral": 80,
                                "ptbAll": 10
                            },
                            "playerTookTheField": true,
                            "shirtNum": 4
                        },
                        {
                            "playerFirstName": "Joel",
                            "playerId": 500113,
                            "playerLastName": "Reddy",
                            "playerName": "Joel Reddy",
                            "playerPosition": "Winger 2",
                            "playerPositionId": 500005,
                            "playerStats": {
                                "allRunMetres": 77,
                                "allRuns": 12,
                                "bombKicksNotDefused": 1,
                                "decoys": 1,
                                "errors": 1,
                                "fantasyPointsTotal": 16,
                                "kickReturnMetres": 14,
                                "kickReturns": 4,
                                "kicksDefused": 3,
                                "kicksNotDefused": 1,
                                "mins": 80,
                                "supports": 17,
                                "tackleBreaks": 1,
                                "tackles": 5,
                                "evasionRuns": 8,
                                "evasionRunMetres": 63,
                                "ptbFast": 18.18,
                                "ptbNeutral": 72.73,
                                "ptbSlow": 9.09,
                                "ptbAll": 11
                            },
                            "playerTookTheField": true,
                            "shirtNum": 19
                        },
                        {
                            "playerFirstName": "Luke",
                            "playerId": 500093,
                            "playerLastName": "Keary",
                            "playerName": "Luke Keary",
                            "playerPosition": "Five-eighth",
                            "playerPositionId": 500006,
                            "playerStats": {
                                "allRunMetres": 56,
                                "allRuns": 9,
                                "fantasyPointsTotal": 27,
                                "ineffectiveTackles": 1,
                                "kickMetres": 29,
                                "kicks": 3,
                                "linebreakAssists": 1,
                                "mins": 80,
                                "missedTackles": 1,
                                "supports": 9,
                                "tackles": 16,
                                "tryAssists": 1,
                                "evasionRuns": 9,
                                "evasionRunMetres": 56,
                                "ptbFast": 50,
                                "ptbNeutral": 50,
                                "ptbAll": 2
                            },
                            "playerTookTheField": true,
                            "shirtNum": 6
                        },
                        {
                            "playerFirstName": "Adam",
                            "playerId": 500086,
                            "playerLastName": "Reynolds",
                            "playerName": "Adam Reynolds",
                            "playerPosition": "Halfback",
                            "playerPositionId": 500007,
                            "playerStats": {
                                "allRunMetres": 43,
                                "allRuns": 6,
                                "bombKicks": 4,
                                "bombKickMetres": 123,
                                "chargedDown": 1,
                                "conversions": 6,
                                "conversionsAttempts": 10,
                                "conversionsMissed": 4,
                                "errors": 1,
                                "fantasyPointsTotal": 66,
                                "fieldGoalsAttempts": 1,
                                "fieldGoalsMissed": 1,
                                "goalConversionRate": 60,
                                "allGoals": 6,
                                "allGoalsMissed": 4,
                                "allGoalsAttempted": 10,
                                "ineffectiveTackles": 4,
                                "kickMetres": 505,
                                "kicks": 16,
                                "mins": 80,
                                "missedTackles": 1,
                                "oneOnOneTackles": 1,
                                "points": 12,
                                "supports": 6,
                                "tackleBreaks": 1,
                                "tackles": 21,
                                "tryAssists": 1,
                                "tryCause": 1,
                                "evasionRuns": 6,
                                "evasionRunMetres": 43,
                                "ptbFast": 33.33,
                                "ptbNeutral": 66.67,
                                "ptbAll": 3
                            },
                            "playerTookTheField": true,
                            "shirtNum": 7
                        },
                        {
                            "playerFirstName": "George",
                            "playerId": 500095,
                            "playerLastName": "Burgess",
                            "playerName": "George Burgess",
                            "playerPosition": "Prop 1",
                            "playerPositionId": 500008,
                            "playerStats": {
                                "allRunMetres": 150,
                                "allRuns": 17,
                                "decoys": 7,
                                "fantasyPointsTotal": 47,
                                "hitUps": 14,
                                "kickReturnMetres": 42,
                                "kickReturns": 3,
                                "linebreaks": 1,
                                "mins": 47,
                                "oneOnOneTackles": 2,
                                "penalties": 1,
                                "supports": 5,
                                "tackleBreaks": 3,
                                "tackles": 21,
                                "hitupRunMeters": 108,
                                "ptbFast": 6.25,
                                "ptbNeutral": 93.75,
                                "ptbAll": 16
                            },
                            "playerTookTheField": true,
                            "shirtNum": 8
                        },
                        {
                            "playerFirstName": "Issac",
                            "playerId": 500088,
                            "playerLastName": "Luke",
                            "playerName": "Issac Luke",
                            "playerPosition": "Hooker",
                            "playerPositionId": 500009,
                            "playerStats": {
                                "allRunMetres": 128,
                                "allRuns": 16,
                                "dummyHalfRuns": 11,
                                "fantasyPointsTotal": 56,
                                "hitUps": 2,
                                "ineffectiveTackles": 3,
                                "kickReturnMetres": 12,
                                "kickReturns": 1,
                                "kicksDefused": 1,
                                "linebreakAssists": 4,
                                "mins": 80,
                                "missedTackles": 2,
                                "offloads": 2,
                                "supports": 7,
                                "tackleBreaks": 1,
                                "tackles": 22,
                                "tryAssists": 2,
                                "hitupRunMeters": 23,
                                "evasionRuns": 2,
                                "evasionRunMetres": 10,
                                "dummyHalfRunMetres": 83,
                                "ptbNeutral": 100,
                                "ptbAll": 6
                            },
                            "playerTookTheField": true,
                            "shirtNum": 9
                        },
                        {
                            "playerFirstName": "Tim",
                            "playerId": 500347,
                            "playerLastName": "Grant",
                            "playerName": "Tim Grant",
                            "playerPosition": "Prop 2",
                            "playerPositionId": 500010,
                            "playerStats": {
                                "allRunMetres": 140,
                                "allRuns": 15,
                                "decoys": 5,
                                "fantasyPointsTotal": 28,
                                "hitUps": 13,
                                "ineffectiveTackles": 2,
                                "kickReturnMetres": 30,
                                "kickReturns": 2,
                                "mins": 43,
                                "penalties": 1,
                                "supports": 2,
                                "tackles": 16,
                                "hitupRunMeters": 110,
                                "ptbFast": 13.33,
                                "ptbNeutral": 80,
                                "ptbSlow": 6.67,
                                "ptbAll": 15
                            },
                            "playerTookTheField": true,
                            "shirtNum": 10
                        },
                        {
                            "playerFirstName": "Glenn",
                            "playerId": 500030,
                            "playerLastName": "Stewart",
                            "playerName": "Glenn Stewart",
                            "playerPosition": "2nd Row 1",
                            "playerPositionId": 500011,
                            "playerStats": {
                                "allRunMetres": 111,
                                "allRuns": 16,
                                "decoys": 13,
                                "fantasyPointsTotal": 50,
                                "hitUps": 11,
                                "ineffectiveTackles": 1,
                                "linebreakAssists": 1,
                                "mins": 80,
                                "missedTackles": 1,
                                "oneOnOneTackles": 1,
                                "supports": 9,
                                "tackleBreaks": 2,
                                "tackles": 28,
                                "tryAssists": 1,
                                "tryCause": 1,
                                "hitupRunMeters": 88,
                                "evasionRuns": 5,
                                "evasionRunMetres": 23,
                                "ptbFast": 50,
                                "ptbNeutral": 50,
                                "ptbAll": 10
                            },
                            "playerTookTheField": true,
                            "shirtNum": 11
                        },
                        {
                            "playerFirstName": "John",
                            "playerId": 500085,
                            "playerLastName": "Sutton",
                            "playerName": "John Sutton",
                            "playerPosition": "2nd Row 2",
                            "playerPositionId": 500012,
                            "playerStats": {
                                "allRunMetres": 115,
                                "allRuns": 12,
                                "decoys": 8,
                                "fantasyPointsTotal": 47,
                                "hitUps": 11,
                                "kickReturnMetres": 10,
                                "kickReturns": 1,
                                "linebreakAssists": 2,
                                "mins": 68,
                                "missedTackles": 1,
                                "offloads": 2,
                                "oneOnOneTackles": 1,
                                "supports": 6,
                                "tackleBreaks": 1,
                                "tackles": 22,
                                "tryAssists": 1,
                                "hitupRunMeters": 105,
                                "ptbFast": 9.09,
                                "ptbNeutral": 81.82,
                                "ptbSlow": 9.09,
                                "ptbAll": 11
                            },
                            "playerTookTheField": true,
                            "shirtNum": 12
                        },
                        {
                            "playerFirstName": "Chris",
                            "playerId": 500090,
                            "playerLastName": "McQueen",
                            "playerName": "Chris McQueen",
                            "playerPosition": "Lock",
                            "playerPositionId": 500013,
                            "playerStats": {
                                "allRunMetres": 117,
                                "allRuns": 13,
                                "decoys": 4,
                                "fantasyPointsTotal": 43,
                                "hitUps": 13,
                                "ineffectiveTackles": 2,
                                "linebreaks": 1,
                                "mins": 55,
                                "missedTackles": 3,
                                "supports": 6,
                                "tackleBreaks": 4,
                                "tackles": 22,
                                "tryCause": 1,
                                "hitupRunMeters": 117,
                                "ptbFast": 7.69,
                                "ptbNeutral": 84.62,
                                "ptbSlow": 7.69,
                                "ptbAll": 13
                            },
                            "playerTookTheField": true,
                            "shirtNum": 13
                        },
                        {
                            "playerFirstName": "Ben",
                            "playerId": 500110,
                            "playerLastName": "Lowe",
                            "playerName": "Ben Lowe",
                            "playerPosition": "Interchange",
                            "playerPositionId": 500014,
                            "playerStats": {
                                "allRunMetres": 22,
                                "allRuns": 3,
                                "chargeDowns": 1,
                                "fantasyPointsTotal": 8,
                                "hitUps": 3,
                                "kicksDefused": 1,
                                "mins": 9,
                                "supports": 1,
                                "tackles": 5,
                                "hitupRunMeters": 22,
                                "ptbNeutral": 100,
                                "ptbAll": 3
                            },
                            "playerTookTheField": true,
                            "shirtNum": 14
                        },
                        {
                            "playerFirstName": "Chris",
                            "playerId": 500106,
                            "playerLastName": "Grevsmuhl",
                            "playerName": "Chris Grevsmuhl",
                            "playerPosition": "Interchange",
                            "playerPositionId": 500014,
                            "playerStats": {
                                "allRunMetres": 86,
                                "allRuns": 9,
                                "decoys": 4,
                                "fantasyPointsTotal": 28,
                                "hitUps": 9,
                                "mins": 29,
                                "supports": 8,
                                "tackleBreaks": 2,
                                "tackles": 14,
                                "hitupRunMeters": 86,
                                "ptbNeutral": 100,
                                "ptbAll": 9
                            },
                            "playerTookTheField": true,
                            "shirtNum": 15
                        },
                        {
                            "playerFirstName": "David",
                            "playerId": 500117,
                            "playerLastName": "Tyrrell",
                            "playerName": "David Tyrrell",
                            "playerPosition": "Interchange",
                            "playerPositionId": 500014,
                            "playerStats": {
                                "allRunMetres": 105,
                                "allRuns": 11,
                                "decoys": 4,
                                "fantasyPointsTotal": 19,
                                "hitUps": 7,
                                "kickReturnMetres": 45,
                                "kickReturns": 3,
                                "mins": 27,
                                "supports": 5,
                                "tackles": 9,
                                "hitupRunMeters": 56,
                                "evasionRuns": 1,
                                "evasionRunMetres": 4,
                                "ptbFast": 22.22,
                                "ptbNeutral": 77.78,
                                "ptbAll": 9
                            },
                            "playerTookTheField": true,
                            "shirtNum": 16
                        },
                        {
                            "playerFirstName": "Thomas",
                            "playerId": 500087,
                            "playerLastName": "Burgess",
                            "playerName": "Thomas Burgess",
                            "playerPosition": "Interchange",
                            "playerPositionId": 500014,
                            "playerStats": {
                                "allRunMetres": 215,
                                "allRuns": 20,
                                "decoys": 8,
                                "fantasyPointsTotal": 52,
                                "hitUps": 17,
                                "kickReturnMetres": 41,
                                "kickReturns": 3,
                                "linebreaks": 1,
                                "mins": 42,
                                "missedTackles": 1,
                                "points": 4,
                                "supports": 12,
                                "tackleBreaks": 2,
                                "tackles": 15,
                                "tries": 1,
                                "hitupRunMeters": 174,
                                "ptbFast": 33.33,
                                "ptbNeutral": 66.67,
                                "ptbAll": 18
                            },
                            "playerTookTheField": true,
                            "shirtNum": 17
                        }
                    ]
                },
                "teamName": "South Sydney Rabbitohs",
                "teamNickName": "Rabbitohs",
                "teamStats": {
                    "allRunMetres": 1855,
                    "allRuns": 213,
                    "bombKicks": 4,
                    "bombKickMetres": 123,
                    "bombKicksDefused": 3,
                    "bombKicksNotDefused": 2,
                    "chargeDowns": 1,
                    "chargedDown": 1,
                    "completeSets": 42,
                    "completionPercentage": 93,
                    "conversions": 6,
                    "conversionsAttempts": 10,
                    "conversionsMissed": 4,
                    "decoys": 66,
                    "dummyHalfRuns": 15,
                    "errors": 3,
                    "fieldGoalsAttempts": 1,
                    "fieldGoalsMissed": 1,
                    "goalConversionRate": 60,
                    "allGoals": 6,
                    "allGoalsAttempted": 10,
                    "allGoalsMissed": 4,
                    "hitUps": 101,
                    "incompleteSets": 3,
                    "ineffectiveTackles": 16,
                    "kickMetres": 618,
                    "kickReturnMetres": 247,
                    "kickReturns": 23,
                    "kicks": 23,
                    "kicksDefused": 8,
                    "kicksNotDefused": 2,
                    "linebreakAssists": 10,
                    "linebreaks": 12,
                    "missedTackles": 16,
                    "offloads": 7,
                    "oneOnOneTackles": 7,
                    "penalties": 3,
                    "points": 52,
                    "pointsConceded": 6,
                    "possession": 62,
                    "scrumWins": 7,
                    "supports": 132,
                    "tackleBreaks": 39,
                    "tackles": 244,
                    "sets": 45,
                    "tries": 10,
                    "triesConceded": 1,
                    "tryAssists": 9,
                    "hitupRunMeters": 896,
                    "evasionRuns": 74,
                    "evasionRunMetres": 602,
                    "dummyHalfRunMetres": 110,
                    "ptbFast": 15,
                    "ptbNeutral": 81,
                    "ptbSlow": 4,
                    "ptbTotal": 163
                }
            },
            {
                "score": {
                    "conversions": 1,
                    "points": 6,
                    "tries": 1
                },
                "team1stHalfScore": 6,
                "team2ndHalfScore": 0,
                "teamAbbr": "NEW",
                "teamFinalScore": 6,
                "teamFullTimeScore": 6,
                "teamHalfTimeScore": 6,
                "teamId": 500003,
                "teamLineup": {
                    "injuriesAndSuspensions": {
                        "injury": [],
                        "suspension": []
                    },
                    "insAndOuts": {
                        "inOut": [
                            {
                                "inOut": "In",
                                "playerFirstName": "Adam",
                                "playerId": "500370",
                                "playerLastName": "Clydsdale",
                                "playerName": "Adam Clydsdale"
                            },
                            {
                                "inOut": "Out",
                                "playerFirstName": "Akuila",
                                "playerId": "500044",
                                "playerLastName": "Uate",
                                "playerName": "Akuila Uate"
                            },
                            {
                                "inOut": "In",
                                "playerFirstName": "Chanel",
                                "playerId": "500376",
                                "playerLastName": "Mata'utia",
                                "playerName": "Chanel Mata'utia"
                            },
                            {
                                "inOut": "Out",
                                "playerFirstName": "Jarrod",
                                "playerId": "500045",
                                "playerLastName": "Mullen",
                                "playerName": "Jarrod Mullen"
                            },
                            {
                                "inOut": "In",
                                "playerFirstName": "Sione",
                                "playerId": "500571",
                                "playerLastName": "Mata'utia",
                                "playerName": "Sione Mata'utia"
                            },
                            {
                                "inOut": "Out",
                                "playerFirstName": "Tyler",
                                "playerId": "500380",
                                "playerLastName": "Randell",
                                "playerName": "Tyler Randell"
                            }
                        ]
                    },
                    "teamPlayer": [
                        {
                            "playerFirstName": "Kurt",
                            "playerId": 500373,
                            "playerLastName": "Gidley",
                            "playerName": "Kurt Gidley",
                            "playerPosition": "Fullback",
                            "playerPositionId": 500001,
                            "playerStats": {
                                "allRunMetres": 31,
                                "allRuns": 4,
                                "bombKicks": 1,
                                "bombKickMetres": 26,
                                "chargedDown": 1,
                                "decoys": 3,
                                "errors": 1,
                                "fantasyPointsTotal": 38,
                                "kickMetres": 65,
                                "kicks": 4,
                                "kicksDefused": 1,
                                "linebreakAssists": 2,
                                "mins": 80,
                                "missedTackles": 4,
                                "oneOnOneTackles": 1,
                                "penalties": 1,
                                "supports": 8,
                                "tackles": 34,
                                "tryAssists": 1,
                                "tryCause": 2,
                                "evasionRuns": 4,
                                "evasionRunMetres": 31,
                                "ptbNeutral": 100,
                                "ptbAll": 1
                            },
                            "playerTookTheField": true,
                            "shirtNum": 1
                        },
                        {
                            "playerFirstName": "Jake",
                            "playerId": 500553,
                            "playerLastName": "Mamo",
                            "playerName": "Jake Mamo",
                            "playerPosition": "Winger 1",
                            "playerPositionId": 500002,
                            "playerStats": {
                                "allRunMetres": 149,
                                "allRuns": 16,
                                "bombKicksDefused": 1,
                                "chargeDowns": 1,
                                "errors": 2,
                                "fantasyPointsTotal": 51,
                                "ineffectiveTackles": 2,
                                "kickReturnMetres": 94,
                                "kickReturns": 10,
                                "kicksDefused": 6,
                                "mins": 80,
                                "missedTackles": 1,
                                "offloads": 1,
                                "oneOnOneTackles": 2,
                                "supports": 7,
                                "tackleBreaks": 7,
                                "tackles": 14,
                                "tryCause": 2,
                                "evasionRuns": 6,
                                "evasionRunMetres": 55,
                                "ptbFast": 8.33,
                                "ptbNeutral": 83.33,
                                "ptbSlow": 8.33,
                                "ptbAll": 12
                            },
                            "playerTookTheField": true,
                            "shirtNum": 2
                        },
                        {
                            "playerFirstName": "James",
                            "playerId": 500378,
                            "playerLastName": "McManus",
                            "playerName": "James McManus",
                            "playerPosition": "Centre 1",
                            "playerPositionId": 500003,
                            "playerStats": {
                                "allRunMetres": 7,
                                "allRuns": 1,
                                "mins": 8,
                                "supports": 1,
                                "tryCause": 1,
                                "evasionRuns": 1,
                                "evasionRunMetres": 7,
                                "ptbNeutral": 100,
                                "ptbAll": 1
                            },
                            "playerTookTheField": true,
                            "shirtNum": 3
                        },
                        {
                            "playerFirstName": "Dane",
                            "playerId": 500043,
                            "playerLastName": "Gagai",
                            "playerName": "Dane Gagai",
                            "playerPosition": "Centre 2",
                            "playerPositionId": 500004,
                            "playerStats": {
                                "allRunMetres": 104,
                                "allRuns": 10,
                                "decoys": 2,
                                "dummyHalfRuns": 3,
                                "errors": 1,
                                "fantasyPointsTotal": 20,
                                "ineffectiveTackles": 1,
                                "kickMetres": 20,
                                "kicks": 2,
                                "linebreaks": 1,
                                "mins": 80,
                                "missedTackles": 6,
                                "oneOnOneTackles": 1,
                                "supports": 5,
                                "tackles": 19,
                                "tryCause": 3,
                                "evasionRuns": 7,
                                "evasionRunMetres": 74,
                                "dummyHalfRunMetres": 30,
                                "ptbNeutral": 100,
                                "ptbAll": 9
                            },
                            "playerTookTheField": true,
                            "shirtNum": 4
                        },
                        {
                            "playerFirstName": "Chanel",
                            "playerId": 500376,
                            "playerLastName": "Mata'utia",
                            "playerName": "Chanel Mata'utia",
                            "playerPosition": "Winger 2",
                            "playerPositionId": 500005,
                            "playerStats": {
                                "allRunMetres": 131,
                                "allRuns": 12,
                                "bombKicksDefused": 1,
                                "decoys": 1,
                                "errors": 2,
                                "fantasyPointsTotal": 17,
                                "kickReturnMetres": 17,
                                "kickReturns": 1,
                                "kicksDefused": 1,
                                "kicksNotDefused": 3,
                                "mins": 80,
                                "missedTackles": 2,
                                "oneOnOneTackles": 1,
                                "supports": 6,
                                "tackleBreaks": 2,
                                "tackles": 5,
                                "tryCause": 4,
                                "evasionRuns": 11,
                                "evasionRunMetres": 114,
                                "ptbFast": 8.33,
                                "ptbNeutral": 83.33,
                                "ptbSlow": 8.33,
                                "ptbAll": 12
                            },
                            "playerTookTheField": true,
                            "shirtNum": 19
                        },
                        {
                            "playerFirstName": "Sione",
                            "playerId": 500571,
                            "playerLastName": "Mata'utia",
                            "playerName": "Sione Mata'utia",
                            "playerPosition": "Five-eighth",
                            "playerPositionId": 500006,
                            "playerStats": {
                                "allRunMetres": 140,
                                "allRuns": 14,
                                "bombKicksDefused": 2,
                                "errors": 2,
                                "fantasyPointsTotal": 16,
                                "hitUps": 1,
                                "ineffectiveTackles": 1,
                                "kickReturnMetres": 42,
                                "kickReturns": 4,
                                "kicksDefused": 4,
                                "mins": 80,
                                "missedTackles": 1,
                                "supports": 5,
                                "tackles": 4,
                                "tryCause": 1,
                                "hitupRunMeters": 14,
                                "evasionRuns": 9,
                                "evasionRunMetres": 84,
                                "ptbFast": 7.69,
                                "ptbNeutral": 84.62,
                                "ptbSlow": 7.69,
                                "ptbAll": 13
                            },
                            "playerTookTheField": true,
                            "shirtNum": 18
                        },
                        {
                            "playerFirstName": "Tyrone",
                            "playerId": 500046,
                            "playerLastName": "Roberts",
                            "playerName": "Tyrone Roberts",
                            "playerPosition": "Halfback",
                            "playerPositionId": 500007,
                            "playerStats": {
                                "allRunMetres": 5,
                                "allRuns": 3,
                                "bombKicks": 4,
                                "bombKickMetres": 89,
                                "conversions": 1,
                                "conversionsAttempts": 1,
                                "fantasyPointsTotal": 16,
                                "goalConversionRate": 100,
                                "allGoals": 1,
                                "allGoalsAttempted": 1,
                                "ineffectiveTackles": 1,
                                "kickMetres": 257,
                                "kickReturns": 1,
                                "kicks": 8,
                                "kicksDefused": 1,
                                "lineDropouts": 3,
                                "mins": 80,
                                "missedTackles": 6,
                                "offloads": 1,
                                "penalties": 1,
                                "points": 2,
                                "supports": 8,
                                "tackles": 13,
                                "tryCause": 4,
                                "evasionRuns": 2,
                                "evasionRunMetres": 5
                            },
                            "playerTookTheField": true,
                            "shirtNum": 7
                        },
                        {
                            "playerFirstName": "Kade",
                            "playerId": 500385,
                            "playerLastName": "Snowden",
                            "playerName": "Kade Snowden",
                            "playerPosition": "Prop 1",
                            "playerPositionId": 500008,
                            "playerStats": {
                                "allRunMetres": 87,
                                "allRuns": 9,
                                "decoys": 6,
                                "fantasyPointsTotal": 78,
                                "hitUps": 7,
                                "kickReturnMetres": 27,
                                "kickReturns": 2,
                                "kicks": 1,
                                "linebreaks": 1,
                                "mins": 55,
                                "offloads": 2,
                                "penalties": 1,
                                "points": 4,
                                "supports": 4,
                                "tackleBreaks": 1,
                                "tackles": 53,
                                "tries": 1,
                                "hitupRunMeters": 60,
                                "ptbNeutral": 83.33,
                                "ptbSlow": 16.67,
                                "ptbAll": 6
                            },
                            "playerTookTheField": true,
                            "shirtNum": 8
                        },
                        {
                            "playerFirstName": "Adam",
                            "playerId": 500370,
                            "playerLastName": "Clydsdale",
                            "playerName": "Adam Clydsdale",
                            "playerPosition": "Hooker",
                            "playerPositionId": 500009,
                            "playerStats": {
                                "allRunMetres": 27,
                                "allRuns": 4,
                                "decoys": 2,
                                "dummyHalfRuns": 4,
                                "fantasyPointsTotal": 36,
                                "mins": 52,
                                "missedTackles": 1,
                                "offloads": 1,
                                "supports": 1,
                                "tackleBreaks": 2,
                                "tackles": 28,
                                "dummyHalfRunMetres": 27,
                                "ptbNeutral": 100,
                                "ptbAll": 2
                            },
                            "playerTookTheField": true,
                            "shirtNum": 9
                        },
                        {
                            "playerFirstName": "Korbin",
                            "playerId": 500384,
                            "playerLastName": "Sims",
                            "playerName": "Korbin Sims",
                            "playerPosition": "Prop 2",
                            "playerPositionId": 500010,
                            "playerStats": {
                                "allRunMetres": 48,
                                "allRuns": 6,
                                "decoys": 1,
                                "fantasyPointsTotal": 35,
                                "hitUps": 6,
                                "ineffectiveTackles": 2,
                                "mins": 48,
                                "missedTackles": 2,
                                "penalties": 1,
                                "supports": 2,
                                "tackleBreaks": 1,
                                "tackles": 34,
                                "hitupRunMeters": 48,
                                "ptbNeutral": 100,
                                "ptbAll": 6
                            },
                            "playerTookTheField": true,
                            "shirtNum": 10
                        },
                        {
                            "playerFirstName": "Beau",
                            "playerId": 500051,
                            "playerLastName": "Scott",
                            "playerName": "Beau Scott",
                            "playerPosition": "2nd Row 1",
                            "playerPositionId": 500011,
                            "playerStats": {
                                "allRunMetres": 52,
                                "allRuns": 5,
                                "decoys": 1,
                                "errors": 1,
                                "fantasyPointsTotal": 15,
                                "hitUps": 4,
                                "ineffectiveTackles": 1,
                                "mins": 80,
                                "missedTackles": 2,
                                "offloads": 2,
                                "supports": 9,
                                "tackles": 12,
                                "tryCause": 2,
                                "hitupRunMeters": 44,
                                "evasionRuns": 1,
                                "evasionRunMetres": 8,
                                "ptbNeutral": 100,
                                "ptbAll": 2
                            },
                            "playerTookTheField": true,
                            "shirtNum": 11
                        },
                        {
                            "playerFirstName": "Tariq",
                            "playerId": 500298,
                            "playerLastName": "Sims",
                            "playerName": "Tariq Sims",
                            "playerPosition": "2nd Row 2",
                            "playerPositionId": 500012,
                            "playerStats": {
                                "allRunMetres": 111,
                                "allRuns": 12,
                                "decoys": 1,
                                "fantasyPointsTotal": 40,
                                "hitUps": 10,
                                "kickMetres": 16,
                                "kicks": 1,
                                "mins": 80,
                                "missedTackles": 3,
                                "offloads": 1,
                                "oneOnOneTackles": 2,
                                "supports": 5,
                                "tackleBreaks": 1,
                                "tackles": 30,
                                "tryCause": 3,
                                "hitupRunMeters": 91,
                                "evasionRuns": 2,
                                "evasionRunMetres": 20,
                                "ptbFast": 25,
                                "ptbNeutral": 75,
                                "ptbAll": 8
                            },
                            "playerTookTheField": true,
                            "shirtNum": 12
                        },
                        {
                            "playerFirstName": "Jeremy",
                            "playerId": 500052,
                            "playerLastName": "Smith",
                            "playerName": "Jeremy Smith",
                            "playerPosition": "Lock",
                            "playerPositionId": 500013,
                            "playerStats": {
                                "allRunMetres": 105,
                                "allRuns": 9,
                                "decoys": 5,
                                "fantasyPointsTotal": 38,
                                "hitUps": 9,
                                "ineffectiveTackles": 1,
                                "mins": 55,
                                "missedTackles": 3,
                                "oneOnOneTackles": 1,
                                "penalties": 2,
                                "tackleBreaks": 2,
                                "tackles": 32,
                                "tryCause": 1,
                                "hitupRunMeters": 105,
                                "ptbNeutral": 88.89,
                                "ptbSlow": 11.11,
                                "ptbAll": 9
                            },
                            "playerTookTheField": true,
                            "shirtNum": 13
                        },
                        {
                            "playerFirstName": "Danny",
                            "playerId": 500567,
                            "playerLastName": "Levi",
                            "playerName": "Danny Levi",
                            "playerPosition": "Interchange",
                            "playerPositionId": 500014,
                            "playerStats": {
                                "allRunMetres": 10,
                                "allRuns": 1,
                                "dummyHalfRuns": 1,
                                "fantasyPointsTotal": 13,
                                "mins": 28,
                                "missedTackles": 5,
                                "penalties": 1,
                                "tackles": 24,
                                "tryCause": 1,
                                "dummyHalfRunMetres": 10,
                                "ptbNeutral": 100,
                                "ptbAll": 1
                            },
                            "playerTookTheField": true,
                            "shirtNum": 14
                        },
                        {
                            "playerFirstName": "David",
                            "playerId": 500047,
                            "playerLastName": "Fa'alogo",
                            "playerName": "David Fa'alogo",
                            "playerPosition": "Interchange",
                            "playerPositionId": 500014,
                            "playerStats": {
                                "allRunMetres": 48,
                                "allRuns": 5,
                                "decoys": 5,
                                "errors": 1,
                                "fantasyPointsTotal": 32,
                                "hitUps": 5,
                                "mins": 39,
                                "missedTackles": 2,
                                "offloads": 1,
                                "supports": 6,
                                "tackles": 32,
                                "hitupRunMeters": 48,
                                "ptbNeutral": 100,
                                "ptbAll": 4
                            },
                            "playerTookTheField": true,
                            "shirtNum": 15
                        },
                        {
                            "playerFirstName": "Chris",
                            "playerId": 500054,
                            "playerLastName": "Houston",
                            "playerName": "Chris Houston",
                            "playerPosition": "Interchange",
                            "playerPositionId": 500014,
                            "playerStats": {
                                "allRunMetres": 26,
                                "allRuns": 3,
                                "decoys": 1,
                                "fantasyPointsTotal": 57,
                                "hitUps": 3,
                                "mins": 72,
                                "oneOnOneTackles": 1,
                                "supports": 2,
                                "tackles": 55,
                                "tryCause": 1,
                                "hitupRunMeters": 26,
                                "ptbNeutral": 100,
                                "ptbAll": 3
                            },
                            "playerTookTheField": true,
                            "shirtNum": 16
                        },
                        {
                            "playerFirstName": "Clint",
                            "playerId": 500962,
                            "playerLastName": "Newton",
                            "playerName": "Clint Newton",
                            "playerPosition": "Interchange",
                            "playerPositionId": 500014,
                            "playerStats": {
                                "allRunMetres": 30,
                                "allRuns": 3,
                                "decoys": 1,
                                "fantasyPointsTotal": 32,
                                "hitUps": 3,
                                "mins": 43,
                                "missedTackles": 1,
                                "supports": 1,
                                "tackles": 31,
                                "hitupRunMeters": 30,
                                "ptbFast": 66.67,
                                "ptbNeutral": 33.33,
                                "ptbAll": 3
                            },
                            "playerTookTheField": true,
                            "shirtNum": 17
                        }
                    ]
                },
                "teamName": "Newcastle Knights",
                "teamNickName": "Knights",
                "teamStats": {
                    "allRunMetres": 1110,
                    "allRuns": 117,
                    "bombKicks": 5,
                    "bombKickMetres": 116,
                    "bombKicksDefused": 4,
                    "chargeDowns": 1,
                    "chargedDown": 1,
                    "completeSets": 16,
                    "completionPercentage": 64,
                    "conversions": 1,
                    "conversionsAttempts": 1,
                    "decoys": 29,
                    "dummyHalfRuns": 8,
                    "errors": 10,
                    "goalConversionRate": 100,
                    "allGoals": 1,
                    "allGoalsAttempted": 1,
                    "hitUps": 48,
                    "incompleteSets": 9,
                    "ineffectiveTackles": 9,
                    "kickMetres": 357,
                    "kickReturnMetres": 180,
                    "kickReturns": 18,
                    "kicks": 16,
                    "kicksDefused": 13,
                    "kicksNotDefused": 3,
                    "lineDropouts": 3,
                    "linebreakAssists": 2,
                    "linebreaks": 2,
                    "missedTackles": 39,
                    "offloads": 9,
                    "oneOnOneTackles": 9,
                    "penalties": 7,
                    "points": 6,
                    "pointsConceded": 52,
                    "possession": 38,
                    "scrumWins": 1,
                    "supports": 70,
                    "tackleBreaks": 16,
                    "tackles": 420,
                    "sets": 25,
                    "tries": 1,
                    "triesConceded": 10,
                    "tryAssists": 1,
                    "hitupRunMeters": 465,
                    "evasionRuns": 43,
                    "evasionRunMetres": 398,
                    "dummyHalfRunMetres": 67,
                    "ptbFast": 8,
                    "ptbNeutral": 87,
                    "ptbSlow": 5,
                    "ptbTotal": 92
                }
            }
        ]
    }
}