{
    "competitionId": 111,
    "competitionName": "NRL Telstra Premiership",
    "gameId": 20151112370,
    "gameInfo": {
        "assistantReferee1Id": 500031,
        "numberOfPeriods": 2,
        "assistantReferee1Name": "Russell Turner",
        "assistantReferee2Id": 500050,
        "assistantReferee2Name": "Peter Gough",
        "gameDate": "2015-08-17",
        "gameHashTag": "#NRLSharksStorm",
        "gameNumber": 7,
        "gameSeconds": 4800,
        "gameMinutes": "80:00",
        "gameTime": "1:20:00",
        "groundConditionId": 1,
        "groundConditionName": "N/A",
        "referee1Id": 500004,
        "referee1Name": "Gerard Sutton",
        "referee2Id": 500008,
        "referee2Name": "Gavin Badger",
        "startTime": "2015-08-17T19:00:00",
        "startTimeUTC": "2015-08-17T09:00:00Z",
        "venueId": 500007,
        "venueName": "Remondis Stadium",
        "videoReferee1Id": 500232,
        "videoReferee1Name": "Luke Patten",
        "videoReferee2Id": 500027,
        "videoReferee2Name": "Bernard Sutton"
    },
    "gameState": "Final",
    "gameStateId": 8,
    "roundId": 23,
    "seasonId": 2015,
    "teams": {
        "teamsMatch": [
            {
                "isHomeTeam": true,
                "score": {
                    "points": 2,
                    "penaltyGoals": 1
                },
                "team1stHalfScore": 2,
                "team2ndHalfScore": 0,
                "teamAbbr": "CRO",
                "teamFinalScore": 2,
                "teamFullTimeScore": 2,
                "teamHalfTimeScore": 2,
                "teamId": 500028,
                "teamLineup": {
                    "injuriesAndSuspensions": {
                        "injury": [],
                        "suspension": []
                    },
                    "insAndOuts": {
                        "inOut": [
                            {
                                "inOut": "In",
                                "playerFirstName": "Luke",
                                "playerId": "500802",
                                "playerLastName": "Lewis",
                                "playerName": "Luke Lewis"
                            },
                            {
                                "inOut": "Out",
                                "playerFirstName": "Sam",
                                "playerId": "500813",
                                "playerLastName": "Tagataese",
                                "playerName": "Sam Tagataese"
                            }
                        ]
                    },
                    "teamPlayer": [
                        {
                            "playerFirstName": "Michael",
                            "playerId": 500797,
                            "playerLastName": "Gordon",
                            "playerName": "Michael Gordon",
                            "playerPosition": "Fullback",
                            "playerPositionId": 500001,
                            "playerStats": {
                                "allRunMetres": 221,
                                "allRuns": 20,
                                "decoys": 3,
                                "errors": 1,
                                "fantasyPointsTotal": 48,
                                "goalConversionRate": 100,
                                "allGoals": 1,
                                "allGoalsAttempted": 1,
                                "kickReturnMetres": 138,
                                "kickReturns": 11,
                                "kicksDefused": 1,
                                "mins": 80,
                                "offloads": 2,
                                "penaltyGoals": 1,
                                "penaltyGoalsAttempts": 1,
                                "points": 2,
                                "supports": 14,
                                "tackleBreaks": 5,
                                "tackles": 6,
                                "tryCause": 1,
                                "evasionRuns": 9,
                                "evasionRunMetres": 83,
                                "ptbFast": 27.78,
                                "ptbNeutral": 72.22,
                                "ptbAll": 18
                            },
                            "playerTookTheField": true,
                            "shirtNum": 1
                        },
                        {
                            "playerFirstName": "Sosaia",
                            "playerId": 500790,
                            "playerLastName": "Feki",
                            "playerName": "Sosaia Feki",
                            "playerPosition": "Winger 1",
                            "playerPositionId": 500002,
                            "playerStats": {
                                "allRunMetres": 130,
                                "allRuns": 15,
                                "dummyHalfRuns": 2,
                                "errors": 1,
                                "fantasyPointsTotal": 19,
                                "kickReturnMetres": 13,
                                "kickReturns": 2,
                                "kicksDefused": 1,
                                "kicksNotDefused": 1,
                                "mins": 70,
                                "missedTackles": 1,
                                "supports": 7,
                                "tackles": 4,
                                "tryCause": 1,
                                "trySaves": 1,
                                "evasionRuns": 11,
                                "evasionRunMetres": 100,
                                "dummyHalfRunMetres": 17,
                                "ptbFast": 21.43,
                                "ptbNeutral": 78.57,
                                "ptbAll": 14
                            },
                            "playerTookTheField": true,
                            "shirtNum": 2
                        },
                        {
                            "playerFirstName": "Gerard",
                            "playerId": 500616,
                            "playerLastName": "Beale",
                            "playerName": "Gerard Beale",
                            "playerPosition": "Centre 1",
                            "playerPositionId": 500003,
                            "playerStats": {
                                "allRunMetres": 85,
                                "allRuns": 12,
                                "decoys": 1,
                                "errors": 1,
                                "fantasyPointsTotal": 29,
                                "kickReturns": 1,
                                "kicksDefused": 1,
                                "mins": 80,
                                "offloads": 2,
                                "supports": 9,
                                "tackles": 18,
                                "evasionRuns": 11,
                                "evasionRunMetres": 85,
                                "ptbFast": 25,
                                "ptbNeutral": 75,
                                "ptbAll": 8
                            },
                            "playerTookTheField": true,
                            "shirtNum": 3
                        },
                        {
                            "playerFirstName": "Ricky",
                            "playerId": 500801,
                            "playerLastName": "Leutele",
                            "playerName": "Ricky Leutele",
                            "playerPosition": "Centre 2",
                            "playerPositionId": 500004,
                            "playerStats": {
                                "allRunMetres": 117,
                                "allRuns": 13,
                                "dummyHalfRuns": 1,
                                "errors": 1,
                                "fantasyPointsTotal": 34,
                                "hitUps": 1,
                                "kickMetres": 5,
                                "kicks": 1,
                                "kicksNotDefused": 1,
                                "mins": 80,
                                "missedTackles": 1,
                                "offloads": 1,
                                "penalties": 1,
                                "supports": 12,
                                "tackleBreaks": 1,
                                "tackles": 24,
                                "tryCause": 3,
                                "hitupRunMeters": 9,
                                "evasionRuns": 11,
                                "evasionRunMetres": 98,
                                "dummyHalfRunMetres": 10,
                                "ptbFast": 25,
                                "ptbNeutral": 75,
                                "ptbAll": 12
                            },
                            "playerTookTheField": true,
                            "shirtNum": 4
                        },
                        {
                            "playerFirstName": "Valentine",
                            "playerId": 500845,
                            "playerLastName": "Holmes",
                            "playerName": "Valentine Holmes",
                            "playerPosition": "Winger 2",
                            "playerPositionId": 500005,
                            "playerStats": {
                                "allRunMetres": 150,
                                "allRuns": 16,
                                "dummyHalfRuns": 1,
                                "fantasyPointsTotal": 23,
                                "hitUps": 2,
                                "kickMetres": 29,
                                "kickReturnMetres": 31,
                                "kickReturns": 4,
                                "kicks": 2,
                                "kicksDefused": 1,
                                "mins": 80,
                                "oneOnOneTackles": 1,
                                "supports": 4,
                                "tackleBreaks": 1,
                                "tackles": 3,
                                "hitupRunMeters": 18,
                                "evasionRuns": 9,
                                "evasionRunMetres": 88,
                                "dummyHalfRunMetres": 13,
                                "ptbFast": 13.33,
                                "ptbNeutral": 80,
                                "ptbSlow": 6.67,
                                "ptbAll": 15
                            },
                            "playerTookTheField": true,
                            "shirtNum": 5
                        },
                        {
                            "playerFirstName": "Jack",
                            "playerId": 500617,
                            "playerLastName": "Bird",
                            "playerName": "Jack Bird",
                            "playerPosition": "Five-eighth",
                            "playerPositionId": 500006,
                            "playerStats": {
                                "allRunMetres": 108,
                                "allRuns": 18,
                                "errors": 2,
                                "fantasyPointsTotal": 63,
                                "kickMetres": 31,
                                "kickReturns": 1,
                                "kicks": 2,
                                "mins": 80,
                                "missedTackles": 1,
                                "offloads": 5,
                                "oneOnOneTackles": 2,
                                "supports": 8,
                                "tackleBreaks": 5,
                                "tackles": 33,
                                "tryCause": 1,
                                "evasionRuns": 17,
                                "evasionRunMetres": 108,
                                "ptbNeutral": 88.89,
                                "ptbSlow": 11.11,
                                "ptbAll": 9
                            },
                            "playerTookTheField": true,
                            "shirtNum": 6
                        },
                        {
                            "playerFirstName": "Jeff",
                            "playerId": 500808,
                            "playerLastName": "Robson",
                            "playerName": "Jeff Robson",
                            "playerPosition": "Halfback",
                            "playerPositionId": 500007,
                            "playerStats": {
                                "allRunMetres": 27,
                                "allRuns": 4,
                                "bombKicks": 2,
                                "bombKickMetres": 50,
                                "chargedDown": 1,
                                "errors": 2,
                                "fantasyPointsTotal": 34,
                                "ineffectiveTackles": 1,
                                "kickMetres": 246,
                                "kicks": 10,
                                "mins": 80,
                                "missedTackles": 4,
                                "offloads": 1,
                                "oneOnOneTackles": 2,
                                "supports": 13,
                                "tackleBreaks": 1,
                                "tackles": 27,
                                "tryCause": 1,
                                "evasionRuns": 4,
                                "evasionRunMetres": 27
                            },
                            "playerTookTheField": true,
                            "shirtNum": 7
                        },
                        {
                            "playerFirstName": "Chris",
                            "playerId": 500799,
                            "playerLastName": "Heighington",
                            "playerName": "Chris Heighington",
                            "playerPosition": "Prop 1",
                            "playerPositionId": 500008,
                            "playerStats": {
                                "allRunMetres": 91,
                                "allRuns": 12,
                                "decoys": 7,
                                "fantasyPointsTotal": 27,
                                "hitUps": 10,
                                "mins": 35,
                                "missedTackles": 1,
                                "offloads": 1,
                                "tackleBreaks": 1,
                                "tackles": 15,
                                "hitupRunMeters": 83,
                                "evasionRuns": 2,
                                "evasionRunMetres": 8,
                                "ptbFast": 11.11,
                                "ptbNeutral": 88.89,
                                "ptbAll": 9
                            },
                            "playerTookTheField": true,
                            "shirtNum": 8
                        },
                        {
                            "playerFirstName": "Michael",
                            "playerId": 500221,
                            "playerLastName": "Ennis",
                            "playerName": "Michael Ennis",
                            "playerPosition": "Hooker",
                            "playerPositionId": 500009,
                            "playerStats": {
                                "allRunMetres": 10,
                                "allRuns": 2,
                                "dummyHalfRuns": 2,
                                "fantasyPointsTotal": 37,
                                "ineffectiveTackles": 1,
                                "kickMetres": 108,
                                "kicks": 6,
                                "lineDropouts": 1,
                                "mins": 80,
                                "missedTackles": 3,
                                "oneOnOneTackles": 1,
                                "penalties": 1,
                                "tackles": 39,
                                "dummyHalfRunMetres": 10
                            },
                            "playerTookTheField": true,
                            "shirtNum": 9
                        },
                        {
                            "playerFirstName": "Matt",
                            "playerId": 500806,
                            "playerLastName": "Prior",
                            "playerName": "Matt Prior",
                            "playerPosition": "Prop 2",
                            "playerPositionId": 500010,
                            "playerStats": {
                                "allRunMetres": 81,
                                "allRuns": 9,
                                "decoys": 6,
                                "fantasyPointsTotal": 35,
                                "hitUps": 9,
                                "mins": 38,
                                "offloads": 2,
                                "supports": 3,
                                "tackles": 23,
                                "hitupRunMeters": 81,
                                "ptbNeutral": 100,
                                "ptbAll": 6
                            },
                            "playerTookTheField": true,
                            "shirtNum": 10
                        },
                        {
                            "playerFirstName": "Luke",
                            "playerId": 500802,
                            "playerLastName": "Lewis",
                            "playerName": "Luke Lewis",
                            "playerPosition": "2nd Row 1",
                            "playerPositionId": 500011,
                            "playerStats": {
                                "allRunMetres": 85,
                                "allRuns": 10,
                                "decoys": 6,
                                "fantasyPointsTotal": 26,
                                "hitUps": 9,
                                "ineffectiveTackles": 1,
                                "mins": 57,
                                "missedTackles": 1,
                                "oneOnOneTackles": 2,
                                "supports": 4,
                                "tackles": 20,
                                "tryCause": 1,
                                "hitupRunMeters": 80,
                                "evasionRuns": 1,
                                "evasionRunMetres": 5,
                                "ptbFast": 25,
                                "ptbNeutral": 62.5,
                                "ptbSlow": 12.5,
                                "ptbAll": 8
                            },
                            "playerTookTheField": true,
                            "shirtNum": 11
                        },
                        {
                            "playerFirstName": "Wade",
                            "playerId": 500798,
                            "playerLastName": "Graham",
                            "playerName": "Wade Graham",
                            "playerPosition": "2nd Row 2",
                            "playerPositionId": 500012,
                            "playerStats": {
                                "allRunMetres": 131,
                                "allRuns": 14,
                                "decoys": 4,
                                "fantasyPointsTotal": 43,
                                "hitUps": 13,
                                "ineffectiveTackles": 1,
                                "kickMetres": 98,
                                "kicks": 4,
                                "mins": 80,
                                "missedTackles": 2,
                                "penalties": 2,
                                "supports": 7,
                                "tackleBreaks": 1,
                                "tackles": 31,
                                "hitupRunMeters": 128,
                                "evasionRuns": 1,
                                "evasionRunMetres": 3,
                                "ptbFast": 8.33,
                                "ptbNeutral": 75,
                                "ptbSlow": 16.67,
                                "ptbAll": 12
                            },
                            "playerTookTheField": true,
                            "shirtNum": 12
                        },
                        {
                            "playerFirstName": "Paul",
                            "playerId": 500794,
                            "playerLastName": "Gallen",
                            "playerName": "Paul Gallen",
                            "playerPosition": "Lock",
                            "playerPositionId": 500013,
                            "playerStats": {
                                "allRunMetres": 247,
                                "allRuns": 29,
                                "decoys": 10,
                                "fantasyPointsTotal": 65,
                                "hitUps": 22,
                                "ineffectiveTackles": 1,
                                "kickReturnMetres": 36,
                                "kickReturns": 3,
                                "mins": 80,
                                "missedTackles": 3,
                                "offloads": 3,
                                "penalties": 2,
                                "supports": 11,
                                "tackleBreaks": 2,
                                "tackles": 39,
                                "hitupRunMeters": 190,
                                "evasionRuns": 4,
                                "evasionRunMetres": 21,
                                "ptbNeutral": 100,
                                "ptbAll": 22
                            },
                            "playerTookTheField": true,
                            "shirtNum": 13
                        },
                        {
                            "playerFirstName": "Ben",
                            "playerId": 500244,
                            "playerLastName": "Barba",
                            "playerName": "Ben Barba",
                            "playerPosition": "Interchange",
                            "playerPositionId": 500014,
                            "playerStats": {
                                "allRunMetres": 24,
                                "allRuns": 2,
                                "decoys": 1,
                                "fantasyPointsTotal": 3,
                                "kickMetres": 7,
                                "kicks": 1,
                                "mins": 10,
                                "tackles": 1,
                                "tryCause": 1,
                                "evasionRuns": 2,
                                "evasionRunMetres": 24,
                                "ptbSlow": 100,
                                "ptbAll": 1
                            },
                            "playerTookTheField": true,
                            "shirtNum": 14
                        },
                        {
                            "playerFirstName": "Anthony",
                            "playerId": 500814,
                            "playerLastName": "Tupou",
                            "playerName": "Anthony Tupou",
                            "playerPosition": "Interchange",
                            "playerPositionId": 500014,
                            "playerStats": {
                                "allRunMetres": 146,
                                "allRuns": 16,
                                "decoys": 9,
                                "errors": 1,
                                "fantasyPointsTotal": 56,
                                "hitUps": 12,
                                "ineffectiveTackles": 1,
                                "mins": 49,
                                "missedTackles": 2,
                                "offloads": 2,
                                "oneOnOneTackles": 2,
                                "supports": 7,
                                "tackleBreaks": 3,
                                "tackles": 35,
                                "hitupRunMeters": 126,
                                "evasionRuns": 4,
                                "evasionRunMetres": 20,
                                "ptbNeutral": 77.78,
                                "ptbSlow": 22.22,
                                "ptbAll": 9
                            },
                            "playerTookTheField": true,
                            "shirtNum": 15
                        },
                        {
                            "playerFirstName": "Tinirau",
                            "playerId": 500100,
                            "playerLastName": "Arona",
                            "playerName": "Tinirau Arona",
                            "playerPosition": "Interchange",
                            "playerPositionId": 500014,
                            "playerStats": {
                                "allRunMetres": 62,
                                "allRuns": 7,
                                "decoys": 3,
                                "fantasyPointsTotal": 23,
                                "hitUps": 5,
                                "ineffectiveTackles": 1,
                                "kickReturnMetres": 12,
                                "kickReturns": 1,
                                "mins": 23,
                                "missedTackles": 1,
                                "oneOnOneTackles": 1,
                                "supports": 5,
                                "tackles": 19,
                                "hitupRunMeters": 45,
                                "evasionRuns": 1,
                                "evasionRunMetres": 5,
                                "ptbFast": 33.33,
                                "ptbNeutral": 66.67,
                                "ptbAll": 6
                            },
                            "playerTookTheField": true,
                            "shirtNum": 16
                        },
                        {
                            "playerFirstName": "Jayson",
                            "playerId": 500977,
                            "playerLastName": "Bukuya",
                            "playerName": "Jayson Bukuya",
                            "playerPosition": "Interchange",
                            "playerPositionId": 500014,
                            "playerStats": {
                                "allRunMetres": 83,
                                "allRuns": 9,
                                "decoys": 3,
                                "fantasyPointsTotal": 30,
                                "hitUps": 9,
                                "ineffectiveTackles": 1,
                                "kickMetres": 14,
                                "kicks": 1,
                                "mins": 38,
                                "missedTackles": 1,
                                "offloads": 1,
                                "oneOnOneTackles": 2,
                                "supports": 5,
                                "tackleBreaks": 1,
                                "tackles": 19,
                                "hitupRunMeters": 83,
                                "ptbFast": 37.5,
                                "ptbNeutral": 62.5,
                                "ptbAll": 8
                            },
                            "playerTookTheField": true,
                            "shirtNum": 17
                        }
                    ]
                },
                "teamName": "Cronulla-Sutherland Sharks",
                "teamNickName": "Sharks",
                "teamStats": {
                    "allRunMetres": 1798,
                    "allRuns": 208,
                    "bombKicks": 2,
                    "bombKickMetres": 50,
                    "chargedDown": 1,
                    "completeSets": 30,
                    "completionPercentage": 77,
                    "decoys": 53,
                    "dummyHalfRuns": 6,
                    "errors": 9,
                    "goalConversionRate": 100,
                    "allGoals": 1,
                    "allGoalsAttempted": 1,
                    "hitUps": 92,
                    "incompleteSets": 9,
                    "ineffectiveTackles": 8,
                    "kickMetres": 539,
                    "kickReturnMetres": 230,
                    "kickReturns": 23,
                    "kicks": 27,
                    "kicksDefused": 4,
                    "kicksNotDefused": 2,
                    "lineDropouts": 1,
                    "missedTackles": 21,
                    "offloads": 20,
                    "oneOnOneTackles": 13,
                    "penalties": 6,
                    "penaltyGoals": 1,
                    "penaltyGoalsAttempts": 1,
                    "points": 2,
                    "pointsConceded": 30,
                    "possession": 57,
                    "scrumWins": 6,
                    "supports": 109,
                    "tackleBreaks": 21,
                    "tackles": 356,
                    "sets": 39,
                    "triesConceded": 5,
                    "trySaves": 1,
                    "hitupRunMeters": 844,
                    "evasionRuns": 87,
                    "evasionRunMetres": 674,
                    "dummyHalfRunMetres": 50,
                    "ptbFast": 15,
                    "ptbNeutral": 80,
                    "ptbSlow": 5,
                    "ptbTotal": 157
                }
            },
            {
                "score": {
                    "conversions": 5,
                    "points": 30,
                    "tries": 5
                },
                "team1stHalfScore": 12,
                "team2ndHalfScore": 18,
                "teamAbbr": "MEL",
                "teamFinalScore": 30,
                "teamFullTimeScore": 30,
                "teamHalfTimeScore": 12,
                "teamId": 500021,
                "teamLineup": {
                    "injuriesAndSuspensions": {
                        "injury": [],
                        "suspension": []
                    },
                    "insAndOuts": {
                        "inOut": [
                            {
                                "inOut": "In",
                                "playerFirstName": "Felise",
                                "playerId": "500598",
                                "playerLastName": "Kaufusi",
                                "playerName": "Felise Kaufusi"
                            },
                            {
                                "inOut": "Out",
                                "playerFirstName": "Nelson",
                                "playerId": "501281",
                                "playerLastName": "Asofa-Solomona",
                                "playerName": "Nelson Asofa-Solomona"
                            }
                        ]
                    },
                    "teamPlayer": [
                        {
                            "playerFirstName": "Cameron",
                            "playerId": 501459,
                            "playerLastName": "Munster",
                            "playerName": "Cameron Munster",
                            "playerPosition": "Fullback",
                            "playerPositionId": 500001,
                            "playerStats": {
                                "allRunMetres": 295,
                                "allRuns": 23,
                                "bombKicksDefused": 1,
                                "decoys": 2,
                                "dummyHalfRuns": 5,
                                "errors": 2,
                                "fantasyPointsTotal": 66,
                                "kickReturnMetres": 67,
                                "kickReturns": 7,
                                "kicksDefused": 5,
                                "kicksNotDefused": 1,
                                "linebreakAssists": 1,
                                "mins": 80,
                                "points": 4,
                                "supports": 15,
                                "tackleBreaks": 6,
                                "tackles": 3,
                                "tries": 1,
                                "tryAssists": 1,
                                "evasionRuns": 11,
                                "evasionRunMetres": 175,
                                "dummyHalfRunMetres": 53,
                                "ptbFast": 14.29,
                                "ptbNeutral": 71.43,
                                "ptbSlow": 14.29,
                                "ptbAll": 21
                            },
                            "playerTookTheField": true,
                            "shirtNum": 1
                        },
                        {
                            "playerFirstName": "Marika",
                            "playerId": 500653,
                            "playerLastName": "Koroibete",
                            "playerName": "Marika Koroibete",
                            "playerPosition": "Winger 1",
                            "playerPositionId": 500002,
                            "playerStats": {
                                "allRunMetres": 144,
                                "allRuns": 16,
                                "bombKicksDefused": 1,
                                "decoys": 1,
                                "dummyHalfRuns": 3,
                                "fantasyPointsTotal": 30,
                                "ineffectiveTackles": 1,
                                "kickReturns": 1,
                                "kicksDefused": 1,
                                "mins": 80,
                                "oneOnOneTackles": 2,
                                "supports": 11,
                                "tackleBreaks": 2,
                                "tackles": 9,
                                "evasionRuns": 12,
                                "evasionRunMetres": 114,
                                "dummyHalfRunMetres": 30,
                                "ptbFast": 17.65,
                                "ptbNeutral": 82.35,
                                "ptbAll": 17
                            },
                            "playerTookTheField": true,
                            "shirtNum": 2
                        },
                        {
                            "playerFirstName": "Will",
                            "playerId": 500586,
                            "playerLastName": "Chambers",
                            "playerName": "Will Chambers",
                            "playerPosition": "Centre 1",
                            "playerPositionId": 500003,
                            "playerStats": {
                                "allRunMetres": 153,
                                "allRuns": 14,
                                "dummyHalfRuns": 2,
                                "errors": 1,
                                "fantasyPointsTotal": 44,
                                "ineffectiveTackles": 2,
                                "kickMetres": 8,
                                "kicks": 1,
                                "kicksDefused": 2,
                                "mins": 80,
                                "missedTackles": 3,
                                "oneOnOneTackles": 1,
                                "supports": 9,
                                "tackleBreaks": 2,
                                "tackles": 19,
                                "tryAssists": 1,
                                "trySaves": 1,
                                "evasionRuns": 12,
                                "evasionRunMetres": 134,
                                "dummyHalfRunMetres": 19,
                                "ptbFast": 21.43,
                                "ptbNeutral": 71.43,
                                "ptbSlow": 7.14,
                                "ptbAll": 14
                            },
                            "playerTookTheField": true,
                            "shirtNum": 3
                        },
                        {
                            "playerFirstName": "Kurt",
                            "playerId": 500601,
                            "playerLastName": "Mann",
                            "playerName": "Kurt Mann",
                            "playerPosition": "Centre 2",
                            "playerPositionId": 500004,
                            "playerStats": {
                                "allRunMetres": 78,
                                "allRuns": 9,
                                "dummyHalfRuns": 5,
                                "errors": 1,
                                "fantasyPointsTotal": 46,
                                "ineffectiveTackles": 6,
                                "kicksDefused": 1,
                                "mins": 80,
                                "offloads": 1,
                                "oneOnOneTackles": 6,
                                "supports": 7,
                                "tackleBreaks": 5,
                                "tackles": 23,
                                "evasionRuns": 4,
                                "evasionRunMetres": 28,
                                "dummyHalfRunMetres": 50,
                                "ptbFast": 11.11,
                                "ptbNeutral": 88.89,
                                "ptbAll": 9
                            },
                            "playerTookTheField": true,
                            "shirtNum": 4
                        },
                        {
                            "playerFirstName": "Matt",
                            "playerId": 500588,
                            "playerLastName": "Duffie",
                            "playerName": "Matt Duffie",
                            "playerPosition": "Winger 2",
                            "playerPositionId": 500005,
                            "playerStats": {
                                "allRunMetres": 126,
                                "allRuns": 13,
                                "decoys": 1,
                                "fantasyPointsTotal": 39,
                                "hitUps": 1,
                                "ineffectiveTackles": 1,
                                "kickReturnMetres": 56,
                                "kickReturns": 4,
                                "kicksDefused": 1,
                                "linebreaks": 1,
                                "mins": 80,
                                "missedTackles": 1,
                                "penalties": 1,
                                "points": 8,
                                "supports": 10,
                                "tackleBreaks": 1,
                                "tackles": 7,
                                "tries": 2,
                                "hitupRunMeters": 6,
                                "evasionRuns": 8,
                                "evasionRunMetres": 64,
                                "ptbFast": 10,
                                "ptbNeutral": 80,
                                "ptbSlow": 10,
                                "ptbAll": 10
                            },
                            "playerTookTheField": true,
                            "shirtNum": 5
                        },
                        {
                            "playerFirstName": "Blake",
                            "playerId": 502209,
                            "playerLastName": "Green",
                            "playerName": "Blake Green",
                            "playerPosition": "Five-eighth",
                            "playerPositionId": 500006,
                            "playerStats": {
                                "allRunMetres": 48,
                                "allRuns": 5,
                                "dummyHalfRuns": 1,
                                "fantasyPointsTotal": 35,
                                "ineffectiveTackles": 5,
                                "kickMetres": 140,
                                "kicks": 5,
                                "kicksNotDefused": 1,
                                "mins": 80,
                                "missedTackles": 4,
                                "supports": 13,
                                "tackleBreaks": 1,
                                "tackles": 29,
                                "evasionRuns": 4,
                                "evasionRunMetres": 38,
                                "dummyHalfRunMetres": 10,
                                "ptbFast": 33.33,
                                "ptbNeutral": 66.67,
                                "ptbAll": 3
                            },
                            "playerTookTheField": true,
                            "shirtNum": 6
                        },
                        {
                            "playerFirstName": "Cooper",
                            "playerId": 500587,
                            "playerLastName": "Cronk",
                            "playerName": "Cooper Cronk",
                            "playerPosition": "Halfback",
                            "playerPositionId": 500007,
                            "playerStats": {
                                "allRunMetres": 53,
                                "allRuns": 10,
                                "decoys": 1,
                                "fantasyPointsTotal": 51,
                                "ineffectiveTackles": 1,
                                "kickMetres": 324,
                                "kicks": 11,
                                "linebreakAssists": 1,
                                "mins": 80,
                                "missedTackles": 1,
                                "offloads": 1,
                                "oneOnOneTackles": 2,
                                "supports": 5,
                                "tackleBreaks": 1,
                                "tackles": 20,
                                "tryAssists": 1,
                                "evasionRuns": 10,
                                "evasionRunMetres": 53,
                                "ptbNeutral": 50,
                                "ptbSlow": 50,
                                "ptbAll": 2
                            },
                            "playerTookTheField": true,
                            "shirtNum": 7
                        },
                        {
                            "playerFirstName": "Jesse",
                            "playerId": 500584,
                            "playerLastName": "Bromwich",
                            "playerName": "Jesse Bromwich",
                            "playerPosition": "Prop 1",
                            "playerPositionId": 500008,
                            "playerStats": {
                                "allRunMetres": 160,
                                "allRuns": 16,
                                "decoys": 4,
                                "fantasyPointsTotal": 63,
                                "hitUps": 14,
                                "ineffectiveTackles": 2,
                                "kickReturnMetres": 9,
                                "kickReturns": 1,
                                "linebreaks": 1,
                                "mins": 64,
                                "missedTackles": 1,
                                "offloads": 1,
                                "points": 4,
                                "supports": 10,
                                "tackleBreaks": 1,
                                "tackles": 32,
                                "tries": 1,
                                "hitupRunMeters": 138,
                                "evasionRuns": 1,
                                "evasionRunMetres": 13,
                                "ptbFast": 35.71,
                                "ptbNeutral": 50,
                                "ptbSlow": 14.29,
                                "ptbAll": 14
                            },
                            "playerTookTheField": true,
                            "shirtNum": 8
                        },
                        {
                            "playerFirstName": "Cameron",
                            "playerId": 500609,
                            "playerLastName": "Smith",
                            "playerName": "Cameron Smith",
                            "playerPosition": "Hooker",
                            "playerPositionId": 500009,
                            "playerStats": {
                                "allRunMetres": 6,
                                "allRuns": 1,
                                "conversions": 5,
                                "conversionsAttempts": 5,
                                "dummyHalfRuns": 1,
                                "fantasyPointsTotal": 62,
                                "goalConversionRate": 100,
                                "allGoals": 5,
                                "allGoalsAttempted": 5,
                                "ineffectiveTackles": 3,
                                "kickMetres": 219,
                                "kicks": 7,
                                "kicksDefused": 1,
                                "lineDropouts": 2,
                                "mins": 80,
                                "missedTackles": 2,
                                "oneOnOneTackles": 2,
                                "penalties": 1,
                                "points": 10,
                                "supports": 2,
                                "tackles": 47,
                                "dummyHalfRunMetres": 6
                            },
                            "playerTookTheField": true,
                            "shirtNum": 9
                        },
                        {
                            "playerFirstName": "Tim",
                            "playerId": 500591,
                            "playerLastName": "Glasby",
                            "playerName": "Tim Glasby",
                            "playerPosition": "Prop 2",
                            "playerPositionId": 500010,
                            "playerStats": {
                                "allRunMetres": 89,
                                "allRuns": 9,
                                "chargeDowns": 1,
                                "decoys": 3,
                                "fantasyPointsTotal": 32,
                                "hitUps": 6,
                                "ineffectiveTackles": 1,
                                "kickReturnMetres": 33,
                                "kickReturns": 3,
                                "mins": 46,
                                "missedTackles": 2,
                                "oneOnOneTackles": 1,
                                "penalties": 1,
                                "supports": 5,
                                "tackles": 30,
                                "hitupRunMeters": 56,
                                "ptbFast": 25,
                                "ptbNeutral": 62.5,
                                "ptbSlow": 12.5,
                                "ptbAll": 8
                            },
                            "playerTookTheField": true,
                            "shirtNum": 10
                        },
                        {
                            "playerFirstName": "Kevin",
                            "playerId": 500606,
                            "playerLastName": "Proctor",
                            "playerName": "Kevin Proctor",
                            "playerPosition": "2nd Row 1",
                            "playerPositionId": 500011,
                            "playerStats": {
                                "allRunMetres": 123,
                                "allRuns": 13,
                                "decoys": 2,
                                "fantasyPointsTotal": 48,
                                "hitUps": 12,
                                "ineffectiveTackles": 2,
                                "kickReturnMetres": 5,
                                "kickReturns": 1,
                                "mins": 66,
                                "missedTackles": 1,
                                "supports": 3,
                                "tackleBreaks": 1,
                                "tackles": 35,
                                "hitupRunMeters": 118,
                                "ptbFast": 15.38,
                                "ptbNeutral": 76.92,
                                "ptbSlow": 7.69,
                                "ptbAll": 13
                            },
                            "playerTookTheField": true,
                            "shirtNum": 11
                        },
                        {
                            "playerFirstName": "Tohu",
                            "playerId": 500594,
                            "playerLastName": "Harris",
                            "playerName": "Tohu Harris",
                            "playerPosition": "2nd Row 2",
                            "playerPositionId": 500012,
                            "playerStats": {
                                "allRunMetres": 128,
                                "allRuns": 14,
                                "decoys": 3,
                                "fantasyPointsTotal": 50,
                                "hitUps": 13,
                                "ineffectiveTackles": 5,
                                "mins": 80,
                                "penalties": 1,
                                "supports": 8,
                                "tackles": 40,
                                "hitupRunMeters": 121,
                                "evasionRuns": 1,
                                "evasionRunMetres": 7,
                                "ptbFast": 38.46,
                                "ptbNeutral": 61.54,
                                "ptbAll": 13
                            },
                            "playerTookTheField": true,
                            "shirtNum": 12
                        },
                        {
                            "playerFirstName": "Dale",
                            "playerId": 500222,
                            "playerLastName": "Finucane",
                            "playerName": "Dale Finucane",
                            "playerPosition": "Lock",
                            "playerPositionId": 500013,
                            "playerStats": {
                                "allRunMetres": 136,
                                "allRuns": 12,
                                "decoys": 9,
                                "errors": 3,
                                "fantasyPointsTotal": 51,
                                "hitUps": 11,
                                "kickMetres": 9,
                                "kickReturnMetres": 19,
                                "kickReturns": 1,
                                "kicks": 1,
                                "mins": 57,
                                "missedTackles": 1,
                                "offloads": 1,
                                "oneOnOneTackles": 1,
                                "penalties": 1,
                                "points": 4,
                                "supports": 3,
                                "tackleBreaks": 1,
                                "tackles": 35,
                                "tries": 1,
                                "hitupRunMeters": 117,
                                "ptbNeutral": 100,
                                "ptbAll": 8
                            },
                            "playerTookTheField": true,
                            "shirtNum": 13
                        },
                        {
                            "playerFirstName": "Ryan",
                            "playerId": 500595,
                            "playerLastName": "Hinchcliffe",
                            "playerName": "Ryan Hinchcliffe",
                            "playerPosition": "Interchange",
                            "playerPositionId": 500014,
                            "playerStats": {
                                "allRunMetres": 24,
                                "allRuns": 4,
                                "decoys": 6,
                                "fantasyPointsTotal": 23,
                                "hitUps": 4,
                                "ineffectiveTackles": 1,
                                "mins": 31,
                                "missedTackles": 2,
                                "supports": 9,
                                "tackles": 25,
                                "hitupRunMeters": 24,
                                "ptbFast": 50,
                                "ptbNeutral": 50,
                                "ptbAll": 4
                            },
                            "playerTookTheField": true,
                            "shirtNum": 14
                        },
                        {
                            "playerFirstName": "Kenneath",
                            "playerId": 500585,
                            "playerLastName": "Bromwich",
                            "playerName": "Kenneath Bromwich",
                            "playerPosition": "Interchange",
                            "playerPositionId": 500014,
                            "playerStats": {
                                "allRunMetres": 51,
                                "allRuns": 5,
                                "decoys": 1,
                                "fantasyPointsTotal": 31,
                                "hitUps": 4,
                                "kickReturnMetres": 10,
                                "kickReturns": 1,
                                "kicksDefused": 1,
                                "mins": 31,
                                "oneOnOneTackles": 2,
                                "supports": 4,
                                "tackles": 25,
                                "hitupRunMeters": 41,
                                "ptbFast": 16.67,
                                "ptbNeutral": 66.67,
                                "ptbSlow": 16.67,
                                "ptbAll": 6
                            },
                            "playerTookTheField": true,
                            "shirtNum": 15
                        },
                        {
                            "playerFirstName": "Felise",
                            "playerId": 500598,
                            "playerLastName": "Kaufusi",
                            "playerName": "Felise Kaufusi",
                            "playerPosition": "Interchange",
                            "playerPositionId": 500014,
                            "playerStats": {
                                "allRunMetres": 17,
                                "allRuns": 2,
                                "fantasyPointsTotal": 6,
                                "hitUps": 2,
                                "mins": 9,
                                "missedTackles": 1,
                                "offloads": 1,
                                "supports": 1,
                                "tackles": 5,
                                "hitupRunMeters": 17,
                                "ptbFast": 100,
                                "ptbAll": 1
                            },
                            "playerTookTheField": true,
                            "shirtNum": 16
                        },
                        {
                            "playerFirstName": "Christian",
                            "playerId": 500786,
                            "playerLastName": "Welch Nichol",
                            "playerName": "Christian Welch Nichol",
                            "playerPosition": "Interchange",
                            "playerPositionId": 500014,
                            "playerStats": {
                                "allRunMetres": 36,
                                "allRuns": 4,
                                "fantasyPointsTotal": 14,
                                "hitUps": 4,
                                "ineffectiveTackles": 2,
                                "mins": 16,
                                "missedTackles": 2,
                                "supports": 3,
                                "tackles": 15,
                                "hitupRunMeters": 36,
                                "ptbNeutral": 100,
                                "ptbAll": 4
                            },
                            "playerTookTheField": true,
                            "shirtNum": 17
                        }
                    ]
                },
                "teamName": "Melbourne Storm",
                "teamNickName": "Storm",
                "teamStats": {
                    "allRunMetres": 1670,
                    "allRuns": 170,
                    "bombKicksDefused": 2,
                    "chargeDowns": 1,
                    "completeSets": 35,
                    "completionPercentage": 83,
                    "conversions": 5,
                    "conversionsAttempts": 5,
                    "decoys": 33,
                    "dummyHalfRuns": 17,
                    "errors": 7,
                    "goalConversionRate": 100,
                    "allGoals": 5,
                    "allGoalsAttempted": 5,
                    "hitUps": 71,
                    "incompleteSets": 7,
                    "ineffectiveTackles": 32,
                    "kickMetres": 700,
                    "kickReturnMetres": 200,
                    "kickReturns": 19,
                    "kicks": 25,
                    "kicksDefused": 12,
                    "kicksNotDefused": 2,
                    "lineDropouts": 2,
                    "linebreakAssists": 2,
                    "linebreaks": 2,
                    "missedTackles": 21,
                    "offloads": 5,
                    "oneOnOneTackles": 17,
                    "penalties": 5,
                    "points": 30,
                    "pointsConceded": 2,
                    "possession": 43,
                    "scrumWins": 3,
                    "supports": 118,
                    "tackleBreaks": 21,
                    "tackles": 399,
                    "sets": 42,
                    "tries": 5,
                    "tryAssists": 3,
                    "trySaves": 1,
                    "hitupRunMeters": 676,
                    "evasionRuns": 63,
                    "evasionRunMetres": 626,
                    "dummyHalfRunMetres": 168,
                    "ptbFast": 20,
                    "ptbNeutral": 72,
                    "ptbSlow": 7,
                    "ptbTotal": 147
                }
            }
        ]
    }
}