{
    "vod": [
        {
            "id": "xlY3ZsYjE60_EZmZL_7wOFm1769PtL3a",
            "contentId": 917953,
            "title": "Rd 15: Sharks v Wests Tigers (Hls)",
            "description": "Highlights of the Round 15 clash between the Sharks & Wests Tigers",
            "publishDate": "2017-06-17T21:33:00+10:00",
            "publisher": "NRL Chief",
            "thumbnailUrl": "http://bpvideos.telstra.insnw.net/web/images/20170617213421a_89x50.jpg",
            "largeThumbnailUrl": "http://bpvideos.telstra.insnw.net/web/images/20170617213421a_326x184.jpg",
            "programType": "Highlights",
            "programCategory": "Match",
            "priority": null,
            "lastUpdateDate": "2017-06-17T21:39:51+10:00",
            "isPremium": false,
            "club": [
                500028,
                500023
            ]
        },
        {
            "id": "40b3ZsYjE6eLGEnm2jxSeiOLtw9TvpQM",
            "contentId": 917999,
            "title": "Rd 15 Press Conference: Sharks",
            "description": "Sharks coach Shane Flanagan answers the media's questions following their Round 15 clash",
            "publishDate": "2017-06-17T22:08:00+10:00",
            "publisher": "NRL Chief",
            "thumbnailUrl": "http://bpvideos.telstra.insnw.net/web/images/20170617220216a_89x50.jpg",
            "largeThumbnailUrl": "http://bpvideos.telstra.insnw.net/web/images/20170617220216a_326x184.jpg",
            "programType": "Press Conference",
            "programCategory": null,
            "priority": null,
            "lastUpdateDate": "2017-06-17T22:12:58+10:00",
            "isPremium": false,
            "club": [
                500028,
                500023
            ]
        },
        {
            "id": "hvbXZsYjE61yiD78jpwyIHzIUaosE8V-",
            "contentId": 918001,
            "title": "Rd 15 Press Conference: Wests Tigers",
            "description": "Wests Tigers coach Ivan Cleary answers the media's questions following their Round 15 clash",
            "publishDate": "2017-06-17T22:04:00+10:00",
            "publisher": "NRL Chief",
            "thumbnailUrl": "http://bpvideos.telstra.insnw.net/web/images/20170617215435a_89x50.jpg",
            "largeThumbnailUrl": "http://bpvideos.telstra.insnw.net/web/images/20170617215435a_326x184.jpg",
            "programType": "Press Conference",
            "programCategory": null,
            "priority": null,
            "lastUpdateDate": "2017-06-17T22:09:58+10:00",
            "isPremium": false,
            "club": [
                500028,
                500023
            ]
        },
        {
            "id": "BnOHZsYjE62PbK8BcpMje2MwUN_LHC5i",
            "contentId": 919107,
            "title": "Rd 15: TRY Jayson Bukuya (78th min)",
            "description": "Jayson Bukuya gives the Sharks the lead",
            "publishDate": "2017-06-17T21:21:45+10:00",
            "publisher": "NRL Chief",
            "thumbnailUrl": "http://bpvideos.telstra.insnw.net/web/images/20170617212041a_89x50.jpg",
            "largeThumbnailUrl": "http://bpvideos.telstra.insnw.net/web/images/20170617212041a_326x184.jpg",
            "programType": "Instant Replay",
            "programCategory": "Score",
            "priority": null,
            "lastUpdateDate": "2017-06-17T21:25:48+10:00",
            "isPremium": true,
            "club": [
                500028,
                500023
            ]
        },
        {
            "id": "U1N3ZsYjE6XTlBR4RO2YKr92sWmWceWb",
            "contentId": 919104,
            "title": "Rd 15: TRY Edrick Lee (74th min)",
            "description": "Edrick Lee puts the Sharks within striking distance headed into the final minutes",
            "publishDate": "2017-06-17T21:16:49+10:00",
            "publisher": "NRL Chief",
            "thumbnailUrl": "http://bpvideos.telstra.insnw.net/web/images/20170617211604a_89x50.jpg",
            "largeThumbnailUrl": "http://bpvideos.telstra.insnw.net/web/images/20170617211604a_326x184.jpg",
            "programType": "Instant Replay",
            "programCategory": "Score",
            "priority": null,
            "lastUpdateDate": "2017-06-17T21:20:46+10:00",
            "isPremium": true,
            "club": [
                500028,
                500023
            ]
        },
        {
            "id": "UzN3ZsYjE6fCQXiEMSCQw03Kv9Xccehz",
            "contentId": 919105,
            "title": "Rd 15: GOAL Chad Townsend (75th min)",
            "description": "Chad Townsend reduces the deficit to two",
            "publishDate": "2017-06-17T21:16:07+10:00",
            "publisher": "NRL Chief",
            "thumbnailUrl": "http://bpvideos.telstra.insnw.net/web/images/20170617211656a_89x50.jpg",
            "largeThumbnailUrl": "http://bpvideos.telstra.insnw.net/web/images/20170617211656a_326x184.jpg",
            "programType": "Instant Replay",
            "programCategory": "Score",
            "priority": null,
            "lastUpdateDate": "2017-06-17T21:20:46+10:00",
            "isPremium": true,
            "club": [
                500028,
                500023
            ]
        },
        {
            "id": "ZkNXZsYjE63GfRjX2qkH6D5ZaZUsrnq7",
            "contentId": 919097,
            "title": "Rd 15: GOAL Tuimoala Lolohea (71st min)",
            "description": "Tuimoala Lolohea converts a long range kick",
            "publishDate": "2017-06-17T21:11:33+10:00",
            "publisher": "NRL Chief",
            "thumbnailUrl": "http://bpvideos.telstra.insnw.net/web/images/20170617211155a_89x50.jpg",
            "largeThumbnailUrl": "http://bpvideos.telstra.insnw.net/web/images/20170617211155a_326x184.jpg",
            "programType": "Instant Replay",
            "programCategory": "Score",
            "priority": null,
            "lastUpdateDate": "2017-06-17T21:15:45+10:00",
            "isPremium": true,
            "club": [
                500028,
                500023
            ]
        },
        {
            "id": "EzNXZsYjE6pozDvyA1aT8K465-e1NEtU",
            "contentId": 919100,
            "title": "Rd 15: TRY Malakai Watene-Zelezniak (69th min)",
            "description": "Watene-Zelezniak scores a Tigers try in the corner",
            "publishDate": "2017-06-17T21:10:31+10:00",
            "publisher": "NRL Chief",
            "thumbnailUrl": "http://bpvideos.telstra.insnw.net/web/images/20170617211003a_89x50.jpg",
            "largeThumbnailUrl": "http://bpvideos.telstra.insnw.net/web/images/20170617211003a_326x184.jpg",
            "programType": "Instant Replay",
            "programCategory": "Score",
            "priority": null,
            "lastUpdateDate": "2017-06-17T21:14:45+10:00",
            "isPremium": true,
            "club": [
                500028,
                500023
            ]
        },
        {
            "id": "5tMnZsYjE6XrNm9lNvSlTqKUsgRAwh30",
            "contentId": 919091,
            "title": "Rd 15: TRY Kurt Capewell (62nd min)",
            "description": "Kurt Capewell scores his second try of the night",
            "publishDate": "2017-06-17T21:02:36+10:00",
            "publisher": "NRL Chief",
            "thumbnailUrl": "http://bpvideos.telstra.insnw.net/web/images/20170617210211a_89x50.jpg",
            "largeThumbnailUrl": "http://bpvideos.telstra.insnw.net/web/images/20170617210211a_326x184.jpg",
            "programType": "Instant Replay",
            "programCategory": "Score",
            "priority": null,
            "lastUpdateDate": "2017-06-17T21:05:43+10:00",
            "isPremium": true,
            "club": [
                500028,
                500023
            ]
        },
        {
            "id": "FieXVsYjE6frZD__BXnBhfuJhaE-7cLk",
            "contentId": 919078,
            "title": "Rd 15: GOAL Chad Townsend (53rd min)",
            "description": "Townsend converts his own try",
            "publishDate": "2017-06-17T20:49:43+10:00",
            "publisher": "NRL Chief",
            "thumbnailUrl": "http://bpvideos.telstra.insnw.net/web/images/20170617204841a_89x50.jpg",
            "largeThumbnailUrl": "http://bpvideos.telstra.insnw.net/web/images/20170617204841a_326x184.jpg",
            "programType": "Instant Replay",
            "programCategory": "Score",
            "priority": null,
            "lastUpdateDate": "2017-06-17T20:53:40+10:00",
            "isPremium": true,
            "club": [
                500028,
                500023
            ]
        },
        {
            "id": "1zeHVsYjE6V7ZZqGPCPMMLWP1bNF54EX",
            "contentId": 919087,
            "title": "Rd 15: TRY Chad Townsend (52nd min)",
            "description": "Chad Townsend rolls off a defender to put the Sharks back in the game",
            "publishDate": "2017-06-17T20:47:17+10:00",
            "publisher": "NRL Chief",
            "thumbnailUrl": "http://bpvideos.telstra.insnw.net/web/images/20170617204622a_89x50.jpg",
            "largeThumbnailUrl": "http://bpvideos.telstra.insnw.net/web/images/20170617204622a_326x184.jpg",
            "programType": "Instant Replay",
            "programCategory": "Score",
            "priority": null,
            "lastUpdateDate": "2017-06-17T20:51:40+10:00",
            "isPremium": true,
            "club": [
                500028,
                500023
            ]
        },
        {
            "id": "xneHVsYjE6mwroV5IE0rGiYa41AmDLoS",
            "contentId": 919077,
            "title": "Rd 15: TRY Jacob Liddle (47th min)",
            "description": "Jacob Liddle goes over for the Tigers' third try",
            "publishDate": "2017-06-17T20:42:40+10:00",
            "publisher": "NRL Chief",
            "thumbnailUrl": "http://bpvideos.telstra.insnw.net/web/images/20170617204138a_89x50.jpg",
            "largeThumbnailUrl": "http://bpvideos.telstra.insnw.net/web/images/20170617204138a_326x184.jpg",
            "programType": "Instant Replay",
            "programCategory": "Score",
            "priority": null,
            "lastUpdateDate": "2017-06-17T20:50:39+10:00",
            "isPremium": true,
            "club": [
                500028,
                500023
            ]
        },
        {
            "id": "pxcHVsYjE6UicOSnPA8A05NMIraGbTus",
            "contentId": 919070,
            "title": "Rd 15: GOAL Tuimoala Lolohea (35th min)",
            "description": "Tuimoala Lolohea kicks his second goal of the night",
            "publishDate": "2017-06-17T20:18:43+10:00",
            "publisher": "NRL Chief",
            "thumbnailUrl": "http://bpvideos.telstra.insnw.net/web/images/20170617201819a_89x50.jpg",
            "largeThumbnailUrl": "http://bpvideos.telstra.insnw.net/web/images/20170617201819a_326x184.jpg",
            "programType": "Instant Replay",
            "programCategory": "Score",
            "priority": null,
            "lastUpdateDate": "2017-06-17T20:22:33+10:00",
            "isPremium": true,
            "club": [
                500028,
                500023
            ]
        },
        {
            "id": "VrcHVsYjE6fm6NUrY9xZl-1yN8WEREkk",
            "contentId": 919069,
            "title": "Rd 15: TRY Esan Marsters (34th min)",
            "description": "Esan Marsters scores his first try in the NRL",
            "publishDate": "2017-06-17T20:17:20+10:00",
            "publisher": "NRL Chief",
            "thumbnailUrl": "http://bpvideos.telstra.insnw.net/web/images/20170617201747a_89x50.jpg",
            "largeThumbnailUrl": "http://bpvideos.telstra.insnw.net/web/images/20170617201747a_326x184.jpg",
            "programType": "Instant Replay",
            "programCategory": "Score",
            "priority": null,
            "lastUpdateDate": "2017-06-17T20:21:32+10:00",
            "isPremium": true,
            "club": [
                500028,
                500023
            ]
        },
        {
            "id": "FrbnVsYjE6NpNsMVoTxzEopKTcuHOYX8",
            "contentId": 919058,
            "title": "Rd 15: GOAL Tuimoala Lolohea (28th min)",
            "description": "Tuimoala Lolohea converts his first of the evening",
            "publishDate": "2017-06-17T20:10:32+10:00",
            "publisher": "NRL Chief",
            "thumbnailUrl": "http://bpvideos.telstra.insnw.net/web/images/20170617200946a_89x50.jpg",
            "largeThumbnailUrl": "http://bpvideos.telstra.insnw.net/web/images/20170617200946a_326x184.jpg",
            "programType": "Instant Replay",
            "programCategory": "Score",
            "priority": null,
            "lastUpdateDate": "2017-06-17T20:14:31+10:00",
            "isPremium": true,
            "club": [
                500028,
                500023
            ]
        },
        {
            "id": "5jbnVsYjE6p8CwG-KIPvbGwamY7Pkl_w",
            "contentId": 919064,
            "title": "Rd 15: TRY Elijah Taylor (27th min)",
            "description": "Elijah Taylor puts it down right under the posts",
            "publishDate": "2017-06-17T20:09:53+10:00",
            "publisher": "NRL Chief",
            "thumbnailUrl": "http://bpvideos.telstra.insnw.net/web/images/20170617200910a_89x50.jpg",
            "largeThumbnailUrl": "http://bpvideos.telstra.insnw.net/web/images/20170617200910a_326x184.jpg",
            "programType": "Instant Replay",
            "programCategory": "Score",
            "priority": null,
            "lastUpdateDate": "2017-06-17T20:13:30+10:00",
            "isPremium": true,
            "club": [
                500028,
                500023
            ]
        },
        {
            "id": "4xa3VsYjE68YFEbNdJxnpjegPOj_2-UW",
            "contentId": 919057,
            "title": "Rd 15: TRY Kurt Capewell (19th min)",
            "description": "Kurt Capewell opens scoring for the Sharks",
            "publishDate": "2017-06-17T19:56:31+10:00",
            "publisher": "NRL Chief",
            "thumbnailUrl": "http://bpvideos.telstra.insnw.net/web/images/20170617195620a_89x50.jpg",
            "largeThumbnailUrl": "http://bpvideos.telstra.insnw.net/web/images/20170617195620a_326x184.jpg",
            "programType": "Instant Replay",
            "programCategory": "Score",
            "priority": null,
            "lastUpdateDate": "2017-06-17T20:00:27+10:00",
            "isPremium": true,
            "club": [
                500028,
                500023
            ]
        }
    ],
    "scores": [
        {
            "gameState": "First Half",
            "gameStateId": 3,
            "gameTime": "0:18:56",
            "gameSeconds": 1136,
            "GameMinutes": "18:56",
            "playerId": 500992,
            "playerName": "Kurt Capewell",
            "scoreMethod": "Try",
            "statEvent": "Try",
            "statId": 38,
            "statValue": 4,
            "vidRef": 31679,
            "homeScore": 4,
            "commentary": "Try by Kurt Capewell",
            "tackleNum": 5,
            "teamId": 500028,
            "teamName": "Cronulla-Sutherland Sharks",
            "homeTeamAbbrv": "CRO",
            "awayTeamAbbrv": "WST"
        },
        {
            "gameState": "Second Half",
            "gameStateId": 5,
            "gameTime": "0:51:11",
            "gameSeconds": 3071,
            "GameMinutes": "51:11",
            "playerId": 501183,
            "playerName": "Chad Townsend",
            "scoreMethod": "Try",
            "statEvent": "Try",
            "statId": 38,
            "statValue": 4,
            "vidRef": 86330,
            "homeScore": 8,
            "awayScore": 16,
            "commentary": "Try by Chad Townsend",
            "tackleNum": 4,
            "teamId": 500028,
            "teamName": "Cronulla-Sutherland Sharks",
            "homeTeamAbbrv": "CRO",
            "awayTeamAbbrv": "WST"
        },
        {
            "gameState": "Second Half",
            "gameStateId": 5,
            "gameTime": "0:52:40",
            "gameSeconds": 3160,
            "GameMinutes": "52:40",
            "playerId": 501183,
            "playerName": "Chad Townsend",
            "scoreMethod": "Conversion",
            "statEvent": "Conversion-Made",
            "statId": 1,
            "statValue": 2,
            "vidRef": 89190,
            "homeScore": 10,
            "awayScore": 16,
            "commentary": "Conversion-Made by Chad Townsend",
            "tackleNum": -1,
            "teamId": 500028,
            "teamName": "Cronulla-Sutherland Sharks",
            "homeTeamAbbrv": "CRO",
            "awayTeamAbbrv": "WST"
        },
        {
            "gameState": "Second Half",
            "gameStateId": 5,
            "gameTime": "1:01:01",
            "gameSeconds": 3661,
            "GameMinutes": "61:01",
            "playerId": 500992,
            "playerName": "Kurt Capewell",
            "scoreMethod": "Try",
            "statEvent": "Try",
            "statId": 38,
            "statValue": 4,
            "vidRef": 105013,
            "homeScore": 14,
            "awayScore": 16,
            "commentary": "Try by Kurt Capewell",
            "tackleNum": 3,
            "teamId": 500028,
            "teamName": "Cronulla-Sutherland Sharks",
            "homeTeamAbbrv": "CRO",
            "awayTeamAbbrv": "WST"
        },
        {
            "gameState": "Second Half",
            "gameStateId": 5,
            "gameTime": "1:13:36",
            "gameSeconds": 4416,
            "GameMinutes": "73:36",
            "playerId": 500322,
            "playerName": "Edrick Lee",
            "scoreMethod": "Try",
            "statEvent": "Try",
            "statId": 38,
            "statValue": 4,
            "vidRef": 128594,
            "homeScore": 18,
            "awayScore": 22,
            "commentary": "Try by Edrick Lee",
            "tackleNum": 4,
            "teamId": 500028,
            "teamName": "Cronulla-Sutherland Sharks",
            "homeTeamAbbrv": "CRO",
            "awayTeamAbbrv": "WST"
        },
        {
            "gameState": "Second Half",
            "gameStateId": 5,
            "gameTime": "1:14:21",
            "gameSeconds": 4461,
            "GameMinutes": "74:21",
            "playerId": 501183,
            "playerName": "Chad Townsend",
            "scoreMethod": "Conversion",
            "statEvent": "Conversion-Made",
            "statId": 1,
            "statValue": 2,
            "vidRef": 129700,
            "homeScore": 20,
            "awayScore": 22,
            "commentary": "Conversion-Made by Chad Townsend",
            "tackleNum": -1,
            "teamId": 500028,
            "teamName": "Cronulla-Sutherland Sharks",
            "homeTeamAbbrv": "CRO",
            "awayTeamAbbrv": "WST"
        },
        {
            "gameState": "Second Half",
            "gameStateId": 5,
            "gameTime": "1:17:56",
            "gameSeconds": 4676,
            "GameMinutes": "77:56",
            "playerId": 500977,
            "playerName": "Jayson Bukuya",
            "scoreMethod": "Try",
            "statEvent": "Try",
            "statId": 38,
            "statValue": 4,
            "vidRef": 136499,
            "homeScore": 24,
            "awayScore": 22,
            "commentary": "Try by Jayson Bukuya",
            "tackleNum": 6,
            "teamId": 500028,
            "teamName": "Cronulla-Sutherland Sharks",
            "homeTeamAbbrv": "CRO",
            "awayTeamAbbrv": "WST"
        },
        {
            "gameState": "First Half",
            "gameStateId": 3,
            "gameTime": "0:26:15",
            "gameSeconds": 1575,
            "GameMinutes": "26:15",
            "playerId": 500970,
            "playerName": "Elijah Taylor",
            "scoreMethod": "Try",
            "statEvent": "Try",
            "statId": 38,
            "statValue": 4,
            "vidRef": 43560,
            "homeScore": 4,
            "awayScore": 4,
            "commentary": "Try by Elijah Taylor",
            "tackleNum": 4,
            "teamId": 500023,
            "teamName": "Wests Tigers",
            "homeTeamAbbrv": "CRO",
            "awayTeamAbbrv": "WST"
        },
        {
            "gameState": "First Half",
            "gameStateId": 3,
            "gameTime": "0:27:08",
            "gameSeconds": 1628,
            "GameMinutes": "27:08",
            "playerId": 500927,
            "playerName": "Tuimoala Lolohea",
            "scoreMethod": "Conversion",
            "statEvent": "Conversion-Made",
            "statId": 1,
            "statValue": 2,
            "vidRef": 46305,
            "homeScore": 4,
            "awayScore": 6,
            "commentary": "Conversion-Made by Tuimoala Lolohea",
            "tackleNum": -1,
            "teamId": 500023,
            "teamName": "Wests Tigers",
            "homeTeamAbbrv": "CRO",
            "awayTeamAbbrv": "WST"
        },
        {
            "gameState": "First Half",
            "gameStateId": 3,
            "gameTime": "0:33:20",
            "gameSeconds": 2000,
            "GameMinutes": "33:20",
            "playerId": 503617,
            "playerName": "Esan Marsters",
            "scoreMethod": "Try",
            "statEvent": "Try",
            "statId": 38,
            "statValue": 4,
            "vidRef": 56600,
            "homeScore": 4,
            "awayScore": 10,
            "commentary": "Try by Esan Marsters",
            "tackleNum": 4,
            "teamId": 500023,
            "teamName": "Wests Tigers",
            "homeTeamAbbrv": "CRO",
            "awayTeamAbbrv": "WST"
        },
        {
            "gameState": "First Half",
            "gameStateId": 3,
            "gameTime": "0:34:26",
            "gameSeconds": 2066,
            "GameMinutes": "34:26",
            "playerId": 500927,
            "playerName": "Tuimoala Lolohea",
            "scoreMethod": "Conversion",
            "statEvent": "Conversion-Made",
            "statId": 1,
            "statValue": 2,
            "vidRef": 59217,
            "homeScore": 4,
            "awayScore": 12,
            "commentary": "Conversion-Made by Tuimoala Lolohea",
            "tackleNum": -1,
            "teamId": 500023,
            "teamName": "Wests Tigers",
            "homeTeamAbbrv": "CRO",
            "awayTeamAbbrv": "WST"
        },
        {
            "gameState": "Second Half",
            "gameStateId": 5,
            "gameTime": "0:46:28",
            "gameSeconds": 2788,
            "GameMinutes": "46:28",
            "playerId": 503449,
            "playerName": "Jacob Liddle",
            "scoreMethod": "Try",
            "statEvent": "Try",
            "statId": 38,
            "statValue": 4,
            "vidRef": 78898,
            "homeScore": 4,
            "awayScore": 16,
            "commentary": "Try by Jacob Liddle",
            "tackleNum": 6,
            "teamId": 500023,
            "teamName": "Wests Tigers",
            "homeTeamAbbrv": "CRO",
            "awayTeamAbbrv": "WST"
        },
        {
            "gameState": "Second Half",
            "gameStateId": 5,
            "gameTime": "1:08:53",
            "gameSeconds": 4133,
            "GameMinutes": "68:53",
            "playerId": 504755,
            "playerName": "Malakai Watene Zelezniak",
            "scoreMethod": "Try",
            "statEvent": "Try",
            "statId": 38,
            "statValue": 4,
            "vidRef": 119039,
            "homeScore": 14,
            "awayScore": 20,
            "commentary": "Try by Malakai Watene Zelezniak",
            "tackleNum": 5,
            "teamId": 500023,
            "teamName": "Wests Tigers",
            "homeTeamAbbrv": "CRO",
            "awayTeamAbbrv": "WST"
        },
        {
            "gameState": "Second Half",
            "gameStateId": 5,
            "gameTime": "1:10:18",
            "gameSeconds": 4218,
            "GameMinutes": "70:18",
            "playerId": 500927,
            "playerName": "Tuimoala Lolohea",
            "scoreMethod": "Conversion",
            "statEvent": "Conversion-Made",
            "statId": 1,
            "statValue": 2,
            "vidRef": 121916,
            "homeScore": 14,
            "awayScore": 22,
            "commentary": "Conversion-Made by Tuimoala Lolohea",
            "tackleNum": -1,
            "teamId": 500023,
            "teamName": "Wests Tigers",
            "homeTeamAbbrv": "CRO",
            "awayTeamAbbrv": "WST"
        }
    ],
    "twitter": [
        {
            "id": "876038316725903362",
            "gameSeconds": 4680
        },
        {
            "id": "876038131203440640",
            "gameSeconds": 4680
        },
        {
            "id": "876034633061646336",
            "gameSeconds": 4200
        },
        {
            "id": "876034348910116865",
            "gameSeconds": 4200
        },
        {
            "id": "876031950263205888",
            "gameSeconds": 3720
        },
        {
            "id": "876031677839032324",
            "gameSeconds": 3720
        },
        {
            "id": "876020143674892289",
            "gameSeconds": 2040
        },
        {
            "id": "876019909351817216",
            "gameSeconds": 2040
        },
        {
            "id": "876018021864583168",
            "gameSeconds": 1620
        },
        {
            "id": "876017707803525120",
            "gameSeconds": 1620
        }
    ]
}