{
    "competitionId": 111,
    "competitionName": "NRL Telstra Premiership",
    "gameId": 20151110520,
    "gameInfo": {
        "assistantReferee1Id": 500038,
        "numberOfPeriods": 2,
        "assistantReferee1Name": "Michael Wise",
        "assistantReferee2Id": 500114,
        "assistantReferee2Name": "Clayton Sharpe",
        "crowd": 15432,
        "gameDate": "2015-04-03",
        "gameHashTag": "#NRLTitansBroncos",
        "gameNumber": 2,
        "gameSeconds": 4800,
        "gameTime": "1:20:00",
        "groundConditionId": 2,
        "groundConditionName": "Good",
        "referee1Id": 500039,
        "referee1Name": "Ashley Klein",
        "referee2Id": 500009,
        "referee2Name": "Alan Shortall",
        "startTime": "2015-04-03T19:35:00",
        "startTimeUTC": "2015-04-03T09:35:00Z",
        "venueId": 500046,
        "venueName": "Cbus Super Stadium",
        "videoReferee1Id": 500203,
        "videoReferee1Name": "Ben Galea",
        "videoReferee2Id": 500030,
        "videoReferee2Name": "Steve Clark",
        "weatherId": 2,
        "weatherName": "Fine"
    },
    "gameState": "Final",
    "gameStateId": 8,
    "roundId": 5,
    "seasonId": 2015,
    "teams": {
        "teamsMatch": [
            {
                "isHomeTeam": true,
                "score": {
                    "conversions": 2,
                    "points": 16,
                    "tries": 3
                },
                "team1stHalfScore": 6,
                "team2ndHalfScore": 10,
                "teamAbbr": "GLD",
                "teamFinalScore": 16,
                "teamFullTimeScore": 16,
                "teamHalfTimeScore": 6,
                "teamId": 500004,
                "teamLineup": {
                    "injuriesAndSuspensions": {
                        "injury": [],
                        "suspension": []
                    },
                    "insAndOuts": {
                        "inOut": [
                            {
                                "inOut": "Out",
                                "playerFirstName": "Beau",
                                "playerId": "500071",
                                "playerLastName": "Falloon",
                                "playerName": "Beau Falloon"
                            },
                            {
                                "inOut": "In",
                                "playerFirstName": "Kierran",
                                "playerId": "500514",
                                "playerLastName": "Moseley",
                                "playerName": "Kierran Moseley"
                            },
                            {
                                "inOut": "In",
                                "playerFirstName": "Lachlan",
                                "playerId": "500219",
                                "playerLastName": "Burr",
                                "playerName": "Lachlan Burr"
                            },
                            {
                                "inOut": "Out",
                                "playerFirstName": "Matt",
                                "playerId": "500079",
                                "playerLastName": "Srama",
                                "playerName": "Matt Srama"
                            }
                        ]
                    },
                    "teamPlayer": [
                        {
                            "playerFirstName": "Josh",
                            "playerId": 500256,
                            "playerLastName": "Hoffman",
                            "playerName": "Josh Hoffman",
                            "playerPosition": "Fullback",
                            "playerPositionId": 500001,
                            "playerStats": {
                                "allRunMetres": 164,
                                "allRuns": 15,
                                "bombKicksDefused": 1,
                                "decoys": 4,
                                "errors": 1,
                                "fantasyPointsTotal": 29,
                                "kickReturnMetres": 52,
                                "kickReturns": 3,
                                "kicksDefused": 1,
                                "mins": 80,
                                "missedTackles": 1,
                                "oneOnOneTackles": 1,
                                "supports": 11,
                                "tackleBreaks": 2,
                                "tackles": 5,
                                "tryAssists": 1,
                                "tryCause": 1,
                                "evasionRuns": 12,
                                "evasionRunMetres": 112,
                                "ptbFast": 6.67,
                                "ptbNeutral": 93.33,
                                "ptbAll": 15
                            },
                            "playerTookTheField": true,
                            "shirtNum": 1
                        },
                        {
                            "playerFirstName": "Anthony",
                            "playerId": 500067,
                            "playerLastName": "Don",
                            "playerName": "Anthony Don",
                            "playerPosition": "Winger 1",
                            "playerPositionId": 500002,
                            "playerStats": {
                                "allRunMetres": 71,
                                "allRuns": 10,
                                "bombKicksDefused": 1,
                                "fantasyPointsTotal": 22,
                                "kickReturnMetres": 8,
                                "kickReturns": 2,
                                "kicksDefused": 3,
                                "mins": 80,
                                "penalties": 1,
                                "supports": 7,
                                "tackleBreaks": 1,
                                "tackles": 3,
                                "tries": 1,
                                "evasionRuns": 8,
                                "evasionRunMetres": 63,
                                "ptbFast": 44.44,
                                "ptbNeutral": 55.56,
                                "ptbAll": 9
                            },
                            "playerTookTheField": true,
                            "shirtNum": 2
                        },
                        {
                            "playerFirstName": "James",
                            "playerId": 500517,
                            "playerLastName": "Roberts",
                            "playerName": "James Roberts",
                            "playerPosition": "Centre 1",
                            "playerPositionId": 500003,
                            "playerStats": {
                                "allRunMetres": 158,
                                "allRuns": 16,
                                "dummyHalfRuns": 3,
                                "errors": 1,
                                "fantasyPointsTotal": 44,
                                "ineffectiveTackles": 1,
                                "kicks": 1,
                                "linebreakAssists": 1,
                                "mins": 80,
                                "offloads": 1,
                                "oneOnOneTackles": 1,
                                "supports": 9,
                                "tackleBreaks": 4,
                                "tackles": 10,
                                "tryAssists": 1,
                                "tryCause": 1,
                                "evasionRuns": 13,
                                "evasionRunMetres": 134,
                                "dummyHalfRunMetres": 24,
                                "ptbFast": 50,
                                "ptbNeutral": 50,
                                "ptbAll": 12
                            },
                            "playerTookTheField": true,
                            "shirtNum": 3
                        },
                        {
                            "playerFirstName": "William",
                            "playerId": 500835,
                            "playerLastName": "Zillman",
                            "playerName": "William Zillman",
                            "playerPosition": "Centre 2",
                            "playerPositionId": 500004,
                            "playerStats": {
                                "allRunMetres": 107,
                                "allRuns": 7,
                                "decoys": 3,
                                "dummyHalfRuns": 1,
                                "errors": 2,
                                "fantasyPointsTotal": 9,
                                "ineffectiveTackles": 2,
                                "kickReturnMetres": 13,
                                "kickReturns": 1,
                                "kicksNotDefused": 1,
                                "mins": 80,
                                "missedTackles": 2,
                                "supports": 17,
                                "tackles": 7,
                                "tryCause": 2,
                                "evasionRuns": 5,
                                "evasionRunMetres": 84,
                                "dummyHalfRunMetres": 10,
                                "ptbFast": 28.57,
                                "ptbNeutral": 71.43,
                                "ptbAll": 7
                            },
                            "playerTookTheField": true,
                            "shirtNum": 4
                        },
                        {
                            "playerFirstName": "David",
                            "playerId": 500831,
                            "playerLastName": "Mead",
                            "playerName": "David Mead",
                            "playerPosition": "Winger 2",
                            "playerPositionId": 500005,
                            "playerStats": {
                                "allRunMetres": 132,
                                "allRuns": 16,
                                "bombKicksDefused": 1,
                                "dummyHalfRuns": 3,
                                "fantasyPointsTotal": 47,
                                "hitUps": 1,
                                "ineffectiveTackles": 1,
                                "kickMetres": 8,
                                "kickReturnMetres": 10,
                                "kickReturns": 2,
                                "kicks": 1,
                                "kicksDefused": 1,
                                "linebreaks": 1,
                                "mins": 80,
                                "offloads": 2,
                                "oneOnOneTackles": 2,
                                "supports": 12,
                                "tackleBreaks": 4,
                                "tackles": 5,
                                "tries": 1,
                                "hitupRunMeters": 10,
                                "evasionRuns": 10,
                                "evasionRunMetres": 88,
                                "dummyHalfRunMetres": 24,
                                "ptbFast": 38.46,
                                "ptbNeutral": 61.54,
                                "ptbAll": 13
                            },
                            "playerTookTheField": true,
                            "shirtNum": 5
                        },
                        {
                            "playerFirstName": "Aidan",
                            "playerId": 500068,
                            "playerLastName": "Sezer",
                            "playerName": "Aidan Sezer",
                            "playerPosition": "Five-eighth",
                            "playerPositionId": 500006,
                            "playerStats": {
                                "allRunMetres": 35,
                                "allRuns": 5,
                                "bombKicks": 3,
                                "bombKickMetres": 91,
                                "conversions": 2,
                                "conversionsAttempts": 3,
                                "conversionsMissed": 1,
                                "decoys": 1,
                                "fantasyPointsTotal": 37,
                                "ineffectiveTackles": 1,
                                "kickMetres": 285,
                                "kicks": 11,
                                "mins": 80,
                                "missedTackles": 3,
                                "offloads": 1,
                                "oneOnOneTackles": 1,
                                "supports": 12,
                                "tackleBreaks": 1,
                                "tackles": 17,
                                "evasionRuns": 5,
                                "evasionRunMetres": 35,
                                "ptbFast": 50,
                                "ptbSlow": 50,
                                "ptbAll": 2
                            },
                            "playerTookTheField": true,
                            "shirtNum": 6
                        },
                        {
                            "playerFirstName": "Kane",
                            "playerId": 501357,
                            "playerLastName": "Elgey",
                            "playerName": "Kane Elgey",
                            "playerPosition": "Halfback",
                            "playerPositionId": 500007,
                            "playerStats": {
                                "allRunMetres": 49,
                                "allRuns": 8,
                                "errors": 2,
                                "fantasyPointsTotal": 22,
                                "kickMetres": 149,
                                "kicks": 6,
                                "mins": 80,
                                "missedTackles": 2,
                                "oneOnOneTackles": 1,
                                "penalties": 1,
                                "supports": 27,
                                "tackleBreaks": 2,
                                "tackles": 15,
                                "tryCause": 1,
                                "evasionRuns": 8,
                                "evasionRunMetres": 49,
                                "ptbNeutral": 100,
                                "ptbAll": 3
                            },
                            "playerTookTheField": true,
                            "shirtNum": 7
                        },
                        {
                            "playerFirstName": "Luke",
                            "playerId": 500070,
                            "playerLastName": "Douglas",
                            "playerName": "Luke Douglas",
                            "playerPosition": "Prop 1",
                            "playerPositionId": 500008,
                            "playerStats": {
                                "allRunMetres": 75,
                                "allRuns": 8,
                                "decoys": 3,
                                "fantasyPointsTotal": 18,
                                "hitUps": 7,
                                "kickReturnMetres": 20,
                                "kickReturns": 1,
                                "mins": 30,
                                "missedTackles": 4,
                                "oneOnOneTackles": 1,
                                "supports": 4,
                                "tackles": 19,
                                "hitupRunMeters": 55,
                                "ptbFast": 42.86,
                                "ptbNeutral": 57.14,
                                "ptbAll": 7
                            },
                            "playerTookTheField": true,
                            "shirtNum": 8
                        },
                        {
                            "playerFirstName": "Kierran",
                            "playerId": 500514,
                            "playerLastName": "Moseley",
                            "playerName": "Kierran Moseley",
                            "playerPosition": "Hooker",
                            "playerPositionId": 500009,
                            "playerStats": {
                                "allRunMetres": 82,
                                "allRuns": 9,
                                "chargedDown": 1,
                                "dummyHalfRuns": 6,
                                "errors": 1,
                                "fantasyPointsTotal": 52,
                                "hitUps": 2,
                                "ineffectiveTackles": 1,
                                "kicks": 1,
                                "linebreakAssists": 1,
                                "mins": 71,
                                "offloads": 2,
                                "oneOnOneTackles": 1,
                                "supports": 2,
                                "tackleBreaks": 1,
                                "tackles": 32,
                                "tryAssists": 1,
                                "tryCause": 2,
                                "hitupRunMeters": 17,
                                "evasionRuns": 1,
                                "evasionRunMetres": 16,
                                "dummyHalfRunMetres": 49,
                                "ptbNeutral": 100,
                                "ptbAll": 4
                            },
                            "playerTookTheField": true,
                            "shirtNum": 9
                        },
                        {
                            "playerFirstName": "Nate",
                            "playerId": 500075,
                            "playerLastName": "Myles",
                            "playerName": "Nate Myles",
                            "playerPosition": "Prop 2",
                            "playerPositionId": 500010,
                            "playerStats": {
                                "allRunMetres": 102,
                                "allRuns": 11,
                                "decoys": 7,
                                "errors": 1,
                                "fantasyPointsTotal": 29,
                                "hitUps": 10,
                                "interceptedPass": 1,
                                "kickReturnMetres": 16,
                                "kickReturns": 1,
                                "mins": 40,
                                "penalties": 1,
                                "supports": 5,
                                "tackles": 23,
                                "hitupRunMeters": 86,
                                "ptbFast": 22.22,
                                "ptbNeutral": 77.78,
                                "ptbAll": 9
                            },
                            "playerTookTheField": true,
                            "shirtNum": 10,
                            "isCaptain": true
                        },
                        {
                            "playerFirstName": "Ryan",
                            "playerId": 500072,
                            "playerLastName": "James",
                            "playerName": "Ryan James",
                            "playerPosition": "2nd Row 1",
                            "playerPositionId": 500011,
                            "playerStats": {
                                "allRunMetres": 178,
                                "allRuns": 19,
                                "decoys": 5,
                                "dummyHalfRuns": 1,
                                "errors": 1,
                                "fantasyPointsTotal": 59,
                                "hitUps": 18,
                                "linebreaks": 1,
                                "mins": 80,
                                "missedTackles": 2,
                                "offloads": 1,
                                "oneOnOneTackles": 2,
                                "penalties": 3,
                                "supports": 15,
                                "tackleBreaks": 4,
                                "tackles": 28,
                                "tries": 1,
                                "hitupRunMeters": 157,
                                "dummyHalfRunMetres": 21,
                                "ptbFast": 50,
                                "ptbNeutral": 44.44,
                                "ptbSlow": 5.56,
                                "ptbAll": 18
                            },
                            "playerTookTheField": true,
                            "shirtNum": 11
                        },
                        {
                            "playerFirstName": "Edward",
                            "playerId": 502632,
                            "playerLastName": "Pettybourne",
                            "playerName": "Edward Pettybourne",
                            "playerPosition": "2nd Row 2",
                            "playerPositionId": 500012,
                            "playerStats": {
                                "allRunMetres": 130,
                                "allRuns": 11,
                                "decoys": 6,
                                "errors": 1,
                                "fantasyPointsTotal": 30,
                                "hitUps": 8,
                                "kickReturnMetres": 48,
                                "kickReturns": 3,
                                "mins": 48,
                                "supports": 5,
                                "tackles": 19,
                                "hitupRunMeters": 82,
                                "ptbFast": 11.11,
                                "ptbNeutral": 88.89,
                                "ptbAll": 9
                            },
                            "playerTookTheField": true,
                            "shirtNum": 14
                        },
                        {
                            "playerFirstName": "Greg",
                            "playerId": 500073,
                            "playerLastName": "Bird",
                            "playerName": "Greg Bird",
                            "playerPosition": "Lock",
                            "playerPositionId": 500013,
                            "playerStats": {
                                "allRunMetres": 130,
                                "allRuns": 16,
                                "decoys": 6,
                                "dummyHalfRuns": 1,
                                "fantasyPointsTotal": 38,
                                "hitUps": 14,
                                "kickMetres": 7,
                                "kicks": 1,
                                "mins": 80,
                                "missedTackles": 2,
                                "offloads": 4,
                                "supports": 7,
                                "tackles": 21,
                                "tryCause": 1,
                                "hitupRunMeters": 116,
                                "evasionRuns": 1,
                                "evasionRunMetres": 4,
                                "dummyHalfRunMetres": 10,
                                "ptbFast": 11.11,
                                "ptbNeutral": 77.78,
                                "ptbSlow": 11.11,
                                "ptbAll": 9
                            },
                            "playerTookTheField": true,
                            "shirtNum": 13
                        },
                        {
                            "playerFirstName": "Dave",
                            "playerId": 500077,
                            "playerLastName": "Taylor",
                            "playerName": "Dave Taylor",
                            "playerPosition": "Interchange",
                            "playerPositionId": 500014,
                            "playerStats": {
                                "allRunMetres": 126,
                                "allRuns": 11,
                                "decoys": 3,
                                "fantasyPointsTotal": 37,
                                "hitUps": 8,
                                "kickReturnMetres": 36,
                                "kickReturns": 3,
                                "mins": 35,
                                "missedTackles": 1,
                                "offloads": 1,
                                "penalties": 1,
                                "supports": 3,
                                "tackleBreaks": 3,
                                "tackles": 18,
                                "tryCause": 1,
                                "hitupRunMeters": 90,
                                "ptbFast": 10,
                                "ptbNeutral": 80,
                                "ptbSlow": 10,
                                "ptbAll": 10
                            },
                            "playerTookTheField": true,
                            "shirtNum": 12
                        },
                        {
                            "playerFirstName": "Agnatius",
                            "playerId": 501393,
                            "playerLastName": "Paasi",
                            "playerName": "Agnatius Paasi",
                            "playerPosition": "Interchange",
                            "playerPositionId": 500014,
                            "playerStats": {
                                "allRunMetres": 104,
                                "allRuns": 12,
                                "decoys": 5,
                                "errors": 1,
                                "fantasyPointsTotal": 26,
                                "hitUps": 9,
                                "intercepts": 1,
                                "kickReturnMetres": 16,
                                "kickReturns": 1,
                                "mins": 31,
                                "missedTackles": 1,
                                "offloads": 1,
                                "supports": 6,
                                "tackles": 18,
                                "tryCause": 1,
                                "hitupRunMeters": 74,
                                "evasionRuns": 2,
                                "evasionRunMetres": 14,
                                "ptbFast": 12.5,
                                "ptbNeutral": 87.5,
                                "ptbAll": 8
                            },
                            "playerTookTheField": true,
                            "shirtNum": 15
                        },
                        {
                            "playerFirstName": "Ryan",
                            "playerId": 500364,
                            "playerLastName": "Simpkins",
                            "playerName": "Ryan Simpkins",
                            "playerPosition": "Interchange",
                            "playerPositionId": 500014,
                            "playerStats": {
                                "allRunMetres": 49,
                                "allRuns": 6,
                                "decoys": 6,
                                "errors": 1,
                                "fantasyPointsTotal": 24,
                                "hitUps": 5,
                                "mins": 45,
                                "missedTackles": 1,
                                "oneOnOneTackles": 1,
                                "supports": 3,
                                "tackles": 24,
                                "tryCause": 1,
                                "hitupRunMeters": 41,
                                "evasionRuns": 1,
                                "evasionRunMetres": 8,
                                "ptbFast": 60,
                                "ptbNeutral": 40,
                                "ptbAll": 5
                            },
                            "playerTookTheField": true,
                            "shirtNum": 16
                        },
                        {
                            "playerFirstName": "Lachlan",
                            "playerId": 500219,
                            "playerLastName": "Burr",
                            "playerName": "Lachlan Burr",
                            "playerPosition": "Interchange",
                            "playerPositionId": 500014,
                            "playerStats": {
                                "allRunMetres": 53,
                                "allRuns": 7,
                                "decoys": 2,
                                "errors": 1,
                                "fantasyPointsTotal": 12,
                                "hitUps": 6,
                                "mins": 20,
                                "missedTackles": 1,
                                "offloads": 1,
                                "supports": 7,
                                "tackleBreaks": 1,
                                "tackles": 6,
                                "hitupRunMeters": 51,
                                "evasionRuns": 1,
                                "evasionRunMetres": 2,
                                "ptbFast": 20,
                                "ptbNeutral": 80,
                                "ptbAll": 5
                            },
                            "playerTookTheField": true,
                            "shirtNum": 19
                        }
                    ]
                },
                "teamName": "Gold Coast Titans",
                "teamNickName": "Titans",
                "teamStats": {
                    "allRunMetres": 1746,
                    "allRuns": 187,
                    "bombKicks": 3,
                    "bombKickMetres": 91,
                    "bombKicksDefused": 3,
                    "chargedDown": 1,
                    "completeSets": 29,
                    "completionPercentage": 69,
                    "conversions": 2,
                    "conversionsAttempts": 3,
                    "conversionsMissed": 1,
                    "decoys": 51,
                    "dummyHalfRuns": 15,
                    "errors": 14,
                    "hitUps": 88,
                    "incompleteSets": 13,
                    "ineffectiveTackles": 6,
                    "interceptedPass": 1,
                    "intercepts": 1,
                    "kickMetres": 449,
                    "kickReturnMetres": 219,
                    "kickReturns": 17,
                    "kicks": 21,
                    "kicksDefused": 5,
                    "kicksNotDefused": 1,
                    "linebreakAssists": 2,
                    "linebreaks": 2,
                    "missedTackles": 20,
                    "oneOnOneTackles": 11,
                    "penalties": 7,
                    "points": 16,
                    "pointsConceded": 26,
                    "possession": 62,
                    "scrumWins": 8,
                    "supports": 152,
                    "tackleBreaks": 23,
                    "tackles": 270,
                    "sets": 42,
                    "tries": 3,
                    "triesConceded": 4,
                    "tryAssists": 3,
                    "offloads": 14,
                    "hitupRunMeters": 780,
                    "evasionRuns": 67,
                    "evasionRunMetres": 609,
                    "dummyHalfRunMetres": 138,
                    "ptbFast": 28,
                    "ptbNeutral": 69,
                    "ptbSlow": 3,
                    "ptbTotal": 145
                }
            },
            {
                "score": {
                    "conversions": 4,
                    "points": 26,
                    "penaltyGoals": 1,
                    "tries": 4
                },
                "team1stHalfScore": 18,
                "team2ndHalfScore": 8,
                "teamAbbr": "BRI",
                "teamFinalScore": 26,
                "teamFullTimeScore": 26,
                "teamHalfTimeScore": 18,
                "teamId": 500011,
                "teamLineup": {
                    "injuriesAndSuspensions": {
                        "injury": [],
                        "suspension": []
                    },
                    "insAndOuts": {
                        "inOut": [
                            {
                                "inOut": "Out",
                                "playerFirstName": "Adam",
                                "playerId": "500645",
                                "playerLastName": "Blair",
                                "playerName": "Adam Blair"
                            },
                            {
                                "inOut": "In",
                                "playerFirstName": "Dale",
                                "playerId": "500245",
                                "playerLastName": "Copley",
                                "playerName": "Dale Copley"
                            },
                            {
                                "inOut": "In",
                                "playerFirstName": "Daniel",
                                "playerId": "500274",
                                "playerLastName": "Vidot",
                                "playerName": "Daniel Vidot"
                            },
                            {
                                "inOut": "Out",
                                "playerFirstName": "Jo",
                                "playerId": "500267",
                                "playerLastName": "Ofahengaue",
                                "playerName": "Jo Ofahengaue"
                            },
                            {
                                "inOut": "Out",
                                "playerFirstName": "Jordan",
                                "playerId": "500258",
                                "playerLastName": "Kahu",
                                "playerName": "Jordan Kahu"
                            },
                            {
                                "inOut": "Out",
                                "playerFirstName": "Justin",
                                "playerId": "500255",
                                "playerLastName": "Hodges",
                                "playerName": "Justin Hodges"
                            },
                            {
                                "inOut": "In",
                                "playerFirstName": "Mitch",
                                "playerId": "500590",
                                "playerLastName": "Garbutt",
                                "playerName": "Mitch Garbutt"
                            },
                            {
                                "inOut": "In",
                                "playerFirstName": "Mitchell",
                                "playerId": "500247",
                                "playerLastName": "Dodds",
                                "playerName": "Mitchell Dodds"
                            }
                        ]
                    },
                    "teamPlayer": [
                        {
                            "playerFirstName": "Lachlan",
                            "playerId": 500260,
                            "playerLastName": "Maranta",
                            "playerName": "Lachlan Maranta",
                            "playerPosition": "Fullback",
                            "playerPositionId": 500001,
                            "playerStats": {
                                "allRunMetres": 116,
                                "allRuns": 12,
                                "bombKicksDefused": 1,
                                "bombKicksNotDefused": 1,
                                "dummyHalfRuns": 1,
                                "errors": 1,
                                "fantasyPointsTotal": 30,
                                "kickReturnMetres": 50,
                                "kickReturns": 6,
                                "kicksDefused": 4,
                                "kicksNotDefused": 1,
                                "linebreaks": 1,
                                "mins": 80,
                                "missedTackles": 1,
                                "offloads": 1,
                                "oneOnOneTackles": 1,
                                "supports": 5,
                                "tackleBreaks": 1,
                                "tackles": 5,
                                "tryAssists": 1,
                                "evasionRuns": 5,
                                "evasionRunMetres": 64,
                                "dummyHalfRunMetres": 2,
                                "ptbNeutral": 100,
                                "ptbAll": 8
                            },
                            "playerTookTheField": true,
                            "shirtNum": 5
                        },
                        {
                            "playerFirstName": "Corey",
                            "playerId": 500266,
                            "playerLastName": "Oates",
                            "playerName": "Corey Oates",
                            "playerPosition": "Winger 1",
                            "playerPositionId": 500002,
                            "playerStats": {
                                "allRunMetres": 105,
                                "allRuns": 9,
                                "fantasyPointsTotal": 20,
                                "kickReturnMetres": 33,
                                "kickReturns": 2,
                                "kicksNotDefused": 1,
                                "mins": 80,
                                "oneOnOneSteal": 1,
                                "oneOnOneTackles": 1,
                                "supports": 4,
                                "tackleBreaks": 2,
                                "tackles": 4,
                                "tryCause": 1,
                                "evasionRuns": 7,
                                "evasionRunMetres": 72,
                                "ptbFast": 44.44,
                                "ptbNeutral": 44.44,
                                "ptbSlow": 11.11,
                                "ptbAll": 9
                            },
                            "playerTookTheField": true,
                            "shirtNum": 2
                        },
                        {
                            "playerFirstName": "Jack",
                            "playerId": 500269,
                            "playerLastName": "Reed",
                            "playerName": "Jack Reed",
                            "playerPosition": "Centre 1",
                            "playerPositionId": 500003,
                            "playerStats": {
                                "allRunMetres": 115,
                                "allRuns": 6,
                                "fantasyPointsTotal": 20,
                                "ineffectiveTackles": 3,
                                "mins": 80,
                                "missedTackles": 2,
                                "offloads": 1,
                                "oneOnOneTackles": 3,
                                "penalties": 1,
                                "supports": 9,
                                "tackles": 13,
                                "tryCause": 1,
                                "evasionRuns": 6,
                                "evasionRunMetres": 115,
                                "ptbNeutral": 100,
                                "ptbAll": 5
                            },
                            "playerTookTheField": true,
                            "shirtNum": 3
                        },
                        {
                            "playerFirstName": "Dale",
                            "playerId": 500245,
                            "playerLastName": "Copley",
                            "playerName": "Dale Copley",
                            "playerPosition": "Centre 2",
                            "playerPositionId": 500004,
                            "playerStats": {
                                "allRunMetres": 95,
                                "allRuns": 9,
                                "errors": 1,
                                "fantasyPointsTotal": 15,
                                "ineffectiveTackles": 1,
                                "intercepts": 1,
                                "mins": 80,
                                "missedTackles": 3,
                                "oneOnOneTackles": 1,
                                "supports": 15,
                                "tackleBreaks": 2,
                                "tackles": 8,
                                "evasionRuns": 9,
                                "evasionRunMetres": 95,
                                "ptbFast": 12.5,
                                "ptbNeutral": 87.5,
                                "ptbAll": 8
                            },
                            "playerTookTheField": true,
                            "shirtNum": 4
                        },
                        {
                            "playerFirstName": "Daniel",
                            "playerId": 500274,
                            "playerLastName": "Vidot",
                            "playerName": "Daniel Vidot",
                            "playerPosition": "Winger 2",
                            "playerPositionId": 500005,
                            "playerStats": {
                                "allRunMetres": 126,
                                "allRuns": 13,
                                "bombKicksNotDefused": 1,
                                "decoys": 1,
                                "errors": 1,
                                "fantasyPointsTotal": 19,
                                "hitUps": 1,
                                "kickReturnMetres": 26,
                                "kickReturns": 3,
                                "kicksDefused": 2,
                                "kicksNotDefused": 1,
                                "mins": 80,
                                "missedTackles": 2,
                                "supports": 7,
                                "tackleBreaks": 3,
                                "tackles": 2,
                                "tryCause": 1,
                                "hitupRunMeters": 6,
                                "evasionRuns": 9,
                                "evasionRunMetres": 94,
                                "ptbFast": 33.33,
                                "ptbNeutral": 66.67,
                                "ptbAll": 12
                            },
                            "playerTookTheField": true,
                            "shirtNum": 19
                        },
                        {
                            "playerFirstName": "Anthony",
                            "playerId": 500326,
                            "playerLastName": "Milford",
                            "playerName": "Anthony Milford",
                            "playerPosition": "Five-eighth",
                            "playerPositionId": 500006,
                            "playerStats": {
                                "allRunMetres": 88,
                                "allRuns": 9,
                                "bombKicks": 1,
                                "bombKickMetres": 39,
                                "dummyHalfRuns": 1,
                                "errors": 2,
                                "fantasyPointsTotal": 49,
                                "ineffectiveTackles": 3,
                                "interceptedPass": 1,
                                "kickMetres": 81,
                                "kickReturns": 2,
                                "kicks": 3,
                                "kicksDefused": 2,
                                "mins": 80,
                                "missedTackles": 2,
                                "oneOnOneTackles": 1,
                                "penalties": 1,
                                "supports": 13,
                                "tackleBreaks": 5,
                                "tackles": 14,
                                "tries": 2,
                                "evasionRuns": 6,
                                "evasionRunMetres": 68,
                                "dummyHalfRunMetres": 20,
                                "ptbFast": 25,
                                "ptbNeutral": 50,
                                "ptbSlow": 25,
                                "ptbAll": 4
                            },
                            "playerTookTheField": true,
                            "shirtNum": 6
                        },
                        {
                            "playerFirstName": "Ben",
                            "playerId": 500257,
                            "playerLastName": "Hunt",
                            "playerName": "Ben Hunt",
                            "playerPosition": "Halfback",
                            "playerPositionId": 500007,
                            "playerStats": {
                                "allRunMetres": 70,
                                "allRuns": 7,
                                "bombKicks": 2,
                                "bombKickMetres": 65,
                                "chargeDowns": 1,
                                "conversions": 2,
                                "conversionsAttempts": 2,
                                "fantasyPointsTotal": 53,
                                "ineffectiveTackles": 1,
                                "kickMetres": 346,
                                "kicks": 10,
                                "kicksDefused": 1,
                                "lineDropouts": 6,
                                "mins": 80,
                                "missedTackles": 3,
                                "oneOnOneTackles": 3,
                                "supports": 13,
                                "tackleBreaks": 2,
                                "tackles": 24,
                                "tryCause": 1,
                                "evasionRuns": 7,
                                "evasionRunMetres": 70,
                                "ptbFast": 50,
                                "ptbNeutral": 50,
                                "ptbAll": 2
                            },
                            "playerTookTheField": true,
                            "shirtNum": 7
                        },
                        {
                            "playerFirstName": "Josh",
                            "playerId": 500262,
                            "playerLastName": "McGuire",
                            "playerName": "Josh McGuire",
                            "playerPosition": "Prop 1",
                            "playerPositionId": 500008,
                            "playerStats": {
                                "allRunMetres": 117,
                                "allRuns": 12,
                                "decoys": 5,
                                "fantasyPointsTotal": 46,
                                "hitUps": 11,
                                "ineffectiveTackles": 2,
                                "kickMetres": 6,
                                "kicks": 1,
                                "mins": 60,
                                "oneOnOneTackles": 2,
                                "penalties": 1,
                                "supports": 1,
                                "tackles": 37,
                                "hitupRunMeters": 109,
                                "evasionRuns": 1,
                                "evasionRunMetres": 8,
                                "ptbFast": 33.33,
                                "ptbNeutral": 66.67,
                                "ptbAll": 9
                            },
                            "playerTookTheField": true,
                            "shirtNum": 8
                        },
                        {
                            "playerFirstName": "Andrew",
                            "playerId": 500261,
                            "playerLastName": "McCullough",
                            "playerName": "Andrew McCullough",
                            "playerPosition": "Hooker",
                            "playerPositionId": 500009,
                            "playerStats": {
                                "allRunMetres": 36,
                                "allRuns": 5,
                                "dummyHalfRuns": 5,
                                "fantasyPointsTotal": 59,
                                "kickMetres": 54,
                                "kicks": 1,
                                "linebreakAssists": 1,
                                "mins": 70,
                                "missedTackles": 1,
                                "oneOnOneTackles": 1,
                                "penalties": 1,
                                "tackleBreaks": 1,
                                "tackles": 48,
                                "tryAssists": 1,
                                "tryCause": 1,
                                "dummyHalfRunMetres": 36,
                                "ptbFast": 50,
                                "ptbNeutral": 50,
                                "ptbAll": 2
                            },
                            "playerTookTheField": true,
                            "shirtNum": 9
                        },
                        {
                            "playerFirstName": "Jarrod",
                            "playerId": 500275,
                            "playerLastName": "Wallace",
                            "playerName": "Jarrod Wallace",
                            "playerPosition": "Prop 2",
                            "playerPositionId": 500010,
                            "playerStats": {
                                "allRunMetres": 27,
                                "allRuns": 3,
                                "decoys": 1,
                                "fantasyPointsTotal": 25,
                                "hitUps": 2,
                                "ineffectiveTackles": 3,
                                "kickReturnMetres": 9,
                                "kickReturns": 1,
                                "mins": 27,
                                "supports": 2,
                                "tackles": 23,
                                "hitupRunMeters": 18,
                                "ptbNeutral": 100,
                                "ptbAll": 2
                            },
                            "playerTookTheField": true,
                            "shirtNum": 14
                        },
                        {
                            "playerFirstName": "Alex",
                            "playerId": 500250,
                            "playerLastName": "Glenn",
                            "playerName": "Alex Glenn",
                            "playerPosition": "2nd Row 1",
                            "playerPositionId": 500011,
                            "playerStats": {
                                "allRunMetres": 119,
                                "allRuns": 14,
                                "decoys": 2,
                                "errors": 1,
                                "fantasyPointsTotal": 30,
                                "hitUps": 14,
                                "ineffectiveTackles": 3,
                                "mins": 76,
                                "missedTackles": 2,
                                "penalties": 1,
                                "supports": 6,
                                "tackleBreaks": 1,
                                "tackles": 24,
                                "hitupRunMeters": 119,
                                "ptbFast": 30.77,
                                "ptbNeutral": 61.54,
                                "ptbSlow": 7.69,
                                "ptbAll": 13
                            },
                            "playerTookTheField": true,
                            "shirtNum": 11
                        },
                        {
                            "playerFirstName": "Matt",
                            "playerId": 500249,
                            "playerLastName": "Gillett",
                            "playerName": "Matt Gillett",
                            "playerPosition": "2nd Row 2",
                            "playerPositionId": 500012,
                            "playerStats": {
                                "allRunMetres": 101,
                                "allRuns": 11,
                                "decoys": 5,
                                "errors": 2,
                                "fantasyPointsTotal": 45,
                                "hitUps": 10,
                                "ineffectiveTackles": 1,
                                "mins": 80,
                                "missedTackles": 4,
                                "oneOnOneTackles": 6,
                                "penalties": 2,
                                "supports": 5,
                                "tackleBreaks": 3,
                                "tackles": 42,
                                "hitupRunMeters": 95,
                                "evasionRuns": 1,
                                "evasionRunMetres": 6,
                                "ptbFast": 12.5,
                                "ptbNeutral": 87.5,
                                "ptbAll": 8
                            },
                            "playerTookTheField": true,
                            "shirtNum": 12
                        },
                        {
                            "playerFirstName": "Corey",
                            "playerId": 500268,
                            "playerLastName": "Parker",
                            "playerName": "Corey Parker",
                            "playerPosition": "Lock",
                            "playerPositionId": 500013,
                            "playerStats": {
                                "allRunMetres": 118,
                                "allRuns": 13,
                                "conversions": 2,
                                "conversionsAttempts": 2,
                                "decoys": 3,
                                "fantasyPointsTotal": 52,
                                "goalConversionRate": 33.333,
                                "hitUps": 12,
                                "ineffectiveTackles": 3,
                                "mins": 63,
                                "missedTackles": 1,
                                "offloads": 1,
                                "oneOnOneTackles": 1,
                                "penaltyGoals": 1,
                                "penaltyGoalsAttempts": 1,
                                "supports": 7,
                                "tackles": 35,
                                "hitupRunMeters": 115,
                                "evasionRuns": 1,
                                "evasionRunMetres": 3,
                                "ptbFast": 9.09,
                                "ptbNeutral": 90.91,
                                "ptbAll": 11
                            },
                            "playerTookTheField": true,
                            "shirtNum": 13,
                            "isCaptain": true
                        },
                        {
                            "playerFirstName": "Sam",
                            "playerId": 500273,
                            "playerLastName": "Thaiday",
                            "playerName": "Sam Thaiday",
                            "playerPosition": "Interchange",
                            "playerPositionId": 500014,
                            "playerStats": {
                                "allRunMetres": 62,
                                "allRuns": 8,
                                "decoys": 4,
                                "fantasyPointsTotal": 43,
                                "hitUps": 6,
                                "kickReturnMetres": 12,
                                "kickReturns": 1,
                                "linebreakAssists": 1,
                                "mins": 51,
                                "supports": 7,
                                "tackles": 35,
                                "hitupRunMeters": 42,
                                "evasionRuns": 1,
                                "evasionRunMetres": 8,
                                "ptbFast": 50,
                                "ptbNeutral": 50,
                                "ptbAll": 6
                            },
                            "playerTookTheField": true,
                            "shirtNum": 10
                        },
                        {
                            "playerFirstName": "Mitch",
                            "playerId": 500590,
                            "playerLastName": "Garbutt",
                            "playerName": "Mitch Garbutt",
                            "playerPosition": "Interchange",
                            "playerPositionId": 500014,
                            "playerStats": {
                                "allRunMetres": 26,
                                "allRuns": 3,
                                "fantasyPointsTotal": 17,
                                "hitUps": 3,
                                "ineffectiveTackles": 1,
                                "mins": 16,
                                "tackles": 15,
                                "hitupRunMeters": 26,
                                "ptbNeutral": 100,
                                "ptbAll": 3
                            },
                            "playerTookTheField": true,
                            "shirtNum": 15
                        },
                        {
                            "playerFirstName": "Mitchell",
                            "playerId": 500247,
                            "playerLastName": "Dodds",
                            "playerName": "Mitchell Dodds",
                            "playerPosition": "Interchange",
                            "playerPositionId": 500014,
                            "playerStats": {
                                "allRunMetres": 51,
                                "allRuns": 6,
                                "decoys": 1,
                                "fantasyPointsTotal": 40,
                                "hitUps": 3,
                                "ineffectiveTackles": 1,
                                "kickReturnMetres": 14,
                                "kickReturns": 1,
                                "linebreaks": 2,
                                "mins": 27,
                                "missedTackles": 1,
                                "oneOnOneTackles": 1,
                                "supports": 1,
                                "tackles": 13,
                                "tries": 2,
                                "hitupRunMeters": 30,
                                "evasionRuns": 2,
                                "evasionRunMetres": 7,
                                "ptbFast": 50,
                                "ptbNeutral": 50,
                                "ptbAll": 4
                            },
                            "playerTookTheField": true,
                            "shirtNum": 16
                        },
                        {
                            "playerFirstName": "Kodi",
                            "playerId": 500265,
                            "playerLastName": "Nikorima",
                            "playerName": "Kodi Nikorima",
                            "playerPosition": "Interchange",
                            "playerPositionId": 500014,
                            "playerStats": {
                                "allRunMetres": 28,
                                "allRuns": 2,
                                "dummyHalfRuns": 1,
                                "errors": 1,
                                "fantasyPointsTotal": 11,
                                "linebreaks": 1,
                                "mins": 10,
                                "missedTackles": 1,
                                "tackles": 9,
                                "evasionRuns": 1,
                                "evasionRunMetres": 6,
                                "dummyHalfRunMetres": 22
                            },
                            "playerTookTheField": true,
                            "shirtNum": 17
                        }
                    ]
                },
                "teamName": "Brisbane Broncos",
                "teamNickName": "Broncos",
                "teamStats": {
                    "allRunMetres": 1400,
                    "allRuns": 142,
                    "bombKicks": 3,
                    "bombKickMetres": 104,
                    "bombKicksDefused": 1,
                    "bombKicksNotDefused": 2,
                    "chargeDowns": 1,
                    "completeSets": 26,
                    "completionPercentage": 67,
                    "conversions": 4,
                    "conversionsAttempts": 4,
                    "decoys": 22,
                    "dummyHalfRuns": 8,
                    "errors": 9,
                    "hitUps": 62,
                    "incompleteSets": 13,
                    "ineffectiveTackles": 22,
                    "interceptedPass": 1,
                    "intercepts": 1,
                    "kickMetres": 488,
                    "kickReturnMetres": 144,
                    "kickReturns": 16,
                    "kicks": 15,
                    "kicksDefused": 9,
                    "kicksNotDefused": 3,
                    "lineDropouts": 6,
                    "linebreakAssists": 2,
                    "linebreaks": 4,
                    "missedTackles": 23,
                    "oneOnOneTackles": 21,
                    "penalties": 7,
                    "penaltyGoals": 1,
                    "penaltyGoalsAttempts": 1,
                    "points": 26,
                    "pointsConceded": 16,
                    "possession": 38,
                    "scrumWins": 7,
                    "supports": 95,
                    "tackleBreaks": 20,
                    "tackles": 351,
                    "sets": 39,
                    "tries": 4,
                    "triesConceded": 3,
                    "tryAssists": 2,
                    "offloads": 3,
                    "hitupRunMeters": 561,
                    "evasionRuns": 56,
                    "evasionRunMetres": 615,
                    "dummyHalfRunMetres": 80,
                    "ptbFast": 25,
                    "ptbNeutral": 73,
                    "ptbSlow": 3,
                    "ptbTotal": 106
                }
            }
        ]
    }
}