{
    "competitionId": 111,
    "competitionName": "NRL Telstra Premiership",
    "gameId": 20161111150,
    "gameInfo": {
        "assistantReferee1Id": 500045,
        "numberOfPeriods": 2,
        "assistantReferee1Name": "Belinda Sleeman",
        "assistantReferee2Id": 500013,
        "assistantReferee2Name": "Brett Suttor",
        "gameDate": "2016-05-21",
        "gameHashTag": "#NRLSharksManly",
        "gameNumber": 5,
        "gameSeconds": 4800,
        "gameMinutes": "80:00",
        "gameTime": "1:20:00",
        "groundConditionId": 1,
        "groundConditionName": "N/A",
        "referee1Id": 500008,
        "referee1Name": "Gavin Badger",
        "referee2Id": 500009,
        "referee2Name": "Alan Shortall",
        "startTime": "2016-05-21T19:30:00",
        "startTimeUTC": "2016-05-21T09:30:00Z",
        "venueId": 500007,
        "venueName": "Southern Cross Group Stadium",
        "videoReferee1Id": 500232,
        "videoReferee1Name": "Luke Patten",
        "videoReferee2Id": 500036,
        "videoReferee2Name": "Jason Robinson",
        "weatherId": 11,
        "weatherName": "Partly Cloudy",
        "broadcastChannel": null,
        "venueLatitude": -33.7591,
        "venueLongitude": 151.27445,
        "broadcastInfo": {
            "radioNetwork": []
        }
    },
    "gameState": "Final",
    "gameStateId": 8,
    "roundId": 11,
    "roundName": "Round 11",
    "seasonId": 2016,
    "teams": {
        "teamsMatch": [
            {
                "isHomeTeam": true,
                "score": {
                    "conversions": 2,
                    "points": 20,
                    "penaltyGoals": 2,
                    "tries": 3
                },
                "team1stHalfScore": 12,
                "team2ndHalfScore": 8,
                "teamAbbr": "CRO",
                "teamFinalScore": 20,
                "teamFullTimeScore": 20,
                "teamHalfTimeScore": 12,
                "teamId": 500028,
                "teamLineup": {
                    "teamLineUpStatusID": 4,
                    "teamLineUpStatus": "Final",
                    "injuriesAndSuspensions": {
                        "injury": [],
                        "suspension": []
                    },
                    "insAndOuts": {
                        "inOut": [
                            {
                                "inOut": "In",
                                "playerFirstName": "Jayson",
                                "playerId": "500977",
                                "playerLastName": "Bukuya",
                                "playerName": "Jayson Bukuya"
                            },
                            {
                                "inOut": "Out",
                                "playerFirstName": "Matt",
                                "playerId": "500806",
                                "playerLastName": "Prior",
                                "playerName": "Matt Prior"
                            }
                        ]
                    },
                    "teamPlayer": [
                        {
                            "playerFirstName": "Ben",
                            "playerId": 500244,
                            "playerLastName": "Barba",
                            "playerName": "Ben Barba",
                            "playerPosition": "Fullback",
                            "playerPositionId": 500001,
                            "playerStats": {
                                "allRunMetres": 111,
                                "allRuns": 11,
                                "bombKicksDefused": 4,
                                "decoys": 4,
                                "dummyHalfRuns": 1,
                                "fantasyPointsTotal": 55,
                                "kickReturnMetres": 28,
                                "kickReturns": 5,
                                "kicksDefused": 5,
                                "kicksNotDefused": 1,
                                "linebreakAssists": 1,
                                "linebreaks": 1,
                                "mins": 80,
                                "offloads": 1,
                                "passes": 7,
                                "passesPerRun": 0.64,
                                "points": 4,
                                "supports": 8,
                                "tackleBreaks": 5,
                                "tackles": 3,
                                "tries": 1,
                                "tryAssists": 1,
                                "tryCause": 1,
                                "evasionRuns": 5,
                                "evasionRunMetres": 72,
                                "dummyHalfRunMetres": 11,
                                "ptbAll": 13,
                                "receipts": 22,
                                "postContactMetres": 31,
                                "dummyPasses": 2,
                                "ptbTwoToThree": 4,
                                "ptbThreeToFour": 3,
                                "ptbFourToFive": 5,
                                "ptbFivePlus": 1,
                                "doubles": 1,
                                "effectiveTacklePercentage": 100
                            },
                            "playerTookTheField": true,
                            "shirtNum": 1,
                            "playerFirstInitial": "B",
                            "playerPositionAbbrev": "FB",
                            "onTheField": true,
                            "fantasyPrice": 348000,
                            "fantasySeasonPriceChange": 170000,
                            "fantasyRoundPriceChange": 2000
                        },
                        {
                            "playerFirstName": "Sosaia",
                            "playerId": 500790,
                            "playerLastName": "Feki",
                            "playerName": "Sosaia Feki",
                            "playerPosition": "Winger 1",
                            "playerPositionId": 500002,
                            "playerStats": {
                                "allRunMetres": 101,
                                "allRuns": 12,
                                "bombKicksDefused": 1,
                                "errors": 2,
                                "fantasyPointsTotal": 26,
                                "hitUps": 1,
                                "kickReturnMetres": 7,
                                "kickReturns": 3,
                                "kicksDefused": 1,
                                "kicksNotDefused": 1,
                                "linebreaks": 1,
                                "mins": 80,
                                "points": 4,
                                "supports": 6,
                                "tackleBreaks": 2,
                                "tackles": 1,
                                "tries": 1,
                                "hitupRunMeters": 15,
                                "evasionRuns": 8,
                                "evasionRunMetres": 79,
                                "ptbAll": 10,
                                "receipts": 13,
                                "postContactMetres": 31,
                                "ptbOneToTwo": 1,
                                "ptbTwoToThree": 3,
                                "ptbThreeToFour": 3,
                                "ptbFourToFive": 2,
                                "ptbFivePlus": 1,
                                "effectiveTacklePercentage": 100
                            },
                            "playerTookTheField": true,
                            "shirtNum": 2,
                            "playerFirstInitial": "S",
                            "playerPositionAbbrev": "WG",
                            "onTheField": true,
                            "fantasyPrice": 221000,
                            "fantasySeasonPriceChange": 3000,
                            "fantasyRoundPriceChange": 27000
                        },
                        {
                            "playerFirstName": "Jack",
                            "playerId": 500617,
                            "playerLastName": "Bird",
                            "playerName": "Jack Bird",
                            "playerPosition": "Centre 1",
                            "playerPositionId": 500003,
                            "playerStats": {
                                "allRunMetres": 119,
                                "allRuns": 13,
                                "decoys": 2,
                                "dummyHalfRuns": 1,
                                "errors": 1,
                                "fantasyPointsTotal": 28,
                                "hitUps": 1,
                                "ineffectiveTackles": 1,
                                "kickReturnMetres": 14,
                                "kickReturns": 2,
                                "kicksNotDefused": 1,
                                "mins": 80,
                                "missedTackles": 3,
                                "offloads": 2,
                                "passes": 4,
                                "passesPerRun": 0.31,
                                "oneOnOneTackles": 3,
                                "penalties": 1,
                                "supports": 6,
                                "tackleBreaks": 2,
                                "tackles": 17,
                                "tryCause": 2,
                                "hitupRunMeters": 8,
                                "evasionRuns": 9,
                                "evasionRunMetres": 84,
                                "dummyHalfRunMetres": 13,
                                "ptbAll": 10,
                                "receipts": 16,
                                "postContactMetres": 48,
                                "ptbThreeToFour": 6,
                                "ptbFourToFive": 3,
                                "ptbFivePlus": 1,
                                "doubles": 3,
                                "effectiveTacklePercentage": 81,
                                "ptbPenalties": 1
                            },
                            "playerTookTheField": true,
                            "shirtNum": 3,
                            "playerFirstInitial": "J",
                            "playerPositionAbbrev": "CT",
                            "onTheField": true,
                            "fantasyPrice": 348000,
                            "fantasySeasonPriceChange": -52000,
                            "fantasyRoundPriceChange": -4000
                        },
                        {
                            "playerFirstName": "Gerard",
                            "playerId": 500616,
                            "playerLastName": "Beale",
                            "playerName": "Gerard Beale",
                            "playerPosition": "Centre 2",
                            "playerPositionId": 500004,
                            "playerStats": {
                                "allRunMetres": 95,
                                "allRuns": 13,
                                "decoys": 1,
                                "errors": 1,
                                "fantasyPointsTotal": 28,
                                "kickMetres": 16,
                                "kickReturnMetres": 8,
                                "kickReturns": 1,
                                "kicks": 1,
                                "linebreakAssists": 1,
                                "mins": 80,
                                "missedTackles": 2,
                                "offloads": 1,
                                "passes": 3,
                                "passesPerRun": 0.23,
                                "oneOnOneTackles": 2,
                                "supports": 5,
                                "tackleBreaks": 2,
                                "tackles": 10,
                                "tryAssists": 1,
                                "evasionRuns": 12,
                                "evasionRunMetres": 87,
                                "ptbAll": 11,
                                "receipts": 13,
                                "chipKick": 1,
                                "postContactMetres": 39,
                                "ptbOneToTwo": 2,
                                "ptbTwoToThree": 1,
                                "ptbThreeToFour": 8,
                                "doubles": 1,
                                "effectiveTacklePercentage": 83.3
                            },
                            "playerTookTheField": true,
                            "shirtNum": 4,
                            "playerFirstInitial": "G",
                            "playerPositionAbbrev": "CT",
                            "onTheField": true,
                            "fantasyPrice": 201000,
                            "fantasySeasonPriceChange": -40000,
                            "fantasyRoundPriceChange": 15000
                        },
                        {
                            "playerFirstName": "Valentine",
                            "playerId": 500845,
                            "playerLastName": "Holmes",
                            "playerName": "Valentine Holmes",
                            "playerPosition": "Winger 2",
                            "playerPositionId": 500005,
                            "playerStats": {
                                "allRunMetres": 97,
                                "allRuns": 11,
                                "bombKicksDefused": 1,
                                "dummyHalfRuns": 2,
                                "fantasyPointsTotal": 29,
                                "hitUps": 1,
                                "kickReturnMetres": 13,
                                "kickReturns": 1,
                                "kicksDefused": 1,
                                "linebreaks": 1,
                                "mins": 80,
                                "passes": 1,
                                "passesPerRun": 0.09,
                                "points": 4,
                                "supports": 1,
                                "tackleBreaks": 1,
                                "tackles": 4,
                                "tries": 1,
                                "tryCause": 1,
                                "hitupRunMeters": 9,
                                "evasionRuns": 7,
                                "evasionRunMetres": 60,
                                "dummyHalfRunMetres": 15,
                                "ptbAll": 9,
                                "receipts": 13,
                                "postContactMetres": 36,
                                "dummyPasses": 1,
                                "ptbTwoToThree": 2,
                                "ptbThreeToFour": 4,
                                "ptbFourToFive": 3,
                                "doubles": 2,
                                "effectiveTacklePercentage": 100
                            },
                            "playerTookTheField": true,
                            "shirtNum": 5,
                            "playerFirstInitial": "V",
                            "playerPositionAbbrev": "WG",
                            "onTheField": true,
                            "fantasyPrice": 309000,
                            "fantasySeasonPriceChange": 45000,
                            "fantasyRoundPriceChange": 42000
                        },
                        {
                            "playerFirstName": "James",
                            "playerId": 500006,
                            "playerLastName": "Maloney",
                            "playerName": "James Maloney",
                            "playerPosition": "Five-Eighth",
                            "playerPositionId": 500006,
                            "playerStats": {
                                "allRunMetres": 76,
                                "allRuns": 8,
                                "bombKicks": 2,
                                "bombKickMetres": 44,
                                "conversions": 2,
                                "conversionsAttempts": 3,
                                "conversionsMissed": 1,
                                "errors": 1,
                                "fantasyPointsTotal": 35,
                                "goalConversionRate": 80,
                                "allGoals": 4,
                                "allGoalsMissed": 1,
                                "allGoalsAttempted": 5,
                                "ineffectiveTackles": 1,
                                "intercepts": 1,
                                "kickDead": 1,
                                "kickMetres": 293,
                                "kicks": 9,
                                "lineDropouts": 1,
                                "linebreakAssists": 1,
                                "mins": 80,
                                "missedTackles": 5,
                                "passes": 29,
                                "passesPerRun": 3.62,
                                "oneOnOneTackles": 1,
                                "penalties": 3,
                                "penaltyGoals": 2,
                                "penaltyGoalsAttempts": 2,
                                "points": 8,
                                "supports": 10,
                                "tackleBreaks": 1,
                                "tackles": 14,
                                "tryAssists": 1,
                                "evasionRuns": 8,
                                "evasionRunMetres": 76,
                                "ptbAll": 5,
                                "receipts": 44,
                                "forcedDropOutKicker": 2,
                                "chipKick": 1,
                                "crossFieldKick": 1,
                                "postContactMetres": 22,
                                "dummyPasses": 3,
                                "kickPressures": 3,
                                "lineEngagedRuns": 2,
                                "ptbTwoToThree": 1,
                                "ptbThreeToFour": 1,
                                "ptbFourToFive": 2,
                                "ptbFivePlus": 1,
                                "doubles": 2,
                                "longKicksSpace": 3,
                                "effectiveTacklePercentage": 70,
                                "ptbPenalties": 3
                            },
                            "playerTookTheField": true,
                            "shirtNum": 6,
                            "playerFirstInitial": "J",
                            "playerPositionAbbrev": "FE",
                            "onTheField": true,
                            "fantasyPrice": 362000,
                            "fantasySeasonPriceChange": -31000,
                            "fantasyRoundPriceChange": 27000
                        },
                        {
                            "playerFirstName": "Chad",
                            "playerId": 501183,
                            "playerLastName": "Townsend",
                            "playerName": "Chad Townsend",
                            "playerPosition": "Halfback",
                            "playerPositionId": 500007,
                            "playerStats": {
                                "allRunMetres": 10,
                                "allRuns": 3,
                                "bombKicks": 3,
                                "bombKickMetres": 83,
                                "errors": 1,
                                "fantasyPointsTotal": 35,
                                "ineffectiveTackles": 2,
                                "kickDead": 1,
                                "kickMetres": 200,
                                "kicks": 7,
                                "mins": 80,
                                "missedTackles": 1,
                                "passes": 24,
                                "passesPerRun": 8,
                                "oneOnOneTackles": 1,
                                "penalties": 1,
                                "supports": 20,
                                "tackles": 30,
                                "tryCause": 1,
                                "evasionRuns": 3,
                                "evasionRunMetres": 10,
                                "ptbAll": 3,
                                "receipts": 35,
                                "chipKick": 1,
                                "postContactMetres": 5,
                                "dummyPasses": 4,
                                "ptbThreeToFour": 2,
                                "ptbFourToFive": 1,
                                "doubles": 5,
                                "longKicksSpace": 2,
                                "effectiveTacklePercentage": 90.9,
                                "ptbPenalties": 1
                            },
                            "playerTookTheField": true,
                            "shirtNum": 7,
                            "playerFirstInitial": "C",
                            "playerPositionAbbrev": "HB",
                            "onTheField": true,
                            "fantasyPrice": 313000,
                            "fantasySeasonPriceChange": -34000,
                            "fantasyRoundPriceChange": -5000
                        },
                        {
                            "playerFirstName": "Andrew",
                            "playerId": 500791,
                            "playerLastName": "Fifita",
                            "playerName": "Andrew Fifita",
                            "playerPosition": "Prop 1",
                            "playerPositionId": 500008,
                            "playerStats": {
                                "allRunMetres": 183,
                                "allRuns": 22,
                                "decoys": 6,
                                "fantasyPointsTotal": 79,
                                "hitUps": 17,
                                "ineffectiveTackles": 3,
                                "kickReturnMetres": 66,
                                "kickReturns": 5,
                                "mins": 57,
                                "offloads": 5,
                                "passes": 1,
                                "passesPerRun": 0.05,
                                "tackleBreaks": 6,
                                "tackles": 33,
                                "hitupRunMeters": 117,
                                "ptbAll": 13,
                                "receipts": 23,
                                "postContactMetres": 71,
                                "ptbOneToTwo": 3,
                                "ptbTwoToThree": 3,
                                "ptbThreeToFour": 2,
                                "ptbFourToFive": 2,
                                "ptbFivePlus": 3,
                                "doubles": 8,
                                "effectiveTacklePercentage": 91.7
                            },
                            "playerTookTheField": true,
                            "shirtNum": 8,
                            "playerFirstInitial": "A",
                            "playerPositionAbbrev": "PR",
                            "onTheField": true,
                            "fantasyPrice": 500000,
                            "fantasySeasonPriceChange": -43000
                        },
                        {
                            "playerFirstName": "Michael",
                            "playerId": 500221,
                            "playerLastName": "Ennis",
                            "playerName": "Michael Ennis",
                            "playerPosition": "Hooker",
                            "playerPositionId": 500009,
                            "playerStats": {
                                "allRunMetres": 63,
                                "allRuns": 7,
                                "dummyHalfRuns": 6,
                                "errors": 1,
                                "fantasyPointsTotal": 38,
                                "hitUps": 1,
                                "ineffectiveTackles": 3,
                                "kickDead": 1,
                                "kickMetres": 97,
                                "kicks": 3,
                                "mins": 80,
                                "missedTackles": 3,
                                "offloads": 1,
                                "passes": 96,
                                "passesPerRun": 13.71,
                                "oneOnOneTackles": 3,
                                "tackles": 34,
                                "dummyHalfRunMetres": 63,
                                "ptbAll": 3,
                                "receipts": 101,
                                "postContactMetres": 20,
                                "dummyPasses": 3,
                                "kickPressures": 5,
                                "lineEngagedRuns": 2,
                                "ptbTwoToThree": 1,
                                "ptbThreeToFour": 1,
                                "ptbFourToFive": 1,
                                "doubles": 6,
                                "longKicksSpace": 1,
                                "effectiveTacklePercentage": 85
                            },
                            "playerTookTheField": true,
                            "shirtNum": 9,
                            "playerFirstInitial": "M",
                            "playerPositionAbbrev": "HK",
                            "onTheField": true,
                            "fantasyPrice": 393000,
                            "fantasySeasonPriceChange": -13000,
                            "fantasyRoundPriceChange": 7000
                        },
                        {
                            "playerFirstName": "Sam",
                            "playerId": 500813,
                            "playerLastName": "Tagataese",
                            "playerName": "Sam Tagataese",
                            "playerPosition": "Prop 2",
                            "playerPositionId": 500010,
                            "playerStats": {
                                "allRunMetres": 68,
                                "allRuns": 8,
                                "decoys": 3,
                                "errors": 2,
                                "fantasyPointsTotal": 15,
                                "hitUps": 8,
                                "ineffectiveTackles": 1,
                                "mins": 29,
                                "passes": 1,
                                "passesPerRun": 0.12,
                                "supports": 3,
                                "tackleBreaks": 1,
                                "tackles": 10,
                                "hitupRunMeters": 68,
                                "ptbAll": 7,
                                "receipts": 10,
                                "postContactMetres": 28,
                                "ptbTwoToThree": 1,
                                "ptbThreeToFour": 5,
                                "ptbFivePlus": 1,
                                "doubles": 2,
                                "effectiveTacklePercentage": 90.9
                            },
                            "playerTookTheField": true,
                            "shirtNum": 10,
                            "playerFirstInitial": "S",
                            "playerPositionAbbrev": "PR",
                            "fantasyPrice": 234000,
                            "fantasySeasonPriceChange": 17000,
                            "fantasyRoundPriceChange": 12000
                        },
                        {
                            "playerFirstName": "Luke",
                            "playerId": 500802,
                            "playerLastName": "Lewis",
                            "playerName": "Luke Lewis",
                            "playerPosition": "2nd Row 1",
                            "playerPositionId": 500011,
                            "playerStats": {
                                "allRunMetres": 97,
                                "allRuns": 10,
                                "decoys": 5,
                                "dummyHalfRuns": 1,
                                "errors": 1,
                                "fantasyPointsTotal": 32,
                                "hitUps": 9,
                                "ineffectiveTackles": 1,
                                "mins": 80,
                                "missedTackles": 4,
                                "passes": 1,
                                "passesPerRun": 0.1,
                                "oneOnOneTackles": 3,
                                "supports": 3,
                                "tackles": 33,
                                "hitupRunMeters": 86,
                                "dummyHalfRunMetres": 11,
                                "ptbAll": 9,
                                "receipts": 11,
                                "postContactMetres": 36,
                                "dummyPasses": 1,
                                "kickPressures": 1,
                                "ptbOneToTwo": 1,
                                "ptbTwoToThree": 3,
                                "ptbThreeToFour": 3,
                                "ptbFourToFive": 2,
                                "doubles": 5,
                                "effectiveTacklePercentage": 86.8
                            },
                            "playerTookTheField": true,
                            "shirtNum": 11,
                            "playerFirstInitial": "L",
                            "playerPositionAbbrev": "2R",
                            "onTheField": true,
                            "fantasyPrice": 332000,
                            "fantasySeasonPriceChange": -61000,
                            "fantasyRoundPriceChange": 31000
                        },
                        {
                            "playerFirstName": "Wade",
                            "playerId": 500798,
                            "playerLastName": "Graham",
                            "playerName": "Wade Graham",
                            "playerPosition": "2nd Row 2",
                            "playerPositionId": 500012,
                            "playerStats": {
                                "allRunMetres": 103,
                                "allRuns": 12,
                                "decoys": 4,
                                "dummyHalfRuns": 1,
                                "errors": 1,
                                "fantasyPointsTotal": 30,
                                "hitUps": 10,
                                "ineffectiveTackles": 1,
                                "kickReturnMetres": 6,
                                "kickReturns": 1,
                                "mins": 75,
                                "missedTackles": 3,
                                "offloads": 1,
                                "passes": 4,
                                "passesPerRun": 0.33,
                                "supports": 3,
                                "tackleBreaks": 1,
                                "tackles": 23,
                                "hitupRunMeters": 89,
                                "dummyHalfRunMetres": 8,
                                "ptbAll": 10,
                                "receipts": 16,
                                "postContactMetres": 40,
                                "kickPressures": 6,
                                "ptbOneToTwo": 1,
                                "ptbThreeToFour": 4,
                                "ptbFourToFive": 2,
                                "ptbFivePlus": 3,
                                "doubles": 4,
                                "effectiveTacklePercentage": 85.2
                            },
                            "playerTookTheField": true,
                            "shirtNum": 12,
                            "playerFirstInitial": "W",
                            "playerPositionAbbrev": "2R",
                            "fantasyPrice": 373000,
                            "fantasySeasonPriceChange": -90000,
                            "fantasyRoundPriceChange": 24000
                        },
                        {
                            "playerFirstName": "Paul",
                            "playerId": 500794,
                            "playerLastName": "Gallen",
                            "playerName": "Paul Gallen",
                            "playerPosition": "Lock",
                            "playerPositionId": 500013,
                            "playerStats": {
                                "allRunMetres": 160,
                                "allRuns": 17,
                                "decoys": 5,
                                "fantasyPointsTotal": 55,
                                "hitUps": 15,
                                "ineffectiveTackles": 1,
                                "kickReturnMetres": 4,
                                "kickReturns": 1,
                                "mins": 70,
                                "missedTackles": 2,
                                "offloads": 1,
                                "passes": 2,
                                "passesPerRun": 0.12,
                                "oneOnOneTackles": 2,
                                "supports": 7,
                                "tackleBreaks": 1,
                                "tackles": 38,
                                "hitupRunMeters": 152,
                                "evasionRuns": 1,
                                "evasionRunMetres": 4,
                                "ptbAll": 13,
                                "receipts": 18,
                                "postContactMetres": 69,
                                "lineEngagedRuns": 1,
                                "ptbOneToTwo": 1,
                                "ptbTwoToThree": 2,
                                "ptbThreeToFour": 6,
                                "ptbFourToFive": 4,
                                "doubles": 5,
                                "effectiveTacklePercentage": 92.7
                            },
                            "playerTookTheField": true,
                            "shirtNum": 13,
                            "playerFirstInitial": "P",
                            "playerPositionAbbrev": "LK",
                            "onTheField": true,
                            "fantasyPrice": 520000,
                            "fantasySeasonPriceChange": -16000,
                            "fantasyRoundPriceChange": -1000
                        },
                        {
                            "playerFirstName": "Ricky",
                            "playerId": 500801,
                            "playerLastName": "Leutele",
                            "playerName": "Ricky Leutele",
                            "playerPosition": "Interchange",
                            "playerPositionId": 500014,
                            "playerStats": [],
                            "shirtNum": 14,
                            "playerFirstInitial": "R",
                            "playerPositionAbbrev": "INT",
                            "fantasyPrice": 237000,
                            "fantasySeasonPriceChange": -51000,
                            "fantasyRoundPriceChange": -24000
                        },
                        {
                            "playerFirstName": "Chris",
                            "playerId": 500799,
                            "playerLastName": "Heighington",
                            "playerName": "Chris Heighington",
                            "playerPosition": "Interchange",
                            "playerPositionId": 500014,
                            "playerStats": {
                                "allRunMetres": 48,
                                "allRuns": 6,
                                "fantasyPointsTotal": 20,
                                "hitUps": 6,
                                "mins": 22,
                                "passes": 2,
                                "passesPerRun": 0.33,
                                "oneOnOneTackles": 1,
                                "supports": 1,
                                "tackleBreaks": 1,
                                "tackles": 13,
                                "hitupRunMeters": 48,
                                "ptbAll": 6,
                                "receipts": 8,
                                "postContactMetres": 18,
                                "kickPressures": 1,
                                "ptbTwoToThree": 1,
                                "ptbThreeToFour": 4,
                                "ptbFourToFive": 1,
                                "doubles": 2,
                                "effectiveTacklePercentage": 100
                            },
                            "playerTookTheField": true,
                            "shirtNum": 15,
                            "playerFirstInitial": "C",
                            "playerPositionAbbrev": "INT",
                            "fantasyPrice": 264000,
                            "fantasySeasonPriceChange": -67000,
                            "fantasyRoundPriceChange": 7000
                        },
                        {
                            "playerFirstName": "Jayson",
                            "playerId": 500977,
                            "playerLastName": "Bukuya",
                            "playerName": "Jayson Bukuya",
                            "playerPosition": "Interchange",
                            "playerPositionId": 500014,
                            "playerStats": {
                                "allRunMetres": 61,
                                "allRuns": 8,
                                "bombKicksDefused": 1,
                                "decoys": 2,
                                "fantasyPointsTotal": 32,
                                "hitUps": 7,
                                "ineffectiveTackles": 1,
                                "kickReturnMetres": 3,
                                "kickReturns": 1,
                                "kicksDefused": 1,
                                "mins": 47,
                                "missedTackles": 4,
                                "oneOnOneTackles": 1,
                                "penalties": 1,
                                "supports": 2,
                                "tackleBreaks": 1,
                                "tackles": 32,
                                "hitupRunMeters": 58,
                                "ptbAll": 8,
                                "receipts": 8,
                                "postContactMetres": 24,
                                "kickPressures": 1,
                                "ptbOneToTwo": 2,
                                "ptbTwoToThree": 4,
                                "ptbThreeToFour": 2,
                                "doubles": 3,
                                "effectiveTacklePercentage": 86.5,
                                "ptbPenalties": 1
                            },
                            "playerTookTheField": true,
                            "shirtNum": 16,
                            "playerFirstInitial": "J",
                            "playerPositionAbbrev": "INT",
                            "onTheField": true,
                            "fantasyPrice": 300000,
                            "fantasySeasonPriceChange": 19000
                        },
                        {
                            "playerFirstName": "Joseph",
                            "playerId": 500686,
                            "playerLastName": "Paulo",
                            "playerName": "Joseph Paulo",
                            "playerPosition": "Interchange",
                            "playerPositionId": 500014,
                            "playerStats": {
                                "allRunMetres": 14,
                                "allRuns": 2,
                                "decoys": 4,
                                "fantasyPointsTotal": 8,
                                "hitUps": 2,
                                "mins": 18,
                                "passes": 2,
                                "passesPerRun": 1,
                                "oneOnOneTackles": 2,
                                "supports": 2,
                                "tackles": 7,
                                "hitupRunMeters": 14,
                                "ptbAll": 2,
                                "receipts": 4,
                                "postContactMetres": 5,
                                "dummyPasses": 1,
                                "ptbTwoToThree": 1,
                                "ptbThreeToFour": 1,
                                "doubles": 1,
                                "effectiveTacklePercentage": 100
                            },
                            "playerTookTheField": true,
                            "shirtNum": 17,
                            "playerFirstInitial": "J",
                            "playerPositionAbbrev": "INT",
                            "onTheField": true,
                            "fantasyPrice": 152000,
                            "fantasySeasonPriceChange": -102000,
                            "fantasyRoundPriceChange": -13000
                        }
                    ]
                },
                "teamName": "Cronulla-Sutherland Sharks",
                "teamNickName": "Sharks",
                "teamStats": {
                    "allRunMetres": 1404,
                    "allRuns": 163,
                    "bombKicks": 5,
                    "bombKickMetres": 127,
                    "bombKicksDefused": 7,
                    "completeSets": 29,
                    "completionPercentage": 71,
                    "conversions": 2,
                    "conversionsAttempts": 3,
                    "conversionsMissed": 1,
                    "decoys": 36,
                    "dummyHalfRuns": 12,
                    "errors": 11,
                    "goalConversionRate": 80,
                    "allGoals": 4,
                    "allGoalsAttempted": 5,
                    "allGoalsMissed": 1,
                    "hitUps": 78,
                    "incompleteSets": 12,
                    "ineffectiveTackles": 15,
                    "intercepts": 1,
                    "kickDead": 3,
                    "kickMetres": 606,
                    "kickReturnMetres": 149,
                    "kickReturns": 20,
                    "kicks": 20,
                    "kicksDefused": 8,
                    "kicksNotDefused": 3,
                    "lineDropouts": 1,
                    "linebreakAssists": 3,
                    "linebreaks": 3,
                    "missedTackles": 27,
                    "offloads": 12,
                    "oneOnOneTackles": 19,
                    "passes": 177,
                    "passesPerRun": 1.09,
                    "penalties": 6,
                    "penaltyGoals": 2,
                    "penaltyGoalsAttempts": 2,
                    "points": 20,
                    "pointsConceded": 12,
                    "possession": 50,
                    "scrumWins": 3,
                    "supports": 77,
                    "tackleBreaks": 24,
                    "tackles": 302,
                    "sets": 41,
                    "tries": 3,
                    "triesConceded": 3,
                    "tryAssists": 3,
                    "tryCause": 5,
                    "hitupRunMeters": 663,
                    "evasionRuns": 53,
                    "evasionRunMetres": 472,
                    "dummyHalfRunMetres": 120,
                    "ptbTotal": 132,
                    "twoManTackles": 71,
                    "threeManTackles": 46,
                    "fourManPlusTackles": 6,
                    "tryScoringPercentage": 10.34,
                    "shiftsLeft": 10,
                    "shiftsRight": 6,
                    "receipts": 355,
                    "forcedDropOutKicker": 2,
                    "chipKick": 3,
                    "crossFieldKick": 1,
                    "postContactMetres": 520,
                    "dummyPasses": 15,
                    "kickPressures": 17,
                    "lineEngagedRuns": 5,
                    "ptbOneToTwo": 11,
                    "ptbTwoToThree": 27,
                    "ptbThreeToFour": 55,
                    "ptbFourToFive": 28,
                    "ptbFivePlus": 11,
                    "interchangeUsed": 7,
                    "interchangeLeft": 1,
                    "doubles": 50,
                    "longKicksSpace": 6,
                    "effectiveTacklePercentage": 87.8,
                    "ptbPenalties": 6,
                    "averageSetDistance": 34.2,
                    "completeSets1stHalf": 18,
                    "completeSets2ndHalf": 11,
                    "completionPercentage1stHalf": 78.26,
                    "completionPercentage2ndHalf": 61.11,
                    "incompleteSets1stHalf": 5,
                    "incompleteSets2ndHalf": 7,
                    "incompletionPercentage1stHalf": 21.74,
                    "incompletionPercentage2ndHalf": 38.89
                },
                "teamHexColour": "4b9ad4",
                "teamHexColour2": "000000"
            },
            {
                "score": {
                    "points": 12,
                    "tries": 3
                },
                "team1stHalfScore": 4,
                "team2ndHalfScore": 8,
                "teamAbbr": "MAN",
                "teamFinalScore": 12,
                "teamFullTimeScore": 12,
                "teamHalfTimeScore": 4,
                "teamId": 500002,
                "teamLineup": {
                    "teamLineUpStatusID": 4,
                    "teamLineUpStatus": "Final",
                    "injuriesAndSuspensions": {
                        "injury": [],
                        "suspension": []
                    },
                    "insAndOuts": {
                        "inOut": [
                            {
                                "inOut": "Out",
                                "playerFirstName": "Addin",
                                "playerId": "500449",
                                "playerLastName": "Fonua-Blake",
                                "playerName": "Addin Fonua-Blake"
                            },
                            {
                                "inOut": "In",
                                "playerFirstName": "Brett",
                                "playerId": "500018",
                                "playerLastName": "Stewart",
                                "playerName": "Brett Stewart"
                            },
                            {
                                "inOut": "In",
                                "playerFirstName": "Jamie",
                                "playerId": "500032",
                                "playerLastName": "Buhrer",
                                "playerName": "Jamie Buhrer"
                            },
                            {
                                "inOut": "In",
                                "playerFirstName": "Josh",
                                "playerId": "501261",
                                "playerLastName": "Starling",
                                "playerName": "Josh Starling"
                            },
                            {
                                "inOut": "Out",
                                "playerFirstName": "Martin",
                                "playerId": "500960",
                                "playerLastName": "Taupau",
                                "playerName": "Martin Taupau"
                            },
                            {
                                "inOut": "Out",
                                "playerFirstName": "Tom",
                                "playerId": "500033",
                                "playerLastName": "Symonds",
                                "playerName": "Tom Symonds"
                            }
                        ]
                    },
                    "teamPlayer": [
                        {
                            "playerFirstName": "Brett",
                            "playerId": 500018,
                            "playerLastName": "Stewart",
                            "playerName": "Brett Stewart",
                            "playerPosition": "Fullback",
                            "playerPositionId": 500001,
                            "playerStats": {
                                "allRunMetres": 91,
                                "allRuns": 12,
                                "bombKicksNotDefused": 1,
                                "dummyHalfRuns": 2,
                                "fantasyPointsTotal": 19,
                                "kickReturnMetres": 18,
                                "kickReturns": 2,
                                "kicksNotDefused": 1,
                                "linebreakAssists": 1,
                                "mins": 80,
                                "missedTackles": 2,
                                "offloads": 2,
                                "passes": 14,
                                "passesPerRun": 1.17,
                                "penalties": 1,
                                "supports": 8,
                                "tackleBreaks": 1,
                                "tackles": 2,
                                "tryAssists": 1,
                                "tryCause": 1,
                                "evasionRuns": 8,
                                "evasionRunMetres": 62,
                                "dummyHalfRunMetres": 11,
                                "ptbAll": 8,
                                "receipts": 24,
                                "postContactMetres": 19,
                                "dummyPasses": 3,
                                "lineEngagedRuns": 2,
                                "ptbThreeToFour": 2,
                                "ptbFourToFive": 3,
                                "ptbFivePlus": 3,
                                "effectiveTacklePercentage": 50,
                                "generalPlayPenalties": 1
                            },
                            "playerTookTheField": true,
                            "shirtNum": 20,
                            "playerFirstInitial": "B",
                            "playerPositionAbbrev": "FB",
                            "onTheField": true,
                            "fantasyPrice": 147000,
                            "fantasySeasonPriceChange": -89000
                        },
                        {
                            "playerFirstName": "Matthew",
                            "playerId": 501025,
                            "playerLastName": "Wright",
                            "playerName": "Matthew Wright",
                            "playerPosition": "Winger 1",
                            "playerPositionId": 500002,
                            "playerStats": {
                                "allRunMetres": 104,
                                "allRuns": 11,
                                "bombKicksDefused": 1,
                                "bombKicksNotDefused": 1,
                                "decoys": 1,
                                "errors": 1,
                                "fantasyPointsTotal": 19,
                                "hitUps": 1,
                                "ineffectiveTackles": 1,
                                "kickReturnMetres": 46,
                                "kickReturns": 3,
                                "kicksDefused": 1,
                                "kicksNotDefused": 1,
                                "mins": 80,
                                "passes": 3,
                                "passesPerRun": 0.27,
                                "oneOnOneTackles": 2,
                                "supports": 5,
                                "tackleBreaks": 1,
                                "tackles": 7,
                                "tryCause": 1,
                                "hitupRunMeters": 11,
                                "evasionRuns": 7,
                                "evasionRunMetres": 47,
                                "ptbAll": 9,
                                "receipts": 14,
                                "postContactMetres": 35,
                                "ptbOneToTwo": 1,
                                "ptbTwoToThree": 2,
                                "ptbThreeToFour": 4,
                                "ptbFivePlus": 2,
                                "doubles": 1,
                                "effectiveTacklePercentage": 87.5
                            },
                            "playerTookTheField": true,
                            "shirtNum": 2,
                            "playerFirstInitial": "M",
                            "playerPositionAbbrev": "WG",
                            "onTheField": true
                        },
                        {
                            "playerFirstName": "Jamie",
                            "playerId": 500020,
                            "playerLastName": "Lyon",
                            "playerName": "Jamie Lyon",
                            "playerPosition": "Centre 1",
                            "playerPositionId": 500003,
                            "playerStats": {
                                "allRunMetres": 33,
                                "allRuns": 6,
                                "bombKicks": 1,
                                "bombKickMetres": 22,
                                "conversionsAttempts": 3,
                                "conversionsMissed": 3,
                                "decoys": 1,
                                "dummyHalfRuns": 1,
                                "errors": 1,
                                "fantasyPointsTotal": 35,
                                "allGoalsMissed": 3,
                                "allGoalsAttempted": 3,
                                "ineffectiveTackles": 1,
                                "interceptedPass": 1,
                                "kickMetres": 137,
                                "kicks": 5,
                                "kicksDefused": 1,
                                "mins": 80,
                                "missedTackles": 2,
                                "offloads": 1,
                                "passes": 18,
                                "passesPerRun": 3,
                                "oneOnOneTackles": 2,
                                "supports": 5,
                                "tackleBreaks": 2,
                                "tackles": 23,
                                "tryCause": 2,
                                "evasionRuns": 5,
                                "evasionRunMetres": 22,
                                "dummyHalfRunMetres": 11,
                                "ptbAll": 4,
                                "receipts": 26,
                                "chipKick": 1,
                                "postContactMetres": 21,
                                "dummyPasses": 2,
                                "kickPressures": 2,
                                "lineEngagedRuns": 1,
                                "ptbThreeToFour": 1,
                                "ptbFourToFive": 3,
                                "longKicksSpace": 1,
                                "effectiveTacklePercentage": 88.5
                            },
                            "playerTookTheField": true,
                            "shirtNum": 3,
                            "playerFirstInitial": "J",
                            "playerPositionAbbrev": "CT",
                            "onTheField": true,
                            "fantasyPrice": 282000,
                            "fantasySeasonPriceChange": -81000,
                            "fantasyRoundPriceChange": -3000
                        },
                        {
                            "playerFirstName": "Tom",
                            "playerId": 501505,
                            "playerLastName": "Trbojevic",
                            "playerName": "Tom Trbojevic",
                            "playerPosition": "Centre 2",
                            "playerPositionId": 500004,
                            "playerStats": {
                                "allRunMetres": 179,
                                "allRuns": 21,
                                "decoys": 4,
                                "dummyHalfRuns": 2,
                                "errors": 2,
                                "fantasyPointsTotal": 49,
                                "hitUps": 4,
                                "linebreaks": 1,
                                "mins": 80,
                                "missedTackles": 2,
                                "passes": 7,
                                "passesPerRun": 0.33,
                                "oneOnOneTackles": 3,
                                "penalties": 1,
                                "points": 4,
                                "supports": 10,
                                "tackleBreaks": 4,
                                "tackles": 13,
                                "tries": 1,
                                "tryCause": 1,
                                "trySaves": 1,
                                "hitupRunMeters": 37,
                                "evasionRuns": 15,
                                "evasionRunMetres": 132,
                                "dummyHalfRunMetres": 10,
                                "ptbAll": 18,
                                "receipts": 26,
                                "postContactMetres": 70,
                                "kickPressures": 1,
                                "ptbZeroToOne": 1,
                                "ptbOneToTwo": 1,
                                "ptbTwoToThree": 8,
                                "ptbThreeToFour": 6,
                                "ptbFourToFive": 2,
                                "doubles": 2,
                                "effectiveTacklePercentage": 86.7,
                                "offsidePenalties": 1
                            },
                            "playerTookTheField": true,
                            "shirtNum": 1,
                            "playerFirstInitial": "T",
                            "playerPositionAbbrev": "CT",
                            "onTheField": true,
                            "fantasyPrice": 327000,
                            "fantasySeasonPriceChange": 62000,
                            "fantasyRoundPriceChange": -5000
                        },
                        {
                            "playerFirstName": "Brayden",
                            "playerId": 501255,
                            "playerLastName": "Wiliame",
                            "playerName": "Brayden Wiliame",
                            "playerPosition": "Winger 2",
                            "playerPositionId": 500005,
                            "playerStats": {
                                "allRunMetres": 109,
                                "allRuns": 12,
                                "bombKicksDefused": 2,
                                "decoys": 1,
                                "errors": 1,
                                "fantasyPointsTotal": 32,
                                "hitUps": 1,
                                "kickReturnMetres": 43,
                                "kickReturns": 4,
                                "kicksDefused": 2,
                                "linebreaks": 1,
                                "mins": 80,
                                "passes": 1,
                                "passesPerRun": 0.08,
                                "points": 4,
                                "supports": 11,
                                "tackleBreaks": 3,
                                "tackles": 1,
                                "tries": 1,
                                "tryCause": 1,
                                "hitupRunMeters": 10,
                                "evasionRuns": 7,
                                "evasionRunMetres": 56,
                                "ptbAll": 12,
                                "receipts": 16,
                                "postContactMetres": 42,
                                "ptbTwoToThree": 4,
                                "ptbThreeToFour": 6,
                                "ptbFourToFive": 2,
                                "effectiveTacklePercentage": 100
                            },
                            "playerTookTheField": true,
                            "shirtNum": 5,
                            "playerFirstInitial": "B",
                            "playerPositionAbbrev": "WG",
                            "onTheField": true,
                            "fantasyPrice": 140000,
                            "fantasySeasonPriceChange": -4000,
                            "fantasyRoundPriceChange": 4000
                        },
                        {
                            "playerFirstName": "Dylan",
                            "playerId": 500083,
                            "playerLastName": "Walker",
                            "playerName": "Dylan Walker",
                            "playerPosition": "Five-Eighth",
                            "playerPositionId": 500006,
                            "playerStats": {
                                "allRunMetres": 153,
                                "allRuns": 14,
                                "decoys": 1,
                                "dummyHalfRuns": 2,
                                "fantasyPointsTotal": 35,
                                "hitUps": 1,
                                "mins": 80,
                                "missedTackles": 2,
                                "passes": 2,
                                "passesPerRun": 0.14,
                                "oneOnOneTackles": 1,
                                "penalties": 1,
                                "supports": 5,
                                "tackleBreaks": 1,
                                "tackles": 23,
                                "tryCause": 1,
                                "hitupRunMeters": 18,
                                "evasionRuns": 11,
                                "evasionRunMetres": 120,
                                "dummyHalfRunMetres": 15,
                                "ptbAll": 14,
                                "receipts": 15,
                                "postContactMetres": 48,
                                "kickPressures": 1,
                                "ptbOneToTwo": 2,
                                "ptbTwoToThree": 3,
                                "ptbThreeToFour": 7,
                                "ptbFourToFive": 1,
                                "ptbFivePlus": 1,
                                "doubles": 3,
                                "effectiveTacklePercentage": 92,
                                "ptbPenalties": 1
                            },
                            "playerTookTheField": true,
                            "shirtNum": 6,
                            "playerFirstInitial": "D",
                            "playerPositionAbbrev": "FE",
                            "onTheField": true,
                            "fantasyPrice": 228000,
                            "fantasySeasonPriceChange": -104000,
                            "fantasyRoundPriceChange": -29000
                        },
                        {
                            "playerFirstName": "Daly",
                            "playerId": 500024,
                            "playerLastName": "Cherry-Evans",
                            "playerName": "Daly Cherry-Evans",
                            "playerPosition": "Halfback",
                            "playerPositionId": 500007,
                            "playerStats": {
                                "allRunMetres": 66,
                                "allRuns": 8,
                                "bombKicks": 7,
                                "bombKickMetres": 159,
                                "dummyHalfRuns": 2,
                                "fantasyPointsTotal": 66,
                                "ineffectiveTackles": 1,
                                "kickMetres": 407,
                                "kicks": 18,
                                "kicksDefused": 1,
                                "lineDropouts": 2,
                                "mins": 80,
                                "missedTackles": 1,
                                "offloads": 1,
                                "passes": 51,
                                "passesPerRun": 6.38,
                                "oneOnOneTackles": 4,
                                "supports": 6,
                                "tackleBreaks": 4,
                                "tackles": 22,
                                "tryAssists": 1,
                                "evasionRuns": 6,
                                "evasionRunMetres": 48,
                                "dummyHalfRunMetres": 18,
                                "ptbAll": 2,
                                "receipts": 73,
                                "grubberKick": 3,
                                "crossFieldKick": 4,
                                "postContactMetres": 7,
                                "dummyPasses": 8,
                                "kickPressures": 1,
                                "lineEngagedRuns": 3,
                                "ptbFourToFive": 1,
                                "ptbFivePlus": 1,
                                "doubles": 3,
                                "longKicksSpace": 1,
                                "effectiveTacklePercentage": 91.7
                            },
                            "playerTookTheField": true,
                            "shirtNum": 7,
                            "playerFirstInitial": "D",
                            "playerPositionAbbrev": "HB",
                            "onTheField": true,
                            "fantasyPrice": 430000,
                            "fantasySeasonPriceChange": -52000,
                            "fantasyRoundPriceChange": 5000
                        },
                        {
                            "playerFirstName": "Darcy",
                            "playerId": 500677,
                            "playerLastName": "Lussick",
                            "playerName": "Darcy Lussick",
                            "playerPosition": "Prop 1",
                            "playerPositionId": 500008,
                            "playerStats": {
                                "allRunMetres": 65,
                                "allRuns": 7,
                                "decoys": 1,
                                "fantasyPointsTotal": 24,
                                "hitUps": 7,
                                "ineffectiveTackles": 1,
                                "mins": 39,
                                "missedTackles": 3,
                                "offloads": 1,
                                "passes": 1,
                                "passesPerRun": 0.14,
                                "penalties": 2,
                                "supports": 3,
                                "tackleBreaks": 1,
                                "tackles": 23,
                                "hitupRunMeters": 65,
                                "ptbAll": 6,
                                "receipts": 8,
                                "postContactMetres": 31,
                                "ptbZeroToOne": 1,
                                "ptbTwoToThree": 1,
                                "ptbThreeToFour": 3,
                                "ptbFivePlus": 1,
                                "doubles": 1,
                                "effectiveTacklePercentage": 85.2,
                                "ptbPenalties": 2
                            },
                            "playerTookTheField": true,
                            "shirtNum": 8,
                            "playerFirstInitial": "D",
                            "playerPositionAbbrev": "PR",
                            "fantasyPrice": 214000,
                            "fantasySeasonPriceChange": -39000,
                            "fantasyRoundPriceChange": -8000
                        },
                        {
                            "playerFirstName": "Matt",
                            "playerId": 501005,
                            "playerLastName": "Parcell",
                            "playerName": "Matt Parcell",
                            "playerPosition": "Hooker",
                            "playerPositionId": 500009,
                            "playerStats": {
                                "allRunMetres": 41,
                                "allRuns": 6,
                                "dummyHalfRuns": 4,
                                "fantasyPointsTotal": 52,
                                "hitUps": 1,
                                "ineffectiveTackles": 2,
                                "mins": 80,
                                "offloads": 1,
                                "passes": 84,
                                "passesPerRun": 14,
                                "oneOnOneTackles": 2,
                                "penalties": 1,
                                "supports": 3,
                                "tackleBreaks": 3,
                                "tackles": 39,
                                "hitupRunMeters": 2,
                                "evasionRuns": 1,
                                "evasionRunMetres": 6,
                                "dummyHalfRunMetres": 33,
                                "ptbAll": 4,
                                "receipts": 89,
                                "postContactMetres": 18,
                                "dummyPasses": 2,
                                "kickPressures": 1,
                                "lineEngagedRuns": 1,
                                "ptbTwoToThree": 1,
                                "ptbThreeToFour": 2,
                                "ptbFivePlus": 1,
                                "doubles": 8,
                                "effectiveTacklePercentage": 95.1,
                                "offsidePenalties": 1
                            },
                            "playerTookTheField": true,
                            "shirtNum": 9,
                            "playerFirstInitial": "M",
                            "playerPositionAbbrev": "HK",
                            "onTheField": true,
                            "fantasyPrice": 407000,
                            "fantasySeasonPriceChange": 242000,
                            "fantasyRoundPriceChange": 16000
                        },
                        {
                            "playerFirstName": "Brenton",
                            "playerId": 500025,
                            "playerLastName": "Lawrence",
                            "playerName": "Brenton Lawrence",
                            "playerPosition": "Prop 2",
                            "playerPositionId": 500010,
                            "playerStats": {
                                "allRunMetres": 96,
                                "allRuns": 10,
                                "decoys": 4,
                                "dummyHalfRuns": 1,
                                "errors": 1,
                                "fantasyPointsTotal": 28,
                                "hitUps": 9,
                                "ineffectiveTackles": 1,
                                "mins": 33,
                                "missedTackles": 1,
                                "offloads": 1,
                                "passes": 1,
                                "passesPerRun": 0.1,
                                "penalties": 1,
                                "supports": 4,
                                "tackleBreaks": 2,
                                "tackles": 17,
                                "hitupRunMeters": 87,
                                "dummyHalfRunMetres": 9,
                                "ptbAll": 8,
                                "receipts": 11,
                                "postContactMetres": 44,
                                "ptbTwoToThree": 3,
                                "ptbThreeToFour": 3,
                                "ptbFourToFive": 1,
                                "ptbFivePlus": 1,
                                "doubles": 2,
                                "effectiveTacklePercentage": 89.5,
                                "ptbPenalties": 1
                            },
                            "playerTookTheField": true,
                            "shirtNum": 16,
                            "playerFirstInitial": "B",
                            "playerPositionAbbrev": "PR",
                            "onTheField": true,
                            "fantasyPrice": 308000,
                            "fantasySeasonPriceChange": 106000,
                            "fantasyRoundPriceChange": 4000
                        },
                        {
                            "playerFirstName": "Lewis",
                            "playerId": 500341,
                            "playerLastName": "Brown",
                            "playerName": "Lewis Brown",
                            "playerPosition": "2nd Row 1",
                            "playerPositionId": 500011,
                            "playerStats": {
                                "allRunMetres": 103,
                                "allRuns": 13,
                                "decoys": 8,
                                "dummyHalfRuns": 1,
                                "fantasyPointsTotal": 45,
                                "hitUps": 11,
                                "ineffectiveTackles": 2,
                                "linebreakAssists": 1,
                                "mins": 80,
                                "missedTackles": 4,
                                "offloads": 1,
                                "passes": 8,
                                "passesPerRun": 0.62,
                                "oneOnOneTackles": 4,
                                "supports": 7,
                                "tackleBreaks": 1,
                                "tackles": 26,
                                "tryAssists": 1,
                                "trySaves": 1,
                                "hitupRunMeters": 87,
                                "evasionRuns": 1,
                                "evasionRunMetres": 3,
                                "dummyHalfRunMetres": 13,
                                "ptbAll": 12,
                                "receipts": 21,
                                "postContactMetres": 43,
                                "dummyPasses": 2,
                                "kickPressures": 2,
                                "lineEngagedRuns": 1,
                                "ptbTwoToThree": 4,
                                "ptbThreeToFour": 4,
                                "ptbFourToFive": 4,
                                "doubles": 3,
                                "effectiveTacklePercentage": 81.2
                            },
                            "playerTookTheField": true,
                            "shirtNum": 11,
                            "playerFirstInitial": "L",
                            "playerPositionAbbrev": "2R",
                            "onTheField": true,
                            "fantasyPrice": 182000,
                            "fantasySeasonPriceChange": -127000,
                            "fantasyRoundPriceChange": -20000
                        },
                        {
                            "playerFirstName": "Jamie",
                            "playerId": 500032,
                            "playerLastName": "Buhrer",
                            "playerName": "Jamie Buhrer",
                            "playerPosition": "2nd Row 2",
                            "playerPositionId": 500012,
                            "playerStats": {
                                "allRunMetres": 68,
                                "allRuns": 8,
                                "decoys": 2,
                                "fantasyPointsTotal": 45,
                                "hitUps": 7,
                                "ineffectiveTackles": 3,
                                "kickDead": 1,
                                "kicks": 1,
                                "mins": 65,
                                "missedTackles": 4,
                                "offloads": 1,
                                "passes": 2,
                                "passesPerRun": 0.25,
                                "penalties": 1,
                                "points": 4,
                                "supports": 8,
                                "tackles": 39,
                                "tries": 1,
                                "hitupRunMeters": 62,
                                "evasionRuns": 1,
                                "evasionRunMetres": 6,
                                "ptbAll": 6,
                                "receipts": 10,
                                "grubberKick": 1,
                                "postContactMetres": 28,
                                "kickPressures": 3,
                                "lineEngagedRuns": 1,
                                "ptbTwoToThree": 1,
                                "ptbThreeToFour": 3,
                                "ptbFourToFive": 1,
                                "ptbFivePlus": 1,
                                "doubles": 9,
                                "effectiveTacklePercentage": 84.8,
                                "ptbPenalties": 1
                            },
                            "playerTookTheField": true,
                            "shirtNum": 12,
                            "playerFirstInitial": "J",
                            "playerPositionAbbrev": "2R",
                            "fantasyPrice": 311000,
                            "fantasySeasonPriceChange": -24000
                        },
                        {
                            "playerFirstName": "Jake",
                            "playerId": 500751,
                            "playerLastName": "Trbojevic",
                            "playerName": "Jake Trbojevic",
                            "playerPosition": "Lock",
                            "playerPositionId": 500013,
                            "playerStats": {
                                "allRunMetres": 125,
                                "allRuns": 15,
                                "decoys": 7,
                                "fantasyPointsTotal": 59,
                                "hitUps": 14,
                                "ineffectiveTackles": 2,
                                "mins": 80,
                                "offloads": 1,
                                "passes": 5,
                                "passesPerRun": 0.33,
                                "oneOnOneTackles": 1,
                                "supports": 15,
                                "tackleBreaks": 1,
                                "tackles": 37,
                                "trySaves": 1,
                                "hitupRunMeters": 122,
                                "evasionRuns": 1,
                                "evasionRunMetres": 3,
                                "ptbAll": 13,
                                "receipts": 19,
                                "postContactMetres": 38,
                                "dummyPasses": 1,
                                "kickPressures": 4,
                                "lineEngagedRuns": 1,
                                "ptbOneToTwo": 2,
                                "ptbTwoToThree": 4,
                                "ptbThreeToFour": 6,
                                "ptbFourToFive": 1,
                                "doubles": 9,
                                "effectiveTacklePercentage": 94.9
                            },
                            "playerTookTheField": true,
                            "shirtNum": 13,
                            "playerFirstInitial": "J",
                            "playerPositionAbbrev": "LK",
                            "onTheField": true,
                            "fantasyPrice": 477000,
                            "fantasySeasonPriceChange": 129000,
                            "fantasyRoundPriceChange": -3000
                        },
                        {
                            "playerFirstName": "Nate",
                            "playerId": 500075,
                            "playerLastName": "Myles",
                            "playerName": "Nate Myles",
                            "playerPosition": "Interchange",
                            "playerPositionId": 500014,
                            "playerStats": {
                                "allRunMetres": 40,
                                "allRuns": 5,
                                "decoys": 1,
                                "fantasyPointsTotal": 22,
                                "hitUps": 5,
                                "mins": 23,
                                "missedTackles": 1,
                                "oneOnOneTackles": 1,
                                "supports": 2,
                                "tackles": 20,
                                "hitupRunMeters": 40,
                                "ptbAll": 5,
                                "receipts": 5,
                                "postContactMetres": 13,
                                "kickPressures": 2,
                                "ptbOneToTwo": 1,
                                "ptbThreeToFour": 4,
                                "doubles": 5,
                                "effectiveTacklePercentage": 95.2
                            },
                            "playerTookTheField": true,
                            "shirtNum": 10,
                            "playerFirstInitial": "N",
                            "playerPositionAbbrev": "INT",
                            "fantasyPrice": 316000,
                            "fantasySeasonPriceChange": -24000,
                            "fantasyRoundPriceChange": -10000
                        },
                        {
                            "playerFirstName": "Blake",
                            "playerId": 501035,
                            "playerLastName": "Leary",
                            "playerName": "Blake Leary",
                            "playerPosition": "Interchange",
                            "playerPositionId": 500014,
                            "playerStats": {
                                "allRunMetres": 22,
                                "allRuns": 2,
                                "fantasyPointsTotal": 16,
                                "hitUps": 2,
                                "ineffectiveTackles": 1,
                                "mins": 15,
                                "missedTackles": 1,
                                "tackleBreaks": 1,
                                "tackles": 13,
                                "tryCause": 1,
                                "hitupRunMeters": 22,
                                "ptbAll": 2,
                                "receipts": 2,
                                "postContactMetres": 12,
                                "ptbOneToTwo": 1,
                                "ptbThreeToFour": 1,
                                "doubles": 6,
                                "effectiveTacklePercentage": 86.7
                            },
                            "playerTookTheField": true,
                            "shirtNum": 14,
                            "playerFirstInitial": "B",
                            "playerPositionAbbrev": "INT",
                            "onTheField": true,
                            "fantasyPrice": 245000,
                            "fantasySeasonPriceChange": -106000,
                            "fantasyRoundPriceChange": -13000
                        },
                        {
                            "playerFirstName": "Josh",
                            "playerId": 501261,
                            "playerLastName": "Starling",
                            "playerName": "Josh Starling",
                            "playerPosition": "Interchange",
                            "playerPositionId": 500014,
                            "playerStats": {
                                "allRunMetres": 61,
                                "allRuns": 8,
                                "decoys": 4,
                                "errors": 1,
                                "fantasyPointsTotal": 16,
                                "hitUps": 5,
                                "ineffectiveTackles": 2,
                                "kickReturnMetres": 18,
                                "kickReturns": 2,
                                "mins": 28,
                                "missedTackles": 1,
                                "passes": 3,
                                "passesPerRun": 0.38,
                                "supports": 2,
                                "tackles": 14,
                                "hitupRunMeters": 40,
                                "evasionRuns": 1,
                                "evasionRunMetres": 3,
                                "ptbAll": 7,
                                "receipts": 10,
                                "postContactMetres": 24,
                                "dummyPasses": 1,
                                "lineEngagedRuns": 1,
                                "ptbTwoToThree": 2,
                                "ptbThreeToFour": 5,
                                "doubles": 5,
                                "effectiveTacklePercentage": 82.4
                            },
                            "playerTookTheField": true,
                            "shirtNum": 15,
                            "playerFirstInitial": "J",
                            "playerPositionAbbrev": "INT",
                            "fantasyPrice": 252000,
                            "fantasySeasonPriceChange": 55000
                        },
                        {
                            "playerFirstName": "Siosaia",
                            "playerId": 501337,
                            "playerLastName": "Vave",
                            "playerName": "Siosaia Vave",
                            "playerPosition": "Interchange",
                            "playerPositionId": 500014,
                            "playerStats": {
                                "allRunMetres": 113,
                                "allRuns": 12,
                                "decoys": 2,
                                "fantasyPointsTotal": 30,
                                "hitUps": 7,
                                "ineffectiveTackles": 1,
                                "kickReturnMetres": 28,
                                "kickReturns": 2,
                                "mins": 37,
                                "offloads": 2,
                                "passes": 5,
                                "passesPerRun": 0.42,
                                "penalties": 1,
                                "supports": 2,
                                "tackleBreaks": 2,
                                "tackles": 11,
                                "hitupRunMeters": 67,
                                "evasionRuns": 3,
                                "evasionRunMetres": 18,
                                "ptbAll": 7,
                                "receipts": 14,
                                "postContactMetres": 39,
                                "dummyPasses": 1,
                                "kickPressures": 2,
                                "lineEngagedRuns": 3,
                                "ptbOneToTwo": 1,
                                "ptbTwoToThree": 5,
                                "ptbThreeToFour": 1,
                                "effectiveTacklePercentage": 91.7,
                                "ptbPenalties": 1
                            },
                            "playerTookTheField": true,
                            "shirtNum": 17,
                            "playerFirstInitial": "S",
                            "playerPositionAbbrev": "INT",
                            "onTheField": true,
                            "fantasyPrice": 233000,
                            "fantasySeasonPriceChange": 77000,
                            "fantasyRoundPriceChange": -7000
                        }
                    ]
                },
                "teamName": "Manly-Warringah Sea Eagles",
                "teamNickName": "Sea Eagles",
                "teamStats": {
                    "allRunMetres": 1467,
                    "allRuns": 170,
                    "bombKicks": 8,
                    "bombKickMetres": 182,
                    "bombKicksDefused": 3,
                    "bombKicksNotDefused": 2,
                    "completeSets": 31,
                    "completionPercentage": 82,
                    "conversionsAttempts": 3,
                    "conversionsMissed": 3,
                    "decoys": 37,
                    "dummyHalfRuns": 15,
                    "errors": 7,
                    "allGoalsAttempted": 3,
                    "allGoalsMissed": 3,
                    "hitUps": 75,
                    "incompleteSets": 7,
                    "ineffectiveTackles": 18,
                    "interceptedPass": 1,
                    "kickDead": 1,
                    "kickMetres": 544,
                    "kickReturnMetres": 153,
                    "kickReturns": 13,
                    "kicks": 24,
                    "kicksDefused": 5,
                    "kicksNotDefused": 2,
                    "lineDropouts": 2,
                    "linebreakAssists": 2,
                    "linebreaks": 2,
                    "missedTackles": 24,
                    "offloads": 12,
                    "oneOnOneTackles": 20,
                    "passes": 205,
                    "passesPerRun": 1.21,
                    "penalties": 9,
                    "points": 12,
                    "pointsConceded": 20,
                    "possession": 50,
                    "scrumWins": 8,
                    "supports": 96,
                    "tackleBreaks": 27,
                    "tackles": 330,
                    "sets": 38,
                    "tries": 3,
                    "triesConceded": 3,
                    "tryAssists": 3,
                    "tryCause": 8,
                    "trySaves": 3,
                    "hitupRunMeters": 670,
                    "evasionRuns": 67,
                    "evasionRunMetres": 524,
                    "dummyHalfRunMetres": 120,
                    "ptbTotal": 137,
                    "twoManTackles": 74,
                    "threeManTackles": 43,
                    "tryScoringPercentage": 9.68,
                    "shiftsLeft": 13,
                    "shiftsRight": 10,
                    "receipts": 383,
                    "chipKick": 1,
                    "grubberKick": 4,
                    "crossFieldKick": 4,
                    "postContactMetres": 531,
                    "dummyPasses": 20,
                    "kickPressures": 19,
                    "lineEngagedRuns": 14,
                    "ptbZeroToOne": 2,
                    "ptbOneToTwo": 9,
                    "ptbTwoToThree": 38,
                    "ptbThreeToFour": 58,
                    "ptbFourToFive": 19,
                    "ptbFivePlus": 11,
                    "interchangeUsed": 7,
                    "interchangeLeft": 1,
                    "doubles": 57,
                    "longKicksSpace": 2,
                    "effectiveTacklePercentage": 88.7,
                    "ptbPenalties": 6,
                    "generalPlayPenalties": 1,
                    "offsidePenalties": 2,
                    "averageSetDistance": 38.6,
                    "completeSets1stHalf": 16,
                    "completeSets2ndHalf": 15,
                    "completionPercentage1stHalf": 84.21,
                    "completionPercentage2ndHalf": 78.95,
                    "incompleteSets1stHalf": 3,
                    "incompleteSets2ndHalf": 4,
                    "incompletionPercentage1stHalf": 15.79,
                    "incompletionPercentage2ndHalf": 21.05
                },
                "teamHexColour": "610a35",
                "teamHexColour2": "b4b4be"
            }
        ]
    }
}