{
    "competitionId": 111,
    "competitionName": "NRL Telstra Premiership",
    "gameId": 20151111960,
    "gameInfo": {
        "assistantReferee1Id": 500040,
        "numberOfPeriods": 2,
        "assistantReferee1Name": "Nick Beashel",
        "assistantReferee2Id": 500070,
        "assistantReferee2Name": "Matt Noyen",
        "gameDate": "2015-07-19",
        "gameHashTag": "#NRLRoostersWarriors",
        "gameNumber": 6,
        "gameSeconds": 4800,
        "gameMinutes": "80:00",
        "gameTime": "1:20:00",
        "groundConditionId": 1,
        "groundConditionName": "N/A",
        "referee1Id": 500002,
        "referee1Name": "Matt Cecchin",
        "referee2Id": 500067,
        "referee2Name": "Grant Atkins",
        "startTime": "2015-07-19T14:00:00",
        "startTimeUTC": "2015-07-19T04:00:00Z",
        "venueId": 500001,
        "venueName": "Allianz Stadium",
        "videoReferee1Id": 500232,
        "videoReferee1Name": "Luke Patten",
        "videoReferee2Id": 500030,
        "videoReferee2Name": "Steve Clark"
    },
    "gameState": "Final",
    "gameStateId": 8,
    "roundId": 19,
    "seasonId": 2015,
    "teams": {
        "teamsMatch": [
            {
                "isHomeTeam": true,
                "score": {
                    "conversions": 4,
                    "points": 24,
                    "tries": 4
                },
                "team1stHalfScore": 18,
                "team2ndHalfScore": 6,
                "teamAbbr": "SYD",
                "teamFinalScore": 24,
                "teamFullTimeScore": 24,
                "teamHalfTimeScore": 18,
                "teamId": 500001,
                "teamLineup": {
                    "injuriesAndSuspensions": {
                        "injury": [],
                        "suspension": [
                            {
                                "playerFirstName": "Willis",
                                "playerId": 500208,
                                "playerLastName": "Meehan",
                                "playerName": "Willis Meehan",
                                "suspensionDescription": "Suspension, Indefinite"
                            }
                        ]
                    },
                    "insAndOuts": {
                        "inOut": [
                            {
                                "inOut": "In",
                                "playerFirstName": "Aidan",
                                "playerId": "500011",
                                "playerLastName": "Guerra",
                                "playerName": "Aidan Guerra"
                            },
                            {
                                "inOut": "Out",
                                "playerFirstName": "Boyd",
                                "playerId": "500013",
                                "playerLastName": "Cordner",
                                "playerName": "Boyd Cordner"
                            },
                            {
                                "inOut": "In",
                                "playerFirstName": "Brendan",
                                "playerId": "500200",
                                "playerLastName": "Elliot",
                                "playerName": "Brendan Elliot"
                            },
                            {
                                "inOut": "Out",
                                "playerFirstName": "Shaun",
                                "playerId": "500004",
                                "playerLastName": "Kenny-Dowall",
                                "playerName": "Shaun Kenny-Dowall"
                            }
                        ]
                    },
                    "teamPlayer": [
                        {
                            "playerFirstName": "Roger",
                            "playerId": 500005,
                            "playerLastName": "Tuivasa-Sheck",
                            "playerName": "Roger Tuivasa-Sheck",
                            "playerPosition": "Fullback",
                            "playerPositionId": 500001,
                            "playerStats": {
                                "allRunMetres": 254,
                                "allRuns": 22,
                                "bombKicksDefused": 1,
                                "decoys": 2,
                                "errors": 1,
                                "fantasyPointsTotal": 66,
                                "kickReturnMetres": 132,
                                "kickReturns": 9,
                                "kicksDefused": 3,
                                "mins": 80,
                                "missedTackles": 1,
                                "offloads": 1,
                                "oneOnOneTackles": 3,
                                "points": 4,
                                "supports": 8,
                                "tackleBreaks": 9,
                                "tackles": 5,
                                "tries": 1,
                                "evasionRuns": 13,
                                "evasionRunMetres": 122,
                                "ptbFast": 20,
                                "ptbNeutral": 75,
                                "ptbSlow": 5,
                                "ptbAll": 20
                            },
                            "playerTookTheField": true,
                            "shirtNum": 1
                        },
                        {
                            "playerFirstName": "Daniel",
                            "playerId": 500002,
                            "playerLastName": "Tupou",
                            "playerName": "Daniel Tupou",
                            "playerPosition": "Winger 1",
                            "playerPositionId": 500002,
                            "playerStats": {
                                "allRunMetres": 202,
                                "allRuns": 16,
                                "bombKicksDefused": 1,
                                "dummyHalfRuns": 1,
                                "errors": 1,
                                "fantasyPointsTotal": 21,
                                "kickReturnMetres": 17,
                                "kickReturns": 2,
                                "kicksDefused": 1,
                                "mins": 80,
                                "missedTackles": 1,
                                "offloads": 1,
                                "oneOnOneTackles": 1,
                                "supports": 11,
                                "tackles": 2,
                                "evasionRuns": 13,
                                "evasionRunMetres": 184,
                                "dummyHalfRunMetres": 1,
                                "ptbFast": 28.57,
                                "ptbNeutral": 71.43,
                                "ptbAll": 14
                            },
                            "playerTookTheField": true,
                            "shirtNum": 2
                        },
                        {
                            "playerFirstName": "Michael",
                            "playerId": 500003,
                            "playerLastName": "Jennings",
                            "playerName": "Michael Jennings",
                            "playerPosition": "Centre 1",
                            "playerPositionId": 500003,
                            "playerStats": {
                                "allRunMetres": 130,
                                "allRuns": 12,
                                "fantasyPointsTotal": 37,
                                "ineffectiveTackles": 1,
                                "kickMetres": 4,
                                "kicks": 1,
                                "linebreakAssists": 1,
                                "mins": 80,
                                "missedTackles": 2,
                                "offloads": 1,
                                "oneOnOneTackles": 3,
                                "supports": 17,
                                "tackleBreaks": 2,
                                "tackles": 13,
                                "tryAssists": 1,
                                "evasionRuns": 12,
                                "evasionRunMetres": 130,
                                "ptbFast": 57.14,
                                "ptbNeutral": 42.86,
                                "ptbAll": 7
                            },
                            "playerTookTheField": true,
                            "shirtNum": 3
                        },
                        {
                            "playerFirstName": "Blake",
                            "playerId": 501569,
                            "playerLastName": "Ferguson",
                            "playerName": "Blake Ferguson",
                            "playerPosition": "Centre 2",
                            "playerPositionId": 500004,
                            "playerStats": {
                                "allRunMetres": 238,
                                "allRuns": 17,
                                "errors": 1,
                                "fantasyPointsTotal": 63,
                                "linebreaks": 3,
                                "mins": 80,
                                "missedTackles": 4,
                                "offloads": 1,
                                "oneOnOneTackles": 1,
                                "points": 4,
                                "supports": 4,
                                "tackleBreaks": 6,
                                "tackles": 10,
                                "tries": 1,
                                "evasionRuns": 17,
                                "evasionRunMetres": 238,
                                "ptbFast": 14.29,
                                "ptbNeutral": 78.57,
                                "ptbSlow": 7.14,
                                "ptbAll": 14
                            },
                            "playerTookTheField": true,
                            "shirtNum": 4
                        },
                        {
                            "playerFirstName": "Brendan",
                            "playerId": 500200,
                            "playerLastName": "Elliot",
                            "playerName": "Brendan Elliot",
                            "playerPosition": "Winger 2",
                            "playerPositionId": 500005,
                            "playerStats": {
                                "allRunMetres": 118,
                                "allRuns": 13,
                                "bombKicksDefused": 3,
                                "bombKicksNotDefused": 1,
                                "dummyHalfRuns": 1,
                                "fantasyPointsTotal": 35,
                                "kickReturnMetres": 20,
                                "kickReturns": 1,
                                "kicksDefused": 5,
                                "kicksNotDefused": 1,
                                "mins": 80,
                                "missedTackles": 2,
                                "supports": 11,
                                "tackleBreaks": 7,
                                "tackles": 2,
                                "evasionRuns": 11,
                                "evasionRunMetres": 88,
                                "dummyHalfRunMetres": 10,
                                "ptbFast": 20,
                                "ptbNeutral": 80,
                                "ptbAll": 15
                            },
                            "playerTookTheField": true,
                            "shirtNum": 21
                        },
                        {
                            "playerFirstName": "James",
                            "playerId": 500006,
                            "playerLastName": "Maloney",
                            "playerName": "James Maloney",
                            "playerPosition": "Five-eighth",
                            "playerPositionId": 500006,
                            "playerStats": {
                                "allRunMetres": 139,
                                "allRuns": 11,
                                "bombKicks": 5,
                                "bombKickMetres": 110,
                                "conversions": 4,
                                "conversionsAttempts": 4,
                                "decoys": 1,
                                "errors": 1,
                                "fantasyPointsTotal": 65,
                                "goalConversionRate": 100,
                                "allGoals": 4,
                                "allGoalsAttempted": 4,
                                "ineffectiveTackles": 1,
                                "kickMetres": 299,
                                "kicks": 11,
                                "lineDropouts": 2,
                                "linebreaks": 2,
                                "mins": 80,
                                "missedTackles": 6,
                                "oneOnOneTackles": 1,
                                "penalties": 1,
                                "points": 12,
                                "supports": 17,
                                "tackleBreaks": 4,
                                "tackles": 13,
                                "tries": 1,
                                "tryAssists": 1,
                                "evasionRuns": 11,
                                "evasionRunMetres": 139,
                                "ptbNeutral": 100,
                                "ptbAll": 4
                            },
                            "playerTookTheField": true,
                            "shirtNum": 6
                        },
                        {
                            "playerFirstName": "Mitchell",
                            "playerId": 500007,
                            "playerLastName": "Pearce",
                            "playerName": "Mitchell Pearce",
                            "playerPosition": "Halfback",
                            "playerPositionId": 500007,
                            "playerStats": {
                                "allRunMetres": 79,
                                "allRuns": 7,
                                "bombKicks": 1,
                                "bombKickMetres": 32,
                                "errors": 1,
                                "fantasyPointsTotal": 37,
                                "kickMetres": 124,
                                "kicks": 5,
                                "linebreakAssists": 1,
                                "linebreaks": 1,
                                "mins": 80,
                                "missedTackles": 7,
                                "oneOnOneTackles": 1,
                                "supports": 15,
                                "tackleBreaks": 1,
                                "tackles": 26,
                                "tryAssists": 1,
                                "evasionRuns": 7,
                                "evasionRunMetres": 79,
                                "ptbNeutral": 100,
                                "ptbAll": 3
                            },
                            "playerTookTheField": true,
                            "shirtNum": 7,
                            "isCaptain": true
                        },
                        {
                            "playerFirstName": "Jared",
                            "playerId": 500008,
                            "playerLastName": "Waerea-Hargreaves",
                            "playerName": "Jared Waerea-Hargreaves",
                            "playerPosition": "Prop 1",
                            "playerPositionId": 500008,
                            "playerStats": {
                                "allRunMetres": 111,
                                "allRuns": 11,
                                "decoys": 4,
                                "errors": 2,
                                "fantasyPointsTotal": 32,
                                "hitUps": 10,
                                "ineffectiveTackles": 1,
                                "kickReturnMetres": 11,
                                "kickReturns": 1,
                                "mins": 55,
                                "missedTackles": 4,
                                "offloads": 2,
                                "penalties": 1,
                                "supports": 7,
                                "tackleBreaks": 1,
                                "tackles": 28,
                                "hitupRunMeters": 100,
                                "ptbFast": 28.57,
                                "ptbNeutral": 71.43,
                                "ptbAll": 7
                            },
                            "playerTookTheField": true,
                            "shirtNum": 8
                        },
                        {
                            "playerFirstName": "Jake",
                            "playerId": 500009,
                            "playerLastName": "Friend",
                            "playerName": "Jake Friend",
                            "playerPosition": "Hooker",
                            "playerPositionId": 500009,
                            "playerStats": {
                                "allRunMetres": 21,
                                "allRuns": 5,
                                "dummyHalfRuns": 4,
                                "fantasyPointsTotal": 52,
                                "hitUps": 1,
                                "ineffectiveTackles": 1,
                                "kickMetres": 5,
                                "kicks": 3,
                                "linebreakAssists": 1,
                                "mins": 57,
                                "offloads": 2,
                                "oneOnOneTackles": 2,
                                "tackleBreaks": 1,
                                "tackles": 36,
                                "tryAssists": 1,
                                "hitupRunMeters": 7,
                                "dummyHalfRunMetres": 14,
                                "ptbNeutral": 100,
                                "ptbAll": 1
                            },
                            "playerTookTheField": true,
                            "shirtNum": 9
                        },
                        {
                            "playerFirstName": "Dylan",
                            "playerId": 500039,
                            "playerLastName": "Napa",
                            "playerName": "Dylan Napa",
                            "playerPosition": "Prop 2",
                            "playerPositionId": 500010,
                            "playerStats": {
                                "allRunMetres": 141,
                                "allRuns": 16,
                                "decoys": 4,
                                "errors": 1,
                                "fantasyPointsTotal": 35,
                                "hitUps": 16,
                                "ineffectiveTackles": 3,
                                "intercepts": 1,
                                "mins": 51,
                                "missedTackles": 3,
                                "offloads": 1,
                                "penalties": 1,
                                "supports": 5,
                                "tackles": 29,
                                "hitupRunMeters": 141,
                                "ptbNeutral": 92.86,
                                "ptbSlow": 7.14,
                                "ptbAll": 14
                            },
                            "playerTookTheField": true,
                            "shirtNum": 10
                        },
                        {
                            "playerFirstName": "Isaac",
                            "playerId": 500038,
                            "playerLastName": "Liu",
                            "playerName": "Isaac Liu",
                            "playerPosition": "2nd Row 1",
                            "playerPositionId": 500011,
                            "playerStats": {
                                "allRunMetres": 43,
                                "allRuns": 5,
                                "decoys": 4,
                                "fantasyPointsTotal": 26,
                                "hitUps": 4,
                                "ineffectiveTackles": 3,
                                "linebreakAssists": 1,
                                "mins": 44,
                                "oneOnOneTackles": 1,
                                "supports": 6,
                                "tackles": 20,
                                "hitupRunMeters": 38,
                                "evasionRuns": 1,
                                "evasionRunMetres": 5,
                                "ptbNeutral": 100,
                                "ptbAll": 4
                            },
                            "playerTookTheField": true,
                            "shirtNum": 15
                        },
                        {
                            "playerFirstName": "Mitchell",
                            "playerId": 500016,
                            "playerLastName": "Aubusson",
                            "playerName": "Mitchell Aubusson",
                            "playerPosition": "2nd Row 2",
                            "playerPositionId": 500012,
                            "playerStats": {
                                "allRunMetres": 109,
                                "allRuns": 9,
                                "decoys": 5,
                                "dummyHalfRuns": 1,
                                "fantasyPointsTotal": 52,
                                "hitUps": 8,
                                "linebreaks": 1,
                                "mins": 73,
                                "offloads": 2,
                                "oneOnOneTackles": 1,
                                "supports": 3,
                                "tackleBreaks": 1,
                                "tackles": 31,
                                "hitupRunMeters": 102,
                                "dummyHalfRunMetres": 7,
                                "ptbFast": 14.29,
                                "ptbNeutral": 85.71,
                                "ptbAll": 7
                            },
                            "playerTookTheField": true,
                            "shirtNum": 12
                        },
                        {
                            "playerFirstName": "Aidan",
                            "playerId": 500011,
                            "playerLastName": "Guerra",
                            "playerName": "Aidan Guerra",
                            "playerPosition": "Lock",
                            "playerPositionId": 500013,
                            "playerStats": {
                                "allRunMetres": 148,
                                "allRuns": 16,
                                "decoys": 4,
                                "errors": 1,
                                "fantasyPointsTotal": 46,
                                "hitUps": 14,
                                "ineffectiveTackles": 2,
                                "kicksNotDefused": 1,
                                "mins": 80,
                                "missedTackles": 2,
                                "oneOnOneTackles": 1,
                                "points": 4,
                                "supports": 21,
                                "tackleBreaks": 1,
                                "tackles": 27,
                                "tries": 1,
                                "hitupRunMeters": 138,
                                "evasionRuns": 2,
                                "evasionRunMetres": 10,
                                "ptbFast": 7.69,
                                "ptbNeutral": 84.62,
                                "ptbSlow": 7.69,
                                "ptbAll": 13
                            },
                            "playerTookTheField": true,
                            "shirtNum": 13
                        },
                        {
                            "playerFirstName": "Sam",
                            "playerId": 500010,
                            "playerLastName": "Moa",
                            "playerName": "Sam Moa",
                            "playerPosition": "Interchange",
                            "playerPositionId": 500014,
                            "playerStats": {
                                "allRunMetres": 118,
                                "allRuns": 12,
                                "decoys": 1,
                                "fantasyPointsTotal": 33,
                                "hitUps": 10,
                                "ineffectiveTackles": 1,
                                "kickReturnMetres": 25,
                                "kickReturns": 2,
                                "mins": 31,
                                "missedTackles": 1,
                                "offloads": 3,
                                "oneOnOneTackles": 1,
                                "supports": 3,
                                "tackleBreaks": 1,
                                "tackles": 15,
                                "hitupRunMeters": 93,
                                "ptbNeutral": 100,
                                "ptbAll": 9
                            },
                            "playerTookTheField": true,
                            "shirtNum": 14
                        },
                        {
                            "playerFirstName": "Kane",
                            "playerId": 500118,
                            "playerLastName": "Evans",
                            "playerName": "Kane Evans",
                            "playerPosition": "Interchange",
                            "playerPositionId": 500014,
                            "playerStats": {
                                "allRunMetres": 92,
                                "allRuns": 8,
                                "decoys": 2,
                                "fantasyPointsTotal": 20,
                                "hitUps": 5,
                                "ineffectiveTackles": 1,
                                "kickReturnMetres": 35,
                                "kickReturns": 2,
                                "mins": 23,
                                "missedTackles": 2,
                                "offloads": 2,
                                "oneOnOneTackles": 2,
                                "penalties": 1,
                                "supports": 4,
                                "tackles": 13,
                                "hitupRunMeters": 54,
                                "evasionRuns": 1,
                                "evasionRunMetres": 3,
                                "ptbFast": 20,
                                "ptbNeutral": 80,
                                "ptbAll": 5
                            },
                            "playerTookTheField": true,
                            "shirtNum": 16
                        },
                        {
                            "playerFirstName": "Sio Siua",
                            "playerId": 501179,
                            "playerLastName": "Taukeiaho",
                            "playerName": "Sio Siua Taukeiaho",
                            "playerPosition": "Interchange",
                            "playerPositionId": 500014,
                            "playerStats": {
                                "allRunMetres": 135,
                                "allRuns": 10,
                                "decoys": 1,
                                "fantasyPointsTotal": 46,
                                "hitUps": 10,
                                "ineffectiveTackles": 1,
                                "mins": 43,
                                "supports": 7,
                                "tackleBreaks": 3,
                                "tackles": 24,
                                "hitupRunMeters": 135,
                                "ptbNeutral": 100,
                                "ptbAll": 9
                            },
                            "playerTookTheField": true,
                            "shirtNum": 17
                        },
                        {
                            "playerFirstName": "Jackson",
                            "playerId": 500202,
                            "playerLastName": "Hastings",
                            "playerName": "Jackson Hastings",
                            "playerPosition": "Interchange",
                            "playerPositionId": 500014,
                            "playerStats": {
                                "allRunMetres": 8,
                                "allRuns": 1,
                                "errors": 1,
                                "fantasyPointsTotal": 8,
                                "ineffectiveTackles": 3,
                                "mins": 23,
                                "missedTackles": 3,
                                "oneOnOneTackles": 1,
                                "supports": 1,
                                "tackles": 16,
                                "evasionRuns": 1,
                                "evasionRunMetres": 8
                            },
                            "playerTookTheField": true,
                            "shirtNum": 18
                        }
                    ]
                },
                "teamName": "Sydney Roosters",
                "teamNickName": "Roosters",
                "teamStats": {
                    "allRunMetres": 2085,
                    "allRuns": 191,
                    "bombKicks": 6,
                    "bombKickMetres": 141,
                    "bombKicksDefused": 5,
                    "bombKicksNotDefused": 1,
                    "completeSets": 29,
                    "completionPercentage": 72,
                    "conversions": 4,
                    "conversionsAttempts": 4,
                    "decoys": 28,
                    "dummyHalfRuns": 7,
                    "errors": 10,
                    "goalConversionRate": 100,
                    "allGoals": 4,
                    "allGoalsAttempted": 4,
                    "hitUps": 78,
                    "incompleteSets": 11,
                    "ineffectiveTackles": 18,
                    "intercepts": 1,
                    "kickMetres": 432,
                    "kickReturnMetres": 239,
                    "kickReturns": 17,
                    "kicks": 20,
                    "kicksDefused": 9,
                    "kicksNotDefused": 2,
                    "lineDropouts": 2,
                    "linebreakAssists": 4,
                    "linebreaks": 7,
                    "missedTackles": 38,
                    "offloads": 16,
                    "oneOnOneTackles": 19,
                    "penalties": 4,
                    "points": 24,
                    "possession": 57,
                    "scrumWins": 10,
                    "supports": 140,
                    "tackleBreaks": 37,
                    "tackles": 310,
                    "sets": 40,
                    "tries": 4,
                    "tryAssists": 4,
                    "hitupRunMeters": 808,
                    "evasionRuns": 89,
                    "evasionRunMetres": 1006,
                    "dummyHalfRunMetres": 32,
                    "ptbFast": 15,
                    "ptbNeutral": 82,
                    "ptbSlow": 3,
                    "ptbTotal": 146
                }
            },
            {
                "score": [],
                "team1stHalfScore": 0,
                "team2ndHalfScore": 0,
                "teamAbbr": "WAR",
                "teamFinalScore": 0,
                "teamFullTimeScore": 0,
                "teamHalfTimeScore": 0,
                "teamId": 500032,
                "teamLineup": {
                    "injuriesAndSuspensions": {
                        "injury": [
                            {
                                "injuryDescription": "Calf, TBA",
                                "playerFirstName": "Ryan",
                                "playerId": "500596",
                                "playerLastName": "Hoffman",
                                "playerName": "Ryan Hoffman"
                            },
                            {
                                "injuryDescription": "Knee, Season",
                                "playerFirstName": "Ben",
                                "playerId": "500702",
                                "playerLastName": "Henry",
                                "playerName": "Ben Henry"
                            },
                            {
                                "injuryDescription": "ACL, Season",
                                "playerFirstName": "Ngani",
                                "playerId": "500706",
                                "playerLastName": "Laumape",
                                "playerName": "Ngani Laumape"
                            },
                            {
                                "injuryDescription": "Knee, Season",
                                "playerFirstName": "Thomas",
                                "playerId": "500707",
                                "playerLastName": "Leuluai",
                                "playerName": "Thomas Leuluai"
                            }
                        ],
                        "suspension": []
                    },
                    "insAndOuts": {
                        "inOut": [
                            {
                                "inOut": "Out",
                                "playerFirstName": "Charlie",
                                "playerId": "500701",
                                "playerLastName": "Gubb",
                                "playerName": "Charlie Gubb"
                            },
                            {
                                "inOut": "In",
                                "playerFirstName": "Sam",
                                "playerId": "500719",
                                "playerLastName": "Rapira",
                                "playerName": "Sam Rapira"
                            }
                        ]
                    },
                    "teamPlayer": [
                        {
                            "playerFirstName": "Sam",
                            "playerId": 501308,
                            "playerLastName": "Tomkins",
                            "playerName": "Sam Tomkins",
                            "playerPosition": "Fullback",
                            "playerPositionId": 500001,
                            "playerStats": {
                                "allRunMetres": 96,
                                "allRuns": 12,
                                "bombKicksDefused": 2,
                                "bombKicksNotDefused": 1,
                                "dummyHalfRuns": 1,
                                "errors": 1,
                                "fantasyPointsTotal": 45,
                                "interceptedPass": 1,
                                "kickMetres": 14,
                                "kickReturnMetres": 37,
                                "kickReturns": 4,
                                "kicks": 1,
                                "kicksDefused": 4,
                                "kicksNotDefused": 1,
                                "mins": 80,
                                "missedTackles": 2,
                                "oneOnOneTackles": 2,
                                "penalties": 1,
                                "supports": 5,
                                "tackleBreaks": 7,
                                "tackles": 14,
                                "tryCause": 2,
                                "trySaves": 1,
                                "evasionRuns": 7,
                                "evasionRunMetres": 48,
                                "dummyHalfRunMetres": 11,
                                "ptbNeutral": 100,
                                "ptbAll": 8
                            },
                            "playerTookTheField": true,
                            "shirtNum": 1
                        },
                        {
                            "playerFirstName": "Tuimoala",
                            "playerId": 500927,
                            "playerLastName": "Lolohea",
                            "playerName": "Tuimoala Lolohea",
                            "playerPosition": "Winger 1",
                            "playerPositionId": 500002,
                            "playerStats": {
                                "allRunMetres": 113,
                                "allRuns": 14,
                                "bombKicksDefused": 1,
                                "fantasyPointsTotal": 39,
                                "ineffectiveTackles": 2,
                                "kickReturnMetres": 50,
                                "kickReturns": 5,
                                "kicksDefused": 2,
                                "mins": 80,
                                "missedTackles": 2,
                                "supports": 4,
                                "tackleBreaks": 9,
                                "tackles": 3,
                                "tryCause": 1,
                                "evasionRuns": 9,
                                "evasionRunMetres": 63,
                                "ptbFast": 21.43,
                                "ptbNeutral": 71.43,
                                "ptbSlow": 7.14,
                                "ptbAll": 14
                            },
                            "playerTookTheField": true,
                            "shirtNum": 2
                        },
                        {
                            "playerFirstName": "David",
                            "playerId": 500919,
                            "playerLastName": "Fusitua",
                            "playerName": "David Fusitua",
                            "playerPosition": "Centre 1",
                            "playerPositionId": 500003,
                            "playerStats": {
                                "allRunMetres": 98,
                                "allRuns": 10,
                                "bombKicksDefused": 1,
                                "decoys": 1,
                                "errors": 2,
                                "fantasyPointsTotal": 14,
                                "kickReturns": 1,
                                "kicksDefused": 1,
                                "mins": 52,
                                "missedTackles": 1,
                                "oneOnOneTackles": 3,
                                "penalties": 1,
                                "supports": 3,
                                "tackles": 12,
                                "evasionRuns": 9,
                                "evasionRunMetres": 98,
                                "ptbFast": 11.11,
                                "ptbNeutral": 88.89,
                                "ptbAll": 9
                            },
                            "playerTookTheField": true,
                            "shirtNum": 3
                        },
                        {
                            "playerFirstName": "Solomone",
                            "playerId": 500921,
                            "playerLastName": "Kata",
                            "playerName": "Solomone Kata",
                            "playerPosition": "Centre 2",
                            "playerPositionId": 500004,
                            "playerStats": {
                                "allRunMetres": 143,
                                "allRuns": 13,
                                "decoys": 3,
                                "dummyHalfRuns": 1,
                                "errors": 1,
                                "fantasyPointsTotal": 30,
                                "hitUps": 2,
                                "ineffectiveTackles": 1,
                                "mins": 80,
                                "missedTackles": 7,
                                "oneOnOneTackles": 2,
                                "supports": 9,
                                "tackleBreaks": 7,
                                "tackles": 11,
                                "tryCause": 1,
                                "hitupRunMeters": 14,
                                "evasionRuns": 10,
                                "evasionRunMetres": 118,
                                "dummyHalfRunMetres": 11,
                                "ptbFast": 7.69,
                                "ptbNeutral": 92.31,
                                "ptbAll": 13
                            },
                            "playerTookTheField": true,
                            "shirtNum": 4
                        },
                        {
                            "playerFirstName": "Jonathan",
                            "playerId": 500815,
                            "playerLastName": "Wright",
                            "playerName": "Jonathan Wright",
                            "playerPosition": "Winger 2",
                            "playerPositionId": 500005,
                            "playerStats": {
                                "allRunMetres": 125,
                                "allRuns": 14,
                                "bombKicksDefused": 1,
                                "fantasyPointsTotal": 22,
                                "hitUps": 1,
                                "kickReturnMetres": 7,
                                "kickReturns": 1,
                                "kicksDefused": 2,
                                "mins": 80,
                                "missedTackles": 3,
                                "oneOnOneTackles": 2,
                                "supports": 5,
                                "tackleBreaks": 2,
                                "tackles": 8,
                                "hitupRunMeters": 12,
                                "evasionRuns": 12,
                                "evasionRunMetres": 106,
                                "ptbFast": 21.43,
                                "ptbNeutral": 78.57,
                                "ptbAll": 14
                            },
                            "playerTookTheField": true,
                            "shirtNum": 5
                        },
                        {
                            "playerFirstName": "Chad",
                            "playerId": 501183,
                            "playerLastName": "Townsend",
                            "playerName": "Chad Townsend",
                            "playerPosition": "Five-eighth",
                            "playerPositionId": 500006,
                            "playerStats": {
                                "allRunMetres": 88,
                                "allRuns": 6,
                                "bombKicks": 4,
                                "bombKickMetres": 76,
                                "dummyHalfRuns": 1,
                                "errors": 1,
                                "fantasyPointsTotal": 37,
                                "ineffectiveTackles": 1,
                                "kickMetres": 247,
                                "kicks": 10,
                                "linebreaks": 1,
                                "mins": 80,
                                "missedTackles": 4,
                                "oneOnOneTackles": 2,
                                "supports": 11,
                                "tackleBreaks": 4,
                                "tackles": 11,
                                "tryCause": 1,
                                "evasionRuns": 5,
                                "evasionRunMetres": 76,
                                "dummyHalfRunMetres": 12,
                                "ptbFast": 20,
                                "ptbNeutral": 60,
                                "ptbSlow": 20,
                                "ptbAll": 5
                            },
                            "playerTookTheField": true,
                            "shirtNum": 6
                        },
                        {
                            "playerFirstName": "Shaun",
                            "playerId": 500705,
                            "playerLastName": "Johnson",
                            "playerName": "Shaun Johnson",
                            "playerPosition": "Halfback",
                            "playerPositionId": 500007,
                            "playerStats": {
                                "allRunMetres": 34,
                                "allRuns": 8,
                                "bombKicks": 2,
                                "bombKickMetres": 62,
                                "errors": 3,
                                "fantasyPointsTotal": 32,
                                "kickMetres": 385,
                                "kicks": 10,
                                "kicksNotDefused": 1,
                                "linebreakAssists": 2,
                                "mins": 80,
                                "missedTackles": 4,
                                "oneOnOneTackles": 2,
                                "supports": 7,
                                "tackleBreaks": 1,
                                "tackles": 17,
                                "tryCause": 1,
                                "evasionRuns": 8,
                                "evasionRunMetres": 34,
                                "ptbNeutral": 100,
                                "ptbAll": 1
                            },
                            "playerTookTheField": true,
                            "shirtNum": 7
                        },
                        {
                            "playerFirstName": "Jacob",
                            "playerId": 500708,
                            "playerLastName": "Lillyman",
                            "playerName": "Jacob Lillyman",
                            "playerPosition": "Prop 1",
                            "playerPositionId": 500008,
                            "playerStats": {
                                "allRunMetres": 74,
                                "allRuns": 8,
                                "decoys": 6,
                                "errors": 1,
                                "fantasyPointsTotal": 24,
                                "hitUps": 7,
                                "ineffectiveTackles": 3,
                                "kickReturnMetres": 10,
                                "kickReturns": 1,
                                "mins": 47,
                                "missedTackles": 3,
                                "supports": 6,
                                "tackles": 25,
                                "hitupRunMeters": 64,
                                "ptbNeutral": 100,
                                "ptbAll": 8
                            },
                            "playerTookTheField": true,
                            "shirtNum": 8
                        },
                        {
                            "playerFirstName": "Nathan",
                            "playerId": 500700,
                            "playerLastName": "Friend",
                            "playerName": "Nathan Friend",
                            "playerPosition": "Hooker",
                            "playerPositionId": 500009,
                            "playerStats": {
                                "allRunMetres": 92,
                                "allRuns": 8,
                                "dummyHalfRuns": 6,
                                "fantasyPointsTotal": 49,
                                "hitUps": 2,
                                "ineffectiveTackles": 3,
                                "kicksDefused": 1,
                                "mins": 78,
                                "missedTackles": 1,
                                "oneOnOneTackles": 1,
                                "supports": 2,
                                "tackleBreaks": 1,
                                "tackles": 38,
                                "hitupRunMeters": 25,
                                "dummyHalfRunMetres": 67,
                                "ptbFast": 14.29,
                                "ptbNeutral": 85.71,
                                "ptbAll": 7
                            },
                            "playerTookTheField": true,
                            "shirtNum": 9
                        },
                        {
                            "playerFirstName": "Ben",
                            "playerId": 500715,
                            "playerLastName": "Matulino",
                            "playerName": "Ben Matulino",
                            "playerPosition": "Prop 2",
                            "playerPositionId": 500010,
                            "playerStats": {
                                "allRunMetres": 121,
                                "allRuns": 13,
                                "decoys": 2,
                                "fantasyPointsTotal": 39,
                                "hitUps": 9,
                                "ineffectiveTackles": 5,
                                "kickReturnMetres": 20,
                                "kickReturns": 1,
                                "mins": 51,
                                "missedTackles": 1,
                                "offloads": 1,
                                "penalties": 2,
                                "supports": 6,
                                "tackleBreaks": 1,
                                "tackles": 28,
                                "hitupRunMeters": 85,
                                "evasionRuns": 3,
                                "evasionRunMetres": 16,
                                "ptbFast": 20,
                                "ptbNeutral": 80,
                                "ptbAll": 10
                            },
                            "playerTookTheField": true,
                            "shirtNum": 10
                        },
                        {
                            "playerFirstName": "Bodene",
                            "playerId": 500664,
                            "playerLastName": "Thompson",
                            "playerName": "Bodene Thompson",
                            "playerPosition": "2nd Row 1",
                            "playerPositionId": 500011,
                            "playerStats": {
                                "allRunMetres": 59,
                                "allRuns": 6,
                                "decoys": 5,
                                "errors": 1,
                                "fantasyPointsTotal": 55,
                                "hitUps": 5,
                                "ineffectiveTackles": 5,
                                "linebreaks": 1,
                                "mins": 68,
                                "missedTackles": 2,
                                "offloads": 1,
                                "oneOnOneTackles": 3,
                                "penalties": 1,
                                "supports": 1,
                                "tackles": 52,
                                "hitupRunMeters": 50,
                                "evasionRuns": 1,
                                "evasionRunMetres": 9,
                                "ptbFast": 16.67,
                                "ptbNeutral": 50,
                                "ptbSlow": 33.33,
                                "ptbAll": 6
                            },
                            "playerTookTheField": true,
                            "shirtNum": 11
                        },
                        {
                            "playerFirstName": "Raymond",
                            "playerId": 500916,
                            "playerLastName": "Faitala-Mariner",
                            "playerName": "Raymond Faitala-Mariner",
                            "playerPosition": "2nd Row 2",
                            "playerPositionId": 500012,
                            "playerStats": {
                                "allRunMetres": 153,
                                "allRuns": 14,
                                "decoys": 7,
                                "fantasyPointsTotal": 51,
                                "hitUps": 13,
                                "ineffectiveTackles": 2,
                                "linebreaks": 1,
                                "mins": 80,
                                "missedTackles": 1,
                                "oneOnOneTackles": 4,
                                "supports": 4,
                                "tackleBreaks": 1,
                                "tackles": 31,
                                "tryCause": 1,
                                "hitupRunMeters": 150,
                                "evasionRuns": 1,
                                "evasionRunMetres": 3,
                                "ptbNeutral": 100,
                                "ptbAll": 13
                            },
                            "playerTookTheField": true,
                            "shirtNum": 12
                        },
                        {
                            "playerFirstName": "Simon",
                            "playerId": 500712,
                            "playerLastName": "Mannering",
                            "playerName": "Simon Mannering",
                            "playerPosition": "Lock",
                            "playerPositionId": 500013,
                            "playerStats": {
                                "allRunMetres": 97,
                                "allRuns": 12,
                                "decoys": 4,
                                "fantasyPointsTotal": 70,
                                "hitUps": 12,
                                "ineffectiveTackles": 3,
                                "mins": 80,
                                "missedTackles": 2,
                                "offloads": 4,
                                "supports": 7,
                                "tackleBreaks": 2,
                                "tackles": 51,
                                "hitupRunMeters": 97,
                                "ptbFast": 12.5,
                                "ptbNeutral": 87.5,
                                "ptbAll": 8
                            },
                            "playerTookTheField": true,
                            "shirtNum": 13,
                            "isCaptain": true
                        },
                        {
                            "playerFirstName": "Siliva",
                            "playerId": 501394,
                            "playerLastName": "Havili",
                            "playerName": "Siliva Havili",
                            "playerPosition": "Interchange",
                            "playerPositionId": 500014,
                            "playerStats": {
                                "allRunMetres": 40,
                                "allRuns": 5,
                                "decoys": 2,
                                "fantasyPointsTotal": 15,
                                "hitUps": 4,
                                "ineffectiveTackles": 1,
                                "mins": 14,
                                "missedTackles": 1,
                                "offloads": 1,
                                "supports": 2,
                                "tackleBreaks": 1,
                                "tackles": 8,
                                "hitupRunMeters": 38,
                                "evasionRuns": 1,
                                "evasionRunMetres": 2,
                                "ptbFast": 33.33,
                                "ptbNeutral": 66.67,
                                "ptbAll": 3
                            },
                            "playerTookTheField": true,
                            "shirtNum": 14
                        },
                        {
                            "playerFirstName": "Sione",
                            "playerId": 500711,
                            "playerLastName": "Lousi",
                            "playerName": "Sione Lousi",
                            "playerPosition": "Interchange",
                            "playerPositionId": 500014,
                            "playerStats": {
                                "allRunMetres": 54,
                                "allRuns": 6,
                                "decoys": 4,
                                "errors": 1,
                                "fantasyPointsTotal": 16,
                                "hitUps": 5,
                                "ineffectiveTackles": 1,
                                "kickReturnMetres": 2,
                                "kickReturns": 1,
                                "kicksDefused": 1,
                                "mins": 31,
                                "offloads": 1,
                                "supports": 1,
                                "tackleBreaks": 1,
                                "tackles": 7,
                                "hitupRunMeters": 52,
                                "ptbNeutral": 100,
                                "ptbAll": 4
                            },
                            "playerTookTheField": true,
                            "shirtNum": 15
                        },
                        {
                            "playerFirstName": "Albert",
                            "playerId": 500937,
                            "playerLastName": "Vete",
                            "playerName": "Albert Vete",
                            "playerPosition": "Interchange",
                            "playerPositionId": 500014,
                            "playerStats": {
                                "allRunMetres": 83,
                                "allRuns": 9,
                                "decoys": 3,
                                "fantasyPointsTotal": 31,
                                "hitUps": 8,
                                "kickReturnMetres": 9,
                                "kickReturns": 1,
                                "mins": 29,
                                "missedTackles": 1,
                                "offloads": 1,
                                "oneOnOneTackles": 2,
                                "penalties": 1,
                                "tackleBreaks": 1,
                                "tackles": 22,
                                "hitupRunMeters": 74,
                                "ptbFast": 25,
                                "ptbNeutral": 75,
                                "ptbAll": 8
                            },
                            "playerTookTheField": true,
                            "shirtNum": 17
                        },
                        {
                            "playerFirstName": "Sam",
                            "playerId": 500719,
                            "playerLastName": "Rapira",
                            "playerName": "Sam Rapira",
                            "playerPosition": "Interchange",
                            "playerPositionId": 500014,
                            "playerStats": {
                                "allRunMetres": 61,
                                "allRuns": 7,
                                "decoys": 1,
                                "fantasyPointsTotal": 18,
                                "hitUps": 7,
                                "ineffectiveTackles": 2,
                                "mins": 30,
                                "missedTackles": 2,
                                "oneOnOneTackles": 1,
                                "supports": 2,
                                "tackles": 16,
                                "hitupRunMeters": 61,
                                "ptbFast": 50,
                                "ptbNeutral": 50,
                                "ptbAll": 6
                            },
                            "playerTookTheField": true,
                            "shirtNum": 18
                        }
                    ]
                },
                "teamName": "New Zealand Warriors",
                "teamNickName": "Warriors",
                "teamStats": {
                    "allRunMetres": 1534,
                    "allRuns": 165,
                    "bombKicks": 6,
                    "bombKickMetres": 138,
                    "bombKicksDefused": 5,
                    "bombKicksNotDefused": 1,
                    "completeSets": 24,
                    "completionPercentage": 71,
                    "decoys": 38,
                    "dummyHalfRuns": 9,
                    "errors": 11,
                    "hitUps": 75,
                    "incompleteSets": 10,
                    "ineffectiveTackles": 29,
                    "interceptedPass": 1,
                    "kickMetres": 646,
                    "kickReturnMetres": 135,
                    "kickReturns": 15,
                    "kicks": 21,
                    "kicksDefused": 11,
                    "kicksNotDefused": 2,
                    "linebreakAssists": 2,
                    "linebreaks": 3,
                    "missedTackles": 37,
                    "offloads": 9,
                    "oneOnOneTackles": 24,
                    "penalties": 6,
                    "pointsConceded": 24,
                    "possession": 43,
                    "scrumWins": 6,
                    "supports": 75,
                    "tackleBreaks": 38,
                    "tackles": 354,
                    "sets": 34,
                    "triesConceded": 4,
                    "trySaves": 1,
                    "hitupRunMeters": 724,
                    "evasionRuns": 66,
                    "evasionRunMetres": 573,
                    "dummyHalfRunMetres": 102,
                    "ptbFast": 15,
                    "ptbNeutral": 82,
                    "ptbSlow": 3,
                    "ptbTotal": 137
                }
            }
        ]
    }
}