{
    "competitionId": 111,
    "competitionName": "NRL Telstra Premiership",
    "gameId": 20151112260,
    "gameInfo": {
        "assistantReferee1Id": 500028,
        "numberOfPeriods": 2,
        "assistantReferee1Name": "Steve Carrall",
        "assistantReferee2Id": 500114,
        "assistantReferee2Name": "Clayton Sharpe",
        "gameDate": "2015-08-08",
        "gameHashTag": "#NRLSharksCowboys",
        "gameNumber": 6,
        "gameSeconds": 4800,
        "gameMinutes": "80:00",
        "gameTime": "1:20:00",
        "groundConditionId": 1,
        "groundConditionName": "N/A",
        "referee1Id": 500002,
        "referee1Name": "Matt Cecchin",
        "referee2Id": 500034,
        "referee2Name": "Dave Munro",
        "startTime": "2015-08-08T17:30:00",
        "startTimeUTC": "2015-08-08T07:30:00Z",
        "venueId": 500007,
        "venueName": "Remondis Stadium",
        "videoReferee1Id": 500017,
        "videoReferee1Name": "Luke Phillips",
        "videoReferee2Id": 500033,
        "videoReferee2Name": "Steve Chiddy"
    },
    "gameState": "Final",
    "gameStateId": 8,
    "roundId": 22,
    "seasonId": 2015,
    "teams": {
        "teamsMatch": [
            {
                "isHomeTeam": true,
                "score": {
                    "conversions": 4,
                    "points": 30,
                    "penaltyGoals": 1,
                    "tries": 5
                },
                "team1stHalfScore": 14,
                "team2ndHalfScore": 16,
                "teamAbbr": "CRO",
                "teamFinalScore": 30,
                "teamFullTimeScore": 30,
                "teamHalfTimeScore": 14,
                "teamId": 500028,
                "teamLineup": {
                    "injuriesAndSuspensions": {
                        "injury": [
                            {
                                "injuryDescription": "ACL, Season",
                                "playerFirstName": "Kyle",
                                "playerId": "500638",
                                "playerLastName": "Stanley",
                                "playerName": "Kyle Stanley"
                            },
                            {
                                "injuryDescription": "Achilles, Season",
                                "playerFirstName": "Jacob",
                                "playerId": "500793",
                                "playerLastName": "Gagan",
                                "playerName": "Jacob Gagan"
                            },
                            {
                                "injuryDescription": "Knee, Round 24",
                                "playerFirstName": "Luke",
                                "playerId": "500802",
                                "playerLastName": "Lewis",
                                "playerName": "Luke Lewis"
                            },
                            {
                                "injuryDescription": "ACL, Indefinite",
                                "playerFirstName": "Fa'amanu",
                                "playerId": "500837",
                                "playerLastName": "Brown",
                                "playerName": "Fa'amanu Brown"
                            }
                        ],
                        "suspension": [
                            {
                                "playerFirstName": "Andrew",
                                "playerId": 500791,
                                "playerLastName": "Fifita",
                                "playerName": "Andrew Fifita",
                                "suspensionDescription": "Suspension, Indefinite"
                            },
                            {
                                "playerFirstName": "David",
                                "playerId": 500792,
                                "playerLastName": "Fifita",
                                "playerName": "David Fifita",
                                "suspensionDescription": "Suspension, Indefinite"
                            }
                        ]
                    },
                    "insAndOuts": {
                        "inOut": []
                    },
                    "teamPlayer": [
                        {
                            "playerFirstName": "Michael",
                            "playerId": 500797,
                            "playerLastName": "Gordon",
                            "playerName": "Michael Gordon",
                            "playerPosition": "Fullback",
                            "playerPositionId": 500001,
                            "playerStats": {
                                "allRunMetres": 240,
                                "allRuns": 18,
                                "bombKicksDefused": 1,
                                "conversions": 4,
                                "conversionsAttempts": 5,
                                "conversionsMissed": 1,
                                "dummyHalfRuns": 2,
                                "errors": 1,
                                "fantasyPointsTotal": 74,
                                "goalConversionRate": 83.333,
                                "allGoals": 5,
                                "allGoalsMissed": 1,
                                "allGoalsAttempted": 6,
                                "ineffectiveTackles": 1,
                                "interceptedPass": 1,
                                "kickReturnMetres": 159,
                                "kickReturns": 6,
                                "kicksDefused": 3,
                                "linebreakAssists": 1,
                                "linebreaks": 1,
                                "mins": 80,
                                "penaltyGoals": 1,
                                "penaltyGoalsAttempts": 1,
                                "points": 14,
                                "supports": 10,
                                "tackleBreaks": 5,
                                "tackles": 5,
                                "tries": 1,
                                "tryAssists": 1,
                                "evasionRuns": 10,
                                "evasionRunMetres": 61,
                                "dummyHalfRunMetres": 20,
                                "ptbFast": 7.69,
                                "ptbNeutral": 92.31,
                                "ptbAll": 13
                            },
                            "playerTookTheField": true,
                            "shirtNum": 1
                        },
                        {
                            "playerFirstName": "Sosaia",
                            "playerId": 500790,
                            "playerLastName": "Feki",
                            "playerName": "Sosaia Feki",
                            "playerPosition": "Winger 1",
                            "playerPositionId": 500002,
                            "playerStats": {
                                "allRunMetres": 79,
                                "allRuns": 8,
                                "dummyHalfRuns": 2,
                                "errors": 1,
                                "fantasyPointsTotal": 7,
                                "ineffectiveTackles": 2,
                                "kickReturnMetres": 20,
                                "kickReturns": 1,
                                "mins": 51,
                                "supports": 7,
                                "tackles": 2,
                                "evasionRuns": 5,
                                "evasionRunMetres": 49,
                                "dummyHalfRunMetres": 10,
                                "ptbNeutral": 100,
                                "ptbAll": 7
                            },
                            "playerTookTheField": true,
                            "shirtNum": 2
                        },
                        {
                            "playerFirstName": "Gerard",
                            "playerId": 500616,
                            "playerLastName": "Beale",
                            "playerName": "Gerard Beale",
                            "playerPosition": "Centre 1",
                            "playerPositionId": 500003,
                            "playerStats": {
                                "allRunMetres": 192,
                                "allRuns": 11,
                                "fantasyPointsTotal": 48,
                                "ineffectiveTackles": 2,
                                "kickMetres": 24,
                                "kickReturnMetres": 108,
                                "kickReturns": 2,
                                "kicks": 1,
                                "kicksDefused": 2,
                                "mins": 80,
                                "offloads": 1,
                                "points": 4,
                                "supports": 6,
                                "tackleBreaks": 1,
                                "tackles": 13,
                                "tries": 1,
                                "tryCause": 1,
                                "evasionRuns": 9,
                                "evasionRunMetres": 84,
                                "ptbNeutral": 88.89,
                                "ptbSlow": 11.11,
                                "ptbAll": 9
                            },
                            "playerTookTheField": true,
                            "shirtNum": 3
                        },
                        {
                            "playerFirstName": "Ricky",
                            "playerId": 500801,
                            "playerLastName": "Leutele",
                            "playerName": "Ricky Leutele",
                            "playerPosition": "Centre 2",
                            "playerPositionId": 500004,
                            "playerStats": {
                                "allRunMetres": 133,
                                "allRuns": 14,
                                "decoys": 2,
                                "dummyHalfRuns": 2,
                                "fantasyPointsTotal": 41,
                                "ineffectiveTackles": 1,
                                "linebreaks": 1,
                                "mins": 80,
                                "missedTackles": 1,
                                "oneOnOneTackles": 2,
                                "points": 4,
                                "supports": 11,
                                "tackleBreaks": 2,
                                "tackles": 12,
                                "tries": 1,
                                "evasionRuns": 12,
                                "evasionRunMetres": 116,
                                "dummyHalfRunMetres": 17,
                                "ptbNeutral": 100,
                                "ptbAll": 13
                            },
                            "playerTookTheField": true,
                            "shirtNum": 4
                        },
                        {
                            "playerFirstName": "Valentine",
                            "playerId": 500845,
                            "playerLastName": "Holmes",
                            "playerName": "Valentine Holmes",
                            "playerPosition": "Winger 2",
                            "playerPositionId": 500005,
                            "playerStats": {
                                "allRunMetres": 119,
                                "allRuns": 11,
                                "bombKicksNotDefused": 1,
                                "decoys": 1,
                                "dummyHalfRuns": 1,
                                "fantasyPointsTotal": 34,
                                "kickReturnMetres": 42,
                                "kickReturns": 3,
                                "kicksNotDefused": 1,
                                "lineDropouts": 1,
                                "mins": 80,
                                "missedTackles": 1,
                                "supports": 8,
                                "tackleBreaks": 8,
                                "tackles": 1,
                                "tryCause": 2,
                                "evasionRuns": 7,
                                "evasionRunMetres": 62,
                                "dummyHalfRunMetres": 15,
                                "ptbNeutral": 100,
                                "ptbAll": 8
                            },
                            "playerTookTheField": true,
                            "shirtNum": 5
                        },
                        {
                            "playerFirstName": "Jack",
                            "playerId": 500617,
                            "playerLastName": "Bird",
                            "playerName": "Jack Bird",
                            "playerPosition": "Five-eighth",
                            "playerPositionId": 500006,
                            "playerStats": {
                                "allRunMetres": 78,
                                "allRuns": 9,
                                "decoys": 1,
                                "errors": 1,
                                "fantasyPointsTotal": 59,
                                "ineffectiveTackles": 2,
                                "kickMetres": 14,
                                "kickReturnMetres": 5,
                                "kickReturns": 1,
                                "kicks": 2,
                                "kicksDefused": 1,
                                "kicksNotDefused": 1,
                                "linebreaks": 1,
                                "mins": 80,
                                "missedTackles": 4,
                                "oneOnOneTackles": 3,
                                "points": 4,
                                "supports": 9,
                                "tackleBreaks": 3,
                                "tackles": 35,
                                "tries": 1,
                                "tryCause": 1,
                                "trySaves": 1,
                                "evasionRuns": 8,
                                "evasionRunMetres": 73,
                                "ptbFast": 16.67,
                                "ptbNeutral": 83.33,
                                "ptbAll": 6
                            },
                            "playerTookTheField": true,
                            "shirtNum": 6
                        },
                        {
                            "playerFirstName": "Jeff",
                            "playerId": 500808,
                            "playerLastName": "Robson",
                            "playerName": "Jeff Robson",
                            "playerPosition": "Halfback",
                            "playerPositionId": 500007,
                            "playerStats": {
                                "allRunMetres": 25,
                                "allRuns": 3,
                                "bombKicks": 2,
                                "bombKickMetres": 49,
                                "decoys": 1,
                                "fantasyPointsTotal": 26,
                                "kickMetres": 218,
                                "kicks": 8,
                                "linebreakAssists": 1,
                                "mins": 80,
                                "missedTackles": 3,
                                "oneOnOneTackles": 1,
                                "penalties": 1,
                                "supports": 14,
                                "tackles": 15,
                                "tryAssists": 1,
                                "evasionRuns": 3,
                                "evasionRunMetres": 25,
                                "ptbFast": 50,
                                "ptbNeutral": 50,
                                "ptbAll": 2
                            },
                            "playerTookTheField": true,
                            "shirtNum": 7
                        },
                        {
                            "playerFirstName": "Chris",
                            "playerId": 500799,
                            "playerLastName": "Heighington",
                            "playerName": "Chris Heighington",
                            "playerPosition": "Prop 1",
                            "playerPositionId": 500008,
                            "playerStats": {
                                "allRunMetres": 113,
                                "allRuns": 13,
                                "decoys": 6,
                                "fantasyPointsTotal": 34,
                                "hitUps": 11,
                                "mins": 43,
                                "missedTackles": 1,
                                "offloads": 1,
                                "supports": 5,
                                "tackles": 23,
                                "hitupRunMeters": 97,
                                "evasionRuns": 2,
                                "evasionRunMetres": 16,
                                "ptbNeutral": 100,
                                "ptbAll": 11
                            },
                            "playerTookTheField": true,
                            "shirtNum": 8
                        },
                        {
                            "playerFirstName": "Michael",
                            "playerId": 500221,
                            "playerLastName": "Ennis",
                            "playerName": "Michael Ennis",
                            "playerPosition": "Hooker",
                            "playerPositionId": 500009,
                            "playerStats": {
                                "allRunMetres": 42,
                                "allRuns": 6,
                                "dummyHalfRuns": 4,
                                "fantasyPointsTotal": 50,
                                "hitUps": 2,
                                "ineffectiveTackles": 1,
                                "kickMetres": 103,
                                "kicks": 5,
                                "mins": 80,
                                "missedTackles": 6,
                                "oneOnOneTackles": 2,
                                "tackleBreaks": 2,
                                "tackles": 47,
                                "hitupRunMeters": 16,
                                "dummyHalfRunMetres": 26,
                                "ptbNeutral": 100,
                                "ptbAll": 3
                            },
                            "playerTookTheField": true,
                            "shirtNum": 9
                        },
                        {
                            "playerFirstName": "Sam",
                            "playerId": 500813,
                            "playerLastName": "Tagataese",
                            "playerName": "Sam Tagataese",
                            "playerPosition": "Prop 2",
                            "playerPositionId": 500010,
                            "playerStats": {
                                "allRunMetres": 80,
                                "allRuns": 9,
                                "decoys": 7,
                                "errors": 1,
                                "fantasyPointsTotal": 23,
                                "hitUps": 6,
                                "kickReturnMetres": 22,
                                "kickReturns": 2,
                                "mins": 32,
                                "missedTackles": 2,
                                "offloads": 1,
                                "onReport": 1,
                                "oneOnOneTackles": 2,
                                "penalties": 1,
                                "supports": 2,
                                "tackles": 21,
                                "hitupRunMeters": 56,
                                "evasionRuns": 1,
                                "evasionRunMetres": 2,
                                "ptbNeutral": 100,
                                "ptbAll": 5
                            },
                            "playerTookTheField": true,
                            "shirtNum": 10
                        },
                        {
                            "playerFirstName": "Anthony",
                            "playerId": 500814,
                            "playerLastName": "Tupou",
                            "playerName": "Anthony Tupou",
                            "playerPosition": "2nd Row 1",
                            "playerPositionId": 500011,
                            "playerStats": {
                                "allRunMetres": 89,
                                "allRuns": 8,
                                "decoys": 4,
                                "fantasyPointsTotal": 39,
                                "hitUps": 6,
                                "mins": 43,
                                "missedTackles": 1,
                                "penalties": 1,
                                "supports": 4,
                                "tackleBreaks": 3,
                                "tackles": 26,
                                "hitupRunMeters": 80,
                                "evasionRuns": 2,
                                "evasionRunMetres": 9,
                                "ptbFast": 20,
                                "ptbNeutral": 80,
                                "ptbAll": 5
                            },
                            "playerTookTheField": true,
                            "shirtNum": 11
                        },
                        {
                            "playerFirstName": "Wade",
                            "playerId": 500798,
                            "playerLastName": "Graham",
                            "playerName": "Wade Graham",
                            "playerPosition": "2nd Row 2",
                            "playerPositionId": 500012,
                            "playerStats": {
                                "allRunMetres": 135,
                                "allRuns": 17,
                                "chargeDowns": 1,
                                "decoys": 6,
                                "dummyHalfRuns": 1,
                                "fantasyPointsTotal": 68,
                                "hitUps": 14,
                                "ineffectiveTackles": 1,
                                "kickMetres": 83,
                                "kicks": 3,
                                "kicksDefused": 1,
                                "linebreaks": 1,
                                "mins": 80,
                                "missedTackles": 4,
                                "offloads": 2,
                                "oneOnOneTackles": 1,
                                "points": 4,
                                "supports": 7,
                                "tackleBreaks": 5,
                                "tackles": 27,
                                "tries": 1,
                                "hitupRunMeters": 122,
                                "evasionRuns": 2,
                                "evasionRunMetres": 6,
                                "dummyHalfRunMetres": 7,
                                "ptbFast": 8.33,
                                "ptbNeutral": 83.33,
                                "ptbSlow": 8.33,
                                "ptbAll": 12
                            },
                            "playerTookTheField": true,
                            "shirtNum": 12
                        },
                        {
                            "playerFirstName": "Paul",
                            "playerId": 500794,
                            "playerLastName": "Gallen",
                            "playerName": "Paul Gallen",
                            "playerPosition": "Lock",
                            "playerPositionId": 500013,
                            "playerStats": {
                                "allRunMetres": 235,
                                "allRuns": 25,
                                "decoys": 6,
                                "errors": 1,
                                "fantasyPointsTotal": 65,
                                "hitUps": 22,
                                "ineffectiveTackles": 3,
                                "kickReturnMetres": 31,
                                "kickReturns": 3,
                                "mins": 80,
                                "missedTackles": 1,
                                "supports": 5,
                                "tackles": 46,
                                "hitupRunMeters": 204,
                                "ptbNeutral": 91.3,
                                "ptbSlow": 8.7,
                                "ptbAll": 23
                            },
                            "playerTookTheField": true,
                            "shirtNum": 13
                        },
                        {
                            "playerFirstName": "Ben",
                            "playerId": 500244,
                            "playerLastName": "Barba",
                            "playerName": "Ben Barba",
                            "playerPosition": "Interchange",
                            "playerPositionId": 500014,
                            "playerStats": {
                                "allRunMetres": 39,
                                "allRuns": 3,
                                "errors": 1,
                                "fantasyPointsTotal": 2,
                                "kickReturnMetres": 9,
                                "kickReturns": 1,
                                "kicksNotDefused": 1,
                                "mins": 29,
                                "supports": 1,
                                "tackles": 1,
                                "tryCause": 1,
                                "evasionRuns": 2,
                                "evasionRunMetres": 30,
                                "ptbNeutral": 100,
                                "ptbAll": 3
                            },
                            "playerTookTheField": true,
                            "shirtNum": 14
                        },
                        {
                            "playerFirstName": "Matt",
                            "playerId": 500806,
                            "playerLastName": "Prior",
                            "playerName": "Matt Prior",
                            "playerPosition": "Interchange",
                            "playerPositionId": 500014,
                            "playerStats": {
                                "allRunMetres": 119,
                                "allRuns": 12,
                                "decoys": 5,
                                "fantasyPointsTotal": 32,
                                "hitUps": 9,
                                "kickReturnMetres": 31,
                                "kickReturns": 2,
                                "mins": 43,
                                "oneOnOneTackles": 1,
                                "penalties": 1,
                                "supports": 1,
                                "tackles": 23,
                                "hitupRunMeters": 83,
                                "evasionRuns": 1,
                                "evasionRunMetres": 5,
                                "ptbNeutral": 100,
                                "ptbAll": 11
                            },
                            "playerTookTheField": true,
                            "shirtNum": 15
                        },
                        {
                            "playerFirstName": "Tinirau",
                            "playerId": 500100,
                            "playerLastName": "Arona",
                            "playerName": "Tinirau Arona",
                            "playerPosition": "Interchange",
                            "playerPositionId": 500014,
                            "playerStats": {
                                "allRunMetres": 54,
                                "allRuns": 5,
                                "decoys": 5,
                                "fantasyPointsTotal": 13,
                                "hitUps": 4,
                                "ineffectiveTackles": 1,
                                "kickReturnMetres": 8,
                                "kickReturns": 1,
                                "mins": 21,
                                "missedTackles": 1,
                                "penalties": 1,
                                "supports": 1,
                                "tackles": 12,
                                "hitupRunMeters": 46,
                                "ptbFast": 20,
                                "ptbNeutral": 80,
                                "ptbAll": 5
                            },
                            "playerTookTheField": true,
                            "shirtNum": 16
                        },
                        {
                            "playerFirstName": "Jayson",
                            "playerId": 500977,
                            "playerLastName": "Bukuya",
                            "playerName": "Jayson Bukuya",
                            "playerPosition": "Interchange",
                            "playerPositionId": 500014,
                            "playerStats": {
                                "allRunMetres": 58,
                                "allRuns": 6,
                                "decoys": 2,
                                "fantasyPointsTotal": 54,
                                "hitUps": 6,
                                "ineffectiveTackles": 2,
                                "mins": 58,
                                "missedTackles": 3,
                                "offloads": 1,
                                "penalties": 1,
                                "supports": 5,
                                "tackleBreaks": 2,
                                "tackles": 44,
                                "tryCause": 1,
                                "trySaves": 1,
                                "hitupRunMeters": 58,
                                "ptbFast": 20,
                                "ptbNeutral": 80,
                                "ptbAll": 5
                            },
                            "playerTookTheField": true,
                            "shirtNum": 17
                        }
                    ]
                },
                "teamName": "Cronulla-Sutherland Sharks",
                "teamNickName": "Sharks",
                "teamStats": {
                    "allRunMetres": 1831,
                    "allRuns": 178,
                    "bombKicks": 2,
                    "bombKickMetres": 49,
                    "bombKicksDefused": 1,
                    "bombKicksNotDefused": 1,
                    "chargeDowns": 1,
                    "completeSets": 34,
                    "completionPercentage": 83,
                    "conversions": 4,
                    "conversionsAttempts": 5,
                    "conversionsMissed": 1,
                    "decoys": 46,
                    "dummyHalfRuns": 12,
                    "errors": 7,
                    "goalConversionRate": 83.333,
                    "allGoals": 5,
                    "allGoalsAttempted": 6,
                    "allGoalsMissed": 1,
                    "hitUps": 80,
                    "incompleteSets": 7,
                    "ineffectiveTackles": 16,
                    "interceptedPass": 1,
                    "kickMetres": 441,
                    "kickReturnMetres": 435,
                    "kickReturns": 22,
                    "kicks": 19,
                    "kicksDefused": 7,
                    "kicksNotDefused": 3,
                    "lineDropouts": 1,
                    "linebreakAssists": 2,
                    "linebreaks": 4,
                    "missedTackles": 28,
                    "offloads": 6,
                    "onReports": 1,
                    "oneOnOneTackles": 12,
                    "penalties": 6,
                    "penaltyGoals": 1,
                    "penaltyGoalsAttempts": 1,
                    "points": 30,
                    "pointsConceded": 18,
                    "possession": 53,
                    "scrumWins": 3,
                    "supports": 96,
                    "tackleBreaks": 31,
                    "tackles": 353,
                    "sets": 41,
                    "tries": 5,
                    "triesConceded": 3,
                    "tryAssists": 2,
                    "trySaves": 2,
                    "hitupRunMeters": 763,
                    "evasionRuns": 64,
                    "evasionRunMetres": 538,
                    "dummyHalfRunMetres": 95,
                    "ptbFast": 5,
                    "ptbNeutral": 92,
                    "ptbSlow": 3,
                    "ptbTotal": 141
                }
            },
            {
                "score": {
                    "conversions": 2,
                    "points": 18,
                    "penaltyGoals": 1,
                    "tries": 3
                },
                "team1stHalfScore": 0,
                "team2ndHalfScore": 18,
                "teamAbbr": "NQL",
                "teamFinalScore": 18,
                "teamFullTimeScore": 18,
                "teamHalfTimeScore": 0,
                "teamId": 500012,
                "teamLineup": {
                    "injuriesAndSuspensions": {
                        "injury": [
                            {
                                "injuryDescription": "ACL, Season",
                                "playerFirstName": "Tautau",
                                "playerId": "500121",
                                "playerLastName": "Moga",
                                "playerName": "Tautau Moga"
                            }
                        ],
                        "suspension": []
                    },
                    "insAndOuts": {
                        "inOut": [
                            {
                                "inOut": "Out",
                                "playerFirstName": "Matthew",
                                "playerId": "500296",
                                "playerLastName": "Scott",
                                "playerName": "Matthew Scott"
                            },
                            {
                                "inOut": "In",
                                "playerFirstName": "Sam",
                                "playerId": "500284",
                                "playerLastName": "Hoare",
                                "playerName": "Sam Hoare"
                            }
                        ]
                    },
                    "teamPlayer": [
                        {
                            "playerFirstName": "Lachlan",
                            "playerId": 500281,
                            "playerLastName": "Coote",
                            "playerName": "Lachlan Coote",
                            "playerPosition": "Fullback",
                            "playerPositionId": 500001,
                            "playerStats": {
                                "allRunMetres": 59,
                                "allRuns": 9,
                                "decoys": 1,
                                "errors": 1,
                                "fantasyPointsTotal": 23,
                                "kickMetres": 136,
                                "kickReturnMetres": 20,
                                "kickReturns": 4,
                                "kicks": 5,
                                "kicksDefused": 2,
                                "mins": 80,
                                "missedTackles": 2,
                                "oneOnOneTackles": 1,
                                "supports": 19,
                                "tackles": 6,
                                "tryAssists": 2,
                                "tryCause": 1,
                                "evasionRuns": 5,
                                "evasionRunMetres": 39,
                                "ptbFast": 12.5,
                                "ptbNeutral": 87.5,
                                "ptbAll": 8
                            },
                            "playerTookTheField": true,
                            "shirtNum": 1
                        },
                        {
                            "playerFirstName": "Matthew",
                            "playerId": 501025,
                            "playerLastName": "Wright",
                            "playerName": "Matthew Wright",
                            "playerPosition": "Winger 1",
                            "playerPositionId": 500002,
                            "playerStats": {
                                "allRunMetres": 83,
                                "allRuns": 11,
                                "bombKicksNotDefused": 1,
                                "decoys": 1,
                                "dummyHalfRuns": 1,
                                "errors": 1,
                                "fantasyPointsTotal": 24,
                                "kickReturnMetres": 17,
                                "kickReturns": 3,
                                "kicksDefused": 1,
                                "kicksNotDefused": 1,
                                "lineDropouts": 2,
                                "mins": 80,
                                "offloads": 1,
                                "points": 4,
                                "supports": 5,
                                "tackles": 7,
                                "tries": 1,
                                "tryCause": 1,
                                "evasionRuns": 7,
                                "evasionRunMetres": 56,
                                "dummyHalfRunMetres": 10,
                                "ptbNeutral": 100,
                                "ptbAll": 11
                            },
                            "playerTookTheField": true,
                            "shirtNum": 2
                        },
                        {
                            "playerFirstName": "Justin",
                            "playerId": 500605,
                            "playerLastName": "O'Neill",
                            "playerName": "Justin O'Neill",
                            "playerPosition": "Centre 1",
                            "playerPositionId": 500003,
                            "playerStats": {
                                "allRunMetres": 103,
                                "allRuns": 10,
                                "bombKicksDefused": 1,
                                "errors": 1,
                                "fantasyPointsTotal": 31,
                                "intercepts": 1,
                                "kicksDefused": 1,
                                "linebreaks": 1,
                                "mins": 80,
                                "missedTackles": 1,
                                "offloads": 1,
                                "oneOnOneTackles": 4,
                                "supports": 2,
                                "tackleBreaks": 2,
                                "tackles": 12,
                                "tryCause": 1,
                                "evasionRuns": 10,
                                "evasionRunMetres": 103,
                                "ptbFast": 11.11,
                                "ptbNeutral": 88.89,
                                "ptbAll": 9
                            },
                            "playerTookTheField": true,
                            "shirtNum": 3
                        },
                        {
                            "playerFirstName": "Kane",
                            "playerId": 500288,
                            "playerLastName": "Linnett",
                            "playerName": "Kane Linnett",
                            "playerPosition": "Centre 2",
                            "playerPositionId": 500004,
                            "playerStats": {
                                "allRunMetres": 124,
                                "allRuns": 13,
                                "fantasyPointsTotal": 34,
                                "ineffectiveTackles": 2,
                                "kickReturns": 1,
                                "mins": 80,
                                "missedTackles": 2,
                                "oneOnOneTackles": 1,
                                "points": 4,
                                "supports": 16,
                                "tackleBreaks": 2,
                                "tackles": 12,
                                "tries": 1,
                                "tryCause": 1,
                                "evasionRuns": 12,
                                "evasionRunMetres": 124,
                                "ptbFast": 10,
                                "ptbNeutral": 80,
                                "ptbSlow": 10,
                                "ptbAll": 10
                            },
                            "playerTookTheField": true,
                            "shirtNum": 4
                        },
                        {
                            "playerFirstName": "Antonio",
                            "playerId": 500305,
                            "playerLastName": "Winterstein",
                            "playerName": "Antonio Winterstein",
                            "playerPosition": "Winger 2",
                            "playerPositionId": 500005,
                            "playerStats": {
                                "allRunMetres": 157,
                                "allRuns": 14,
                                "dummyHalfRuns": 1,
                                "fantasyPointsTotal": 34,
                                "kickReturnMetres": 39,
                                "kickReturns": 3,
                                "mins": 80,
                                "penalties": 1,
                                "points": 4,
                                "supports": 4,
                                "tackleBreaks": 3,
                                "tackles": 4,
                                "tries": 1,
                                "evasionRuns": 10,
                                "evasionRunMetres": 110,
                                "dummyHalfRunMetres": 8,
                                "ptbFast": 23.08,
                                "ptbNeutral": 76.92,
                                "ptbAll": 13
                            },
                            "playerTookTheField": true,
                            "shirtNum": 5
                        },
                        {
                            "playerFirstName": "Michael ",
                            "playerId": 500292,
                            "playerLastName": "Morgan",
                            "playerName": "Michael  Morgan",
                            "playerPosition": "Five-eighth",
                            "playerPositionId": 500006,
                            "playerStats": {
                                "allRunMetres": 40,
                                "allRuns": 4,
                                "decoys": 1,
                                "errors": 1,
                                "fantasyPointsTotal": 32,
                                "ineffectiveTackles": 2,
                                "kickMetres": 36,
                                "kickReturnMetres": 1,
                                "kickReturns": 1,
                                "kicks": 2,
                                "linebreakAssists": 1,
                                "mins": 80,
                                "missedTackles": 2,
                                "offloads": 1,
                                "oneOnOneTackles": 1,
                                "supports": 11,
                                "tackleBreaks": 3,
                                "tackles": 20,
                                "tryCause": 1,
                                "evasionRuns": 3,
                                "evasionRunMetres": 39,
                                "ptbFast": 50,
                                "ptbNeutral": 50,
                                "ptbAll": 2
                            },
                            "playerTookTheField": true,
                            "shirtNum": 6
                        },
                        {
                            "playerFirstName": "Johnathan",
                            "playerId": 500304,
                            "playerLastName": "Thurston",
                            "playerName": "Johnathan Thurston",
                            "playerPosition": "Halfback",
                            "playerPositionId": 500007,
                            "playerStats": {
                                "allRunMetres": 89,
                                "allRuns": 11,
                                "bombKicks": 3,
                                "bombKickMetres": 82,
                                "chargedDown": 1,
                                "conversions": 2,
                                "conversionsAttempts": 3,
                                "conversionsMissed": 1,
                                "decoys": 1,
                                "errors": 2,
                                "fantasyPointsTotal": 60,
                                "goalConversionRate": 75,
                                "allGoals": 3,
                                "allGoalsMissed": 1,
                                "allGoalsAttempted": 4,
                                "ineffectiveTackles": 1,
                                "kickMetres": 344,
                                "kickReturnMetres": 5,
                                "kickReturns": 1,
                                "kicks": 13,
                                "kicksDefused": 1,
                                "lineDropouts": 1,
                                "linebreakAssists": 1,
                                "linebreaks": 1,
                                "mins": 80,
                                "missedTackles": 6,
                                "oneOnOneTackles": 2,
                                "penaltyGoals": 1,
                                "penaltyGoalsAttempts": 1,
                                "points": 6,
                                "supports": 18,
                                "tackleBreaks": 5,
                                "tackles": 18,
                                "tryAssists": 1,
                                "tryCause": 3,
                                "evasionRuns": 10,
                                "evasionRunMetres": 84,
                                "ptbFast": 25,
                                "ptbNeutral": 75,
                                "ptbAll": 4
                            },
                            "playerTookTheField": true,
                            "shirtNum": 7
                        },
                        {
                            "playerFirstName": "Ben",
                            "playerId": 500254,
                            "playerLastName": "Hannant",
                            "playerName": "Ben Hannant",
                            "playerPosition": "Prop 1",
                            "playerPositionId": 500008,
                            "playerStats": {
                                "allRunMetres": 129,
                                "allRuns": 14,
                                "decoys": 3,
                                "fantasyPointsTotal": 41,
                                "hitUps": 13,
                                "ineffectiveTackles": 1,
                                "kickReturnMetres": 18,
                                "kickReturns": 1,
                                "mins": 46,
                                "missedTackles": 1,
                                "offloads": 1,
                                "penalties": 3,
                                "supports": 7,
                                "tackleBreaks": 1,
                                "tackles": 32,
                                "hitupRunMeters": 111,
                                "ptbNeutral": 100,
                                "ptbAll": 12
                            },
                            "playerTookTheField": true,
                            "shirtNum": 17
                        },
                        {
                            "playerFirstName": "Jake",
                            "playerId": 500251,
                            "playerLastName": "Granville",
                            "playerName": "Jake Granville",
                            "playerPosition": "Hooker",
                            "playerPositionId": 500009,
                            "playerStats": {
                                "allRunMetres": 38,
                                "allRuns": 7,
                                "dummyHalfRuns": 6,
                                "fantasyPointsTotal": 34,
                                "hitUps": 1,
                                "ineffectiveTackles": 1,
                                "kickMetres": 21,
                                "kicks": 2,
                                "mins": 52,
                                "missedTackles": 2,
                                "oneOnOneTackles": 1,
                                "tackleBreaks": 1,
                                "tackles": 31,
                                "hitupRunMeters": 9,
                                "dummyHalfRunMetres": 29,
                                "ptbNeutral": 100,
                                "ptbAll": 5
                            },
                            "playerTookTheField": true,
                            "shirtNum": 9
                        },
                        {
                            "playerFirstName": "James",
                            "playerId": 500299,
                            "playerLastName": "Tamou",
                            "playerName": "James Tamou",
                            "playerPosition": "Prop 2",
                            "playerPositionId": 500010,
                            "playerStats": {
                                "allRunMetres": 128,
                                "allRuns": 15,
                                "decoys": 9,
                                "fantasyPointsTotal": 40,
                                "hitUps": 10,
                                "ineffectiveTackles": 1,
                                "kickReturnMetres": 52,
                                "kickReturns": 5,
                                "mins": 62,
                                "missedTackles": 1,
                                "offloads": 1,
                                "onReport": 1,
                                "penalties": 1,
                                "supports": 10,
                                "tackles": 30,
                                "tryCause": 1,
                                "hitupRunMeters": 76,
                                "ptbFast": 7.69,
                                "ptbNeutral": 92.31,
                                "ptbAll": 13
                            },
                            "playerTookTheField": true,
                            "shirtNum": 10
                        },
                        {
                            "playerFirstName": "Gavin",
                            "playerId": 500280,
                            "playerLastName": "Cooper",
                            "playerName": "Gavin Cooper",
                            "playerPosition": "2nd Row 1",
                            "playerPositionId": 500011,
                            "playerStats": {
                                "allRunMetres": 175,
                                "allRuns": 18,
                                "decoys": 2,
                                "dummyHalfRuns": 1,
                                "errors": 1,
                                "fantasyPointsTotal": 69,
                                "hitUps": 17,
                                "ineffectiveTackles": 1,
                                "kickMetres": 4,
                                "kicks": 1,
                                "linebreaks": 1,
                                "mins": 80,
                                "missedTackles": 4,
                                "offloads": 3,
                                "oneOnOneTackles": 1,
                                "penalties": 1,
                                "supports": 15,
                                "tackleBreaks": 6,
                                "tackles": 36,
                                "tryCause": 1,
                                "hitupRunMeters": 167,
                                "dummyHalfRunMetres": 8,
                                "ptbFast": 21.43,
                                "ptbNeutral": 78.57,
                                "ptbAll": 14
                            },
                            "playerTookTheField": true,
                            "shirtNum": 11
                        },
                        {
                            "playerFirstName": "Ethan",
                            "playerId": 500289,
                            "playerLastName": "Lowe",
                            "playerName": "Ethan Lowe",
                            "playerPosition": "2nd Row 2",
                            "playerPositionId": 500012,
                            "playerStats": {
                                "allRunMetres": 38,
                                "allRuns": 6,
                                "decoys": 5,
                                "dummyHalfRuns": 1,
                                "fantasyPointsTotal": 38,
                                "hitUps": 5,
                                "ineffectiveTackles": 2,
                                "mins": 72,
                                "missedTackles": 2,
                                "oneOnOneTackles": 2,
                                "supports": 9,
                                "tackles": 39,
                                "tryCause": 1,
                                "hitupRunMeters": 28,
                                "dummyHalfRunMetres": 10,
                                "ptbNeutral": 100,
                                "ptbAll": 6
                            },
                            "playerTookTheField": true,
                            "shirtNum": 12
                        },
                        {
                            "playerFirstName": "Jason",
                            "playerId": 500301,
                            "playerLastName": "Taumalolo",
                            "playerName": "Jason Taumalolo",
                            "playerPosition": "Lock",
                            "playerPositionId": 500013,
                            "playerStats": {
                                "allRunMetres": 77,
                                "allRuns": 8,
                                "decoys": 3,
                                "fantasyPointsTotal": 21,
                                "hitUps": 7,
                                "ineffectiveTackles": 1,
                                "mins": 49,
                                "missedTackles": 4,
                                "oneOnOneTackles": 1,
                                "supports": 4,
                                "tackleBreaks": 1,
                                "tackles": 19,
                                "hitupRunMeters": 70,
                                "evasionRuns": 1,
                                "evasionRunMetres": 7,
                                "ptbNeutral": 100,
                                "ptbAll": 7
                            },
                            "playerTookTheField": true,
                            "shirtNum": 13
                        },
                        {
                            "playerFirstName": "Rory",
                            "playerId": 500287,
                            "playerLastName": "Kostjasyn",
                            "playerName": "Rory Kostjasyn",
                            "playerPosition": "Interchange",
                            "playerPositionId": 500014,
                            "playerStats": {
                                "allRunMetres": 26,
                                "allRuns": 2,
                                "dummyHalfRuns": 1,
                                "fantasyPointsTotal": 24,
                                "mins": 28,
                                "penalties": 2,
                                "supports": 1,
                                "tackleBreaks": 1,
                                "tackles": 23,
                                "evasionRuns": 1,
                                "evasionRunMetres": 16,
                                "dummyHalfRunMetres": 10,
                                "ptbFast": 100,
                                "ptbAll": 1
                            },
                            "playerTookTheField": true,
                            "shirtNum": 14
                        },
                        {
                            "playerFirstName": "John",
                            "playerId": 500277,
                            "playerLastName": "Asiata",
                            "playerName": "John Asiata",
                            "playerPosition": "Interchange",
                            "playerPositionId": 500014,
                            "playerStats": {
                                "allRunMetres": 105,
                                "allRuns": 13,
                                "decoys": 2,
                                "fantasyPointsTotal": 40,
                                "hitUps": 11,
                                "mins": 46,
                                "missedTackles": 2,
                                "oneOnOneTackles": 1,
                                "supports": 3,
                                "tackleBreaks": 1,
                                "tackles": 31,
                                "tryCause": 1,
                                "hitupRunMeters": 96,
                                "evasionRuns": 2,
                                "evasionRunMetres": 9,
                                "ptbFast": 27.27,
                                "ptbNeutral": 72.73,
                                "ptbAll": 11
                            },
                            "playerTookTheField": true,
                            "shirtNum": 15
                        },
                        {
                            "playerFirstName": "Scott",
                            "playerId": 500278,
                            "playerLastName": "Bolton",
                            "playerName": "Scott Bolton",
                            "playerPosition": "Interchange",
                            "playerPositionId": 500014,
                            "playerStats": {
                                "allRunMetres": 83,
                                "allRuns": 9,
                                "decoys": 2,
                                "fantasyPointsTotal": 31,
                                "hitUps": 9,
                                "ineffectiveTackles": 1,
                                "mins": 35,
                                "missedTackles": 1,
                                "supports": 2,
                                "tackles": 25,
                                "hitupRunMeters": 83,
                                "ptbFast": 11.11,
                                "ptbNeutral": 88.89,
                                "ptbAll": 9
                            },
                            "playerTookTheField": true,
                            "shirtNum": 16
                        },
                        {
                            "playerFirstName": "Sam",
                            "playerId": 500284,
                            "playerLastName": "Hoare",
                            "playerName": "Sam Hoare",
                            "playerPosition": "Interchange",
                            "playerPositionId": 500014,
                            "playerStats": {
                                "allRunMetres": 44,
                                "allRuns": 4,
                                "fantasyPointsTotal": 12,
                                "hitUps": 4,
                                "mins": 10,
                                "missedTackles": 1,
                                "tackleBreaks": 2,
                                "tackles": 4,
                                "hitupRunMeters": 44,
                                "ptbFast": 100,
                                "ptbAll": 4
                            },
                            "playerTookTheField": true,
                            "shirtNum": 18
                        }
                    ]
                },
                "teamName": "North Queensland Cowboys",
                "teamNickName": "Cowboys",
                "teamStats": {
                    "allRunMetres": 1498,
                    "allRuns": 168,
                    "bombKicks": 3,
                    "bombKickMetres": 82,
                    "bombKicksDefused": 1,
                    "bombKicksNotDefused": 1,
                    "chargedDown": 1,
                    "completeSets": 27,
                    "completionPercentage": 75,
                    "conversions": 2,
                    "conversionsAttempts": 3,
                    "conversionsMissed": 1,
                    "decoys": 30,
                    "dummyHalfRuns": 11,
                    "errors": 7,
                    "goalConversionRate": 75,
                    "allGoals": 3,
                    "allGoalsAttempted": 4,
                    "allGoalsMissed": 1,
                    "hitUps": 77,
                    "incompleteSets": 9,
                    "ineffectiveTackles": 13,
                    "intercepts": 1,
                    "kickMetres": 541,
                    "kickReturnMetres": 152,
                    "kickReturns": 19,
                    "kicks": 23,
                    "kicksDefused": 5,
                    "kicksNotDefused": 1,
                    "lineDropouts": 3,
                    "linebreakAssists": 2,
                    "linebreaks": 3,
                    "missedTackles": 31,
                    "offloads": 8,
                    "onReports": 1,
                    "oneOnOneTackles": 15,
                    "penalties": 8,
                    "penaltyGoals": 1,
                    "penaltyGoalsAttempts": 1,
                    "points": 18,
                    "pointsConceded": 30,
                    "possession": 47,
                    "scrumWins": 4,
                    "supports": 126,
                    "tackleBreaks": 28,
                    "tackles": 349,
                    "sets": 36,
                    "tries": 3,
                    "triesConceded": 5,
                    "tryAssists": 3,
                    "hitupRunMeters": 685,
                    "evasionRuns": 61,
                    "evasionRunMetres": 587,
                    "dummyHalfRunMetres": 74,
                    "ptbFast": 15,
                    "ptbNeutral": 84,
                    "ptbSlow": 1,
                    "ptbTotal": 139
                }
            }
        ]
    }
}