{
    "vod": [
        {
            "id": "drYTduNDE6r2NRVC_su2PADMYCA-2WDH",
            "contentId": 861598,
            "title": "Rd 18: Bulldogs v Wests Tigers (Hls)",
            "description": "Highlights of the match between the Bulldogs and Wests Tigers from ANZ Stadium",
            "publishDate": "2016-07-09T21:50:00+10:00",
            "publisher": "NRL Chief",
            "thumbnailUrl": "http://bigpondvideo.com/web/images/content/20160709212421a_89x50.jpg",
            "largeThumbnailUrl": "http://bigpondvideo.com/web/images/content/20160709212421a_326x184.jpg",
            "programType": "Highlights",
            "programCategory": "Match",
            "priority": null,
            "lastUpdateDate": "2016-07-09T21:57:08+10:00",
            "isPremium": false,
            "club": [
                500010,
                500023
            ]
        },
        {
            "id": "Z5azduNDE6qtXSytN5pIjoxoOYzdjWKA",
            "contentId": 861603,
            "title": "Rd 18 Press Conference: Bulldogs",
            "description": "The Bulldogs coach faces the media following the match",
            "publishDate": "2016-07-09T22:21:00+10:00",
            "publisher": "NRL Chief",
            "thumbnailUrl": "http://bigpondvideo.com/web/images/content/20160709220409a_89x50.jpg",
            "largeThumbnailUrl": "http://bigpondvideo.com/web/images/content/20160709220409a_326x184.jpg",
            "programType": "Press Conference",
            "programCategory": null,
            "priority": null,
            "lastUpdateDate": "2016-07-09T22:27:14+10:00",
            "isPremium": false,
            "club": [
                500010,
                500023
            ]
        },
        {
            "id": "M2aTduNDE6R01naLP1yxLPKHv5Fnit73",
            "contentId": 861604,
            "title": "Rd 18 Press Conference: Wests Tigers",
            "description": "The Wests Tigers coach faces the media following the match",
            "publishDate": "2016-07-09T22:13:00+10:00",
            "publisher": "NRL Chief",
            "thumbnailUrl": "http://bigpondvideo.com/web/images/content/20160709215306a_89x50.jpg",
            "largeThumbnailUrl": "http://bigpondvideo.com/web/images/content/20160709215306a_326x184.jpg",
            "programType": "Press Conference",
            "programCategory": null,
            "priority": null,
            "lastUpdateDate": "2016-07-09T22:19:13+10:00",
            "isPremium": false,
            "club": [
                500010,
                500023
            ]
        },
        {
            "id": "Z3MjduNDE664C3pWgz1mp50ESE4lS1MA",
            "contentId": 861325,
            "title": "Rd 18: GOAL Moses Mbye (80th min)",
            "description": "Moses Mbye converts Sam Perrett's try",
            "publishDate": "2016-07-09T21:26:00+10:00",
            "publisher": "NRL Chief",
            "thumbnailUrl": "http://bigpondvideo.com/web/images/content/20160709213222a_89x50.jpg",
            "largeThumbnailUrl": "http://bigpondvideo.com/web/images/content/20160709213222a_326x184.jpg",
            "programType": "Instant Replay",
            "programCategory": "Score",
            "priority": null,
            "lastUpdateDate": "2016-07-09T21:36:01+10:00",
            "isPremium": true,
            "club": [
                500010,
                500023
            ]
        },
        {
            "id": "BzMjduNDE60envHzhDwdigFouWScLvRy",
            "contentId": 861323,
            "title": "Rd 18: TRY Sam Perrett (80th min)",
            "description": "Sam Perrett scores the final try of the match for the Bulldogs",
            "publishDate": "2016-07-09T21:24:00+10:00",
            "publisher": "NRL Chief",
            "thumbnailUrl": "http://bigpondvideo.com/web/images/content/20160709213202a_89x50.jpg",
            "largeThumbnailUrl": "http://bigpondvideo.com/web/images/content/20160709213202a_326x184.jpg",
            "programType": "Instant Replay",
            "programCategory": "Score",
            "priority": null,
            "lastUpdateDate": "2016-07-09T21:35:01+10:00",
            "isPremium": true,
            "club": [
                500010,
                500023
            ]
        },
        {
            "id": "lqdzZuNDE6ayWYFE0nK3EM1zqLGbWscM",
            "contentId": 861321,
            "title": "Rd 18: GOAL Moses Mbye (66th min)",
            "description": "Moses Mbye converts Curtis Rona's try",
            "publishDate": "2016-07-09T21:11:00+10:00",
            "publisher": "NRL Chief",
            "thumbnailUrl": "http://bigpondvideo.com/web/images/content/20160709211549a_89x50.jpg",
            "largeThumbnailUrl": "http://bigpondvideo.com/web/images/content/20160709211549a_326x184.jpg",
            "programType": "Instant Replay",
            "programCategory": "Score",
            "priority": null,
            "lastUpdateDate": "2016-07-09T21:18:57+10:00",
            "isPremium": true,
            "club": [
                500010,
                500023
            ]
        },
        {
            "id": "4xdzZuNDE6t_mQoeGQhEi-zcnp5z27QD",
            "contentId": 861320,
            "title": "Rd 18: TRY Curtis Rona (64th min)",
            "description": "Curtis Rona scores to put the Bulldogs in the lead",
            "publishDate": "2016-07-09T21:09:00+10:00",
            "publisher": "NRL Chief",
            "thumbnailUrl": "http://bigpondvideo.com/web/images/content/20160709211519a_89x50.jpg",
            "largeThumbnailUrl": "http://bigpondvideo.com/web/images/content/20160709211519a_326x184.jpg",
            "programType": "Instant Replay",
            "programCategory": "Score",
            "priority": null,
            "lastUpdateDate": "2016-07-09T21:18:57+10:00",
            "isPremium": true,
            "club": [
                500010,
                500023
            ]
        },
        {
            "id": "ExdTZuNDE6R1Wth-KfCeMwYkDsbBv7Ii",
            "contentId": 861319,
            "title": "Rd 18: TRY Brett Morris (60th min)",
            "description": "Brett Morris crosses for his second try",
            "publishDate": "2016-07-09T21:03:00+10:00",
            "publisher": "NRL Chief",
            "thumbnailUrl": "http://bigpondvideo.com/web/images/content/20160709210842a_89x50.jpg",
            "largeThumbnailUrl": "http://bigpondvideo.com/web/images/content/20160709210842a_326x184.jpg",
            "programType": "Instant Replay",
            "programCategory": "Score",
            "priority": null,
            "lastUpdateDate": "2016-07-09T21:11:55+10:00",
            "isPremium": true,
            "club": [
                500010,
                500023
            ]
        },
        {
            "id": "t2bTZuNDE6zcRMq5pmkeL69azMe6Z3ZY",
            "contentId": 861318,
            "title": "Rd 18: GOAL Mitchell Moses (45th min)",
            "description": "Mitchell Moses converts the try of Jacob LIddle",
            "publishDate": "2016-07-09T20:45:00+10:00",
            "publisher": "NRL Chief",
            "thumbnailUrl": "http://bigpondvideo.com/web/images/content/20160709204906a_89x50.jpg",
            "largeThumbnailUrl": "http://bigpondvideo.com/web/images/content/20160709204906a_326x184.jpg",
            "programType": "Instant Replay",
            "programCategory": "Score",
            "priority": null,
            "lastUpdateDate": "2016-07-09T20:51:51+10:00",
            "isPremium": true,
            "club": [
                500010,
                500023
            ]
        },
        {
            "id": "NsbTZuNDE6MU15TNkzN7b_8Bxr28ypOh",
            "contentId": 861317,
            "title": "Rd 18: TRY Jacob Liddle (44th min)",
            "description": "Jacob Liddle scores on debut for the Wests Tigers",
            "publishDate": "2016-07-09T20:44:00+10:00",
            "publisher": "NRL Chief",
            "thumbnailUrl": "http://bigpondvideo.com/web/images/content/20160709204813a_89x50.jpg",
            "largeThumbnailUrl": "http://bigpondvideo.com/web/images/content/20160709204813a_326x184.jpg",
            "programType": "Instant Replay",
            "programCategory": "Score",
            "priority": null,
            "lastUpdateDate": "2016-07-09T20:51:51+10:00",
            "isPremium": true,
            "club": [
                500010,
                500023
            ]
        },
        {
            "id": "wwaDZuNDE6U0oVY834iwV3S_K0sQSvvf",
            "contentId": 861316,
            "title": "Rd 18: PENALTY GOAL Mitchell Moses (40th min)",
            "description": "Mitchell Moses grabs two points for the Wests Tigers right on half time",
            "publishDate": "2016-07-09T20:25:00+10:00",
            "publisher": "NRL Chief",
            "thumbnailUrl": "http://bigpondvideo.com/web/images/content/20160709203138a_89x50.jpg",
            "largeThumbnailUrl": "http://bigpondvideo.com/web/images/content/20160709203138a_326x184.jpg",
            "programType": "Instant Replay",
            "programCategory": "Score",
            "priority": null,
            "lastUpdateDate": "2016-07-09T20:34:47+10:00",
            "isPremium": true,
            "club": [
                500010,
                500023
            ]
        },
        {
            "id": "9vZDZuNDE6NxSqEznSKwib5uk-eH8Z7E",
            "contentId": 861314,
            "title": "Rd 18: GOAL Moses Mbye (31st min)",
            "description": "Moses Mbye converts Will Hopoate's try",
            "publishDate": "2016-07-09T20:18:00+10:00",
            "publisher": "NRL Chief",
            "thumbnailUrl": "http://bigpondvideo.com/web/images/content/20160709202057a_89x50.jpg",
            "largeThumbnailUrl": "http://bigpondvideo.com/web/images/content/20160709202057a_326x184.jpg",
            "programType": "Instant Replay",
            "programCategory": "Score",
            "priority": null,
            "lastUpdateDate": "2016-07-09T20:24:44+10:00",
            "isPremium": true,
            "club": [
                500010,
                500023
            ]
        },
        {
            "id": "BtZDZuNDE6zqbm_tsS8FHscClep3MSNl",
            "contentId": 861312,
            "title": "Rd 18: TRY William Hopoate (29th min)",
            "description": "Will Hopoate crosses for the Bulldogs",
            "publishDate": "2016-07-09T20:17:00+10:00",
            "publisher": "NRL Chief",
            "thumbnailUrl": "http://bigpondvideo.com/web/images/content/20160709202042a_89x50.jpg",
            "largeThumbnailUrl": "http://bigpondvideo.com/web/images/content/20160709202042a_326x184.jpg",
            "programType": "Instant Replay",
            "programCategory": "Score",
            "priority": null,
            "lastUpdateDate": "2016-07-09T20:24:44+10:00",
            "isPremium": true,
            "club": [
                500010,
                500023
            ]
        },
        {
            "id": "RpZDZuNDE6Vqby4v_CJct3W6ZvEDLO1R",
            "contentId": 861311,
            "title": "Rd 18: GOAL Moses Mbye (28th min)",
            "description": "Moses Mbye converts Brett Morris' try",
            "publishDate": "2016-07-09T20:15:00+10:00",
            "publisher": "NRL Chief",
            "thumbnailUrl": "http://bigpondvideo.com/web/images/content/20160709202013b_89x50.jpg",
            "largeThumbnailUrl": "http://bigpondvideo.com/web/images/content/20160709202013b_326x184.jpg",
            "programType": "Instant Replay",
            "programCategory": "Score",
            "priority": null,
            "lastUpdateDate": "2016-07-09T20:23:44+10:00",
            "isPremium": true,
            "club": [
                500010,
                500023
            ]
        },
        {
            "id": "cwZDZuNDE6RWYn5IXuec1g2InPeaSIO4",
            "contentId": 861310,
            "title": "Rd 18: TRY Brett Morris (27th min)",
            "description": "Brett Morris scores another for the Bulldogs",
            "publishDate": "2016-07-09T20:10:00+10:00",
            "publisher": "NRL Chief",
            "thumbnailUrl": "http://bigpondvideo.com/web/images/content/20160709201929a_89x50.jpg",
            "largeThumbnailUrl": "http://bigpondvideo.com/web/images/content/20160709201929a_326x184.jpg",
            "programType": "Instant Replay",
            "programCategory": "Score",
            "priority": null,
            "lastUpdateDate": "2016-07-09T20:22:44+10:00",
            "isPremium": true,
            "club": [
                500010,
                500023
            ]
        },
        {
            "id": "42YjZuNDE6W6Y0fdjkvBj3P_t1XmTUtI",
            "contentId": 861309,
            "title": "Rd 18: GOAL Mitchell Moses (25th min)",
            "description": "Mitchell Moses converts the try of Joshua Addo-Carr",
            "publishDate": "2016-07-09T20:09:00+10:00",
            "publisher": "NRL Chief",
            "thumbnailUrl": "http://bigpondvideo.com/web/images/content/20160709201320a_89x50.jpg",
            "largeThumbnailUrl": "http://bigpondvideo.com/web/images/content/20160709201320a_326x184.jpg",
            "programType": "Instant Replay",
            "programCategory": "Score",
            "priority": null,
            "lastUpdateDate": "2016-07-09T20:16:42+10:00",
            "isPremium": true,
            "club": [
                500010,
                500023
            ]
        },
        {
            "id": "d2YTZuNDE6jXE5DE-QnRYBUyRuiuM9a5",
            "contentId": 861308,
            "title": "Rd 18: TRY Joshua Addo-Carr (23rd min)",
            "description": "Joshua Addo-Carr streaks away to score for the Wests Tigers",
            "publishDate": "2016-07-09T20:06:00+10:00",
            "publisher": "NRL Chief",
            "thumbnailUrl": "http://bigpondvideo.com/web/images/content/20160709201248a_89x50.jpg",
            "largeThumbnailUrl": "http://bigpondvideo.com/web/images/content/20160709201248a_326x184.jpg",
            "programType": "Instant Replay",
            "programCategory": "Score",
            "priority": null,
            "lastUpdateDate": "2016-07-09T20:16:42+10:00",
            "isPremium": true,
            "club": [
                500010,
                500023
            ]
        },
        {
            "id": "o2OTZuNDE6rt3gELywOFqabtKZgMyqu9",
            "contentId": 861307,
            "title": "Rd 18: PENALTY GOAL Mitchell Moses (21st min)",
            "description": "Mitchell Moses takes two points for the Wests Tigers",
            "publishDate": "2016-07-09T20:04:00+10:00",
            "publisher": "NRL Chief",
            "thumbnailUrl": "http://bigpondvideo.com/web/images/content/20160709200733a_89x50.jpg",
            "largeThumbnailUrl": "http://bigpondvideo.com/web/images/content/20160709200733a_326x184.jpg",
            "programType": "Instant Replay",
            "programCategory": "Score",
            "priority": null,
            "lastUpdateDate": "2016-07-09T20:10:41+10:00",
            "isPremium": true,
            "club": [
                500010,
                500023
            ]
        },
        {
            "id": "Z2NjZuNDE697FTEZMGNZYq6QCiK_ncBn",
            "contentId": 861306,
            "title": "Rd 18: TRY Moses Mbye (13th min)",
            "description": "Moses Mbye grabs the Bulldogs' first of the night",
            "publishDate": "2016-07-09T19:55:00+10:00",
            "publisher": "NRL Chief",
            "thumbnailUrl": "http://bigpondvideo.com/web/images/content/20160709200024a_89x50.jpg",
            "largeThumbnailUrl": "http://bigpondvideo.com/web/images/content/20160709200024a_326x184.jpg",
            "programType": "Instant Replay",
            "programCategory": "Score",
            "priority": null,
            "lastUpdateDate": "2016-07-09T20:03:39+10:00",
            "isPremium": true,
            "club": [
                500010,
                500023
            ]
        },
        {
            "id": "tiNDZuNDE6qzeeQlmGWLvmDv2QmqXcDQ",
            "contentId": 861305,
            "title": "Rd 18: GOAL Mitchell Moses (5th min)",
            "description": "Mitchell Moses converts the Kavin Naiqama try.",
            "publishDate": "2016-07-09T19:49:00+10:00",
            "publisher": "NRL Chief",
            "thumbnailUrl": "http://bigpondvideo.com/web/images/content/20160709195243a_89x50.jpg",
            "largeThumbnailUrl": "http://bigpondvideo.com/web/images/content/20160709195243a_326x184.jpg",
            "programType": "Instant Replay",
            "programCategory": "Score",
            "priority": null,
            "lastUpdateDate": "2016-07-09T19:56:38+10:00",
            "isPremium": true,
            "club": [
                500010,
                500023
            ]
        },
        {
            "id": "U3NDZuNDE6FJSFNUEpMViWJWlzeKkANO",
            "contentId": 861302,
            "title": "Rd 18: TRY Kevin Naiqama (4th min)",
            "description": "Kevin Naiqama opens the scoring for the Wests Tigers",
            "publishDate": "2016-07-09T19:47:00+10:00",
            "publisher": "NRL Chief",
            "thumbnailUrl": "http://bigpondvideo.com/web/images/content/20160709195209a_89x50.jpg",
            "largeThumbnailUrl": "http://bigpondvideo.com/web/images/content/20160709195209a_326x184.jpg",
            "programType": "Instant Replay",
            "programCategory": "Score",
            "priority": null,
            "lastUpdateDate": "2016-07-09T19:55:37+10:00",
            "isPremium": true,
            "club": [
                500010,
                500023
            ]
        }
    ],
    "scores": [
        {
            "gameState": "First Half",
            "gameStateId": 3,
            "gameTime": "0:12:15",
            "gameSeconds": 735,
            "GameMinutes": "12:15",
            "playerId": 500243,
            "playerName": "Moses Mbye",
            "scoreMethod": "Try",
            "statEvent": "Try",
            "statId": 38,
            "statValue": 4,
            "vidRef": 23035,
            "homeScore": 4,
            "awayScore": 6,
            "commentary": "Try by Moses Mbye",
            "tackleNum": 5,
            "teamId": 500010,
            "teamName": "Canterbury-Bankstown Bulldogs",
            "homeTeamAbbrv": "CBY",
            "awayTeamAbbrv": "WST"
        },
        {
            "gameState": "First Half",
            "gameStateId": 3,
            "gameTime": "0:26:29",
            "gameSeconds": 1589,
            "GameMinutes": "26:29",
            "playerId": 500633,
            "playerName": "Brett Morris",
            "scoreMethod": "Try",
            "statEvent": "Try",
            "statId": 38,
            "statValue": 4,
            "vidRef": 47201,
            "homeScore": 8,
            "awayScore": 14,
            "commentary": "Try by Brett Morris",
            "teamId": 500010,
            "teamName": "Canterbury-Bankstown Bulldogs",
            "homeTeamAbbrv": "CBY",
            "awayTeamAbbrv": "WST"
        },
        {
            "gameState": "First Half",
            "gameStateId": 3,
            "gameTime": "0:27:26",
            "gameSeconds": 1646,
            "GameMinutes": "27:26",
            "playerId": 500243,
            "playerName": "Moses Mbye",
            "scoreMethod": "Conversion",
            "statEvent": "Conversion-Made",
            "statId": 1,
            "statValue": 2,
            "vidRef": 48643,
            "homeScore": 10,
            "awayScore": 14,
            "commentary": "Conversion-Made by Moses Mbye",
            "tackleNum": -1,
            "teamId": 500010,
            "teamName": "Canterbury-Bankstown Bulldogs",
            "homeTeamAbbrv": "CBY",
            "awayTeamAbbrv": "WST"
        },
        {
            "gameState": "First Half",
            "gameStateId": 3,
            "gameTime": "0:28:53",
            "gameSeconds": 1733,
            "GameMinutes": "28:53",
            "playerId": 500672,
            "playerName": "Will Hopoate",
            "scoreMethod": "Try",
            "statEvent": "Try",
            "statId": 38,
            "statValue": 4,
            "vidRef": 50811,
            "homeScore": 14,
            "awayScore": 14,
            "commentary": "Try by Will Hopoate",
            "tackleNum": 5,
            "teamId": 500010,
            "teamName": "Canterbury-Bankstown Bulldogs",
            "homeTeamAbbrv": "CBY",
            "awayTeamAbbrv": "WST"
        },
        {
            "gameState": "First Half",
            "gameStateId": 3,
            "gameTime": "0:30:20",
            "gameSeconds": 1820,
            "GameMinutes": "30:20",
            "playerId": 500243,
            "playerName": "Moses Mbye",
            "scoreMethod": "Conversion",
            "statEvent": "Conversion-Made",
            "statId": 1,
            "statValue": 2,
            "vidRef": 52989,
            "homeScore": 16,
            "awayScore": 14,
            "commentary": "Conversion-Made by Moses Mbye",
            "tackleNum": -1,
            "teamId": 500010,
            "teamName": "Canterbury-Bankstown Bulldogs",
            "homeTeamAbbrv": "CBY",
            "awayTeamAbbrv": "WST"
        },
        {
            "gameState": "Second Half",
            "gameStateId": 5,
            "gameTime": "0:59:06",
            "gameSeconds": 3546,
            "GameMinutes": "59:06",
            "playerId": 500633,
            "playerName": "Brett Morris",
            "scoreMethod": "Try",
            "statEvent": "Try",
            "statId": 38,
            "statValue": 4,
            "vidRef": 104694,
            "homeScore": 20,
            "awayScore": 22,
            "commentary": "Try by Brett Morris",
            "tackleNum": 6,
            "teamId": 500010,
            "teamName": "Canterbury-Bankstown Bulldogs",
            "homeTeamAbbrv": "CBY",
            "awayTeamAbbrv": "WST"
        },
        {
            "gameState": "Second Half",
            "gameStateId": 5,
            "gameTime": "1:03:22",
            "gameSeconds": 3802,
            "GameMinutes": "63:22",
            "playerId": 500294,
            "playerName": "Curtis Rona",
            "scoreMethod": "Try",
            "statEvent": "Try",
            "statId": 38,
            "statValue": 4,
            "vidRef": 111564,
            "homeScore": 24,
            "awayScore": 22,
            "commentary": "Try by Curtis Rona",
            "tackleNum": 4,
            "teamId": 500010,
            "teamName": "Canterbury-Bankstown Bulldogs",
            "homeTeamAbbrv": "CBY",
            "awayTeamAbbrv": "WST"
        },
        {
            "gameState": "Second Half",
            "gameStateId": 5,
            "gameTime": "1:04:59",
            "gameSeconds": 3899,
            "GameMinutes": "64:59",
            "playerId": 500243,
            "playerName": "Moses Mbye",
            "scoreMethod": "Conversion",
            "statEvent": "Conversion-Made",
            "statId": 1,
            "statValue": 2,
            "vidRef": 113994,
            "homeScore": 26,
            "awayScore": 22,
            "commentary": "Conversion-Made by Moses Mbye",
            "tackleNum": -1,
            "teamId": 500010,
            "teamName": "Canterbury-Bankstown Bulldogs",
            "homeTeamAbbrv": "CBY",
            "awayTeamAbbrv": "WST"
        },
        {
            "gameState": "Second Half",
            "gameStateId": 5,
            "gameTime": "1:19:17",
            "gameSeconds": 4757,
            "GameMinutes": "79:17",
            "playerId": 500234,
            "playerName": "Sam Perrett",
            "scoreMethod": "Try",
            "statEvent": "Try",
            "statId": 38,
            "statValue": 4,
            "vidRef": 137138,
            "homeScore": 30,
            "awayScore": 22,
            "commentary": "Try by Sam Perrett",
            "tackleNum": 4,
            "teamId": 500010,
            "teamName": "Canterbury-Bankstown Bulldogs",
            "homeTeamAbbrv": "CBY",
            "awayTeamAbbrv": "WST"
        },
        {
            "gameState": "Second Half",
            "gameStateId": 5,
            "gameTime": "1:20:00",
            "gameSeconds": 4800,
            "GameMinutes": "80:00",
            "playerId": 500243,
            "playerName": "Moses Mbye",
            "scoreMethod": "Conversion",
            "statEvent": "Conversion-Made",
            "statId": 1,
            "statValue": 2,
            "vidRef": 139214,
            "homeScore": 32,
            "awayScore": 22,
            "commentary": "Conversion-Made by Moses Mbye",
            "tackleNum": -1,
            "teamId": 500010,
            "teamName": "Canterbury-Bankstown Bulldogs",
            "homeTeamAbbrv": "CBY",
            "awayTeamAbbrv": "WST"
        },
        {
            "gameState": "First Half",
            "gameStateId": 3,
            "gameTime": "0:03:29",
            "gameSeconds": 209,
            "GameMinutes": "03:29",
            "playerId": 500041,
            "playerName": "Kevin Naiqama",
            "scoreMethod": "Try",
            "statEvent": "Try",
            "statId": 38,
            "statValue": 4,
            "vidRef": 8662,
            "awayScore": 4,
            "commentary": "Try by Kevin Naiqama",
            "tackleNum": 6,
            "teamId": 500023,
            "teamName": "Wests Tigers",
            "homeTeamAbbrv": "CBY",
            "awayTeamAbbrv": "WST"
        },
        {
            "gameState": "First Half",
            "gameStateId": 3,
            "gameTime": "0:04:23",
            "gameSeconds": 263,
            "GameMinutes": "04:23",
            "playerId": 500485,
            "playerName": "Mitchell Moses",
            "scoreMethod": "Conversion",
            "statEvent": "Conversion-Made",
            "statId": 1,
            "statValue": 2,
            "vidRef": 10002,
            "awayScore": 6,
            "commentary": "Conversion-Made by Mitchell Moses",
            "tackleNum": -1,
            "teamId": 500023,
            "teamName": "Wests Tigers",
            "homeTeamAbbrv": "CBY",
            "awayTeamAbbrv": "WST"
        },
        {
            "gameState": "First Half",
            "gameStateId": 3,
            "gameTime": "0:19:57",
            "gameSeconds": 1197,
            "GameMinutes": "19:57",
            "playerId": 500485,
            "playerName": "Mitchell Moses",
            "scoreMethod": "Penalty Goal",
            "statEvent": "Penalty Shot-Made",
            "statId": 67,
            "statValue": 2,
            "vidRef": 35246,
            "homeScore": 4,
            "awayScore": 8,
            "commentary": "Penalty Shot-Made by Mitchell Moses",
            "tackleNum": -1,
            "teamId": 500023,
            "teamName": "Wests Tigers",
            "homeTeamAbbrv": "CBY",
            "awayTeamAbbrv": "WST"
        },
        {
            "gameState": "First Half",
            "gameStateId": 3,
            "gameTime": "0:22:42",
            "gameSeconds": 1362,
            "GameMinutes": "22:42",
            "playerId": 501351,
            "playerName": "Josh Addo-Carr",
            "scoreMethod": "Try",
            "statEvent": "Try",
            "statId": 38,
            "statValue": 4,
            "vidRef": 39357,
            "homeScore": 4,
            "awayScore": 12,
            "commentary": "Try by Josh Addo-Carr",
            "tackleNum": 2,
            "teamId": 500023,
            "teamName": "Wests Tigers",
            "homeTeamAbbrv": "CBY",
            "awayTeamAbbrv": "WST"
        },
        {
            "gameState": "First Half",
            "gameStateId": 3,
            "gameTime": "0:24:08",
            "gameSeconds": 1448,
            "GameMinutes": "24:08",
            "playerId": 500485,
            "playerName": "Mitchell Moses",
            "scoreMethod": "Conversion",
            "statEvent": "Conversion-Made",
            "statId": 1,
            "statValue": 2,
            "vidRef": 41513,
            "homeScore": 4,
            "awayScore": 14,
            "commentary": "Conversion-Made by Mitchell Moses",
            "tackleNum": -1,
            "teamId": 500023,
            "teamName": "Wests Tigers",
            "homeTeamAbbrv": "CBY",
            "awayTeamAbbrv": "WST"
        },
        {
            "gameState": "First Half",
            "gameStateId": 3,
            "gameTime": "0:40:00",
            "gameSeconds": 2400,
            "GameMinutes": "40:00",
            "playerId": 500485,
            "playerName": "Mitchell Moses",
            "scoreMethod": "Penalty Goal",
            "statEvent": "Penalty Shot-Made",
            "statId": 67,
            "statValue": 2,
            "vidRef": 67650,
            "homeScore": 16,
            "awayScore": 16,
            "commentary": "Penalty Shot-Made by Mitchell Moses",
            "tackleNum": -1,
            "teamId": 500023,
            "teamName": "Wests Tigers",
            "homeTeamAbbrv": "CBY",
            "awayTeamAbbrv": "WST"
        },
        {
            "gameState": "Second Half",
            "gameStateId": 5,
            "gameTime": "0:43:33",
            "gameSeconds": 2613,
            "GameMinutes": "43:33",
            "playerId": 503449,
            "playerName": "Jacob Liddle",
            "scoreMethod": "Try",
            "statEvent": "Try",
            "statId": 38,
            "statValue": 4,
            "vidRef": 74998,
            "homeScore": 16,
            "awayScore": 20,
            "commentary": "Try by Jacob Liddle",
            "tackleNum": 6,
            "teamId": 500023,
            "teamName": "Wests Tigers",
            "homeTeamAbbrv": "CBY",
            "awayTeamAbbrv": "WST"
        },
        {
            "gameState": "Second Half",
            "gameStateId": 5,
            "gameTime": "0:44:54",
            "gameSeconds": 2694,
            "GameMinutes": "44:54",
            "playerId": 500485,
            "playerName": "Mitchell Moses",
            "scoreMethod": "Conversion",
            "statEvent": "Conversion-Made",
            "statId": 1,
            "statValue": 2,
            "vidRef": 77019,
            "homeScore": 16,
            "awayScore": 22,
            "commentary": "Conversion-Made by Mitchell Moses",
            "tackleNum": -1,
            "teamId": 500023,
            "teamName": "Wests Tigers",
            "homeTeamAbbrv": "CBY",
            "awayTeamAbbrv": "WST"
        }
    ]
}