{
    "competitionId": 111,
    "competitionName": "NRL Telstra Premiership",
    "gameId": 20151111310,
    "gameInfo": {
        "assistantReferee1Id": 500038,
        "numberOfPeriods": 2,
        "assistantReferee1Name": "Michael Wise",
        "assistantReferee2Id": 500034,
        "assistantReferee2Name": "Dave Munro",
        "gameDate": "2015-06-05",
        "gameHashTag": "#NRLBroncosManly",
        "gameNumber": 1,
        "gameSeconds": 4800,
        "gameTime": "1:20:00",
        "groundConditionId": 2,
        "groundConditionName": "Good",
        "referee1Id": 500002,
        "referee1Name": "Matt Cecchin",
        "referee2Id": 500012,
        "referee2Name": "Gavin Morris",
        "startTime": "2015-06-05T19:35:00",
        "startTimeUTC": "2015-06-05T09:35:00Z",
        "venueId": 500010,
        "venueName": "Suncorp Stadium",
        "videoReferee1Id": 500017,
        "videoReferee1Name": "Luke Phillips",
        "videoReferee2Id": 500027,
        "videoReferee2Name": "Bernard Sutton",
        "weatherId": 2,
        "weatherName": "Fine"
    },
    "gameState": "Final",
    "gameStateId": 8,
    "roundId": 13,
    "seasonId": 2015,
    "teams": {
        "teamsMatch": [
            {
                "isHomeTeam": true,
                "score": {
                    "conversions": 5,
                    "points": 44,
                    "penaltyGoals": 1,
                    "tries": 8
                },
                "team1stHalfScore": 20,
                "team2ndHalfScore": 24,
                "teamAbbr": "BRI",
                "teamFinalScore": 44,
                "teamFullTimeScore": 44,
                "teamHalfTimeScore": 20,
                "teamId": 500011,
                "teamLineup": {
                    "injuriesAndSuspensions": {
                        "injury": [
                            {
                                "injuryDescription": "Hamstring, Round 14",
                                "playerFirstName": "Dale",
                                "playerId": "500245",
                                "playerLastName": "Copley",
                                "playerName": "Dale Copley"
                            },
                            {
                                "injuryDescription": "Knee, Round 14",
                                "playerFirstName": "Mitchell",
                                "playerId": "500247",
                                "playerLastName": "Dodds",
                                "playerName": "Mitchell Dodds"
                            },
                            {
                                "injuryDescription": "Medial Ligament, Round 16",
                                "playerFirstName": "Kodi",
                                "playerId": "500265",
                                "playerLastName": "Nikorima",
                                "playerName": "Kodi Nikorima"
                            },
                            {
                                "injuryDescription": "ACL, Season",
                                "playerFirstName": "James",
                                "playerId": "501286",
                                "playerLastName": "Gavet",
                                "playerName": "James Gavet"
                            }
                        ],
                        "suspension": []
                    },
                    "insAndOuts": {
                        "inOut": [
                            {
                                "inOut": "Out",
                                "playerFirstName": "Corey",
                                "playerId": "500268",
                                "playerLastName": "Parker",
                                "playerName": "Corey Parker"
                            },
                            {
                                "inOut": "In",
                                "playerFirstName": "Justin",
                                "playerId": "500255",
                                "playerLastName": "Hodges",
                                "playerName": "Justin Hodges"
                            },
                            {
                                "inOut": "Out",
                                "playerFirstName": "Lachlan",
                                "playerId": "500260",
                                "playerLastName": "Maranta",
                                "playerName": "Lachlan Maranta"
                            },
                            {
                                "inOut": "In",
                                "playerFirstName": "Sam",
                                "playerId": "500273",
                                "playerLastName": "Thaiday",
                                "playerName": "Sam Thaiday"
                            }
                        ]
                    },
                    "teamPlayer": [
                        {
                            "playerFirstName": "Darius",
                            "playerId": 500040,
                            "playerLastName": "Boyd",
                            "playerName": "Darius Boyd",
                            "playerPosition": "Fullback",
                            "playerPositionId": 500001,
                            "playerStats": {
                                "allRunMetres": 182,
                                "allRuns": 16,
                                "bombKicksDefused": 1,
                                "bombKicksNotDefused": 2,
                                "decoys": 3,
                                "dummyHalfRuns": 3,
                                "fantasyPointsTotal": 41,
                                "hitUps": 1,
                                "kickReturnMetres": 7,
                                "kickReturns": 1,
                                "kicksDefused": 1,
                                "kicksNotDefused": 2,
                                "linebreakAssists": 1,
                                "linebreaks": 1,
                                "mins": 80,
                                "supports": 6,
                                "tackleBreaks": 2,
                                "tackles": 5,
                                "tryAssists": 1,
                                "tryCause": 1,
                                "hitupRunMeters": 9,
                                "evasionRuns": 11,
                                "evasionRunMetres": 124,
                                "dummyHalfRunMetres": 42,
                                "ptbNeutral": 69.23,
                                "ptbSlow": 30.77,
                                "ptbAll": 13
                            },
                            "playerTookTheField": true,
                            "shirtNum": 1
                        },
                        {
                            "playerFirstName": "Jordan",
                            "playerId": 500258,
                            "playerLastName": "Kahu",
                            "playerName": "Jordan Kahu",
                            "playerPosition": "Winger 1",
                            "playerPositionId": 500002,
                            "playerStats": {
                                "allRunMetres": 117,
                                "allRuns": 11,
                                "conversions": 5,
                                "conversionsAttempts": 8,
                                "conversionsMissed": 3,
                                "fantasyPointsTotal": 52,
                                "goalConversionRate": 66.667,
                                "allGoals": 6,
                                "allGoalsMissed": 3,
                                "allGoalsAttempted": 9,
                                "kickReturnMetres": 37,
                                "kickReturns": 3,
                                "linebreaks": 1,
                                "mins": 80,
                                "missedTackles": 1,
                                "oneOnOneTackles": 1,
                                "penaltyGoals": 1,
                                "penaltyGoalsAttempts": 1,
                                "points": 16,
                                "supports": 9,
                                "tackleBreaks": 3,
                                "tackles": 5,
                                "tries": 1,
                                "tryAssists": 1,
                                "evasionRuns": 8,
                                "evasionRunMetres": 80,
                                "ptbFast": 25,
                                "ptbNeutral": 75,
                                "ptbAll": 8
                            },
                            "playerTookTheField": true,
                            "shirtNum": 2
                        },
                        {
                            "playerFirstName": "Jack",
                            "playerId": 500269,
                            "playerLastName": "Reed",
                            "playerName": "Jack Reed",
                            "playerPosition": "Centre 1",
                            "playerPositionId": 500003,
                            "playerStats": {
                                "allRunMetres": 128,
                                "allRuns": 12,
                                "fantasyPointsTotal": 65,
                                "kickMetres": 26,
                                "kicks": 2,
                                "linebreakAssists": 3,
                                "linebreaks": 1,
                                "mins": 80,
                                "missedTackles": 1,
                                "oneOnOneTackles": 5,
                                "points": 4,
                                "supports": 11,
                                "tackles": 26,
                                "tries": 1,
                                "tryAssists": 2,
                                "tryCause": 1,
                                "evasionRuns": 12,
                                "evasionRunMetres": 128,
                                "ptbNeutral": 80,
                                "ptbSlow": 20,
                                "ptbAll": 5
                            },
                            "playerTookTheField": true,
                            "shirtNum": 3
                        },
                        {
                            "playerFirstName": "Justin",
                            "playerId": 500255,
                            "playerLastName": "Hodges",
                            "playerName": "Justin Hodges",
                            "playerPosition": "Centre 2",
                            "playerPositionId": 500004,
                            "playerStats": {
                                "allRunMetres": 66,
                                "allRuns": 13,
                                "decoys": 1,
                                "dummyHalfRuns": 3,
                                "errors": 1,
                                "fantasyPointsTotal": 30,
                                "kicksNotDefused": 2,
                                "mins": 63,
                                "missedTackles": 2,
                                "offloads": 4,
                                "points": 4,
                                "supports": 2,
                                "tackleBreaks": 2,
                                "tackles": 8,
                                "tries": 1,
                                "tryCause": 1,
                                "evasionRuns": 10,
                                "evasionRunMetres": 54,
                                "dummyHalfRunMetres": 12,
                                "ptbNeutral": 100,
                                "ptbAll": 7
                            },
                            "playerTookTheField": true,
                            "shirtNum": 4,
                            "isCaptain": true
                        },
                        {
                            "playerFirstName": "Daniel",
                            "playerId": 500274,
                            "playerLastName": "Vidot",
                            "playerName": "Daniel Vidot",
                            "playerPosition": "Winger 2",
                            "playerPositionId": 500005,
                            "playerStats": {
                                "allRunMetres": 229,
                                "allRuns": 20,
                                "bombKicksDefused": 1,
                                "decoys": 1,
                                "fantasyPointsTotal": 74,
                                "hitUps": 2,
                                "kickMetres": 32,
                                "kickReturnMetres": 52,
                                "kickReturns": 4,
                                "kicks": 1,
                                "kicksDefused": 1,
                                "linebreaks": 3,
                                "mins": 80,
                                "offloads": 2,
                                "points": 8,
                                "supports": 8,
                                "tackleBreaks": 4,
                                "tackles": 6,
                                "tries": 2,
                                "tryCause": 1,
                                "hitupRunMeters": 17,
                                "evasionRuns": 14,
                                "evasionRunMetres": 160,
                                "ptbFast": 21.43,
                                "ptbNeutral": 71.43,
                                "ptbSlow": 7.14,
                                "ptbAll": 14
                            },
                            "playerTookTheField": true,
                            "shirtNum": 5
                        },
                        {
                            "playerFirstName": "Anthony",
                            "playerId": 500326,
                            "playerLastName": "Milford",
                            "playerName": "Anthony Milford",
                            "playerPosition": "Five-eighth",
                            "playerPositionId": 500006,
                            "playerStats": {
                                "allRunMetres": 93,
                                "allRuns": 16,
                                "decoys": 1,
                                "dummyHalfRuns": 2,
                                "errors": 1,
                                "fantasyPointsTotal": 51,
                                "kickMetres": 53,
                                "kicks": 3,
                                "linebreaks": 1,
                                "mins": 80,
                                "missedTackles": 3,
                                "offloads": 2,
                                "penalties": 3,
                                "points": 8,
                                "supports": 8,
                                "tackleBreaks": 6,
                                "tackles": 12,
                                "tries": 2,
                                "evasionRuns": 14,
                                "evasionRunMetres": 83,
                                "dummyHalfRunMetres": 10,
                                "ptbNeutral": 83.33,
                                "ptbSlow": 16.67,
                                "ptbAll": 6
                            },
                            "playerTookTheField": true,
                            "shirtNum": 6
                        },
                        {
                            "playerFirstName": "Ben",
                            "playerId": 500257,
                            "playerLastName": "Hunt",
                            "playerName": "Ben Hunt",
                            "playerPosition": "Halfback",
                            "playerPositionId": 500007,
                            "playerStats": {
                                "allRunMetres": 62,
                                "allRuns": 7,
                                "bombKicks": 1,
                                "bombKickMetres": 40,
                                "errors": 1,
                                "fantasyPointsTotal": 79,
                                "ineffectiveTackles": 1,
                                "kickMetres": 459,
                                "kickReturnMetres": 10,
                                "kickReturns": 1,
                                "kicks": 16,
                                "linebreakAssists": 1,
                                "linebreaks": 1,
                                "mins": 80,
                                "missedTackles": 1,
                                "offloads": 2,
                                "oneOnOneTackles": 2,
                                "points": 4,
                                "supports": 10,
                                "tackleBreaks": 4,
                                "tackles": 20,
                                "tries": 1,
                                "tryAssists": 1,
                                "evasionRuns": 6,
                                "evasionRunMetres": 52,
                                "ptbSlow": 100,
                                "ptbAll": 1
                            },
                            "playerTookTheField": true,
                            "shirtNum": 7
                        },
                        {
                            "playerFirstName": "Josh",
                            "playerId": 500262,
                            "playerLastName": "McGuire",
                            "playerName": "Josh McGuire",
                            "playerPosition": "Prop 1",
                            "playerPositionId": 500008,
                            "playerStats": {
                                "allRunMetres": 192,
                                "allRuns": 22,
                                "decoys": 4,
                                "errors": 1,
                                "fantasyPointsTotal": 45,
                                "hitUps": 22,
                                "ineffectiveTackles": 2,
                                "mins": 57,
                                "offloads": 1,
                                "supports": 7,
                                "tackleBreaks": 2,
                                "tackles": 20,
                                "hitupRunMeters": 192,
                                "ptbFast": 5,
                                "ptbNeutral": 95,
                                "ptbAll": 20
                            },
                            "playerTookTheField": true,
                            "shirtNum": 8
                        },
                        {
                            "playerFirstName": "Andrew",
                            "playerId": 500261,
                            "playerLastName": "McCullough",
                            "playerName": "Andrew McCullough",
                            "playerPosition": "Hooker",
                            "playerPositionId": 500009,
                            "playerStats": {
                                "allRunMetres": 62,
                                "allRuns": 9,
                                "decoys": 1,
                                "dummyHalfRuns": 6,
                                "fantasyPointsTotal": 33,
                                "hitUps": 2,
                                "ineffectiveTackles": 1,
                                "kickMetres": 42,
                                "kicks": 1,
                                "mins": 66,
                                "missedTackles": 1,
                                "supports": 2,
                                "tackleBreaks": 1,
                                "tackles": 24,
                                "tryCause": 1,
                                "hitupRunMeters": 12,
                                "evasionRuns": 1,
                                "evasionRunMetres": 6,
                                "dummyHalfRunMetres": 44,
                                "ptbNeutral": 83.33,
                                "ptbSlow": 16.67,
                                "ptbAll": 6
                            },
                            "playerTookTheField": true,
                            "shirtNum": 9
                        },
                        {
                            "playerFirstName": "Adam",
                            "playerId": 500645,
                            "playerLastName": "Blair",
                            "playerName": "Adam Blair",
                            "playerPosition": "Prop 2",
                            "playerPositionId": 500010,
                            "playerStats": {
                                "allRunMetres": 84,
                                "allRuns": 12,
                                "decoys": 5,
                                "fantasyPointsTotal": 30,
                                "hitUps": 10,
                                "kickReturnMetres": 18,
                                "kickReturns": 2,
                                "mins": 57,
                                "missedTackles": 1,
                                "offloads": 1,
                                "oneOnOneTackles": 1,
                                "penalties": 1,
                                "supports": 2,
                                "tackles": 24,
                                "tryCause": 1,
                                "hitupRunMeters": 66,
                                "ptbFast": 9.09,
                                "ptbNeutral": 90.91,
                                "ptbAll": 11
                            },
                            "playerTookTheField": true,
                            "shirtNum": 10
                        },
                        {
                            "playerFirstName": "Alex",
                            "playerId": 500250,
                            "playerLastName": "Glenn",
                            "playerName": "Alex Glenn",
                            "playerPosition": "2nd Row 1",
                            "playerPositionId": 500011,
                            "playerStats": {
                                "allRunMetres": 123,
                                "allRuns": 14,
                                "decoys": 2,
                                "fantasyPointsTotal": 34,
                                "hitUps": 13,
                                "ineffectiveTackles": 2,
                                "kickMetres": 16,
                                "kicks": 1,
                                "linebreakAssists": 1,
                                "mins": 74,
                                "missedTackles": 1,
                                "oneOnOneTackles": 1,
                                "supports": 7,
                                "tackles": 22,
                                "tryCause": 1,
                                "hitupRunMeters": 116,
                                "evasionRuns": 1,
                                "evasionRunMetres": 7,
                                "ptbNeutral": 100,
                                "ptbAll": 13
                            },
                            "playerTookTheField": true,
                            "shirtNum": 11
                        },
                        {
                            "playerFirstName": "Matt",
                            "playerId": 500249,
                            "playerLastName": "Gillett",
                            "playerName": "Matt Gillett",
                            "playerPosition": "2nd Row 2",
                            "playerPositionId": 500012,
                            "playerStats": {
                                "allRunMetres": 80,
                                "allRuns": 11,
                                "decoys": 6,
                                "fantasyPointsTotal": 46,
                                "hitUps": 11,
                                "mins": 80,
                                "oneOnOneTackles": 1,
                                "supports": 9,
                                "tackles": 38,
                                "hitupRunMeters": 80,
                                "ptbFast": 20,
                                "ptbNeutral": 50,
                                "ptbSlow": 30,
                                "ptbAll": 10
                            },
                            "playerTookTheField": true,
                            "shirtNum": 12
                        },
                        {
                            "playerFirstName": "Sam",
                            "playerId": 500273,
                            "playerLastName": "Thaiday",
                            "playerName": "Sam Thaiday",
                            "playerPosition": "Lock",
                            "playerPositionId": 500013,
                            "playerStats": {
                                "allRunMetres": 132,
                                "allRuns": 14,
                                "decoys": 7,
                                "fantasyPointsTotal": 33,
                                "hitUps": 11,
                                "ineffectiveTackles": 2,
                                "kickReturnMetres": 26,
                                "kickReturns": 2,
                                "mins": 60,
                                "oneOnOneTackles": 3,
                                "supports": 18,
                                "tackles": 20,
                                "hitupRunMeters": 101,
                                "evasionRuns": 1,
                                "evasionRunMetres": 5,
                                "ptbFast": 16.67,
                                "ptbNeutral": 75,
                                "ptbSlow": 8.33,
                                "ptbAll": 12
                            },
                            "playerTookTheField": true,
                            "shirtNum": 13
                        },
                        {
                            "playerFirstName": "Jarrod",
                            "playerId": 500275,
                            "playerLastName": "Wallace",
                            "playerName": "Jarrod Wallace",
                            "playerPosition": "Interchange",
                            "playerPositionId": 500014,
                            "playerStats": {
                                "allRunMetres": 100,
                                "allRuns": 11,
                                "decoys": 8,
                                "fantasyPointsTotal": 24,
                                "hitUps": 9,
                                "ineffectiveTackles": 1,
                                "kickReturnMetres": 30,
                                "kickReturns": 2,
                                "mins": 38,
                                "oneOnOneTackles": 1,
                                "supports": 9,
                                "tackles": 14,
                                "hitupRunMeters": 70,
                                "ptbNeutral": 90,
                                "ptbSlow": 10,
                                "ptbAll": 10
                            },
                            "playerTookTheField": true,
                            "shirtNum": 14
                        },
                        {
                            "playerFirstName": "Francis",
                            "playerId": 500264,
                            "playerLastName": "Molo",
                            "playerName": "Francis Molo",
                            "playerPosition": "Interchange",
                            "playerPositionId": 500014,
                            "playerStats": {
                                "allRunMetres": 62,
                                "allRuns": 7,
                                "decoys": 4,
                                "errors": 1,
                                "fantasyPointsTotal": 9,
                                "hitUps": 5,
                                "ineffectiveTackles": 1,
                                "kickReturnMetres": 23,
                                "kickReturns": 2,
                                "mins": 23,
                                "missedTackles": 1,
                                "supports": 3,
                                "tackles": 7,
                                "tryCause": 1,
                                "hitupRunMeters": 39,
                                "ptbFast": 16.67,
                                "ptbNeutral": 83.33,
                                "ptbAll": 6
                            },
                            "playerTookTheField": true,
                            "shirtNum": 15
                        },
                        {
                            "playerFirstName": "Corey",
                            "playerId": 500266,
                            "playerLastName": "Oates",
                            "playerName": "Corey Oates",
                            "playerPosition": "Interchange",
                            "playerPositionId": 500014,
                            "playerStats": {
                                "allRunMetres": 73,
                                "allRuns": 4,
                                "fantasyPointsTotal": 14,
                                "hitUps": 1,
                                "kickReturnMetres": 15,
                                "kickReturns": 1,
                                "kicks": 1,
                                "mins": 17,
                                "supports": 2,
                                "tackleBreaks": 2,
                                "tackles": 1,
                                "hitupRunMeters": 11,
                                "evasionRuns": 2,
                                "evasionRunMetres": 47,
                                "ptbFast": 33.33,
                                "ptbNeutral": 66.67,
                                "ptbAll": 3
                            },
                            "playerTookTheField": true,
                            "shirtNum": 16
                        },
                        {
                            "playerFirstName": "Matt",
                            "playerId": 501005,
                            "playerLastName": "Parcell",
                            "playerName": "Matt Parcell",
                            "playerPosition": "Interchange",
                            "playerPositionId": 500014,
                            "playerStats": {
                                "allRunMetres": 18,
                                "allRuns": 2,
                                "dummyHalfRuns": 2,
                                "fantasyPointsTotal": 11,
                                "ineffectiveTackles": 1,
                                "mins": 25,
                                "supports": 1,
                                "tackles": 10,
                                "dummyHalfRunMetres": 18,
                                "ptbNeutral": 100,
                                "ptbAll": 1
                            },
                            "playerTookTheField": true,
                            "shirtNum": 17
                        }
                    ]
                },
                "teamName": "Brisbane Broncos",
                "teamNickName": "Broncos",
                "teamStats": {
                    "allRunMetres": 1804,
                    "allRuns": 201,
                    "bombKicks": 1,
                    "bombKickMetres": 40,
                    "bombKicksDefused": 2,
                    "bombKicksNotDefused": 2,
                    "completeSets": 35,
                    "completionPercentage": 92,
                    "conversions": 5,
                    "conversionsAttempts": 8,
                    "conversionsMissed": 3,
                    "decoys": 43,
                    "dummyHalfRuns": 16,
                    "errors": 5,
                    "goalConversionRate": 66.667,
                    "allGoals": 6,
                    "allGoalsAttempted": 9,
                    "allGoalsMissed": 3,
                    "hitUps": 87,
                    "incompleteSets": 3,
                    "ineffectiveTackles": 11,
                    "kickMetres": 629,
                    "kickReturnMetres": 218,
                    "kickReturns": 18,
                    "kicks": 25,
                    "kicksDefused": 2,
                    "kicksNotDefused": 4,
                    "linebreakAssists": 6,
                    "linebreaks": 8,
                    "missedTackles": 12,
                    "offloads": 12,
                    "oneOnOneTackles": 15,
                    "penalties": 4,
                    "penaltyGoals": 1,
                    "penaltyGoalsAttempts": 1,
                    "points": 44,
                    "pointsConceded": 10,
                    "possession": 51,
                    "scrumWins": 4,
                    "supports": 114,
                    "tackleBreaks": 26,
                    "tackles": 262,
                    "sets": 38,
                    "tries": 8,
                    "triesConceded": 2,
                    "tryAssists": 5,
                    "hitupRunMeters": 714,
                    "evasionRuns": 80,
                    "evasionRunMetres": 746,
                    "dummyHalfRunMetres": 126,
                    "ptbFast": 9,
                    "ptbNeutral": 82,
                    "ptbSlow": 10,
                    "ptbTotal": 146
                }
            },
            {
                "score": {
                    "conversions": 1,
                    "points": 10,
                    "tries": 2
                },
                "team1stHalfScore": 6,
                "team2ndHalfScore": 4,
                "teamAbbr": "MAN",
                "teamFinalScore": 10,
                "teamFullTimeScore": 10,
                "teamHalfTimeScore": 6,
                "teamId": 500002,
                "teamLineup": {
                    "injuriesAndSuspensions": {
                        "injury": [
                            {
                                "injuryDescription": "Shoulder, Round 14-16",
                                "playerFirstName": "Daly",
                                "playerId": "500024",
                                "playerLastName": "Cherry-Evans",
                                "playerName": "Daly Cherry-Evans"
                            },
                            {
                                "injuryDescription": "Back, Round 16",
                                "playerFirstName": "Brenton",
                                "playerId": "500025",
                                "playerLastName": "Lawrence",
                                "playerName": "Brenton Lawrence"
                            },
                            {
                                "injuryDescription": "Knee, Season",
                                "playerFirstName": "Jamie",
                                "playerId": "500032",
                                "playerLastName": "Buhrer",
                                "playerName": "Jamie Buhrer"
                            },
                            {
                                "injuryDescription": "Shoulder, Round 13",
                                "playerFirstName": "Jesse",
                                "playerId": "500583",
                                "playerLastName": "Sene-Lefao",
                                "playerName": "Jesse Sene-Lefao"
                            },
                            {
                                "injuryDescription": "ACL, Season",
                                "playerFirstName": "Clinton",
                                "playerId": "500729",
                                "playerLastName": "Gutherson",
                                "playerName": "Clinton Gutherson"
                            },
                            {
                                "injuryDescription": "Unknown, Round 13",
                                "playerFirstName": "Josh",
                                "playerId": "501261",
                                "playerLastName": "Starling",
                                "playerName": "Josh Starling"
                            }
                        ],
                        "suspension": []
                    },
                    "insAndOuts": {
                        "inOut": [
                            {
                                "inOut": "In",
                                "playerFirstName": "Daly",
                                "playerId": "500024",
                                "playerLastName": "Cherry-Evans",
                                "playerName": "Daly Cherry-Evans"
                            },
                            {
                                "inOut": "In",
                                "playerFirstName": "Feleti",
                                "playerId": "500714",
                                "playerLastName": "Mateo",
                                "playerName": "Feleti Mateo"
                            },
                            {
                                "inOut": "Out",
                                "playerFirstName": "James",
                                "playerId": "500578",
                                "playerLastName": "Hasson",
                                "playerName": "James Hasson"
                            },
                            {
                                "inOut": "Out",
                                "playerFirstName": "Tom",
                                "playerId": "501505",
                                "playerLastName": "Trbojevic",
                                "playerName": "Tom Trbojevic"
                            }
                        ]
                    },
                    "teamPlayer": [
                        {
                            "playerFirstName": "Brett",
                            "playerId": 500018,
                            "playerLastName": "Stewart",
                            "playerName": "Brett Stewart",
                            "playerPosition": "Fullback",
                            "playerPositionId": 500001,
                            "playerStats": {
                                "allRunMetres": 51,
                                "allRuns": 6,
                                "decoys": 1,
                                "dummyHalfRuns": 1,
                                "errors": 1,
                                "fantasyPointsTotal": 13,
                                "kickMetres": 40,
                                "kickReturnMetres": 28,
                                "kickReturns": 4,
                                "kicks": 1,
                                "kicksDefused": 3,
                                "mins": 80,
                                "missedTackles": 3,
                                "oneOnOneTackles": 2,
                                "points": 4,
                                "supports": 4,
                                "tackles": 3,
                                "tries": 1,
                                "tryCause": 2,
                                "evasionRuns": 1,
                                "evasionRunMetres": 7,
                                "dummyHalfRunMetres": 16,
                                "ptbNeutral": 100,
                                "ptbAll": 5
                            },
                            "playerTookTheField": true,
                            "shirtNum": 1
                        },
                        {
                            "playerFirstName": "Jorge",
                            "playerId": 500019,
                            "playerLastName": "Taufua",
                            "playerName": "Jorge Taufua",
                            "playerPosition": "Winger 1",
                            "playerPositionId": 500002,
                            "playerStats": {
                                "allRunMetres": 81,
                                "allRuns": 9,
                                "errors": 2,
                                "fantasyPointsTotal": 16,
                                "kickReturnMetres": 3,
                                "kickReturns": 1,
                                "kicksDefused": 1,
                                "kicksNotDefused": 3,
                                "mins": 80,
                                "missedTackles": 1,
                                "offloads": 1,
                                "oneOnOneTackles": 3,
                                "supports": 5,
                                "tackleBreaks": 2,
                                "tackles": 5,
                                "tryCause": 2,
                                "evasionRuns": 8,
                                "evasionRunMetres": 78,
                                "ptbNeutral": 100,
                                "ptbAll": 7
                            },
                            "playerTookTheField": true,
                            "shirtNum": 2
                        },
                        {
                            "playerFirstName": "Jamie",
                            "playerId": 500020,
                            "playerLastName": "Lyon",
                            "playerName": "Jamie Lyon",
                            "playerPosition": "Centre 1",
                            "playerPositionId": 500003,
                            "playerStats": {
                                "allRunMetres": 74,
                                "allRuns": 9,
                                "bombKicksDefused": 1,
                                "conversions": 1,
                                "conversionsAttempts": 2,
                                "conversionsMissed": 1,
                                "decoys": 1,
                                "errors": 1,
                                "fantasyPointsTotal": 28,
                                "goalConversionRate": 50,
                                "allGoals": 1,
                                "allGoalsMissed": 1,
                                "allGoalsAttempted": 2,
                                "ineffectiveTackles": 2,
                                "kickReturns": 1,
                                "kicksDefused": 1,
                                "kicksNotDefused": 1,
                                "linebreakAssists": 1,
                                "mins": 55,
                                "missedTackles": 1,
                                "points": 2,
                                "supports": 3,
                                "tackleBreaks": 1,
                                "tackles": 12,
                                "tryAssists": 1,
                                "tryCause": 1,
                                "evasionRuns": 8,
                                "evasionRunMetres": 74,
                                "ptbFast": 14.29,
                                "ptbNeutral": 57.14,
                                "ptbSlow": 28.57,
                                "ptbAll": 7
                            },
                            "playerTookTheField": true,
                            "shirtNum": 6
                        },
                        {
                            "playerFirstName": "Steve",
                            "playerId": 500021,
                            "playerLastName": "Matai",
                            "playerName": "Steve Matai",
                            "playerPosition": "Centre 2",
                            "playerPositionId": 500004,
                            "playerStats": {
                                "allRunMetres": 78,
                                "allRuns": 9,
                                "decoys": 2,
                                "dummyHalfRuns": 1,
                                "errors": 1,
                                "fantasyPointsTotal": 12,
                                "mins": 80,
                                "missedTackles": 3,
                                "oneOnOneTackles": 1,
                                "penalties": 1,
                                "supports": 7,
                                "tackleBreaks": 2,
                                "tackles": 9,
                                "tryCause": 1,
                                "evasionRuns": 8,
                                "evasionRunMetres": 65,
                                "dummyHalfRunMetres": 13,
                                "ptbFast": 12.5,
                                "ptbNeutral": 87.5,
                                "ptbAll": 8
                            },
                            "playerTookTheField": true,
                            "shirtNum": 4
                        },
                        {
                            "playerFirstName": "Peta",
                            "playerId": 500579,
                            "playerLastName": "Hiku",
                            "playerName": "Peta Hiku",
                            "playerPosition": "Winger 2",
                            "playerPositionId": 500005,
                            "playerStats": {
                                "allRunMetres": 108,
                                "allRuns": 13,
                                "fantasyPointsTotal": 27,
                                "ineffectiveTackles": 1,
                                "kickReturnMetres": 59,
                                "kickReturns": 7,
                                "kicksDefused": 1,
                                "linebreaks": 1,
                                "mins": 80,
                                "missedTackles": 1,
                                "oneOnOneTackles": 1,
                                "points": 4,
                                "supports": 10,
                                "tackles": 6,
                                "tries": 1,
                                "tryCause": 2,
                                "evasionRuns": 6,
                                "evasionRunMetres": 49,
                                "ptbFast": 8.33,
                                "ptbNeutral": 83.33,
                                "ptbSlow": 8.33,
                                "ptbAll": 12
                            },
                            "playerTookTheField": true,
                            "shirtNum": 3
                        },
                        {
                            "playerFirstName": "Kieran",
                            "playerId": 500023,
                            "playerLastName": "Foran",
                            "playerName": "Kieran Foran",
                            "playerPosition": "Five-eighth",
                            "playerPositionId": 500006,
                            "playerStats": {
                                "allRunMetres": 143,
                                "allRuns": 16,
                                "bombKicks": 3,
                                "bombKickMetres": 70,
                                "decoys": 1,
                                "errors": 1,
                                "fantasyPointsTotal": 26,
                                "ineffectiveTackles": 1,
                                "kickMetres": 75,
                                "kicks": 5,
                                "linebreaks": 1,
                                "mins": 80,
                                "missedTackles": 4,
                                "offloads": 1,
                                "supports": 4,
                                "tackleBreaks": 1,
                                "tackles": 10,
                                "tryCause": 1,
                                "evasionRuns": 16,
                                "evasionRunMetres": 143,
                                "ptbNeutral": 100,
                                "ptbAll": 4
                            },
                            "playerTookTheField": true,
                            "shirtNum": 7,
                            "isCaptain": true
                        },
                        {
                            "playerFirstName": "Daly",
                            "playerId": 500024,
                            "playerLastName": "Cherry-Evans",
                            "playerName": "Daly Cherry-Evans",
                            "playerPosition": "Halfback",
                            "playerPositionId": 500007,
                            "playerStats": {
                                "allRunMetres": 71,
                                "allRuns": 6,
                                "bombKicks": 1,
                                "bombKickMetres": 21,
                                "dummyHalfRuns": 1,
                                "errors": 1,
                                "fantasyPointsTotal": 64,
                                "kickMetres": 261,
                                "kicks": 7,
                                "kicksDefused": 1,
                                "kicksNotDefused": 1,
                                "lineDropouts": 3,
                                "linebreaks": 1,
                                "mins": 80,
                                "missedTackles": 1,
                                "oneOnOneTackles": 4,
                                "supports": 9,
                                "tackleBreaks": 3,
                                "tackles": 29,
                                "tryAssists": 1,
                                "tryCause": 1,
                                "evasionRuns": 5,
                                "evasionRunMetres": 61,
                                "dummyHalfRunMetres": 10,
                                "ptbNeutral": 100,
                                "ptbAll": 1
                            },
                            "playerTookTheField": true,
                            "shirtNum": 19
                        },
                        {
                            "playerFirstName": "Luke",
                            "playerId": 500103,
                            "playerLastName": "Burgess",
                            "playerName": "Luke Burgess",
                            "playerPosition": "Prop 1",
                            "playerPositionId": 500008,
                            "playerStats": {
                                "allRunMetres": 105,
                                "allRuns": 10,
                                "decoys": 3,
                                "fantasyPointsTotal": 37,
                                "hitUps": 8,
                                "ineffectiveTackles": 2,
                                "kickReturnMetres": 10,
                                "kickReturns": 1,
                                "mins": 43,
                                "offloads": 1,
                                "supports": 2,
                                "tackles": 25,
                                "hitupRunMeters": 88,
                                "evasionRuns": 1,
                                "evasionRunMetres": 7,
                                "ptbFast": 25,
                                "ptbNeutral": 75,
                                "ptbAll": 8
                            },
                            "playerTookTheField": true,
                            "shirtNum": 8
                        },
                        {
                            "playerFirstName": "Matt",
                            "playerId": 500026,
                            "playerLastName": "Ballin",
                            "playerName": "Matt Ballin",
                            "playerPosition": "Hooker",
                            "playerPositionId": 500009,
                            "playerStats": {
                                "allRunMetres": 34,
                                "allRuns": 6,
                                "dummyHalfRuns": 5,
                                "errors": 2,
                                "fantasyPointsTotal": 48,
                                "ineffectiveTackles": 4,
                                "mins": 80,
                                "missedTackles": 2,
                                "oneOnOneTackles": 3,
                                "supports": 1,
                                "tackles": 53,
                                "tryCause": 1,
                                "evasionRuns": 1,
                                "evasionRunMetres": 8,
                                "dummyHalfRunMetres": 26,
                                "ptbFast": 40,
                                "ptbNeutral": 60,
                                "ptbAll": 5
                            },
                            "playerTookTheField": true,
                            "shirtNum": 9
                        },
                        {
                            "playerFirstName": "Willie",
                            "playerId": 500049,
                            "playerLastName": "Mason",
                            "playerName": "Willie Mason",
                            "playerPosition": "Prop 2",
                            "playerPositionId": 500010,
                            "playerStats": {
                                "allRunMetres": 33,
                                "allRuns": 4,
                                "decoys": 2,
                                "fantasyPointsTotal": 25,
                                "hitUps": 4,
                                "mins": 35,
                                "missedTackles": 2,
                                "offloads": 1,
                                "oneOnOneTackles": 2,
                                "supports": 2,
                                "tackles": 24,
                                "tryCause": 1,
                                "hitupRunMeters": 33,
                                "ptbNeutral": 100,
                                "ptbAll": 3
                            },
                            "playerTookTheField": true,
                            "shirtNum": 10
                        },
                        {
                            "playerFirstName": "Blake",
                            "playerId": 501035,
                            "playerLastName": "Leary",
                            "playerName": "Blake Leary",
                            "playerPosition": "2nd Row 1",
                            "playerPositionId": 500011,
                            "playerStats": {
                                "allRunMetres": 111,
                                "allRuns": 13,
                                "decoys": 6,
                                "fantasyPointsTotal": 53,
                                "hitUps": 13,
                                "ineffectiveTackles": 1,
                                "kicksNotDefused": 1,
                                "mins": 77,
                                "oneOnOneTackles": 2,
                                "supports": 9,
                                "tackleBreaks": 3,
                                "tackles": 33,
                                "tryCause": 1,
                                "hitupRunMeters": 111,
                                "ptbFast": 46.15,
                                "ptbNeutral": 46.15,
                                "ptbSlow": 7.69,
                                "ptbAll": 13
                            },
                            "playerTookTheField": true,
                            "shirtNum": 11
                        },
                        {
                            "playerFirstName": "Justin",
                            "playerId": 500029,
                            "playerLastName": "Horo",
                            "playerName": "Justin Horo",
                            "playerPosition": "2nd Row 2",
                            "playerPositionId": 500012,
                            "playerStats": {
                                "allRunMetres": 114,
                                "allRuns": 13,
                                "decoys": 3,
                                "errors": 1,
                                "fantasyPointsTotal": 24,
                                "hitUps": 13,
                                "ineffectiveTackles": 2,
                                "mins": 80,
                                "missedTackles": 1,
                                "onReport": 1,
                                "oneOnOneTackles": 2,
                                "penalties": 1,
                                "supports": 8,
                                "tackles": 19,
                                "tryCause": 1,
                                "hitupRunMeters": 114,
                                "ptbFast": 33.33,
                                "ptbNeutral": 66.67,
                                "ptbAll": 12
                            },
                            "playerTookTheField": true,
                            "shirtNum": 12
                        },
                        {
                            "playerFirstName": "Dunamis",
                            "playerId": 500957,
                            "playerLastName": "Lui",
                            "playerName": "Dunamis Lui",
                            "playerPosition": "Lock",
                            "playerPositionId": 500013,
                            "playerStats": {
                                "allRunMetres": 21,
                                "allRuns": 2,
                                "decoys": 6,
                                "fantasyPointsTotal": 16,
                                "hitUps": 2,
                                "ineffectiveTackles": 2,
                                "mins": 42,
                                "missedTackles": 2,
                                "oneOnOneTackles": 1,
                                "penalties": 1,
                                "supports": 5,
                                "tackles": 20,
                                "tryCause": 1,
                                "hitupRunMeters": 21,
                                "ptbNeutral": 100,
                                "ptbAll": 2
                            },
                            "playerTookTheField": true,
                            "shirtNum": 13
                        },
                        {
                            "playerFirstName": "Tom",
                            "playerId": 500033,
                            "playerLastName": "Symonds",
                            "playerName": "Tom Symonds",
                            "playerPosition": "Interchange",
                            "playerPositionId": 500014,
                            "playerStats": {
                                "allRunMetres": 48,
                                "allRuns": 6,
                                "errors": 1,
                                "fantasyPointsTotal": 9,
                                "hitUps": 6,
                                "mins": 25,
                                "missedTackles": 1,
                                "supports": 1,
                                "tackles": 9,
                                "tryCause": 2,
                                "hitupRunMeters": 48,
                                "ptbNeutral": 100,
                                "ptbAll": 5
                            },
                            "playerTookTheField": true,
                            "shirtNum": 14
                        },
                        {
                            "playerFirstName": "Jake",
                            "playerId": 500751,
                            "playerLastName": "Trbojevic",
                            "playerName": "Jake Trbojevic",
                            "playerPosition": "Interchange",
                            "playerPositionId": 500014,
                            "playerStats": {
                                "allRunMetres": 79,
                                "allRuns": 9,
                                "decoys": 9,
                                "fantasyPointsTotal": 31,
                                "hitUps": 5,
                                "ineffectiveTackles": 1,
                                "kickReturnMetres": 26,
                                "kickReturns": 2,
                                "mins": 44,
                                "missedTackles": 1,
                                "oneOnOneTackles": 2,
                                "penalties": 2,
                                "supports": 8,
                                "tackles": 30,
                                "tryCause": 1,
                                "hitupRunMeters": 44,
                                "evasionRuns": 2,
                                "evasionRunMetres": 9,
                                "ptbFast": 16.67,
                                "ptbNeutral": 83.33,
                                "ptbAll": 6
                            },
                            "playerTookTheField": true,
                            "shirtNum": 15
                        },
                        {
                            "playerFirstName": "Feleti",
                            "playerId": 500714,
                            "playerLastName": "Mateo",
                            "playerName": "Feleti Mateo",
                            "playerPosition": "Interchange",
                            "playerPositionId": 500014,
                            "playerStats": {
                                "allRunMetres": 40,
                                "allRuns": 6,
                                "decoys": 3,
                                "fantasyPointsTotal": 19,
                                "hitUps": 2,
                                "linebreakAssists": 1,
                                "mins": 43,
                                "missedTackles": 2,
                                "supports": 2,
                                "tackles": 17,
                                "tryCause": 1,
                                "hitupRunMeters": 20,
                                "evasionRuns": 4,
                                "evasionRunMetres": 20,
                                "ptbFast": 50,
                                "ptbNeutral": 50,
                                "ptbAll": 2
                            },
                            "playerTookTheField": true,
                            "shirtNum": 16
                        },
                        {
                            "playerFirstName": "Ligi",
                            "playerId": 500582,
                            "playerLastName": "Sao",
                            "playerName": "Ligi Sao",
                            "playerPosition": "Interchange",
                            "playerPositionId": 500014,
                            "playerStats": {
                                "allRunMetres": 52,
                                "allRuns": 7,
                                "decoys": 4,
                                "fantasyPointsTotal": 21,
                                "hitUps": 7,
                                "ineffectiveTackles": 1,
                                "mins": 36,
                                "missedTackles": 1,
                                "offloads": 1,
                                "oneOnOneTackles": 1,
                                "penalties": 1,
                                "supports": 3,
                                "tackles": 18,
                                "hitupRunMeters": 52,
                                "ptbNeutral": 100,
                                "ptbAll": 6
                            },
                            "playerTookTheField": true,
                            "shirtNum": 17
                        }
                    ]
                },
                "teamName": "Manly-Warringah Sea Eagles",
                "teamNickName": "Sea Eagles",
                "teamStats": {
                    "allRunMetres": 1244,
                    "allRuns": 144,
                    "bombKicks": 4,
                    "bombKickMetres": 92,
                    "bombKicksDefused": 1,
                    "completeSets": 16,
                    "completionPercentage": 57,
                    "conversions": 1,
                    "conversionsAttempts": 2,
                    "conversionsMissed": 1,
                    "decoys": 41,
                    "dummyHalfRuns": 8,
                    "errors": 11,
                    "goalConversionRate": 50,
                    "allGoals": 1,
                    "allGoalsAttempted": 2,
                    "allGoalsMissed": 1,
                    "hitUps": 60,
                    "incompleteSets": 12,
                    "ineffectiveTackles": 17,
                    "kickMetres": 376,
                    "kickReturnMetres": 126,
                    "kickReturns": 16,
                    "kicks": 13,
                    "kicksDefused": 7,
                    "kicksNotDefused": 6,
                    "lineDropouts": 3,
                    "linebreakAssists": 2,
                    "linebreaks": 3,
                    "missedTackles": 26,
                    "offloads": 5,
                    "onReports": 1,
                    "oneOnOneTackles": 24,
                    "penalties": 6,
                    "points": 10,
                    "pointsConceded": 44,
                    "possession": 49,
                    "scrumWins": 2,
                    "supports": 83,
                    "tackleBreaks": 12,
                    "tackles": 322,
                    "sets": 28,
                    "tries": 2,
                    "triesConceded": 8,
                    "tryAssists": 2,
                    "hitupRunMeters": 531,
                    "evasionRuns": 60,
                    "evasionRunMetres": 522,
                    "dummyHalfRunMetres": 65,
                    "ptbFast": 18,
                    "ptbNeutral": 78,
                    "ptbSlow": 4,
                    "ptbTotal": 106
                }
            }
        ]
    }
}