{
    "vod": [
        {
            "id": "05aXlnNTE60lLO1AoDnwDBcwvoWS6eGl",
            "contentId": 871520,
            "title": "Rd 24: Rabbitohs v Sharks (Hls)",
            "description": "Highlights of the match between the Rabbitohs and Sharks from ANZ Stadium",
            "publishDate": "2016-08-22T21:06:00+10:00",
            "publisher": "NRL Chief",
            "thumbnailUrl": "http://bigpondvideo.com/web/images/content/20160822205735a_89x50.jpg",
            "largeThumbnailUrl": "http://bigpondvideo.com/web/images/content/20160822205735a_326x184.jpg",
            "programType": "Highlights",
            "programCategory": "Match",
            "priority": null,
            "lastUpdateDate": "2016-08-22T21:12:23+10:00",
            "isPremium": false,
            "club": [
                500028,
                500005
            ]
        },
        {
            "id": "twd3lnNTE6_ACfkxR8qLRATsE5VjbCwo",
            "contentId": 871536,
            "title": "Rd 24 Press Conference: Rabbitohs",
            "description": "The Rabbitohs coach faces the media following the match",
            "publishDate": "2016-08-22T21:46:00+10:00",
            "publisher": "NRL Chief",
            "thumbnailUrl": "http://bigpondvideo.com/web/images/content/20160822213438a_89x50.jpg",
            "largeThumbnailUrl": "http://bigpondvideo.com/web/images/content/20160822213438a_326x184.jpg",
            "programType": "Press Conference",
            "programCategory": null,
            "priority": null,
            "lastUpdateDate": "2016-08-22T21:51:32+10:00",
            "isPremium": false,
            "club": [
                500028,
                500005
            ]
        },
        {
            "id": "xmdXlnNTE6wjbzlzY2lRDMQTRqNEaoXS",
            "contentId": 871537,
            "title": "Rd 24 Press Conference: Sharks",
            "description": "The Sharks coach faces the media following the match",
            "publishDate": "2016-08-22T21:42:00+10:00",
            "publisher": "NRL Chief",
            "thumbnailUrl": "http://bigpondvideo.com/web/images/content/20160822211920a_89x50.jpg",
            "largeThumbnailUrl": "http://bigpondvideo.com/web/images/content/20160822211920a_326x184.jpg",
            "programType": "Press Conference",
            "programCategory": null,
            "priority": null,
            "lastUpdateDate": "2016-08-22T21:45:31+10:00",
            "isPremium": false,
            "club": [
                500028,
                500005
            ]
        },
        {
            "id": "lrYnlnNTE6ttUIIAJ0WMaQPSnrAGvGiS",
            "contentId": 871597,
            "title": "Rd 24: TRY Joe Burgess (80th min)",
            "description": "The Rabbitohs wrap this match up as Joe Burgess crosses in the corner",
            "publishDate": "2016-08-22T20:51:00+10:00",
            "publisher": "NRL Chief",
            "thumbnailUrl": "http://bigpondvideo.com/web/images/content/20160822205131a_89x50.jpg",
            "largeThumbnailUrl": "http://bigpondvideo.com/web/images/content/20160822205131a_326x184.jpg",
            "programType": "Instant Replay",
            "programCategory": "Score",
            "priority": 1,
            "lastUpdateDate": "2016-08-22T20:55:20+10:00",
            "isPremium": true,
            "club": [
                500028,
                500005
            ]
        },
        {
            "id": "dwMHlnNTE6ztzTC9anZpe4v8cuCs_h_s",
            "contentId": 871596,
            "title": "Rd 24: GOAL James Maloney (54th min)",
            "description": "Conversion sees the visitors trail 8-6",
            "publishDate": "2016-08-22T20:21:00+10:00",
            "publisher": "NRL Chief",
            "thumbnailUrl": "http://bigpondvideo.com/web/images/content/20160822202134a_89x50.jpg",
            "largeThumbnailUrl": "http://bigpondvideo.com/web/images/content/20160822202134a_326x184.jpg",
            "programType": "Instant Replay",
            "programCategory": "Score",
            "priority": 2,
            "lastUpdateDate": "2016-08-22T20:50:18+10:00",
            "isPremium": true,
            "club": [
                500028,
                500005
            ]
        },
        {
            "id": "duMHlnNTE6bwLFvGVz0UTKJsG2bBYSJI",
            "contentId": 871594,
            "title": "Rd 24: TRY Wade Graham (53rd min)",
            "description": "The Sharks strike first in the 2nd half as Wade Graham crosses for his 2nd try for the season",
            "publishDate": "2016-08-22T20:20:00+10:00",
            "publisher": "NRL Chief",
            "thumbnailUrl": "http://bigpondvideo.com/web/images/content/20160822202049a_89x50.jpg",
            "largeThumbnailUrl": "http://bigpondvideo.com/web/images/content/20160822202049a_326x184.jpg",
            "programType": "Instant Replay",
            "programCategory": "Score",
            "priority": 3,
            "lastUpdateDate": "2016-08-22T20:50:18+10:00",
            "isPremium": true,
            "club": [
                500028,
                500005
            ]
        },
        {
            "id": "NsbnhnNTE6To34f08BY5pUPn84ueDS3D",
            "contentId": 871593,
            "title": "Rd 24: PENALTY GOAL Damien Cook (40th min)",
            "description": "Penalty goal to the Rabbitohs takes them out to a 8 point lead",
            "publishDate": "2016-08-22T19:46:00+10:00",
            "publisher": "NRL Chief",
            "thumbnailUrl": "http://bigpondvideo.com/web/images/content/20160822194925a_89x50.jpg",
            "largeThumbnailUrl": "http://bigpondvideo.com/web/images/content/20160822194925a_326x184.jpg",
            "programType": "Instant Replay",
            "programCategory": "Score",
            "priority": 4,
            "lastUpdateDate": "2016-08-22T20:50:18+10:00",
            "isPremium": true,
            "club": [
                500028,
                500005
            ]
        },
        {
            "id": "lsbHhnNTE6ZZkFIvYtRsrReKPtOJDBIV",
            "contentId": 871592,
            "title": "Rd 24: GOAL Damien Cook (34th min)",
            "description": "Conversion sees the Rabbitohs lead 6-0",
            "publishDate": "2016-08-22T19:40:00+10:00",
            "publisher": "NRL Chief",
            "thumbnailUrl": "http://bigpondvideo.com/web/images/content/20160822194440a_89x50.jpg",
            "largeThumbnailUrl": "http://bigpondvideo.com/web/images/content/20160822194440a_326x184.jpg",
            "programType": "Instant Replay",
            "programCategory": "Score",
            "priority": 5,
            "lastUpdateDate": "2016-08-22T20:50:18+10:00",
            "isPremium": true,
            "club": [
                500028,
                500005
            ]
        },
        {
            "id": "0zbHhnNTE6nKqTtIdCglO7rU_vO8iIr2",
            "contentId": 871590,
            "title": "Rd 24: TRY Cody Walker (33rd min)",
            "description": "The Rabbitohs open the scoring in this match through a try to Cody Walker",
            "publishDate": "2016-08-22T19:39:00+10:00",
            "publisher": "NRL Chief",
            "thumbnailUrl": "http://bigpondvideo.com/web/images/content/20160822194241a_89x50.jpg",
            "largeThumbnailUrl": "http://bigpondvideo.com/web/images/content/20160822194241a_326x184.jpg",
            "programType": "Instant Replay",
            "programCategory": "Score",
            "priority": 6,
            "lastUpdateDate": "2016-08-22T20:49:19+10:00",
            "isPremium": true,
            "club": [
                500028,
                500005
            ]
        }
    ],
    "scores": [
        {
            "gameState": "First Half",
            "gameStateId": 3,
            "gameTime": "0:32:18",
            "gameSeconds": 1938,
            "GameMinutes": "32:18",
            "playerId": 500611,
            "playerName": "Cody Walker",
            "scoreMethod": "Try",
            "statEvent": "Try",
            "statId": 38,
            "statValue": 4,
            "vidRef": 50524,
            "homeScore": 4,
            "commentary": "Try by Cody Walker",
            "tackleNum": 3,
            "teamId": 500005,
            "teamName": "South Sydney Rabbitohs",
            "homeTeamAbbrv": "SOU",
            "awayTeamAbbrv": "CRO"
        },
        {
            "gameState": "First Half",
            "gameStateId": 3,
            "gameTime": "0:33:28",
            "gameSeconds": 2008,
            "GameMinutes": "33:28",
            "playerId": 501600,
            "playerName": "Damien Cook",
            "scoreMethod": "Conversion",
            "statEvent": "Conversion-Made",
            "statId": 1,
            "statValue": 2,
            "vidRef": 52287,
            "homeScore": 6,
            "commentary": "Conversion-Made by Damien Cook",
            "tackleNum": -1,
            "teamId": 500005,
            "teamName": "South Sydney Rabbitohs",
            "homeTeamAbbrv": "SOU",
            "awayTeamAbbrv": "CRO"
        },
        {
            "gameState": "First Half",
            "gameStateId": 3,
            "gameTime": "0:40:00",
            "gameSeconds": 2400,
            "GameMinutes": "40:00",
            "playerId": 501600,
            "playerName": "Damien Cook",
            "scoreMethod": "Penalty Goal",
            "statEvent": "Penalty Shot-Made",
            "statId": 67,
            "statValue": 2,
            "vidRef": 63723,
            "homeScore": 8,
            "commentary": "Penalty Shot-Made by Damien Cook",
            "tackleNum": -1,
            "teamId": 500005,
            "teamName": "South Sydney Rabbitohs",
            "homeTeamAbbrv": "SOU",
            "awayTeamAbbrv": "CRO"
        },
        {
            "gameState": "Second Half",
            "gameStateId": 5,
            "gameTime": "1:19:53",
            "gameSeconds": 4793,
            "GameMinutes": "79:53",
            "playerId": 502205,
            "playerName": "Joe Burgess",
            "scoreMethod": "Try",
            "statEvent": "Try",
            "statId": 38,
            "statValue": 4,
            "vidRef": 135834,
            "homeScore": 12,
            "awayScore": 6,
            "commentary": "Try by Joe Burgess",
            "tackleNum": 2,
            "teamId": 500005,
            "teamName": "South Sydney Rabbitohs",
            "homeTeamAbbrv": "SOU",
            "awayTeamAbbrv": "CRO"
        },
        {
            "gameState": "Second Half",
            "gameStateId": 5,
            "gameTime": "0:52:39",
            "gameSeconds": 3159,
            "GameMinutes": "52:39",
            "playerId": 500798,
            "playerName": "Wade Graham",
            "scoreMethod": "Try",
            "statEvent": "Try",
            "statId": 38,
            "statValue": 4,
            "vidRef": 88781,
            "homeScore": 8,
            "awayScore": 4,
            "commentary": "Try by Wade Graham",
            "tackleNum": 2,
            "teamId": 500028,
            "teamName": "Cronulla-Sutherland Sharks",
            "homeTeamAbbrv": "SOU",
            "awayTeamAbbrv": "CRO"
        },
        {
            "gameState": "Second Half",
            "gameStateId": 5,
            "gameTime": "0:53:30",
            "gameSeconds": 3210,
            "GameMinutes": "53:30",
            "playerId": 500006,
            "playerName": "James Maloney",
            "scoreMethod": "Conversion",
            "statEvent": "Conversion-Made",
            "statId": 1,
            "statValue": 2,
            "vidRef": 90076,
            "homeScore": 8,
            "awayScore": 6,
            "commentary": "Conversion-Made by James Maloney",
            "tackleNum": -1,
            "teamId": 500028,
            "teamName": "Cronulla-Sutherland Sharks",
            "homeTeamAbbrv": "SOU",
            "awayTeamAbbrv": "CRO"
        }
    ]
}