{
    "vod": [
        {
            "id": "VwN2ZodjqDJISez8dIBT-YxKB5IV26Hp",
            "contentId": 773787,
            "title": "Rd 20: TRY Peter Mata'utia (78th min)",
            "description": "Peter Mata'utia gives the Dragons fans something to smile about as he scores their first try for the night",
            "publishDate": "2015-07-25T19:22:00+10:00",
            "publisher": "NRL Chief",
            "thumbnailUrl": "http://bigpondvideo.com/Web/Images/Content/20150725192247a_89x50.jpg",
            "largeThumbnailUrl": "http://bigpondvideo.com/Web/Images/Content/20150725192247a_326x184.jpg",
            "programType": "Instant Replay",
            "programCategory": "Score",
            "priority": 1,
            "lastUpdateDate": "2015-07-25T19:37:50+10:00",
            "isPremium": true,
            "club": [
                500021,
                500022
            ]
        },
        {
            "id": "5oMWZodjqJqz25wE2x8uyi2GZjVpmp1n",
            "contentId": 773785,
            "title": "Rd 20: TRY Mahe Fonua (61st min)",
            "description": "The cross field kick from Cooper Cronk comes up trumps as Mahe Fonua crosses in the corner",
            "publishDate": "2015-07-25T19:02:00+10:00",
            "publisher": "NRL Chief",
            "thumbnailUrl": "http://bigpondvideo.com/Web/Images/Content/20150725190222a_89x50.jpg",
            "largeThumbnailUrl": "http://bigpondvideo.com/Web/Images/Content/20150725190222a_326x184.jpg",
            "programType": "Instant Replay",
            "programCategory": "Score",
            "priority": 2,
            "lastUpdateDate": "2015-07-25T19:35:49+10:00",
            "isPremium": true,
            "club": [
                500021,
                500022
            ]
        },
        {
            "id": "50eWVodjoHkysLN01JnCFvmIAzk5jC-S",
            "contentId": 773786,
            "title": "Rd 20: GOAL Cameron Smith (57th min)",
            "description": "Conversion sees the Storm lead 18-0",
            "publishDate": "2015-07-25T18:56:00+10:00",
            "publisher": "NRL Chief",
            "thumbnailUrl": "http://bigpondvideo.com/Web/Images/Content/20150725185726a_89x50.jpg",
            "largeThumbnailUrl": "http://bigpondvideo.com/Web/Images/Content/20150725185726a_326x184.jpg",
            "programType": "Instant Replay",
            "programCategory": "Score",
            "priority": 3,
            "lastUpdateDate": "2015-07-25T19:34:49+10:00",
            "isPremium": true,
            "club": [
                500021,
                500022
            ]
        },
        {
            "id": "U1eWVodjqqLqOPca5scGqEXlvb7qaPS9",
            "contentId": 773783,
            "title": "Rd 20: TRY Kevin Proctor (55th min)",
            "description": "Storm are in again as Kevin Proctor crashes across to score the third try of the night",
            "publishDate": "2015-07-25T18:55:00+10:00",
            "publisher": "NRL Chief",
            "thumbnailUrl": "http://bigpondvideo.com/Web/Images/Content/20150725185614a_89x50.jpg",
            "largeThumbnailUrl": "http://bigpondvideo.com/Web/Images/Content/20150725185614a_326x184.jpg",
            "programType": "Instant Replay",
            "programCategory": "Score",
            "priority": 4,
            "lastUpdateDate": "2015-07-25T19:33:49+10:00",
            "isPremium": true,
            "club": [
                500021,
                500022
            ]
        },
        {
            "id": "xqb2VodjqndVIZXpha3f4K_EVctOVMUf",
            "contentId": 773784,
            "title": "Rd 20: GOAL Cameron Smith (40th min)",
            "description": "Conversion sees the Storm lead 12-0",
            "publishDate": "2015-07-25T18:24:00+10:00",
            "publisher": "NRL Chief",
            "thumbnailUrl": "http://bigpondvideo.com/Web/Images/Content/20150725182327a_89x50.jpg",
            "largeThumbnailUrl": "http://bigpondvideo.com/Web/Images/Content/20150725182327a_326x184.jpg",
            "programType": "Instant Replay",
            "programCategory": "Score",
            "priority": 5,
            "lastUpdateDate": "2015-07-25T19:32:49+10:00",
            "isPremium": true,
            "club": [
                500021,
                500022
            ]
        },
        {
            "id": "NvbmVodjpQFV2AIJ2oy0ImboEJMM7My9",
            "contentId": 773782,
            "title": "Rd 20: TRY Marika Koroibete (38th min)",
            "description": "The Dragons pay the price for pushing the pass as Tohu Harris takes the intercept and sends Marika Koroibete into open pasture to score",
            "publishDate": "2015-07-25T18:22:00+10:00",
            "publisher": "NRL Chief",
            "thumbnailUrl": "http://bigpondvideo.com/Web/Images/Content/20150725182148a_89x50.jpg",
            "largeThumbnailUrl": "http://bigpondvideo.com/Web/Images/Content/20150725182148a_326x184.jpg",
            "programType": "Instant Replay",
            "programCategory": "Score",
            "priority": 6,
            "lastUpdateDate": "2015-07-25T19:31:48+10:00",
            "isPremium": true,
            "club": [
                500021,
                500022
            ]
        },
        {
            "id": "V0a2Vodjo6vWUva_KOSOFSox0H-uq88k",
            "contentId": 773781,
            "title": "Rd 20: GOAL Cameron Smith (29th min)",
            "description": "Conversion sees the Storm lead 6-0",
            "publishDate": "2015-07-25T18:11:00+10:00",
            "publisher": "NRL Chief",
            "thumbnailUrl": "http://bigpondvideo.com/Web/Images/Content/20150725181146a_89x50.jpg",
            "largeThumbnailUrl": "http://bigpondvideo.com/Web/Images/Content/20150725181146a_326x184.jpg",
            "programType": "Instant Replay",
            "programCategory": "Score",
            "priority": 7,
            "lastUpdateDate": "2015-07-25T19:29:48+10:00",
            "isPremium": true,
            "club": [
                500021,
                500022
            ]
        },
        {
            "id": "9ka2VodjoLT9B-4_kRS4aNUaDypotsFz",
            "contentId": 773780,
            "title": "Rd 20: TRY Nelson Asofa-Solomona (28th min)",
            "description": "Storm open the scoring as Nelson Asofa-Solomona charges over from close range to score his first try in 1st grade",
            "publishDate": "2015-07-25T18:10:00+10:00",
            "publisher": "NRL Chief",
            "thumbnailUrl": "http://bigpondvideo.com/Web/Images/Content/20150725181020a_89x50.jpg",
            "largeThumbnailUrl": "http://bigpondvideo.com/Web/Images/Content/20150725181020a_326x184.jpg",
            "programType": "Instant Replay",
            "programCategory": "Score",
            "priority": 8,
            "lastUpdateDate": "2015-07-25T19:27:47+10:00",
            "isPremium": true,
            "club": [
                500021,
                500022
            ]
        }
    ],
    "scores": [
        {
            "gameState": "First Half",
            "gameStateId": 3,
            "gameTime": "0:27:29",
            "gameSeconds": 1649,
            "playerId": 501281,
            "playerName": "Nelson Asofa-Solomona",
            "scoreMethod": "Try",
            "statEvent": "Try",
            "statId": 38,
            "statValue": 4,
            "vidRef": 48498,
            "homeScore": 4,
            "teamId": 500021,
            "teamName": "Melbourne Storm",
            "homeTeamAbbrv": "MEL",
            "awayTeamAbbrv": "SGI"
        },
        {
            "gameState": "First Half",
            "gameStateId": 3,
            "gameTime": "0:28:17",
            "gameSeconds": 1697,
            "playerId": 500609,
            "playerName": "Cameron Smith",
            "scoreMethod": "Conversion",
            "statEvent": "Conversion-Made",
            "statId": 1,
            "statValue": 2,
            "vidRef": 50303,
            "homeScore": 6,
            "teamId": 500021,
            "teamName": "Melbourne Storm",
            "homeTeamAbbrv": "MEL",
            "awayTeamAbbrv": "SGI"
        },
        {
            "gameState": "First Half",
            "gameStateId": 3,
            "gameTime": "0:37:17",
            "gameSeconds": 2237,
            "playerId": 500653,
            "playerName": "Marika Koroibete",
            "scoreMethod": "Try",
            "statEvent": "Try",
            "statId": 38,
            "statValue": 4,
            "vidRef": 63808,
            "homeScore": 10,
            "teamId": 500021,
            "teamName": "Melbourne Storm",
            "homeTeamAbbrv": "MEL",
            "awayTeamAbbrv": "SGI"
        },
        {
            "gameState": "First Half",
            "gameStateId": 3,
            "gameTime": "0:38:54",
            "gameSeconds": 2334,
            "playerId": 500609,
            "playerName": "Cameron Smith",
            "scoreMethod": "Conversion",
            "statEvent": "Conversion-Made",
            "statId": 1,
            "statValue": 2,
            "vidRef": 66935,
            "homeScore": 12,
            "teamId": 500021,
            "teamName": "Melbourne Storm",
            "homeTeamAbbrv": "MEL",
            "awayTeamAbbrv": "SGI"
        },
        {
            "gameState": "Second Half",
            "gameStateId": 5,
            "gameTime": "0:54:24",
            "gameSeconds": 3264,
            "playerId": 500606,
            "playerName": "Kevin Proctor",
            "scoreMethod": "Try",
            "statEvent": "Try",
            "statId": 38,
            "statValue": 4,
            "vidRef": 97783,
            "homeScore": 16,
            "teamId": 500021,
            "teamName": "Melbourne Storm",
            "homeTeamAbbrv": "MEL",
            "awayTeamAbbrv": "SGI"
        },
        {
            "gameState": "Second Half",
            "gameStateId": 5,
            "gameTime": "0:55:51",
            "gameSeconds": 3351,
            "playerId": 500609,
            "playerName": "Cameron Smith",
            "scoreMethod": "Conversion",
            "statEvent": "Conversion-Made",
            "statId": 1,
            "statValue": 2,
            "vidRef": 100399,
            "homeScore": 18,
            "teamId": 500021,
            "teamName": "Melbourne Storm",
            "homeTeamAbbrv": "MEL",
            "awayTeamAbbrv": "SGI"
        },
        {
            "gameState": "Second Half",
            "gameStateId": 5,
            "gameTime": "1:00:53",
            "gameSeconds": 3653,
            "playerId": 500589,
            "playerName": "Mahe Fonua",
            "scoreMethod": "Try",
            "statEvent": "Try",
            "statId": 38,
            "statValue": 4,
            "vidRef": 107947,
            "homeScore": 22,
            "teamId": 500021,
            "teamName": "Melbourne Storm",
            "homeTeamAbbrv": "MEL",
            "awayTeamAbbrv": "SGI"
        },
        {
            "gameState": "Second Half",
            "gameStateId": 5,
            "gameTime": "1:17:15",
            "gameSeconds": 4635,
            "playerId": 500630,
            "playerName": "Peter Mata'utia",
            "scoreMethod": "Try",
            "statEvent": "Try",
            "statId": 38,
            "statValue": 4,
            "vidRef": 139213,
            "homeScore": 22,
            "awayScore": 4,
            "teamId": 500022,
            "teamName": "St. George Illawarra Dragons",
            "homeTeamAbbrv": "MEL",
            "awayTeamAbbrv": "SGI"
        }
    ]
}