{
    "vod": [
        {
            "id": "VsdTJqYjE6Vlq91U2ZK3wLEPOS30abkh",
            "contentId": 916785,
            "title": "Rd 14: Eels v Cowboys (Hls)",
            "description": "Highlights of the Round 14 clash between the Eels & Cowboys",
            "publishDate": "2017-06-10T21:25:00+10:00",
            "publisher": "NRL Chief",
            "thumbnailUrl": "http://bpvideos.telstra.insnw.net/web/images/20170610211810a_89x50.jpg",
            "largeThumbnailUrl": "http://bpvideos.telstra.insnw.net/web/images/20170610211810a_326x184.jpg",
            "programType": "Highlights",
            "programCategory": "Match",
            "priority": null,
            "lastUpdateDate": "2017-06-10T21:29:23+10:00",
            "isPremium": false,
            "club": [
                500012,
                500031
            ]
        },
        {
            "id": "dkMzNqYjE6Vt5oNwBjkSRopT4vLeMa2V",
            "contentId": 917224,
            "title": "Rd 14 Press Conference: Eels",
            "description": "Eels coach Brad Arthur speaks to the media following their Round 14 clash",
            "publishDate": "2017-06-10T22:03:00+10:00",
            "publisher": "NRL Chief",
            "thumbnailUrl": "http://bpvideos.telstra.insnw.net/web/images/20170610215336a_89x50.jpg",
            "largeThumbnailUrl": "http://bpvideos.telstra.insnw.net/web/images/20170610215336a_326x184.jpg",
            "programType": "Press Conference",
            "programCategory": null,
            "priority": null,
            "lastUpdateDate": "2017-06-10T22:08:32+10:00",
            "isPremium": false,
            "club": [
                500012,
                500031
            ]
        },
        {
            "id": "t3MDNqYjE6zhN7f037aXItKMZnRvfYgJ",
            "contentId": 917223,
            "title": "Rd 14 Press Conference: Cowboys",
            "description": "Cowboys coach Paul Green speaks to the media following their Round 14 clash",
            "publishDate": "2017-06-10T21:53:00+10:00",
            "publisher": "NRL Chief",
            "thumbnailUrl": "http://bpvideos.telstra.insnw.net/web/images/20170610215255a_89x50.jpg",
            "largeThumbnailUrl": "http://bpvideos.telstra.insnw.net/web/images/20170610215255a_326x184.jpg",
            "programType": "Press Conference",
            "programCategory": null,
            "priority": null,
            "lastUpdateDate": "2017-06-10T21:57:29+10:00",
            "isPremium": false,
            "club": [
                500012,
                500031
            ]
        },
        {
            "id": "o1cTJqYjE6G41-T9186Y-T0PdeczMcgf",
            "contentId": 917728,
            "title": "Rd 14: GOAL Clint Gutherson (70th min)",
            "description": "Clint Gutherson converts the Eels' first try",
            "publishDate": "2017-06-10T21:07:25+10:00",
            "publisher": "NRL Chief",
            "thumbnailUrl": "http://bpvideos.telstra.insnw.net/web/images/20170610210701a_89x50.jpg",
            "largeThumbnailUrl": "http://bpvideos.telstra.insnw.net/web/images/20170610210701a_326x184.jpg",
            "programType": "Instant Replay",
            "programCategory": "Score",
            "priority": null,
            "lastUpdateDate": "2017-06-10T21:11:19+10:00",
            "isPremium": true,
            "club": [
                500012,
                500031
            ]
        },
        {
            "id": "9zcDJqYjE6r6-7Ifknqpmtv0YyRV5c2-",
            "contentId": 917729,
            "title": "Rd 14: TRY Brad Takairangi (68th min)",
            "description": "Brad Takairangi crosses for Parramatta's first points",
            "publishDate": "2017-06-10T21:06:25+10:00",
            "publisher": "NRL Chief",
            "thumbnailUrl": "http://bpvideos.telstra.insnw.net/web/images/20170610210542a_89x50.jpg",
            "largeThumbnailUrl": "http://bpvideos.telstra.insnw.net/web/images/20170610210542a_326x184.jpg",
            "programType": "Instant Replay",
            "programCategory": "Score",
            "priority": null,
            "lastUpdateDate": "2017-06-10T21:09:18+10:00",
            "isPremium": true,
            "club": [
                500012,
                500031
            ]
        },
        {
            "id": "ZsbzJqYjE6xw74HME83-yNfrsBRkLe0V",
            "contentId": 917722,
            "title": "Rd 14: GOAL Johnathan Thurston (62nd min)",
            "description": "The Cowboys kick out to an unanswered 32-point lead",
            "publishDate": "2017-06-10T20:59:32+10:00",
            "publisher": "NRL Chief",
            "thumbnailUrl": "http://bpvideos.telstra.insnw.net/web/images/20170610205824a_89x50.jpg",
            "largeThumbnailUrl": "http://bpvideos.telstra.insnw.net/web/images/20170610205824a_326x184.jpg",
            "programType": "Instant Replay",
            "programCategory": "Score",
            "priority": null,
            "lastUpdateDate": "2017-06-10T21:03:17+10:00",
            "isPremium": true,
            "club": [
                500012,
                500031
            ]
        },
        {
            "id": "83bzJqYjE6gdCPy6uoUqLCsMx5zlLwpN",
            "contentId": 917721,
            "title": "Rd 14: TRY Antonio Winterstein (60th min)",
            "description": "Antonio Winterstein crosses to put the Cowboys out to a 30-point lead",
            "publishDate": "2017-06-10T20:58:36+10:00",
            "publisher": "NRL Chief",
            "thumbnailUrl": "http://bpvideos.telstra.insnw.net/web/images/20170610205812a_89x50.jpg",
            "largeThumbnailUrl": "http://bpvideos.telstra.insnw.net/web/images/20170610205812a_326x184.jpg",
            "programType": "Instant Replay",
            "programCategory": "Score",
            "priority": null,
            "lastUpdateDate": "2017-06-10T21:02:16+10:00",
            "isPremium": true,
            "club": [
                500012,
                500031
            ]
        },
        {
            "id": "90bTJqYjE61fNlYKkIiGHjLdGZXxd40j",
            "contentId": 917720,
            "title": "Rd 14: GOAL Johnathan Thurston (55th min)",
            "description": "Johnathan Thurston converts the try of Coen Hess",
            "publishDate": "2017-06-10T20:52:18+10:00",
            "publisher": "NRL Chief",
            "thumbnailUrl": "http://bpvideos.telstra.insnw.net/web/images/20170610205204a_89x50.jpg",
            "largeThumbnailUrl": "http://bpvideos.telstra.insnw.net/web/images/20170610205204a_326x184.jpg",
            "programType": "Instant Replay",
            "programCategory": "Score",
            "priority": null,
            "lastUpdateDate": "2017-06-10T20:56:15+10:00",
            "isPremium": true,
            "club": [
                500012,
                500031
            ]
        },
        {
            "id": "05bTJqYjE6qhN7XmUPX1vAO3VzSGGcKs",
            "contentId": 917719,
            "title": "Rd 14: TRY Coen Hess (53rd min)",
            "description": "Coen Hess crosses to extend the Cowboys' lead in the top of the country",
            "publishDate": "2017-06-10T20:50:29+10:00",
            "publisher": "NRL Chief",
            "thumbnailUrl": "http://bpvideos.telstra.insnw.net/web/images/20170610205026a_89x50.jpg",
            "largeThumbnailUrl": "http://bpvideos.telstra.insnw.net/web/images/20170610205026a_326x184.jpg",
            "programType": "Instant Replay",
            "programCategory": "Score",
            "priority": null,
            "lastUpdateDate": "2017-06-10T20:54:14+10:00",
            "isPremium": true,
            "club": [
                500012,
                500031
            ]
        },
        {
            "id": "FyazJqYjE6zfiIYSY9k78GCiPFUqs1iL",
            "contentId": 917715,
            "title": "Rd 14: GOAL Johnathan Thurston (46th min)",
            "description": "JT converts his own try",
            "publishDate": "2017-06-10T20:42:51+10:00",
            "publisher": "NRL Chief",
            "thumbnailUrl": "http://bpvideos.telstra.insnw.net/web/images/20170610204254a_89x50.jpg",
            "largeThumbnailUrl": "http://bpvideos.telstra.insnw.net/web/images/20170610204254a_326x184.jpg",
            "programType": "Instant Replay",
            "programCategory": "Score",
            "priority": null,
            "lastUpdateDate": "2017-06-10T20:46:12+10:00",
            "isPremium": true,
            "club": [
                500012,
                500031
            ]
        },
        {
            "id": "1oazJqYjE6-JkHLG-wiZlu1OGRTYplWD",
            "contentId": 917713,
            "title": "Rd 14: TRY Johnathan Thurston (45th min)",
            "description": "The Cowboys' star half goes over for four points of his own",
            "publishDate": "2017-06-10T20:42:14+10:00",
            "publisher": "NRL Chief",
            "thumbnailUrl": "http://bpvideos.telstra.insnw.net/web/images/20170610204202a_89x50.jpg",
            "largeThumbnailUrl": "http://bpvideos.telstra.insnw.net/web/images/20170610204202a_326x184.jpg",
            "programType": "Instant Replay",
            "programCategory": "Score",
            "priority": null,
            "lastUpdateDate": "2017-06-10T20:45:12+10:00",
            "isPremium": true,
            "club": [
                500012,
                500031
            ]
        },
        {
            "id": "RkZzJqYjE6f94QfIbmGqCW-2getJzTHV",
            "contentId": 917700,
            "title": "Rd 14: PENALTY GOAL Johnathan Thurston (40th min)",
            "description": "JT puts the Cowboys 14-points clear at half time in Darwin",
            "publishDate": "2017-06-10T20:23:39+10:00",
            "publisher": "NRL Chief",
            "thumbnailUrl": "http://bpvideos.telstra.insnw.net/web/images/20170610202219a_89x50.jpg",
            "largeThumbnailUrl": "http://bpvideos.telstra.insnw.net/web/images/20170610202219a_326x184.jpg",
            "programType": "Instant Replay",
            "programCategory": "Score",
            "priority": null,
            "lastUpdateDate": "2017-06-10T20:27:07+10:00",
            "isPremium": true,
            "club": [
                500012,
                500031
            ]
        },
        {
            "id": "Z3ZDJqYjE69urOGwiNCW24CmTtJr3grk",
            "contentId": 917693,
            "title": "Rd 14: TRY Kyle Feldt (33rd min)",
            "description": "Kyle Feldt dives over to nab his second try",
            "publishDate": "2017-06-10T20:16:24+10:00",
            "publisher": "NRL Chief",
            "thumbnailUrl": "http://bpvideos.telstra.insnw.net/web/images/20170610201605a_89x50.jpg",
            "largeThumbnailUrl": "http://bpvideos.telstra.insnw.net/web/images/20170610201605a_326x184.jpg",
            "programType": "Instant Replay",
            "programCategory": "Score",
            "priority": null,
            "lastUpdateDate": "2017-06-10T20:20:05+10:00",
            "isPremium": true,
            "club": [
                500012,
                500031
            ]
        },
        {
            "id": "dzZDJqYjE6hWoex8ZRJL3VauCTeygg4E",
            "contentId": 917685,
            "title": "Rd 14: PENALTY GOAL Johnathan Thurston (29th min)",
            "description": "Johnathan Thurston pots an extra two points for the Cowboys",
            "publishDate": "2017-06-10T20:15:20+10:00",
            "publisher": "NRL Chief",
            "thumbnailUrl": "http://bpvideos.telstra.insnw.net/web/images/20170610201503a_89x50.jpg",
            "largeThumbnailUrl": "http://bpvideos.telstra.insnw.net/web/images/20170610201503a_326x184.jpg",
            "programType": "Instant Replay",
            "programCategory": "Score",
            "priority": null,
            "lastUpdateDate": "2017-06-10T20:19:05+10:00",
            "isPremium": true,
            "club": [
                500012,
                500031
            ]
        },
        {
            "id": "szODJqYjE6VqDv7mxo6nRC2Y6IbkrTih",
            "contentId": 917670,
            "title": "Rd 14: GOAL Johnathan Thurston (8th min)",
            "description": "Johnathan Thurston signals his return by laying on - and converting - the try of Kyle Feldt",
            "publishDate": "2017-06-10T19:45:59+10:00",
            "publisher": "NRL Chief",
            "thumbnailUrl": "http://bpvideos.telstra.insnw.net/web/images/20170610194514a_89x50.jpg",
            "largeThumbnailUrl": "http://bpvideos.telstra.insnw.net/web/images/20170610194514a_326x184.jpg",
            "programType": "Instant Replay",
            "programCategory": "Score",
            "priority": null,
            "lastUpdateDate": "2017-06-10T19:48:58+10:00",
            "isPremium": true,
            "club": [
                500012,
                500031
            ]
        },
        {
            "id": "Z1NzJqYjE6_sAAdev6ElVX0AW1BNTOm3",
            "contentId": 917669,
            "title": "Rd 14: TRY Kyle Feldt (7th min)",
            "description": "Kyle Feldt opens the scoring for the Cowboys in Darwin",
            "publishDate": "2017-06-10T19:43:45+10:00",
            "publisher": "NRL Chief",
            "thumbnailUrl": "http://bpvideos.telstra.insnw.net/web/images/20170610194306a_89x50.jpg",
            "largeThumbnailUrl": "http://bpvideos.telstra.insnw.net/web/images/20170610194306a_326x184.jpg",
            "programType": "Instant Replay",
            "programCategory": "Score",
            "priority": null,
            "lastUpdateDate": "2017-06-10T19:47:58+10:00",
            "isPremium": true,
            "club": [
                500012,
                500031
            ]
        }
    ],
    "scores": [
        {
            "gameState": "Second Half",
            "gameStateId": 5,
            "gameTime": "1:07:58",
            "gameSeconds": 4078,
            "GameMinutes": "67:58",
            "playerId": 500065,
            "playerName": "Brad Takairangi",
            "scoreMethod": "Try",
            "statEvent": "Try",
            "statId": 38,
            "statValue": 4,
            "vidRef": 114255,
            "homeScore": 4,
            "awayScore": 32,
            "commentary": "Try by Brad Takairangi",
            "tackleNum": 5,
            "teamId": 500031,
            "teamName": "Parramatta Eels",
            "homeTeamAbbrv": "PAR",
            "awayTeamAbbrv": "NQL"
        },
        {
            "gameState": "Second Half",
            "gameStateId": 5,
            "gameTime": "1:09:09",
            "gameSeconds": 4149,
            "GameMinutes": "69:09",
            "playerId": 500729,
            "playerName": "Clinton Gutherson",
            "scoreMethod": "Conversion",
            "statEvent": "Conversion-Made",
            "statId": 1,
            "statValue": 2,
            "vidRef": 116047,
            "homeScore": 6,
            "awayScore": 32,
            "commentary": "Conversion-Made by Clinton Gutherson",
            "tackleNum": -1,
            "teamId": 500031,
            "teamName": "Parramatta Eels",
            "homeTeamAbbrv": "PAR",
            "awayTeamAbbrv": "NQL"
        },
        {
            "gameState": "First Half",
            "gameStateId": 3,
            "gameTime": "0:06:13",
            "gameSeconds": 373,
            "GameMinutes": "06:13",
            "playerId": 500282,
            "playerName": "Kyle Feldt",
            "scoreMethod": "Try",
            "statEvent": "Try",
            "statId": 38,
            "statValue": 4,
            "vidRef": 10315,
            "awayScore": 4,
            "commentary": "Try by Kyle Feldt",
            "tackleNum": 6,
            "teamId": 500012,
            "teamName": "North Queensland Cowboys",
            "homeTeamAbbrv": "PAR",
            "awayTeamAbbrv": "NQL"
        },
        {
            "gameState": "First Half",
            "gameStateId": 3,
            "gameTime": "0:07:39",
            "gameSeconds": 459,
            "GameMinutes": "07:39",
            "playerId": 500304,
            "playerName": "Johnathan Thurston",
            "scoreMethod": "Conversion",
            "statEvent": "Conversion-Made",
            "statId": 1,
            "statValue": 2,
            "vidRef": 13411,
            "awayScore": 6,
            "commentary": "Conversion-Made by Johnathan Thurston",
            "tackleNum": -1,
            "teamId": 500012,
            "teamName": "North Queensland Cowboys",
            "homeTeamAbbrv": "PAR",
            "awayTeamAbbrv": "NQL"
        },
        {
            "gameState": "First Half",
            "gameStateId": 3,
            "gameTime": "0:28:29",
            "gameSeconds": 1709,
            "GameMinutes": "28:29",
            "playerId": 500304,
            "playerName": "Johnathan Thurston",
            "scoreMethod": "Penalty Goal",
            "statEvent": "Penalty Shot-Made",
            "statId": 67,
            "statValue": 2,
            "vidRef": 46547,
            "awayScore": 8,
            "commentary": "Penalty Shot-Made by Johnathan Thurston",
            "tackleNum": -1,
            "teamId": 500012,
            "teamName": "North Queensland Cowboys",
            "homeTeamAbbrv": "PAR",
            "awayTeamAbbrv": "NQL"
        },
        {
            "gameState": "First Half",
            "gameStateId": 3,
            "gameTime": "0:32:38",
            "gameSeconds": 1958,
            "GameMinutes": "32:38",
            "playerId": 500282,
            "playerName": "Kyle Feldt",
            "scoreMethod": "Try",
            "statEvent": "Try",
            "statId": 38,
            "statValue": 4,
            "vidRef": 54719,
            "awayScore": 12,
            "commentary": "Try by Kyle Feldt",
            "tackleNum": 5,
            "teamId": 500012,
            "teamName": "North Queensland Cowboys",
            "homeTeamAbbrv": "PAR",
            "awayTeamAbbrv": "NQL"
        },
        {
            "gameState": "First Half",
            "gameStateId": 3,
            "gameTime": "0:40:00",
            "gameSeconds": 2400,
            "GameMinutes": "40:00",
            "playerId": 500304,
            "playerName": "Johnathan Thurston",
            "scoreMethod": "Penalty Goal",
            "statEvent": "Penalty Shot-Made",
            "statId": 67,
            "statValue": 2,
            "vidRef": 70049,
            "awayScore": 14,
            "commentary": "Penalty Shot-Made by Johnathan Thurston",
            "tackleNum": -1,
            "teamId": 500012,
            "teamName": "North Queensland Cowboys",
            "homeTeamAbbrv": "PAR",
            "awayTeamAbbrv": "NQL"
        },
        {
            "gameState": "Second Half",
            "gameStateId": 5,
            "gameTime": "0:44:22",
            "gameSeconds": 2662,
            "GameMinutes": "44:22",
            "playerId": 500304,
            "playerName": "Johnathan Thurston",
            "scoreMethod": "Try",
            "statEvent": "Try",
            "statId": 38,
            "statValue": 4,
            "vidRef": 78086,
            "awayScore": 18,
            "commentary": "Try by Johnathan Thurston",
            "tackleNum": 4,
            "teamId": 500012,
            "teamName": "North Queensland Cowboys",
            "homeTeamAbbrv": "PAR",
            "awayTeamAbbrv": "NQL"
        },
        {
            "gameState": "Second Half",
            "gameStateId": 5,
            "gameTime": "0:45:49",
            "gameSeconds": 2749,
            "GameMinutes": "45:49",
            "playerId": 500304,
            "playerName": "Johnathan Thurston",
            "scoreMethod": "Conversion",
            "statEvent": "Conversion-Made",
            "statId": 1,
            "statValue": 2,
            "vidRef": 80245,
            "awayScore": 20,
            "commentary": "Conversion-Made by Johnathan Thurston",
            "tackleNum": -1,
            "teamId": 500012,
            "teamName": "North Queensland Cowboys",
            "homeTeamAbbrv": "PAR",
            "awayTeamAbbrv": "NQL"
        },
        {
            "gameState": "Second Half",
            "gameStateId": 5,
            "gameTime": "0:52:53",
            "gameSeconds": 3173,
            "GameMinutes": "52:53",
            "playerId": 500405,
            "playerName": "Coen Hess",
            "scoreMethod": "Try",
            "statEvent": "Try",
            "statId": 38,
            "statValue": 4,
            "vidRef": 90843,
            "awayScore": 24,
            "commentary": "Try by Coen Hess",
            "tackleNum": 6,
            "teamId": 500012,
            "teamName": "North Queensland Cowboys",
            "homeTeamAbbrv": "PAR",
            "awayTeamAbbrv": "NQL"
        },
        {
            "gameState": "Second Half",
            "gameStateId": 5,
            "gameTime": "0:54:36",
            "gameSeconds": 3276,
            "GameMinutes": "54:36",
            "playerId": 500304,
            "playerName": "Johnathan Thurston",
            "scoreMethod": "Conversion",
            "statEvent": "Conversion-Made",
            "statId": 1,
            "statValue": 2,
            "vidRef": 93429,
            "awayScore": 26,
            "commentary": "Conversion-Made by Johnathan Thurston",
            "tackleNum": -1,
            "teamId": 500012,
            "teamName": "North Queensland Cowboys",
            "homeTeamAbbrv": "PAR",
            "awayTeamAbbrv": "NQL"
        },
        {
            "gameState": "Second Half",
            "gameStateId": 5,
            "gameTime": "0:59:46",
            "gameSeconds": 3586,
            "GameMinutes": "59:46",
            "playerId": 500305,
            "playerName": "Antonio Winterstein",
            "scoreMethod": "Try",
            "statEvent": "Try",
            "statId": 38,
            "statValue": 4,
            "vidRef": 101848,
            "awayScore": 30,
            "commentary": "Try by Antonio Winterstein",
            "tackleNum": 4,
            "teamId": 500012,
            "teamName": "North Queensland Cowboys",
            "homeTeamAbbrv": "PAR",
            "awayTeamAbbrv": "NQL"
        },
        {
            "gameState": "Second Half",
            "gameStateId": 5,
            "gameTime": "1:01:23",
            "gameSeconds": 3683,
            "GameMinutes": "61:23",
            "playerId": 500304,
            "playerName": "Johnathan Thurston",
            "scoreMethod": "Conversion",
            "statEvent": "Conversion-Made",
            "statId": 1,
            "statValue": 2,
            "vidRef": 104380,
            "awayScore": 32,
            "commentary": "Conversion-Made by Johnathan Thurston",
            "tackleNum": -1,
            "teamId": 500012,
            "teamName": "North Queensland Cowboys",
            "homeTeamAbbrv": "PAR",
            "awayTeamAbbrv": "NQL"
        }
    ],
    "twitter": []
}