{
    "vod": [
        {
            "id": "1zM2VtdTq2YWTdRO4AyIxeWy_QS9P9f_",
            "contentId": 759426,
            "title": "Rd 14: Wests Tigers v Rabbitohs (1)",
            "description": "1st half replay of the match between the Wests Tigers & Rabbitohs",
            "publishDate": "2015-06-13T09:30:00+10:00",
            "publisher": "NRL Chief",
            "thumbnailUrl": "http://bigpondvideo.com/Web/Images/Content/20150612215528a_89x50.jpg",
            "largeThumbnailUrl": "http://bigpondvideo.com/Web/Images/Content/20150612215528a_326x184.jpg",
            "programType": "Matches",
            "programCategory": "Replay: 1st Half",
            "priority": null,
            "lastUpdateDate": "2015-06-13T00:38:26+10:00",
            "isPremium": true,
            "club": [
                500005,
                500023
            ]
        },
        {
            "id": "9uNGVtdTohr_Ko9dgl7T1SZdgWwaxgOq",
            "contentId": 759427,
            "title": "Rd 14: Wests Tigers v Rabbitohs (2)",
            "description": "2nd half replay of the match between the Wests Tigers & Rabbitohs",
            "publishDate": "2015-06-13T09:30:00+10:00",
            "publisher": "NRL Chief",
            "thumbnailUrl": "http://bigpondvideo.com/Web/Images/Content/20150612215606a_89x50.jpg",
            "largeThumbnailUrl": "http://bigpondvideo.com/Web/Images/Content/20150612215606a_326x184.jpg",
            "programType": "Matches",
            "programCategory": "Replay: 2nd Half",
            "priority": null,
            "lastUpdateDate": "2015-06-13T00:40:26+10:00",
            "isPremium": true,
            "club": [
                500005,
                500023
            ]
        },
        {
            "id": "FsNmNtdTplR_q953HK6eguNUrl4JUzJS",
            "contentId": 759398,
            "title": "Rd 14: Wests Tigers v Rabbitohs (Hls)",
            "description": "Highlights of the match between the Wests Tigers & Rabbitohs from ANZ Stadium",
            "publishDate": "2015-06-12T22:03:00+10:00",
            "publisher": "NRL Chief",
            "thumbnailUrl": "http://bigpondvideo.com/Web/Images/Content/20150612215422a_89x50.jpg",
            "largeThumbnailUrl": "http://bigpondvideo.com/Web/Images/Content/20150612215422a_326x184.jpg",
            "programType": "Highlights",
            "programCategory": "Match",
            "priority": null,
            "lastUpdateDate": "2015-06-12T22:08:46+10:00",
            "isPremium": false,
            "club": [
                500005,
                500023
            ]
        },
        {
            "id": "Z4cWNtdTrhOH0BSRK4pZiAfZ8E0NbaDQ",
            "contentId": 759414,
            "title": "Rd 14 Press Conference: Wests Tigers",
            "description": "The Wests Tigers coach faces the media following the match",
            "publishDate": "2015-06-12T22:45:00+10:00",
            "publisher": "NRL Chief",
            "thumbnailUrl": "http://bigpondvideo.com/Web/Images/Content/20150612221932a_89x50.jpg",
            "largeThumbnailUrl": "http://bigpondvideo.com/Web/Images/Content/20150612221932a_326x184.jpg",
            "programType": "Press Conference",
            "programCategory": null,
            "priority": null,
            "lastUpdateDate": "2015-06-12T22:58:59+10:00",
            "isPremium": false,
            "club": [
                500005,
                500023
            ]
        },
        {
            "id": "RhbmNtdTqgQY9xG1yPU9bmVroriPWVMG",
            "contentId": 759415,
            "title": "Rd 14 Press Conference: Rabbitohs",
            "description": "The Rabbitohs coach faces the media following the match",
            "publishDate": "2015-06-12T22:37:00+10:00",
            "publisher": "NRL Chief",
            "thumbnailUrl": "http://bigpondvideo.com/Web/Images/Content/20150612222507a_89x50.jpg",
            "largeThumbnailUrl": "http://bigpondvideo.com/Web/Images/Content/20150612222507a_326x184.jpg",
            "programType": "Press Conference",
            "programCategory": null,
            "priority": null,
            "lastUpdateDate": "2015-06-12T22:44:53+10:00",
            "isPremium": false,
            "club": [
                500005,
                500023
            ]
        },
        {
            "id": "wydWJtdTpA3MEGouEcg4TkmID6ELVpHK",
            "contentId": 760093,
            "title": "Rd 14: GOAL Pat Richards (80th min)",
            "description": "Conversion gives the Wests Tigers a 34-6 victory",
            "publishDate": "2015-06-12T21:44:00+10:00",
            "publisher": "NRL Chief",
            "thumbnailUrl": "http://bigpondvideo.com/Web/Images/Content/20150612214323a_89x50.jpg",
            "largeThumbnailUrl": "http://bigpondvideo.com/Web/Images/Content/20150612214323a_326x184.jpg",
            "programType": "Instant Replay",
            "programCategory": "Score",
            "priority": 1,
            "lastUpdateDate": "2015-06-12T21:53:41+10:00",
            "isPremium": true,
            "club": [
                500005,
                500023
            ]
        },
        {
            "id": "tsdGJtdTrYOM38ozEajUAOy7MoNftE2I",
            "contentId": 760092,
            "title": "Rd 14: TRY James Tedesco (79th min)",
            "description": "Wests Tigers put the icing on the cake as James Tedesco strolls over for another try for the joint venture",
            "publishDate": "2015-06-12T21:43:00+10:00",
            "publisher": "NRL Chief",
            "thumbnailUrl": "http://bigpondvideo.com/Web/Images/Content/20150612214312a_89x50.jpg",
            "largeThumbnailUrl": "http://bigpondvideo.com/Web/Images/Content/20150612214312a_326x184.jpg",
            "programType": "Instant Replay",
            "programCategory": "Score",
            "priority": 2,
            "lastUpdateDate": "2015-06-12T21:52:41+10:00",
            "isPremium": true,
            "club": [
                500005,
                500023
            ]
        },
        {
            "id": "V5b2JtdTo1h38pB3Nxk2AGaCSBT1WZ8Z",
            "contentId": 760091,
            "title": "Rd 14: GOAL Pat Richards (69th min)",
            "description": "Conversion sees the Wests Tigers lead 28-6",
            "publishDate": "2015-06-12T21:29:00+10:00",
            "publisher": "NRL Chief",
            "thumbnailUrl": "http://bigpondvideo.com/Web/Images/Content/20150612213036a_89x50.jpg",
            "largeThumbnailUrl": "http://bigpondvideo.com/Web/Images/Content/20150612213036a_326x184.jpg",
            "programType": "Instant Replay",
            "programCategory": "Score",
            "priority": 3,
            "lastUpdateDate": "2015-06-12T21:52:41+10:00",
            "isPremium": true,
            "club": [
                500005,
                500023
            ]
        },
        {
            "id": "93b2JtdToMEaW0Fp2TfJveajEIVLVmwa",
            "contentId": 760089,
            "title": "Rd 14: TRY David Nofoaluma (68th min)",
            "description": "David Nofoaluma storms over  Alex Johnston to score another try for the Wests Tigers",
            "publishDate": "2015-06-12T21:27:00+10:00",
            "publisher": "NRL Chief",
            "thumbnailUrl": "http://bigpondvideo.com/Web/Images/Content/20150612212744a_89x50.jpg",
            "largeThumbnailUrl": "http://bigpondvideo.com/Web/Images/Content/20150612212744a_326x184.jpg",
            "programType": "Instant Replay",
            "programCategory": "Score",
            "priority": 4,
            "lastUpdateDate": "2015-06-12T21:51:41+10:00",
            "isPremium": true,
            "club": [
                500005,
                500023
            ]
        },
        {
            "id": "V2bGJtdTourRrj2VUbikZc5T3Wl2rG63",
            "contentId": 760088,
            "title": "Rd 14: TRY Martin Taupau (64th min)",
            "description": "Wests Tigers are in again and once again its Martin Taupau storming over to record a double",
            "publishDate": "2015-06-12T21:23:00+10:00",
            "publisher": "NRL Chief",
            "thumbnailUrl": "http://bigpondvideo.com/Web/Images/Content/20150612212343a_89x50.jpg",
            "largeThumbnailUrl": "http://bigpondvideo.com/Web/Images/Content/20150612212343a_326x184.jpg",
            "programType": "Instant Replay",
            "programCategory": "Score",
            "priority": 5,
            "lastUpdateDate": "2015-06-12T21:50:40+10:00",
            "isPremium": true,
            "club": [
                500005,
                500023
            ]
        },
        {
            "id": "13Y2JtdTo898NekRAtOVz40RF3No_hdn",
            "contentId": 760085,
            "title": "Rd 14: GOAL Pat Richards (45th min)",
            "description": "Conversion from touch sees the Wests Tigers lead 18-6",
            "publishDate": "2015-06-12T21:05:00+10:00",
            "publisher": "NRL Chief",
            "thumbnailUrl": "http://bigpondvideo.com/Web/Images/Content/20150612210458a_89x50.jpg",
            "largeThumbnailUrl": "http://bigpondvideo.com/Web/Images/Content/20150612210458a_326x184.jpg",
            "programType": "Instant Replay",
            "programCategory": "Score",
            "priority": 6,
            "lastUpdateDate": "2015-06-12T21:50:40+10:00",
            "isPremium": true,
            "club": [
                500005,
                500023
            ]
        },
        {
            "id": "h1Y2JtdTrUNv-GhetqnOevuDbwJUOGzu",
            "contentId": 760084,
            "title": "Rd 14: TRY Luke Brooks (44th min)",
            "description": "Tigers attack the short side and Luke Brooks shows blistering speed to race away to score, standing up Alex Johnston in his wake",
            "publishDate": "2015-06-12T21:04:00+10:00",
            "publisher": "NRL Chief",
            "thumbnailUrl": "http://bigpondvideo.com/Web/Images/Content/20150612210215a_89x50.jpg",
            "largeThumbnailUrl": "http://bigpondvideo.com/Web/Images/Content/20150612210215a_326x184.jpg",
            "programType": "Instant Replay",
            "programCategory": "Score",
            "priority": 7,
            "lastUpdateDate": "2015-06-12T21:49:40+10:00",
            "isPremium": true,
            "club": [
                500005,
                500023
            ]
        },
        {
            "id": "NqcWFtdTopw0zEZZDZKFbvGuxM9XzNsL",
            "contentId": 760083,
            "title": "Rd 14: GOAL Adam Reynolds (17th min)",
            "description": "Conversion sees the Rabbitohs trail 12-6",
            "publishDate": "2015-06-12T20:20:00+10:00",
            "publisher": "NRL Chief",
            "thumbnailUrl": "http://bigpondvideo.com/Web/Images/Content/20150612202003a_89x50.jpg",
            "largeThumbnailUrl": "http://bigpondvideo.com/Web/Images/Content/20150612202003a_326x184.jpg",
            "programType": "Instant Replay",
            "programCategory": "Score",
            "priority": null,
            "lastUpdateDate": "2015-06-12T20:24:14+10:00",
            "isPremium": true,
            "club": [
                500005,
                500023
            ]
        },
        {
            "id": "9yb2FtdTpTuc7X8eUBi1o922-n3nn-Xw",
            "contentId": 760082,
            "title": "Rd 14: TRY Bryson Goodwin (16th min)",
            "description": "Rabbitohs strike back through a soft try to Bryson Goodwin",
            "publishDate": "2015-06-12T20:17:00+10:00",
            "publisher": "NRL Chief",
            "thumbnailUrl": "http://bigpondvideo.com/Web/Images/Content/20150612201745a_89x50.jpg",
            "largeThumbnailUrl": "http://bigpondvideo.com/Web/Images/Content/20150612201745a_326x184.jpg",
            "programType": "Instant Replay",
            "programCategory": "Score",
            "priority": 8,
            "lastUpdateDate": "2015-06-12T21:49:40+10:00",
            "isPremium": true,
            "club": [
                500005,
                500023
            ]
        },
        {
            "id": "Nua2FtdTo-yfZyUe12Xn20c4l8NLWLVv",
            "contentId": 760081,
            "title": "Rd 14: GOAL Pat Richards (8th min)",
            "description": "Conversion sees the home slide lead 12-0",
            "publishDate": "2015-06-12T20:13:00+10:00",
            "publisher": "NRL Chief",
            "thumbnailUrl": "http://bigpondvideo.com/Web/Images/Content/20150612201301a_89x50.jpg",
            "largeThumbnailUrl": "http://bigpondvideo.com/Web/Images/Content/20150612201301a_326x184.jpg",
            "programType": "Instant Replay",
            "programCategory": "Score",
            "priority": null,
            "lastUpdateDate": "2015-06-12T20:20:14+10:00",
            "isPremium": true,
            "club": [
                500005,
                500023
            ]
        },
        {
            "id": "55aGFtdTq-x6XUaawf-GshOx-7Tr_vdw",
            "contentId": 760080,
            "title": "Rd 14: TRY Martin Taupau (10th min)",
            "description": "Wests Tigers are in again this time Martin Taupau powers over from close range",
            "publishDate": "2015-06-12T20:11:00+10:00",
            "publisher": "NRL Chief",
            "thumbnailUrl": "http://bigpondvideo.com/Web/Images/Content/20150612201045a_89x50.jpg",
            "largeThumbnailUrl": "http://bigpondvideo.com/Web/Images/Content/20150612201045a_326x184.jpg",
            "programType": "Instant Replay",
            "programCategory": "Score",
            "priority": 9,
            "lastUpdateDate": "2015-06-12T21:48:40+10:00",
            "isPremium": true,
            "club": [
                500005,
                500023
            ]
        },
        {
            "id": "JlZmFtdToCEMVdcrIDDMDbB2I-MTjKcL",
            "contentId": 760079,
            "title": "Rd 14: GOAL Pat Richards (8th min)",
            "description": "Conversion sees the Wests Tigers lead 6-0",
            "publishDate": "2015-06-12T20:07:10+10:00",
            "publisher": "NRL Chief",
            "thumbnailUrl": "http://bigpondvideo.com/Web/Images/Content/20150612200811a_89x50.jpg",
            "largeThumbnailUrl": "http://bigpondvideo.com/Web/Images/Content/20150612200811a_326x184.jpg",
            "programType": "Instant Replay",
            "programCategory": "Score",
            "priority": null,
            "lastUpdateDate": "2015-06-12T20:12:11+10:00",
            "isPremium": true,
            "club": [
                500005,
                500023
            ]
        },
        {
            "id": "psZWFtdTrrv-4q40Ck-DBaYbJAmfyePr",
            "contentId": 760077,
            "title": "Rd 14: TRY James Tedesco (6th min)",
            "description": "The Wests Tigers creates a 3 on 2 down the short side and its James Tedesco who scores the first try of the night",
            "publishDate": "2015-06-12T20:06:00+10:00",
            "publisher": "NRL Chief",
            "thumbnailUrl": "http://bigpondvideo.com/Web/Images/Content/20150612200702a_89x50.jpg",
            "largeThumbnailUrl": "http://bigpondvideo.com/Web/Images/Content/20150612200702a_326x184.jpg",
            "programType": "Instant Replay",
            "programCategory": "Score",
            "priority": 10,
            "lastUpdateDate": "2015-06-12T21:47:39+10:00",
            "isPremium": true,
            "club": [
                500005,
                500023
            ]
        }
    ],
    "scores": [
        {
            "gameState": "First Half",
            "gameStateId": 3,
            "gameTime": "0:06:02",
            "gameSeconds": 362,
            "playerId": 500663,
            "playerName": "James Tedesco",
            "scoreMethod": "Try",
            "statEvent": "Try",
            "statId": 38,
            "statValue": 4,
            "vidRef": 11627,
            "homeScore": 4,
            "teamId": 500023,
            "teamName": "Wests Tigers",
            "homeTeamAbbrv": "WST",
            "awayTeamAbbrv": "SOU"
        },
        {
            "gameState": "First Half",
            "gameStateId": 3,
            "gameTime": "0:07:31",
            "gameSeconds": 451,
            "playerId": 501284,
            "playerName": "Pat Richards",
            "scoreMethod": "Conversion",
            "statEvent": "Conversion-Made",
            "statId": 1,
            "statValue": 2,
            "vidRef": 13907,
            "homeScore": 6,
            "teamId": 500023,
            "teamName": "Wests Tigers",
            "homeTeamAbbrv": "WST",
            "awayTeamAbbrv": "SOU"
        },
        {
            "gameState": "First Half",
            "gameStateId": 3,
            "gameTime": "0:09:36",
            "gameSeconds": 576,
            "playerId": 500960,
            "playerName": "Martin Taupau",
            "scoreMethod": "Try",
            "statEvent": "Try",
            "statId": 38,
            "statValue": 4,
            "vidRef": 18430,
            "homeScore": 10,
            "teamId": 500023,
            "teamName": "Wests Tigers",
            "homeTeamAbbrv": "WST",
            "awayTeamAbbrv": "SOU"
        },
        {
            "gameState": "First Half",
            "gameStateId": 3,
            "gameTime": "0:10:31",
            "gameSeconds": 631,
            "playerId": 501284,
            "playerName": "Pat Richards",
            "scoreMethod": "Conversion",
            "statEvent": "Conversion-Made",
            "statId": 1,
            "statValue": 2,
            "vidRef": 19798,
            "homeScore": 12,
            "teamId": 500023,
            "teamName": "Wests Tigers",
            "homeTeamAbbrv": "WST",
            "awayTeamAbbrv": "SOU"
        },
        {
            "gameState": "Second Half",
            "gameStateId": 5,
            "gameTime": "0:43:25",
            "gameSeconds": 2605,
            "playerId": 500646,
            "playerName": "Luke Brooks",
            "scoreMethod": "Try",
            "statEvent": "Try",
            "statId": 38,
            "statValue": 4,
            "vidRef": 74239,
            "homeScore": 16,
            "awayScore": 6,
            "teamId": 500023,
            "teamName": "Wests Tigers",
            "homeTeamAbbrv": "WST",
            "awayTeamAbbrv": "SOU"
        },
        {
            "gameState": "Second Half",
            "gameStateId": 5,
            "gameTime": "0:44:58",
            "gameSeconds": 2698,
            "playerId": 501284,
            "playerName": "Pat Richards",
            "scoreMethod": "Conversion",
            "statEvent": "Conversion-Made",
            "statId": 1,
            "statValue": 2,
            "vidRef": 77076,
            "homeScore": 18,
            "awayScore": 6,
            "teamId": 500023,
            "teamName": "Wests Tigers",
            "homeTeamAbbrv": "WST",
            "awayTeamAbbrv": "SOU"
        },
        {
            "gameState": "Second Half",
            "gameStateId": 5,
            "gameTime": "1:03:19",
            "gameSeconds": 3799,
            "playerId": 500960,
            "playerName": "Martin Taupau",
            "scoreMethod": "Try",
            "statEvent": "Try",
            "statId": 38,
            "statValue": 4,
            "vidRef": 105271,
            "homeScore": 22,
            "awayScore": 6,
            "teamId": 500023,
            "teamName": "Wests Tigers",
            "homeTeamAbbrv": "WST",
            "awayTeamAbbrv": "SOU"
        },
        {
            "gameState": "Second Half",
            "gameStateId": 5,
            "gameTime": "1:07:22",
            "gameSeconds": 4042,
            "playerId": 500658,
            "playerName": "David Nofoaluma",
            "scoreMethod": "Try",
            "statEvent": "Try",
            "statId": 38,
            "statValue": 4,
            "vidRef": 111364,
            "homeScore": 26,
            "awayScore": 6,
            "teamId": 500023,
            "teamName": "Wests Tigers",
            "homeTeamAbbrv": "WST",
            "awayTeamAbbrv": "SOU"
        },
        {
            "gameState": "Second Half",
            "gameStateId": 5,
            "gameTime": "1:08:43",
            "gameSeconds": 4123,
            "playerId": 501284,
            "playerName": "Pat Richards",
            "scoreMethod": "Conversion",
            "statEvent": "Conversion-Made",
            "statId": 1,
            "statValue": 2,
            "vidRef": 113375,
            "homeScore": 28,
            "awayScore": 6,
            "teamId": 500023,
            "teamName": "Wests Tigers",
            "homeTeamAbbrv": "WST",
            "awayTeamAbbrv": "SOU"
        },
        {
            "gameState": "Second Half",
            "gameStateId": 5,
            "gameTime": "1:19:00",
            "gameSeconds": 4740,
            "playerId": 500663,
            "playerName": "James Tedesco",
            "scoreMethod": "Try",
            "statEvent": "Try",
            "statId": 38,
            "statValue": 4,
            "vidRef": 131445,
            "homeScore": 32,
            "awayScore": 6,
            "teamId": 500023,
            "teamName": "Wests Tigers",
            "homeTeamAbbrv": "WST",
            "awayTeamAbbrv": "SOU"
        },
        {
            "gameState": "Second Half",
            "gameStateId": 5,
            "gameTime": "1:20:00",
            "gameSeconds": 4800,
            "playerId": 501284,
            "playerName": "Pat Richards",
            "scoreMethod": "Conversion",
            "statEvent": "Conversion-Made",
            "statId": 1,
            "statValue": 2,
            "vidRef": 133151,
            "homeScore": 34,
            "awayScore": 6,
            "teamId": 500023,
            "teamName": "Wests Tigers",
            "homeTeamAbbrv": "WST",
            "awayTeamAbbrv": "SOU"
        },
        {
            "gameState": "First Half",
            "gameStateId": 3,
            "gameTime": "0:15:32",
            "gameSeconds": 932,
            "playerId": 500082,
            "playerName": "Bryson Goodwin",
            "scoreMethod": "Try",
            "statEvent": "Try",
            "statId": 38,
            "statValue": 4,
            "vidRef": 29038,
            "homeScore": 12,
            "awayScore": 4,
            "teamId": 500005,
            "teamName": "South Sydney Rabbitohs",
            "homeTeamAbbrv": "WST",
            "awayTeamAbbrv": "SOU"
        },
        {
            "gameState": "First Half",
            "gameStateId": 3,
            "gameTime": "0:16:34",
            "gameSeconds": 994,
            "playerId": 500086,
            "playerName": "Adam Reynolds",
            "scoreMethod": "Conversion",
            "statEvent": "Conversion-Made",
            "statId": 1,
            "statValue": 2,
            "vidRef": 30573,
            "homeScore": 12,
            "awayScore": 6,
            "teamId": 500005,
            "teamName": "South Sydney Rabbitohs",
            "homeTeamAbbrv": "WST",
            "awayTeamAbbrv": "SOU"
        }
    ]
}