{
    "competitionId": 111,
    "competitionName": "NRL Telstra Premiership",
    "gameId": 20161111830,
    "gameInfo": {
        "assistantReferee1Id": 500020,
        "numberOfPeriods": 2,
        "assistantReferee1Name": "Jason Walsh",
        "assistantReferee2Id": 500114,
        "assistantReferee2Name": "Clayton Sharpe",
        "gameDate": "2016-07-10",
        "gameHashTag": "#NRLPanthersSharks",
        "gameNumber": 3,
        "gameSeconds": 4800,
        "gameMinutes": "80:00",
        "gameTime": "1:20:00",
        "groundConditionId": 1,
        "groundConditionName": "N/A",
        "referee1Id": 500022,
        "referee1Name": "Jared Maxwell",
        "referee2Id": 500006,
        "referee2Name": "Henry Perenara",
        "startTime": "2016-07-10T16:00:00",
        "startTimeUTC": "2016-07-10T06:00:00Z",
        "venueId": 500040,
        "venueName": "Pepper Stadium",
        "videoReferee1Id": 500002,
        "videoReferee1Name": "Matt Cecchin",
        "videoReferee2Id": 500203,
        "videoReferee2Name": "Ben Galea",
        "weatherId": 4,
        "weatherName": "Rain",
        "broadcastChannel": null,
        "venueLatitude": -33.7586,
        "venueLongitude": 150.6878,
        "broadcastInfo": {
            "radioNetwork": []
        }
    },
    "gameState": "Final",
    "gameStateId": 8,
    "roundId": 18,
    "roundName": "Round 18",
    "seasonId": 2016,
    "teams": {
        "teamsMatch": [
            {
                "isHomeTeam": true,
                "score": {
                    "conversions": 1,
                    "points": 10,
                    "tries": 2
                },
                "team1stHalfScore": 6,
                "team2ndHalfScore": 4,
                "teamAbbr": "PEN",
                "teamFinalScore": 10,
                "teamFullTimeScore": 10,
                "teamHalfTimeScore": 6,
                "teamId": 500014,
                "teamLineup": {
                    "teamLineUpStatusID": 4,
                    "teamLineUpStatus": "Final",
                    "injuriesAndSuspensions": {
                        "injury": [],
                        "suspension": []
                    },
                    "insAndOuts": {
                        "inOut": [
                            {
                                "inOut": "In",
                                "playerFirstName": "Dylan",
                                "playerId": "503340",
                                "playerLastName": "Edwards",
                                "playerName": "Dylan Edwards"
                            },
                            {
                                "inOut": "Out",
                                "playerFirstName": "Josh",
                                "playerId": "500352",
                                "playerLastName": "Mansour",
                                "playerName": "Josh Mansour"
                            },
                            {
                                "inOut": "Out",
                                "playerFirstName": "Matt",
                                "playerId": "500356",
                                "playerLastName": "Moylan",
                                "playerName": "Matt Moylan"
                            },
                            {
                                "inOut": "Out",
                                "playerFirstName": "Sam",
                                "playerId": "500354",
                                "playerLastName": "McKendry",
                                "playerName": "Sam McKendry"
                            },
                            {
                                "inOut": "In",
                                "playerFirstName": "Sitaleki",
                                "playerId": "501382",
                                "playerLastName": "Akauola",
                                "playerName": "Sitaleki Akauola"
                            },
                            {
                                "inOut": "In",
                                "playerFirstName": "Suaia",
                                "playerId": "500713",
                                "playerLastName": "Matagi",
                                "playerName": "Suaia Matagi"
                            },
                            {
                                "inOut": "Out",
                                "playerFirstName": "Tyrone",
                                "playerId": "501184",
                                "playerLastName": "Peachey",
                                "playerName": "Tyrone Peachey"
                            },
                            {
                                "inOut": "In",
                                "playerFirstName": "Will",
                                "playerId": "501253",
                                "playerLastName": "Smith",
                                "playerName": "Will Smith"
                            }
                        ]
                    },
                    "teamPlayer": [
                        {
                            "playerFirstName": "Will",
                            "playerId": 501253,
                            "playerLastName": "Smith",
                            "playerName": "Will Smith",
                            "playerPosition": "Fullback",
                            "playerPositionId": 500001,
                            "playerStats": {
                                "allRunMetres": 87,
                                "allRuns": 9,
                                "dummyHalfRuns": 2,
                                "errors": 1,
                                "fantasyPointsTotal": 28,
                                "ineffectiveTackles": 1,
                                "mins": 80,
                                "offloads": 1,
                                "passes": 10,
                                "passesPerRun": 1.11,
                                "oneOnOneTackles": 1,
                                "supports": 5,
                                "tackleBreaks": 2,
                                "tackles": 14,
                                "tryCause": 2,
                                "evasionRuns": 7,
                                "evasionRunMetres": 66,
                                "dummyHalfRunMetres": 21,
                                "ptbAll": 7,
                                "receipts": 14,
                                "postContactMetres": 22,
                                "dummyPasses": 1,
                                "kickPressures": 1,
                                "ptbTwoToThree": 2,
                                "ptbThreeToFour": 4,
                                "ptbFourToFive": 1,
                                "doubles": 1,
                                "effectiveTacklePercentage": 93.3,
                                "stint1": 4800
                            },
                            "playerTookTheField": true,
                            "shirtNum": 17,
                            "playerFirstInitial": "W",
                            "playerPositionAbbrev": "FB",
                            "onTheField": true,
                            "fantasyPrice": 308000,
                            "fantasySeasonPriceChange": -59000
                        },
                        {
                            "playerFirstName": "Zak",
                            "playerId": 502221,
                            "playerLastName": "Hardaker",
                            "playerName": "Zak Hardaker",
                            "playerPosition": "Winger 1",
                            "playerPositionId": 500002,
                            "playerStats": {
                                "allRunMetres": 77,
                                "allRuns": 12,
                                "dummyHalfRuns": 2,
                                "fantasyPointsTotal": 18,
                                "kickReturnMetres": 21,
                                "kickReturns": 3,
                                "kicksDefused": 1,
                                "lineDropouts": 3,
                                "mins": 80,
                                "missedTackles": 3,
                                "offloads": 2,
                                "passes": 16,
                                "passesPerRun": 1.33,
                                "oneOnOneTackles": 1,
                                "supports": 10,
                                "tackleBreaks": 3,
                                "tackles": 3,
                                "tryCause": 1,
                                "evasionRuns": 7,
                                "evasionRunMetres": 43,
                                "dummyHalfRunMetres": 13,
                                "ptbAll": 8,
                                "receipts": 29,
                                "postContactMetres": 19,
                                "dummyPasses": 3,
                                "ptbTwoToThree": 4,
                                "ptbThreeToFour": 3,
                                "ptbFivePlus": 1,
                                "effectiveTacklePercentage": 50,
                                "stint1": 4800
                            },
                            "playerTookTheField": true,
                            "shirtNum": 2,
                            "playerFirstInitial": "Z",
                            "playerPositionAbbrev": "WG",
                            "onTheField": true,
                            "fantasyPrice": 206000
                        },
                        {
                            "playerFirstName": "Waqa",
                            "playerId": 500496,
                            "playerLastName": "Blake",
                            "playerName": "Waqa Blake",
                            "playerPosition": "Centre 1",
                            "playerPositionId": 500003,
                            "playerStats": {
                                "allRunMetres": 79,
                                "allRuns": 8,
                                "decoys": 1,
                                "dummyHalfRuns": 1,
                                "errors": 1,
                                "fantasyPointsTotal": 14,
                                "hitUps": 2,
                                "kicksDefused": 1,
                                "mins": 80,
                                "missedTackles": 1,
                                "offloads": 1,
                                "passes": 3,
                                "passesPerRun": 0.38,
                                "oneOnOneTackles": 2,
                                "penalties": 1,
                                "supports": 5,
                                "tackleBreaks": 1,
                                "tackles": 7,
                                "hitupRunMeters": 17,
                                "evasionRuns": 5,
                                "evasionRunMetres": 53,
                                "dummyHalfRunMetres": 9,
                                "ptbAll": 7,
                                "receipts": 12,
                                "postContactMetres": 26,
                                "kickPressures": 1,
                                "ptbTwoToThree": 1,
                                "ptbThreeToFour": 3,
                                "ptbFourToFive": 3,
                                "doubles": 1,
                                "effectiveTacklePercentage": 87.5,
                                "ptbPenalties": 1,
                                "stint1": 4800
                            },
                            "playerTookTheField": true,
                            "shirtNum": 3,
                            "playerFirstInitial": "W",
                            "playerPositionAbbrev": "CT",
                            "onTheField": true,
                            "fantasyPrice": 207000,
                            "fantasySeasonPriceChange": -15000,
                            "fantasyRoundPriceChange": 4000
                        },
                        {
                            "playerFirstName": "Dylan",
                            "playerId": 503340,
                            "playerLastName": "Edwards",
                            "playerName": "Dylan Edwards",
                            "playerPosition": "Centre 2",
                            "playerPositionId": 500004,
                            "playerStats": {
                                "allRunMetres": 70,
                                "allRuns": 11,
                                "bombKicksDefused": 1,
                                "errors": 1,
                                "fantasyPointsTotal": 16,
                                "hitUps": 1,
                                "kickReturnMetres": 27,
                                "kickReturns": 4,
                                "kicksDefused": 2,
                                "mins": 80,
                                "missedTackles": 1,
                                "passes": 3,
                                "passesPerRun": 0.27,
                                "supports": 7,
                                "tackleBreaks": 2,
                                "tackles": 5,
                                "hitupRunMeters": 10,
                                "evasionRuns": 6,
                                "evasionRunMetres": 33,
                                "ptbAll": 10,
                                "receipts": 15,
                                "postContactMetres": 16,
                                "ptbOneToTwo": 2,
                                "ptbTwoToThree": 5,
                                "ptbThreeToFour": 3,
                                "effectiveTacklePercentage": 83.3,
                                "stint1": 4800
                            },
                            "playerTookTheField": true,
                            "shirtNum": 19,
                            "playerFirstInitial": "D",
                            "playerPositionAbbrev": "CT",
                            "onTheField": true
                        },
                        {
                            "playerFirstName": "Dallin",
                            "playerId": 500532,
                            "playerLastName": "Watene Zelezniak",
                            "playerName": "Dallin Watene Zelezniak",
                            "playerPosition": "Winger 2",
                            "playerPositionId": 500005,
                            "playerStats": {
                                "allRunMetres": 126,
                                "allRuns": 14,
                                "bombKicksNotDefused": 1,
                                "dummyHalfRuns": 1,
                                "fantasyPointsTotal": 13,
                                "kickReturnMetres": 28,
                                "kickReturns": 2,
                                "kicksNotDefused": 1,
                                "mins": 80,
                                "missedTackles": 4,
                                "passes": 3,
                                "passesPerRun": 0.21,
                                "supports": 6,
                                "tackleBreaks": 2,
                                "tackles": 3,
                                "evasionRuns": 11,
                                "evasionRunMetres": 95,
                                "dummyHalfRunMetres": 3,
                                "ptbAll": 12,
                                "receipts": 15,
                                "postContactMetres": 47,
                                "ptbTwoToThree": 5,
                                "ptbThreeToFour": 3,
                                "ptbFourToFive": 4,
                                "effectiveTacklePercentage": 42.9,
                                "stint1": 4800
                            },
                            "playerTookTheField": true,
                            "shirtNum": 5,
                            "playerFirstInitial": "D",
                            "playerPositionAbbrev": "WG",
                            "onTheField": true,
                            "fantasyPrice": 241000,
                            "fantasySeasonPriceChange": -55000,
                            "fantasyRoundPriceChange": -6000
                        },
                        {
                            "playerFirstName": "Bryce",
                            "playerId": 500499,
                            "playerLastName": "Cartwright",
                            "playerName": "Bryce Cartwright",
                            "playerPosition": "Five-Eighth",
                            "playerPositionId": 500006,
                            "playerStats": {
                                "allRunMetres": 117,
                                "allRuns": 16,
                                "bombKicks": 1,
                                "bombKickMetres": 26,
                                "decoys": 1,
                                "errors": 2,
                                "fantasyPointsTotal": 53,
                                "hitUps": 1,
                                "ineffectiveTackles": 1,
                                "kickMetres": 110,
                                "kicks": 6,
                                "linebreakAssists": 1,
                                "mins": 80,
                                "missedTackles": 2,
                                "offloads": 2,
                                "passes": 34,
                                "passesPerRun": 2.12,
                                "oneOnOneTackles": 3,
                                "penalties": 1,
                                "supports": 2,
                                "tackleBreaks": 4,
                                "tackles": 24,
                                "tryAssists": 1,
                                "hitupRunMeters": 11,
                                "evasionRuns": 15,
                                "evasionRunMetres": 106,
                                "ptbAll": 5,
                                "receipts": 48,
                                "chipKick": 3,
                                "grubberKick": 1,
                                "postContactMetres": 24,
                                "dummyPasses": 6,
                                "lineEngagedRuns": 7,
                                "ptbZeroToOne": 1,
                                "ptbTwoToThree": 1,
                                "ptbFourToFive": 3,
                                "doubles": 4,
                                "effectiveTacklePercentage": 88.9,
                                "ptbPenalties": 1,
                                "stint1": 4800
                            },
                            "playerTookTheField": true,
                            "shirtNum": 6,
                            "playerFirstInitial": "B",
                            "playerPositionAbbrev": "FE",
                            "onTheField": true,
                            "fantasyPrice": 471000,
                            "fantasySeasonPriceChange": 114000,
                            "fantasyRoundPriceChange": 12000
                        },
                        {
                            "playerFirstName": "Nathan",
                            "playerId": 504120,
                            "playerLastName": "Cleary",
                            "playerName": "Nathan Cleary",
                            "playerPosition": "Halfback",
                            "playerPositionId": 500007,
                            "playerStats": {
                                "allRunMetres": 85,
                                "allRuns": 10,
                                "bombKicks": 4,
                                "bombKickMetres": 71,
                                "conversions": 1,
                                "conversionsAttempts": 2,
                                "conversionsMissed": 1,
                                "fantasyPointsTotal": 45,
                                "goalConversionRate": 33.33,
                                "allGoals": 1,
                                "allGoalsMissed": 2,
                                "allGoalsAttempted": 3,
                                "ineffectiveTackles": 1,
                                "kickMetres": 248,
                                "kicks": 9,
                                "mins": 80,
                                "missedTackles": 2,
                                "passes": 24,
                                "passesPerRun": 2.4,
                                "oneOnOneTackles": 2,
                                "penaltyGoalsAttempts": 1,
                                "penaltyGoalsMissed": 1,
                                "points": 2,
                                "supports": 10,
                                "tackleBreaks": 3,
                                "tackles": 18,
                                "tryCause": 2,
                                "evasionRuns": 10,
                                "evasionRunMetres": 85,
                                "ptbAll": 7,
                                "receipts": 41,
                                "forcedDropOutKicker": 1,
                                "crossFieldKick": 1,
                                "postContactMetres": 22,
                                "dummyPasses": 6,
                                "kickPressures": 1,
                                "lineEngagedRuns": 3,
                                "ptbTwoToThree": 5,
                                "ptbThreeToFour": 1,
                                "ptbFivePlus": 1,
                                "doubles": 2,
                                "longKicksSpace": 3,
                                "effectiveTacklePercentage": 85.7,
                                "stint1": 4800
                            },
                            "playerTookTheField": true,
                            "shirtNum": 7,
                            "playerFirstInitial": "N",
                            "playerPositionAbbrev": "HB",
                            "onTheField": true,
                            "fantasyPrice": 324000
                        },
                        {
                            "playerFirstName": "Suaia",
                            "playerId": 500713,
                            "playerLastName": "Matagi",
                            "playerName": "Suaia Matagi",
                            "playerPosition": "Prop 1",
                            "playerPositionId": 500008,
                            "playerStats": {
                                "allRunMetres": 60,
                                "allRuns": 7,
                                "decoys": 4,
                                "fantasyPointsTotal": 22,
                                "hitUps": 4,
                                "ineffectiveTackles": 1,
                                "kickReturnMetres": 22,
                                "kickReturns": 2,
                                "mins": 29,
                                "missedTackles": 2,
                                "passes": 2,
                                "passesPerRun": 0.29,
                                "supports": 3,
                                "tackleBreaks": 2,
                                "tackles": 14,
                                "hitupRunMeters": 34,
                                "evasionRuns": 1,
                                "evasionRunMetres": 4,
                                "ptbAll": 5,
                                "receipts": 9,
                                "postContactMetres": 17,
                                "dummyPasses": 1,
                                "kickPressures": 1,
                                "lineEngagedRuns": 1,
                                "ptbOneToTwo": 1,
                                "ptbThreeToFour": 3,
                                "ptbFourToFive": 1,
                                "doubles": 3,
                                "effectiveTacklePercentage": 82.4,
                                "stint1": 1139,
                                "stint2": 582
                            },
                            "playerTookTheField": true,
                            "shirtNum": 14,
                            "playerFirstInitial": "S",
                            "playerPositionAbbrev": "PR",
                            "onTheField": true,
                            "fantasyPrice": 164000,
                            "fantasySeasonPriceChange": -27000
                        },
                        {
                            "playerFirstName": "Peter",
                            "playerId": 500956,
                            "playerLastName": "Wallace",
                            "playerName": "Peter Wallace",
                            "playerPosition": "Hooker",
                            "playerPositionId": 500009,
                            "playerStats": {
                                "allRunMetres": 28,
                                "allRuns": 7,
                                "dummyHalfRuns": 2,
                                "fantasyPointsTotal": 39,
                                "hitUps": 3,
                                "linebreakAssists": 1,
                                "mins": 80,
                                "missedTackles": 1,
                                "offloads": 1,
                                "passes": 106,
                                "passesPerRun": 15.14,
                                "supports": 1,
                                "tackles": 30,
                                "tryAssists": 1,
                                "tryCause": 1,
                                "hitupRunMeters": 8,
                                "evasionRuns": 2,
                                "evasionRunMetres": 10,
                                "dummyHalfRunMetres": 10,
                                "ptbAll": 4,
                                "receipts": 112,
                                "postContactMetres": 8,
                                "dummyPasses": 3,
                                "lineEngagedRuns": 2,
                                "ptbTwoToThree": 2,
                                "ptbThreeToFour": 2,
                                "doubles": 6,
                                "effectiveTacklePercentage": 96.8,
                                "stint1": 4800
                            },
                            "playerTookTheField": true,
                            "shirtNum": 9,
                            "playerFirstInitial": "P",
                            "playerPositionAbbrev": "HK",
                            "onTheField": true,
                            "fantasyPrice": 348000,
                            "fantasySeasonPriceChange": 87000,
                            "fantasyRoundPriceChange": -3000
                        },
                        {
                            "playerFirstName": "Reagan",
                            "playerId": 500498,
                            "playerLastName": "Campbell-Gillard",
                            "playerName": "Reagan Campbell-Gillard",
                            "playerPosition": "Prop 2",
                            "playerPositionId": 500010,
                            "playerStats": {
                                "allRunMetres": 70,
                                "allRuns": 10,
                                "decoys": 8,
                                "fantasyPointsTotal": 28,
                                "hitUps": 10,
                                "ineffectiveTackles": 3,
                                "mins": 48,
                                "missedTackles": 6,
                                "oneOnOneTackles": 1,
                                "penalties": 1,
                                "supports": 3,
                                "tackleBreaks": 4,
                                "tackles": 23,
                                "tryCause": 2,
                                "hitupRunMeters": 70,
                                "ptbAll": 10,
                                "receipts": 10,
                                "postContactMetres": 22,
                                "kickPressures": 1,
                                "ptbOneToTwo": 2,
                                "ptbTwoToThree": 3,
                                "ptbThreeToFour": 4,
                                "ptbFourToFive": 1,
                                "doubles": 5,
                                "effectiveTacklePercentage": 71.9,
                                "ptbPenalties": 1,
                                "stint1": 1470,
                                "stint2": 1375
                            },
                            "playerTookTheField": true,
                            "shirtNum": 10,
                            "playerFirstInitial": "R",
                            "playerPositionAbbrev": "PR",
                            "onTheField": true,
                            "fantasyPrice": 277000,
                            "fantasySeasonPriceChange": -9000,
                            "fantasyRoundPriceChange": 6000
                        },
                        {
                            "playerFirstName": "Isaah",
                            "playerId": 500534,
                            "playerLastName": "Yeo",
                            "playerName": "Isaah Yeo",
                            "playerPosition": "2nd Row 1",
                            "playerPositionId": 500011,
                            "playerStats": {
                                "allRunMetres": 149,
                                "allRuns": 12,
                                "decoys": 4,
                                "fantasyPointsTotal": 66,
                                "hitUps": 12,
                                "ineffectiveTackles": 2,
                                "linebreaks": 1,
                                "mins": 80,
                                "offloads": 2,
                                "passes": 2,
                                "passesPerRun": 0.17,
                                "oneOnOneTackles": 2,
                                "penalties": 1,
                                "points": 4,
                                "supports": 7,
                                "tackleBreaks": 4,
                                "tackles": 26,
                                "tries": 1,
                                "tryCause": 1,
                                "hitupRunMeters": 149,
                                "ptbAll": 9,
                                "receipts": 14,
                                "postContactMetres": 34,
                                "dummyPasses": 2,
                                "kickPressures": 1,
                                "ptbZeroToOne": 1,
                                "ptbTwoToThree": 5,
                                "ptbThreeToFour": 3,
                                "doubles": 4,
                                "effectiveTacklePercentage": 92.9,
                                "ptbPenalties": 1,
                                "stint1": 4800
                            },
                            "playerTookTheField": true,
                            "shirtNum": 11,
                            "playerFirstInitial": "I",
                            "playerPositionAbbrev": "2R",
                            "onTheField": true,
                            "fantasyPrice": 318000,
                            "fantasySeasonPriceChange": 19000,
                            "fantasyRoundPriceChange": 12000
                        },
                        {
                            "playerFirstName": "James",
                            "playerId": 502580,
                            "playerLastName": "Fisher-Harris",
                            "playerName": "James Fisher-Harris",
                            "playerPosition": "2nd Row 2",
                            "playerPositionId": 500012,
                            "playerStats": {
                                "allRunMetres": 107,
                                "allRuns": 14,
                                "decoys": 4,
                                "fantasyPointsTotal": 47,
                                "hitUps": 13,
                                "ineffectiveTackles": 1,
                                "kickDead": 1,
                                "kickReturnMetres": 11,
                                "kickReturns": 1,
                                "kicks": 1,
                                "mins": 70,
                                "missedTackles": 3,
                                "offloads": 1,
                                "passes": 3,
                                "passesPerRun": 0.21,
                                "supports": 4,
                                "tackles": 41,
                                "tryCause": 2,
                                "hitupRunMeters": 96,
                                "ptbAll": 12,
                                "receipts": 19,
                                "chipKick": 1,
                                "postContactMetres": 33,
                                "ptbOneToTwo": 1,
                                "ptbTwoToThree": 4,
                                "ptbThreeToFour": 4,
                                "ptbFourToFive": 2,
                                "ptbFivePlus": 1,
                                "doubles": 12,
                                "effectiveTacklePercentage": 91.1,
                                "stint1": 4218
                            },
                            "playerTookTheField": true,
                            "shirtNum": 12,
                            "playerFirstInitial": "J",
                            "playerPositionAbbrev": "2R",
                            "fantasyPrice": 235000,
                            "fantasySeasonPriceChange": 105000,
                            "fantasyRoundPriceChange": -13000
                        },
                        {
                            "playerFirstName": "Trent",
                            "playerId": 500632,
                            "playerLastName": "Merrin",
                            "playerName": "Trent Merrin",
                            "playerPosition": "Lock",
                            "playerPositionId": 500013,
                            "playerStats": {
                                "allRunMetres": 112,
                                "allRuns": 12,
                                "decoys": 6,
                                "fantasyPointsTotal": 61,
                                "hitUps": 12,
                                "ineffectiveTackles": 2,
                                "mins": 62,
                                "missedTackles": 2,
                                "offloads": 4,
                                "passes": 3,
                                "passesPerRun": 0.25,
                                "oneOnOneTackles": 2,
                                "supports": 4,
                                "tackleBreaks": 1,
                                "tackles": 43,
                                "hitupRunMeters": 112,
                                "ptbAll": 6,
                                "receipts": 15,
                                "postContactMetres": 35,
                                "kickPressures": 1,
                                "ptbOneToTwo": 1,
                                "ptbTwoToThree": 1,
                                "ptbThreeToFour": 3,
                                "ptbFourToFive": 1,
                                "doubles": 17,
                                "effectiveTacklePercentage": 91.5,
                                "stint1": 1843,
                                "stint2": 1855
                            },
                            "playerTookTheField": true,
                            "shirtNum": 13,
                            "playerFirstInitial": "T",
                            "playerPositionAbbrev": "LK",
                            "onTheField": true,
                            "fantasyPrice": 481000,
                            "fantasySeasonPriceChange": -4000,
                            "fantasyRoundPriceChange": 21000
                        },
                        {
                            "playerFirstName": "Leilani",
                            "playerId": 501254,
                            "playerLastName": "Latu",
                            "playerName": "Leilani Latu",
                            "playerPosition": "Interchange",
                            "playerPositionId": 500014,
                            "playerStats": {
                                "allRunMetres": 101,
                                "allRuns": 14,
                                "decoys": 4,
                                "errors": 3,
                                "fantasyPointsTotal": 35,
                                "hitUps": 7,
                                "kickMetres": 7,
                                "kickReturnMetres": 10,
                                "kickReturns": 1,
                                "kicks": 1,
                                "linebreaks": 1,
                                "mins": 45,
                                "missedTackles": 2,
                                "passes": 7,
                                "passesPerRun": 0.5,
                                "oneOnOneTackles": 1,
                                "points": 4,
                                "supports": 1,
                                "tackleBreaks": 1,
                                "tackles": 20,
                                "tries": 1,
                                "tryCause": 1,
                                "hitupRunMeters": 53,
                                "evasionRuns": 6,
                                "evasionRunMetres": 38,
                                "ptbAll": 4,
                                "receipts": 18,
                                "grubberKick": 1,
                                "postContactMetres": 18,
                                "kickPressures": 1,
                                "lineEngagedRuns": 6,
                                "ptbTwoToThree": 1,
                                "ptbThreeToFour": 3,
                                "doubles": 3,
                                "effectiveTacklePercentage": 90.9,
                                "stint1": 1799,
                                "stint2": 884
                            },
                            "playerTookTheField": true,
                            "shirtNum": 8,
                            "playerFirstInitial": "L",
                            "playerPositionAbbrev": "INT",
                            "onTheField": true,
                            "fantasyPrice": 323000,
                            "fantasySeasonPriceChange": 112000,
                            "fantasyRoundPriceChange": -5000
                        },
                        {
                            "playerFirstName": "Jeremy",
                            "playerId": 500351,
                            "playerLastName": "Latimore",
                            "playerName": "Jeremy Latimore",
                            "playerPosition": "Interchange",
                            "playerPositionId": 500014,
                            "playerStats": {
                                "allRunMetres": 48,
                                "allRuns": 5,
                                "decoys": 2,
                                "fantasyPointsTotal": 17,
                                "hitUps": 4,
                                "ineffectiveTackles": 3,
                                "kickReturnMetres": 16,
                                "kickReturns": 1,
                                "mins": 26,
                                "missedTackles": 1,
                                "oneOnOneTackles": 3,
                                "supports": 2,
                                "tackleBreaks": 1,
                                "tackles": 12,
                                "tryCause": 1,
                                "hitupRunMeters": 32,
                                "ptbAll": 5,
                                "receipts": 5,
                                "postContactMetres": 18,
                                "kickPressures": 1,
                                "ptbTwoToThree": 2,
                                "ptbThreeToFour": 2,
                                "ptbFourToFive": 1,
                                "doubles": 2,
                                "effectiveTacklePercentage": 75,
                                "stint1": 1582
                            },
                            "playerTookTheField": true,
                            "shirtNum": 15,
                            "playerFirstInitial": "J",
                            "playerPositionAbbrev": "INT",
                            "fantasyPrice": 190000,
                            "fantasySeasonPriceChange": -163000,
                            "fantasyRoundPriceChange": 1000
                        },
                        {
                            "playerFirstName": "Chris",
                            "playerId": 500106,
                            "playerLastName": "Grevsmuhl",
                            "playerName": "Chris Grevsmuhl",
                            "playerPosition": "Interchange",
                            "playerPositionId": 500014,
                            "playerStats": {
                                "allRunMetres": 78,
                                "allRuns": 9,
                                "decoys": 5,
                                "fantasyPointsTotal": 28,
                                "hitUps": 9,
                                "kicksDefused": 1,
                                "mins": 32,
                                "missedTackles": 1,
                                "supports": 2,
                                "tackleBreaks": 2,
                                "tackles": 16,
                                "hitupRunMeters": 78,
                                "ptbAll": 8,
                                "receipts": 9,
                                "postContactMetres": 32,
                                "ptbTwoToThree": 2,
                                "ptbThreeToFour": 4,
                                "ptbFourToFive": 2,
                                "doubles": 1,
                                "effectiveTacklePercentage": 94.1,
                                "stint1": 1954
                            },
                            "playerTookTheField": true,
                            "shirtNum": 16,
                            "playerFirstInitial": "C",
                            "playerPositionAbbrev": "INT",
                            "fantasyPrice": 307000,
                            "fantasySeasonPriceChange": 37000,
                            "fantasyRoundPriceChange": -4000
                        },
                        {
                            "playerFirstName": "Sitaleki",
                            "playerId": 501382,
                            "playerLastName": "Akauola",
                            "playerName": "Sitaleki Akauola",
                            "playerPosition": "Interchange",
                            "playerPositionId": 500014,
                            "playerStats": {
                                "allRunMetres": 16,
                                "allRuns": 2,
                                "decoys": 1,
                                "hitUps": 2,
                                "mins": 8,
                                "penalties": 2,
                                "tackles": 3,
                                "hitupRunMeters": 16,
                                "ptbAll": 2,
                                "receipts": 2,
                                "postContactMetres": 5,
                                "ptbOneToTwo": 1,
                                "ptbThreeToFour": 1,
                                "effectiveTacklePercentage": 100,
                                "ptbPenalties": 1,
                                "foulPlayPenalties": 1,
                                "stint1": 491
                            },
                            "playerTookTheField": true,
                            "shirtNum": 20,
                            "playerFirstInitial": "S",
                            "playerPositionAbbrev": "INT",
                            "fantasyPrice": 128000,
                            "fantasySeasonPriceChange": -6000
                        }
                    ]
                },
                "teamName": "Penrith Panthers",
                "teamNickName": "Panthers",
                "teamStats": {
                    "allRunMetres": 1412,
                    "allRuns": 172,
                    "bombKicks": 5,
                    "bombKickMetres": 96,
                    "bombKicksDefused": 1,
                    "bombKicksNotDefused": 1,
                    "completeSets": 28,
                    "completionPercentage": 78,
                    "conversions": 1,
                    "conversionsAttempts": 2,
                    "conversionsMissed": 1,
                    "decoys": 40,
                    "dummyHalfRuns": 8,
                    "errors": 8,
                    "goalConversionRate": 33.33,
                    "allGoals": 1,
                    "allGoalsAttempted": 3,
                    "allGoalsMissed": 2,
                    "hitUps": 80,
                    "incompleteSets": 8,
                    "ineffectiveTackles": 15,
                    "kickDead": 1,
                    "kickMetres": 365,
                    "kickReturnMetres": 136,
                    "kickReturns": 14,
                    "kicks": 17,
                    "kicksDefused": 5,
                    "kicksNotDefused": 1,
                    "lineDropouts": 3,
                    "linebreakAssists": 2,
                    "linebreaks": 2,
                    "missedTackles": 31,
                    "offloads": 14,
                    "oneOnOneTackles": 18,
                    "passes": 216,
                    "passesPerRun": 1.26,
                    "penalties": 6,
                    "penaltyGoalsAttempts": 1,
                    "penaltyGoalsMissed": 1,
                    "points": 10,
                    "pointsConceded": 26,
                    "possession": 52,
                    "scrumWins": 8,
                    "supports": 72,
                    "tackleBreaks": 32,
                    "tackles": 302,
                    "sets": 36,
                    "tries": 2,
                    "triesConceded": 5,
                    "tryAssists": 2,
                    "tryCause": 13,
                    "hitupRunMeters": 687,
                    "evasionRuns": 70,
                    "evasionRunMetres": 533,
                    "dummyHalfRunMetres": 56,
                    "ptbTotal": 121,
                    "twoManTackles": 75,
                    "threeManTackles": 38,
                    "fourManPlusTackles": 1,
                    "tryScoringPercentage": 7.14,
                    "shiftsLeft": 15,
                    "shiftsRight": 17,
                    "receipts": 387,
                    "forcedDropOutKicker": 1,
                    "chipKick": 4,
                    "grubberKick": 2,
                    "crossFieldKick": 1,
                    "postContactMetres": 397,
                    "dummyPasses": 22,
                    "kickPressures": 9,
                    "lineEngagedRuns": 19,
                    "ptbZeroToOne": 2,
                    "ptbOneToTwo": 8,
                    "ptbTwoToThree": 43,
                    "ptbThreeToFour": 46,
                    "ptbFourToFive": 19,
                    "ptbFivePlus": 3,
                    "interchangeUsed": 8,
                    "doubles": 61,
                    "longKicksSpace": 3,
                    "effectiveTacklePercentage": 86.8,
                    "ptbPenalties": 5,
                    "foulPlayPenalties": 1,
                    "averageSetDistance": 39.2,
                    "completeSets1stHalf": 19,
                    "completeSets2ndHalf": 9,
                    "completionPercentage1stHalf": 90.48,
                    "completionPercentage2ndHalf": 60,
                    "incompleteSets1stHalf": 2,
                    "incompleteSets2ndHalf": 6,
                    "incompletionPercentage1stHalf": 9.52,
                    "incompletionPercentage2ndHalf": 40
                },
                "teamHexColour": "00687d",
                "teamHexColour2": "232020"
            },
            {
                "score": {
                    "conversions": 2,
                    "points": 26,
                    "penaltyGoals": 1,
                    "tries": 5
                },
                "team1stHalfScore": 8,
                "team2ndHalfScore": 18,
                "teamAbbr": "CRO",
                "teamFinalScore": 26,
                "teamFullTimeScore": 26,
                "teamHalfTimeScore": 8,
                "teamId": 500028,
                "teamLineup": {
                    "teamLineUpStatusID": 4,
                    "teamLineUpStatus": "Final",
                    "injuriesAndSuspensions": {
                        "injury": [],
                        "suspension": []
                    },
                    "insAndOuts": {
                        "inOut": [
                            {
                                "inOut": "Out",
                                "playerFirstName": "Andrew",
                                "playerId": "500791",
                                "playerLastName": "Fifita",
                                "playerName": "Andrew Fifita"
                            },
                            {
                                "inOut": "In",
                                "playerFirstName": "Fa'amanu",
                                "playerId": "500837",
                                "playerLastName": "Brown",
                                "playerName": "Fa'amanu Brown"
                            },
                            {
                                "inOut": "Out",
                                "playerFirstName": "Jack",
                                "playerId": "500617",
                                "playerLastName": "Bird",
                                "playerName": "Jack Bird"
                            },
                            {
                                "inOut": "Out",
                                "playerFirstName": "James",
                                "playerId": "500006",
                                "playerLastName": "Maloney",
                                "playerName": "James Maloney"
                            },
                            {
                                "inOut": "In",
                                "playerFirstName": "Jesse",
                                "playerId": "500583",
                                "playerLastName": "Sene-Lefao",
                                "playerName": "Jesse Sene-Lefao"
                            },
                            {
                                "inOut": "In",
                                "playerFirstName": "Kurt",
                                "playerId": "500992",
                                "playerLastName": "Capewell",
                                "playerName": "Kurt Capewell"
                            },
                            {
                                "inOut": "In",
                                "playerFirstName": "Matt",
                                "playerId": "500325",
                                "playerLastName": "McIlwrick",
                                "playerName": "Matt McIlwrick"
                            },
                            {
                                "inOut": "In",
                                "playerFirstName": "Mitch",
                                "playerId": "500217",
                                "playerLastName": "Brown",
                                "playerName": "Mitch Brown"
                            },
                            {
                                "inOut": "Out",
                                "playerFirstName": "Paul",
                                "playerId": "500794",
                                "playerLastName": "Gallen",
                                "playerName": "Paul Gallen"
                            },
                            {
                                "inOut": "Out",
                                "playerFirstName": "Ricky",
                                "playerId": "500801",
                                "playerLastName": "Leutele",
                                "playerName": "Ricky Leutele"
                            },
                            {
                                "inOut": "In",
                                "playerFirstName": "Valentine",
                                "playerId": "500845",
                                "playerLastName": "Holmes",
                                "playerName": "Valentine Holmes"
                            },
                            {
                                "inOut": "Out",
                                "playerFirstName": "Wade",
                                "playerId": "500798",
                                "playerLastName": "Graham",
                                "playerName": "Wade Graham"
                            }
                        ]
                    },
                    "teamPlayer": [
                        {
                            "playerFirstName": "Ben",
                            "playerId": 500244,
                            "playerLastName": "Barba",
                            "playerName": "Ben Barba",
                            "playerPosition": "Fullback",
                            "playerPositionId": 500001,
                            "playerStats": {
                                "allRunMetres": 174,
                                "allRuns": 14,
                                "bombKicksDefused": 1,
                                "errors": 4,
                                "fantasyPointsTotal": 70,
                                "kickMetres": 16,
                                "kickReturnMetres": 4,
                                "kickReturns": 3,
                                "kicks": 1,
                                "kicksDefused": 1,
                                "kicksNotDefused": 1,
                                "linebreakAssists": 1,
                                "linebreaks": 3,
                                "mins": 80,
                                "missedTackles": 1,
                                "offloads": 1,
                                "passes": 16,
                                "passesPerRun": 1.14,
                                "points": 8,
                                "supports": 6,
                                "tackleBreaks": 7,
                                "tackles": 4,
                                "tries": 2,
                                "tryAssists": 1,
                                "evasionRuns": 11,
                                "evasionRunMetres": 170,
                                "ptbAll": 4,
                                "receipts": 28,
                                "grubberKick": 1,
                                "postContactMetres": 9,
                                "lineEngagedRuns": 3,
                                "ptbTwoToThree": 1,
                                "ptbFourToFive": 1,
                                "ptbFivePlus": 2,
                                "effectiveTacklePercentage": 80,
                                "stint1": 4800
                            },
                            "playerTookTheField": true,
                            "shirtNum": 1,
                            "playerFirstInitial": "B",
                            "playerPositionAbbrev": "FB",
                            "onTheField": true,
                            "fantasyPrice": 299000,
                            "fantasySeasonPriceChange": 121000,
                            "fantasyRoundPriceChange": -23000
                        },
                        {
                            "playerFirstName": "Sosaia",
                            "playerId": 500790,
                            "playerLastName": "Feki",
                            "playerName": "Sosaia Feki",
                            "playerPosition": "Winger 1",
                            "playerPositionId": 500002,
                            "playerStats": {
                                "allRunMetres": 73,
                                "allRuns": 8,
                                "bombKicksDefused": 1,
                                "bombKicksNotDefused": 1,
                                "dummyHalfRuns": 2,
                                "fantasyPointsTotal": 8,
                                "hitUps": 1,
                                "ineffectiveTackles": 1,
                                "kickReturns": 1,
                                "kicksDefused": 1,
                                "kicksNotDefused": 1,
                                "mins": 80,
                                "passes": 1,
                                "passesPerRun": 0.12,
                                "supports": 4,
                                "hitupRunMeters": 15,
                                "evasionRuns": 4,
                                "evasionRunMetres": 36,
                                "dummyHalfRunMetres": 22,
                                "ptbAll": 8,
                                "receipts": 9,
                                "postContactMetres": 27,
                                "ptbTwoToThree": 2,
                                "ptbThreeToFour": 5,
                                "ptbFourToFive": 1,
                                "stint1": 4800
                            },
                            "playerTookTheField": true,
                            "shirtNum": 2,
                            "playerFirstInitial": "S",
                            "playerPositionAbbrev": "WG",
                            "onTheField": true,
                            "fantasyPrice": 261000,
                            "fantasySeasonPriceChange": 43000,
                            "fantasyRoundPriceChange": 21000
                        },
                        {
                            "playerFirstName": "Gerard",
                            "playerId": 500616,
                            "playerLastName": "Beale",
                            "playerName": "Gerard Beale",
                            "playerPosition": "Centre 1",
                            "playerPositionId": 500003,
                            "playerStats": {
                                "allRunMetres": 115,
                                "allRuns": 13,
                                "bombKicksNotDefused": 1,
                                "errors": 1,
                                "fantasyPointsTotal": 26,
                                "ineffectiveTackles": 1,
                                "kickReturnMetres": 4,
                                "kickReturns": 1,
                                "kicksNotDefused": 1,
                                "mins": 80,
                                "missedTackles": 1,
                                "offloads": 1,
                                "passes": 2,
                                "passesPerRun": 0.15,
                                "oneOnOneTackles": 1,
                                "supports": 3,
                                "tackleBreaks": 2,
                                "tackles": 11,
                                "evasionRuns": 12,
                                "evasionRunMetres": 111,
                                "ptbAll": 11,
                                "receipts": 14,
                                "postContactMetres": 41,
                                "ptbOneToTwo": 2,
                                "ptbTwoToThree": 5,
                                "ptbThreeToFour": 3,
                                "ptbFourToFive": 1,
                                "doubles": 1,
                                "effectiveTacklePercentage": 84.6,
                                "stint1": 4800
                            },
                            "playerTookTheField": true,
                            "shirtNum": 4,
                            "playerFirstInitial": "G",
                            "playerPositionAbbrev": "CT",
                            "onTheField": true,
                            "fantasyPrice": 239000,
                            "fantasySeasonPriceChange": -2000,
                            "fantasyRoundPriceChange": 11000
                        },
                        {
                            "playerFirstName": "Mitch",
                            "playerId": 500217,
                            "playerLastName": "Brown",
                            "playerName": "Mitch Brown",
                            "playerPosition": "Centre 2",
                            "playerPositionId": 500004,
                            "playerStats": {
                                "allRunMetres": 138,
                                "allRuns": 16,
                                "decoys": 2,
                                "errors": 1,
                                "fantasyPointsTotal": 41,
                                "hitUps": 1,
                                "ineffectiveTackles": 1,
                                "linebreaks": 1,
                                "mins": 80,
                                "missedTackles": 1,
                                "passes": 3,
                                "passesPerRun": 0.19,
                                "oneOnOneTackles": 4,
                                "penalties": 1,
                                "points": 4,
                                "supports": 2,
                                "tackleBreaks": 2,
                                "tackles": 16,
                                "tries": 1,
                                "hitupRunMeters": 8,
                                "evasionRuns": 15,
                                "evasionRunMetres": 130,
                                "ptbAll": 13,
                                "receipts": 16,
                                "postContactMetres": 48,
                                "ptbOneToTwo": 2,
                                "ptbTwoToThree": 4,
                                "ptbThreeToFour": 4,
                                "ptbFourToFive": 2,
                                "ptbFivePlus": 1,
                                "doubles": 1,
                                "effectiveTacklePercentage": 88.9,
                                "generalPlayPenalties": 1,
                                "foulPlayPenalties": 1,
                                "stint1": 4800
                            },
                            "playerTookTheField": true,
                            "shirtNum": 18,
                            "playerFirstInitial": "M",
                            "playerPositionAbbrev": "CT",
                            "onTheField": true,
                            "fantasyPrice": 134000
                        },
                        {
                            "playerFirstName": "Valentine",
                            "playerId": 500845,
                            "playerLastName": "Holmes",
                            "playerName": "Valentine Holmes",
                            "playerPosition": "Winger 2",
                            "playerPositionId": 500005,
                            "playerStats": {
                                "allRunMetres": 116,
                                "allRuns": 12,
                                "bombKicksDefused": 1,
                                "conversionsAttempts": 3,
                                "conversionsMissed": 3,
                                "dummyHalfRuns": 1,
                                "fantasyPointsTotal": 16,
                                "allGoalsMissed": 3,
                                "allGoalsAttempted": 3,
                                "hitUps": 1,
                                "kickReturnMetres": 42,
                                "kickReturns": 4,
                                "kicksDefused": 1,
                                "lineDropouts": 2,
                                "mins": 80,
                                "missedTackles": 1,
                                "passes": 2,
                                "passesPerRun": 0.17,
                                "penalties": 1,
                                "supports": 5,
                                "tackleBreaks": 2,
                                "tackles": 2,
                                "hitupRunMeters": 4,
                                "evasionRuns": 6,
                                "evasionRunMetres": 65,
                                "dummyHalfRunMetres": 5,
                                "ptbAll": 12,
                                "receipts": 14,
                                "postContactMetres": 53,
                                "ptbTwoToThree": 3,
                                "ptbThreeToFour": 8,
                                "ptbFourToFive": 1,
                                "effectiveTacklePercentage": 66.7,
                                "foulPlayPenalties": 1,
                                "stint1": 4800
                            },
                            "playerTookTheField": true,
                            "shirtNum": 5,
                            "playerFirstInitial": "V",
                            "playerPositionAbbrev": "WG",
                            "onTheField": true,
                            "fantasyPrice": 306000,
                            "fantasySeasonPriceChange": 42000
                        },
                        {
                            "playerFirstName": "Fa'amanu",
                            "playerId": 500837,
                            "playerLastName": "Brown",
                            "playerName": "Fa'amanu Brown",
                            "playerPosition": "Five-Eighth",
                            "playerPositionId": 500006,
                            "playerStats": {
                                "allRunMetres": 44,
                                "allRuns": 4,
                                "fantasyPointsTotal": 42,
                                "ineffectiveTackles": 1,
                                "kickMetres": 69,
                                "kicks": 3,
                                "kicksDefused": 1,
                                "kicksNotDefused": 1,
                                "linebreaks": 1,
                                "mins": 80,
                                "missedTackles": 2,
                                "passes": 21,
                                "passesPerRun": 5.25,
                                "oneOnOneTackles": 3,
                                "supports": 3,
                                "tackleBreaks": 3,
                                "tackles": 20,
                                "tryAssists": 1,
                                "evasionRuns": 4,
                                "evasionRunMetres": 44,
                                "ptbAll": 3,
                                "receipts": 28,
                                "forcedDropOutKicker": 1,
                                "grubberKick": 1,
                                "postContactMetres": 7,
                                "dummyPasses": 1,
                                "ptbTwoToThree": 1,
                                "ptbThreeToFour": 1,
                                "ptbFivePlus": 1,
                                "doubles": 2,
                                "longKicksSpace": 1,
                                "effectiveTacklePercentage": 87,
                                "stint1": 4800
                            },
                            "playerTookTheField": true,
                            "shirtNum": 6,
                            "playerFirstInitial": "F",
                            "playerPositionAbbrev": "FE",
                            "onTheField": true,
                            "fantasyPrice": 170000
                        },
                        {
                            "playerFirstName": "Chad",
                            "playerId": 501183,
                            "playerLastName": "Townsend",
                            "playerName": "Chad Townsend",
                            "playerPosition": "Halfback",
                            "playerPositionId": 500007,
                            "playerStats": {
                                "allRunMetres": 57,
                                "allRuns": 10,
                                "bombKicks": 2,
                                "bombKickMetres": 31,
                                "conversions": 2,
                                "conversionsAttempts": 2,
                                "fantasyPointsTotal": 45,
                                "goalConversionRate": 100,
                                "allGoals": 3,
                                "allGoalsAttempted": 3,
                                "ineffectiveTackles": 4,
                                "kickMetres": 298,
                                "kicks": 9,
                                "linebreakAssists": 1,
                                "mins": 80,
                                "missedTackles": 4,
                                "passes": 30,
                                "passesPerRun": 3,
                                "oneOnOneTackles": 1,
                                "penaltyGoals": 1,
                                "penaltyGoalsAttempts": 1,
                                "points": 6,
                                "supports": 7,
                                "tackleBreaks": 1,
                                "tackles": 18,
                                "tryAssists": 1,
                                "tryCause": 1,
                                "evasionRuns": 10,
                                "evasionRunMetres": 57,
                                "ptbAll": 2,
                                "receipts": 42,
                                "forcedDropOutKicker": 1,
                                "postContactMetres": 6,
                                "dummyPasses": 3,
                                "lineEngagedRuns": 6,
                                "ptbTwoToThree": 2,
                                "doubles": 2,
                                "longKicksSpace": 3,
                                "effectiveTacklePercentage": 69.2,
                                "stint1": 4800
                            },
                            "playerTookTheField": true,
                            "shirtNum": 7,
                            "playerFirstInitial": "C",
                            "playerPositionAbbrev": "HB",
                            "onTheField": true,
                            "fantasyPrice": 325000,
                            "fantasySeasonPriceChange": -22000,
                            "fantasyRoundPriceChange": 6000
                        },
                        {
                            "playerFirstName": "Matt",
                            "playerId": 500806,
                            "playerLastName": "Prior",
                            "playerName": "Matt Prior",
                            "playerPosition": "Prop 1",
                            "playerPositionId": 500008,
                            "playerStats": {
                                "allRunMetres": 115,
                                "allRuns": 10,
                                "decoys": 3,
                                "errors": 3,
                                "fantasyPointsTotal": 29,
                                "hitUps": 7,
                                "ineffectiveTackles": 1,
                                "kickReturnMetres": 44,
                                "kickReturns": 3,
                                "mins": 41,
                                "missedTackles": 1,
                                "oneOnOneTackles": 1,
                                "penalties": 1,
                                "tackleBreaks": 2,
                                "tackles": 22,
                                "hitupRunMeters": 71,
                                "ptbAll": 9,
                                "receipts": 12,
                                "postContactMetres": 56,
                                "ptbTwoToThree": 3,
                                "ptbThreeToFour": 6,
                                "doubles": 4,
                                "effectiveTacklePercentage": 91.7,
                                "foulPlayPenalties": 1,
                                "stint1": 1335,
                                "stint2": 1153
                            },
                            "playerTookTheField": true,
                            "shirtNum": 8,
                            "playerFirstInitial": "M",
                            "playerPositionAbbrev": "PR",
                            "onTheField": true,
                            "fantasyPrice": 228000,
                            "fantasySeasonPriceChange": -6000,
                            "fantasyRoundPriceChange": -22000
                        },
                        {
                            "playerFirstName": "Michael",
                            "playerId": 500221,
                            "playerLastName": "Ennis",
                            "playerName": "Michael Ennis",
                            "playerPosition": "Hooker",
                            "playerPositionId": 500009,
                            "playerStats": {
                                "allRunMetres": 24,
                                "allRuns": 3,
                                "dummyHalfRuns": 3,
                                "fantasyPointsTotal": 36,
                                "ineffectiveTackles": 3,
                                "kickMetres": 143,
                                "kicks": 4,
                                "mins": 80,
                                "missedTackles": 3,
                                "offloads": 1,
                                "passes": 96,
                                "passesPerRun": 32,
                                "penalties": 1,
                                "tackles": 33,
                                "dummyHalfRunMetres": 24,
                                "receipts": 100,
                                "dummyPasses": 4,
                                "kickPressures": 3,
                                "lineEngagedRuns": 2,
                                "doubles": 9,
                                "longKicksSpace": 4,
                                "effectiveTacklePercentage": 84.6,
                                "ptbPenalties": 1,
                                "stint1": 4800
                            },
                            "playerTookTheField": true,
                            "shirtNum": 9,
                            "playerFirstInitial": "M",
                            "playerPositionAbbrev": "HK",
                            "onTheField": true,
                            "fantasyPrice": 405000,
                            "fantasySeasonPriceChange": -1000,
                            "fantasyRoundPriceChange": -7000
                        },
                        {
                            "playerFirstName": "Sam",
                            "playerId": 500813,
                            "playerLastName": "Tagataese",
                            "playerName": "Sam Tagataese",
                            "playerPosition": "Prop 2",
                            "playerPositionId": 500010,
                            "playerStats": {
                                "allRunMetres": 55,
                                "allRuns": 6,
                                "decoys": 3,
                                "fantasyPointsTotal": 21,
                                "hitUps": 6,
                                "mins": 35,
                                "missedTackles": 2,
                                "offloads": 2,
                                "passes": 1,
                                "passesPerRun": 0.17,
                                "supports": 1,
                                "tackles": 16,
                                "hitupRunMeters": 55,
                                "ptbAll": 3,
                                "receipts": 7,
                                "postContactMetres": 13,
                                "ptbTwoToThree": 1,
                                "ptbThreeToFour": 1,
                                "ptbFourToFive": 1,
                                "doubles": 3,
                                "effectiveTacklePercentage": 88.9,
                                "stint1": 1083,
                                "stint2": 999
                            },
                            "playerTookTheField": true,
                            "shirtNum": 10,
                            "playerFirstInitial": "S",
                            "playerPositionAbbrev": "PR",
                            "onTheField": true,
                            "fantasyPrice": 194000,
                            "fantasySeasonPriceChange": -23000,
                            "fantasyRoundPriceChange": -6000
                        },
                        {
                            "playerFirstName": "Luke",
                            "playerId": 500802,
                            "playerLastName": "Lewis",
                            "playerName": "Luke Lewis",
                            "playerPosition": "2nd Row 1",
                            "playerPositionId": 500011,
                            "playerStats": {
                                "allRunMetres": 83,
                                "allRuns": 9,
                                "decoys": 5,
                                "dummyHalfRuns": 2,
                                "fantasyPointsTotal": 45,
                                "hitUps": 6,
                                "ineffectiveTackles": 2,
                                "linebreaks": 1,
                                "mins": 77,
                                "missedTackles": 4,
                                "offloads": 1,
                                "passes": 6,
                                "passesPerRun": 0.67,
                                "oneOnOneTackles": 2,
                                "penalties": 4,
                                "points": 4,
                                "supports": 1,
                                "tackleBreaks": 3,
                                "tackles": 30,
                                "tries": 1,
                                "tryCause": 1,
                                "hitupRunMeters": 57,
                                "evasionRuns": 1,
                                "evasionRunMetres": 4,
                                "dummyHalfRunMetres": 22,
                                "ptbAll": 6,
                                "receipts": 14,
                                "postContactMetres": 21,
                                "kickPressures": 3,
                                "lineEngagedRuns": 1,
                                "ptbOneToTwo": 2,
                                "ptbTwoToThree": 2,
                                "ptbThreeToFour": 2,
                                "effectiveTacklePercentage": 83.3,
                                "ptbPenalties": 4,
                                "stint1": 4590
                            },
                            "playerTookTheField": true,
                            "shirtNum": 11,
                            "playerFirstInitial": "L",
                            "playerPositionAbbrev": "2R",
                            "fantasyPrice": 343000,
                            "fantasySeasonPriceChange": -50000,
                            "fantasyRoundPriceChange": -11000
                        },
                        {
                            "playerFirstName": "Jayson",
                            "playerId": 500977,
                            "playerLastName": "Bukuya",
                            "playerName": "Jayson Bukuya",
                            "playerPosition": "2nd Row 2",
                            "playerPositionId": 500012,
                            "playerStats": {
                                "allRunMetres": 80,
                                "allRuns": 11,
                                "decoys": 3,
                                "fantasyPointsTotal": 38,
                                "hitUps": 11,
                                "mins": 63,
                                "missedTackles": 4,
                                "passes": 1,
                                "passesPerRun": 0.09,
                                "oneOnOneTackles": 2,
                                "supports": 3,
                                "tackleBreaks": 2,
                                "tackles": 32,
                                "hitupRunMeters": 80,
                                "ptbAll": 10,
                                "receipts": 12,
                                "postContactMetres": 33,
                                "dummyPasses": 1,
                                "ptbZeroToOne": 1,
                                "ptbTwoToThree": 1,
                                "ptbThreeToFour": 6,
                                "ptbFourToFive": 2,
                                "doubles": 5,
                                "effectiveTacklePercentage": 88.9,
                                "stint1": 3801
                            },
                            "playerTookTheField": true,
                            "shirtNum": 12,
                            "playerFirstInitial": "J",
                            "playerPositionAbbrev": "2R",
                            "fantasyPrice": 292000,
                            "fantasySeasonPriceChange": 11000,
                            "fantasyRoundPriceChange": 10000
                        },
                        {
                            "playerFirstName": "Chris",
                            "playerId": 500799,
                            "playerLastName": "Heighington",
                            "playerName": "Chris Heighington",
                            "playerPosition": "Lock",
                            "playerPositionId": 500013,
                            "playerStats": {
                                "allRunMetres": 174,
                                "allRuns": 18,
                                "decoys": 1,
                                "fantasyPointsTotal": 49,
                                "hitUps": 12,
                                "ineffectiveTackles": 4,
                                "kickReturnMetres": 45,
                                "kickReturns": 4,
                                "mins": 56,
                                "missedTackles": 2,
                                "offloads": 1,
                                "passes": 3,
                                "passesPerRun": 0.17,
                                "penalties": 1,
                                "tackleBreaks": 4,
                                "tackles": 24,
                                "hitupRunMeters": 116,
                                "evasionRuns": 2,
                                "evasionRunMetres": 13,
                                "ptbAll": 14,
                                "receipts": 19,
                                "postContactMetres": 60,
                                "lineEngagedRuns": 2,
                                "ptbZeroToOne": 1,
                                "ptbOneToTwo": 2,
                                "ptbTwoToThree": 6,
                                "ptbThreeToFour": 2,
                                "ptbFourToFive": 3,
                                "doubles": 3,
                                "effectiveTacklePercentage": 80,
                                "ptbPenalties": 1,
                                "stint1": 1784,
                                "stint2": 1556
                            },
                            "playerTookTheField": true,
                            "shirtNum": 13,
                            "playerFirstInitial": "C",
                            "playerPositionAbbrev": "LK",
                            "onTheField": true,
                            "fantasyPrice": 218000,
                            "fantasySeasonPriceChange": -113000,
                            "fantasyRoundPriceChange": -15000
                        },
                        {
                            "playerFirstName": "Matt",
                            "playerId": 500325,
                            "playerLastName": "McIlwrick",
                            "playerName": "Matt McIlwrick",
                            "playerPosition": "Interchange",
                            "playerPositionId": 500014,
                            "playerStats": {
                                "allRunMetres": 17,
                                "allRuns": 2,
                                "fantasyPointsTotal": 3,
                                "hitUps": 2,
                                "mins": 3,
                                "tackles": 2,
                                "hitupRunMeters": 17,
                                "ptbAll": 2,
                                "receipts": 2,
                                "postContactMetres": 4,
                                "ptbZeroToOne": 1,
                                "ptbTwoToThree": 1,
                                "effectiveTacklePercentage": 100,
                                "stint1": 211
                            },
                            "playerTookTheField": true,
                            "shirtNum": 14,
                            "playerFirstInitial": "M",
                            "playerPositionAbbrev": "INT",
                            "onTheField": true,
                            "fantasyPrice": 185000
                        },
                        {
                            "playerFirstName": "Jesse",
                            "playerId": 500583,
                            "playerLastName": "Sene-Lefao",
                            "playerName": "Jesse Sene-Lefao",
                            "playerPosition": "Interchange",
                            "playerPositionId": 500014,
                            "playerStats": {
                                "allRunMetres": 83,
                                "allRuns": 9,
                                "decoys": 3,
                                "fantasyPointsTotal": 27,
                                "hitUps": 8,
                                "kickReturnMetres": 9,
                                "kickReturns": 1,
                                "mins": 32,
                                "missedTackles": 1,
                                "offloads": 1,
                                "tackles": 19,
                                "hitupRunMeters": 74,
                                "ptbAll": 8,
                                "receipts": 9,
                                "postContactMetres": 31,
                                "ptbZeroToOne": 1,
                                "ptbOneToTwo": 4,
                                "ptbTwoToThree": 3,
                                "doubles": 5,
                                "effectiveTacklePercentage": 95,
                                "stint1": 1909
                            },
                            "playerTookTheField": true,
                            "shirtNum": 15,
                            "playerFirstInitial": "J",
                            "playerPositionAbbrev": "INT",
                            "fantasyPrice": 244000
                        },
                        {
                            "playerFirstName": "Kurt",
                            "playerId": 500992,
                            "playerLastName": "Capewell",
                            "playerName": "Kurt Capewell",
                            "playerPosition": "Interchange",
                            "playerPositionId": 500014,
                            "playerStats": {
                                "allRunMetres": 136,
                                "allRuns": 13,
                                "decoys": 1,
                                "fantasyPointsTotal": 27,
                                "hitUps": 13,
                                "ineffectiveTackles": 1,
                                "mins": 50,
                                "missedTackles": 5,
                                "oneOnOneTackles": 2,
                                "tackleBreaks": 2,
                                "tackles": 18,
                                "tryCause": 1,
                                "hitupRunMeters": 136,
                                "ptbAll": 13,
                                "receipts": 13,
                                "postContactMetres": 51,
                                "dummyPasses": 1,
                                "kickPressures": 1,
                                "ptbTwoToThree": 6,
                                "ptbThreeToFour": 6,
                                "ptbFourToFive": 1,
                                "doubles": 7,
                                "effectiveTacklePercentage": 75,
                                "stint1": 3016
                            },
                            "playerTookTheField": true,
                            "shirtNum": 16,
                            "playerFirstInitial": "K",
                            "playerPositionAbbrev": "INT",
                            "onTheField": true,
                            "fantasyPrice": 130000
                        },
                        {
                            "playerFirstName": "Joseph",
                            "playerId": 500686,
                            "playerLastName": "Paulo",
                            "playerName": "Joseph Paulo",
                            "playerPosition": "Interchange",
                            "playerPositionId": 500014,
                            "playerStats": {
                                "allRunMetres": 95,
                                "allRuns": 11,
                                "decoys": 4,
                                "fantasyPointsTotal": 43,
                                "hitUps": 6,
                                "kickReturnMetres": 27,
                                "kickReturns": 2,
                                "mins": 43,
                                "offloads": 1,
                                "passes": 7,
                                "passesPerRun": 0.64,
                                "penalties": 1,
                                "points": 4,
                                "tackleBreaks": 1,
                                "tackles": 23,
                                "tries": 1,
                                "tryCause": 1,
                                "hitupRunMeters": 54,
                                "evasionRuns": 3,
                                "evasionRunMetres": 14,
                                "ptbAll": 5,
                                "receipts": 16,
                                "postContactMetres": 24,
                                "lineEngagedRuns": 2,
                                "ptbTwoToThree": 1,
                                "ptbThreeToFour": 2,
                                "ptbFourToFive": 2,
                                "doubles": 3,
                                "effectiveTacklePercentage": 100,
                                "generalPlayPenalties": 1,
                                "stint1": 2563
                            },
                            "playerTookTheField": true,
                            "shirtNum": 17,
                            "playerFirstInitial": "J",
                            "playerPositionAbbrev": "INT",
                            "fantasyPrice": 128000,
                            "fantasySeasonPriceChange": -126000
                        }
                    ]
                },
                "teamName": "Cronulla-Sutherland Sharks",
                "teamNickName": "Sharks",
                "teamStats": {
                    "allRunMetres": 1578,
                    "allRuns": 169,
                    "bombKicks": 2,
                    "bombKickMetres": 31,
                    "bombKicksDefused": 3,
                    "bombKicksNotDefused": 2,
                    "completeSets": 27,
                    "completionPercentage": 71,
                    "conversions": 2,
                    "conversionsAttempts": 5,
                    "conversionsMissed": 3,
                    "decoys": 25,
                    "dummyHalfRuns": 8,
                    "errors": 9,
                    "goalConversionRate": 50,
                    "allGoals": 3,
                    "allGoalsAttempted": 6,
                    "allGoalsMissed": 3,
                    "hitUps": 74,
                    "incompleteSets": 11,
                    "ineffectiveTackles": 19,
                    "kickMetres": 525,
                    "kickReturnMetres": 175,
                    "kickReturns": 19,
                    "kicks": 17,
                    "kicksDefused": 4,
                    "kicksNotDefused": 4,
                    "lineDropouts": 2,
                    "linebreakAssists": 2,
                    "linebreaks": 6,
                    "missedTackles": 32,
                    "offloads": 9,
                    "oneOnOneTackles": 16,
                    "passes": 189,
                    "passesPerRun": 1.12,
                    "penalties": 10,
                    "penaltyGoals": 1,
                    "penaltyGoalsAttempts": 1,
                    "points": 26,
                    "pointsConceded": 10,
                    "possession": 48,
                    "scrumWins": 5,
                    "supports": 35,
                    "tackleBreaks": 31,
                    "tackles": 290,
                    "sets": 38,
                    "tries": 5,
                    "triesConceded": 2,
                    "tryAssists": 3,
                    "tryCause": 4,
                    "hitupRunMeters": 688,
                    "evasionRuns": 68,
                    "evasionRunMetres": 643,
                    "dummyHalfRunMetres": 72,
                    "ptbTotal": 123,
                    "twoManTackles": 50,
                    "threeManTackles": 55,
                    "fourManPlusTackles": 2,
                    "tryScoringPercentage": 18.52,
                    "shiftsLeft": 6,
                    "shiftsRight": 10,
                    "receipts": 355,
                    "forcedDropOutKicker": 2,
                    "grubberKick": 2,
                    "postContactMetres": 484,
                    "dummyPasses": 10,
                    "kickPressures": 7,
                    "lineEngagedRuns": 16,
                    "ptbZeroToOne": 4,
                    "ptbOneToTwo": 12,
                    "ptbTwoToThree": 42,
                    "ptbThreeToFour": 46,
                    "ptbFourToFive": 15,
                    "ptbFivePlus": 4,
                    "interchangeUsed": 7,
                    "interchangeLeft": 1,
                    "doubles": 45,
                    "longKicksSpace": 8,
                    "effectiveTacklePercentage": 85,
                    "ptbPenalties": 6,
                    "generalPlayPenalties": 2,
                    "foulPlayPenalties": 3,
                    "averageSetDistance": 41.5,
                    "completeSets1stHalf": 12,
                    "completeSets2ndHalf": 15,
                    "completionPercentage1stHalf": 70.59,
                    "completionPercentage2ndHalf": 71.43,
                    "incompleteSets1stHalf": 5,
                    "incompleteSets2ndHalf": 6,
                    "incompletionPercentage1stHalf": 29.41,
                    "incompletionPercentage2ndHalf": 28.57
                },
                "teamHexColour": "4b9ad4",
                "teamHexColour2": "000000"
            }
        ]
    }
}