{
    "vod": [
        {
            "id": "5kNmoxYzE6HYAoRDxOKNHGZSIEJIO5d7",
            "contentId": 927171,
            "title": "Rd 20: Wests Tigers v Eels (Hls)",
            "description": "Highlights of the clash between the Wests Tigers & Eels",
            "publishDate": "2017-07-23T18:08:07+10:00",
            "publisher": "NRL Chief",
            "thumbnailUrl": "http://bpvideos.telstra.insnw.net/web/images/20170723180802a_89x50.jpg",
            "largeThumbnailUrl": "http://bpvideos.telstra.insnw.net/web/images/20170723180802a_326x184.jpg",
            "programType": "Highlights",
            "programCategory": "Match",
            "priority": null,
            "lastUpdateDate": "2017-07-23T18:12:34+10:00",
            "isPremium": false,
            "club": [
                500031,
                500023
            ]
        },
        {
            "id": "VjZmoxYzE613yFog52dOSMIHSagojyQG",
            "contentId": 927120,
            "title": "Rd 20 Press Conference: Wests Tigers",
            "description": "Wests Tigers coach Ivan Cleary speaks with the media following their Round 20 clash",
            "publishDate": "2017-07-23T18:56:01+10:00",
            "publisher": "NRL Chief",
            "thumbnailUrl": "http://bpvideos.telstra.insnw.net/web/images/20170723184746a_89x50.jpg",
            "largeThumbnailUrl": "http://bpvideos.telstra.insnw.net/web/images/20170723184746a_326x184.jpg",
            "programType": "Press Conference",
            "programCategory": null,
            "priority": null,
            "lastUpdateDate": "2017-07-23T19:01:45+10:00",
            "isPremium": false,
            "club": [
                500031,
                500023
            ]
        },
        {
            "id": "52ZWoxYzE6Y1thVd8R1FYhGuiR1PzEfW",
            "contentId": 927119,
            "title": "Rd 20 Press Conference: Eels",
            "description": "Eels coach Brad Arthur speaks with the media following their Round 20 clash",
            "publishDate": "2017-07-23T18:53:50+10:00",
            "publisher": "NRL Chief",
            "thumbnailUrl": "http://bpvideos.telstra.insnw.net/web/images/20170723183639a_89x50.jpg",
            "largeThumbnailUrl": "http://bpvideos.telstra.insnw.net/web/images/20170723183639a_326x184.jpg",
            "programType": "Press Conference",
            "programCategory": null,
            "priority": null,
            "lastUpdateDate": "2017-07-23T18:58:45+10:00",
            "isPremium": false,
            "club": [
                500031,
                500023
            ]
        },
        {
            "id": "E1NGoxYzE6og8i76mqUK69Vay0HXruAQ",
            "contentId": 927172,
            "title": "Rd 20: FIELD GOAL Corey Norman (77th min)",
            "description": "Corey Norman slots the winning point for the Eels",
            "publishDate": "2017-07-23T17:56:42+10:00",
            "publisher": "NRL Chief",
            "thumbnailUrl": "http://bpvideos.telstra.insnw.net/web/images/20170723175552a_89x50.jpg",
            "largeThumbnailUrl": "http://bpvideos.telstra.insnw.net/web/images/20170723175552a_326x184.jpg",
            "programType": "Instant Replay",
            "programCategory": "Score",
            "priority": null,
            "lastUpdateDate": "2017-07-23T18:00:31+10:00",
            "isPremium": true,
            "club": [
                500031,
                500023
            ]
        },
        {
            "id": "A5MmoxYzE6F0o-i0zR6BdW_ZpGjY4ikh",
            "contentId": 927166,
            "title": "Rd 20: TRY Malakai Watene-Zelezniak (70th min)",
            "description": "Malakai Watene-Zelezniak leaps high to lock the scores up",
            "publishDate": "2017-07-23T17:47:52+10:00",
            "publisher": "NRL Chief",
            "thumbnailUrl": "http://bpvideos.telstra.insnw.net/web/images/20170723174737a_89x50.jpg",
            "largeThumbnailUrl": "http://bpvideos.telstra.insnw.net/web/images/20170723174737a_326x184.jpg",
            "programType": "Instant Replay",
            "programCategory": "Score",
            "priority": null,
            "lastUpdateDate": "2017-07-23T17:51:28+10:00",
            "isPremium": true,
            "club": [
                500031,
                500023
            ]
        },
        {
            "id": "kwMWoxYzE6IpcN_qBNHQb2KUqciDGw9N",
            "contentId": 927159,
            "title": "Rd 20: GOAL Clint Gutherson (62nd min)",
            "description": "Clint Gutherson converts his own try",
            "publishDate": "2017-07-23T17:40:41+10:00",
            "publisher": "NRL Chief",
            "thumbnailUrl": "http://bpvideos.telstra.insnw.net/web/images/20170723174007a_89x50.jpg",
            "largeThumbnailUrl": "http://bpvideos.telstra.insnw.net/web/images/20170723174007a_326x184.jpg",
            "programType": "Instant Replay",
            "programCategory": "Score",
            "priority": null,
            "lastUpdateDate": "2017-07-23T17:44:26+10:00",
            "isPremium": true,
            "club": [
                500031,
                500023
            ]
        },
        {
            "id": "E1MGoxYzE6mO8-6EVdEvV5pB2K7hgbqs",
            "contentId": 927161,
            "title": "Rd 20: TRY Clint Gutherson (61st min)",
            "description": "Clint Gutherson restores the lead for the Eels",
            "publishDate": "2017-07-23T17:37:03+10:00",
            "publisher": "NRL Chief",
            "thumbnailUrl": "http://bpvideos.telstra.insnw.net/web/images/20170723173612a_89x50.jpg",
            "largeThumbnailUrl": "http://bpvideos.telstra.insnw.net/web/images/20170723173612a_326x184.jpg",
            "programType": "Instant Replay",
            "programCategory": "Score",
            "priority": null,
            "lastUpdateDate": "2017-07-23T17:40:25+10:00",
            "isPremium": true,
            "club": [
                500031,
                500023
            ]
        },
        {
            "id": "V3eWkxYzE6uD4K9-73vbMYdkt3pKtMZT",
            "contentId": 927160,
            "title": "Rd 20: PENALTY GOAL Tuimoala Lolohea (56th min)",
            "description": "Tuimoala Lolohea kicks another two points",
            "publishDate": "2017-07-23T17:34:54+10:00",
            "publisher": "NRL Chief",
            "thumbnailUrl": "http://bpvideos.telstra.insnw.net/web/images/20170723173602a_89x50.jpg",
            "largeThumbnailUrl": "http://bpvideos.telstra.insnw.net/web/images/20170723173602a_326x184.jpg",
            "programType": "Instant Replay",
            "programCategory": "Score",
            "priority": null,
            "lastUpdateDate": "2017-07-23T17:40:25+10:00",
            "isPremium": true,
            "club": [
                500031,
                500023
            ]
        },
        {
            "id": "BreWkxYzE6b02KWYwLM9iqByUFGkz_NS",
            "contentId": 927155,
            "title": "Rd 20: PENALTY GOAL Tuimoala Lolohea (53rd min)",
            "description": "Tuimoala Lolohea ties the scores up",
            "publishDate": "2017-07-23T17:33:35+10:00",
            "publisher": "NRL Chief",
            "thumbnailUrl": "http://bpvideos.telstra.insnw.net/web/images/20170723173319a_89x50.jpg",
            "largeThumbnailUrl": "http://bpvideos.telstra.insnw.net/web/images/20170723173319a_326x184.jpg",
            "programType": "Instant Replay",
            "programCategory": "Score",
            "priority": null,
            "lastUpdateDate": "2017-07-23T17:37:24+10:00",
            "isPremium": true,
            "club": [
                500031,
                500023
            ]
        },
        {
            "id": "kzaGkxYzE6ubxyHKgZCPHDm-w8LO2ZPm",
            "contentId": 927137,
            "title": "Rd 20: TRY Semi Radradra (31st min)",
            "description": "Semi Radradra touches down for another Eels try",
            "publishDate": "2017-07-23T16:48:21+10:00",
            "publisher": "NRL Chief",
            "thumbnailUrl": "http://bpvideos.telstra.insnw.net/web/images/20170723164824a_89x50.jpg",
            "largeThumbnailUrl": "http://bpvideos.telstra.insnw.net/web/images/20170723164824a_326x184.jpg",
            "programType": "Instant Replay",
            "programCategory": "Score",
            "priority": null,
            "lastUpdateDate": "2017-07-23T16:52:12+10:00",
            "isPremium": true,
            "club": [
                500031,
                500023
            ]
        },
        {
            "id": "dlZ2kxYzE6XKBn7ohrPU_TeU46isBb6q",
            "contentId": 927133,
            "title": "Rd 20: PENALTY GOAL Tuimoala Lolohea (26th min)",
            "description": "The Wests Tigers pivot kicks his side into the lead",
            "publishDate": "2017-07-23T16:45:16+10:00",
            "publisher": "NRL Chief",
            "thumbnailUrl": "http://bpvideos.telstra.insnw.net/web/images/20170723164450a_89x50.jpg",
            "largeThumbnailUrl": "http://bpvideos.telstra.insnw.net/web/images/20170723164450a_326x184.jpg",
            "programType": "Instant Replay",
            "programCategory": "Score",
            "priority": null,
            "lastUpdateDate": "2017-07-23T16:49:11+10:00",
            "isPremium": true,
            "club": [
                500031,
                500023
            ]
        },
        {
            "id": "lmZGkxYzE6uvhvKC_jdif5dLT67SC10F",
            "contentId": 927113,
            "title": "Rd 20: GOAL Tuimoala Lolohea (13th min)",
            "description": "The Wests Tigers' five-eighth converts from the touch line",
            "publishDate": "2017-07-23T16:33:35+10:00",
            "publisher": "NRL Chief",
            "thumbnailUrl": "http://bpvideos.telstra.insnw.net/web/images/20170723163308a_89x50.jpg",
            "largeThumbnailUrl": "http://bpvideos.telstra.insnw.net/web/images/20170723163308a_326x184.jpg",
            "programType": "Instant Replay",
            "programCategory": "Score",
            "priority": null,
            "lastUpdateDate": "2017-07-23T16:37:08+10:00",
            "isPremium": true,
            "club": [
                500031,
                500023
            ]
        },
        {
            "id": "UxZGkxYzE6e7sfGYBjDQVqconHqn2d1F",
            "contentId": 927111,
            "title": "Rd 20: TRY James Tedesco (12th min)",
            "description": "James Tedesco streaks away to score a stylish try",
            "publishDate": "2017-07-23T16:31:55+10:00",
            "publisher": "NRL Chief",
            "thumbnailUrl": "http://bpvideos.telstra.insnw.net/web/images/20170723163148a_89x50.jpg",
            "largeThumbnailUrl": "http://bpvideos.telstra.insnw.net/web/images/20170723163148a_326x184.jpg",
            "programType": "Instant Replay",
            "programCategory": "Score",
            "priority": null,
            "lastUpdateDate": "2017-07-23T16:36:08+10:00",
            "isPremium": true,
            "club": [
                500031,
                500023
            ]
        },
        {
            "id": "M2Y2kxYzE6F0kSr1LnOWe5FZpgIcNkEm",
            "contentId": 927105,
            "title": "Rd 20: GOAL Clint Gutherson (5th min)",
            "description": "The Eels ace converts Bevan French's try",
            "publishDate": "2017-07-23T16:25:46+10:00",
            "publisher": "NRL Chief",
            "thumbnailUrl": "http://bpvideos.telstra.insnw.net/web/images/20170723162553a_89x50.jpg",
            "largeThumbnailUrl": "http://bpvideos.telstra.insnw.net/web/images/20170723162553a_326x184.jpg",
            "programType": "Instant Replay",
            "programCategory": "Score",
            "priority": null,
            "lastUpdateDate": "2017-07-23T16:30:06+10:00",
            "isPremium": true,
            "club": [
                500031,
                500023
            ]
        },
        {
            "id": "M0Y2kxYzE6WrCMmgS1T3_LBmVSqY3Gtp",
            "contentId": 927102,
            "title": "Rd 20: TRY Bevan French (3rd min)",
            "description": "Bevan French pounces early for the Eels",
            "publishDate": "2017-07-23T16:25:29+10:00",
            "publisher": "NRL Chief",
            "thumbnailUrl": "http://bpvideos.telstra.insnw.net/web/images/20170723162539a_89x50.jpg",
            "largeThumbnailUrl": "http://bpvideos.telstra.insnw.net/web/images/20170723162539a_326x184.jpg",
            "programType": "Instant Replay",
            "programCategory": "Score",
            "priority": null,
            "lastUpdateDate": "2017-07-23T16:30:06+10:00",
            "isPremium": true,
            "club": [
                500031,
                500023
            ]
        }
    ],
    "scores": [
        {
            "gameState": "First Half",
            "gameStateId": 3,
            "gameTime": "0:11:25",
            "gameSeconds": 685,
            "GameMinutes": "11:25",
            "playerId": 500663,
            "playerName": "James Tedesco",
            "scoreMethod": "Try",
            "statEvent": "Try",
            "statId": 38,
            "statValue": 4,
            "vidRef": 20086,
            "homeScore": 4,
            "awayScore": 6,
            "commentary": "Try by James Tedesco",
            "tackleNum": 5,
            "teamId": 500023,
            "teamName": "Wests Tigers",
            "homeTeamAbbrv": "WST",
            "awayTeamAbbrv": "PAR"
        },
        {
            "gameState": "First Half",
            "gameStateId": 3,
            "gameTime": "0:12:40",
            "gameSeconds": 760,
            "GameMinutes": "12:40",
            "playerId": 500927,
            "playerName": "Tuimoala Lolohea",
            "scoreMethod": "Conversion",
            "statEvent": "Conversion-Made",
            "statId": 1,
            "statValue": 2,
            "vidRef": 22541,
            "homeScore": 6,
            "awayScore": 6,
            "commentary": "Conversion-Made by Tuimoala Lolohea",
            "tackleNum": -1,
            "teamId": 500023,
            "teamName": "Wests Tigers",
            "homeTeamAbbrv": "WST",
            "awayTeamAbbrv": "PAR"
        },
        {
            "gameState": "First Half",
            "gameStateId": 3,
            "gameTime": "0:25:42",
            "gameSeconds": 1542,
            "GameMinutes": "25:42",
            "playerId": 500927,
            "playerName": "Tuimoala Lolohea",
            "scoreMethod": "Penalty Goal",
            "statEvent": "Penalty Shot-Made",
            "statId": 67,
            "statValue": 2,
            "vidRef": 42675,
            "homeScore": 8,
            "awayScore": 6,
            "commentary": "Penalty Shot-Made by Tuimoala Lolohea",
            "tackleNum": -1,
            "teamId": 500023,
            "teamName": "Wests Tigers",
            "homeTeamAbbrv": "WST",
            "awayTeamAbbrv": "PAR"
        },
        {
            "gameState": "Second Half",
            "gameStateId": 5,
            "gameTime": "0:52:04",
            "gameSeconds": 3124,
            "GameMinutes": "52:04",
            "playerId": 500927,
            "playerName": "Tuimoala Lolohea",
            "scoreMethod": "Penalty Goal",
            "statEvent": "Penalty Shot-Made",
            "statId": 67,
            "statValue": 2,
            "vidRef": 85585,
            "homeScore": 10,
            "awayScore": 10,
            "commentary": "Penalty Shot-Made by Tuimoala Lolohea",
            "tackleNum": -1,
            "teamId": 500023,
            "teamName": "Wests Tigers",
            "homeTeamAbbrv": "WST",
            "awayTeamAbbrv": "PAR"
        },
        {
            "gameState": "Second Half",
            "gameStateId": 5,
            "gameTime": "0:55:01",
            "gameSeconds": 3301,
            "GameMinutes": "55:01",
            "playerId": 500927,
            "playerName": "Tuimoala Lolohea",
            "scoreMethod": "Penalty Goal",
            "statEvent": "Penalty Shot-Made",
            "statId": 67,
            "statValue": 2,
            "vidRef": 90016,
            "homeScore": 12,
            "awayScore": 10,
            "commentary": "Penalty Shot-Made by Tuimoala Lolohea",
            "tackleNum": -1,
            "teamId": 500023,
            "teamName": "Wests Tigers",
            "homeTeamAbbrv": "WST",
            "awayTeamAbbrv": "PAR"
        },
        {
            "gameState": "Second Half",
            "gameStateId": 5,
            "gameTime": "1:09:13",
            "gameSeconds": 4153,
            "GameMinutes": "69:13",
            "playerId": 504755,
            "playerName": "Malakai Watene Zelezniak",
            "scoreMethod": "Try",
            "statEvent": "Try",
            "statId": 38,
            "statValue": 4,
            "vidRef": 116483,
            "homeScore": 16,
            "awayScore": 16,
            "commentary": "Try by Malakai Watene Zelezniak",
            "tackleNum": 6,
            "teamId": 500023,
            "teamName": "Wests Tigers",
            "homeTeamAbbrv": "WST",
            "awayTeamAbbrv": "PAR"
        },
        {
            "gameState": "First Half",
            "gameStateId": 3,
            "gameTime": "0:02:21",
            "gameSeconds": 141,
            "GameMinutes": "02:21",
            "playerId": 503601,
            "playerName": "Bevan French",
            "scoreMethod": "Try",
            "statEvent": "Try",
            "statId": 38,
            "statValue": 4,
            "vidRef": 5965,
            "awayScore": 4,
            "commentary": "Try by Bevan French",
            "tackleNum": 4,
            "teamId": 500031,
            "teamName": "Parramatta Eels",
            "homeTeamAbbrv": "WST",
            "awayTeamAbbrv": "PAR"
        },
        {
            "gameState": "First Half",
            "gameStateId": 3,
            "gameTime": "0:03:54",
            "gameSeconds": 234,
            "GameMinutes": "03:54",
            "playerId": 500729,
            "playerName": "Clinton Gutherson",
            "scoreMethod": "Conversion",
            "statEvent": "Conversion-Made",
            "statId": 1,
            "statValue": 2,
            "vidRef": 8804,
            "awayScore": 6,
            "commentary": "Conversion-Made by Clinton Gutherson",
            "tackleNum": -1,
            "teamId": 500031,
            "teamName": "Parramatta Eels",
            "homeTeamAbbrv": "WST",
            "awayTeamAbbrv": "PAR"
        },
        {
            "gameState": "First Half",
            "gameStateId": 3,
            "gameTime": "0:30:33",
            "gameSeconds": 1833,
            "GameMinutes": "30:33",
            "playerId": 500690,
            "playerName": "Semi Radradra",
            "scoreMethod": "Try",
            "statEvent": "Try",
            "statId": 38,
            "statValue": 4,
            "vidRef": 49944,
            "homeScore": 8,
            "awayScore": 10,
            "commentary": "Try by Semi Radradra",
            "tackleNum": 2,
            "teamId": 500031,
            "teamName": "Parramatta Eels",
            "homeTeamAbbrv": "WST",
            "awayTeamAbbrv": "PAR"
        },
        {
            "gameState": "Second Half",
            "gameStateId": 5,
            "gameTime": "1:00:09",
            "gameSeconds": 3609,
            "GameMinutes": "60:09",
            "playerId": 500729,
            "playerName": "Clinton Gutherson",
            "scoreMethod": "Try",
            "statEvent": "Try",
            "statId": 38,
            "statValue": 4,
            "vidRef": 97724,
            "homeScore": 12,
            "awayScore": 14,
            "commentary": "Try by Clinton Gutherson",
            "tackleNum": 4,
            "teamId": 500031,
            "teamName": "Parramatta Eels",
            "homeTeamAbbrv": "WST",
            "awayTeamAbbrv": "PAR"
        },
        {
            "gameState": "Second Half",
            "gameStateId": 5,
            "gameTime": "1:01:40",
            "gameSeconds": 3700,
            "GameMinutes": "61:40",
            "playerId": 500729,
            "playerName": "Clinton Gutherson",
            "scoreMethod": "Conversion",
            "statEvent": "Conversion-Made",
            "statId": 1,
            "statValue": 2,
            "vidRef": 101005,
            "homeScore": 12,
            "awayScore": 16,
            "commentary": "Conversion-Made by Clinton Gutherson",
            "tackleNum": -1,
            "teamId": 500031,
            "teamName": "Parramatta Eels",
            "homeTeamAbbrv": "WST",
            "awayTeamAbbrv": "PAR"
        },
        {
            "gameState": "Second Half",
            "gameStateId": 5,
            "gameTime": "1:16:47",
            "gameSeconds": 4607,
            "GameMinutes": "76:47",
            "playerId": 500684,
            "playerName": "Corey Norman",
            "scoreMethod": "Field Goal",
            "statEvent": "Drop Goal-Made",
            "statId": 69,
            "statValue": 1,
            "vidRef": 129253,
            "homeScore": 16,
            "awayScore": 17,
            "commentary": "Drop Goal-Made by Corey Norman",
            "tackleNum": 4,
            "teamId": 500031,
            "teamName": "Parramatta Eels",
            "homeTeamAbbrv": "WST",
            "awayTeamAbbrv": "PAR"
        }
    ],
    "twitter": [
        {
            "id": "889028789367328768",
            "gameSeconds": 4140
        },
        {
            "id": "889028668730650624",
            "gameSeconds": 4140
        },
        {
            "id": "889027548524367872",
            "gameSeconds": 3540
        },
        {
            "id": "889027069429948417",
            "gameSeconds": 3540
        },
        {
            "id": "889009206338101249",
            "gameSeconds": 720
        },
        {
            "id": "889009040583294976",
            "gameSeconds": 720
        }
    ]
}