{
    "competitionId": 111,
    "competitionName": "NRL Telstra Premiership",
    "gameId": 20161110980,
    "gameInfo": {
        "assistantReferee1Id": 500031,
        "numberOfPeriods": 2,
        "assistantReferee1Name": "Russell Turner",
        "assistantReferee2Id": 500014,
        "assistantReferee2Name": "Jeff Younis",
        "gameDate": "2016-05-01",
        "gameHashTag": "#NRLSharksBroncos",
        "gameNumber": 8,
        "gameSeconds": 4800,
        "gameMinutes": "80:00",
        "gameTime": "1:20:00",
        "groundConditionId": 1,
        "groundConditionName": "N/A",
        "referee1Id": 500004,
        "referee1Name": "Gerard Sutton",
        "referee2Id": 500011,
        "referee2Name": "Adam Devcich",
        "startTime": "2016-05-01T16:00:00",
        "startTimeUTC": "2016-05-01T06:00:00Z",
        "venueId": 500007,
        "venueName": "Southern Cross Group Stadium",
        "videoReferee1Id": 500203,
        "videoReferee1Name": "Ben Galea",
        "videoReferee2Id": 500036,
        "videoReferee2Name": "Jason Robinson",
        "weatherId": 2,
        "weatherName": "Fine",
        "broadcastChannel": null,
        "venueLatitude": -33.7591,
        "venueLongitude": 151.27445,
        "broadcastInfo": {
            "radioNetwork": []
        }
    },
    "gameState": "Final",
    "gameStateId": 8,
    "roundId": 9,
    "roundName": "Round 9",
    "seasonId": 2016,
    "teams": {
        "teamsMatch": [
            {
                "isHomeTeam": true,
                "score": {
                    "conversions": 4,
                    "points": 30,
                    "penaltyGoals": 1,
                    "tries": 5
                },
                "team1stHalfScore": 28,
                "team2ndHalfScore": 2,
                "teamAbbr": "CRO",
                "teamFinalScore": 30,
                "teamFullTimeScore": 30,
                "teamHalfTimeScore": 28,
                "teamId": 500028,
                "teamLineup": {
                    "teamLineUpStatusID": 4,
                    "teamLineUpStatus": "Final",
                    "injuriesAndSuspensions": {
                        "injury": [],
                        "suspension": []
                    },
                    "insAndOuts": {
                        "inOut": []
                    },
                    "teamPlayer": [
                        {
                            "playerFirstName": "Ben",
                            "playerId": 500244,
                            "playerLastName": "Barba",
                            "playerName": "Ben Barba",
                            "playerPosition": "Fullback",
                            "playerPositionId": 500001,
                            "playerStats": {
                                "allRunMetres": 80,
                                "allRuns": 11,
                                "bombKicksDefused": 1,
                                "decoys": 3,
                                "fantasyPointsTotal": 21,
                                "ineffectiveTackles": 2,
                                "kickMetres": 5,
                                "kickReturnMetres": 18,
                                "kickReturns": 4,
                                "kicks": 1,
                                "kicksDefused": 3,
                                "linebreakAssists": 1,
                                "mins": 80,
                                "missedTackles": 1,
                                "offloads": 1,
                                "passes": 15,
                                "passesPerRun": 1.36,
                                "penalties": 1,
                                "supports": 6,
                                "tackleBreaks": 1,
                                "tackles": 2,
                                "tryAssists": 1,
                                "evasionRuns": 7,
                                "evasionRunMetres": 62,
                                "ptbAll": 8,
                                "receipts": 25,
                                "grubberKick": 1,
                                "postContactMetres": 22,
                                "lineEngagedRuns": 2,
                                "ptbTwoToThree": 3,
                                "ptbThreeToFour": 4,
                                "ptbFivePlus": 1,
                                "effectiveTacklePercentage": 40,
                                "foulPlayPenalties": 1
                            },
                            "playerTookTheField": true,
                            "shirtNum": 1,
                            "playerFirstInitial": "B",
                            "playerPositionAbbrev": "FB",
                            "fantasyPrice": 357000,
                            "fantasySeasonPriceChange": 179000,
                            "fantasyRoundPriceChange": 11000
                        },
                        {
                            "playerFirstName": "Sosaia",
                            "playerId": 500790,
                            "playerLastName": "Feki",
                            "playerName": "Sosaia Feki",
                            "playerPosition": "Winger 1",
                            "playerPositionId": 500002,
                            "playerStats": {
                                "allRunMetres": 82,
                                "allRuns": 6,
                                "errors": 2,
                                "fantasyPointsTotal": 26,
                                "hitUps": 1,
                                "kickReturnMetres": 27,
                                "kickReturns": 2,
                                "kicksDefused": 1,
                                "linebreaks": 1,
                                "mins": 40,
                                "penalties": 1,
                                "points": 8,
                                "tackleBreaks": 1,
                                "tries": 2,
                                "tryCause": 1,
                                "hitupRunMeters": 12,
                                "evasionRuns": 3,
                                "evasionRunMetres": 43,
                                "ptbAll": 4,
                                "receipts": 8,
                                "postContactMetres": 32,
                                "ptbTwoToThree": 1,
                                "ptbThreeToFour": 2,
                                "ptbFourToFive": 1,
                                "foulPlayPenalties": 1
                            },
                            "playerTookTheField": true,
                            "shirtNum": 2,
                            "playerFirstInitial": "S",
                            "playerPositionAbbrev": "WG",
                            "fantasyPrice": 193000,
                            "fantasySeasonPriceChange": -25000
                        },
                        {
                            "playerFirstName": "Jack",
                            "playerId": 500617,
                            "playerLastName": "Bird",
                            "playerName": "Jack Bird",
                            "playerPosition": "Centre 1",
                            "playerPositionId": 500003,
                            "playerStats": {
                                "allRunMetres": 101,
                                "allRuns": 12,
                                "decoys": 1,
                                "dummyHalfRuns": 2,
                                "errors": 2,
                                "fantasyPointsTotal": 20,
                                "ineffectiveTackles": 1,
                                "kickMetres": 24,
                                "kicks": 1,
                                "kicksNotDefused": 1,
                                "linebreakAssists": 1,
                                "mins": 80,
                                "missedTackles": 3,
                                "offloads": 1,
                                "passes": 9,
                                "passesPerRun": 0.75,
                                "oneOnOneTackles": 1,
                                "supports": 4,
                                "tackleBreaks": 1,
                                "tackles": 12,
                                "tryCause": 3,
                                "evasionRuns": 10,
                                "evasionRunMetres": 81,
                                "dummyHalfRunMetres": 20,
                                "ptbAll": 10,
                                "receipts": 22,
                                "forcedDropOutKicker": 1,
                                "grubberKick": 1,
                                "postContactMetres": 48,
                                "ptbTwoToThree": 3,
                                "ptbThreeToFour": 2,
                                "ptbFourToFive": 5,
                                "doubles": 3,
                                "effectiveTacklePercentage": 75
                            },
                            "playerTookTheField": true,
                            "shirtNum": 3,
                            "playerFirstInitial": "J",
                            "playerPositionAbbrev": "CT",
                            "fantasyPrice": 363000,
                            "fantasySeasonPriceChange": -37000,
                            "fantasyRoundPriceChange": 9000
                        },
                        {
                            "playerFirstName": "Gerard",
                            "playerId": 500616,
                            "playerLastName": "Beale",
                            "playerName": "Gerard Beale",
                            "playerPosition": "Centre 2",
                            "playerPositionId": 500004,
                            "playerStats": {
                                "allRunMetres": 133,
                                "allRuns": 14,
                                "bombKicksDefused": 1,
                                "fantasyPointsTotal": 25,
                                "kickMetres": 17,
                                "kickReturnMetres": 6,
                                "kickReturns": 1,
                                "kicks": 1,
                                "kicksDefused": 1,
                                "mins": 80,
                                "missedTackles": 1,
                                "offloads": 2,
                                "passes": 6,
                                "passesPerRun": 0.43,
                                "supports": 7,
                                "tackles": 4,
                                "tryAssists": 1,
                                "tryCause": 2,
                                "evasionRuns": 13,
                                "evasionRunMetres": 127,
                                "ptbAll": 13,
                                "receipts": 21,
                                "grubberKick": 1,
                                "postContactMetres": 46,
                                "ptbOneToTwo": 1,
                                "ptbTwoToThree": 8,
                                "ptbThreeToFour": 2,
                                "ptbFourToFive": 1,
                                "ptbFivePlus": 1,
                                "doubles": 1,
                                "effectiveTacklePercentage": 80
                            },
                            "playerTookTheField": true,
                            "shirtNum": 14,
                            "playerFirstInitial": "G",
                            "playerPositionAbbrev": "CT",
                            "fantasyPrice": 193000,
                            "fantasySeasonPriceChange": -48000
                        },
                        {
                            "playerFirstName": "Valentine",
                            "playerId": 500845,
                            "playerLastName": "Holmes",
                            "playerName": "Valentine Holmes",
                            "playerPosition": "Winger 2",
                            "playerPositionId": 500005,
                            "playerStats": {
                                "allRunMetres": 120,
                                "allRuns": 9,
                                "bombKicksDefused": 1,
                                "dummyHalfRuns": 1,
                                "errors": 1,
                                "fantasyPointsTotal": 29,
                                "hitUps": 1,
                                "kickMetres": 10,
                                "kickReturnMetres": 34,
                                "kickReturns": 2,
                                "kicks": 1,
                                "kicksDefused": 2,
                                "linebreaks": 1,
                                "mins": 80,
                                "missedTackles": 1,
                                "passes": 3,
                                "passesPerRun": 0.33,
                                "supports": 3,
                                "tackleBreaks": 3,
                                "tackles": 6,
                                "tryCause": 2,
                                "hitupRunMeters": 19,
                                "evasionRuns": 5,
                                "evasionRunMetres": 58,
                                "dummyHalfRunMetres": 9,
                                "ptbAll": 11,
                                "receipts": 16,
                                "grubberKick": 1,
                                "postContactMetres": 35,
                                "ptbTwoToThree": 3,
                                "ptbThreeToFour": 5,
                                "ptbFourToFive": 3,
                                "doubles": 2,
                                "effectiveTacklePercentage": 85.7
                            },
                            "playerTookTheField": true,
                            "shirtNum": 5,
                            "playerFirstInitial": "V",
                            "playerPositionAbbrev": "WG",
                            "fantasyPrice": 259000,
                            "fantasySeasonPriceChange": -5000,
                            "fantasyRoundPriceChange": 15000
                        },
                        {
                            "playerFirstName": "James",
                            "playerId": 500006,
                            "playerLastName": "Maloney",
                            "playerName": "James Maloney",
                            "playerPosition": "Five-Eighth",
                            "playerPositionId": 500006,
                            "playerStats": {
                                "allRunMetres": 69,
                                "allRuns": 8,
                                "bombKicks": 3,
                                "bombKickMetres": 29,
                                "conversions": 4,
                                "conversionsAttempts": 5,
                                "conversionsMissed": 1,
                                "errors": 1,
                                "fantasyPointsTotal": 42,
                                "goalConversionRate": 83.33,
                                "allGoals": 5,
                                "allGoalsMissed": 1,
                                "allGoalsAttempted": 6,
                                "hitUps": 1,
                                "ineffectiveTackles": 1,
                                "kickMetres": 71,
                                "kicks": 7,
                                "linebreaks": 1,
                                "mins": 80,
                                "missedTackles": 5,
                                "passes": 23,
                                "passesPerRun": 2.88,
                                "oneOnOneTackles": 1,
                                "penalties": 2,
                                "penaltyGoals": 1,
                                "penaltyGoalsAttempts": 1,
                                "points": 14,
                                "supports": 4,
                                "tackleBreaks": 1,
                                "tackles": 19,
                                "tries": 1,
                                "tryAssists": 1,
                                "tryCause": 1,
                                "hitupRunMeters": 9,
                                "evasionRuns": 7,
                                "evasionRunMetres": 60,
                                "ptbAll": 4,
                                "receipts": 35,
                                "forcedDropOutKicker": 1,
                                "grubberKick": 3,
                                "crossFieldKick": 1,
                                "postContactMetres": 14,
                                "kickPressures": 1,
                                "lineEngagedRuns": 3,
                                "ptbOneToTwo": 1,
                                "ptbThreeToFour": 2,
                                "ptbFourToFive": 1,
                                "doubles": 3,
                                "effectiveTacklePercentage": 76,
                                "foulPlayPenalties": 2
                            },
                            "playerTookTheField": true,
                            "shirtNum": 6,
                            "playerFirstInitial": "J",
                            "playerPositionAbbrev": "FE",
                            "fantasyPrice": 323000,
                            "fantasySeasonPriceChange": -70000,
                            "fantasyRoundPriceChange": 14000
                        },
                        {
                            "playerFirstName": "Chad",
                            "playerId": 501183,
                            "playerLastName": "Townsend",
                            "playerName": "Chad Townsend",
                            "playerPosition": "Halfback",
                            "playerPositionId": 500007,
                            "playerStats": {
                                "allRunMetres": 42,
                                "allRuns": 6,
                                "bombKicks": 3,
                                "bombKickMetres": 69,
                                "decoys": 3,
                                "errors": 1,
                                "fantasyPointsTotal": 29,
                                "ineffectiveTackles": 1,
                                "kickMetres": 110,
                                "kicks": 6,
                                "mins": 80,
                                "missedTackles": 2,
                                "passes": 34,
                                "passesPerRun": 5.67,
                                "oneOnOneTackles": 2,
                                "penalties": 1,
                                "points": 4,
                                "supports": 13,
                                "tackleBreaks": 1,
                                "tackles": 17,
                                "tries": 1,
                                "tryCause": 1,
                                "evasionRuns": 6,
                                "evasionRunMetres": 42,
                                "ptbAll": 3,
                                "receipts": 46,
                                "grubberKick": 1,
                                "crossFieldKick": 1,
                                "postContactMetres": 12,
                                "dummyPasses": 2,
                                "lineEngagedRuns": 3,
                                "ptbTwoToThree": 2,
                                "ptbThreeToFour": 1,
                                "doubles": 1,
                                "longKicksSpace": 1,
                                "effectiveTacklePercentage": 85,
                                "ptbPenalties": 1
                            },
                            "playerTookTheField": true,
                            "shirtNum": 7,
                            "playerFirstInitial": "C",
                            "playerPositionAbbrev": "HB",
                            "fantasyPrice": 323000,
                            "fantasySeasonPriceChange": -24000,
                            "fantasyRoundPriceChange": -1000
                        },
                        {
                            "playerFirstName": "Andrew",
                            "playerId": 500791,
                            "playerLastName": "Fifita",
                            "playerName": "Andrew Fifita",
                            "playerPosition": "Prop 1",
                            "playerPositionId": 500008,
                            "playerStats": {
                                "allRunMetres": 123,
                                "allRuns": 15,
                                "decoys": 5,
                                "fantasyPointsTotal": 49,
                                "hitUps": 13,
                                "ineffectiveTackles": 2,
                                "kickReturnMetres": 10,
                                "kickReturns": 1,
                                "kicks": 1,
                                "mins": 52,
                                "missedTackles": 1,
                                "offloads": 4,
                                "passes": 3,
                                "passesPerRun": 0.2,
                                "oneOnOneTackles": 1,
                                "penalties": 3,
                                "supports": 5,
                                "tackleBreaks": 2,
                                "tackles": 31,
                                "hitupRunMeters": 107,
                                "evasionRuns": 1,
                                "evasionRunMetres": 6,
                                "ptbAll": 10,
                                "receipts": 18,
                                "grubberKick": 1,
                                "postContactMetres": 37,
                                "kickPressures": 2,
                                "lineEngagedRuns": 1,
                                "ptbZeroToOne": 1,
                                "ptbOneToTwo": 3,
                                "ptbTwoToThree": 3,
                                "ptbThreeToFour": 2,
                                "ptbFivePlus": 1,
                                "doubles": 5,
                                "effectiveTacklePercentage": 91.2,
                                "ptbPenalties": 2,
                                "generalPlayPenalties": 1
                            },
                            "playerTookTheField": true,
                            "shirtNum": 8,
                            "playerFirstInitial": "A",
                            "playerPositionAbbrev": "PR",
                            "fantasyPrice": 509000,
                            "fantasySeasonPriceChange": -34000,
                            "fantasyRoundPriceChange": -4000
                        },
                        {
                            "playerFirstName": "Michael",
                            "playerId": 500221,
                            "playerLastName": "Ennis",
                            "playerName": "Michael Ennis",
                            "playerPosition": "Hooker",
                            "playerPositionId": 500009,
                            "playerStats": {
                                "allRunMetres": 26,
                                "allRuns": 5,
                                "dummyHalfRuns": 5,
                                "fantasyPointsTotal": 45,
                                "ineffectiveTackles": 3,
                                "kickMetres": 12,
                                "kicks": 1,
                                "linebreakAssists": 1,
                                "mins": 80,
                                "missedTackles": 1,
                                "offloads": 1,
                                "passes": 94,
                                "passesPerRun": 18.8,
                                "oneOnOneTackles": 1,
                                "tackles": 31,
                                "tryAssists": 2,
                                "dummyHalfRunMetres": 26,
                                "ptbAll": 2,
                                "receipts": 100,
                                "grubberKick": 1,
                                "postContactMetres": 11,
                                "dummyPasses": 2,
                                "kickPressures": 2,
                                "lineEngagedRuns": 1,
                                "ptbThreeToFour": 1,
                                "ptbFivePlus": 1,
                                "doubles": 5,
                                "effectiveTacklePercentage": 88.6
                            },
                            "playerTookTheField": true,
                            "shirtNum": 9,
                            "playerFirstInitial": "M",
                            "playerPositionAbbrev": "HK",
                            "fantasyPrice": 376000,
                            "fantasySeasonPriceChange": -30000,
                            "fantasyRoundPriceChange": 18000
                        },
                        {
                            "playerFirstName": "Matt",
                            "playerId": 500806,
                            "playerLastName": "Prior",
                            "playerName": "Matt Prior",
                            "playerPosition": "Prop 2",
                            "playerPositionId": 500010,
                            "playerStats": {
                                "allRunMetres": 37,
                                "allRuns": 5,
                                "decoys": 6,
                                "fantasyPointsTotal": 15,
                                "hitUps": 4,
                                "kickReturnMetres": 12,
                                "kickReturns": 1,
                                "mins": 44,
                                "missedTackles": 4,
                                "oneOnOneTackles": 1,
                                "supports": 1,
                                "tackles": 20,
                                "hitupRunMeters": 25,
                                "ptbAll": 5,
                                "receipts": 5,
                                "postContactMetres": 12,
                                "ptbTwoToThree": 2,
                                "ptbThreeToFour": 2,
                                "ptbFivePlus": 1,
                                "doubles": 4,
                                "effectiveTacklePercentage": 83.3
                            },
                            "playerTookTheField": true,
                            "shirtNum": 16,
                            "playerFirstInitial": "M",
                            "playerPositionAbbrev": "PR",
                            "fantasyPrice": 312000,
                            "fantasySeasonPriceChange": 78000,
                            "fantasyRoundPriceChange": 15000
                        },
                        {
                            "playerFirstName": "Jayson",
                            "playerId": 500977,
                            "playerLastName": "Bukuya",
                            "playerName": "Jayson Bukuya",
                            "playerPosition": "2nd Row 1",
                            "playerPositionId": 500011,
                            "playerStats": {
                                "allRunMetres": 84,
                                "allRuns": 10,
                                "decoys": 3,
                                "errors": 1,
                                "fantasyPointsTotal": 27,
                                "hitUps": 9,
                                "ineffectiveTackles": 2,
                                "kickReturnMetres": 11,
                                "kickReturns": 1,
                                "mins": 41,
                                "onReport": 1,
                                "oneOnOneTackles": 1,
                                "penalties": 1,
                                "supports": 3,
                                "tackleBreaks": 2,
                                "tackles": 17,
                                "hitupRunMeters": 73,
                                "ptbAll": 9,
                                "receipts": 10,
                                "postContactMetres": 34,
                                "ptbTwoToThree": 3,
                                "ptbThreeToFour": 4,
                                "ptbFourToFive": 2,
                                "effectiveTacklePercentage": 89.5,
                                "foulPlayPenalties": 1
                            },
                            "playerTookTheField": true,
                            "shirtNum": 11,
                            "playerFirstInitial": "J",
                            "playerPositionAbbrev": "2R",
                            "fantasyPrice": 309000,
                            "fantasySeasonPriceChange": 28000,
                            "fantasyRoundPriceChange": -2000
                        },
                        {
                            "playerFirstName": "Wade",
                            "playerId": 500798,
                            "playerLastName": "Graham",
                            "playerName": "Wade Graham",
                            "playerPosition": "2nd Row 2",
                            "playerPositionId": 500012,
                            "playerStats": {
                                "allRunMetres": 119,
                                "allRuns": 16,
                                "chargeDowns": 1,
                                "decoys": 1,
                                "dummyHalfRuns": 1,
                                "errors": 1,
                                "fantasyPointsTotal": 44,
                                "hitUps": 15,
                                "ineffectiveTackles": 2,
                                "mins": 80,
                                "missedTackles": 3,
                                "offloads": 2,
                                "passes": 7,
                                "passesPerRun": 0.44,
                                "penalties": 1,
                                "supports": 7,
                                "tackleBreaks": 4,
                                "tackles": 27,
                                "tryCause": 1,
                                "hitupRunMeters": 113,
                                "dummyHalfRunMetres": 6,
                                "ptbAll": 13,
                                "receipts": 22,
                                "postContactMetres": 47,
                                "dummyPasses": 1,
                                "kickPressures": 2,
                                "ptbOneToTwo": 1,
                                "ptbTwoToThree": 1,
                                "ptbThreeToFour": 8,
                                "ptbFourToFive": 3,
                                "doubles": 6,
                                "effectiveTacklePercentage": 84.4,
                                "ptbPenalties": 1
                            },
                            "playerTookTheField": true,
                            "shirtNum": 12,
                            "playerFirstInitial": "W",
                            "playerPositionAbbrev": "2R",
                            "fantasyPrice": 349000,
                            "fantasySeasonPriceChange": -114000,
                            "fantasyRoundPriceChange": -8000
                        },
                        {
                            "playerFirstName": "Paul",
                            "playerId": 500794,
                            "playerLastName": "Gallen",
                            "playerName": "Paul Gallen",
                            "playerPosition": "Lock",
                            "playerPositionId": 500013,
                            "playerStats": {
                                "allRunMetres": 185,
                                "allRuns": 20,
                                "decoys": 7,
                                "errors": 1,
                                "fantasyPointsTotal": 54,
                                "hitUps": 17,
                                "ineffectiveTackles": 5,
                                "kickReturnMetres": 23,
                                "kickReturns": 2,
                                "mins": 80,
                                "missedTackles": 4,
                                "offloads": 2,
                                "passes": 6,
                                "passesPerRun": 0.3,
                                "points": 4,
                                "supports": 5,
                                "tackleBreaks": 3,
                                "tackles": 25,
                                "tries": 1,
                                "hitupRunMeters": 152,
                                "evasionRuns": 1,
                                "evasionRunMetres": 10,
                                "ptbAll": 15,
                                "receipts": 27,
                                "postContactMetres": 63,
                                "kickPressures": 1,
                                "lineEngagedRuns": 1,
                                "ptbOneToTwo": 1,
                                "ptbTwoToThree": 8,
                                "ptbThreeToFour": 3,
                                "ptbFourToFive": 1,
                                "ptbFivePlus": 2,
                                "doubles": 4,
                                "effectiveTacklePercentage": 73.5
                            },
                            "playerTookTheField": true,
                            "shirtNum": 13,
                            "playerFirstInitial": "P",
                            "playerPositionAbbrev": "LK",
                            "fantasyPrice": 515000,
                            "fantasySeasonPriceChange": -21000,
                            "fantasyRoundPriceChange": 15000
                        },
                        {
                            "playerFirstName": "Ricky",
                            "playerId": 500801,
                            "playerLastName": "Leutele",
                            "playerName": "Ricky Leutele",
                            "playerPosition": "Interchange",
                            "playerPositionId": 500014,
                            "playerStats": {
                                "allRunMetres": 37,
                                "allRuns": 4,
                                "decoys": 1,
                                "dummyHalfRuns": 1,
                                "fantasyPointsTotal": 14,
                                "mins": 40,
                                "passes": 1,
                                "passesPerRun": 0.25,
                                "supports": 1,
                                "tackleBreaks": 2,
                                "tackles": 5,
                                "tryCause": 1,
                                "evasionRuns": 3,
                                "evasionRunMetres": 27,
                                "dummyHalfRunMetres": 10,
                                "ptbAll": 3,
                                "receipts": 4,
                                "postContactMetres": 19,
                                "kickPressures": 1,
                                "ptbOneToTwo": 1,
                                "ptbThreeToFour": 2,
                                "doubles": 1,
                                "effectiveTacklePercentage": 100
                            },
                            "playerTookTheField": true,
                            "shirtNum": 4,
                            "playerFirstInitial": "R",
                            "playerPositionAbbrev": "INT",
                            "fantasyPrice": 279000,
                            "fantasySeasonPriceChange": -9000,
                            "fantasyRoundPriceChange": -8000
                        },
                        {
                            "playerFirstName": "Sam",
                            "playerId": 500813,
                            "playerLastName": "Tagataese",
                            "playerName": "Sam Tagataese",
                            "playerPosition": "Interchange",
                            "playerPositionId": 500014,
                            "playerStats": {
                                "allRunMetres": 96,
                                "allRuns": 9,
                                "decoys": 4,
                                "fantasyPointsTotal": 29,
                                "hitUps": 7,
                                "kickReturnMetres": 33,
                                "kickReturns": 2,
                                "mins": 27,
                                "offloads": 3,
                                "supports": 2,
                                "tackleBreaks": 1,
                                "tackles": 11,
                                "hitupRunMeters": 63,
                                "ptbAll": 6,
                                "receipts": 9,
                                "postContactMetres": 38,
                                "dummyPasses": 1,
                                "ptbOneToTwo": 1,
                                "ptbTwoToThree": 2,
                                "ptbThreeToFour": 2,
                                "ptbFourToFive": 1,
                                "doubles": 1,
                                "effectiveTacklePercentage": 100
                            },
                            "playerTookTheField": true,
                            "shirtNum": 10,
                            "playerFirstInitial": "S",
                            "playerPositionAbbrev": "INT",
                            "fantasyPrice": 223000,
                            "fantasySeasonPriceChange": 6000,
                            "fantasyRoundPriceChange": -5000
                        },
                        {
                            "playerFirstName": "Chris",
                            "playerId": 500799,
                            "playerLastName": "Heighington",
                            "playerName": "Chris Heighington",
                            "playerPosition": "Interchange",
                            "playerPositionId": 500014,
                            "playerStats": {
                                "allRunMetres": 61,
                                "allRuns": 6,
                                "decoys": 1,
                                "errors": 1,
                                "fantasyPointsTotal": 30,
                                "hitUps": 6,
                                "linebreaks": 1,
                                "mins": 26,
                                "tackleBreaks": 2,
                                "tackles": 16,
                                "hitupRunMeters": 61,
                                "ptbAll": 6,
                                "receipts": 7,
                                "postContactMetres": 19,
                                "ptbThreeToFour": 5,
                                "ptbFourToFive": 1,
                                "doubles": 3,
                                "effectiveTacklePercentage": 100
                            },
                            "playerTookTheField": true,
                            "shirtNum": 15,
                            "playerFirstInitial": "C",
                            "playerPositionAbbrev": "INT",
                            "fantasyPrice": 263000,
                            "fantasySeasonPriceChange": -68000,
                            "fantasyRoundPriceChange": -10000
                        },
                        {
                            "playerFirstName": "Luke",
                            "playerId": 500802,
                            "playerLastName": "Lewis",
                            "playerName": "Luke Lewis",
                            "playerPosition": "Interchange",
                            "playerPositionId": 500014,
                            "playerStats": {
                                "allRunMetres": 50,
                                "allRuns": 7,
                                "decoys": 4,
                                "fantasyPointsTotal": 30,
                                "hitUps": 6,
                                "linebreakAssists": 1,
                                "mins": 49,
                                "missedTackles": 2,
                                "offloads": 1,
                                "passes": 8,
                                "passesPerRun": 1.14,
                                "oneOnOneTackles": 4,
                                "supports": 2,
                                "tackleBreaks": 1,
                                "tackles": 22,
                                "tryCause": 1,
                                "hitupRunMeters": 49,
                                "evasionRuns": 1,
                                "evasionRunMetres": 1,
                                "ptbAll": 4,
                                "receipts": 13,
                                "postContactMetres": 18,
                                "lineEngagedRuns": 1,
                                "ptbOneToTwo": 1,
                                "ptbTwoToThree": 2,
                                "ptbFivePlus": 1,
                                "doubles": 5,
                                "effectiveTacklePercentage": 91.7
                            },
                            "playerTookTheField": true,
                            "shirtNum": 17,
                            "playerFirstInitial": "L",
                            "playerPositionAbbrev": "INT",
                            "fantasyPrice": 315000,
                            "fantasySeasonPriceChange": -78000,
                            "fantasyRoundPriceChange": -17000
                        }
                    ]
                },
                "teamName": "Cronulla-Sutherland Sharks",
                "teamNickName": "Sharks",
                "teamStats": {
                    "allRunMetres": 1443,
                    "allRuns": 163,
                    "bombKicks": 6,
                    "bombKickMetres": 97,
                    "bombKicksDefused": 3,
                    "chargeDowns": 1,
                    "completeSets": 24,
                    "completionPercentage": 75,
                    "conversions": 4,
                    "conversionsAttempts": 5,
                    "conversionsMissed": 1,
                    "decoys": 39,
                    "dummyHalfRuns": 10,
                    "errors": 11,
                    "goalConversionRate": 83.33,
                    "allGoals": 5,
                    "allGoalsAttempted": 6,
                    "allGoalsMissed": 1,
                    "hitUps": 80,
                    "incompleteSets": 8,
                    "ineffectiveTackles": 19,
                    "kickMetres": 248,
                    "kickReturnMetres": 174,
                    "kickReturns": 16,
                    "kicks": 19,
                    "kicksDefused": 7,
                    "kicksNotDefused": 1,
                    "linebreakAssists": 4,
                    "linebreaks": 4,
                    "missedTackles": 28,
                    "offloads": 17,
                    "onReports": 1,
                    "oneOnOneTackles": 12,
                    "passes": 209,
                    "passesPerRun": 1.28,
                    "penalties": 10,
                    "penaltyGoals": 1,
                    "penaltyGoalsAttempts": 1,
                    "points": 30,
                    "pointsConceded": 28,
                    "possession": 53,
                    "scrumWins": 7,
                    "supports": 63,
                    "tackleBreaks": 25,
                    "tackles": 265,
                    "sets": 32,
                    "tries": 5,
                    "triesConceded": 5,
                    "tryAssists": 5,
                    "tryCause": 13,
                    "hitupRunMeters": 682,
                    "evasionRuns": 57,
                    "evasionRunMetres": 515,
                    "dummyHalfRunMetres": 72,
                    "ptbTotal": 126,
                    "twoManTackles": 59,
                    "threeManTackles": 40,
                    "fourManPlusTackles": 1,
                    "tryScoringPercentage": 20.83,
                    "shiftsLeft": 11,
                    "shiftsRight": 16,
                    "receipts": 388,
                    "forcedDropOutKicker": 2,
                    "grubberKick": 10,
                    "crossFieldKick": 2,
                    "postContactMetres": 508,
                    "dummyPasses": 6,
                    "kickPressures": 9,
                    "lineEngagedRuns": 12,
                    "ptbZeroToOne": 1,
                    "ptbOneToTwo": 10,
                    "ptbTwoToThree": 41,
                    "ptbThreeToFour": 47,
                    "ptbFourToFive": 19,
                    "ptbFivePlus": 8,
                    "interchangeUsed": 7,
                    "interchangeLeft": 1,
                    "doubles": 44,
                    "longKicksSpace": 1,
                    "effectiveTacklePercentage": 84.9,
                    "ptbPenalties": 4,
                    "generalPlayPenalties": 1,
                    "foulPlayPenalties": 5,
                    "averageSetDistance": 45.1,
                    "completeSets1stHalf": 15,
                    "completeSets2ndHalf": 9,
                    "completionPercentage1stHalf": 88.24,
                    "completionPercentage2ndHalf": 60,
                    "incompleteSets1stHalf": 2,
                    "incompleteSets2ndHalf": 6,
                    "incompletionPercentage1stHalf": 11.76,
                    "incompletionPercentage2ndHalf": 40
                },
                "teamHexColour": "4b9ad4",
                "teamHexColour2": "000000"
            },
            {
                "score": {
                    "conversions": 3,
                    "points": 28,
                    "penaltyGoals": 1,
                    "tries": 5
                },
                "team1stHalfScore": 6,
                "team2ndHalfScore": 22,
                "teamAbbr": "BRI",
                "teamFinalScore": 28,
                "teamFullTimeScore": 28,
                "teamHalfTimeScore": 6,
                "teamId": 500011,
                "teamLineup": {
                    "teamLineUpStatusID": 4,
                    "teamLineUpStatus": "Final",
                    "injuriesAndSuspensions": {
                        "injury": [],
                        "suspension": []
                    },
                    "insAndOuts": {
                        "inOut": [
                            {
                                "inOut": "Out",
                                "playerFirstName": "Adam",
                                "playerId": "500645",
                                "playerLastName": "Blair",
                                "playerName": "Adam Blair"
                            },
                            {
                                "inOut": "In",
                                "playerFirstName": "Alex",
                                "playerId": "500250",
                                "playerLastName": "Glenn",
                                "playerName": "Alex Glenn"
                            },
                            {
                                "inOut": "Out",
                                "playerFirstName": "Andrew",
                                "playerId": "500261",
                                "playerLastName": "McCullough",
                                "playerName": "Andrew McCullough"
                            },
                            {
                                "inOut": "In",
                                "playerFirstName": "Travis",
                                "playerId": "500390",
                                "playerLastName": "Waddell",
                                "playerName": "Travis Waddell"
                            }
                        ]
                    },
                    "teamPlayer": [
                        {
                            "playerFirstName": "Darius",
                            "playerId": 500040,
                            "playerLastName": "Boyd",
                            "playerName": "Darius Boyd",
                            "playerPosition": "Fullback",
                            "playerPositionId": 500001,
                            "playerStats": {
                                "allRunMetres": 60,
                                "allRuns": 9,
                                "bombKicksDefused": 1,
                                "decoys": 6,
                                "dummyHalfRuns": 3,
                                "fantasyPointsTotal": 41,
                                "kickReturnMetres": 2,
                                "kickReturns": 1,
                                "kicksDefused": 3,
                                "kicksNotDefused": 1,
                                "linebreakAssists": 3,
                                "mins": 80,
                                "passes": 8,
                                "passesPerRun": 0.89,
                                "oneOnOneTackles": 2,
                                "supports": 8,
                                "tackleBreaks": 2,
                                "tackles": 5,
                                "tryAssists": 3,
                                "tryCause": 2,
                                "evasionRuns": 5,
                                "evasionRunMetres": 41,
                                "dummyHalfRunMetres": 17,
                                "ptbAll": 9,
                                "receipts": 18,
                                "postContactMetres": 26,
                                "lineEngagedRuns": 1,
                                "ptbTwoToThree": 1,
                                "ptbThreeToFour": 4,
                                "ptbFourToFive": 3,
                                "ptbFivePlus": 1,
                                "effectiveTacklePercentage": 100
                            },
                            "playerTookTheField": true,
                            "shirtNum": 1,
                            "playerFirstInitial": "D",
                            "playerPositionAbbrev": "FB",
                            "fantasyPrice": 256000,
                            "fantasySeasonPriceChange": -43000,
                            "fantasyRoundPriceChange": -9000
                        },
                        {
                            "playerFirstName": "Corey",
                            "playerId": 500266,
                            "playerLastName": "Oates",
                            "playerName": "Corey Oates",
                            "playerPosition": "Winger 1",
                            "playerPositionId": 500002,
                            "playerStats": {
                                "allRunMetres": 68,
                                "allRuns": 10,
                                "bombKicksDefused": 1,
                                "errors": 1,
                                "fantasyPointsTotal": 16,
                                "hitUps": 1,
                                "kickReturnMetres": 20,
                                "kickReturns": 3,
                                "kicksDefused": 2,
                                "kicksNotDefused": 1,
                                "mins": 80,
                                "missedTackles": 1,
                                "points": 4,
                                "supports": 6,
                                "tackleBreaks": 1,
                                "tackles": 1,
                                "tries": 1,
                                "hitupRunMeters": 10,
                                "evasionRuns": 6,
                                "evasionRunMetres": 38,
                                "ptbAll": 8,
                                "receipts": 11,
                                "postContactMetres": 23,
                                "ptbTwoToThree": 1,
                                "ptbThreeToFour": 6,
                                "ptbFourToFive": 1,
                                "effectiveTacklePercentage": 50
                            },
                            "playerTookTheField": true,
                            "shirtNum": 2,
                            "playerFirstInitial": "C",
                            "playerPositionAbbrev": "WG",
                            "fantasyPrice": 336000,
                            "fantasySeasonPriceChange": 83000,
                            "fantasyRoundPriceChange": 7000
                        },
                        {
                            "playerFirstName": "Jack",
                            "playerId": 500269,
                            "playerLastName": "Reed",
                            "playerName": "Jack Reed",
                            "playerPosition": "Centre 1",
                            "playerPositionId": 500003,
                            "playerStats": {
                                "allRunMetres": 61,
                                "allRuns": 7,
                                "dummyHalfRuns": 3,
                                "fantasyPointsTotal": 21,
                                "ineffectiveTackles": 2,
                                "mins": 80,
                                "passes": 7,
                                "passesPerRun": 1,
                                "oneOnOneTackles": 4,
                                "penalties": 1,
                                "supports": 8,
                                "tackleBreaks": 2,
                                "tackles": 11,
                                "evasionRuns": 4,
                                "evasionRunMetres": 22,
                                "dummyHalfRunMetres": 39,
                                "ptbAll": 6,
                                "receipts": 12,
                                "postContactMetres": 23,
                                "lineEngagedRuns": 1,
                                "ptbOneToTwo": 1,
                                "ptbThreeToFour": 4,
                                "ptbFourToFive": 1,
                                "effectiveTacklePercentage": 84.6,
                                "ptbPenalties": 1
                            },
                            "playerTookTheField": true,
                            "shirtNum": 3,
                            "playerFirstInitial": "J",
                            "playerPositionAbbrev": "CT",
                            "fantasyPrice": 240000,
                            "fantasySeasonPriceChange": -49000,
                            "fantasyRoundPriceChange": -5000
                        },
                        {
                            "playerFirstName": "James",
                            "playerId": 500517,
                            "playerLastName": "Roberts",
                            "playerName": "James Roberts",
                            "playerPosition": "Centre 2",
                            "playerPositionId": 500004,
                            "playerStats": {
                                "allRunMetres": 101,
                                "allRuns": 8,
                                "decoys": 1,
                                "fantasyPointsTotal": 60,
                                "ineffectiveTackles": 1,
                                "kickReturns": 1,
                                "kicksDefused": 1,
                                "linebreaks": 2,
                                "mins": 80,
                                "missedTackles": 2,
                                "offloads": 1,
                                "passes": 5,
                                "passesPerRun": 0.62,
                                "oneOnOneTackles": 2,
                                "points": 4,
                                "supports": 4,
                                "tackleBreaks": 6,
                                "tackles": 17,
                                "tries": 1,
                                "tryCause": 3,
                                "evasionRuns": 7,
                                "evasionRunMetres": 101,
                                "ptbAll": 4,
                                "receipts": 11,
                                "postContactMetres": 16,
                                "ptbTwoToThree": 1,
                                "ptbThreeToFour": 2,
                                "ptbFivePlus": 1,
                                "doubles": 1,
                                "effectiveTacklePercentage": 85
                            },
                            "playerTookTheField": true,
                            "shirtNum": 4,
                            "playerFirstInitial": "J",
                            "playerPositionAbbrev": "CT",
                            "fantasyPrice": 373000,
                            "fantasySeasonPriceChange": 17000,
                            "fantasyRoundPriceChange": -11000
                        },
                        {
                            "playerFirstName": "Jordan",
                            "playerId": 500258,
                            "playerLastName": "Kahu",
                            "playerName": "Jordan Kahu",
                            "playerPosition": "Winger 2",
                            "playerPositionId": 500005,
                            "playerStats": {
                                "allRunMetres": 36,
                                "allRuns": 5,
                                "bombKicksDefused": 1,
                                "bombKicksNotDefused": 1,
                                "conversions": 2,
                                "conversionsAttempts": 2,
                                "errors": 1,
                                "fantasyPointsTotal": 29,
                                "goalConversionRate": 100,
                                "allGoals": 2,
                                "allGoalsAttempted": 2,
                                "kicksDefused": 1,
                                "kicksNotDefused": 3,
                                "linebreaks": 1,
                                "mins": 80,
                                "offloads": 1,
                                "passes": 1,
                                "passesPerRun": 0.2,
                                "oneOnOneTackles": 1,
                                "points": 8,
                                "supports": 5,
                                "tackleBreaks": 1,
                                "tackles": 6,
                                "tries": 1,
                                "tryCause": 2,
                                "evasionRuns": 5,
                                "evasionRunMetres": 36,
                                "ptbAll": 2,
                                "receipts": 8,
                                "postContactMetres": 12,
                                "ptbThreeToFour": 1,
                                "ptbFourToFive": 1,
                                "doubles": 2,
                                "effectiveTacklePercentage": 100
                            },
                            "playerTookTheField": true,
                            "shirtNum": 5,
                            "playerFirstInitial": "J",
                            "playerPositionAbbrev": "WG",
                            "fantasyPrice": 250000,
                            "fantasySeasonPriceChange": -38000,
                            "fantasyRoundPriceChange": 23000
                        },
                        {
                            "playerFirstName": "Anthony",
                            "playerId": 500326,
                            "playerLastName": "Milford",
                            "playerName": "Anthony Milford",
                            "playerPosition": "Five-Eighth",
                            "playerPositionId": 500006,
                            "playerStats": {
                                "allRunMetres": 114,
                                "allRuns": 13,
                                "decoys": 1,
                                "dummyHalfRuns": 1,
                                "errors": 2,
                                "fantasyPointsTotal": 21,
                                "kickMetres": 95,
                                "kickReturnMetres": 8,
                                "kickReturns": 1,
                                "kicks": 3,
                                "kicksDefused": 1,
                                "kicksNotDefused": 1,
                                "mins": 80,
                                "missedTackles": 2,
                                "offloads": 2,
                                "passes": 37,
                                "passesPerRun": 2.85,
                                "penalties": 2,
                                "supports": 3,
                                "tackleBreaks": 2,
                                "tackles": 7,
                                "tryCause": 1,
                                "evasionRuns": 11,
                                "evasionRunMetres": 97,
                                "dummyHalfRunMetres": 9,
                                "ptbAll": 5,
                                "receipts": 49,
                                "grubberKick": 1,
                                "postContactMetres": 18,
                                "dummyPasses": 8,
                                "lineEngagedRuns": 4,
                                "ptbThreeToFour": 2,
                                "ptbFivePlus": 3,
                                "longKicksSpace": 1,
                                "effectiveTacklePercentage": 77.8,
                                "ptbPenalties": 1,
                                "offsidePenalties": 1
                            },
                            "playerTookTheField": true,
                            "shirtNum": 6,
                            "playerFirstInitial": "A",
                            "playerPositionAbbrev": "FE",
                            "fantasyPrice": 487000,
                            "fantasySeasonPriceChange": 124000,
                            "fantasyRoundPriceChange": -5000
                        },
                        {
                            "playerFirstName": "Ben",
                            "playerId": 500257,
                            "playerLastName": "Hunt",
                            "playerName": "Ben Hunt",
                            "playerPosition": "Halfback",
                            "playerPositionId": 500007,
                            "playerStats": {
                                "allRunMetres": 55,
                                "allRuns": 10,
                                "bombKicks": 3,
                                "bombKickMetres": 85,
                                "bombKicksNotDefused": 1,
                                "chargedDown": 1,
                                "errors": 2,
                                "fantasyPointsTotal": 32,
                                "ineffectiveTackles": 1,
                                "kickMetres": 293,
                                "kicks": 10,
                                "kicksNotDefused": 1,
                                "lineDropouts": 2,
                                "mins": 80,
                                "missedTackles": 4,
                                "offloads": 3,
                                "passes": 24,
                                "passesPerRun": 2.4,
                                "oneOnOneTackles": 2,
                                "supports": 4,
                                "tackleBreaks": 1,
                                "tackles": 16,
                                "tryCause": 1,
                                "evasionRuns": 10,
                                "evasionRunMetres": 55,
                                "ptbAll": 4,
                                "receipts": 43,
                                "grubberKick": 1,
                                "crossFieldKick": 2,
                                "postContactMetres": 19,
                                "dummyPasses": 5,
                                "lineEngagedRuns": 2,
                                "ptbTwoToThree": 1,
                                "ptbThreeToFour": 2,
                                "ptbFourToFive": 1,
                                "doubles": 2,
                                "longKicksSpace": 3,
                                "effectiveTacklePercentage": 76.2
                            },
                            "playerTookTheField": true,
                            "shirtNum": 7,
                            "playerFirstInitial": "B",
                            "playerPositionAbbrev": "HB",
                            "fantasyPrice": 506000,
                            "fantasySeasonPriceChange": -9000,
                            "fantasyRoundPriceChange": 17000
                        },
                        {
                            "playerFirstName": "Josh",
                            "playerId": 500262,
                            "playerLastName": "McGuire",
                            "playerName": "Josh McGuire",
                            "playerPosition": "Prop 1",
                            "playerPositionId": 500008,
                            "playerStats": {
                                "allRunMetres": 86,
                                "allRuns": 14,
                                "decoys": 4,
                                "dummyHalfRuns": 1,
                                "fantasyPointsTotal": 39,
                                "hitUps": 13,
                                "mins": 60,
                                "missedTackles": 1,
                                "offloads": 2,
                                "passes": 9,
                                "passesPerRun": 0.64,
                                "oneOnOneTackles": 1,
                                "supports": 1,
                                "tackleBreaks": 1,
                                "tackles": 26,
                                "hitupRunMeters": 76,
                                "dummyHalfRunMetres": 10,
                                "ptbAll": 11,
                                "receipts": 23,
                                "postContactMetres": 23,
                                "ptbTwoToThree": 3,
                                "ptbThreeToFour": 7,
                                "ptbFourToFive": 1,
                                "doubles": 5,
                                "effectiveTacklePercentage": 96.3
                            },
                            "playerTookTheField": true,
                            "shirtNum": 8,
                            "playerFirstInitial": "J",
                            "playerPositionAbbrev": "PR",
                            "fantasyPrice": 417000,
                            "fantasySeasonPriceChange": -13000,
                            "fantasyRoundPriceChange": -17000
                        },
                        {
                            "playerFirstName": "Travis",
                            "playerId": 500390,
                            "playerLastName": "Waddell",
                            "playerName": "Travis Waddell",
                            "playerPosition": "Hooker",
                            "playerPositionId": 500009,
                            "playerStats": {
                                "allRunMetres": 22,
                                "allRuns": 3,
                                "dummyHalfRuns": 3,
                                "errors": 1,
                                "fantasyPointsTotal": 21,
                                "ineffectiveTackles": 4,
                                "mins": 35,
                                "missedTackles": 1,
                                "passes": 33,
                                "passesPerRun": 11,
                                "oneOnOneTackles": 1,
                                "tackles": 23,
                                "dummyHalfRunMetres": 22,
                                "ptbAll": 2,
                                "receipts": 31,
                                "postContactMetres": 7,
                                "ptbThreeToFour": 2,
                                "doubles": 7,
                                "effectiveTacklePercentage": 82.1
                            },
                            "playerTookTheField": true,
                            "shirtNum": 17,
                            "playerFirstInitial": "T",
                            "playerPositionAbbrev": "HK",
                            "fantasyPrice": 170000
                        },
                        {
                            "playerFirstName": "Sam",
                            "playerId": 500273,
                            "playerLastName": "Thaiday",
                            "playerName": "Sam Thaiday",
                            "playerPosition": "Prop 2",
                            "playerPositionId": 500010,
                            "playerStats": {
                                "allRunMetres": 107,
                                "allRuns": 13,
                                "decoys": 6,
                                "errors": 1,
                                "fantasyPointsTotal": 33,
                                "hitUps": 9,
                                "ineffectiveTackles": 2,
                                "kickReturnMetres": 38,
                                "kickReturns": 3,
                                "linebreaks": 1,
                                "mins": 62,
                                "missedTackles": 1,
                                "passes": 3,
                                "passesPerRun": 0.23,
                                "oneOnOneTackles": 3,
                                "points": 4,
                                "supports": 10,
                                "tackles": 15,
                                "tries": 1,
                                "hitupRunMeters": 62,
                                "evasionRuns": 1,
                                "evasionRunMetres": 7,
                                "ptbAll": 11,
                                "receipts": 16,
                                "postContactMetres": 29,
                                "dummyPasses": 1,
                                "kickPressures": 1,
                                "ptbTwoToThree": 7,
                                "ptbFourToFive": 4,
                                "doubles": 1,
                                "effectiveTacklePercentage": 83.3
                            },
                            "playerTookTheField": true,
                            "shirtNum": 15,
                            "playerFirstInitial": "S",
                            "playerPositionAbbrev": "PR",
                            "fantasyPrice": 269000,
                            "fantasySeasonPriceChange": -100000,
                            "fantasyRoundPriceChange": -16000
                        },
                        {
                            "playerFirstName": "Alex",
                            "playerId": 500250,
                            "playerLastName": "Glenn",
                            "playerName": "Alex Glenn",
                            "playerPosition": "2nd Row 1",
                            "playerPositionId": 500011,
                            "playerStats": {
                                "allRunMetres": 31,
                                "allRuns": 6,
                                "decoys": 1,
                                "fantasyPointsTotal": 16,
                                "hitUps": 6,
                                "ineffectiveTackles": 2,
                                "kicksNotDefused": 1,
                                "mins": 43,
                                "missedTackles": 1,
                                "passes": 3,
                                "passesPerRun": 0.5,
                                "supports": 4,
                                "tackleBreaks": 1,
                                "tackles": 12,
                                "hitupRunMeters": 31,
                                "ptbAll": 6,
                                "receipts": 9,
                                "postContactMetres": 11,
                                "kickPressures": 1,
                                "ptbThreeToFour": 3,
                                "ptbFourToFive": 2,
                                "ptbFivePlus": 1,
                                "doubles": 1,
                                "effectiveTacklePercentage": 80
                            },
                            "playerTookTheField": true,
                            "shirtNum": 11,
                            "playerFirstInitial": "A",
                            "playerPositionAbbrev": "2R",
                            "fantasyPrice": 345000,
                            "fantasySeasonPriceChange": -39000
                        },
                        {
                            "playerFirstName": "Matt",
                            "playerId": 500249,
                            "playerLastName": "Gillett",
                            "playerName": "Matt Gillett",
                            "playerPosition": "2nd Row 2",
                            "playerPositionId": 500012,
                            "playerStats": {
                                "allRunMetres": 62,
                                "allRuns": 10,
                                "decoys": 10,
                                "errors": 1,
                                "fantasyPointsTotal": 38,
                                "hitUps": 10,
                                "ineffectiveTackles": 4,
                                "mins": 80,
                                "missedTackles": 4,
                                "offloads": 1,
                                "oneOnOneTackles": 4,
                                "supports": 7,
                                "tackleBreaks": 1,
                                "tackles": 37,
                                "hitupRunMeters": 62,
                                "ptbAll": 8,
                                "receipts": 11,
                                "postContactMetres": 21,
                                "kickPressures": 1,
                                "ptbTwoToThree": 1,
                                "ptbThreeToFour": 4,
                                "ptbFourToFive": 2,
                                "ptbFivePlus": 1,
                                "doubles": 11,
                                "effectiveTacklePercentage": 82.2
                            },
                            "playerTookTheField": true,
                            "shirtNum": 12,
                            "playerFirstInitial": "M",
                            "playerPositionAbbrev": "2R",
                            "fantasyPrice": 453000,
                            "fantasySeasonPriceChange": 8000,
                            "fantasyRoundPriceChange": -19000
                        },
                        {
                            "playerFirstName": "Corey",
                            "playerId": 500268,
                            "playerLastName": "Parker",
                            "playerName": "Corey Parker",
                            "playerPosition": "Lock",
                            "playerPositionId": 500013,
                            "playerStats": {
                                "allRunMetres": 148,
                                "allRuns": 16,
                                "conversions": 1,
                                "conversionsAttempts": 3,
                                "conversionsMissed": 2,
                                "decoys": 6,
                                "fantasyPointsTotal": 69,
                                "goalConversionRate": 50,
                                "allGoals": 2,
                                "allGoalsMissed": 2,
                                "allGoalsAttempted": 4,
                                "hitUps": 15,
                                "ineffectiveTackles": 5,
                                "linebreaks": 1,
                                "mins": 69,
                                "missedTackles": 3,
                                "offloads": 1,
                                "passes": 4,
                                "passesPerRun": 0.25,
                                "penaltyGoals": 1,
                                "penaltyGoalsAttempts": 1,
                                "points": 8,
                                "supports": 4,
                                "tackleBreaks": 4,
                                "tackles": 31,
                                "tries": 1,
                                "hitupRunMeters": 145,
                                "evasionRuns": 1,
                                "evasionRunMetres": 3,
                                "ptbAll": 12,
                                "receipts": 19,
                                "postContactMetres": 56,
                                "dummyPasses": 1,
                                "lineEngagedRuns": 1,
                                "ptbTwoToThree": 3,
                                "ptbThreeToFour": 4,
                                "ptbFourToFive": 5,
                                "doubles": 5,
                                "effectiveTacklePercentage": 79.5
                            },
                            "playerTookTheField": true,
                            "shirtNum": 13,
                            "playerFirstInitial": "C",
                            "playerPositionAbbrev": "LK",
                            "fantasyPrice": 476000,
                            "fantasySeasonPriceChange": -83000,
                            "fantasyRoundPriceChange": -6000
                        },
                        {
                            "playerFirstName": "Kodi",
                            "playerId": 500265,
                            "playerLastName": "Nikorima",
                            "playerName": "Kodi Nikorima",
                            "playerPosition": "Interchange",
                            "playerPositionId": 500014,
                            "playerStats": {
                                "allRunMetres": 27,
                                "allRuns": 4,
                                "decoys": 1,
                                "dummyHalfRuns": 4,
                                "fantasyPointsTotal": 25,
                                "ineffectiveTackles": 1,
                                "mins": 38,
                                "missedTackles": 3,
                                "passes": 44,
                                "passesPerRun": 11,
                                "oneOnOneTackles": 1,
                                "tackleBreaks": 1,
                                "tackles": 26,
                                "dummyHalfRunMetres": 27,
                                "ptbAll": 3,
                                "receipts": 43,
                                "postContactMetres": 8,
                                "dummyPasses": 2,
                                "lineEngagedRuns": 1,
                                "ptbThreeToFour": 3,
                                "doubles": 9,
                                "effectiveTacklePercentage": 86.7
                            },
                            "playerTookTheField": true,
                            "shirtNum": 9,
                            "playerFirstInitial": "K",
                            "playerPositionAbbrev": "INT",
                            "fantasyPrice": 214000,
                            "fantasySeasonPriceChange": 79000,
                            "fantasyRoundPriceChange": 13000
                        },
                        {
                            "playerFirstName": "Jarrod",
                            "playerId": 500275,
                            "playerLastName": "Wallace",
                            "playerName": "Jarrod Wallace",
                            "playerPosition": "Interchange",
                            "playerPositionId": 500014,
                            "playerStats": {
                                "allRunMetres": 76,
                                "allRuns": 8,
                                "decoys": 5,
                                "fantasyPointsTotal": 24,
                                "hitUps": 8,
                                "ineffectiveTackles": 2,
                                "mins": 30,
                                "missedTackles": 1,
                                "offloads": 1,
                                "passes": 2,
                                "passesPerRun": 0.25,
                                "penalties": 1,
                                "supports": 4,
                                "tackleBreaks": 1,
                                "tackles": 16,
                                "hitupRunMeters": 76,
                                "ptbAll": 6,
                                "receipts": 10,
                                "postContactMetres": 26,
                                "kickPressures": 2,
                                "ptbTwoToThree": 3,
                                "ptbThreeToFour": 1,
                                "ptbFourToFive": 2,
                                "doubles": 3,
                                "effectiveTacklePercentage": 84.2,
                                "ptbPenalties": 1
                            },
                            "playerTookTheField": true,
                            "shirtNum": 14,
                            "playerFirstInitial": "J",
                            "playerPositionAbbrev": "INT",
                            "fantasyPrice": 246000,
                            "fantasySeasonPriceChange": -62000,
                            "fantasyRoundPriceChange": 7000
                        },
                        {
                            "playerFirstName": "Jo",
                            "playerId": 500267,
                            "playerLastName": "Ofahengaue",
                            "playerName": "Jo Ofahengaue",
                            "playerPosition": "Interchange",
                            "playerPositionId": 500014,
                            "playerStats": {
                                "allRunMetres": 114,
                                "allRuns": 14,
                                "decoys": 5,
                                "dummyHalfRuns": 1,
                                "fantasyPointsTotal": 45,
                                "hitUps": 10,
                                "ineffectiveTackles": 1,
                                "kickReturnMetres": 33,
                                "kickReturns": 3,
                                "mins": 45,
                                "missedTackles": 1,
                                "supports": 5,
                                "tackleBreaks": 4,
                                "tackles": 24,
                                "hitupRunMeters": 80,
                                "dummyHalfRunMetres": 1,
                                "ptbAll": 14,
                                "receipts": 14,
                                "postContactMetres": 46,
                                "dummyPasses": 1,
                                "ptbOneToTwo": 1,
                                "ptbTwoToThree": 5,
                                "ptbThreeToFour": 6,
                                "ptbFourToFive": 1,
                                "ptbFivePlus": 1,
                                "doubles": 6,
                                "effectiveTacklePercentage": 92.3
                            },
                            "playerTookTheField": true,
                            "shirtNum": 16,
                            "playerFirstInitial": "J",
                            "playerPositionAbbrev": "INT",
                            "fantasyPrice": 187000,
                            "fantasySeasonPriceChange": 3000,
                            "fantasyRoundPriceChange": 11000
                        },
                        {
                            "playerFirstName": "Herman",
                            "playerId": 500129,
                            "playerLastName": "Ese'ese",
                            "playerName": "Herman Ese'ese",
                            "playerPosition": "Interchange",
                            "playerPositionId": 500014,
                            "playerStats": {
                                "allRunMetres": 32,
                                "allRuns": 5,
                                "decoys": 4,
                                "fantasyPointsTotal": 13,
                                "hitUps": 5,
                                "mins": 17,
                                "offloads": 1,
                                "passes": 1,
                                "passesPerRun": 0.2,
                                "supports": 1,
                                "tackles": 8,
                                "hitupRunMeters": 32,
                                "ptbAll": 4,
                                "receipts": 6,
                                "postContactMetres": 14,
                                "ptbTwoToThree": 1,
                                "ptbThreeToFour": 2,
                                "ptbFourToFive": 1,
                                "effectiveTacklePercentage": 100
                            },
                            "playerTookTheField": true,
                            "shirtNum": 18,
                            "playerFirstInitial": "H",
                            "playerPositionAbbrev": "INT",
                            "fantasyPrice": 128000
                        }
                    ]
                },
                "teamName": "Brisbane Broncos",
                "teamNickName": "Broncos",
                "teamStats": {
                    "allRunMetres": 1200,
                    "allRuns": 155,
                    "bombKicks": 3,
                    "bombKickMetres": 85,
                    "bombKicksDefused": 3,
                    "bombKicksNotDefused": 2,
                    "chargedDown": 1,
                    "completeSets": 27,
                    "completionPercentage": 73,
                    "conversions": 3,
                    "conversionsAttempts": 5,
                    "conversionsMissed": 2,
                    "decoys": 50,
                    "dummyHalfRuns": 16,
                    "errors": 9,
                    "goalConversionRate": 66.67,
                    "allGoals": 4,
                    "allGoalsAttempted": 6,
                    "allGoalsMissed": 2,
                    "hitUps": 77,
                    "incompleteSets": 10,
                    "ineffectiveTackles": 25,
                    "kickMetres": 389,
                    "kickReturnMetres": 101,
                    "kickReturns": 12,
                    "kicks": 13,
                    "kicksDefused": 8,
                    "kicksNotDefused": 8,
                    "lineDropouts": 2,
                    "linebreakAssists": 3,
                    "linebreaks": 5,
                    "missedTackles": 25,
                    "offloads": 13,
                    "oneOnOneTackles": 21,
                    "passes": 181,
                    "passesPerRun": 1.17,
                    "penalties": 4,
                    "penaltyGoals": 1,
                    "penaltyGoalsAttempts": 1,
                    "points": 28,
                    "pointsConceded": 30,
                    "possession": 47,
                    "scrumWins": 4,
                    "supports": 74,
                    "tackleBreaks": 28,
                    "tackles": 281,
                    "sets": 37,
                    "tries": 5,
                    "triesConceded": 5,
                    "tryAssists": 3,
                    "tryCause": 9,
                    "hitupRunMeters": 574,
                    "evasionRuns": 50,
                    "evasionRunMetres": 400,
                    "dummyHalfRunMetres": 125,
                    "ptbTotal": 115,
                    "twoManTackles": 65,
                    "threeManTackles": 40,
                    "tryScoringPercentage": 18.52,
                    "shiftsLeft": 12,
                    "shiftsRight": 12,
                    "receipts": 334,
                    "grubberKick": 2,
                    "crossFieldKick": 2,
                    "postContactMetres": 378,
                    "dummyPasses": 18,
                    "kickPressures": 5,
                    "lineEngagedRuns": 10,
                    "ptbOneToTwo": 2,
                    "ptbTwoToThree": 27,
                    "ptbThreeToFour": 53,
                    "ptbFourToFive": 25,
                    "ptbFivePlus": 8,
                    "interchangeUsed": 7,
                    "interchangeLeft": 1,
                    "doubles": 53,
                    "longKicksSpace": 4,
                    "effectiveTacklePercentage": 84.9,
                    "ptbPenalties": 3,
                    "offsidePenalties": 1,
                    "averageSetDistance": 32.4,
                    "completeSets1stHalf": 11,
                    "completeSets2ndHalf": 16,
                    "completionPercentage1stHalf": 68.75,
                    "completionPercentage2ndHalf": 76.19,
                    "incompleteSets1stHalf": 5,
                    "incompleteSets2ndHalf": 5,
                    "incompletionPercentage1stHalf": 31.25,
                    "incompletionPercentage2ndHalf": 23.81
                },
                "teamHexColour": "650038",
                "teamHexColour2": "ffce35"
            }
        ]
    }
}