{
    "vod": [
        {
            "id": "Y2dmJuNTE6bCdyHKnH2JPjdlLtfsNMC0",
            "contentId": 874594,
            "title": "Rd 26: Broncos v Roosters (Hls)",
            "description": "Highlights of the match between the Broncos and Roosters from Suncorp Stadium",
            "publishDate": "2016-09-01T21:53:00+10:00",
            "publisher": "NRL Chief",
            "thumbnailUrl": "http://bigpondvideo.com/web/images/content/20160901214312a_89x50.jpg",
            "largeThumbnailUrl": "http://bigpondvideo.com/web/images/content/20160901214312a_326x184.jpg",
            "programType": "Highlights",
            "programCategory": "Match",
            "priority": null,
            "lastUpdateDate": "2016-09-01T21:57:22+10:00",
            "isPremium": false,
            "club": [
                500011,
                500001
            ]
        },
        {
            "id": "Rjc2NuNTE61CsiF9swpVFe06bD1eUvMm",
            "contentId": 874605,
            "title": "Rd 26 Press Conference: Broncos",
            "description": "The Broncos coach faces the media following the match",
            "publishDate": "2016-09-01T22:49:00+10:00",
            "publisher": "NRL Chief",
            "thumbnailUrl": "http://bigpondvideo.com/web/images/content/20160901222915a_89x50.jpg",
            "largeThumbnailUrl": "http://bigpondvideo.com/web/images/content/20160901222915a_326x184.jpg",
            "programType": "Press Conference",
            "programCategory": null,
            "priority": null,
            "lastUpdateDate": "2016-09-01T22:53:35+10:00",
            "isPremium": false,
            "club": [
                500011,
                500001
            ]
        },
        {
            "id": "MxdGNuNTE6umbSilN_MGfsyB5_fDRsxG",
            "contentId": 874606,
            "title": "Rd 26 Press Conference: Roosters",
            "description": "The Roosters coach faces the media following the match",
            "publishDate": "2016-09-01T22:47:00+10:00",
            "publisher": "NRL Chief",
            "thumbnailUrl": "http://bigpondvideo.com/web/images/content/20160901222907a_89x50.jpg",
            "largeThumbnailUrl": "http://bigpondvideo.com/web/images/content/20160901222907a_326x184.jpg",
            "programType": "Press Conference",
            "programCategory": null,
            "priority": null,
            "lastUpdateDate": "2016-09-01T22:54:35+10:00",
            "isPremium": false,
            "club": [
                500011,
                500001
            ]
        },
        {
            "id": "dwbWJuNTE6qqGtU366PObX78vpW8n1hD",
            "contentId": 874345,
            "title": "Rd 26: GOAL Corey Parker (75th min)",
            "description": "Conversion sees the Broncos lead 24-14",
            "publishDate": "2016-09-01T21:35:00+10:00",
            "publisher": "NRL Chief",
            "thumbnailUrl": "http://bigpondvideo.com/web/images/content/20160901213711a_89x50.jpg",
            "largeThumbnailUrl": "http://bigpondvideo.com/web/images/content/20160901213711a_326x184.jpg",
            "programType": "Instant Replay",
            "programCategory": "Score",
            "priority": 1,
            "lastUpdateDate": "2016-09-01T21:43:19+10:00",
            "isPremium": true,
            "club": [
                500011,
                500001
            ]
        },
        {
            "id": "A1bWJuNTE6q_Zd-cW9POq5SL9uX0TLCk",
            "contentId": 874344,
            "title": "Rd 26: TRY Jordan Kahu (74th min)",
            "description": "The Broncos wrap this match up as Jordan Kahu crosses for a 2nd half double",
            "publishDate": "2016-09-01T21:34:00+10:00",
            "publisher": "NRL Chief",
            "thumbnailUrl": "http://bigpondvideo.com/web/images/content/20160901213631a_89x50.jpg",
            "largeThumbnailUrl": "http://bigpondvideo.com/web/images/content/20160901213631a_326x184.jpg",
            "programType": "Instant Replay",
            "programCategory": "Score",
            "priority": 2,
            "lastUpdateDate": "2016-09-01T21:43:19+10:00",
            "isPremium": true,
            "club": [
                500011,
                500001
            ]
        },
        {
            "id": "Z3ZGJuNTE6TN318DgO5l06H759mTxHef",
            "contentId": 874342,
            "title": "Rd 26: TRY Jordan Kahu (55th min)",
            "description": "The Broncos take the lead as the put it through the hands to see Jordan Kahu cross in the corner",
            "publishDate": "2016-09-01T21:16:00+10:00",
            "publisher": "NRL Chief",
            "thumbnailUrl": "http://bigpondvideo.com/web/images/content/20160901211742a_89x50.jpg",
            "largeThumbnailUrl": "http://bigpondvideo.com/web/images/content/20160901211742a_326x184.jpg",
            "programType": "Instant Replay",
            "programCategory": "Score",
            "priority": 3,
            "lastUpdateDate": "2016-09-01T21:43:19+10:00",
            "isPremium": true,
            "club": [
                500011,
                500001
            ]
        },
        {
            "id": "dlYmJuNTE6Vo6Jx2eiqU8YlnmUveDW8I",
            "contentId": 874331,
            "title": "Rd 26: PENALTY GOAL Anthony Milford (51st min)",
            "description": "Penalty goal to the Broncos locks this match up at 14-all",
            "publishDate": "2016-09-01T21:09:00+10:00",
            "publisher": "NRL Chief",
            "thumbnailUrl": "http://bigpondvideo.com/web/images/content/20160901211204a_89x50.jpg",
            "largeThumbnailUrl": "http://bigpondvideo.com/web/images/content/20160901211204a_326x184.jpg",
            "programType": "Instant Replay",
            "programCategory": "Score",
            "priority": 4,
            "lastUpdateDate": "2016-09-01T21:42:18+10:00",
            "isPremium": true,
            "club": [
                500011,
                500001
            ]
        },
        {
            "id": "p4dGFuNTE6c10CGu4uOdWqqv3E2jEEpN",
            "contentId": 874328,
            "title": "Rd 26: GOAL Anthony Milford (38th min)",
            "description": "Conversion sees the homeside trail by 2",
            "publishDate": "2016-09-01T20:41:00+10:00",
            "publisher": "NRL Chief",
            "thumbnailUrl": "http://bigpondvideo.com/web/images/content/20160901204105a_89x50.jpg",
            "largeThumbnailUrl": "http://bigpondvideo.com/web/images/content/20160901204105a_326x184.jpg",
            "programType": "Instant Replay",
            "programCategory": "Score",
            "priority": 5,
            "lastUpdateDate": "2016-09-01T21:42:18+10:00",
            "isPremium": true,
            "club": [
                500011,
                500001
            ]
        },
        {
            "id": "F2dGFuNTE6-3v46t-poEW5Mb8ywMciRn",
            "contentId": 874326,
            "title": "Rd 26: TRY James Roberts (36th min)",
            "description": "The Broncos go back to back as the Rooster fail to clean up the kick and James Roberts is on hand to score",
            "publishDate": "2016-09-01T20:39:00+10:00",
            "publisher": "NRL Chief",
            "thumbnailUrl": "http://bigpondvideo.com/web/images/content/20160901203939a_89x50.jpg",
            "largeThumbnailUrl": "http://bigpondvideo.com/web/images/content/20160901203939a_326x184.jpg",
            "programType": "Instant Replay",
            "programCategory": "Score",
            "priority": 6,
            "lastUpdateDate": "2016-09-01T21:42:18+10:00",
            "isPremium": true,
            "club": [
                500011,
                500001
            ]
        },
        {
            "id": "xlc2FuNTE65Av-j2ABetntXluLP_QdHd",
            "contentId": 874325,
            "title": "Rd 26: GOAL Anthony Milford (35th min)",
            "description": "Conversion sees the Broncos trail 14-6",
            "publishDate": "2016-09-01T20:36:00+10:00",
            "publisher": "NRL Chief",
            "thumbnailUrl": "http://bigpondvideo.com/web/images/content/20160901203802a_89x50.jpg",
            "largeThumbnailUrl": "http://bigpondvideo.com/web/images/content/20160901203802a_326x184.jpg",
            "programType": "Instant Replay",
            "programCategory": "Score",
            "priority": null,
            "lastUpdateDate": "2016-09-01T20:40:03+10:00",
            "isPremium": true,
            "club": [
                500011,
                500001
            ]
        },
        {
            "id": "xnc2FuNTE6JgXi8ZKFKep5C4gqeyRZDF",
            "contentId": 874323,
            "title": "Rd 26: TRY Anthony Milford (33rd min)",
            "description": "The Broncos strike back as Anthony Milford crosses for his 13th try for the season",
            "publishDate": "2016-09-01T20:35:00+10:00",
            "publisher": "NRL Chief",
            "thumbnailUrl": "http://bigpondvideo.com/web/images/content/20160901203748a_89x50.jpg",
            "largeThumbnailUrl": "http://bigpondvideo.com/web/images/content/20160901203748a_326x184.jpg",
            "programType": "Instant Replay",
            "programCategory": "Score",
            "priority": 7,
            "lastUpdateDate": "2016-09-01T21:42:18+10:00",
            "isPremium": true,
            "club": [
                500011,
                500001
            ]
        },
        {
            "id": "F4cGFuNTE6ujDBE4aJ56QV00Eehx9r8s",
            "contentId": 874322,
            "title": "Rd 26: GOAL Blake Ferguson (29th min)",
            "description": "Conversion sees the visitors lead 14-0",
            "publishDate": "2016-09-01T20:30:00+10:00",
            "publisher": "NRL Chief",
            "thumbnailUrl": "http://bigpondvideo.com/web/images/content/20160901203213a_89x50.jpg",
            "largeThumbnailUrl": "http://bigpondvideo.com/web/images/content/20160901203213a_326x184.jpg",
            "programType": "Instant Replay",
            "programCategory": "Score",
            "priority": null,
            "lastUpdateDate": "2016-09-01T20:35:02+10:00",
            "isPremium": true,
            "club": [
                500011,
                500001
            ]
        },
        {
            "id": "EwcWFuNTE6KULl8hE11sKUzeYUHrsiFM",
            "contentId": 874321,
            "title": "Rd 26: TRY Connor Watson (27th min)",
            "description": "The Roosters extend their lead as Connor Watson crosses under the posts",
            "publishDate": "2016-09-01T20:29:00+10:00",
            "publisher": "NRL Chief",
            "thumbnailUrl": "http://bigpondvideo.com/web/images/content/20160901203044a_89x50.jpg",
            "largeThumbnailUrl": "http://bigpondvideo.com/web/images/content/20160901203044a_326x184.jpg",
            "programType": "Instant Replay",
            "programCategory": "Score",
            "priority": 8,
            "lastUpdateDate": "2016-09-01T21:41:18+10:00",
            "isPremium": true,
            "club": [
                500011,
                500001
            ]
        },
        {
            "id": "5kbmFuNTE6u3F8zkvmMfGTuxvfqo1JQ9",
            "contentId": 874320,
            "title": "Rd 26: PENALTY GOAL Blake Ferguson (24th min)",
            "description": "Penalty goal to the Roosters takes them out to a 8 point lead",
            "publishDate": "2016-09-01T20:23:00+10:00",
            "publisher": "NRL Chief",
            "thumbnailUrl": "http://bigpondvideo.com/web/images/content/20160901202513a_89x50.jpg",
            "largeThumbnailUrl": "http://bigpondvideo.com/web/images/content/20160901202513a_326x184.jpg",
            "programType": "Instant Replay",
            "programCategory": "Score",
            "priority": 9,
            "lastUpdateDate": "2016-09-01T21:41:18+10:00",
            "isPremium": true,
            "club": [
                500011,
                500001
            ]
        },
        {
            "id": "VyZmFuNTE68qklerE8hv2OMQcN4jYn-4",
            "contentId": 874319,
            "title": "Rd 26: GOAL Latrell Mitchell (8th min)",
            "description": "Conversion sees the Roosters lead 6-0",
            "publishDate": "2016-09-01T20:08:00+10:00",
            "publisher": "NRL Chief",
            "thumbnailUrl": "http://bigpondvideo.com/web/images/content/20160901200846a_89x50.jpg",
            "largeThumbnailUrl": "http://bigpondvideo.com/web/images/content/20160901200846a_326x184.jpg",
            "programType": "Instant Replay",
            "programCategory": "Score",
            "priority": null,
            "lastUpdateDate": "2016-09-01T20:11:57+10:00",
            "isPremium": true,
            "club": [
                500011,
                500001
            ]
        },
        {
            "id": "5qZmFuNTE63SWdt2oBqVPoLJRUdQAj3T",
            "contentId": 874317,
            "title": "Rd 26: TRY Dale Copley (7th min)",
            "description": "The Roosters open the scoring in this match through a try to Dale Copley",
            "publishDate": "2016-09-01T20:07:00+10:00",
            "publisher": "NRL Chief",
            "thumbnailUrl": "http://bigpondvideo.com/web/images/content/20160901200802a_89x50.jpg",
            "largeThumbnailUrl": "http://bigpondvideo.com/web/images/content/20160901200802a_326x184.jpg",
            "programType": "Instant Replay",
            "programCategory": "Score",
            "priority": 10,
            "lastUpdateDate": "2016-09-01T21:41:18+10:00",
            "isPremium": true,
            "club": [
                500011,
                500001
            ]
        }
    ],
    "scores": [
        {
            "gameState": "First Half",
            "gameStateId": 3,
            "gameTime": "0:32:21",
            "gameSeconds": 1941,
            "GameMinutes": "32:21",
            "playerId": 500326,
            "playerName": "Anthony Milford",
            "scoreMethod": "Try",
            "statEvent": "Try",
            "statId": 38,
            "statValue": 4,
            "vidRef": 51671,
            "homeScore": 4,
            "awayScore": 14,
            "commentary": "Try by Anthony Milford",
            "tackleNum": 2,
            "teamId": 500011,
            "teamName": "Brisbane Broncos",
            "homeTeamAbbrv": "BRI",
            "awayTeamAbbrv": "SYD"
        },
        {
            "gameState": "First Half",
            "gameStateId": 3,
            "gameTime": "0:34:27",
            "gameSeconds": 2067,
            "GameMinutes": "34:27",
            "playerId": 500326,
            "playerName": "Anthony Milford",
            "scoreMethod": "Conversion",
            "statEvent": "Conversion-Made",
            "statId": 1,
            "statValue": 2,
            "vidRef": 54833,
            "homeScore": 6,
            "awayScore": 14,
            "commentary": "Conversion-Made by Anthony Milford",
            "tackleNum": -1,
            "teamId": 500011,
            "teamName": "Brisbane Broncos",
            "homeTeamAbbrv": "BRI",
            "awayTeamAbbrv": "SYD"
        },
        {
            "gameState": "First Half",
            "gameStateId": 3,
            "gameTime": "0:35:58",
            "gameSeconds": 2158,
            "GameMinutes": "35:58",
            "playerId": 500517,
            "playerName": "James Roberts",
            "scoreMethod": "Try",
            "statEvent": "Try",
            "statId": 38,
            "statValue": 4,
            "vidRef": 57112,
            "homeScore": 10,
            "awayScore": 14,
            "commentary": "Try by James Roberts",
            "tackleNum": 1,
            "teamId": 500011,
            "teamName": "Brisbane Broncos",
            "homeTeamAbbrv": "BRI",
            "awayTeamAbbrv": "SYD"
        },
        {
            "gameState": "First Half",
            "gameStateId": 3,
            "gameTime": "0:37:32",
            "gameSeconds": 2252,
            "GameMinutes": "37:32",
            "playerId": 500326,
            "playerName": "Anthony Milford",
            "scoreMethod": "Conversion",
            "statEvent": "Conversion-Made",
            "statId": 1,
            "statValue": 2,
            "vidRef": 60053,
            "homeScore": 12,
            "awayScore": 14,
            "commentary": "Conversion-Made by Anthony Milford",
            "tackleNum": -1,
            "teamId": 500011,
            "teamName": "Brisbane Broncos",
            "homeTeamAbbrv": "BRI",
            "awayTeamAbbrv": "SYD"
        },
        {
            "gameState": "Second Half",
            "gameStateId": 5,
            "gameTime": "0:50:32",
            "gameSeconds": 3032,
            "GameMinutes": "50:32",
            "playerId": 500326,
            "playerName": "Anthony Milford",
            "scoreMethod": "Penalty Goal",
            "statEvent": "Penalty Shot-Made",
            "statId": 67,
            "statValue": 2,
            "vidRef": 85130,
            "homeScore": 14,
            "awayScore": 14,
            "commentary": "Penalty Shot-Made by Anthony Milford",
            "tackleNum": -1,
            "teamId": 500011,
            "teamName": "Brisbane Broncos",
            "homeTeamAbbrv": "BRI",
            "awayTeamAbbrv": "SYD"
        },
        {
            "gameState": "Second Half",
            "gameStateId": 5,
            "gameTime": "0:55:04",
            "gameSeconds": 3304,
            "GameMinutes": "55:04",
            "playerId": 500258,
            "playerName": "Jordan Kahu",
            "scoreMethod": "Try",
            "statEvent": "Try",
            "statId": 38,
            "statValue": 4,
            "vidRef": 91944,
            "homeScore": 18,
            "awayScore": 14,
            "commentary": "Try by Jordan Kahu",
            "tackleNum": 6,
            "teamId": 500011,
            "teamName": "Brisbane Broncos",
            "homeTeamAbbrv": "BRI",
            "awayTeamAbbrv": "SYD"
        },
        {
            "gameState": "Second Half",
            "gameStateId": 5,
            "gameTime": "1:13:31",
            "gameSeconds": 4411,
            "GameMinutes": "73:31",
            "playerId": 500258,
            "playerName": "Jordan Kahu",
            "scoreMethod": "Try",
            "statEvent": "Try",
            "statId": 38,
            "statValue": 4,
            "vidRef": 122003,
            "homeScore": 22,
            "awayScore": 14,
            "commentary": "Try by Jordan Kahu",
            "teamId": 500011,
            "teamName": "Brisbane Broncos",
            "homeTeamAbbrv": "BRI",
            "awayTeamAbbrv": "SYD"
        },
        {
            "gameState": "Second Half",
            "gameStateId": 5,
            "gameTime": "1:14:37",
            "gameSeconds": 4477,
            "GameMinutes": "74:37",
            "playerId": 500268,
            "playerName": "Corey Parker",
            "scoreMethod": "Conversion",
            "statEvent": "Conversion-Made",
            "statId": 1,
            "statValue": 2,
            "vidRef": 123651,
            "homeScore": 24,
            "awayScore": 14,
            "commentary": "Conversion-Made by Corey Parker",
            "tackleNum": -1,
            "teamId": 500011,
            "teamName": "Brisbane Broncos",
            "homeTeamAbbrv": "BRI",
            "awayTeamAbbrv": "SYD"
        },
        {
            "gameState": "First Half",
            "gameStateId": 3,
            "gameTime": "0:06:22",
            "gameSeconds": 382,
            "GameMinutes": "06:22",
            "playerId": 500245,
            "playerName": "Dale Copley",
            "scoreMethod": "Try",
            "statEvent": "Try",
            "statId": 38,
            "statValue": 4,
            "vidRef": 10353,
            "awayScore": 4,
            "commentary": "Try by Dale Copley",
            "tackleNum": 6,
            "teamId": 500001,
            "teamName": "Sydney Roosters",
            "homeTeamAbbrv": "BRI",
            "awayTeamAbbrv": "SYD"
        },
        {
            "gameState": "First Half",
            "gameStateId": 3,
            "gameTime": "0:07:43",
            "gameSeconds": 463,
            "GameMinutes": "07:43",
            "playerId": 502502,
            "playerName": "Latrell Mitchell",
            "scoreMethod": "Conversion",
            "statEvent": "Conversion-Made",
            "statId": 1,
            "statValue": 2,
            "vidRef": 12375,
            "awayScore": 6,
            "commentary": "Conversion-Made by Latrell Mitchell",
            "tackleNum": -1,
            "teamId": 500001,
            "teamName": "Sydney Roosters",
            "homeTeamAbbrv": "BRI",
            "awayTeamAbbrv": "SYD"
        },
        {
            "gameState": "First Half",
            "gameStateId": 3,
            "gameTime": "0:23:05",
            "gameSeconds": 1385,
            "GameMinutes": "23:05",
            "playerId": 501569,
            "playerName": "Blake Ferguson",
            "scoreMethod": "Penalty Goal",
            "statEvent": "Penalty Shot-Made",
            "statId": 67,
            "statValue": 2,
            "vidRef": 36298,
            "awayScore": 8,
            "commentary": "Penalty Shot-Made by Blake Ferguson",
            "tackleNum": -1,
            "teamId": 500001,
            "teamName": "Sydney Roosters",
            "homeTeamAbbrv": "BRI",
            "awayTeamAbbrv": "SYD"
        },
        {
            "gameState": "First Half",
            "gameStateId": 3,
            "gameTime": "0:26:52",
            "gameSeconds": 1612,
            "GameMinutes": "26:52",
            "playerId": 503327,
            "playerName": "Connor Watson",
            "scoreMethod": "Try",
            "statEvent": "Try",
            "statId": 38,
            "statValue": 4,
            "vidRef": 43448,
            "awayScore": 12,
            "commentary": "Try by Connor Watson",
            "tackleNum": 4,
            "teamId": 500001,
            "teamName": "Sydney Roosters",
            "homeTeamAbbrv": "BRI",
            "awayTeamAbbrv": "SYD"
        },
        {
            "gameState": "First Half",
            "gameStateId": 3,
            "gameTime": "0:28:18",
            "gameSeconds": 1698,
            "GameMinutes": "28:18",
            "playerId": 501569,
            "playerName": "Blake Ferguson",
            "scoreMethod": "Conversion",
            "statEvent": "Conversion-Made",
            "statId": 1,
            "statValue": 2,
            "vidRef": 45616,
            "awayScore": 14,
            "commentary": "Conversion-Made by Blake Ferguson",
            "tackleNum": -1,
            "teamId": 500001,
            "teamName": "Sydney Roosters",
            "homeTeamAbbrv": "BRI",
            "awayTeamAbbrv": "SYD"
        }
    ]
}