{
    "vod": [
        {
            "id": "B4Z3JqdTrbJ9vzr-lF3FiN6hk8_rBdQl",
            "contentId": 757240,
            "title": "Rd 13: Bulldogs v Dragons (Hls)",
            "description": "Highlights of the match between the Bulldogs & Dragons from ANZ Stadium",
            "publishDate": "2015-06-08T18:25:00+10:00",
            "publisher": "NRL Chief",
            "thumbnailUrl": "http://bigpondvideo.com/Web/Images/Content/20150608182254a_89x50.jpg",
            "largeThumbnailUrl": "http://bigpondvideo.com/Web/Images/Content/20150608182254a_326x184.jpg",
            "programType": "Highlights",
            "programCategory": "Match",
            "priority": null,
            "lastUpdateDate": "2015-06-08T18:30:32+10:00",
            "isPremium": false,
            "club": [
                500010,
                500022
            ]
        },
        {
            "id": "AyanJqdTo_XKRvcU9yzzNKDbKRM_pkNP",
            "contentId": 757303,
            "title": "Rd 13 Press Conference: Dragons",
            "description": "The Dragons coach faces the media following the match",
            "publishDate": "2015-06-08T18:34:00+10:00",
            "publisher": "NRL Chief",
            "thumbnailUrl": "http://bigpondvideo.com/Web/Images/Content/20150608182209a_89x50.jpg",
            "largeThumbnailUrl": "http://bigpondvideo.com/Web/Images/Content/20150608182209a_326x184.jpg",
            "programType": "Press Conference",
            "programCategory": null,
            "priority": null,
            "lastUpdateDate": "2015-06-08T18:43:37+10:00",
            "isPremium": false,
            "club": [
                500010,
                500022
            ]
        },
        {
            "id": "RwZ3JqdTpCNUsZ8SbZvtjCCukvE0diix",
            "contentId": 757302,
            "title": "Rd 13 Press Conference: Bulldogs",
            "description": "The Bulldogs coach faces the media following the match",
            "publishDate": "2015-06-08T18:27:00+10:00",
            "publisher": "NRL Chief",
            "thumbnailUrl": "http://bigpondvideo.com/Web/Images/Content/20150608182146a_89x50.jpg",
            "largeThumbnailUrl": "http://bigpondvideo.com/Web/Images/Content/20150608182146a_326x184.jpg",
            "programType": "Press Conference",
            "programCategory": null,
            "priority": null,
            "lastUpdateDate": "2015-06-08T18:34:35+10:00",
            "isPremium": false,
            "club": [
                500010,
                500022
            ]
        },
        {
            "id": "J3N3JqdTq8vw-c0I2e66dMh4ykhYodul",
            "contentId": 758192,
            "title": "Rd 13: GOAL Trent Hodkinson (77th min)",
            "description": "Conversion sees the Bulldogs lead 29-16",
            "publishDate": "2015-06-08T17:51:00+10:00",
            "publisher": "NRL Chief",
            "thumbnailUrl": "http://bigpondvideo.com/Web/Images/Content/20150608175346a_89x50.jpg",
            "largeThumbnailUrl": "http://bigpondvideo.com/Web/Images/Content/20150608175346a_326x184.jpg",
            "programType": "Instant Replay",
            "programCategory": "Score",
            "priority": null,
            "lastUpdateDate": "2015-06-08T17:56:10+10:00",
            "isPremium": true,
            "club": [
                500010,
                500022
            ]
        },
        {
            "id": "Qza3JqdTqShql-PwhOCZzsHkfn1VwNTx",
            "contentId": 759161,
            "title": "Rd 13: TRY Sam Kasiano (76th min)",
            "description": "Sam Kasiano dives over from close range to wrap this game up for the Bulldogs",
            "publishDate": "2015-06-08T17:50:40+10:00",
            "publisher": "NRL Chief",
            "thumbnailUrl": "http://bigpondvideo.com/Web/Images/Content/20150608183405a_89x50.jpg",
            "largeThumbnailUrl": "http://bigpondvideo.com/Web/Images/Content/20150608183405a_326x184.jpg",
            "programType": "Instant Replay",
            "programCategory": "Score",
            "priority": 2,
            "lastUpdateDate": "2015-06-08T18:40:36+10:00",
            "isPremium": true,
            "club": [
                500010,
                500022
            ]
        },
        {
            "id": "VvNXJqdTrHB25D1zv20ZcSWoNk57Qta0",
            "contentId": 758185,
            "title": "Rd 13: FIELD GOAL Moses Mbye (75th min)",
            "description": "Moses Mbye is the go to man who snaps the one point to take the Bulldogs to a 23-16 lead",
            "publishDate": "2015-06-08T17:47:00+10:00",
            "publisher": "NRL Chief",
            "thumbnailUrl": "http://bigpondvideo.com/Web/Images/Content/20150608174707a_89x50.jpg",
            "largeThumbnailUrl": "http://bigpondvideo.com/Web/Images/Content/20150608174707a_326x184.jpg",
            "programType": "Instant Replay",
            "programCategory": "Score",
            "priority": 3,
            "lastUpdateDate": "2015-06-08T17:59:11+10:00",
            "isPremium": true,
            "club": [
                500010,
                500022
            ]
        },
        {
            "id": "VqNHJqdTpfKURTLuj80T5leAEnKxkdyl",
            "contentId": 758188,
            "title": "Rd 13: GOAL Moses Mbye (68th min)",
            "description": "Conversion sees the Bulldogs lead 22-16",
            "publishDate": "2015-06-08T17:40:00+10:00",
            "publisher": "NRL Chief",
            "thumbnailUrl": "http://bigpondvideo.com/Web/Images/Content/20150608173925a_89x50.jpg",
            "largeThumbnailUrl": "http://bigpondvideo.com/Web/Images/Content/20150608173925a_326x184.jpg",
            "programType": "Instant Replay",
            "programCategory": "Score",
            "priority": null,
            "lastUpdateDate": "2015-06-08T17:44:22+10:00",
            "isPremium": true,
            "club": [
                500010,
                500022
            ]
        },
        {
            "id": "ZmNHJqdTrfZeqewXf_nQsht27t6f4a1W",
            "contentId": 758187,
            "title": "Rd 13: TRY Tim Browne (66th min)",
            "description": "Sam Kasiano produces a gem of a ball to send Tim Browne over for his 2nd career try",
            "publishDate": "2015-06-08T17:39:00+10:00",
            "publisher": "NRL Chief",
            "thumbnailUrl": "http://bigpondvideo.com/Web/Images/Content/20150608173912a_89x50.jpg",
            "largeThumbnailUrl": "http://bigpondvideo.com/Web/Images/Content/20150608173912a_326x184.jpg",
            "programType": "Instant Replay",
            "programCategory": "Score",
            "priority": 4,
            "lastUpdateDate": "2015-06-08T17:58:12+10:00",
            "isPremium": true,
            "club": [
                500010,
                500022
            ]
        },
        {
            "id": "t3M3JqdTpfySoz8HyFj9SNCSzfeQWviy",
            "contentId": 758186,
            "title": "Rd 13: GOAL Moses Mbye (63rd min)",
            "description": "Conversion locks the score up at 16-all",
            "publishDate": "2015-06-08T17:36:00+10:00",
            "publisher": "NRL Chief",
            "thumbnailUrl": "http://bigpondvideo.com/Web/Images/Content/20150608173530a_89x50.jpg",
            "largeThumbnailUrl": "http://bigpondvideo.com/Web/Images/Content/20150608173530a_326x184.jpg",
            "programType": "Instant Replay",
            "programCategory": "Score",
            "priority": null,
            "lastUpdateDate": "2015-06-08T17:41:20+10:00",
            "isPremium": true,
            "club": [
                500010,
                500022
            ]
        },
        {
            "id": "F1M3JqdTqDQLHTt7aEFzeGPS5XeEiQ9r",
            "contentId": 758183,
            "title": "Rd 13: TRY Tim Lafai (62nd min)",
            "description": "Bulldogs strike back through a fantastic try to Tim Lafai",
            "publishDate": "2015-06-08T17:35:00+10:00",
            "publisher": "NRL Chief",
            "thumbnailUrl": "http://bigpondvideo.com/Web/Images/Content/20150608173245a_89x50.jpg",
            "largeThumbnailUrl": "http://bigpondvideo.com/Web/Images/Content/20150608173245a_326x184.jpg",
            "programType": "Instant Replay",
            "programCategory": "Score",
            "priority": 5,
            "lastUpdateDate": "2015-06-08T17:58:11+10:00",
            "isPremium": true,
            "club": [
                500010,
                500022
            ]
        },
        {
            "id": "tuMHJqdTp3CygowG_Sr4EanqLP1QdxU0",
            "contentId": 758182,
            "title": "Rd 13: TRY Peter Mata'utia (57th min)",
            "description": "Sam Perrett gets a wicked bounce and Peter Mata'utia is on hand to score the third try of the afternoon for the Dragons",
            "publishDate": "2015-06-08T17:27:00+10:00",
            "publisher": "NRL Chief",
            "thumbnailUrl": "http://bigpondvideo.com/Web/Images/Content/20150608172628a_89x50.jpg",
            "largeThumbnailUrl": "http://bigpondvideo.com/Web/Images/Content/20150608172628a_326x184.jpg",
            "programType": "Instant Replay",
            "programCategory": "Score",
            "priority": 6,
            "lastUpdateDate": "2015-06-08T17:57:10+10:00",
            "isPremium": true,
            "club": [
                500010,
                500022
            ]
        },
        {
            "id": "FmeHFqdTolHn-8vwgMsi1Dz7cpun7I3I",
            "contentId": 758180,
            "title": "Rd 13: GOAL Gareth Widdop (48th min)",
            "description": "Conversion sees the Dragons lead 12-10",
            "publishDate": "2015-06-08T17:16:00+10:00",
            "publisher": "NRL Chief",
            "thumbnailUrl": "http://bigpondvideo.com/Web/Images/Content/20150608171600a_89x50.jpg",
            "largeThumbnailUrl": "http://bigpondvideo.com/Web/Images/Content/20150608171600a_326x184.jpg",
            "programType": "Instant Replay",
            "programCategory": "Score",
            "priority": null,
            "lastUpdateDate": "2015-06-08T17:20:03+10:00",
            "isPremium": true,
            "club": [
                500010,
                500022
            ]
        },
        {
            "id": "9ieHFqdTpGoMnGy1Hsty86kwK4DFRIX8",
            "contentId": 758177,
            "title": "Rd 13: TRY Gareth Widdop (46th min)",
            "description": "Dragons level the scores as Gareth Widdop crosses for a double",
            "publishDate": "2015-06-08T17:15:00+10:00",
            "publisher": "NRL Chief",
            "thumbnailUrl": "http://bigpondvideo.com/Web/Images/Content/20150608171544a_89x50.jpg",
            "largeThumbnailUrl": "http://bigpondvideo.com/Web/Images/Content/20150608171544a_326x184.jpg",
            "programType": "Instant Replay",
            "programCategory": "Score",
            "priority": 7,
            "lastUpdateDate": "2015-06-08T17:57:10+10:00",
            "isPremium": true,
            "club": [
                500010,
                500022
            ]
        },
        {
            "id": "k3cnFqdTrA2XIObRHDtp9T8_NNaL7Hwx",
            "contentId": 758176,
            "title": "Rd 13: GOAL Gareth Widdop (34th min)",
            "description": "Conversion sees the Dragons trail by 4",
            "publishDate": "2015-06-08T16:48:00+10:00",
            "publisher": "NRL Chief",
            "thumbnailUrl": "http://bigpondvideo.com/Web/Images/Content/20150608164624a_89x50.jpg",
            "largeThumbnailUrl": "http://bigpondvideo.com/Web/Images/Content/20150608164624a_326x184.jpg",
            "programType": "Instant Replay",
            "programCategory": "Score",
            "priority": null,
            "lastUpdateDate": "2015-06-08T16:51:27+10:00",
            "isPremium": true,
            "club": [
                500010,
                500022
            ]
        },
        {
            "id": "I5cnFqdTpq9lmu3BItI3FY5bGrv9aWMi",
            "contentId": 758175,
            "title": "Rd 13: TRY Gareth Widdop (32nd min)",
            "description": "Great set play by the Dragons sees Benji Marshall provide a quality ball for Gareth Widdop to cross",
            "publishDate": "2015-06-08T16:47:00+10:00",
            "publisher": "NRL Chief",
            "thumbnailUrl": "http://bigpondvideo.com/Web/Images/Content/20150608164501a_89x50.jpg",
            "largeThumbnailUrl": "http://bigpondvideo.com/Web/Images/Content/20150608164501a_326x184.jpg",
            "programType": "Instant Replay",
            "programCategory": "Score",
            "priority": 8,
            "lastUpdateDate": "2015-06-08T17:56:10+10:00",
            "isPremium": true,
            "club": [
                500010,
                500022
            ]
        },
        {
            "id": "NsbnFqdTqVV3SBMKK8CAHM-1dCFYnP63",
            "contentId": 758172,
            "title": "Rd 13: GOAL Trent Hodkinson (22nd min)",
            "description": "Conversion takes the Bulldogs out to a 10-0 lead",
            "publishDate": "2015-06-08T16:33:00+10:00",
            "publisher": "NRL Chief",
            "thumbnailUrl": "http://bigpondvideo.com/Web/Images/Content/20150608163308a_89x50.jpg",
            "largeThumbnailUrl": "http://bigpondvideo.com/Web/Images/Content/20150608163308a_326x184.jpg",
            "programType": "Instant Replay",
            "programCategory": "Score",
            "priority": null,
            "lastUpdateDate": "2015-06-08T16:36:12+10:00",
            "isPremium": true,
            "club": [
                500010,
                500022
            ]
        },
        {
            "id": "w5bnFqdTrCJQJssVYtbBV6pczTt72_iW",
            "contentId": 758174,
            "title": "Rd 13: TRY Josh Morris (20th min)",
            "description": "Wonderful rugby league by the Bulldogs sees Moses Mbye send Curtis Rona into the clear who puts in a clever kick for Josh Morris to score",
            "publishDate": "2015-06-08T16:31:00+10:00",
            "publisher": "NRL Chief",
            "thumbnailUrl": "http://bigpondvideo.com/Web/Images/Content/20150608163036a_89x50.jpg",
            "largeThumbnailUrl": "http://bigpondvideo.com/Web/Images/Content/20150608163036a_326x184.jpg",
            "programType": "Instant Replay",
            "programCategory": "Score",
            "priority": 9,
            "lastUpdateDate": "2015-06-08T17:55:09+10:00",
            "isPremium": true,
            "club": [
                500010,
                500022
            ]
        },
        {
            "id": "w5anFqdTomtlUBX_fwtkR6KpzIhZiDNT",
            "contentId": 758165,
            "title": "Rd 13: TRY Curtis Rona (7th min)",
            "description": "Bulldogs open the scoring in this match as Curtis Rona crosses for his 13th try for the year",
            "publishDate": "2015-06-08T16:17:00+10:00",
            "publisher": "NRL Chief",
            "thumbnailUrl": "http://bigpondvideo.com/Web/Images/Content/20150608161622a_89x50.jpg",
            "largeThumbnailUrl": "http://bigpondvideo.com/Web/Images/Content/20150608161622a_326x184.jpg",
            "programType": "Instant Replay",
            "programCategory": "Score",
            "priority": 10,
            "lastUpdateDate": "2015-06-08T17:54:08+10:00",
            "isPremium": true,
            "club": [
                500010,
                500022
            ]
        }
    ],
    "scores": [
        {
            "gameState": "First Half",
            "gameStateId": 3,
            "gameTime": "0:06:31",
            "gameSeconds": 391,
            "playerId": 500294,
            "playerName": "Curtis Rona",
            "scoreMethod": "Try",
            "statEvent": "Try",
            "statId": 38,
            "statValue": 4,
            "vidRef": 12544,
            "homeScore": 4,
            "teamId": 500010,
            "teamName": "Canterbury-Bankstown Bulldogs",
            "homeTeamAbbrv": "CBY",
            "awayTeamAbbrv": "SGI"
        },
        {
            "gameState": "First Half",
            "gameStateId": 3,
            "gameTime": "0:19:46",
            "gameSeconds": 1186,
            "playerId": 500232,
            "playerName": "Josh Morris",
            "scoreMethod": "Try",
            "statEvent": "Try",
            "statId": 38,
            "statValue": 4,
            "vidRef": 33926,
            "homeScore": 8,
            "teamId": 500010,
            "teamName": "Canterbury-Bankstown Bulldogs",
            "homeTeamAbbrv": "CBY",
            "awayTeamAbbrv": "SGI"
        },
        {
            "gameState": "First Half",
            "gameStateId": 3,
            "gameTime": "0:21:08",
            "gameSeconds": 1268,
            "playerId": 500224,
            "playerName": "Trent Hodkinson",
            "scoreMethod": "Conversion",
            "statEvent": "Conversion-Made",
            "statId": 1,
            "statValue": 2,
            "vidRef": 35982,
            "homeScore": 10,
            "teamId": 500010,
            "teamName": "Canterbury-Bankstown Bulldogs",
            "homeTeamAbbrv": "CBY",
            "awayTeamAbbrv": "SGI"
        },
        {
            "gameState": "Second Half",
            "gameStateId": 5,
            "gameTime": "1:01:33",
            "gameSeconds": 3693,
            "playerId": 500229,
            "playerName": "Timoteo Lafai",
            "scoreMethod": "Try",
            "statEvent": "Try",
            "statId": 38,
            "statValue": 4,
            "vidRef": 106498,
            "homeScore": 14,
            "awayScore": 16,
            "teamId": 500010,
            "teamName": "Canterbury-Bankstown Bulldogs",
            "homeTeamAbbrv": "CBY",
            "awayTeamAbbrv": "SGI"
        },
        {
            "gameState": "Second Half",
            "gameStateId": 5,
            "gameTime": "1:02:50",
            "gameSeconds": 3770,
            "playerId": 500243,
            "playerName": "Moses Mbye",
            "scoreMethod": "Conversion",
            "statEvent": "Conversion-Made",
            "statId": 1,
            "statValue": 2,
            "vidRef": 108421,
            "homeScore": 16,
            "awayScore": 16,
            "teamId": 500010,
            "teamName": "Canterbury-Bankstown Bulldogs",
            "homeTeamAbbrv": "CBY",
            "awayTeamAbbrv": "SGI"
        },
        {
            "gameState": "Second Half",
            "gameStateId": 5,
            "gameTime": "1:05:59",
            "gameSeconds": 3959,
            "playerId": 500218,
            "playerName": "Tim Browne",
            "scoreMethod": "Try",
            "statEvent": "Try",
            "statId": 38,
            "statValue": 4,
            "vidRef": 113153,
            "homeScore": 20,
            "awayScore": 16,
            "teamId": 500010,
            "teamName": "Canterbury-Bankstown Bulldogs",
            "homeTeamAbbrv": "CBY",
            "awayTeamAbbrv": "SGI"
        },
        {
            "gameState": "Second Half",
            "gameStateId": 5,
            "gameTime": "1:07:11",
            "gameSeconds": 4031,
            "playerId": 500243,
            "playerName": "Moses Mbye",
            "scoreMethod": "Conversion",
            "statEvent": "Conversion-Made",
            "statId": 1,
            "statValue": 2,
            "vidRef": 114932,
            "homeScore": 22,
            "awayScore": 16,
            "teamId": 500010,
            "teamName": "Canterbury-Bankstown Bulldogs",
            "homeTeamAbbrv": "CBY",
            "awayTeamAbbrv": "SGI"
        },
        {
            "gameState": "Second Half",
            "gameStateId": 5,
            "gameTime": "1:14:08",
            "gameSeconds": 4448,
            "playerId": 500243,
            "playerName": "Moses Mbye",
            "scoreMethod": "Field Goal",
            "statEvent": "Drop Goal-Made",
            "statId": 69,
            "statValue": 1,
            "vidRef": 125602,
            "homeScore": 23,
            "awayScore": 16,
            "teamId": 500010,
            "teamName": "Canterbury-Bankstown Bulldogs",
            "homeTeamAbbrv": "CBY",
            "awayTeamAbbrv": "SGI"
        },
        {
            "gameState": "Second Half",
            "gameStateId": 5,
            "gameTime": "1:15:39",
            "gameSeconds": 4539,
            "playerId": 500227,
            "playerName": "Sam Kasiano",
            "scoreMethod": "Try",
            "statEvent": "Try",
            "statId": 38,
            "statValue": 4,
            "vidRef": 129487,
            "homeScore": 27,
            "awayScore": 16,
            "teamId": 500010,
            "teamName": "Canterbury-Bankstown Bulldogs",
            "homeTeamAbbrv": "CBY",
            "awayTeamAbbrv": "SGI"
        },
        {
            "gameState": "Second Half",
            "gameStateId": 5,
            "gameTime": "1:16:43",
            "gameSeconds": 4603,
            "playerId": 500224,
            "playerName": "Trent Hodkinson",
            "scoreMethod": "Conversion",
            "statEvent": "Conversion-Made",
            "statId": 1,
            "statValue": 2,
            "vidRef": 131081,
            "homeScore": 29,
            "awayScore": 16,
            "teamId": 500010,
            "teamName": "Canterbury-Bankstown Bulldogs",
            "homeTeamAbbrv": "CBY",
            "awayTeamAbbrv": "SGI"
        },
        {
            "gameState": "First Half",
            "gameStateId": 3,
            "gameTime": "0:31:49",
            "gameSeconds": 1909,
            "playerId": 500641,
            "playerName": "Gareth Widdop",
            "scoreMethod": "Try",
            "statEvent": "Try",
            "statId": 38,
            "statValue": 4,
            "vidRef": 54285,
            "homeScore": 10,
            "awayScore": 4,
            "teamId": 500022,
            "teamName": "St. George Illawarra Dragons",
            "homeTeamAbbrv": "CBY",
            "awayTeamAbbrv": "SGI"
        },
        {
            "gameState": "First Half",
            "gameStateId": 3,
            "gameTime": "0:33:11",
            "gameSeconds": 1991,
            "playerId": 500641,
            "playerName": "Gareth Widdop",
            "scoreMethod": "Conversion",
            "statEvent": "Conversion-Made",
            "statId": 1,
            "statValue": 2,
            "vidRef": 56625,
            "homeScore": 10,
            "awayScore": 6,
            "teamId": 500022,
            "teamName": "St. George Illawarra Dragons",
            "homeTeamAbbrv": "CBY",
            "awayTeamAbbrv": "SGI"
        },
        {
            "gameState": "Second Half",
            "gameStateId": 5,
            "gameTime": "0:45:51",
            "gameSeconds": 2751,
            "playerId": 500641,
            "playerName": "Gareth Widdop",
            "scoreMethod": "Try",
            "statEvent": "Try",
            "statId": 38,
            "statValue": 4,
            "vidRef": 78394,
            "homeScore": 10,
            "awayScore": 10,
            "teamId": 500022,
            "teamName": "St. George Illawarra Dragons",
            "homeTeamAbbrv": "CBY",
            "awayTeamAbbrv": "SGI"
        },
        {
            "gameState": "Second Half",
            "gameStateId": 5,
            "gameTime": "0:46:59",
            "gameSeconds": 2819,
            "playerId": 500641,
            "playerName": "Gareth Widdop",
            "scoreMethod": "Conversion",
            "statEvent": "Conversion-Made",
            "statId": 1,
            "statValue": 2,
            "vidRef": 80099,
            "homeScore": 10,
            "awayScore": 12,
            "teamId": 500022,
            "teamName": "St. George Illawarra Dragons",
            "homeTeamAbbrv": "CBY",
            "awayTeamAbbrv": "SGI"
        },
        {
            "gameState": "Second Half",
            "gameStateId": 5,
            "gameTime": "0:56:27",
            "gameSeconds": 3387,
            "playerId": 500630,
            "playerName": "Peter Mata'utia",
            "scoreMethod": "Try",
            "statEvent": "Try",
            "statId": 38,
            "statValue": 4,
            "vidRef": 95787,
            "homeScore": 10,
            "awayScore": 16,
            "teamId": 500022,
            "teamName": "St. George Illawarra Dragons",
            "homeTeamAbbrv": "CBY",
            "awayTeamAbbrv": "SGI"
        }
    ]
}