{
    "vod": [
        {
            "id": "w1YmtnYjE6pWlPNLoDAx5GvuaA6O94lS",
            "contentId": 915682,
            "title": "Rd 13: Bulldogs v Panthers (Hls)",
            "description": "Highlights of the Round 13 clash between the Bulldogs & Panthers",
            "publishDate": "2017-06-04T18:03:00+10:00",
            "publisher": "NRL Chief",
            "thumbnailUrl": "http://bpvideos.telstra.insnw.net/web/images/20170604174732a_89x50.jpg",
            "largeThumbnailUrl": "http://bpvideos.telstra.insnw.net/web/images/20170604174732a_326x184.jpg",
            "programType": "Highlights",
            "programCategory": "Match",
            "priority": null,
            "lastUpdateDate": "2017-06-04T18:23:35+10:00",
            "isPremium": false,
            "club": [
                500010,
                500014
            ]
        },
        {
            "id": "4wbWtnYjE68QVjvD9bTLgzjeiG7NUgAF",
            "contentId": 915686,
            "title": "Rd 13 Press Conference: Bulldogs",
            "description": "Bulldogs coach Des Hasler answers the media's questions after his side's Round 13 clash",
            "publishDate": "2017-06-04T18:38:00+10:00",
            "publisher": "NRL Chief",
            "thumbnailUrl": "http://bpvideos.telstra.insnw.net/web/images/20170604183002a_89x50.jpg",
            "largeThumbnailUrl": "http://bpvideos.telstra.insnw.net/web/images/20170604183002a_326x184.jpg",
            "programType": "Press Conference",
            "programCategory": null,
            "priority": null,
            "lastUpdateDate": "2017-06-04T18:58:44+10:00",
            "isPremium": false,
            "club": [
                500010,
                500014
            ]
        },
        {
            "id": "94amtnYjE6ODmzZgPqYPVsL0ZBRrEHS8",
            "contentId": 915685,
            "title": "Rd 13 Press Conference: Panthers",
            "description": "Panthers coach Anthony Griffin answers the media's questions after his side's Round 13 clash",
            "publishDate": "2017-06-04T18:29:00+10:00",
            "publisher": "NRL Chief",
            "thumbnailUrl": "http://bpvideos.telstra.insnw.net/web/images/20170604182638a_89x50.jpg",
            "largeThumbnailUrl": "http://bpvideos.telstra.insnw.net/web/images/20170604182638a_326x184.jpg",
            "programType": "Press Conference",
            "programCategory": null,
            "priority": null,
            "lastUpdateDate": "2017-06-04T18:49:42+10:00",
            "isPremium": false,
            "club": [
                500010,
                500014
            ]
        },
        {
            "id": "R1OGtnYjE6ixv_uim2GeackWweXSPVwA",
            "contentId": 916452,
            "title": "Rd 13: GOAL Nathan Cleary (80th min)",
            "description": "Nathan Cleary puts the cherry on the top of a huge scoreline",
            "publishDate": "2017-06-04T17:59:36+10:00",
            "publisher": "NRL Chief",
            "thumbnailUrl": "http://bpvideos.telstra.insnw.net/web/images/20170604175922a_89x50.jpg",
            "largeThumbnailUrl": "http://bpvideos.telstra.insnw.net/web/images/20170604175922a_326x184.jpg",
            "programType": "Instant Replay",
            "programCategory": "Score",
            "priority": null,
            "lastUpdateDate": "2017-06-04T18:18:34+10:00",
            "isPremium": true,
            "club": [
                500010,
                500014
            ]
        },
        {
            "id": "ZnOGtnYjE6AumHrMoG5WKXQo_OCizpm1",
            "contentId": 916451,
            "title": "Rd 13: TRY Josh Mansour (79th min)",
            "description": "Josh Mansour scores a last minute Panthers try in the corner",
            "publishDate": "2017-06-04T17:57:54+10:00",
            "publisher": "NRL Chief",
            "thumbnailUrl": "http://bpvideos.telstra.insnw.net/web/images/20170604175733a_89x50.jpg",
            "largeThumbnailUrl": "http://bpvideos.telstra.insnw.net/web/images/20170604175733a_326x184.jpg",
            "programType": "Instant Replay",
            "programCategory": "Score",
            "priority": null,
            "lastUpdateDate": "2017-06-04T18:17:34+10:00",
            "isPremium": true,
            "club": [
                500010,
                500014
            ]
        },
        {
            "id": "5sNWtnYjE6OY9ycTDIzeOjod5M6_frhc",
            "contentId": 916450,
            "title": "Rd 13: GOAL Nathan Cleary (68th min)",
            "description": "Nathan Cleary gets the extras after Rein's second try",
            "publishDate": "2017-06-04T17:44:47+10:00",
            "publisher": "NRL Chief",
            "thumbnailUrl": "http://bpvideos.telstra.insnw.net/web/images/20170604174413a_89x50.jpg",
            "largeThumbnailUrl": "http://bpvideos.telstra.insnw.net/web/images/20170604174413a_326x184.jpg",
            "programType": "Instant Replay",
            "programCategory": "Score",
            "priority": null,
            "lastUpdateDate": "2017-06-04T18:03:31+10:00",
            "isPremium": true,
            "club": [
                500010,
                500014
            ]
        },
        {
            "id": "lkNWtnYjE6-avJQdnn7owyuyydmu7d-Y",
            "contentId": 916448,
            "title": "Rd 13: TRY Mitch Rein (67th min)",
            "description": "Mitch Rein rolls through a broken Bulldogs defence for his second try",
            "publishDate": "2017-06-04T17:42:56+10:00",
            "publisher": "NRL Chief",
            "thumbnailUrl": "http://bpvideos.telstra.insnw.net/web/images/20170604174207a_89x50.jpg",
            "largeThumbnailUrl": "http://bpvideos.telstra.insnw.net/web/images/20170604174207a_326x184.jpg",
            "programType": "Instant Replay",
            "programCategory": "Score",
            "priority": null,
            "lastUpdateDate": "2017-06-04T18:02:30+10:00",
            "isPremium": true,
            "club": [
                500010,
                500014
            ]
        },
        {
            "id": "ttNGtnYjE6UUUncniryTMzxYPFSycJbm",
            "contentId": 916445,
            "title": "Rd 13: GOAL Nathan Cleary (65th min)",
            "description": "Nathan Cleary converts his own try",
            "publishDate": "2017-06-04T17:40:48+10:00",
            "publisher": "NRL Chief",
            "thumbnailUrl": "http://bpvideos.telstra.insnw.net/web/images/20170604174028a_89x50.jpg",
            "largeThumbnailUrl": "http://bpvideos.telstra.insnw.net/web/images/20170604174028a_326x184.jpg",
            "programType": "Instant Replay",
            "programCategory": "Score",
            "priority": null,
            "lastUpdateDate": "2017-06-04T17:59:31+10:00",
            "isPremium": true,
            "club": [
                500010,
                500014
            ]
        },
        {
            "id": "ZnNGtnYjE6vD_B4DefwYfB9P-033yieh",
            "contentId": 916444,
            "title": "Rd 13: TRY Nathan Cleary (64th min)",
            "description": "Nathan Cleary scores under the posts off a perfect Mansour kick",
            "publishDate": "2017-06-04T17:39:27+10:00",
            "publisher": "NRL Chief",
            "thumbnailUrl": "http://bpvideos.telstra.insnw.net/web/images/20170604173948a_89x50.jpg",
            "largeThumbnailUrl": "http://bpvideos.telstra.insnw.net/web/images/20170604173948a_326x184.jpg",
            "programType": "Instant Replay",
            "programCategory": "Score",
            "priority": null,
            "lastUpdateDate": "2017-06-04T17:59:31+10:00",
            "isPremium": true,
            "club": [
                500010,
                500014
            ]
        },
        {
            "id": "F2MWtnYjE6T3gD-5KElQXnd4L773D3jR",
            "contentId": 916437,
            "title": "Rd 13: GOAL Nathan Cleary (53rd min)",
            "description": "Nathan Cleary converts Blake's try",
            "publishDate": "2017-06-04T17:27:40+10:00",
            "publisher": "NRL Chief",
            "thumbnailUrl": "http://bpvideos.telstra.insnw.net/web/images/20170604172713a_89x50.jpg",
            "largeThumbnailUrl": "http://bpvideos.telstra.insnw.net/web/images/20170604172713a_326x184.jpg",
            "programType": "Instant Replay",
            "programCategory": "Score",
            "priority": null,
            "lastUpdateDate": "2017-06-04T17:47:27+10:00",
            "isPremium": true,
            "club": [
                500010,
                500014
            ]
        },
        {
            "id": "hqMWtnYjE6zxq4GB0yiDk3XVMCi_U4Vg",
            "contentId": 916440,
            "title": "Rd 13: TRY Waqa Blake (52nd min)",
            "description": "Waqa Blake breaks through and extends the Panthers' lead",
            "publishDate": "2017-06-04T17:26:20+10:00",
            "publisher": "NRL Chief",
            "thumbnailUrl": "http://bpvideos.telstra.insnw.net/web/images/20170604172606a_89x50.jpg",
            "largeThumbnailUrl": "http://bpvideos.telstra.insnw.net/web/images/20170604172606a_326x184.jpg",
            "programType": "Instant Replay",
            "programCategory": "Score",
            "priority": null,
            "lastUpdateDate": "2017-06-04T17:45:26+10:00",
            "isPremium": true,
            "club": [
                500010,
                500014
            ]
        },
        {
            "id": "h4c2pnYjE6LvN81Y0f8uOIhas68eQ0e-",
            "contentId": 916436,
            "title": "Rd 13: TRY Matt Moylan (29th min)",
            "description": "Matt Moylan collects a beautiful pass to score down the left side",
            "publishDate": "2017-06-04T16:45:02+10:00",
            "publisher": "NRL Chief",
            "thumbnailUrl": "http://bpvideos.telstra.insnw.net/web/images/20170604164513a_89x50.jpg",
            "largeThumbnailUrl": "http://bpvideos.telstra.insnw.net/web/images/20170604164513a_326x184.jpg",
            "programType": "Instant Replay",
            "programCategory": "Score",
            "priority": null,
            "lastUpdateDate": "2017-06-04T17:05:18+10:00",
            "isPremium": true,
            "club": [
                500010,
                500014
            ]
        },
        {
            "id": "1ucWpnYjE6xpR9Ot6Wqj4327c2xped_Z",
            "contentId": 916429,
            "title": "Rd 13: GOAL Nathan Cleary (22nd min)",
            "description": "Nathan Cleary kicks his first goal of the afternoon",
            "publishDate": "2017-06-04T16:37:13+10:00",
            "publisher": "NRL Chief",
            "thumbnailUrl": "http://bpvideos.telstra.insnw.net/web/images/20170604163711a_89x50.jpg",
            "largeThumbnailUrl": "http://bpvideos.telstra.insnw.net/web/images/20170604163711a_326x184.jpg",
            "programType": "Instant Replay",
            "programCategory": "Score",
            "priority": null,
            "lastUpdateDate": "2017-06-04T16:57:15+10:00",
            "isPremium": true,
            "club": [
                500010,
                500014
            ]
        },
        {
            "id": "dkcWpnYjE6M5230GiSXWfWxaeT8U0kht",
            "contentId": 916431,
            "title": "Rd 13: TRY Mitch Rein (20th min)",
            "description": "Mitch Rein slips beneath the Bulldogs defence for a try",
            "publishDate": "2017-06-04T16:36:13+10:00",
            "publisher": "NRL Chief",
            "thumbnailUrl": "http://bpvideos.telstra.insnw.net/web/images/20170604163623a_89x50.jpg",
            "largeThumbnailUrl": "http://bpvideos.telstra.insnw.net/web/images/20170604163623a_326x184.jpg",
            "programType": "Instant Replay",
            "programCategory": "Score",
            "priority": null,
            "lastUpdateDate": "2017-06-04T16:56:15+10:00",
            "isPremium": true,
            "club": [
                500010,
                500014
            ]
        },
        {
            "id": "FwbWpnYjE6nbDQcrDG69_9C5g5n-VrVE",
            "contentId": 916430,
            "title": "Rd 13: TRY Corey Harawira-Naera (4th min)",
            "description": "Corey Harawira-Naera puts the Panthers on the board early",
            "publishDate": "2017-06-04T16:19:32+10:00",
            "publisher": "NRL Chief",
            "thumbnailUrl": "http://bpvideos.telstra.insnw.net/web/images/20170604161932a_89x50.jpg",
            "largeThumbnailUrl": "http://bpvideos.telstra.insnw.net/web/images/20170604161932a_326x184.jpg",
            "programType": "Instant Replay",
            "programCategory": "Score",
            "priority": null,
            "lastUpdateDate": "2017-06-04T16:39:11+10:00",
            "isPremium": true,
            "club": [
                500010,
                500014
            ]
        }
    ],
    "scores": [
        {
            "gameState": "First Half",
            "gameStateId": 3,
            "gameTime": "0:03:25",
            "gameSeconds": 205,
            "GameMinutes": "03:25",
            "playerId": 501241,
            "playerName": "Corey Harawira-Naera",
            "scoreMethod": "Try",
            "statEvent": "Try",
            "statId": 38,
            "statValue": 4,
            "vidRef": 5149,
            "awayScore": 4,
            "commentary": "Try by Corey Harawira-Naera",
            "tackleNum": 4,
            "teamId": 500014,
            "teamName": "Penrith Panthers",
            "homeTeamAbbrv": "CBY",
            "awayTeamAbbrv": "PEN"
        },
        {
            "gameState": "First Half",
            "gameStateId": 3,
            "gameTime": "0:19:49",
            "gameSeconds": 1189,
            "GameMinutes": "19:49",
            "playerId": 500636,
            "playerName": "Mitch Rein",
            "scoreMethod": "Try",
            "statEvent": "Try",
            "statId": 38,
            "statValue": 4,
            "vidRef": 29769,
            "awayScore": 8,
            "commentary": "Try by Mitch Rein",
            "tackleNum": 5,
            "teamId": 500014,
            "teamName": "Penrith Panthers",
            "homeTeamAbbrv": "CBY",
            "awayTeamAbbrv": "PEN"
        },
        {
            "gameState": "First Half",
            "gameStateId": 3,
            "gameTime": "0:21:45",
            "gameSeconds": 1305,
            "GameMinutes": "21:45",
            "playerId": 504120,
            "playerName": "Nathan Cleary",
            "scoreMethod": "Conversion",
            "statEvent": "Conversion-Made",
            "statId": 1,
            "statValue": 2,
            "vidRef": 32672,
            "awayScore": 10,
            "commentary": "Conversion-Made by Nathan Cleary",
            "tackleNum": -1,
            "teamId": 500014,
            "teamName": "Penrith Panthers",
            "homeTeamAbbrv": "CBY",
            "awayTeamAbbrv": "PEN"
        },
        {
            "gameState": "First Half",
            "gameStateId": 3,
            "gameTime": "0:28:17",
            "gameSeconds": 1697,
            "GameMinutes": "28:17",
            "playerId": 500356,
            "playerName": "Matt Moylan",
            "scoreMethod": "Try",
            "statEvent": "Try",
            "statId": 38,
            "statValue": 4,
            "vidRef": 44363,
            "awayScore": 14,
            "commentary": "Try by Matt Moylan",
            "tackleNum": 6,
            "teamId": 500014,
            "teamName": "Penrith Panthers",
            "homeTeamAbbrv": "CBY",
            "awayTeamAbbrv": "PEN"
        },
        {
            "gameState": "Second Half",
            "gameStateId": 5,
            "gameTime": "0:51:18",
            "gameSeconds": 3078,
            "GameMinutes": "51:18",
            "playerId": 500496,
            "playerName": "Waqa Blake",
            "scoreMethod": "Try",
            "statEvent": "Try",
            "statId": 38,
            "statValue": 4,
            "vidRef": 81231,
            "awayScore": 18,
            "commentary": "Try by Waqa Blake",
            "tackleNum": 5,
            "teamId": 500014,
            "teamName": "Penrith Panthers",
            "homeTeamAbbrv": "CBY",
            "awayTeamAbbrv": "PEN"
        },
        {
            "gameState": "Second Half",
            "gameStateId": 5,
            "gameTime": "0:52:46",
            "gameSeconds": 3166,
            "GameMinutes": "52:46",
            "playerId": 504120,
            "playerName": "Nathan Cleary",
            "scoreMethod": "Conversion",
            "statEvent": "Conversion-Made",
            "statId": 1,
            "statValue": 2,
            "vidRef": 83569,
            "awayScore": 20,
            "commentary": "Conversion-Made by Nathan Cleary",
            "tackleNum": -1,
            "teamId": 500014,
            "teamName": "Penrith Panthers",
            "homeTeamAbbrv": "CBY",
            "awayTeamAbbrv": "PEN"
        },
        {
            "gameState": "Second Half",
            "gameStateId": 5,
            "gameTime": "1:03:24",
            "gameSeconds": 3804,
            "GameMinutes": "63:24",
            "playerId": 504120,
            "playerName": "Nathan Cleary",
            "scoreMethod": "Try",
            "statEvent": "Try",
            "statId": 38,
            "statValue": 4,
            "vidRef": 99519,
            "awayScore": 24,
            "commentary": "Try by Nathan Cleary",
            "tackleNum": 6,
            "teamId": 500014,
            "teamName": "Penrith Panthers",
            "homeTeamAbbrv": "CBY",
            "awayTeamAbbrv": "PEN"
        },
        {
            "gameState": "Second Half",
            "gameStateId": 5,
            "gameTime": "1:04:35",
            "gameSeconds": 3875,
            "GameMinutes": "64:35",
            "playerId": 504120,
            "playerName": "Nathan Cleary",
            "scoreMethod": "Conversion",
            "statEvent": "Conversion-Made",
            "statId": 1,
            "statValue": 2,
            "vidRef": 102191,
            "awayScore": 26,
            "commentary": "Conversion-Made by Nathan Cleary",
            "tackleNum": -1,
            "teamId": 500014,
            "teamName": "Penrith Panthers",
            "homeTeamAbbrv": "CBY",
            "awayTeamAbbrv": "PEN"
        },
        {
            "gameState": "Second Half",
            "gameStateId": 5,
            "gameTime": "1:06:21",
            "gameSeconds": 3981,
            "GameMinutes": "66:21",
            "playerId": 500636,
            "playerName": "Mitch Rein",
            "scoreMethod": "Try",
            "statEvent": "Try",
            "statId": 38,
            "statValue": 4,
            "vidRef": 104854,
            "awayScore": 30,
            "commentary": "Try by Mitch Rein",
            "tackleNum": 6,
            "teamId": 500014,
            "teamName": "Penrith Panthers",
            "homeTeamAbbrv": "CBY",
            "awayTeamAbbrv": "PEN"
        },
        {
            "gameState": "Second Half",
            "gameStateId": 5,
            "gameTime": "1:07:39",
            "gameSeconds": 4059,
            "GameMinutes": "67:39",
            "playerId": 504120,
            "playerName": "Nathan Cleary",
            "scoreMethod": "Conversion",
            "statEvent": "Conversion-Made",
            "statId": 1,
            "statValue": 2,
            "vidRef": 106793,
            "awayScore": 32,
            "commentary": "Conversion-Made by Nathan Cleary",
            "tackleNum": -1,
            "teamId": 500014,
            "teamName": "Penrith Panthers",
            "homeTeamAbbrv": "CBY",
            "awayTeamAbbrv": "PEN"
        },
        {
            "gameState": "Second Half",
            "gameStateId": 5,
            "gameTime": "1:18:58",
            "gameSeconds": 4738,
            "GameMinutes": "78:58",
            "playerId": 500352,
            "playerName": "Josh Mansour",
            "scoreMethod": "Try",
            "statEvent": "Try",
            "statId": 38,
            "statValue": 4,
            "vidRef": 127198,
            "awayScore": 36,
            "commentary": "Try by Josh Mansour",
            "tackleNum": 1,
            "teamId": 500014,
            "teamName": "Penrith Panthers",
            "homeTeamAbbrv": "CBY",
            "awayTeamAbbrv": "PEN"
        },
        {
            "gameState": "Second Half",
            "gameStateId": 5,
            "gameTime": "1:19:58",
            "gameSeconds": 4798,
            "GameMinutes": "79:58",
            "playerId": 504120,
            "playerName": "Nathan Cleary",
            "scoreMethod": "Conversion",
            "statEvent": "Conversion-Made",
            "statId": 1,
            "statValue": 2,
            "vidRef": 129857,
            "awayScore": 38,
            "commentary": "Conversion-Made by Nathan Cleary",
            "tackleNum": -1,
            "teamId": 500014,
            "teamName": "Penrith Panthers",
            "homeTeamAbbrv": "CBY",
            "awayTeamAbbrv": "PEN"
        }
    ],
    "twitter": [
        {
            "id": "871274451949699072",
            "gameSeconds": 4740
        },
        {
            "id": "871274297012043776",
            "gameSeconds": 4740
        },
        {
            "id": "871269385838534656",
            "gameSeconds": 3780
        },
        {
            "id": "871269173409624064",
            "gameSeconds": 3780
        }
    ]
}