{
    "competitionId": 111,
    "competitionName": "NRL Telstra Premiership",
    "gameId": 20151111860,
    "gameInfo": {
        "assistantReferee1Id": 500114,
        "numberOfPeriods": 2,
        "assistantReferee1Name": "Clayton Sharpe",
        "assistantReferee2Id": 500029,
        "assistantReferee2Name": "Chris Butler",
        "gameDate": "2015-07-13",
        "gameHashTag": "#NRLTitansManly",
        "gameNumber": 6,
        "gameSeconds": 4800,
        "gameMinutes": "80:00",
        "gameTime": "1:20:00",
        "groundConditionId": 1,
        "groundConditionName": "N/A",
        "referee1Id": 500006,
        "referee1Name": "Henry Perenara",
        "referee2Id": 500005,
        "referee2Name": "Gavin Reynolds",
        "startTime": "2015-07-13T19:00:00",
        "startTimeUTC": "2015-07-13T09:00:00Z",
        "venueId": 500046,
        "venueName": "Cbus Super Stadium",
        "videoReferee1Id": 500118,
        "videoReferee1Name": "Steve Folkes",
        "videoReferee2Id": 500039,
        "videoReferee2Name": "Ashley Klein"
    },
    "gameState": "Final",
    "gameStateId": 8,
    "roundId": 18,
    "seasonId": 2015,
    "teams": {
        "teamsMatch": [
            {
                "isHomeTeam": true,
                "score": {
                    "conversions": 1,
                    "points": 6,
                    "tries": 1
                },
                "team1stHalfScore": 0,
                "team2ndHalfScore": 6,
                "teamAbbr": "GLD",
                "teamFinalScore": 6,
                "teamFullTimeScore": 6,
                "teamHalfTimeScore": 0,
                "teamId": 500004,
                "teamLineup": {
                    "injuriesAndSuspensions": {
                        "injury": [],
                        "suspension": []
                    },
                    "insAndOuts": {
                        "inOut": []
                    },
                    "teamPlayer": [
                        {
                            "playerFirstName": "David",
                            "playerId": 500831,
                            "playerLastName": "Mead",
                            "playerName": "David Mead",
                            "playerPosition": "Fullback",
                            "playerPositionId": 500001,
                            "playerStats": {
                                "allRunMetres": 146,
                                "allRuns": 14,
                                "decoys": 1,
                                "dummyHalfRuns": 3,
                                "errors": 1,
                                "fantasyPointsTotal": 28,
                                "kickMetres": 32,
                                "kickReturnMetres": 75,
                                "kickReturns": 7,
                                "kicks": 2,
                                "kicksDefused": 1,
                                "mins": 80,
                                "missedTackles": 1,
                                "offloads": 1,
                                "oneOnOneTackles": 2,
                                "penalties": 1,
                                "supports": 6,
                                "tackleBreaks": 1,
                                "tackles": 13,
                                "evasionRuns": 4,
                                "evasionRunMetres": 50,
                                "dummyHalfRunMetres": 21,
                                "ptbNeutral": 100,
                                "ptbAll": 12
                            },
                            "playerTookTheField": true,
                            "shirtNum": 1
                        },
                        {
                            "playerFirstName": "Anthony",
                            "playerId": 500067,
                            "playerLastName": "Don",
                            "playerName": "Anthony Don",
                            "playerPosition": "Winger 1",
                            "playerPositionId": 500002,
                            "playerStats": {
                                "allRunMetres": 66,
                                "allRuns": 12,
                                "bombKicksDefused": 1,
                                "errors": 2,
                                "fantasyPointsTotal": 7,
                                "kickReturnMetres": 19,
                                "kickReturns": 4,
                                "kicksDefused": 1,
                                "mins": 80,
                                "missedTackles": 1,
                                "oneOnOneTackles": 1,
                                "supports": 5,
                                "tackles": 6,
                                "evasionRuns": 8,
                                "evasionRunMetres": 47,
                                "ptbFast": 40,
                                "ptbNeutral": 60,
                                "ptbAll": 10
                            },
                            "playerTookTheField": true,
                            "shirtNum": 2
                        },
                        {
                            "playerFirstName": "James",
                            "playerId": 500517,
                            "playerLastName": "Roberts",
                            "playerName": "James Roberts",
                            "playerPosition": "Centre 1",
                            "playerPositionId": 500003,
                            "playerStats": {
                                "allRunMetres": 128,
                                "allRuns": 11,
                                "dummyHalfRuns": 3,
                                "errors": 2,
                                "fantasyPointsTotal": 42,
                                "kicksDefused": 1,
                                "linebreaks": 1,
                                "mins": 80,
                                "missedTackles": 2,
                                "offloads": 1,
                                "oneOnOneTackles": 3,
                                "supports": 5,
                                "tackleBreaks": 5,
                                "tackles": 16,
                                "tryCause": 2,
                                "evasionRuns": 8,
                                "evasionRunMetres": 103,
                                "dummyHalfRunMetres": 25,
                                "ptbNeutral": 100,
                                "ptbAll": 10
                            },
                            "playerTookTheField": true,
                            "shirtNum": 3
                        },
                        {
                            "playerFirstName": "Nene",
                            "playerId": 500206,
                            "playerLastName": "Macdonald",
                            "playerName": "Nene Macdonald",
                            "playerPosition": "Centre 2",
                            "playerPositionId": 500004,
                            "playerStats": {
                                "allRunMetres": 184,
                                "allRuns": 17,
                                "dummyHalfRuns": 1,
                                "fantasyPointsTotal": 45,
                                "hitUps": 2,
                                "ineffectiveTackles": 1,
                                "kickReturns": 1,
                                "kicksDefused": 1,
                                "linebreaks": 1,
                                "mins": 80,
                                "missedTackles": 3,
                                "offloads": 4,
                                "oneOnOneTackles": 1,
                                "penalties": 1,
                                "supports": 12,
                                "tackleBreaks": 5,
                                "tackles": 7,
                                "tryCause": 3,
                                "hitupRunMeters": 57,
                                "evasionRuns": 13,
                                "evasionRunMetres": 116,
                                "dummyHalfRunMetres": 11,
                                "ptbFast": 9.09,
                                "ptbNeutral": 90.91,
                                "ptbAll": 11
                            },
                            "playerTookTheField": true,
                            "shirtNum": 4
                        },
                        {
                            "playerFirstName": "Kevin",
                            "playerId": 500063,
                            "playerLastName": "Gordon",
                            "playerName": "Kevin Gordon",
                            "playerPosition": "Winger 2",
                            "playerPositionId": 500005,
                            "playerStats": {
                                "allRunMetres": 120,
                                "allRuns": 12,
                                "bombKicksDefused": 1,
                                "conversions": 1,
                                "conversionsAttempts": 1,
                                "dummyHalfRuns": 2,
                                "fantasyPointsTotal": 15,
                                "goalConversionRate": 100,
                                "allGoals": 1,
                                "allGoalsAttempted": 1,
                                "kickMetres": 10,
                                "kickReturnMetres": 40,
                                "kickReturns": 3,
                                "kicks": 1,
                                "kicksDefused": 2,
                                "mins": 80,
                                "missedTackles": 2,
                                "offloads": 1,
                                "points": 2,
                                "supports": 10,
                                "tackles": 1,
                                "tryCause": 3,
                                "evasionRuns": 7,
                                "evasionRunMetres": 62,
                                "dummyHalfRunMetres": 18,
                                "ptbFast": 9.09,
                                "ptbNeutral": 90.91,
                                "ptbAll": 11
                            },
                            "playerTookTheField": true,
                            "shirtNum": 5
                        },
                        {
                            "playerFirstName": "Josh",
                            "playerId": 500256,
                            "playerLastName": "Hoffman",
                            "playerName": "Josh Hoffman",
                            "playerPosition": "Five-eighth",
                            "playerPositionId": 500006,
                            "playerStats": {
                                "allRunMetres": 80,
                                "allRuns": 8,
                                "bombKicks": 1,
                                "bombKickMetres": 28,
                                "chargedDown": 1,
                                "dummyHalfRuns": 1,
                                "fantasyPointsTotal": 20,
                                "kickMetres": 69,
                                "kicks": 4,
                                "mins": 80,
                                "missedTackles": 2,
                                "offloads": 1,
                                "oneOnOneTackles": 1,
                                "supports": 13,
                                "tackleBreaks": 1,
                                "tackles": 8,
                                "tryCause": 2,
                                "evasionRuns": 7,
                                "evasionRunMetres": 69,
                                "dummyHalfRunMetres": 11,
                                "ptbFast": 28.57,
                                "ptbNeutral": 71.43,
                                "ptbAll": 7
                            },
                            "playerTookTheField": true,
                            "shirtNum": 6
                        },
                        {
                            "playerFirstName": "Daniel",
                            "playerId": 500015,
                            "playerLastName": "Mortimer",
                            "playerName": "Daniel Mortimer",
                            "playerPosition": "Halfback",
                            "playerPositionId": 500007,
                            "playerStats": {
                                "allRunMetres": 59,
                                "allRuns": 9,
                                "bombKicks": 5,
                                "bombKickMetres": 134,
                                "dummyHalfRuns": 1,
                                "errors": 3,
                                "fantasyPointsTotal": 48,
                                "kickMetres": 259,
                                "kickReturnMetres": 19,
                                "kickReturns": 2,
                                "kicks": 12,
                                "kicksDefused": 1,
                                "linebreakAssists": 1,
                                "mins": 80,
                                "missedTackles": 4,
                                "offloads": 1,
                                "oneOnOneTackles": 1,
                                "penalties": 2,
                                "supports": 11,
                                "tackleBreaks": 5,
                                "tackles": 29,
                                "tryCause": 1,
                                "evasionRuns": 6,
                                "evasionRunMetres": 29,
                                "dummyHalfRunMetres": 11,
                                "ptbNeutral": 100,
                                "ptbAll": 1
                            },
                            "playerTookTheField": true,
                            "shirtNum": 7
                        },
                        {
                            "playerFirstName": "Luke",
                            "playerId": 500070,
                            "playerLastName": "Douglas",
                            "playerName": "Luke Douglas",
                            "playerPosition": "Prop 1",
                            "playerPositionId": 500008,
                            "playerStats": {
                                "allRunMetres": 113,
                                "allRuns": 12,
                                "chargeDowns": 1,
                                "decoys": 4,
                                "errors": 1,
                                "fantasyPointsTotal": 53,
                                "hitUps": 9,
                                "ineffectiveTackles": 1,
                                "kickReturnMetres": 37,
                                "kickReturns": 3,
                                "kicksDefused": 1,
                                "mins": 64,
                                "missedTackles": 3,
                                "offloads": 1,
                                "supports": 7,
                                "tackleBreaks": 1,
                                "tackles": 44,
                                "hitupRunMeters": 76,
                                "ptbFast": 22.22,
                                "ptbNeutral": 77.78,
                                "ptbAll": 9
                            },
                            "playerTookTheField": true,
                            "shirtNum": 8
                        },
                        {
                            "playerFirstName": "Chad",
                            "playerId": 500381,
                            "playerLastName": "Redman",
                            "playerName": "Chad Redman",
                            "playerPosition": "Hooker",
                            "playerPositionId": 500009,
                            "playerStats": {
                                "allRunMetres": 36,
                                "allRuns": 4,
                                "dummyHalfRuns": 3,
                                "fantasyPointsTotal": 30,
                                "hitUps": 1,
                                "kickMetres": 49,
                                "kicks": 1,
                                "mins": 41,
                                "missedTackles": 1,
                                "tackles": 22,
                                "trySaves": 1,
                                "hitupRunMeters": 6,
                                "dummyHalfRunMetres": 30,
                                "ptbFast": 25,
                                "ptbNeutral": 75,
                                "ptbAll": 4
                            },
                            "playerTookTheField": true,
                            "shirtNum": 9
                        },
                        {
                            "playerFirstName": "Nate",
                            "playerId": 500075,
                            "playerLastName": "Myles",
                            "playerName": "Nate Myles",
                            "playerPosition": "Prop 2",
                            "playerPositionId": 500010,
                            "playerStats": {
                                "allRunMetres": 107,
                                "allRuns": 11,
                                "decoys": 2,
                                "errors": 1,
                                "fantasyPointsTotal": 35,
                                "hitUps": 10,
                                "ineffectiveTackles": 1,
                                "interceptedPass": 1,
                                "mins": 40,
                                "missedTackles": 1,
                                "offloads": 1,
                                "penalties": 1,
                                "supports": 1,
                                "tackles": 29,
                                "hitupRunMeters": 99,
                                "evasionRuns": 1,
                                "evasionRunMetres": 8,
                                "ptbFast": 11.11,
                                "ptbNeutral": 88.89,
                                "ptbAll": 9
                            },
                            "playerTookTheField": true,
                            "shirtNum": 10
                        },
                        {
                            "playerFirstName": "Ryan",
                            "playerId": 500072,
                            "playerLastName": "James",
                            "playerName": "Ryan James",
                            "playerPosition": "2nd Row 1",
                            "playerPositionId": 500011,
                            "playerStats": {
                                "allRunMetres": 68,
                                "allRuns": 8,
                                "decoys": 3,
                                "fantasyPointsTotal": 31,
                                "hitUps": 8,
                                "kickMetres": 6,
                                "kicks": 1,
                                "mins": 80,
                                "missedTackles": 1,
                                "oneOnOneTackles": 2,
                                "supports": 4,
                                "tackleBreaks": 1,
                                "tackles": 24,
                                "tryCause": 2,
                                "hitupRunMeters": 68,
                                "ptbFast": 62.5,
                                "ptbNeutral": 37.5,
                                "ptbAll": 8
                            },
                            "playerTookTheField": true,
                            "shirtNum": 11
                        },
                        {
                            "playerFirstName": "Agnatius",
                            "playerId": 501393,
                            "playerLastName": "Paasi",
                            "playerName": "Agnatius Paasi",
                            "playerPosition": "2nd Row 2",
                            "playerPositionId": 500012,
                            "playerStats": {
                                "allRunMetres": 54,
                                "allRuns": 6,
                                "decoys": 1,
                                "fantasyPointsTotal": 29,
                                "hitUps": 6,
                                "ineffectiveTackles": 1,
                                "mins": 55,
                                "missedTackles": 5,
                                "oneOnOneTackles": 1,
                                "supports": 4,
                                "tackleBreaks": 2,
                                "tackles": 28,
                                "hitupRunMeters": 54,
                                "ptbFast": 16.67,
                                "ptbNeutral": 83.33,
                                "ptbAll": 6
                            },
                            "playerTookTheField": true,
                            "shirtNum": 12
                        },
                        {
                            "playerFirstName": "Edward",
                            "playerId": 502632,
                            "playerLastName": "Pettybourne",
                            "playerName": "Edward Pettybourne",
                            "playerPosition": "Lock",
                            "playerPositionId": 500013,
                            "playerStats": {
                                "allRunMetres": 157,
                                "allRuns": 16,
                                "fantasyPointsTotal": 23,
                                "hitUps": 16,
                                "mins": 47,
                                "missedTackles": 2,
                                "penalties": 2,
                                "supports": 3,
                                "tackles": 16,
                                "hitupRunMeters": 157,
                                "ptbFast": 20,
                                "ptbNeutral": 80,
                                "ptbAll": 15
                            },
                            "playerTookTheField": true,
                            "shirtNum": 13
                        },
                        {
                            "playerFirstName": "Dave",
                            "playerId": 500077,
                            "playerLastName": "Taylor",
                            "playerName": "Dave Taylor",
                            "playerPosition": "Interchange",
                            "playerPositionId": 500014,
                            "playerStats": {
                                "allRunMetres": 87,
                                "allRuns": 8,
                                "decoys": 1,
                                "fantasyPointsTotal": 54,
                                "hitUps": 8,
                                "ineffectiveTackles": 1,
                                "linebreakAssists": 1,
                                "linebreaks": 1,
                                "mins": 56,
                                "missedTackles": 4,
                                "offloads": 4,
                                "oneOnOneTackles": 2,
                                "supports": 2,
                                "tackleBreaks": 1,
                                "tackles": 32,
                                "tryAssists": 1,
                                "tryCause": 1,
                                "hitupRunMeters": 87,
                                "ptbFast": 25,
                                "ptbNeutral": 75,
                                "ptbAll": 4
                            },
                            "playerTookTheField": true,
                            "shirtNum": 14
                        },
                        {
                            "playerFirstName": "Lachlan",
                            "playerId": 500219,
                            "playerLastName": "Burr",
                            "playerName": "Lachlan Burr",
                            "playerPosition": "Interchange",
                            "playerPositionId": 500014,
                            "playerStats": {
                                "allRunMetres": 42,
                                "allRuns": 5,
                                "decoys": 1,
                                "errors": 1,
                                "fantasyPointsTotal": 18,
                                "hitUps": 5,
                                "interceptedPass": 1,
                                "mins": 36,
                                "missedTackles": 4,
                                "offloads": 1,
                                "oneOnOneTackles": 1,
                                "penalties": 1,
                                "supports": 2,
                                "tackles": 24,
                                "hitupRunMeters": 42,
                                "ptbNeutral": 100,
                                "ptbAll": 3
                            },
                            "playerTookTheField": true,
                            "shirtNum": 16,
                            "isCaptain": true
                        },
                        {
                            "playerFirstName": "Beau",
                            "playerId": 500071,
                            "playerLastName": "Falloon",
                            "playerName": "Beau Falloon",
                            "playerPosition": "Interchange",
                            "playerPositionId": 500014,
                            "playerStats": {
                                "allRunMetres": 32,
                                "allRuns": 4,
                                "dummyHalfRuns": 2,
                                "fantasyPointsTotal": 34,
                                "hitUps": 2,
                                "mins": 39,
                                "missedTackles": 3,
                                "offloads": 1,
                                "oneOnOneTackles": 4,
                                "supports": 2,
                                "tackleBreaks": 1,
                                "tackles": 32,
                                "tryCause": 1,
                                "hitupRunMeters": 10,
                                "dummyHalfRunMetres": 22,
                                "ptbNeutral": 50,
                                "ptbSlow": 50,
                                "ptbAll": 2
                            },
                            "playerTookTheField": true,
                            "shirtNum": 20
                        },
                        {
                            "playerFirstName": "Nathaniel",
                            "playerId": 501501,
                            "playerLastName": "Peteru",
                            "playerName": "Nathaniel Peteru",
                            "playerPosition": "Interchange",
                            "playerPositionId": 500014,
                            "playerStats": {
                                "allRunMetres": 43,
                                "allRuns": 5,
                                "decoys": 4,
                                "fantasyPointsTotal": 24,
                                "hitUps": 5,
                                "mins": 22,
                                "missedTackles": 1,
                                "offloads": 1,
                                "points": 4,
                                "supports": 2,
                                "tackles": 12,
                                "tries": 1,
                                "tryCause": 1,
                                "hitupRunMeters": 43,
                                "ptbFast": 25,
                                "ptbNeutral": 75,
                                "ptbAll": 4
                            },
                            "playerTookTheField": true,
                            "shirtNum": 22
                        }
                    ]
                },
                "teamName": "Gold Coast Titans",
                "teamNickName": "Titans",
                "teamStats": {
                    "allRunMetres": 1523,
                    "allRuns": 162,
                    "bombKicks": 6,
                    "bombKickMetres": 162,
                    "bombKicksDefused": 2,
                    "chargeDowns": 1,
                    "chargedDown": 1,
                    "completeSets": 28,
                    "completionPercentage": 76,
                    "conversions": 1,
                    "conversionsAttempts": 1,
                    "decoys": 17,
                    "dummyHalfRuns": 16,
                    "errors": 11,
                    "goalConversionRate": 100,
                    "allGoals": 1,
                    "allGoalsAttempted": 1,
                    "hitUps": 72,
                    "incompleteSets": 9,
                    "ineffectiveTackles": 5,
                    "interceptedPass": 2,
                    "kickMetres": 425,
                    "kickReturnMetres": 191,
                    "kickReturns": 20,
                    "kicks": 21,
                    "kicksDefused": 8,
                    "linebreakAssists": 2,
                    "linebreaks": 3,
                    "missedTackles": 40,
                    "offloads": 18,
                    "oneOnOneTackles": 19,
                    "penalties": 8,
                    "points": 6,
                    "pointsConceded": 38,
                    "possession": 52,
                    "scrumWins": 5,
                    "supports": 89,
                    "tackleBreaks": 23,
                    "tackles": 343,
                    "sets": 37,
                    "tries": 1,
                    "triesConceded": 7,
                    "tryAssists": 1,
                    "trySaves": 1,
                    "hitupRunMeters": 698,
                    "evasionRuns": 54,
                    "evasionRunMetres": 485,
                    "dummyHalfRunMetres": 149,
                    "ptbFast": 18,
                    "ptbNeutral": 81,
                    "ptbSlow": 1,
                    "ptbTotal": 126
                }
            },
            {
                "score": {
                    "conversions": 5,
                    "points": 38,
                    "tries": 7
                },
                "team1stHalfScore": 20,
                "team2ndHalfScore": 18,
                "teamAbbr": "MAN",
                "teamFinalScore": 38,
                "teamFullTimeScore": 38,
                "teamHalfTimeScore": 20,
                "teamId": 500002,
                "teamLineup": {
                    "injuriesAndSuspensions": {
                        "injury": [],
                        "suspension": []
                    },
                    "insAndOuts": {
                        "inOut": [
                            {
                                "inOut": "Out",
                                "playerFirstName": "Dunamis",
                                "playerId": "500957",
                                "playerLastName": "Lui",
                                "playerName": "Dunamis Lui"
                            },
                            {
                                "inOut": "In",
                                "playerFirstName": "Justin",
                                "playerId": "500029",
                                "playerLastName": "Horo",
                                "playerName": "Justin Horo"
                            }
                        ]
                    },
                    "teamPlayer": [
                        {
                            "playerFirstName": "Brett",
                            "playerId": 500018,
                            "playerLastName": "Stewart",
                            "playerName": "Brett Stewart",
                            "playerPosition": "Fullback",
                            "playerPositionId": 500001,
                            "playerStats": {
                                "allRunMetres": 82,
                                "allRuns": 8,
                                "bombKicksDefused": 4,
                                "decoys": 2,
                                "errors": 1,
                                "fantasyPointsTotal": 66,
                                "ineffectiveTackles": 1,
                                "kickReturnMetres": 8,
                                "kickReturns": 3,
                                "kicks": 1,
                                "kicksDefused": 7,
                                "linebreakAssists": 1,
                                "linebreaks": 2,
                                "mins": 80,
                                "missedTackles": 1,
                                "points": 4,
                                "supports": 7,
                                "tackleBreaks": 8,
                                "tackles": 3,
                                "tries": 1,
                                "tryAssists": 2,
                                "tryCause": 1,
                                "evasionRuns": 5,
                                "evasionRunMetres": 74,
                                "ptbNeutral": 100,
                                "ptbAll": 6
                            },
                            "playerTookTheField": true,
                            "shirtNum": 1
                        },
                        {
                            "playerFirstName": "Jorge",
                            "playerId": 500019,
                            "playerLastName": "Taufua",
                            "playerName": "Jorge Taufua",
                            "playerPosition": "Winger 1",
                            "playerPositionId": 500002,
                            "playerStats": {
                                "allRunMetres": 135,
                                "allRuns": 15,
                                "bombKicksDefused": 1,
                                "fantasyPointsTotal": 57,
                                "kickReturnMetres": 25,
                                "kickReturns": 4,
                                "kicksDefused": 3,
                                "kicksNotDefused": 1,
                                "linebreaks": 1,
                                "mins": 80,
                                "missedTackles": 1,
                                "oneOnOneTackles": 1,
                                "points": 8,
                                "supports": 8,
                                "tackleBreaks": 7,
                                "tackles": 2,
                                "tries": 2,
                                "evasionRuns": 11,
                                "evasionRunMetres": 110,
                                "ptbFast": 23.08,
                                "ptbNeutral": 76.92,
                                "ptbAll": 13
                            },
                            "playerTookTheField": true,
                            "shirtNum": 2
                        },
                        {
                            "playerFirstName": "Jamie",
                            "playerId": 500020,
                            "playerLastName": "Lyon",
                            "playerName": "Jamie Lyon",
                            "playerPosition": "Centre 1",
                            "playerPositionId": 500003,
                            "playerStats": {
                                "allRunMetres": 112,
                                "allRuns": 9,
                                "conversions": 5,
                                "conversionsAttempts": 7,
                                "conversionsMissed": 2,
                                "decoys": 1,
                                "fantasyPointsTotal": 71,
                                "goalConversionRate": 71.429,
                                "allGoals": 5,
                                "allGoalsMissed": 2,
                                "allGoalsAttempted": 7,
                                "ineffectiveTackles": 1,
                                "kickMetres": 32,
                                "kicks": 1,
                                "linebreakAssists": 2,
                                "linebreaks": 1,
                                "mins": 80,
                                "missedTackles": 2,
                                "offloads": 2,
                                "penalties": 1,
                                "points": 10,
                                "supports": 8,
                                "tackleBreaks": 3,
                                "tackles": 24,
                                "tryAssists": 2,
                                "evasionRuns": 9,
                                "evasionRunMetres": 112,
                                "ptbFast": 16.67,
                                "ptbNeutral": 83.33,
                                "ptbAll": 6
                            },
                            "playerTookTheField": true,
                            "shirtNum": 3
                        },
                        {
                            "playerFirstName": "Steve",
                            "playerId": 500021,
                            "playerLastName": "Matai",
                            "playerName": "Steve Matai",
                            "playerPosition": "Centre 2",
                            "playerPositionId": 500004,
                            "playerStats": {
                                "allRunMetres": 149,
                                "allRuns": 15,
                                "decoys": 1,
                                "dummyHalfRuns": 1,
                                "errors": 1,
                                "fantasyPointsTotal": 18,
                                "kicksNotDefused": 1,
                                "linebreaks": 1,
                                "mins": 80,
                                "missedTackles": 3,
                                "supports": 10,
                                "tackleBreaks": 2,
                                "tackles": 2,
                                "evasionRuns": 14,
                                "evasionRunMetres": 139,
                                "dummyHalfRunMetres": 10,
                                "ptbFast": 7.14,
                                "ptbNeutral": 85.71,
                                "ptbSlow": 7.14,
                                "ptbAll": 14
                            },
                            "playerTookTheField": true,
                            "shirtNum": 4
                        },
                        {
                            "playerFirstName": "Tom",
                            "playerId": 501505,
                            "playerLastName": "Trbojevic",
                            "playerName": "Tom Trbojevic",
                            "playerPosition": "Winger 2",
                            "playerPositionId": 500005,
                            "playerStats": {
                                "allRunMetres": 155,
                                "allRuns": 14,
                                "bombKicksNotDefused": 1,
                                "fantasyPointsTotal": 43,
                                "ineffectiveTackles": 1,
                                "kickReturnMetres": 48,
                                "kickReturns": 3,
                                "kicksDefused": 1,
                                "kicksNotDefused": 1,
                                "linebreaks": 1,
                                "mins": 80,
                                "missedTackles": 1,
                                "oneOnOneTackles": 1,
                                "points": 8,
                                "supports": 8,
                                "tackleBreaks": 2,
                                "tackles": 3,
                                "tries": 2,
                                "evasionRuns": 11,
                                "evasionRunMetres": 107,
                                "ptbFast": 54.55,
                                "ptbNeutral": 45.45,
                                "ptbAll": 11
                            },
                            "playerTookTheField": true,
                            "shirtNum": 5
                        },
                        {
                            "playerFirstName": "Kieran",
                            "playerId": 500023,
                            "playerLastName": "Foran",
                            "playerName": "Kieran Foran",
                            "playerPosition": "Five-eighth",
                            "playerPositionId": 500006,
                            "playerStats": {
                                "allRunMetres": 63,
                                "allRuns": 8,
                                "bombKicks": 2,
                                "bombKickMetres": 41,
                                "chargedDown": 1,
                                "dummyHalfRuns": 2,
                                "errors": 2,
                                "fantasyPointsTotal": 34,
                                "kickMetres": 174,
                                "kicks": 8,
                                "linebreakAssists": 1,
                                "mins": 70,
                                "missedTackles": 1,
                                "oneOnOneTackles": 1,
                                "penalties": 1,
                                "points": 4,
                                "supports": 8,
                                "tackleBreaks": 3,
                                "tackles": 9,
                                "tries": 1,
                                "evasionRuns": 6,
                                "evasionRunMetres": 47,
                                "dummyHalfRunMetres": 16,
                                "ptbNeutral": 100,
                                "ptbAll": 4
                            },
                            "playerTookTheField": true,
                            "shirtNum": 6
                        },
                        {
                            "playerFirstName": "Daly",
                            "playerId": 500024,
                            "playerLastName": "Cherry-Evans",
                            "playerName": "Daly Cherry-Evans",
                            "playerPosition": "Halfback",
                            "playerPositionId": 500007,
                            "playerStats": {
                                "allRunMetres": 62,
                                "allRuns": 5,
                                "dummyHalfRuns": 1,
                                "fantasyPointsTotal": 54,
                                "ineffectiveTackles": 2,
                                "kickMetres": 268,
                                "kicks": 8,
                                "lineDropouts": 3,
                                "linebreakAssists": 1,
                                "mins": 80,
                                "oneOnOneTackles": 2,
                                "penalties": 1,
                                "supports": 17,
                                "tackleBreaks": 1,
                                "tackles": 27,
                                "tryAssists": 1,
                                "evasionRuns": 4,
                                "evasionRunMetres": 52,
                                "dummyHalfRunMetres": 10,
                                "ptbNeutral": 75,
                                "ptbSlow": 25,
                                "ptbAll": 4
                            },
                            "playerTookTheField": true,
                            "shirtNum": 7
                        },
                        {
                            "playerFirstName": "Jake",
                            "playerId": 500751,
                            "playerLastName": "Trbojevic",
                            "playerName": "Jake Trbojevic",
                            "playerPosition": "Prop 1",
                            "playerPositionId": 500008,
                            "playerStats": {
                                "allRunMetres": 129,
                                "allRuns": 15,
                                "decoys": 4,
                                "fantasyPointsTotal": 39,
                                "hitUps": 14,
                                "ineffectiveTackles": 3,
                                "mins": 48,
                                "missedTackles": 2,
                                "offloads": 1,
                                "oneOnOneTackles": 3,
                                "supports": 7,
                                "tackles": 29,
                                "hitupRunMeters": 124,
                                "evasionRuns": 1,
                                "evasionRunMetres": 5,
                                "ptbFast": 7.69,
                                "ptbNeutral": 84.62,
                                "ptbSlow": 7.69,
                                "ptbAll": 13
                            },
                            "playerTookTheField": true,
                            "shirtNum": 8
                        },
                        {
                            "playerFirstName": "Matt",
                            "playerId": 500026,
                            "playerLastName": "Ballin",
                            "playerName": "Matt Ballin",
                            "playerPosition": "Hooker",
                            "playerPositionId": 500009,
                            "playerStats": {
                                "allRunMetres": 25,
                                "allRuns": 4,
                                "chargeDowns": 1,
                                "dummyHalfRuns": 3,
                                "fantasyPointsTotal": 41,
                                "hitUps": 1,
                                "ineffectiveTackles": 2,
                                "intercepts": 1,
                                "kickMetres": 60,
                                "kicks": 1,
                                "linebreakAssists": 1,
                                "mins": 55,
                                "missedTackles": 2,
                                "oneOnOneTackles": 1,
                                "penalties": 1,
                                "supports": 1,
                                "tackles": 35,
                                "tryAssists": 1,
                                "hitupRunMeters": 10,
                                "dummyHalfRunMetres": 15,
                                "ptbFast": 25,
                                "ptbNeutral": 75,
                                "ptbAll": 4
                            },
                            "playerTookTheField": true,
                            "shirtNum": 9
                        },
                        {
                            "playerFirstName": "Willie",
                            "playerId": 500049,
                            "playerLastName": "Mason",
                            "playerName": "Willie Mason",
                            "playerPosition": "Prop 2",
                            "playerPositionId": 500010,
                            "playerStats": {
                                "allRunMetres": 111,
                                "allRuns": 13,
                                "decoys": 6,
                                "fantasyPointsTotal": 57,
                                "hitUps": 11,
                                "kickReturnMetres": 10,
                                "kickReturns": 1,
                                "linebreaks": 1,
                                "mins": 52,
                                "missedTackles": 1,
                                "oneOnOneTackles": 3,
                                "penalties": 1,
                                "points": 4,
                                "supports": 2,
                                "tackleBreaks": 5,
                                "tackles": 23,
                                "tries": 1,
                                "hitupRunMeters": 99,
                                "evasionRuns": 1,
                                "evasionRunMetres": 2,
                                "ptbFast": 9.09,
                                "ptbNeutral": 90.91,
                                "ptbAll": 11
                            },
                            "playerTookTheField": true,
                            "shirtNum": 10
                        },
                        {
                            "playerFirstName": "Feleti",
                            "playerId": 500714,
                            "playerLastName": "Mateo",
                            "playerName": "Feleti Mateo",
                            "playerPosition": "2nd Row 1",
                            "playerPositionId": 500011,
                            "playerStats": {
                                "allRunMetres": 141,
                                "allRuns": 14,
                                "decoys": 4,
                                "errors": 2,
                                "fantasyPointsTotal": 33,
                                "hitUps": 12,
                                "ineffectiveTackles": 4,
                                "kickMetres": 34,
                                "kicks": 1,
                                "linebreakAssists": 1,
                                "mins": 80,
                                "missedTackles": 1,
                                "oneOnOneTackles": 1,
                                "supports": 11,
                                "tackleBreaks": 3,
                                "tackles": 13,
                                "tryCause": 1,
                                "hitupRunMeters": 130,
                                "evasionRuns": 2,
                                "evasionRunMetres": 11,
                                "ptbFast": 11.11,
                                "ptbNeutral": 88.89,
                                "ptbAll": 9
                            },
                            "playerTookTheField": true,
                            "shirtNum": 11
                        },
                        {
                            "playerFirstName": "Tom",
                            "playerId": 500033,
                            "playerLastName": "Symonds",
                            "playerName": "Tom Symonds",
                            "playerPosition": "2nd Row 2",
                            "playerPositionId": 500012,
                            "playerStats": {
                                "allRunMetres": 136,
                                "allRuns": 13,
                                "decoys": 4,
                                "dummyHalfRuns": 1,
                                "fantasyPointsTotal": 65,
                                "hitUps": 12,
                                "ineffectiveTackles": 3,
                                "kicksDefused": 1,
                                "linebreakAssists": 1,
                                "mins": 80,
                                "penalties": 1,
                                "supports": 7,
                                "tackleBreaks": 4,
                                "tackles": 39,
                                "hitupRunMeters": 125,
                                "dummyHalfRunMetres": 11,
                                "ptbFast": 30.77,
                                "ptbNeutral": 61.54,
                                "ptbSlow": 7.69,
                                "ptbAll": 13
                            },
                            "playerTookTheField": true,
                            "shirtNum": 12
                        },
                        {
                            "playerFirstName": "Ligi",
                            "playerId": 500582,
                            "playerLastName": "Sao",
                            "playerName": "Ligi Sao",
                            "playerPosition": "Lock",
                            "playerPositionId": 500013,
                            "playerStats": {
                                "allRunMetres": 92,
                                "allRuns": 8,
                                "decoys": 7,
                                "fantasyPointsTotal": 33,
                                "hitUps": 6,
                                "kickReturnMetres": 40,
                                "kickReturns": 2,
                                "mins": 34,
                                "missedTackles": 1,
                                "supports": 8,
                                "tackleBreaks": 1,
                                "tackles": 23,
                                "hitupRunMeters": 52,
                                "ptbFast": 37.5,
                                "ptbNeutral": 62.5,
                                "ptbAll": 8
                            },
                            "playerTookTheField": true,
                            "shirtNum": 17
                        },
                        {
                            "playerFirstName": "Luke",
                            "playerId": 500103,
                            "playerLastName": "Burgess",
                            "playerName": "Luke Burgess",
                            "playerPosition": "Interchange",
                            "playerPositionId": 500014,
                            "playerStats": {
                                "allRunMetres": 123,
                                "allRuns": 12,
                                "decoys": 3,
                                "fantasyPointsTotal": 28,
                                "hitUps": 9,
                                "ineffectiveTackles": 2,
                                "kickReturnMetres": 32,
                                "kickReturns": 2,
                                "mins": 34,
                                "missedTackles": 1,
                                "supports": 7,
                                "tackles": 18,
                                "hitupRunMeters": 82,
                                "evasionRuns": 1,
                                "evasionRunMetres": 9,
                                "ptbFast": 8.33,
                                "ptbNeutral": 91.67,
                                "ptbAll": 12
                            },
                            "playerTookTheField": true,
                            "shirtNum": 14
                        },
                        {
                            "playerFirstName": "Josh",
                            "playerId": 501261,
                            "playerLastName": "Starling",
                            "playerName": "Josh Starling",
                            "playerPosition": "Interchange",
                            "playerPositionId": 500014,
                            "playerStats": {
                                "allRunMetres": 102,
                                "allRuns": 11,
                                "decoys": 4,
                                "fantasyPointsTotal": 22,
                                "hitUps": 10,
                                "ineffectiveTackles": 4,
                                "kickReturnMetres": 1,
                                "kickReturns": 1,
                                "mins": 28,
                                "oneOnOneTackles": 1,
                                "supports": 5,
                                "tackles": 12,
                                "hitupRunMeters": 101,
                                "ptbNeutral": 100,
                                "ptbAll": 11
                            },
                            "playerTookTheField": true,
                            "shirtNum": 15
                        },
                        {
                            "playerFirstName": "Justin",
                            "playerId": 500029,
                            "playerLastName": "Horo",
                            "playerName": "Justin Horo",
                            "playerPosition": "Interchange",
                            "playerPositionId": 500014,
                            "playerStats": {
                                "allRunMetres": 117,
                                "allRuns": 11,
                                "decoys": 7,
                                "fantasyPointsTotal": 31,
                                "hitUps": 8,
                                "ineffectiveTackles": 3,
                                "kickReturnMetres": 21,
                                "kickReturns": 2,
                                "linebreaks": 1,
                                "mins": 54,
                                "missedTackles": 4,
                                "supports": 10,
                                "tackleBreaks": 1,
                                "tackles": 21,
                                "tryCause": 1,
                                "hitupRunMeters": 85,
                                "evasionRuns": 1,
                                "evasionRunMetres": 11,
                                "ptbFast": 25,
                                "ptbNeutral": 75,
                                "ptbAll": 8
                            },
                            "playerTookTheField": true,
                            "shirtNum": 16
                        },
                        {
                            "playerFirstName": "Jayden",
                            "playerId": 500982,
                            "playerLastName": "Hodges",
                            "playerName": "Jayden Hodges",
                            "playerPosition": "Interchange",
                            "playerPositionId": 500014,
                            "playerStats": {
                                "allRunMetres": 48,
                                "allRuns": 4,
                                "dummyHalfRuns": 3,
                                "fantasyPointsTotal": 14,
                                "hitUps": 1,
                                "ineffectiveTackles": 1,
                                "intercepts": 1,
                                "mins": 25,
                                "missedTackles": 2,
                                "tackles": 14,
                                "hitupRunMeters": 6,
                                "dummyHalfRunMetres": 42,
                                "ptbFast": 25,
                                "ptbNeutral": 75,
                                "ptbAll": 4
                            },
                            "playerTookTheField": true,
                            "shirtNum": 19
                        }
                    ]
                },
                "teamName": "Manly-Warringah Sea Eagles",
                "teamNickName": "Sea Eagles",
                "teamStats": {
                    "allRunMetres": 1782,
                    "allRuns": 179,
                    "bombKicks": 2,
                    "bombKickMetres": 41,
                    "bombKicksDefused": 5,
                    "bombKicksNotDefused": 1,
                    "chargeDowns": 1,
                    "chargedDown": 1,
                    "completeSets": 37,
                    "completionPercentage": 86,
                    "conversions": 5,
                    "conversionsAttempts": 7,
                    "conversionsMissed": 2,
                    "decoys": 43,
                    "dummyHalfRuns": 11,
                    "errors": 6,
                    "goalConversionRate": 71.429,
                    "allGoals": 5,
                    "allGoalsAttempted": 7,
                    "allGoalsMissed": 2,
                    "hitUps": 84,
                    "incompleteSets": 6,
                    "ineffectiveTackles": 27,
                    "intercepts": 2,
                    "kickMetres": 567,
                    "kickReturnMetres": 186,
                    "kickReturns": 18,
                    "kicks": 20,
                    "kicksDefused": 12,
                    "kicksNotDefused": 3,
                    "lineDropouts": 3,
                    "linebreakAssists": 8,
                    "linebreaks": 8,
                    "missedTackles": 23,
                    "offloads": 3,
                    "oneOnOneTackles": 14,
                    "penalties": 6,
                    "points": 38,
                    "pointsConceded": 6,
                    "possession": 48,
                    "scrumWins": 4,
                    "supports": 124,
                    "tackleBreaks": 40,
                    "tackles": 297,
                    "sets": 43,
                    "tries": 7,
                    "triesConceded": 1,
                    "tryAssists": 6,
                    "hitupRunMeters": 813,
                    "evasionRuns": 66,
                    "evasionRunMetres": 679,
                    "dummyHalfRunMetres": 104,
                    "ptbFast": 17,
                    "ptbNeutral": 80,
                    "ptbSlow": 3,
                    "ptbTotal": 151
                }
            }
        ]
    }
}