{
    "vod": [
        {
            "id": "AybGFhdzqs7BFhT6qffpAtx64Sz9OOCh",
            "contentId": 785081,
            "title": "Rd 25: Raiders v Panthers (1)",
            "description": "1st half replay of the match between the Raiders & Panthers",
            "publishDate": "2015-09-01T09:00:00+10:00",
            "publisher": "NRL Chief",
            "thumbnailUrl": "http://bigpondvideo.com/Web/Images/Content/20150831210302a_89x50.jpg",
            "largeThumbnailUrl": "http://bigpondvideo.com/Web/Images/Content/20150831210302a_326x184.jpg",
            "programType": "Matches",
            "programCategory": "Replay: 1st Half",
            "priority": null,
            "lastUpdateDate": "2015-08-31T23:18:41+10:00",
            "isPremium": true,
            "club": [
                500013,
                500014
            ]
        },
        {
            "id": "1mbWFhdzrGkCqkBzO1XhHjvoyRmME2zx",
            "contentId": 785082,
            "title": "Rd 25: Raiders v Panthers (2)",
            "description": "2nd half replay of the match between the Raiders & Panthers",
            "publishDate": "2015-09-01T09:00:00+10:00",
            "publisher": "NRL Chief",
            "thumbnailUrl": "http://bigpondvideo.com/Web/Images/Content/20150831210331a_89x50.jpg",
            "largeThumbnailUrl": "http://bigpondvideo.com/Web/Images/Content/20150831210331a_326x184.jpg",
            "programType": "Matches",
            "programCategory": "Replay: 2nd Half",
            "priority": null,
            "lastUpdateDate": "2015-08-31T23:18:41+10:00",
            "isPremium": true,
            "club": [
                500013,
                500014
            ]
        },
        {
            "id": "hoeThhdzoCnPgzhiSLAWNMXh1T9APqZb",
            "contentId": 785015,
            "title": "Rd 25: Raiders v Panthers (Hls)",
            "description": "Highlights of the match between the Raiders & Panthers from GIO Stadium",
            "publishDate": "2015-08-31T21:08:00+10:00",
            "publisher": "NRL Chief",
            "thumbnailUrl": "http://bigpondvideo.com/Web/Images/Content/20150831210858a_89x50.jpg",
            "largeThumbnailUrl": "http://bigpondvideo.com/Web/Images/Content/20150831210858a_326x184.jpg",
            "programType": "Highlights",
            "programCategory": "Match",
            "priority": null,
            "lastUpdateDate": "2015-08-31T21:12:58+10:00",
            "isPremium": false,
            "club": [
                500013,
                500014
            ]
        },
        {
            "id": "5yZDlhdzpxBAQOv5OoEt9rG1AJkbQrjl",
            "contentId": 785049,
            "title": "Rd 25 Press Conference: Raiders",
            "description": "The Raiders coach faces the media following the match",
            "publishDate": "2015-08-31T21:36:00+10:00",
            "publisher": "NRL Chief",
            "thumbnailUrl": "http://bigpondvideo.com/Web/Images/Content/20150831212421a_89x50.jpg",
            "largeThumbnailUrl": "http://bigpondvideo.com/Web/Images/Content/20150831212421a_326x184.jpg",
            "programType": "Press Conference",
            "programCategory": null,
            "priority": null,
            "lastUpdateDate": "2015-08-31T21:47:19+10:00",
            "isPremium": false,
            "club": [
                500013,
                500014
            ]
        },
        {
            "id": "U2YTlhdzqac0JVgTN5j4fhXseKG_CBLb",
            "contentId": 785051,
            "title": "Rd 25 Press Conference: Panthers",
            "description": "The Panthers coach faces the media following the match",
            "publishDate": "2015-08-31T21:30:00+10:00",
            "publisher": "NRL Chief",
            "thumbnailUrl": "http://bigpondvideo.com/Web/Images/Content/20150831212431a_89x50.jpg",
            "largeThumbnailUrl": "http://bigpondvideo.com/Web/Images/Content/20150831212431a_326x184.jpg",
            "programType": "Press Conference",
            "programCategory": null,
            "priority": null,
            "lastUpdateDate": "2015-08-31T21:38:06+10:00",
            "isPremium": false,
            "club": [
                500013,
                500014
            ]
        },
        {
            "id": "RpdDhhdzpKtFWo0jlIu0ICov-bsSXao-",
            "contentId": 786092,
            "title": "Rd 25: GOAL Apisai Koroisau (77th min)",
            "description": "Conversion sees the Panthers trail 34-18",
            "publishDate": "2015-08-31T20:50:00+10:00",
            "publisher": "NRL Chief",
            "thumbnailUrl": "http://bigpondvideo.com/Web/Images/Content/20150831204918a_89x50.jpg",
            "largeThumbnailUrl": "http://bigpondvideo.com/Web/Images/Content/20150831204918a_326x184.jpg",
            "programType": "Instant Replay",
            "programCategory": "Score",
            "priority": null,
            "lastUpdateDate": "2015-08-31T20:53:53+10:00",
            "isPremium": true,
            "club": [
                500013,
                500014
            ]
        },
        {
            "id": "hndDhhdzoDdE9ruSC2aeYnD3d9jcyAA-",
            "contentId": 786091,
            "title": "Rd 25: TRY Will Smith (76th min)",
            "description": "The Panthers get a late one through a solo special to Will Smith",
            "publishDate": "2015-08-31T20:49:00+10:00",
            "publisher": "NRL Chief",
            "thumbnailUrl": "http://bigpondvideo.com/Web/Images/Content/20150831204854a_89x50.jpg",
            "largeThumbnailUrl": "http://bigpondvideo.com/Web/Images/Content/20150831204854a_326x184.jpg",
            "programType": "Instant Replay",
            "programCategory": "Score",
            "priority": 1,
            "lastUpdateDate": "2015-08-31T21:03:55+10:00",
            "isPremium": true,
            "club": [
                500013,
                500014
            ]
        },
        {
            "id": "FhdDhhdzoHnnOubq1b-ZCAAsmFw0ZW3o",
            "contentId": 786089,
            "title": "Rd 25: GOAL Jarrod Croker (74th min)",
            "description": "Conversion sees the Raiders lead 34-12",
            "publishDate": "2015-08-31T20:46:00+10:00",
            "publisher": "NRL Chief",
            "thumbnailUrl": "http://bigpondvideo.com/Web/Images/Content/20150831204843a_89x50.jpg",
            "largeThumbnailUrl": "http://bigpondvideo.com/Web/Images/Content/20150831204843a_326x184.jpg",
            "programType": "Instant Replay",
            "programCategory": "Score",
            "priority": 2,
            "lastUpdateDate": "2015-08-31T21:03:55+10:00",
            "isPremium": true,
            "club": [
                500013,
                500014
            ]
        },
        {
            "id": "Y3czhhdzp_FJd0bvAjnaQ-TfJnP44mxr",
            "contentId": 786087,
            "title": "Rd 25: TRY Sisa Waqa (72nd min)",
            "description": "The Raiders are in again this time through Sisa Waqa",
            "publishDate": "2015-08-31T20:45:10+10:00",
            "publisher": "NRL Chief",
            "thumbnailUrl": "http://bigpondvideo.com/Web/Images/Content/20150831204550a_89x50.jpg",
            "largeThumbnailUrl": "http://bigpondvideo.com/Web/Images/Content/20150831204550a_326x184.jpg",
            "programType": "Instant Replay",
            "programCategory": "Score",
            "priority": 3,
            "lastUpdateDate": "2015-08-31T21:02:55+10:00",
            "isPremium": true,
            "club": [
                500013,
                500014
            ]
        },
        {
            "id": "J3cjhhdzoNvCDBWBmmP3CEeFXwQ0OOsu",
            "contentId": 786085,
            "title": "Rd 25: GOAL Apisai Koroisau (66th min)",
            "description": "Conversion sees the Panthers trail 28-12",
            "publishDate": "2015-08-31T20:35:00+10:00",
            "publisher": "NRL Chief",
            "thumbnailUrl": "http://bigpondvideo.com/Web/Images/Content/20150831204330a_89x50.jpg",
            "largeThumbnailUrl": "http://bigpondvideo.com/Web/Images/Content/20150831204330a_326x184.jpg",
            "programType": "Instant Replay",
            "programCategory": "Score",
            "priority": null,
            "lastUpdateDate": "2015-08-31T20:48:53+10:00",
            "isPremium": true,
            "club": [
                500013,
                500014
            ]
        },
        {
            "id": "5zcjhhdzp7FBUYvvIMJG9gBfxWM11DIZ",
            "contentId": 786084,
            "title": "Rd 25: TRY Lewis Brown (65th min)",
            "description": "Panthers strike back through a try to Lewis Brown",
            "publishDate": "2015-08-31T20:34:00+10:00",
            "publisher": "NRL Chief",
            "thumbnailUrl": "http://bigpondvideo.com/Web/Images/Content/20150831204316a_89x50.jpg",
            "largeThumbnailUrl": "http://bigpondvideo.com/Web/Images/Content/20150831204316a_326x184.jpg",
            "programType": "Instant Replay",
            "programCategory": "Score",
            "priority": 4,
            "lastUpdateDate": "2015-08-31T21:02:55+10:00",
            "isPremium": true,
            "club": [
                500013,
                500014
            ]
        },
        {
            "id": "lqcThhdzpjFnjuxOnbGSqkhxLWglo9HK",
            "contentId": 786083,
            "title": "Rd 25: GOAL Jarrod Croker (62nd min)",
            "description": "Conversion takes Canberra out to a 28-6 lead",
            "publishDate": "2015-08-31T20:33:00+10:00",
            "publisher": "NRL Chief",
            "thumbnailUrl": "http://bigpondvideo.com/Web/Images/Content/20150831204017a_89x50.jpg",
            "largeThumbnailUrl": "http://bigpondvideo.com/Web/Images/Content/20150831204017a_326x184.jpg",
            "programType": "Instant Replay",
            "programCategory": "Score",
            "priority": null,
            "lastUpdateDate": "2015-08-31T20:43:48+10:00",
            "isPremium": true,
            "club": [
                500013,
                500014
            ]
        },
        {
            "id": "RscThhdzq2wijvN0vJi81qOH2Uo9gCiO",
            "contentId": 786082,
            "title": "Rd 25: TRY Kurt Baptiste (61st min)",
            "description": "Raiders extend their lead as Kurt Baptiste crosses for his 2nd try for the year",
            "publishDate": "2015-08-31T20:32:00+10:00",
            "publisher": "NRL Chief",
            "thumbnailUrl": "http://bigpondvideo.com/Web/Images/Content/20150831204001a_89x50.jpg",
            "largeThumbnailUrl": "http://bigpondvideo.com/Web/Images/Content/20150831204001a_326x184.jpg",
            "programType": "Instant Replay",
            "programCategory": "Score",
            "priority": 5,
            "lastUpdateDate": "2015-08-31T21:01:55+10:00",
            "isPremium": true,
            "club": [
                500013,
                500014
            ]
        },
        {
            "id": "k2ZjhhdzpECbtBLGJYVhFnjcUHDCI7f-",
            "contentId": 786080,
            "title": "Rd 25: GOAL Jamie Soward (33rd min)",
            "description": "Conversion sees the Panthers trail 22-6",
            "publishDate": "2015-08-31T19:40:00+10:00",
            "publisher": "NRL Chief",
            "thumbnailUrl": "http://bigpondvideo.com/Web/Images/Content/20150831194101a_89x50.jpg",
            "largeThumbnailUrl": "http://bigpondvideo.com/Web/Images/Content/20150831194101a_326x184.jpg",
            "programType": "Instant Replay",
            "programCategory": "Score",
            "priority": null,
            "lastUpdateDate": "2015-08-31T20:09:40+10:00",
            "isPremium": true,
            "club": [
                500013,
                500014
            ]
        },
        {
            "id": "dwZThhdzrSBiD_lekwCW8YHhD6kvptVe",
            "contentId": 786079,
            "title": "Rd 25: TRY James Segeyaro (33rd min)",
            "description": "Panthers open their scoring in this match through a try to James Segeyaro",
            "publishDate": "2015-08-31T19:39:00+10:00",
            "publisher": "NRL Chief",
            "thumbnailUrl": "http://bigpondvideo.com/Web/Images/Content/20150831193958a_89x50.jpg",
            "largeThumbnailUrl": "http://bigpondvideo.com/Web/Images/Content/20150831193958a_326x184.jpg",
            "programType": "Instant Replay",
            "programCategory": "Score",
            "priority": 6,
            "lastUpdateDate": "2015-08-31T21:01:54+10:00",
            "isPremium": true,
            "club": [
                500013,
                500014
            ]
        },
        {
            "id": "luZThhdzo7t7_z6iGnN4RqaTy0HqbsBV",
            "contentId": 786078,
            "title": "Rd 25: GOAL Jarrod Croker (28th min)",
            "description": "Conversion takes the Raiders out to a 22 point lead",
            "publishDate": "2015-08-31T19:34:00+10:00",
            "publisher": "NRL Chief",
            "thumbnailUrl": "http://bigpondvideo.com/Web/Images/Content/20150831193534a_89x50.jpg",
            "largeThumbnailUrl": "http://bigpondvideo.com/Web/Images/Content/20150831193534a_326x184.jpg",
            "programType": "Instant Replay",
            "programCategory": "Score",
            "priority": null,
            "lastUpdateDate": "2015-08-31T20:08:43+10:00",
            "isPremium": true,
            "club": [
                500013,
                500014
            ]
        },
        {
            "id": "ZoZThhdzqUlAKzS0FcvlPyHlezcu8L4_",
            "contentId": 786077,
            "title": "Rd 25: TRY Shaun Fensom (27th min)",
            "description": "Raiders are in for their 4th try for the night this time through Shaun Fensom",
            "publishDate": "2015-08-31T19:33:00+10:00",
            "publisher": "NRL Chief",
            "thumbnailUrl": "http://bigpondvideo.com/Web/Images/Content/20150831193350a_89x50.jpg",
            "largeThumbnailUrl": "http://bigpondvideo.com/Web/Images/Content/20150831193350a_326x184.jpg",
            "programType": "Instant Replay",
            "programCategory": "Score",
            "priority": 7,
            "lastUpdateDate": "2015-08-31T21:01:54+10:00",
            "isPremium": true,
            "club": [
                500013,
                500014
            ]
        },
        {
            "id": "piZThhdzrGQGHQ7CBdKgYD-4_kLyDO4e",
            "contentId": 786076,
            "title": "Rd 25: GOAL Jarrod Croker (23rd min)",
            "description": "Conversion sees the Raiders lead 16-0",
            "publishDate": "2015-08-31T19:26:00+10:00",
            "publisher": "NRL Chief",
            "thumbnailUrl": "http://bigpondvideo.com/Web/Images/Content/20150831193241a_89x50.jpg",
            "largeThumbnailUrl": "http://bigpondvideo.com/Web/Images/Content/20150831193241a_326x184.jpg",
            "programType": "Instant Replay",
            "programCategory": "Score",
            "priority": null,
            "lastUpdateDate": "2015-08-31T20:07:39+10:00",
            "isPremium": true,
            "club": [
                500013,
                500014
            ]
        },
        {
            "id": "h5ZDhhdzpjhGhXqpU9ZWZIZ4ugwJd-1c",
            "contentId": 786075,
            "title": "Rd 25: TRY Jarrad Kennedy (21st min)",
            "description": "Left side raid sees Jarrad Kennedy power over for the Raiders",
            "publishDate": "2015-08-31T19:25:00+10:00",
            "publisher": "NRL Chief",
            "thumbnailUrl": "http://bigpondvideo.com/Web/Images/Content/20150831192554a_89x50.jpg",
            "largeThumbnailUrl": "http://bigpondvideo.com/Web/Images/Content/20150831192554a_326x184.jpg",
            "programType": "Instant Replay",
            "programCategory": "Score",
            "priority": 8,
            "lastUpdateDate": "2015-08-31T21:00:54+10:00",
            "isPremium": true,
            "club": [
                500013,
                500014
            ]
        },
        {
            "id": "N1ZDhhdzqpm8IGczLaPpuYEsS_VbQENU",
            "contentId": 786074,
            "title": "Rd 25: GOAL Jarrod Croker (17th min)",
            "description": "Conversion sees the Raiders lead 10-0",
            "publishDate": "2015-08-31T19:20:01+10:00",
            "publisher": "NRL Chief",
            "thumbnailUrl": "http://bigpondvideo.com/Web/Images/Content/20150831192136a_89x50.jpg",
            "largeThumbnailUrl": "http://bigpondvideo.com/Web/Images/Content/20150831192136a_326x184.jpg",
            "programType": "Instant Replay",
            "programCategory": "Score",
            "priority": null,
            "lastUpdateDate": "2015-08-31T20:06:39+10:00",
            "isPremium": true,
            "club": [
                500013,
                500014
            ]
        },
        {
            "id": "NzZDhhdzq1oUWGS-WPDrXEJXbCEo7Obb",
            "contentId": 786073,
            "title": "Rd 25: TRY Jarrod Croker (15th min)",
            "description": "The Raiders go the length of the field as Sam Williams makes the bust from dummy half and Jarrod Croker is in support to score",
            "publishDate": "2015-08-31T19:19:01+10:00",
            "publisher": "NRL Chief",
            "thumbnailUrl": "http://bigpondvideo.com/Web/Images/Content/20150831191928a_89x50.jpg",
            "largeThumbnailUrl": "http://bigpondvideo.com/Web/Images/Content/20150831191928a_326x184.jpg",
            "programType": "Instant Replay",
            "programCategory": "Score",
            "priority": 9,
            "lastUpdateDate": "2015-08-31T21:00:54+10:00",
            "isPremium": true,
            "club": [
                500013,
                500014
            ]
        },
        {
            "id": "xtZDhhdzrENPU5ZLNTdTrw7VX8sYAkDd",
            "contentId": 786072,
            "title": "Rd 25: TRY Sam Williams (8th min)",
            "description": "The Raiders open the scoring in this match through a try to Sam Williams",
            "publishDate": "2015-08-31T19:13:11+10:00",
            "publisher": "NRL Chief",
            "thumbnailUrl": "http://bigpondvideo.com/Web/Images/Content/20150831191236a_89x50.jpg",
            "largeThumbnailUrl": "http://bigpondvideo.com/Web/Images/Content/20150831191236a_326x184.jpg",
            "programType": "Instant Replay",
            "programCategory": "Score",
            "priority": 10,
            "lastUpdateDate": "2015-08-31T20:59:53+10:00",
            "isPremium": true,
            "club": [
                500013,
                500014
            ]
        }
    ],
    "scores": [
        {
            "gameState": "First Half",
            "gameStateId": 3,
            "gameTime": "0:07:25",
            "gameSeconds": 445,
            "playerId": 500642,
            "playerName": "Sam Williams",
            "scoreMethod": "Try",
            "statEvent": "Try",
            "statId": 38,
            "statValue": 4,
            "vidRef": 13325,
            "homeScore": 4,
            "teamId": 500013,
            "teamName": "Canberra Raiders",
            "homeTeamAbbrv": "CAN",
            "awayTeamAbbrv": "PEN"
        },
        {
            "gameState": "First Half",
            "gameStateId": 3,
            "gameTime": "0:14:50",
            "gameSeconds": 890,
            "playerId": 500313,
            "playerName": "Jarrod Croker",
            "scoreMethod": "Try",
            "statEvent": "Try",
            "statId": 38,
            "statValue": 4,
            "vidRef": 24452,
            "homeScore": 8,
            "teamId": 500013,
            "teamName": "Canberra Raiders",
            "homeTeamAbbrv": "CAN",
            "awayTeamAbbrv": "PEN"
        },
        {
            "gameState": "First Half",
            "gameStateId": 3,
            "gameTime": "0:16:15",
            "gameSeconds": 975,
            "playerId": 500313,
            "playerName": "Jarrod Croker",
            "scoreMethod": "Conversion",
            "statEvent": "Conversion-Made",
            "statId": 1,
            "statValue": 2,
            "vidRef": 26594,
            "homeScore": 10,
            "teamId": 500013,
            "teamName": "Canberra Raiders",
            "homeTeamAbbrv": "CAN",
            "awayTeamAbbrv": "PEN"
        },
        {
            "gameState": "First Half",
            "gameStateId": 3,
            "gameTime": "0:21:00",
            "gameSeconds": 1260,
            "playerId": 500319,
            "playerName": "Jarrad Kennedy",
            "scoreMethod": "Try",
            "statEvent": "Try",
            "statId": 38,
            "statValue": 4,
            "vidRef": 33703,
            "homeScore": 14,
            "teamId": 500013,
            "teamName": "Canberra Raiders",
            "homeTeamAbbrv": "CAN",
            "awayTeamAbbrv": "PEN"
        },
        {
            "gameState": "First Half",
            "gameStateId": 3,
            "gameTime": "0:22:27",
            "gameSeconds": 1347,
            "playerId": 500313,
            "playerName": "Jarrod Croker",
            "scoreMethod": "Conversion",
            "statEvent": "Conversion-Made",
            "statId": 1,
            "statValue": 2,
            "vidRef": 35882,
            "homeScore": 16,
            "teamId": 500013,
            "teamName": "Canberra Raiders",
            "homeTeamAbbrv": "CAN",
            "awayTeamAbbrv": "PEN"
        },
        {
            "gameState": "First Half",
            "gameStateId": 3,
            "gameTime": "0:26:56",
            "gameSeconds": 1616,
            "playerId": 500316,
            "playerName": "Shaun Fensom",
            "scoreMethod": "Try",
            "statEvent": "Try",
            "statId": 38,
            "statValue": 4,
            "vidRef": 46256,
            "homeScore": 20,
            "teamId": 500013,
            "teamName": "Canberra Raiders",
            "homeTeamAbbrv": "CAN",
            "awayTeamAbbrv": "PEN"
        },
        {
            "gameState": "First Half",
            "gameStateId": 3,
            "gameTime": "0:27:53",
            "gameSeconds": 1673,
            "playerId": 500313,
            "playerName": "Jarrod Croker",
            "scoreMethod": "Conversion",
            "statEvent": "Conversion-Made",
            "statId": 1,
            "statValue": 2,
            "vidRef": 47686,
            "homeScore": 22,
            "teamId": 500013,
            "teamName": "Canberra Raiders",
            "homeTeamAbbrv": "CAN",
            "awayTeamAbbrv": "PEN"
        },
        {
            "gameState": "Second Half",
            "gameStateId": 5,
            "gameTime": "1:00:32",
            "gameSeconds": 3632,
            "playerId": 500308,
            "playerName": "Kurt Baptiste",
            "scoreMethod": "Try",
            "statEvent": "Try",
            "statId": 38,
            "statValue": 4,
            "vidRef": 113651,
            "homeScore": 26,
            "awayScore": 6,
            "teamId": 500013,
            "teamName": "Canberra Raiders",
            "homeTeamAbbrv": "CAN",
            "awayTeamAbbrv": "PEN"
        },
        {
            "gameState": "Second Half",
            "gameStateId": 5,
            "gameTime": "1:01:46",
            "gameSeconds": 3706,
            "playerId": 500313,
            "playerName": "Jarrod Croker",
            "scoreMethod": "Conversion",
            "statEvent": "Conversion-Made",
            "statId": 1,
            "statValue": 2,
            "vidRef": 115509,
            "homeScore": 28,
            "awayScore": 6,
            "teamId": 500013,
            "teamName": "Canberra Raiders",
            "homeTeamAbbrv": "CAN",
            "awayTeamAbbrv": "PEN"
        },
        {
            "gameState": "Second Half",
            "gameStateId": 5,
            "gameTime": "1:11:27",
            "gameSeconds": 4287,
            "playerId": 500612,
            "playerName": "Sisa Waqa",
            "scoreMethod": "Try",
            "statEvent": "Try",
            "statId": 38,
            "statValue": 4,
            "vidRef": 130038,
            "homeScore": 32,
            "awayScore": 12,
            "teamId": 500013,
            "teamName": "Canberra Raiders",
            "homeTeamAbbrv": "CAN",
            "awayTeamAbbrv": "PEN"
        },
        {
            "gameState": "Second Half",
            "gameStateId": 5,
            "gameTime": "1:12:44",
            "gameSeconds": 4364,
            "playerId": 500313,
            "playerName": "Jarrod Croker",
            "scoreMethod": "Conversion",
            "statEvent": "Conversion-Made",
            "statId": 1,
            "statValue": 2,
            "vidRef": 132439,
            "homeScore": 34,
            "awayScore": 12,
            "teamId": 500013,
            "teamName": "Canberra Raiders",
            "homeTeamAbbrv": "CAN",
            "awayTeamAbbrv": "PEN"
        },
        {
            "gameState": "First Half",
            "gameStateId": 3,
            "gameTime": "0:32:10",
            "gameSeconds": 1930,
            "playerId": 500362,
            "playerName": "James Segeyaro",
            "scoreMethod": "Try",
            "statEvent": "Try",
            "statId": 38,
            "statValue": 4,
            "vidRef": 54119,
            "homeScore": 22,
            "awayScore": 4,
            "teamId": 500014,
            "teamName": "Penrith Panthers",
            "homeTeamAbbrv": "CAN",
            "awayTeamAbbrv": "PEN"
        },
        {
            "gameState": "First Half",
            "gameStateId": 3,
            "gameTime": "0:32:49",
            "gameSeconds": 1969,
            "playerId": 501259,
            "playerName": "Jamie Soward",
            "scoreMethod": "Conversion",
            "statEvent": "Conversion-Made",
            "statId": 1,
            "statValue": 2,
            "vidRef": 55088,
            "homeScore": 22,
            "awayScore": 6,
            "teamId": 500014,
            "teamName": "Penrith Panthers",
            "homeTeamAbbrv": "CAN",
            "awayTeamAbbrv": "PEN"
        },
        {
            "gameState": "Second Half",
            "gameStateId": 5,
            "gameTime": "1:04:22",
            "gameSeconds": 3862,
            "playerId": 500341,
            "playerName": "Lewis Brown",
            "scoreMethod": "Try",
            "statEvent": "Try",
            "statId": 38,
            "statValue": 4,
            "vidRef": 119409,
            "homeScore": 28,
            "awayScore": 10,
            "teamId": 500014,
            "teamName": "Penrith Panthers",
            "homeTeamAbbrv": "CAN",
            "awayTeamAbbrv": "PEN"
        },
        {
            "gameState": "Second Half",
            "gameStateId": 5,
            "gameTime": "1:05:28",
            "gameSeconds": 3928,
            "playerId": 500109,
            "playerName": "Apisai Koroisau",
            "scoreMethod": "Conversion",
            "statEvent": "Conversion-Made",
            "statId": 1,
            "statValue": 2,
            "vidRef": 121044,
            "homeScore": 28,
            "awayScore": 12,
            "teamId": 500014,
            "teamName": "Penrith Panthers",
            "homeTeamAbbrv": "CAN",
            "awayTeamAbbrv": "PEN"
        },
        {
            "gameState": "Second Half",
            "gameStateId": 5,
            "gameTime": "1:15:18",
            "gameSeconds": 4518,
            "playerId": 501253,
            "playerName": "Will Smith",
            "scoreMethod": "Try",
            "statEvent": "Try",
            "statId": 38,
            "statValue": 4,
            "vidRef": 136272,
            "homeScore": 34,
            "awayScore": 16,
            "teamId": 500014,
            "teamName": "Penrith Panthers",
            "homeTeamAbbrv": "CAN",
            "awayTeamAbbrv": "PEN"
        },
        {
            "gameState": "Second Half",
            "gameStateId": 5,
            "gameTime": "1:15:55",
            "gameSeconds": 4555,
            "playerId": 500109,
            "playerName": "Apisai Koroisau",
            "scoreMethod": "Conversion",
            "statEvent": "Conversion-Made",
            "statId": 1,
            "statValue": 2,
            "vidRef": 137200,
            "homeScore": 34,
            "awayScore": 18,
            "teamId": 500014,
            "teamName": "Penrith Panthers",
            "homeTeamAbbrv": "CAN",
            "awayTeamAbbrv": "PEN"
        }
    ]
}