{
    "vod": [
        {
            "id": "dlMjF2NDE6qPs9nrsUxLkxYXZgBGgFJw",
            "contentId": 865120,
            "title": "Rd 20: Cowboys v Bulldogs (Hls)",
            "description": "Highlights of the match between the Cowboys and Bulldogs from 1300Smiles Stadium",
            "publishDate": "2016-07-21T22:00:00+10:00",
            "publisher": "NRL Chief",
            "thumbnailUrl": "http://bigpondvideo.com/web/images/content/20160721215830a_89x50.jpg",
            "largeThumbnailUrl": "http://bigpondvideo.com/web/images/content/20160721215830a_326x184.jpg",
            "programType": "Highlights",
            "programCategory": "Match",
            "priority": null,
            "lastUpdateDate": "2016-07-21T22:07:56+10:00",
            "isPremium": false,
            "club": [
                500010,
                500012
            ]
        },
        {
            "id": "k1cjF2NDE6Vzupw_G_nOgt8H6PT7tmh-",
            "contentId": 865129,
            "title": "Rd 20 Press Conference: Cowboys",
            "description": "The Cowboys coach faces the media following the match",
            "publishDate": "2016-07-21T22:46:00+10:00",
            "publisher": "NRL Chief",
            "thumbnailUrl": "http://bigpondvideo.com/web/images/content/20160721222627a_89x50.jpg",
            "largeThumbnailUrl": "http://bigpondvideo.com/web/images/content/20160721222627a_326x184.jpg",
            "programType": "Press Conference",
            "programCategory": null,
            "priority": null,
            "lastUpdateDate": "2016-07-21T22:51:05+10:00",
            "isPremium": false,
            "club": [
                500010,
                500012
            ]
        },
        {
            "id": "05ajF2NDE689yj2D7GLHVyo3pyIoO3MI",
            "contentId": 865130,
            "title": "Rd 20 Press Conference: Bulldogs",
            "description": "The Bulldogs coach faces the media following the match",
            "publishDate": "2016-07-21T22:34:00+10:00",
            "publisher": "NRL Chief",
            "thumbnailUrl": "http://bigpondvideo.com/web/images/content/20160721222619a_89x50.jpg",
            "largeThumbnailUrl": "http://bigpondvideo.com/web/images/content/20160721222619a_326x184.jpg",
            "programType": "Press Conference",
            "programCategory": null,
            "priority": null,
            "lastUpdateDate": "2016-07-21T22:39:03+10:00",
            "isPremium": false,
            "club": [
                500010,
                500012
            ]
        },
        {
            "id": "FocTB2NDE6HjZnlp09Wdgr0g0Keo7AzQ",
            "contentId": 864561,
            "title": "Rd 20: TRY Antonio Winterstein (80th min)",
            "description": "Grandstand finish for the Cowboys as Antonio Winterstein cleans up a Bulldogs error to race away to score",
            "publishDate": "2016-07-21T21:40:00+10:00",
            "publisher": "NRL Chief",
            "thumbnailUrl": "http://bigpondvideo.com/web/images/content/20160721214145a_89x50.jpg",
            "largeThumbnailUrl": "http://bigpondvideo.com/web/images/content/20160721214145a_326x184.jpg",
            "programType": "Instant Replay",
            "programCategory": "Score",
            "priority": 1,
            "lastUpdateDate": "2016-07-21T21:44:51+10:00",
            "isPremium": true,
            "club": [
                500010,
                500012
            ]
        },
        {
            "id": "tqbTB2NDE6VvQ1ndAAC7sC3KYOnnd0dU",
            "contentId": 864560,
            "title": "Rd 20: GOAL Ethan Lowe (73rd min)",
            "description": "Conversion sees the Cowboys lead 32-0",
            "publishDate": "2016-07-21T21:31:00+10:00",
            "publisher": "NRL Chief",
            "thumbnailUrl": "http://bigpondvideo.com/web/images/content/20160721213249a_89x50.jpg",
            "largeThumbnailUrl": "http://bigpondvideo.com/web/images/content/20160721213249a_326x184.jpg",
            "programType": "Instant Replay",
            "programCategory": "Score",
            "priority": 2,
            "lastUpdateDate": "2016-07-21T21:41:50+10:00",
            "isPremium": true,
            "club": [
                500010,
                500012
            ]
        },
        {
            "id": "Q2bDB2NDE6JuejKWgkwo4J-USoppiu4O",
            "contentId": 864559,
            "title": "Rd 20: TRY Justin O'Neill (71st min)",
            "description": "Its all too easy for the Cowboys as Justin O'Neill comes back against the grain to cross under the posts",
            "publishDate": "2016-07-21T21:30:00+10:00",
            "publisher": "NRL Chief",
            "thumbnailUrl": "http://bigpondvideo.com/web/images/content/20160721213122a_89x50.jpg",
            "largeThumbnailUrl": "http://bigpondvideo.com/web/images/content/20160721213122a_326x184.jpg",
            "programType": "Instant Replay",
            "programCategory": "Score",
            "priority": 3,
            "lastUpdateDate": "2016-07-21T21:40:50+10:00",
            "isPremium": true,
            "club": [
                500010,
                500012
            ]
        },
        {
            "id": "tnajB2NDE616UE29mwN18LW_EvMEj6QI",
            "contentId": 864558,
            "title": "Rd 20: GOAL Ethan Lowe (67th min)",
            "description": "Conversion sees the homeside lead 26-0",
            "publishDate": "2016-07-21T21:24:00+10:00",
            "publisher": "NRL Chief",
            "thumbnailUrl": "http://bigpondvideo.com/web/images/content/20160721212722a_89x50.jpg",
            "largeThumbnailUrl": "http://bigpondvideo.com/web/images/content/20160721212722a_326x184.jpg",
            "programType": "Instant Replay",
            "programCategory": "Score",
            "priority": 4,
            "lastUpdateDate": "2016-07-21T21:40:50+10:00",
            "isPremium": true,
            "club": [
                500010,
                500012
            ]
        },
        {
            "id": "E1ZTB2NDE6Xd6MvcHwtcaSCoQka6P54W",
            "contentId": 864557,
            "title": "Rd 20: TRY Ethan Lowe (65th min)",
            "description": "Great solo effort from Ethan Lowe sees him cross for another try for the Cowboys",
            "publishDate": "2016-07-21T21:23:00+10:00",
            "publisher": "NRL Chief",
            "thumbnailUrl": "http://bigpondvideo.com/web/images/content/20160721212424a_89x50.jpg",
            "largeThumbnailUrl": "http://bigpondvideo.com/web/images/content/20160721212424a_326x184.jpg",
            "programType": "Instant Replay",
            "programCategory": "Score",
            "priority": 5,
            "lastUpdateDate": "2016-07-21T21:40:50+10:00",
            "isPremium": true,
            "club": [
                500010,
                500012
            ]
        },
        {
            "id": "phMzB2NDE6XC_n9iHdsNGB-nraNzQjat",
            "contentId": 864556,
            "title": "Rd 20: TRY Justin O'Neill (45th min)",
            "description": "Great play from Michael Morgan sees Justin O'Neill score another try for the Cowboys",
            "publishDate": "2016-07-21T21:03:00+10:00",
            "publisher": "NRL Chief",
            "thumbnailUrl": "http://bigpondvideo.com/web/images/content/20160721210431a_89x50.jpg",
            "largeThumbnailUrl": "http://bigpondvideo.com/web/images/content/20160721210431a_326x184.jpg",
            "programType": "Instant Replay",
            "programCategory": "Score",
            "priority": 6,
            "lastUpdateDate": "2016-07-21T21:40:50+10:00",
            "isPremium": true,
            "club": [
                500010,
                500012
            ]
        },
        {
            "id": "9wbHl1NDE6k-UB0w1mMyXBFgxgsAJYiX",
            "contentId": 864555,
            "title": "Rd 20: TRY Javid Bowen (24th min)",
            "description": "A little slice of JT magic sends Javid Bowen over for the 3rd try of the night for the Cowboys",
            "publishDate": "2016-07-21T20:25:00+10:00",
            "publisher": "NRL Chief",
            "thumbnailUrl": "http://bigpondvideo.com/web/images/content/20160721202608a_89x50.jpg",
            "largeThumbnailUrl": "http://bigpondvideo.com/web/images/content/20160721202608a_326x184.jpg",
            "programType": "Instant Replay",
            "programCategory": "Score",
            "priority": 7,
            "lastUpdateDate": "2016-07-21T21:39:50+10:00",
            "isPremium": true,
            "club": [
                500010,
                500012
            ]
        },
        {
            "id": "Z5Z3l1NDE6-Gt6bHIg1B0xEjVabQf9HA",
            "contentId": 864554,
            "title": "Rd 20: GOAL Johnathan Thurston (9th min)",
            "description": "Conversion gives the Cowboys an early 12-0 lead",
            "publishDate": "2016-07-21T20:10:00+10:00",
            "publisher": "NRL Chief",
            "thumbnailUrl": "http://bigpondvideo.com/web/images/content/20160721201355a_89x50.jpg",
            "largeThumbnailUrl": "http://bigpondvideo.com/web/images/content/20160721201355a_326x184.jpg",
            "programType": "Instant Replay",
            "programCategory": "Score",
            "priority": 8,
            "lastUpdateDate": "2016-07-21T21:39:49+10:00",
            "isPremium": true,
            "club": [
                500010,
                500012
            ]
        },
        {
            "id": "8xaHl1NDE6NNhLaySWbVY3w7QEGulTc3",
            "contentId": 864553,
            "title": "Rd 20: TRY Antonio Winterstein (8th min)",
            "description": "The Cowboys are in again as Antonio Winterstein crosses for an early double",
            "publishDate": "2016-07-21T20:09:00+10:00",
            "publisher": "NRL Chief",
            "thumbnailUrl": "http://bigpondvideo.com/web/images/content/20160721201338a_89x50.jpg",
            "largeThumbnailUrl": "http://bigpondvideo.com/web/images/content/20160721201338a_326x184.jpg",
            "programType": "Instant Replay",
            "programCategory": "Score",
            "priority": 9,
            "lastUpdateDate": "2016-07-21T21:39:49+10:00",
            "isPremium": true,
            "club": [
                500010,
                500012
            ]
        },
        {
            "id": "1rZXl1NDE6ffsuSsaHUUxMo-eOXlIyBy",
            "contentId": 864551,
            "title": "Rd 20: GOAL Johnathan Thurston (5th min)",
            "description": "Conversion sees the Cowboys lead 6-0",
            "publishDate": "2016-07-21T20:05:00+10:00",
            "publisher": "NRL Chief",
            "thumbnailUrl": "http://bigpondvideo.com/web/images/content/20160721200759a_89x50.jpg",
            "largeThumbnailUrl": "http://bigpondvideo.com/web/images/content/20160721200759a_326x184.jpg",
            "programType": "Instant Replay",
            "programCategory": "Score",
            "priority": null,
            "lastUpdateDate": "2016-07-21T20:11:30+10:00",
            "isPremium": true,
            "club": [
                500010,
                500012
            ]
        },
        {
            "id": "tnZXl1NDE6NJm2pPSsS-dKc0XEvoAOZV",
            "contentId": 864550,
            "title": "Rd 20: TRY Antonio Winterstein (4th min)",
            "description": "The Cowboys open the scoring in this match through a try to Antonio Winterstein",
            "publishDate": "2016-07-21T20:04:00+10:00",
            "publisher": "NRL Chief",
            "thumbnailUrl": "http://bigpondvideo.com/web/images/content/20160721200745a_89x50.jpg",
            "largeThumbnailUrl": "http://bigpondvideo.com/web/images/content/20160721200745a_326x184.jpg",
            "programType": "Instant Replay",
            "programCategory": "Score",
            "priority": 10,
            "lastUpdateDate": "2016-07-21T21:39:49+10:00",
            "isPremium": true,
            "club": [
                500010,
                500012
            ]
        }
    ],
    "scores": [
        {
            "gameState": "First Half",
            "gameStateId": 3,
            "gameTime": "0:03:13",
            "gameSeconds": 193,
            "GameMinutes": "03:13",
            "playerId": 500305,
            "playerName": "Antonio Winterstein",
            "scoreMethod": "Try",
            "statEvent": "Try",
            "statId": 38,
            "statValue": 4,
            "vidRef": 4986,
            "homeScore": 4,
            "commentary": "Try by Antonio Winterstein",
            "tackleNum": 4,
            "teamId": 500012,
            "teamName": "North Queensland Cowboys",
            "homeTeamAbbrv": "NQL",
            "awayTeamAbbrv": "CBY"
        },
        {
            "gameState": "First Half",
            "gameStateId": 3,
            "gameTime": "0:04:43",
            "gameSeconds": 283,
            "GameMinutes": "04:43",
            "playerId": 500304,
            "playerName": "Johnathan Thurston",
            "scoreMethod": "Conversion",
            "statEvent": "Conversion-Made",
            "statId": 1,
            "statValue": 2,
            "vidRef": 7229,
            "homeScore": 6,
            "commentary": "Conversion-Made by Johnathan Thurston",
            "tackleNum": -1,
            "teamId": 500012,
            "teamName": "North Queensland Cowboys",
            "homeTeamAbbrv": "NQL",
            "awayTeamAbbrv": "CBY"
        },
        {
            "gameState": "First Half",
            "gameStateId": 3,
            "gameTime": "0:07:19",
            "gameSeconds": 439,
            "GameMinutes": "07:19",
            "playerId": 500305,
            "playerName": "Antonio Winterstein",
            "scoreMethod": "Try",
            "statEvent": "Try",
            "statId": 38,
            "statValue": 4,
            "vidRef": 11123,
            "homeScore": 10,
            "commentary": "Try by Antonio Winterstein",
            "tackleNum": 5,
            "teamId": 500012,
            "teamName": "North Queensland Cowboys",
            "homeTeamAbbrv": "NQL",
            "awayTeamAbbrv": "CBY"
        },
        {
            "gameState": "First Half",
            "gameStateId": 3,
            "gameTime": "0:08:50",
            "gameSeconds": 530,
            "GameMinutes": "08:50",
            "playerId": 500304,
            "playerName": "Johnathan Thurston",
            "scoreMethod": "Conversion",
            "statEvent": "Conversion-Made",
            "statId": 1,
            "statValue": 2,
            "vidRef": 13391,
            "homeScore": 12,
            "commentary": "Conversion-Made by Johnathan Thurston",
            "tackleNum": -1,
            "teamId": 500012,
            "teamName": "North Queensland Cowboys",
            "homeTeamAbbrv": "NQL",
            "awayTeamAbbrv": "CBY"
        },
        {
            "gameState": "First Half",
            "gameStateId": 3,
            "gameTime": "0:23:10",
            "gameSeconds": 1390,
            "GameMinutes": "23:10",
            "playerId": 500279,
            "playerName": "Javid Bowen",
            "scoreMethod": "Try",
            "statEvent": "Try",
            "statId": 38,
            "statValue": 4,
            "vidRef": 35753,
            "homeScore": 16,
            "commentary": "Try by Javid Bowen",
            "tackleNum": 5,
            "teamId": 500012,
            "teamName": "North Queensland Cowboys",
            "homeTeamAbbrv": "NQL",
            "awayTeamAbbrv": "CBY"
        },
        {
            "gameState": "Second Half",
            "gameStateId": 5,
            "gameTime": "0:44:08",
            "gameSeconds": 2648,
            "GameMinutes": "44:08",
            "playerId": 500605,
            "playerName": "Justin O'Neill",
            "scoreMethod": "Try",
            "statEvent": "Try",
            "statId": 38,
            "statValue": 4,
            "vidRef": 71240,
            "homeScore": 20,
            "commentary": "Try by Justin O'Neill",
            "tackleNum": 4,
            "teamId": 500012,
            "teamName": "North Queensland Cowboys",
            "homeTeamAbbrv": "NQL",
            "awayTeamAbbrv": "CBY"
        },
        {
            "gameState": "Second Half",
            "gameStateId": 5,
            "gameTime": "1:04:38",
            "gameSeconds": 3878,
            "GameMinutes": "64:38",
            "playerId": 500289,
            "playerName": "Ethan Lowe",
            "scoreMethod": "Try",
            "statEvent": "Try",
            "statId": 38,
            "statValue": 4,
            "vidRef": 102156,
            "homeScore": 24,
            "commentary": "Try by Ethan Lowe",
            "tackleNum": 3,
            "teamId": 500012,
            "teamName": "North Queensland Cowboys",
            "homeTeamAbbrv": "NQL",
            "awayTeamAbbrv": "CBY"
        },
        {
            "gameState": "Second Half",
            "gameStateId": 5,
            "gameTime": "1:06:00",
            "gameSeconds": 3960,
            "GameMinutes": "66:00",
            "playerId": 500289,
            "playerName": "Ethan Lowe",
            "scoreMethod": "Conversion",
            "statEvent": "Conversion-Made",
            "statId": 1,
            "statValue": 2,
            "vidRef": 104740,
            "homeScore": 26,
            "commentary": "Conversion-Made by Ethan Lowe",
            "tackleNum": -1,
            "teamId": 500012,
            "teamName": "North Queensland Cowboys",
            "homeTeamAbbrv": "NQL",
            "awayTeamAbbrv": "CBY"
        },
        {
            "gameState": "Second Half",
            "gameStateId": 5,
            "gameTime": "1:10:52",
            "gameSeconds": 4252,
            "GameMinutes": "70:52",
            "playerId": 500605,
            "playerName": "Justin O'Neill",
            "scoreMethod": "Try",
            "statEvent": "Try",
            "statId": 38,
            "statValue": 4,
            "vidRef": 112038,
            "homeScore": 30,
            "commentary": "Try by Justin O'Neill",
            "tackleNum": 5,
            "teamId": 500012,
            "teamName": "North Queensland Cowboys",
            "homeTeamAbbrv": "NQL",
            "awayTeamAbbrv": "CBY"
        },
        {
            "gameState": "Second Half",
            "gameStateId": 5,
            "gameTime": "1:12:41",
            "gameSeconds": 4361,
            "GameMinutes": "72:41",
            "playerId": 500289,
            "playerName": "Ethan Lowe",
            "scoreMethod": "Conversion",
            "statEvent": "Conversion-Made",
            "statId": 1,
            "statValue": 2,
            "vidRef": 114764,
            "homeScore": 32,
            "commentary": "Conversion-Made by Ethan Lowe",
            "tackleNum": -1,
            "teamId": 500012,
            "teamName": "North Queensland Cowboys",
            "homeTeamAbbrv": "NQL",
            "awayTeamAbbrv": "CBY"
        },
        {
            "gameState": "Second Half",
            "gameStateId": 5,
            "gameTime": "1:19:22",
            "gameSeconds": 4762,
            "GameMinutes": "79:22",
            "playerId": 500305,
            "playerName": "Antonio Winterstein",
            "scoreMethod": "Try",
            "statEvent": "Try",
            "statId": 38,
            "statValue": 4,
            "vidRef": 127424,
            "homeScore": 36,
            "commentary": "Try by Antonio Winterstein",
            "teamId": 500012,
            "teamName": "North Queensland Cowboys",
            "homeTeamAbbrv": "NQL",
            "awayTeamAbbrv": "CBY"
        }
    ]
}