{
    "competitionId": 111,
    "competitionName": "NRL Telstra Premiership",
    "gameId": 20161111780,
    "gameInfo": {
        "assistantReferee1Id": 500040,
        "numberOfPeriods": 2,
        "assistantReferee1Name": "Nick Beashel",
        "assistantReferee2Id": 500032,
        "assistantReferee2Name": "Adam Reid",
        "gameDate": "2016-07-04",
        "gameHashTag": "#NRLManlyDragons",
        "gameNumber": 8,
        "gameSeconds": 4800,
        "gameMinutes": "80:00",
        "gameTime": "1:20:00",
        "groundConditionId": 1,
        "groundConditionName": "N/A",
        "referee1Id": 500008,
        "referee1Name": "Gavin Badger",
        "referee2Id": 500006,
        "referee2Name": "Henry Perenara",
        "startTime": "2016-07-04T19:00:00",
        "startTimeUTC": "2016-07-04T09:00:00Z",
        "venueId": 500005,
        "venueName": "Brookvale Oval",
        "videoReferee1Id": 500039,
        "videoReferee1Name": "Ashley Klein",
        "weatherId": 10,
        "weatherName": "Cloudy",
        "broadcastChannel": null,
        "venueLatitude": -34.0386,
        "venueLongitude": 151.1408,
        "broadcastInfo": {
            "radioNetwork": []
        }
    },
    "gameState": "Final",
    "gameStateId": 8,
    "roundId": 17,
    "roundName": "Round 17",
    "seasonId": 2016,
    "teams": {
        "teamsMatch": [
            {
                "isHomeTeam": true,
                "score": {
                    "conversions": 3,
                    "points": 36,
                    "penaltyGoals": 1,
                    "tries": 7
                },
                "team1stHalfScore": 22,
                "team2ndHalfScore": 14,
                "teamAbbr": "MAN",
                "teamFinalScore": 36,
                "teamFullTimeScore": 36,
                "teamHalfTimeScore": 22,
                "teamId": 500002,
                "teamLineup": {
                    "teamLineUpStatusID": 4,
                    "teamLineUpStatus": "Final",
                    "injuriesAndSuspensions": {
                        "injury": [],
                        "suspension": []
                    },
                    "insAndOuts": {
                        "inOut": [
                            {
                                "inOut": "Out",
                                "playerFirstName": "Brett",
                                "playerId": "500018",
                                "playerLastName": "Stewart",
                                "playerName": "Brett Stewart"
                            },
                            {
                                "inOut": "In",
                                "playerFirstName": "Luke",
                                "playerId": "500103",
                                "playerLastName": "Burgess",
                                "playerName": "Luke Burgess"
                            },
                            {
                                "inOut": "In",
                                "playerFirstName": "Matthew",
                                "playerId": "501025",
                                "playerLastName": "Wright",
                                "playerName": "Matthew Wright"
                            },
                            {
                                "inOut": "Out",
                                "playerFirstName": "Siosaia",
                                "playerId": "501337",
                                "playerLastName": "Vave",
                                "playerName": "Siosaia Vave"
                            }
                        ]
                    },
                    "teamPlayer": [
                        {
                            "playerFirstName": "Tom",
                            "playerId": 501505,
                            "playerLastName": "Trbojevic",
                            "playerName": "Tom Trbojevic",
                            "playerPosition": "Fullback",
                            "playerPositionId": 500001,
                            "playerStats": {
                                "allRunMetres": 134,
                                "allRuns": 16,
                                "decoys": 2,
                                "dummyHalfRuns": 1,
                                "errors": 3,
                                "fantasyPointsTotal": 33,
                                "ineffectiveTackles": 1,
                                "kickMetres": 4,
                                "kickReturnMetres": 36,
                                "kickReturns": 2,
                                "kicks": 1,
                                "kicksDefused": 1,
                                "kicksNotDefused": 1,
                                "linebreakAssists": 1,
                                "mins": 80,
                                "missedTackles": 1,
                                "offloads": 2,
                                "passes": 10,
                                "passesPerRun": 0.62,
                                "oneOnOneTackles": 2,
                                "penalties": 2,
                                "supports": 8,
                                "tackleBreaks": 2,
                                "tackles": 9,
                                "tryAssists": 1,
                                "trySaves": 1,
                                "evasionRuns": 13,
                                "evasionRunMetres": 87,
                                "dummyHalfRunMetres": 11,
                                "ptbAll": 9,
                                "receipts": 27,
                                "grubberKick": 1,
                                "postContactMetres": 36,
                                "lineEngagedRuns": 2,
                                "ptbOneToTwo": 1,
                                "ptbTwoToThree": 4,
                                "ptbThreeToFour": 1,
                                "ptbFourToFive": 2,
                                "ptbFivePlus": 1,
                                "doubles": 1,
                                "effectiveTacklePercentage": 81.8,
                                "ptbPenalties": 2,
                                "stint1": 4800
                            },
                            "playerTookTheField": true,
                            "shirtNum": 3,
                            "playerFirstInitial": "T",
                            "playerPositionAbbrev": "FB",
                            "onTheField": true,
                            "fantasyPrice": 363000,
                            "fantasySeasonPriceChange": 98000,
                            "fantasyRoundPriceChange": 9000
                        },
                        {
                            "playerFirstName": "Jorge",
                            "playerId": 500019,
                            "playerLastName": "Taufua",
                            "playerName": "Jorge Taufua",
                            "playerPosition": "Winger 1",
                            "playerPositionId": 500002,
                            "playerStats": {
                                "allRunMetres": 209,
                                "allRuns": 19,
                                "errors": 1,
                                "fantasyPointsTotal": 56,
                                "ineffectiveTackles": 1,
                                "kicksDefused": 1,
                                "linebreaks": 1,
                                "mins": 80,
                                "missedTackles": 1,
                                "points": 8,
                                "supports": 5,
                                "tackleBreaks": 6,
                                "tackles": 1,
                                "tries": 2,
                                "evasionRuns": 19,
                                "evasionRunMetres": 209,
                                "ptbAll": 16,
                                "receipts": 20,
                                "postContactMetres": 59,
                                "ptbOneToTwo": 1,
                                "ptbTwoToThree": 4,
                                "ptbThreeToFour": 7,
                                "ptbFourToFive": 2,
                                "ptbFivePlus": 2,
                                "effectiveTacklePercentage": 33.3,
                                "stint1": 4800
                            },
                            "playerTookTheField": true,
                            "shirtNum": 2,
                            "playerFirstInitial": "J",
                            "playerPositionAbbrev": "WG",
                            "onTheField": true,
                            "fantasyPrice": 222000,
                            "fantasySeasonPriceChange": -61000,
                            "fantasyRoundPriceChange": -5000
                        },
                        {
                            "playerFirstName": "Brayden",
                            "playerId": 501255,
                            "playerLastName": "Wiliame",
                            "playerName": "Brayden Wiliame",
                            "playerPosition": "Centre 1",
                            "playerPositionId": 500003,
                            "playerStats": {
                                "allRunMetres": 96,
                                "allRuns": 11,
                                "bombKicksDefused": 1,
                                "fantasyPointsTotal": 29,
                                "kickReturns": 1,
                                "kicksDefused": 2,
                                "linebreaks": 1,
                                "mins": 80,
                                "missedTackles": 2,
                                "offloads": 1,
                                "passes": 3,
                                "passesPerRun": 0.27,
                                "oneOnOneTackles": 3,
                                "penalties": 1,
                                "points": 4,
                                "supports": 11,
                                "tackleBreaks": 1,
                                "tackles": 7,
                                "tries": 1,
                                "evasionRuns": 10,
                                "evasionRunMetres": 96,
                                "ptbAll": 10,
                                "receipts": 12,
                                "postContactMetres": 25,
                                "ptbOneToTwo": 2,
                                "ptbTwoToThree": 2,
                                "ptbThreeToFour": 5,
                                "ptbFourToFive": 1,
                                "doubles": 2,
                                "effectiveTacklePercentage": 77.8,
                                "ptbPenalties": 1,
                                "stint1": 4800
                            },
                            "playerTookTheField": true,
                            "shirtNum": 5,
                            "playerFirstInitial": "B",
                            "playerPositionAbbrev": "CT",
                            "onTheField": true,
                            "fantasyPrice": 178000,
                            "fantasySeasonPriceChange": 34000,
                            "fantasyRoundPriceChange": -4000
                        },
                        {
                            "playerFirstName": "Dylan",
                            "playerId": 500083,
                            "playerLastName": "Walker",
                            "playerName": "Dylan Walker",
                            "playerPosition": "Centre 2",
                            "playerPositionId": 500004,
                            "playerStats": {
                                "allRunMetres": 164,
                                "allRuns": 8,
                                "conversionsAttempts": 1,
                                "conversionsMissed": 1,
                                "decoys": 1,
                                "errors": 1,
                                "fantasyPointsTotal": 44,
                                "allGoalsMissed": 1,
                                "allGoalsAttempted": 1,
                                "ineffectiveTackles": 2,
                                "intercepts": 1,
                                "linebreaks": 1,
                                "mins": 80,
                                "missedTackles": 1,
                                "passes": 14,
                                "passesPerRun": 1.75,
                                "oneOnOneTackles": 1,
                                "points": 8,
                                "supports": 3,
                                "tackles": 12,
                                "tries": 2,
                                "tryCause": 1,
                                "evasionRuns": 8,
                                "evasionRunMetres": 164,
                                "ptbAll": 4,
                                "receipts": 17,
                                "postContactMetres": 16,
                                "lineEngagedRuns": 2,
                                "ptbTwoToThree": 1,
                                "ptbThreeToFour": 1,
                                "ptbFourToFive": 2,
                                "doubles": 1,
                                "effectiveTacklePercentage": 80,
                                "stint1": 4800
                            },
                            "playerTookTheField": true,
                            "shirtNum": 4,
                            "playerFirstInitial": "D",
                            "playerPositionAbbrev": "CT",
                            "onTheField": true,
                            "fantasyPrice": 300000,
                            "fantasySeasonPriceChange": -32000,
                            "fantasyRoundPriceChange": 25000
                        },
                        {
                            "playerFirstName": "Matthew",
                            "playerId": 501025,
                            "playerLastName": "Wright",
                            "playerName": "Matthew Wright",
                            "playerPosition": "Winger 2",
                            "playerPositionId": 500005,
                            "playerStats": {
                                "allRunMetres": 117,
                                "allRuns": 12,
                                "decoys": 1,
                                "dummyHalfRuns": 1,
                                "fantasyPointsTotal": 21,
                                "kickMetres": 10,
                                "kickReturnMetres": 21,
                                "kickReturns": 2,
                                "kicks": 1,
                                "kicksDefused": 1,
                                "lineDropouts": 1,
                                "mins": 80,
                                "passes": 3,
                                "passesPerRun": 0.25,
                                "supports": 3,
                                "tackleBreaks": 2,
                                "tackles": 3,
                                "evasionRuns": 9,
                                "evasionRunMetres": 84,
                                "dummyHalfRunMetres": 12,
                                "ptbAll": 13,
                                "receipts": 16,
                                "chipKick": 1,
                                "postContactMetres": 46,
                                "dummyPasses": 1,
                                "ptbTwoToThree": 6,
                                "ptbThreeToFour": 6,
                                "ptbFourToFive": 1,
                                "doubles": 1,
                                "effectiveTacklePercentage": 100,
                                "stint1": 4800
                            },
                            "playerTookTheField": true,
                            "shirtNum": 18,
                            "playerFirstInitial": "M",
                            "playerPositionAbbrev": "WG",
                            "onTheField": true,
                            "fantasyPrice": 128000,
                            "fantasySeasonPriceChange": -117000
                        },
                        {
                            "playerFirstName": "Jamie",
                            "playerId": 500020,
                            "playerLastName": "Lyon",
                            "playerName": "Jamie Lyon",
                            "playerPosition": "Five-Eighth",
                            "playerPositionId": 500006,
                            "playerStats": {
                                "allRunMetres": 68,
                                "allRuns": 12,
                                "bombKicks": 1,
                                "bombKickMetres": 33,
                                "conversions": 3,
                                "conversionsAttempts": 6,
                                "conversionsMissed": 3,
                                "fantasyPointsTotal": 61,
                                "goalConversionRate": 57.14,
                                "allGoals": 4,
                                "allGoalsMissed": 3,
                                "allGoalsAttempted": 7,
                                "ineffectiveTackles": 1,
                                "kickMetres": 157,
                                "kickReturnMetres": 5,
                                "kickReturns": 2,
                                "kicks": 5,
                                "kicksDefused": 1,
                                "linebreakAssists": 2,
                                "mins": 70,
                                "offloads": 3,
                                "passes": 10,
                                "passesPerRun": 0.83,
                                "oneOnOneTackles": 2,
                                "penalties": 1,
                                "penaltyGoals": 1,
                                "penaltyGoalsAttempts": 1,
                                "points": 8,
                                "supports": 3,
                                "tackleBreaks": 2,
                                "tackles": 20,
                                "tryAssists": 1,
                                "evasionRuns": 10,
                                "evasionRunMetres": 63,
                                "ptbAll": 4,
                                "receipts": 25,
                                "chipKick": 1,
                                "postContactMetres": 11,
                                "lineEngagedRuns": 1,
                                "ptbOneToTwo": 1,
                                "ptbTwoToThree": 2,
                                "ptbThreeToFour": 1,
                                "doubles": 4,
                                "effectiveTacklePercentage": 95.2,
                                "ptbPenalties": 1,
                                "stint1": 4212
                            },
                            "playerTookTheField": true,
                            "shirtNum": 6,
                            "playerFirstInitial": "J",
                            "playerPositionAbbrev": "FE",
                            "fantasyPrice": 269000,
                            "fantasySeasonPriceChange": -94000,
                            "fantasyRoundPriceChange": -6000
                        },
                        {
                            "playerFirstName": "Daly",
                            "playerId": 500024,
                            "playerLastName": "Cherry-Evans",
                            "playerName": "Daly Cherry-Evans",
                            "playerPosition": "Halfback",
                            "playerPositionId": 500007,
                            "playerStats": {
                                "allRunMetres": 62,
                                "allRuns": 8,
                                "bombKicks": 2,
                                "bombKickMetres": 36,
                                "dummyHalfRuns": 1,
                                "errors": 1,
                                "fantasyPointsTotal": 40,
                                "kickMetres": 194,
                                "kicks": 8,
                                "linebreakAssists": 2,
                                "mins": 80,
                                "missedTackles": 3,
                                "offloads": 1,
                                "passes": 60,
                                "passesPerRun": 7.5,
                                "supports": 4,
                                "tackles": 22,
                                "tryAssists": 1,
                                "tryCause": 1,
                                "evasionRuns": 7,
                                "evasionRunMetres": 48,
                                "dummyHalfRunMetres": 14,
                                "ptbAll": 3,
                                "receipts": 73,
                                "chipKick": 1,
                                "crossFieldKick": 1,
                                "postContactMetres": 10,
                                "dummyPasses": 3,
                                "lineEngagedRuns": 3,
                                "ptbTwoToThree": 1,
                                "ptbThreeToFour": 1,
                                "ptbFourToFive": 1,
                                "doubles": 3,
                                "longKicksSpace": 2,
                                "effectiveTacklePercentage": 88,
                                "stint1": 4800
                            },
                            "playerTookTheField": true,
                            "shirtNum": 7,
                            "playerFirstInitial": "D",
                            "playerPositionAbbrev": "HB",
                            "onTheField": true,
                            "fantasyPrice": 447000,
                            "fantasySeasonPriceChange": -35000,
                            "fantasyRoundPriceChange": 4000
                        },
                        {
                            "playerFirstName": "Darcy",
                            "playerId": 500677,
                            "playerLastName": "Lussick",
                            "playerName": "Darcy Lussick",
                            "playerPosition": "Prop 1",
                            "playerPositionId": 500008,
                            "playerStats": {
                                "allRunMetres": 161,
                                "allRuns": 15,
                                "decoys": 1,
                                "dummyHalfRuns": 1,
                                "fantasyPointsTotal": 43,
                                "hitUps": 13,
                                "ineffectiveTackles": 1,
                                "mins": 50,
                                "missedTackles": 1,
                                "passes": 5,
                                "passesPerRun": 0.33,
                                "penalties": 1,
                                "supports": 2,
                                "tackleBreaks": 1,
                                "tackles": 28,
                                "hitupRunMeters": 144,
                                "evasionRuns": 1,
                                "evasionRunMetres": 10,
                                "dummyHalfRunMetres": 7,
                                "ptbAll": 14,
                                "receipts": 19,
                                "postContactMetres": 43,
                                "kickPressures": 2,
                                "lineEngagedRuns": 1,
                                "ptbTwoToThree": 4,
                                "ptbThreeToFour": 4,
                                "ptbFourToFive": 4,
                                "ptbFivePlus": 2,
                                "doubles": 4,
                                "effectiveTacklePercentage": 93.3,
                                "ptbPenalties": 1,
                                "stint1": 1126,
                                "stint2": 1856
                            },
                            "playerTookTheField": true,
                            "shirtNum": 8,
                            "playerFirstInitial": "D",
                            "playerPositionAbbrev": "PR",
                            "fantasyPrice": 249000,
                            "fantasySeasonPriceChange": -4000,
                            "fantasyRoundPriceChange": 13000
                        },
                        {
                            "playerFirstName": "Apisai",
                            "playerId": 500109,
                            "playerLastName": "Koroisau",
                            "playerName": "Apisai Koroisau",
                            "playerPosition": "Hooker",
                            "playerPositionId": 500009,
                            "playerStats": {
                                "allRunMetres": 59,
                                "allRuns": 8,
                                "dummyHalfRuns": 6,
                                "fantasyPointsTotal": 43,
                                "hitUps": 2,
                                "ineffectiveTackles": 3,
                                "kicks": 1,
                                "mins": 80,
                                "missedTackles": 5,
                                "offloads": 1,
                                "passes": 116,
                                "passesPerRun": 14.5,
                                "oneOnOneTackles": 2,
                                "penalties": 1,
                                "supports": 2,
                                "tackles": 43,
                                "tryAssists": 1,
                                "hitupRunMeters": 22,
                                "dummyHalfRunMetres": 37,
                                "ptbAll": 5,
                                "receipts": 123,
                                "grubberKick": 1,
                                "postContactMetres": 13,
                                "dummyPasses": 1,
                                "kickPressures": 1,
                                "lineEngagedRuns": 2,
                                "ptbTwoToThree": 2,
                                "ptbThreeToFour": 2,
                                "ptbFivePlus": 1,
                                "doubles": 10,
                                "effectiveTacklePercentage": 84.3,
                                "ptbPenalties": 1,
                                "stint1": 4800
                            },
                            "playerTookTheField": true,
                            "shirtNum": 9,
                            "playerFirstInitial": "A",
                            "playerPositionAbbrev": "HK",
                            "onTheField": true,
                            "fantasyPrice": 324000,
                            "fantasySeasonPriceChange": -61000
                        },
                        {
                            "playerFirstName": "Martin",
                            "playerId": 500960,
                            "playerLastName": "Taupau",
                            "playerName": "Martin Taupau",
                            "playerPosition": "Prop 2",
                            "playerPositionId": 500010,
                            "playerStats": {
                                "allRunMetres": 195,
                                "allRuns": 19,
                                "decoys": 3,
                                "errors": 1,
                                "fantasyPointsTotal": 43,
                                "hitUps": 15,
                                "ineffectiveTackles": 1,
                                "kickReturnMetres": 52,
                                "kickReturns": 3,
                                "mins": 42,
                                "offloads": 3,
                                "passes": 4,
                                "passesPerRun": 0.21,
                                "tackleBreaks": 1,
                                "tackles": 17,
                                "hitupRunMeters": 136,
                                "evasionRuns": 1,
                                "evasionRunMetres": 7,
                                "ptbAll": 14,
                                "receipts": 22,
                                "postContactMetres": 57,
                                "dummyPasses": 1,
                                "lineEngagedRuns": 1,
                                "ptbOneToTwo": 1,
                                "ptbTwoToThree": 4,
                                "ptbThreeToFour": 7,
                                "ptbFourToFive": 2,
                                "doubles": 5,
                                "effectiveTacklePercentage": 94.4,
                                "stint1": 1458,
                                "stint2": 1070
                            },
                            "playerTookTheField": true,
                            "shirtNum": 10,
                            "playerFirstInitial": "M",
                            "playerPositionAbbrev": "PR",
                            "onTheField": true,
                            "fantasyPrice": 427000,
                            "fantasySeasonPriceChange": -19000,
                            "fantasyRoundPriceChange": -14000
                        },
                        {
                            "playerFirstName": "Nathan",
                            "playerId": 500624,
                            "playerLastName": "Green",
                            "playerName": "Nathan Green",
                            "playerPosition": "2nd Row 1",
                            "playerPositionId": 500011,
                            "playerStats": {
                                "allRunMetres": 151,
                                "allRuns": 16,
                                "decoys": 4,
                                "errors": 1,
                                "fantasyPointsTotal": 68,
                                "hitUps": 15,
                                "kickMetres": 40,
                                "kicks": 1,
                                "linebreaks": 1,
                                "mins": 65,
                                "offloads": 1,
                                "passes": 4,
                                "passesPerRun": 0.25,
                                "points": 4,
                                "supports": 5,
                                "tackleBreaks": 7,
                                "tackles": 13,
                                "tries": 1,
                                "tryAssists": 1,
                                "hitupRunMeters": 140,
                                "evasionRuns": 1,
                                "evasionRunMetres": 11,
                                "ptbAll": 10,
                                "receipts": 21,
                                "postContactMetres": 59,
                                "kickPressures": 1,
                                "lineEngagedRuns": 1,
                                "ptbOneToTwo": 1,
                                "ptbTwoToThree": 5,
                                "ptbThreeToFour": 3,
                                "ptbFourToFive": 1,
                                "doubles": 2,
                                "longKicksSpace": 1,
                                "effectiveTacklePercentage": 100,
                                "stint1": 3875
                            },
                            "playerTookTheField": true,
                            "shirtNum": 11,
                            "playerFirstInitial": "N",
                            "playerPositionAbbrev": "2R",
                            "fantasyPrice": 167000,
                            "fantasySeasonPriceChange": -3000,
                            "fantasyRoundPriceChange": 1000
                        },
                        {
                            "playerFirstName": "Jamie",
                            "playerId": 500032,
                            "playerLastName": "Buhrer",
                            "playerName": "Jamie Buhrer",
                            "playerPosition": "2nd Row 2",
                            "playerPositionId": 500012,
                            "playerStats": {
                                "allRunMetres": 208,
                                "allRuns": 10,
                                "decoys": 3,
                                "fantasyPointsTotal": 87,
                                "hitUps": 9,
                                "kickMetres": 5,
                                "kicks": 1,
                                "linebreaks": 2,
                                "mins": 80,
                                "offloads": 1,
                                "passes": 3,
                                "passesPerRun": 0.3,
                                "oneOnOneTackles": 2,
                                "penalties": 1,
                                "points": 4,
                                "supports": 13,
                                "tackleBreaks": 5,
                                "tackles": 36,
                                "tries": 1,
                                "hitupRunMeters": 208,
                                "evasionRuns": 1,
                                "ptbAll": 7,
                                "receipts": 13,
                                "crossFieldKick": 1,
                                "postContactMetres": 26,
                                "kickPressures": 1,
                                "lineEngagedRuns": 1,
                                "ptbTwoToThree": 2,
                                "ptbThreeToFour": 2,
                                "ptbFourToFive": 2,
                                "ptbFivePlus": 1,
                                "doubles": 9,
                                "effectiveTacklePercentage": 100,
                                "ptbPenalties": 1,
                                "stint1": 4800
                            },
                            "playerTookTheField": true,
                            "shirtNum": 12,
                            "playerFirstInitial": "J",
                            "playerPositionAbbrev": "2R",
                            "onTheField": true,
                            "fantasyPrice": 307000,
                            "fantasySeasonPriceChange": -28000,
                            "fantasyRoundPriceChange": 9000
                        },
                        {
                            "playerFirstName": "Jake",
                            "playerId": 500751,
                            "playerLastName": "Trbojevic",
                            "playerName": "Jake Trbojevic",
                            "playerPosition": "Lock",
                            "playerPositionId": 500013,
                            "playerStats": {
                                "allRunMetres": 71,
                                "allRuns": 11,
                                "decoys": 3,
                                "fantasyPointsTotal": 45,
                                "hitUps": 10,
                                "ineffectiveTackles": 1,
                                "mins": 53,
                                "offloads": 4,
                                "passes": 5,
                                "passesPerRun": 0.45,
                                "supports": 12,
                                "tackles": 30,
                                "hitupRunMeters": 68,
                                "evasionRuns": 1,
                                "evasionRunMetres": 3,
                                "ptbAll": 6,
                                "receipts": 16,
                                "postContactMetres": 16,
                                "kickPressures": 1,
                                "lineEngagedRuns": 1,
                                "ptbOneToTwo": 1,
                                "ptbTwoToThree": 1,
                                "ptbThreeToFour": 2,
                                "ptbFourToFive": 1,
                                "ptbFivePlus": 1,
                                "doubles": 11,
                                "effectiveTacklePercentage": 96.8,
                                "stint1": 1874,
                                "stint2": 1307
                            },
                            "playerTookTheField": true,
                            "shirtNum": 13,
                            "playerFirstInitial": "J",
                            "playerPositionAbbrev": "LK",
                            "onTheField": true,
                            "fantasyPrice": 456000,
                            "fantasySeasonPriceChange": 108000,
                            "fantasyRoundPriceChange": -11000
                        },
                        {
                            "playerFirstName": "Lewis",
                            "playerId": 500341,
                            "playerLastName": "Brown",
                            "playerName": "Lewis Brown",
                            "playerPosition": "Interchange",
                            "playerPositionId": 500014,
                            "playerStats": {
                                "allRunMetres": 26,
                                "allRuns": 2,
                                "dummyHalfRuns": 1,
                                "fantasyPointsTotal": 3,
                                "hitUps": 1,
                                "mins": 15,
                                "passes": 10,
                                "passesPerRun": 5,
                                "tackles": 1,
                                "hitupRunMeters": 12,
                                "dummyHalfRunMetres": 14,
                                "ptbAll": 2,
                                "receipts": 12,
                                "postContactMetres": 8,
                                "ptbThreeToFour": 1,
                                "ptbFivePlus": 1,
                                "effectiveTacklePercentage": 100,
                                "stint1": 925
                            },
                            "playerTookTheField": true,
                            "shirtNum": 14,
                            "playerFirstInitial": "L",
                            "playerPositionAbbrev": "INT",
                            "onTheField": true,
                            "fantasyPrice": 188000,
                            "fantasySeasonPriceChange": -121000,
                            "fantasyRoundPriceChange": 4000
                        },
                        {
                            "playerFirstName": "Josh",
                            "playerId": 501261,
                            "playerLastName": "Starling",
                            "playerName": "Josh Starling",
                            "playerPosition": "Interchange",
                            "playerPositionId": 500014,
                            "playerStats": {
                                "allRunMetres": 149,
                                "allRuns": 14,
                                "decoys": 5,
                                "fantasyPointsTotal": 33,
                                "hitUps": 14,
                                "kicksDefused": 1,
                                "mins": 49,
                                "missedTackles": 1,
                                "passes": 2,
                                "passesPerRun": 0.14,
                                "supports": 3,
                                "tackles": 20,
                                "hitupRunMeters": 149,
                                "ptbAll": 15,
                                "receipts": 17,
                                "postContactMetres": 67,
                                "dummyPasses": 1,
                                "ptbTwoToThree": 5,
                                "ptbThreeToFour": 6,
                                "ptbFourToFive": 4,
                                "doubles": 5,
                                "effectiveTacklePercentage": 95.2,
                                "stint1": 2367,
                                "stint2": 588
                            },
                            "playerTookTheField": true,
                            "shirtNum": 15,
                            "playerFirstInitial": "J",
                            "playerPositionAbbrev": "INT",
                            "onTheField": true,
                            "fantasyPrice": 238000,
                            "fantasySeasonPriceChange": 41000,
                            "fantasyRoundPriceChange": 8000
                        },
                        {
                            "playerFirstName": "Addin",
                            "playerId": 500449,
                            "playerLastName": "Fonua-Blake",
                            "playerName": "Addin Fonua-Blake",
                            "playerPosition": "Interchange",
                            "playerPositionId": 500014,
                            "playerStats": {
                                "allRunMetres": 150,
                                "allRuns": 13,
                                "decoys": 2,
                                "fantasyPointsTotal": 24,
                                "hitUps": 9,
                                "ineffectiveTackles": 1,
                                "kickReturnMetres": 62,
                                "kickReturns": 4,
                                "mins": 36,
                                "missedTackles": 1,
                                "passes": 4,
                                "passesPerRun": 0.31,
                                "supports": 3,
                                "tackles": 11,
                                "hitupRunMeters": 88,
                                "ptbAll": 11,
                                "receipts": 17,
                                "postContactMetres": 51,
                                "kickPressures": 1,
                                "ptbOneToTwo": 1,
                                "ptbTwoToThree": 3,
                                "ptbThreeToFour": 6,
                                "ptbFourToFive": 1,
                                "effectiveTacklePercentage": 84.6,
                                "stint1": 1544,
                                "stint2": 588
                            },
                            "playerTookTheField": true,
                            "shirtNum": 16,
                            "playerFirstInitial": "A",
                            "playerPositionAbbrev": "INT",
                            "onTheField": true,
                            "fantasyPrice": 193000
                        },
                        {
                            "playerFirstName": "Luke",
                            "playerId": 500103,
                            "playerLastName": "Burgess",
                            "playerName": "Luke Burgess",
                            "playerPosition": "Interchange",
                            "playerPositionId": 500014,
                            "playerStats": {
                                "allRunMetres": 74,
                                "allRuns": 8,
                                "decoys": 1,
                                "fantasyPointsTotal": 11,
                                "hitUps": 6,
                                "kickMetres": 15,
                                "kickReturnMetres": 23,
                                "kickReturns": 2,
                                "kicks": 1,
                                "mins": 20,
                                "missedTackles": 1,
                                "supports": 1,
                                "tackles": 6,
                                "hitupRunMeters": 51,
                                "ptbAll": 7,
                                "receipts": 8,
                                "forcedDropOutKicker": 1,
                                "chipKick": 1,
                                "postContactMetres": 18,
                                "dummyPasses": 1,
                                "ptbTwoToThree": 3,
                                "ptbThreeToFour": 2,
                                "ptbFourToFive": 2,
                                "doubles": 1,
                                "effectiveTacklePercentage": 85.7,
                                "stint1": 1210
                            },
                            "playerTookTheField": true,
                            "shirtNum": 21,
                            "playerFirstInitial": "L",
                            "playerPositionAbbrev": "INT",
                            "fantasyPrice": 250000,
                            "fantasySeasonPriceChange": -7000
                        }
                    ]
                },
                "teamName": "Manly-Warringah Sea Eagles",
                "teamNickName": "Sea Eagles",
                "teamStats": {
                    "allRunMetres": 2094,
                    "allRuns": 202,
                    "bombKicks": 3,
                    "bombKickMetres": 69,
                    "bombKicksDefused": 1,
                    "completeSets": 33,
                    "completionPercentage": 80,
                    "conversions": 3,
                    "conversionsAttempts": 7,
                    "conversionsMissed": 4,
                    "decoys": 26,
                    "dummyHalfRuns": 11,
                    "errors": 8,
                    "goalConversionRate": 50,
                    "allGoals": 4,
                    "allGoalsAttempted": 8,
                    "allGoalsMissed": 4,
                    "hitUps": 94,
                    "incompleteSets": 8,
                    "ineffectiveTackles": 12,
                    "intercepts": 1,
                    "kickMetres": 427,
                    "kickReturnMetres": 199,
                    "kickReturns": 16,
                    "kicks": 19,
                    "kicksDefused": 7,
                    "kicksNotDefused": 1,
                    "lineDropouts": 1,
                    "linebreakAssists": 5,
                    "linebreaks": 6,
                    "missedTackles": 17,
                    "offloads": 17,
                    "oneOnOneTackles": 12,
                    "passes": 253,
                    "passesPerRun": 1.25,
                    "penalties": 7,
                    "penaltyGoals": 1,
                    "penaltyGoalsAttempts": 1,
                    "points": 36,
                    "pointsConceded": 6,
                    "possession": 58,
                    "scrumWins": 10,
                    "supports": 78,
                    "tackleBreaks": 27,
                    "tackles": 279,
                    "sets": 41,
                    "tries": 7,
                    "triesConceded": 1,
                    "tryAssists": 5,
                    "tryCause": 2,
                    "trySaves": 1,
                    "hitupRunMeters": 1018,
                    "evasionRuns": 81,
                    "evasionRunMetres": 781,
                    "dummyHalfRunMetres": 96,
                    "ptbTotal": 150,
                    "twoManTackles": 71,
                    "threeManTackles": 65,
                    "fourManPlusTackles": 8,
                    "tryScoringPercentage": 21.21,
                    "shiftsLeft": 14,
                    "shiftsRight": 15,
                    "receipts": 458,
                    "forcedDropOutKicker": 1,
                    "chipKick": 4,
                    "grubberKick": 2,
                    "crossFieldKick": 2,
                    "postContactMetres": 561,
                    "dummyPasses": 8,
                    "kickPressures": 7,
                    "lineEngagedRuns": 15,
                    "ptbOneToTwo": 9,
                    "ptbTwoToThree": 49,
                    "ptbThreeToFour": 57,
                    "ptbFourToFive": 26,
                    "ptbFivePlus": 9,
                    "interchangeUsed": 7,
                    "interchangeLeft": 1,
                    "doubles": 59,
                    "longKicksSpace": 3,
                    "effectiveTacklePercentage": 90.6,
                    "ptbPenalties": 7,
                    "averageSetDistance": 51.1,
                    "completeSets1stHalf": 17,
                    "completeSets2ndHalf": 16,
                    "completionPercentage1stHalf": 80.95,
                    "completionPercentage2ndHalf": 80,
                    "incompleteSets1stHalf": 4,
                    "incompleteSets2ndHalf": 4,
                    "incompletionPercentage1stHalf": 19.05,
                    "incompletionPercentage2ndHalf": 20
                },
                "teamHexColour": "610a35",
                "teamHexColour2": "b4b4be"
            },
            {
                "score": {
                    "conversions": 1,
                    "points": 6,
                    "tries": 1
                },
                "team1stHalfScore": 0,
                "team2ndHalfScore": 6,
                "teamAbbr": "SGI",
                "teamFinalScore": 6,
                "teamFullTimeScore": 6,
                "teamHalfTimeScore": 0,
                "teamId": 500022,
                "teamLineup": {
                    "teamLineUpStatusID": 4,
                    "teamLineUpStatus": "Final",
                    "injuriesAndSuspensions": {
                        "injury": [],
                        "suspension": []
                    },
                    "insAndOuts": {
                        "inOut": [
                            {
                                "inOut": "In",
                                "playerFirstName": "Tariq",
                                "playerId": "500298",
                                "playerLastName": "Sims",
                                "playerName": "Tariq Sims"
                            },
                            {
                                "inOut": "Out",
                                "playerFirstName": "Will",
                                "playerId": "500631",
                                "playerLastName": "Matthews",
                                "playerName": "Will Matthews"
                            }
                        ]
                    },
                    "teamPlayer": [
                        {
                            "playerFirstName": "Josh",
                            "playerId": 500621,
                            "playerLastName": "Dugan",
                            "playerName": "Josh Dugan",
                            "playerPosition": "Fullback",
                            "playerPositionId": 500001,
                            "playerStats": {
                                "allRunMetres": 186,
                                "allRuns": 18,
                                "errors": 3,
                                "fantasyPointsTotal": 62,
                                "hitUps": 1,
                                "interceptedPass": 1,
                                "kickMetres": 6,
                                "kickReturnMetres": 71,
                                "kickReturns": 8,
                                "kicks": 1,
                                "kicksDefused": 6,
                                "kicksNotDefused": 1,
                                "lineDropouts": 1,
                                "linebreaks": 1,
                                "mins": 80,
                                "missedTackles": 2,
                                "passes": 6,
                                "passesPerRun": 0.33,
                                "oneOnOneTackles": 2,
                                "penalties": 1,
                                "points": 4,
                                "supports": 4,
                                "tackleBreaks": 3,
                                "tackles": 14,
                                "tries": 1,
                                "tryCause": 2,
                                "trySaves": 3,
                                "hitupRunMeters": 3,
                                "evasionRuns": 9,
                                "evasionRunMetres": 112,
                                "ptbAll": 15,
                                "receipts": 24,
                                "grubberKick": 1,
                                "postContactMetres": 55,
                                "dummyPasses": 1,
                                "lineEngagedRuns": 2,
                                "ptbOneToTwo": 1,
                                "ptbTwoToThree": 5,
                                "ptbThreeToFour": 7,
                                "ptbFourToFive": 2,
                                "doubles": 3,
                                "effectiveTacklePercentage": 87.5,
                                "ptbPenalties": 1,
                                "stint1": 4800
                            },
                            "playerTookTheField": true,
                            "shirtNum": 1,
                            "playerFirstInitial": "J",
                            "playerPositionAbbrev": "FB",
                            "onTheField": true,
                            "fantasyPrice": 366000,
                            "fantasySeasonPriceChange": -66000,
                            "fantasyRoundPriceChange": -25000
                        },
                        {
                            "playerFirstName": "Kalifa",
                            "playerId": 500822,
                            "playerLastName": "Faifai Loa",
                            "playerName": "Kalifa Faifai Loa",
                            "playerPosition": "Winger 1",
                            "playerPositionId": 500002,
                            "playerStats": {
                                "allRunMetres": 165,
                                "allRuns": 11,
                                "bombKicksDefused": 1,
                                "bombKicksNotDefused": 1,
                                "dummyHalfRuns": 3,
                                "errors": 2,
                                "fantasyPointsTotal": 24,
                                "hitUps": 1,
                                "ineffectiveTackles": 1,
                                "intercepts": 1,
                                "kickReturnMetres": 3,
                                "kickReturns": 1,
                                "kicksDefused": 2,
                                "kicksNotDefused": 2,
                                "mins": 76,
                                "missedTackles": 2,
                                "passes": 4,
                                "passesPerRun": 0.36,
                                "oneOnOneTackles": 1,
                                "supports": 5,
                                "tackleBreaks": 1,
                                "tackles": 6,
                                "tryCause": 2,
                                "trySaves": 1,
                                "hitupRunMeters": 7,
                                "evasionRuns": 6,
                                "evasionRunMetres": 115,
                                "dummyHalfRunMetres": 40,
                                "ptbAll": 10,
                                "receipts": 17,
                                "postContactMetres": 42,
                                "ptbTwoToThree": 5,
                                "ptbThreeToFour": 2,
                                "ptbFourToFive": 3,
                                "effectiveTacklePercentage": 66.7,
                                "stint1": 4541
                            },
                            "playerTookTheField": true,
                            "shirtNum": 2,
                            "playerFirstInitial": "K",
                            "playerPositionAbbrev": "WG",
                            "fantasyPrice": 218000,
                            "fantasySeasonPriceChange": -12000,
                            "fantasyRoundPriceChange": -5000
                        },
                        {
                            "playerFirstName": "Euan",
                            "playerId": 500441,
                            "playerLastName": "Aitken",
                            "playerName": "Euan Aitken",
                            "playerPosition": "Centre 1",
                            "playerPositionId": 500003,
                            "playerStats": {
                                "allRunMetres": 135,
                                "allRuns": 11,
                                "errors": 1,
                                "fantasyPointsTotal": 37,
                                "ineffectiveTackles": 2,
                                "linebreaks": 1,
                                "mins": 80,
                                "missedTackles": 4,
                                "offloads": 1,
                                "passes": 2,
                                "passesPerRun": 0.18,
                                "oneOnOneTackles": 2,
                                "penalties": 1,
                                "supports": 5,
                                "tackleBreaks": 3,
                                "tackles": 21,
                                "tryCause": 3,
                                "evasionRuns": 11,
                                "evasionRunMetres": 135,
                                "ptbAll": 9,
                                "receipts": 13,
                                "postContactMetres": 26,
                                "kickPressures": 1,
                                "ptbOneToTwo": 1,
                                "ptbTwoToThree": 3,
                                "ptbThreeToFour": 2,
                                "ptbFourToFive": 2,
                                "ptbFivePlus": 1,
                                "doubles": 3,
                                "effectiveTacklePercentage": 77.8,
                                "ptbPenalties": 1,
                                "stint1": 4800
                            },
                            "playerTookTheField": true,
                            "shirtNum": 3,
                            "playerFirstInitial": "E",
                            "playerPositionAbbrev": "CT",
                            "onTheField": true,
                            "fantasyPrice": 394000,
                            "fantasySeasonPriceChange": 17000,
                            "fantasyRoundPriceChange": 14000
                        },
                        {
                            "playerFirstName": "Timoteo",
                            "playerId": 500229,
                            "playerLastName": "Lafai",
                            "playerName": "Timoteo Lafai",
                            "playerPosition": "Centre 2",
                            "playerPositionId": 500004,
                            "playerStats": {
                                "allRunMetres": 80,
                                "allRuns": 9,
                                "errors": 1,
                                "fantasyPointsTotal": 20,
                                "ineffectiveTackles": 1,
                                "mins": 80,
                                "missedTackles": 2,
                                "offloads": 1,
                                "passes": 1,
                                "passesPerRun": 0.11,
                                "oneOnOneTackles": 2,
                                "supports": 5,
                                "tackleBreaks": 1,
                                "tackles": 8,
                                "tryCause": 1,
                                "trySaves": 1,
                                "evasionRuns": 9,
                                "evasionRunMetres": 80,
                                "ptbAll": 6,
                                "receipts": 7,
                                "postContactMetres": 20,
                                "dummyPasses": 1,
                                "ptbTwoToThree": 3,
                                "ptbThreeToFour": 3,
                                "effectiveTacklePercentage": 72.7,
                                "stint1": 4800
                            },
                            "playerTookTheField": true,
                            "shirtNum": 4,
                            "playerFirstInitial": "T",
                            "playerPositionAbbrev": "CT",
                            "onTheField": true,
                            "fantasyPrice": 257000,
                            "fantasySeasonPriceChange": 13000,
                            "fantasyRoundPriceChange": 14000
                        },
                        {
                            "playerFirstName": "Jason",
                            "playerId": 500634,
                            "playerLastName": "Nightingale",
                            "playerName": "Jason Nightingale",
                            "playerPosition": "Winger 2",
                            "playerPositionId": 500005,
                            "playerStats": {
                                "allRunMetres": 61,
                                "allRuns": 10,
                                "bombKicksDefused": 1,
                                "fantasyPointsTotal": 12,
                                "ineffectiveTackles": 1,
                                "kickReturnMetres": 2,
                                "kickReturns": 2,
                                "kicksDefused": 2,
                                "mins": 80,
                                "passes": 2,
                                "passesPerRun": 0.2,
                                "supports": 6,
                                "tackleBreaks": 1,
                                "tackles": 1,
                                "tryCause": 1,
                                "evasionRuns": 8,
                                "evasionRunMetres": 59,
                                "ptbAll": 10,
                                "receipts": 13,
                                "postContactMetres": 14,
                                "ptbZeroToOne": 2,
                                "ptbOneToTwo": 1,
                                "ptbTwoToThree": 2,
                                "ptbThreeToFour": 4,
                                "ptbFourToFive": 1,
                                "effectiveTacklePercentage": 50,
                                "stint1": 4800
                            },
                            "playerTookTheField": true,
                            "shirtNum": 5,
                            "playerFirstInitial": "J",
                            "playerPositionAbbrev": "WG",
                            "onTheField": true,
                            "fantasyPrice": 320000,
                            "fantasySeasonPriceChange": 38000,
                            "fantasyRoundPriceChange": -1000
                        },
                        {
                            "playerFirstName": "Gareth",
                            "playerId": 500641,
                            "playerLastName": "Widdop",
                            "playerName": "Gareth Widdop",
                            "playerPosition": "Five-Eighth",
                            "playerPositionId": 500006,
                            "playerStats": {
                                "allRunMetres": 55,
                                "allRuns": 8,
                                "conversions": 1,
                                "conversionsAttempts": 1,
                                "dummyHalfRuns": 1,
                                "errors": 3,
                                "fantasyPointsTotal": 20,
                                "goalConversionRate": 100,
                                "allGoals": 1,
                                "allGoalsAttempted": 1,
                                "ineffectiveTackles": 2,
                                "kickMetres": 52,
                                "kicks": 3,
                                "linebreakAssists": 1,
                                "mins": 80,
                                "missedTackles": 1,
                                "passes": 20,
                                "passesPerRun": 2.5,
                                "oneOnOneTackles": 1,
                                "points": 2,
                                "supports": 2,
                                "tackles": 12,
                                "tryAssists": 1,
                                "tryCause": 1,
                                "evasionRuns": 7,
                                "evasionRunMetres": 45,
                                "dummyHalfRunMetres": 10,
                                "ptbAll": 4,
                                "receipts": 30,
                                "chipKick": 1,
                                "crossFieldKick": 1,
                                "postContactMetres": 6,
                                "dummyPasses": 2,
                                "lineEngagedRuns": 2,
                                "ptbTwoToThree": 1,
                                "ptbThreeToFour": 2,
                                "ptbFivePlus": 1,
                                "doubles": 1,
                                "effectiveTacklePercentage": 80,
                                "stint1": 4800
                            },
                            "playerTookTheField": true,
                            "shirtNum": 6,
                            "playerFirstInitial": "G",
                            "playerPositionAbbrev": "FE",
                            "onTheField": true,
                            "fantasyPrice": 367000,
                            "fantasySeasonPriceChange": -15000,
                            "fantasyRoundPriceChange": 21000
                        },
                        {
                            "playerFirstName": "Benji",
                            "playerId": 500948,
                            "playerLastName": "Marshall",
                            "playerName": "Benji Marshall",
                            "playerPosition": "Halfback",
                            "playerPositionId": 500007,
                            "playerStats": {
                                "allRunMetres": 71,
                                "allRuns": 10,
                                "bombKicks": 1,
                                "bombKickMetres": 27,
                                "errors": 1,
                                "fantasyPointsTotal": 30,
                                "ineffectiveTackles": 1,
                                "kickMetres": 217,
                                "kicks": 8,
                                "kicksNotDefused": 1,
                                "linebreakAssists": 1,
                                "mins": 80,
                                "missedTackles": 4,
                                "offloads": 1,
                                "passes": 21,
                                "passesPerRun": 2.1,
                                "oneOnOneTackles": 1,
                                "supports": 1,
                                "tackles": 19,
                                "tryCause": 2,
                                "evasionRuns": 10,
                                "evasionRunMetres": 71,
                                "ptbAll": 1,
                                "receipts": 31,
                                "forcedDropOutKicker": 1,
                                "chipKick": 1,
                                "grubberKick": 1,
                                "crossFieldKick": 1,
                                "postContactMetres": 2,
                                "kickPressures": 1,
                                "lineEngagedRuns": 8,
                                "ptbThreeToFour": 1,
                                "doubles": 1,
                                "longKicksSpace": 3,
                                "effectiveTacklePercentage": 79.2,
                                "stint1": 4800
                            },
                            "playerTookTheField": true,
                            "shirtNum": 7,
                            "playerFirstInitial": "B",
                            "playerPositionAbbrev": "HB",
                            "onTheField": true,
                            "fantasyPrice": 282000,
                            "fantasySeasonPriceChange": -18000,
                            "fantasyRoundPriceChange": 25000
                        },
                        {
                            "playerFirstName": "Leeson",
                            "playerId": 500614,
                            "playerLastName": "Ah Mau",
                            "playerName": "Leeson Ah Mau",
                            "playerPosition": "Prop 1",
                            "playerPositionId": 500008,
                            "playerStats": {
                                "allRunMetres": 82,
                                "allRuns": 8,
                                "decoys": 1,
                                "fantasyPointsTotal": 38,
                                "hitUps": 6,
                                "ineffectiveTackles": 2,
                                "kickReturnMetres": 27,
                                "kickReturns": 2,
                                "mins": 36,
                                "offloads": 1,
                                "oneOnOneTackles": 1,
                                "supports": 4,
                                "tackles": 23,
                                "trySaves": 1,
                                "hitupRunMeters": 55,
                                "ptbAll": 7,
                                "receipts": 8,
                                "postContactMetres": 28,
                                "dummyPasses": 2,
                                "kickPressures": 2,
                                "ptbOneToTwo": 1,
                                "ptbTwoToThree": 3,
                                "ptbThreeToFour": 2,
                                "ptbFourToFive": 1,
                                "doubles": 3,
                                "effectiveTacklePercentage": 92,
                                "stint1": 1374,
                                "stint2": 775
                            },
                            "playerTookTheField": true,
                            "shirtNum": 8,
                            "playerFirstInitial": "L",
                            "playerPositionAbbrev": "PR",
                            "onTheField": true,
                            "fantasyPrice": 291000,
                            "fantasySeasonPriceChange": -66000,
                            "fantasyRoundPriceChange": -5000
                        },
                        {
                            "playerFirstName": "Mitch",
                            "playerId": 500636,
                            "playerLastName": "Rein",
                            "playerName": "Mitch Rein",
                            "playerPosition": "Hooker",
                            "playerPositionId": 500009,
                            "playerStats": {
                                "allRunMetres": 42,
                                "allRuns": 5,
                                "dummyHalfRuns": 3,
                                "errors": 1,
                                "fantasyPointsTotal": 58,
                                "ineffectiveTackles": 6,
                                "mins": 80,
                                "missedTackles": 2,
                                "passes": 96,
                                "passesPerRun": 19.2,
                                "oneOnOneTackles": 2,
                                "penalties": 2,
                                "tackleBreaks": 1,
                                "tackles": 56,
                                "trySaves": 1,
                                "evasionRuns": 2,
                                "evasionRunMetres": 18,
                                "dummyHalfRunMetres": 24,
                                "receipts": 95,
                                "postContactMetres": 2,
                                "lineEngagedRuns": 4,
                                "doubles": 13,
                                "effectiveTacklePercentage": 87.5,
                                "ptbPenalties": 2,
                                "stint1": 4800
                            },
                            "playerTookTheField": true,
                            "shirtNum": 9,
                            "playerFirstInitial": "M",
                            "playerPositionAbbrev": "HK",
                            "onTheField": true,
                            "fantasyPrice": 433000,
                            "fantasySeasonPriceChange": -13000,
                            "fantasyRoundPriceChange": 19000
                        },
                        {
                            "playerFirstName": "Russell",
                            "playerId": 502631,
                            "playerLastName": "Packer",
                            "playerName": "Russell Packer",
                            "playerPosition": "Prop 2",
                            "playerPositionId": 500010,
                            "playerStats": {
                                "allRunMetres": 92,
                                "allRuns": 10,
                                "decoys": 3,
                                "fantasyPointsTotal": 37,
                                "hitUps": 10,
                                "ineffectiveTackles": 1,
                                "mins": 38,
                                "missedTackles": 1,
                                "passes": 1,
                                "passesPerRun": 0.1,
                                "supports": 2,
                                "tackles": 25,
                                "tryCause": 1,
                                "trySaves": 1,
                                "hitupRunMeters": 92,
                                "ptbAll": 10,
                                "receipts": 11,
                                "postContactMetres": 32,
                                "kickPressures": 1,
                                "ptbOneToTwo": 1,
                                "ptbTwoToThree": 6,
                                "ptbThreeToFour": 3,
                                "doubles": 4,
                                "effectiveTacklePercentage": 92.6,
                                "stint1": 1374,
                                "stint2": 927
                            },
                            "playerTookTheField": true,
                            "shirtNum": 10,
                            "playerFirstInitial": "R",
                            "playerPositionAbbrev": "PR",
                            "onTheField": true,
                            "fantasyPrice": 309000,
                            "fantasySeasonPriceChange": 98000
                        },
                        {
                            "playerFirstName": "Tyson",
                            "playerId": 500622,
                            "playerLastName": "Frizell",
                            "playerName": "Tyson Frizell",
                            "playerPosition": "2nd Row 1",
                            "playerPositionId": 500011,
                            "playerStats": {
                                "allRunMetres": 46,
                                "allRuns": 5,
                                "decoys": 4,
                                "fantasyPointsTotal": 45,
                                "hitUps": 5,
                                "mins": 52,
                                "missedTackles": 1,
                                "passes": 1,
                                "passesPerRun": 0.2,
                                "oneOnOneTackles": 2,
                                "penalties": 1,
                                "supports": 4,
                                "tackleBreaks": 1,
                                "tackles": 37,
                                "trySaves": 1,
                                "hitupRunMeters": 46,
                                "ptbAll": 4,
                                "receipts": 6,
                                "postContactMetres": 21,
                                "kickPressures": 1,
                                "ptbZeroToOne": 1,
                                "ptbTwoToThree": 1,
                                "ptbThreeToFour": 2,
                                "doubles": 5,
                                "effectiveTacklePercentage": 97.4,
                                "ptbPenalties": 1,
                                "stint1": 3118
                            },
                            "playerTookTheField": true,
                            "shirtNum": 11,
                            "playerFirstInitial": "T",
                            "playerPositionAbbrev": "2R",
                            "fantasyPrice": 438000,
                            "fantasySeasonPriceChange": -21000,
                            "fantasyRoundPriceChange": -13000
                        },
                        {
                            "playerFirstName": "Joel",
                            "playerId": 500640,
                            "playerLastName": "Thompson",
                            "playerName": "Joel Thompson",
                            "playerPosition": "2nd Row 2",
                            "playerPositionId": 500012,
                            "playerStats": {
                                "allRunMetres": 113,
                                "allRuns": 13,
                                "decoys": 4,
                                "errors": 1,
                                "fantasyPointsTotal": 33,
                                "hitUps": 13,
                                "ineffectiveTackles": 3,
                                "mins": 80,
                                "missedTackles": 1,
                                "passes": 1,
                                "passesPerRun": 0.08,
                                "oneOnOneTackles": 2,
                                "penalties": 3,
                                "supports": 5,
                                "tackles": 27,
                                "trySaves": 1,
                                "hitupRunMeters": 113,
                                "ptbAll": 13,
                                "receipts": 15,
                                "postContactMetres": 39,
                                "kickPressures": 1,
                                "ptbThreeToFour": 10,
                                "ptbFourToFive": 2,
                                "ptbFivePlus": 1,
                                "doubles": 2,
                                "effectiveTacklePercentage": 87.1,
                                "ptbPenalties": 2,
                                "foulPlayPenalties": 1,
                                "stint1": 4800
                            },
                            "playerTookTheField": true,
                            "shirtNum": 12,
                            "playerFirstInitial": "J",
                            "playerPositionAbbrev": "2R",
                            "onTheField": true,
                            "fantasyPrice": 350000,
                            "fantasySeasonPriceChange": -9000,
                            "fantasyRoundPriceChange": 15000
                        },
                        {
                            "playerFirstName": "Jack",
                            "playerId": 500619,
                            "playerLastName": "de Belin",
                            "playerName": "Jack de Belin",
                            "playerPosition": "Lock",
                            "playerPositionId": 500013,
                            "playerStats": {
                                "allRunMetres": 98,
                                "allRuns": 12,
                                "decoys": 1,
                                "fantasyPointsTotal": 89,
                                "hitUps": 6,
                                "ineffectiveTackles": 1,
                                "mins": 60,
                                "passes": 9,
                                "passesPerRun": 0.75,
                                "supports": 4,
                                "tackleBreaks": 3,
                                "tackles": 61,
                                "tryCause": 1,
                                "trySaves": 2,
                                "hitupRunMeters": 56,
                                "evasionRuns": 6,
                                "evasionRunMetres": 42,
                                "ptbAll": 5,
                                "receipts": 15,
                                "postContactMetres": 16,
                                "dummyPasses": 2,
                                "kickPressures": 2,
                                "lineEngagedRuns": 6,
                                "ptbOneToTwo": 1,
                                "ptbTwoToThree": 3,
                                "ptbFourToFive": 1,
                                "doubles": 15,
                                "effectiveTacklePercentage": 98.4,
                                "stint1": 1943,
                                "stint2": 1682
                            },
                            "playerTookTheField": true,
                            "shirtNum": 13,
                            "playerFirstInitial": "J",
                            "playerPositionAbbrev": "LK",
                            "onTheField": true,
                            "fantasyPrice": 445000,
                            "fantasySeasonPriceChange": 16000,
                            "fantasyRoundPriceChange": -29000
                        },
                        {
                            "playerFirstName": "Tariq",
                            "playerId": 500298,
                            "playerLastName": "Sims",
                            "playerName": "Tariq Sims",
                            "playerPosition": "Interchange",
                            "playerPositionId": 500014,
                            "playerStats": {
                                "allRunMetres": 82,
                                "allRuns": 8,
                                "decoys": 2,
                                "fantasyPointsTotal": 32,
                                "hitUps": 8,
                                "kicksDefused": 1,
                                "mins": 42,
                                "missedTackles": 2,
                                "passes": 4,
                                "passesPerRun": 0.5,
                                "oneOnOneTackles": 2,
                                "penalties": 1,
                                "supports": 1,
                                "tackles": 29,
                                "hitupRunMeters": 82,
                                "ptbAll": 6,
                                "receipts": 12,
                                "postContactMetres": 26,
                                "ptbOneToTwo": 1,
                                "ptbTwoToThree": 2,
                                "ptbThreeToFour": 2,
                                "ptbFourToFive": 1,
                                "doubles": 4,
                                "effectiveTacklePercentage": 93.5,
                                "ptbPenalties": 1,
                                "stint1": 2499
                            },
                            "playerTookTheField": true,
                            "shirtNum": 14,
                            "playerFirstInitial": "T",
                            "playerPositionAbbrev": "INT"
                        },
                        {
                            "playerFirstName": "Jacob",
                            "playerId": 500453,
                            "playerLastName": "Host",
                            "playerName": "Jacob Host",
                            "playerPosition": "Interchange",
                            "playerPositionId": 500014,
                            "playerStats": {
                                "allRunMetres": 38,
                                "allRuns": 4,
                                "decoys": 3,
                                "fantasyPointsTotal": 25,
                                "hitUps": 4,
                                "mins": 48,
                                "missedTackles": 2,
                                "passes": 2,
                                "passesPerRun": 0.5,
                                "oneOnOneTackles": 1,
                                "supports": 4,
                                "tackles": 26,
                                "hitupRunMeters": 38,
                                "ptbAll": 4,
                                "receipts": 6,
                                "postContactMetres": 16,
                                "ptbTwoToThree": 3,
                                "ptbThreeToFour": 1,
                                "doubles": 2,
                                "effectiveTacklePercentage": 92.9,
                                "stint1": 2874
                            },
                            "playerTookTheField": true,
                            "shirtNum": 15,
                            "playerFirstInitial": "J",
                            "playerPositionAbbrev": "INT",
                            "onTheField": true,
                            "fantasyPrice": 151000
                        },
                        {
                            "playerFirstName": "Dunamis",
                            "playerId": 500957,
                            "playerLastName": "Lui",
                            "playerName": "Dunamis Lui",
                            "playerPosition": "Interchange",
                            "playerPositionId": 500014,
                            "playerStats": {
                                "allRunMetres": 39,
                                "allRuns": 4,
                                "decoys": 1,
                                "errors": 1,
                                "fantasyPointsTotal": 9,
                                "hitUps": 4,
                                "ineffectiveTackles": 1,
                                "mins": 15,
                                "missedTackles": 3,
                                "tackleBreaks": 3,
                                "tackles": 5,
                                "tryCause": 1,
                                "hitupRunMeters": 39,
                                "ptbAll": 3,
                                "receipts": 4,
                                "postContactMetres": 22,
                                "ptbOneToTwo": 1,
                                "ptbTwoToThree": 2,
                                "doubles": 1,
                                "effectiveTacklePercentage": 55.6,
                                "stint1": 907
                            },
                            "playerTookTheField": true,
                            "shirtNum": 16,
                            "playerFirstInitial": "D",
                            "playerPositionAbbrev": "INT",
                            "fantasyPrice": 177000,
                            "fantasySeasonPriceChange": -64000,
                            "fantasyRoundPriceChange": 2000
                        },
                        {
                            "playerFirstName": "Jake",
                            "playerId": 501088,
                            "playerLastName": "Marketo",
                            "playerName": "Jake Marketo",
                            "playerPosition": "Interchange",
                            "playerPositionId": 500014,
                            "playerStats": {
                                "allRunMetres": 39,
                                "allRuns": 5,
                                "decoys": 2,
                                "fantasyPointsTotal": 29,
                                "hitUps": 5,
                                "ineffectiveTackles": 1,
                                "mins": 33,
                                "offloads": 1,
                                "passes": 2,
                                "passesPerRun": 0.4,
                                "supports": 2,
                                "tackles": 24,
                                "hitupRunMeters": 39,
                                "ptbAll": 4,
                                "receipts": 7,
                                "postContactMetres": 10,
                                "kickPressures": 1,
                                "ptbTwoToThree": 2,
                                "ptbFourToFive": 2,
                                "doubles": 5,
                                "effectiveTacklePercentage": 96,
                                "stint1": 1744,
                                "stint2": 259
                            },
                            "playerTookTheField": true,
                            "shirtNum": 17,
                            "playerFirstInitial": "J",
                            "playerPositionAbbrev": "INT",
                            "onTheField": true,
                            "fantasyPrice": 256000,
                            "fantasySeasonPriceChange": 51000,
                            "fantasyRoundPriceChange": 3000
                        }
                    ]
                },
                "teamName": "St. George Illawarra Dragons",
                "teamNickName": "Dragons",
                "teamStats": {
                    "allRunMetres": 1425,
                    "allRuns": 151,
                    "bombKicks": 1,
                    "bombKickMetres": 27,
                    "bombKicksDefused": 2,
                    "bombKicksNotDefused": 1,
                    "completeSets": 20,
                    "completionPercentage": 59,
                    "conversions": 1,
                    "conversionsAttempts": 1,
                    "decoys": 21,
                    "dummyHalfRuns": 7,
                    "errors": 14,
                    "goalConversionRate": 100,
                    "allGoals": 1,
                    "allGoalsAttempted": 1,
                    "hitUps": 63,
                    "incompleteSets": 14,
                    "ineffectiveTackles": 23,
                    "interceptedPass": 1,
                    "intercepts": 1,
                    "kickMetres": 275,
                    "kickReturnMetres": 102,
                    "kickReturns": 13,
                    "kicks": 12,
                    "kicksDefused": 11,
                    "kicksNotDefused": 4,
                    "lineDropouts": 1,
                    "linebreakAssists": 2,
                    "linebreaks": 2,
                    "missedTackles": 27,
                    "offloads": 5,
                    "oneOnOneTackles": 19,
                    "passes": 172,
                    "passesPerRun": 1.14,
                    "penalties": 9,
                    "points": 6,
                    "pointsConceded": 36,
                    "possession": 42,
                    "scrumWins": 3,
                    "supports": 54,
                    "tackleBreaks": 17,
                    "tackles": 394,
                    "sets": 34,
                    "tries": 1,
                    "triesConceded": 7,
                    "tryAssists": 1,
                    "tryCause": 15,
                    "trySaves": 12,
                    "hitupRunMeters": 570,
                    "evasionRuns": 68,
                    "evasionRunMetres": 678,
                    "dummyHalfRunMetres": 75,
                    "ptbTotal": 111,
                    "twoManTackles": 61,
                    "threeManTackles": 45,
                    "fourManPlusTackles": 1,
                    "tryScoringPercentage": 5,
                    "shiftsLeft": 7,
                    "shiftsRight": 8,
                    "receipts": 314,
                    "forcedDropOutKicker": 1,
                    "chipKick": 2,
                    "grubberKick": 2,
                    "crossFieldKick": 2,
                    "postContactMetres": 377,
                    "dummyPasses": 8,
                    "kickPressures": 10,
                    "lineEngagedRuns": 22,
                    "ptbZeroToOne": 3,
                    "ptbOneToTwo": 8,
                    "ptbTwoToThree": 41,
                    "ptbThreeToFour": 41,
                    "ptbFourToFive": 15,
                    "ptbFivePlus": 3,
                    "interchangeUsed": 7,
                    "interchangeLeft": 1,
                    "doubles": 62,
                    "longKicksSpace": 3,
                    "effectiveTacklePercentage": 88.7,
                    "ptbPenalties": 8,
                    "foulPlayPenalties": 1,
                    "averageSetDistance": 41.9,
                    "completeSets1stHalf": 9,
                    "completeSets2ndHalf": 11,
                    "completionPercentage1stHalf": 56.25,
                    "completionPercentage2ndHalf": 61.11,
                    "incompleteSets1stHalf": 7,
                    "incompleteSets2ndHalf": 7,
                    "incompletionPercentage1stHalf": 43.75,
                    "incompletionPercentage2ndHalf": 38.89
                },
                "teamHexColour": "fe000b",
                "teamHexColour2": "b4b4be"
            }
        ]
    }
}