{
    "competitionId": 111,
    "competitionName": "NRL Telstra Premiership",
    "gameId": 20151110470,
    "gameInfo": {
        "assistantReferee1Id": 500024,
        "numberOfPeriods": 2,
        "assistantReferee1Name": "Rickey MacFarlane",
        "assistantReferee2Id": 500032,
        "assistantReferee2Name": "Adam Reid",
        "gameDate": "2015-03-29",
        "gameHashTag": "#NRLRoostersRaiders",
        "gameNumber": 7,
        "gameSeconds": 4800,
        "gameTime": "1:20:00",
        "groundConditionId": 2,
        "groundConditionName": "Good",
        "referee1Id": 500011,
        "referee1Name": "Adam Devcich",
        "referee2Id": 500005,
        "referee2Name": "Gavin Reynolds",
        "startTime": "2015-03-29T14:00:00",
        "startTimeUTC": "2015-03-29T03:00:00Z",
        "venueId": 500001,
        "venueName": "Allianz Stadium",
        "videoReferee1Id": 500203,
        "videoReferee1Name": "Ben Galea",
        "videoReferee2Id": 500039,
        "videoReferee2Name": "Ashley Klein",
        "weatherId": 2,
        "weatherName": "Fine"
    },
    "gameState": "Final",
    "gameStateId": 8,
    "roundId": 4,
    "seasonId": 2015,
    "teams": {
        "teamsMatch": [
            {
                "isHomeTeam": true,
                "score": {
                    "conversions": 5,
                    "points": 34,
                    "tries": 6
                },
                "team1stHalfScore": 18,
                "team2ndHalfScore": 16,
                "teamAbbr": "SYD",
                "teamFinalScore": 34,
                "teamFullTimeScore": 34,
                "teamHalfTimeScore": 18,
                "teamId": 500001,
                "teamLineup": {
                    "injuriesAndSuspensions": {
                        "injury": [],
                        "suspension": []
                    },
                    "insAndOuts": {
                        "inOut": []
                    },
                    "teamPlayer": [
                        {
                            "playerFirstName": "Roger",
                            "playerId": 500005,
                            "playerLastName": "Tuivasa-Sheck",
                            "playerName": "Roger Tuivasa-Sheck",
                            "playerPosition": "Fullback",
                            "playerPositionId": 500001,
                            "playerStats": {
                                "allRunMetres": 207,
                                "allRuns": 23,
                                "bombKicksDefused": 1,
                                "decoys": 1,
                                "fantasyPointsTotal": 52,
                                "kickReturnMetres": 54,
                                "kickReturns": 7,
                                "kicksDefused": 2,
                                "linebreakAssists": 1,
                                "linebreaks": 1,
                                "mins": 80,
                                "missedTackles": 3,
                                "offloads": 1,
                                "supports": 20,
                                "tackleBreaks": 4,
                                "tackles": 3,
                                "tries": 1,
                                "tryAssists": 1,
                                "tryCause": 1,
                                "evasionRuns": 16,
                                "evasionRunMetres": 153,
                                "ptbFast": 5,
                                "ptbNeutral": 95,
                                "ptbAll": 20
                            },
                            "playerTookTheField": true,
                            "shirtNum": 1
                        },
                        {
                            "playerFirstName": "Daniel",
                            "playerId": 500002,
                            "playerLastName": "Tupou",
                            "playerName": "Daniel Tupou",
                            "playerPosition": "Winger 1",
                            "playerPositionId": 500002,
                            "playerStats": {
                                "allRunMetres": 118,
                                "allRuns": 12,
                                "bombKicksDefused": 1,
                                "dummyHalfRuns": 2,
                                "fantasyPointsTotal": 44,
                                "kickReturnMetres": 20,
                                "kickReturns": 2,
                                "kicksDefused": 1,
                                "linebreaks": 1,
                                "mins": 80,
                                "offloads": 2,
                                "supports": 11,
                                "tackleBreaks": 3,
                                "tackles": 2,
                                "tries": 1,
                                "tryAssists": 1,
                                "evasionRuns": 8,
                                "evasionRunMetres": 80,
                                "dummyHalfRunMetres": 18,
                                "ptbFast": 11.11,
                                "ptbNeutral": 88.89,
                                "ptbAll": 9
                            },
                            "playerTookTheField": true,
                            "shirtNum": 2
                        },
                        {
                            "playerFirstName": "Michael",
                            "playerId": 500003,
                            "playerLastName": "Jennings",
                            "playerName": "Michael Jennings",
                            "playerPosition": "Centre 1",
                            "playerPositionId": 500003,
                            "playerStats": {
                                "allRunMetres": 137,
                                "allRuns": 15,
                                "dummyHalfRuns": 2,
                                "errors": 3,
                                "fantasyPointsTotal": 49,
                                "hitUps": 1,
                                "kicksDefused": 1,
                                "linebreakAssists": 1,
                                "linebreaks": 1,
                                "mins": 80,
                                "oneOnOneTackles": 1,
                                "supports": 12,
                                "tackleBreaks": 6,
                                "tackles": 9,
                                "tries": 1,
                                "hitupRunMeters": 4,
                                "evasionRuns": 12,
                                "evasionRunMetres": 117,
                                "dummyHalfRunMetres": 16,
                                "ptbFast": 45.45,
                                "ptbNeutral": 54.55,
                                "ptbAll": 11
                            },
                            "playerTookTheField": true,
                            "shirtNum": 3
                        },
                        {
                            "playerFirstName": "Blake",
                            "playerId": 501569,
                            "playerLastName": "Ferguson",
                            "playerName": "Blake Ferguson",
                            "playerPosition": "Centre 2",
                            "playerPositionId": 500004,
                            "playerStats": {
                                "allRunMetres": 146,
                                "allRuns": 9,
                                "dummyHalfRuns": 1,
                                "errors": 3,
                                "fantasyPointsTotal": 48,
                                "ineffectiveTackles": 1,
                                "linebreakAssists": 1,
                                "linebreaks": 2,
                                "mins": 58,
                                "missedTackles": 2,
                                "oneOnOneTackles": 3,
                                "supports": 12,
                                "tackleBreaks": 4,
                                "tackles": 9,
                                "tries": 1,
                                "tryAssists": 1,
                                "tryCause": 1,
                                "evasionRuns": 8,
                                "evasionRunMetres": 134,
                                "dummyHalfRunMetres": 12,
                                "ptbFast": 33.33,
                                "ptbNeutral": 66.67,
                                "ptbAll": 6
                            },
                            "playerTookTheField": true,
                            "shirtNum": 4
                        },
                        {
                            "playerFirstName": "Shaun",
                            "playerId": 500004,
                            "playerLastName": "Kenny-Dowall",
                            "playerName": "Shaun Kenny-Dowall",
                            "playerPosition": "Winger 2",
                            "playerPositionId": 500005,
                            "playerStats": {
                                "allRunMetres": 142,
                                "allRuns": 17,
                                "bombKicksDefused": 1,
                                "decoys": 1,
                                "dummyHalfRuns": 3,
                                "fantasyPointsTotal": 29,
                                "hitUps": 1,
                                "kickReturnMetres": 9,
                                "kickReturns": 1,
                                "kicksDefused": 2,
                                "linebreaks": 1,
                                "mins": 80,
                                "missedTackles": 1,
                                "penalties": 1,
                                "supports": 11,
                                "tackles": 5,
                                "tries": 1,
                                "tryCause": 1,
                                "hitupRunMeters": 9,
                                "evasionRuns": 12,
                                "evasionRunMetres": 96,
                                "dummyHalfRunMetres": 28,
                                "ptbFast": 26.67,
                                "ptbNeutral": 73.33,
                                "ptbAll": 15
                            },
                            "playerTookTheField": true,
                            "shirtNum": 5
                        },
                        {
                            "playerFirstName": "James",
                            "playerId": 500006,
                            "playerLastName": "Maloney",
                            "playerName": "James Maloney",
                            "playerPosition": "Five-eighth",
                            "playerPositionId": 500006,
                            "playerStats": {
                                "allRunMetres": 120,
                                "allRuns": 9,
                                "conversions": 5,
                                "conversionsAttempts": 6,
                                "conversionsMissed": 1,
                                "decoys": 2,
                                "dummyHalfRuns": 1,
                                "errors": 3,
                                "fantasyPointsTotal": 57,
                                "ineffectiveTackles": 2,
                                "kickMetres": 120,
                                "kicks": 5,
                                "lineDropouts": 1,
                                "linebreakAssists": 1,
                                "mins": 80,
                                "missedTackles": 2,
                                "oneOnOneTackles": 1,
                                "supports": 11,
                                "tackleBreaks": 2,
                                "tackles": 18,
                                "tries": 1,
                                "tryAssists": 1,
                                "evasionRuns": 8,
                                "evasionRunMetres": 108,
                                "dummyHalfRunMetres": 12,
                                "ptbFast": 20,
                                "ptbNeutral": 80,
                                "ptbAll": 5
                            },
                            "playerTookTheField": true,
                            "shirtNum": 6
                        },
                        {
                            "playerFirstName": "Mitchell",
                            "playerId": 500007,
                            "playerLastName": "Pearce",
                            "playerName": "Mitchell Pearce",
                            "playerPosition": "Halfback",
                            "playerPositionId": 500007,
                            "playerStats": {
                                "allRunMetres": 62,
                                "allRuns": 12,
                                "bombKicks": 5,
                                "bombKickMetres": 117,
                                "fantasyPointsTotal": 56,
                                "ineffectiveTackles": 1,
                                "kickMetres": 464,
                                "kicks": 13,
                                "linebreakAssists": 2,
                                "mins": 80,
                                "missedTackles": 1,
                                "offloads": 2,
                                "oneOnOneTackles": 1,
                                "penalties": 1,
                                "supports": 22,
                                "tackles": 13,
                                "tryAssists": 2,
                                "evasionRuns": 12,
                                "evasionRunMetres": 62,
                                "ptbFast": 16.67,
                                "ptbNeutral": 66.67,
                                "ptbSlow": 16.67,
                                "ptbAll": 6
                            },
                            "playerTookTheField": true,
                            "shirtNum": 7,
                            "isCaptain": true
                        },
                        {
                            "playerFirstName": "Jared",
                            "playerId": 500008,
                            "playerLastName": "Waerea-Hargreaves",
                            "playerName": "Jared Waerea-Hargreaves",
                            "playerPosition": "Prop 1",
                            "playerPositionId": 500008,
                            "playerStats": {
                                "allRunMetres": 57,
                                "allRuns": 6,
                                "decoys": 2,
                                "fantasyPointsTotal": 24,
                                "hitUps": 4,
                                "ineffectiveTackles": 1,
                                "kickReturnMetres": 26,
                                "kickReturns": 2,
                                "mins": 29,
                                "offloads": 1,
                                "supports": 2,
                                "tackles": 17,
                                "hitupRunMeters": 31,
                                "ptbNeutral": 100,
                                "ptbAll": 4
                            },
                            "playerTookTheField": true,
                            "shirtNum": 8
                        },
                        {
                            "playerFirstName": "Matt",
                            "playerId": 500325,
                            "playerLastName": "McIlwrick",
                            "playerName": "Matt McIlwrick",
                            "playerPosition": "Hooker",
                            "playerPositionId": 500009,
                            "playerStats": {
                                "allRunMetres": 53,
                                "allRuns": 4,
                                "dummyHalfRuns": 3,
                                "fantasyPointsTotal": 28,
                                "hitUps": 1,
                                "ineffectiveTackles": 2,
                                "mins": 51,
                                "missedTackles": 1,
                                "penalties": 2,
                                "tackles": 29,
                                "hitupRunMeters": 14,
                                "dummyHalfRunMetres": 39,
                                "ptbNeutral": 100,
                                "ptbAll": 5
                            },
                            "playerTookTheField": true,
                            "shirtNum": 9
                        },
                        {
                            "playerFirstName": "Sam",
                            "playerId": 500010,
                            "playerLastName": "Moa",
                            "playerName": "Sam Moa",
                            "playerPosition": "Prop 2",
                            "playerPositionId": 500010,
                            "playerStats": {
                                "allRunMetres": 79,
                                "allRuns": 9,
                                "decoys": 1,
                                "fantasyPointsTotal": 30,
                                "hitUps": 9,
                                "ineffectiveTackles": 1,
                                "mins": 41,
                                "missedTackles": 2,
                                "offloads": 1,
                                "penalties": 1,
                                "supports": 4,
                                "tackles": 27,
                                "hitupRunMeters": 79,
                                "ptbNeutral": 100,
                                "ptbAll": 8
                            },
                            "playerTookTheField": true,
                            "shirtNum": 10
                        },
                        {
                            "playerFirstName": "Boyd",
                            "playerId": 500013,
                            "playerLastName": "Cordner",
                            "playerName": "Boyd Cordner",
                            "playerPosition": "2nd Row 1",
                            "playerPositionId": 500011,
                            "playerStats": {
                                "allRunMetres": 75,
                                "allRuns": 7,
                                "decoys": 8,
                                "fantasyPointsTotal": 34,
                                "hitUps": 7,
                                "ineffectiveTackles": 5,
                                "mins": 80,
                                "oneOnOneTackles": 1,
                                "supports": 8,
                                "tackleBreaks": 1,
                                "tackles": 24,
                                "hitupRunMeters": 75,
                                "ptbFast": 16.67,
                                "ptbNeutral": 66.67,
                                "ptbSlow": 16.67,
                                "ptbAll": 6
                            },
                            "playerTookTheField": true,
                            "shirtNum": 11
                        },
                        {
                            "playerFirstName": "Aidan",
                            "playerId": 500011,
                            "playerLastName": "Guerra",
                            "playerName": "Aidan Guerra",
                            "playerPosition": "2nd Row 2",
                            "playerPositionId": 500012,
                            "playerStats": {
                                "allRunMetres": 59,
                                "allRuns": 7,
                                "decoys": 5,
                                "fantasyPointsTotal": 30,
                                "hitUps": 7,
                                "ineffectiveTackles": 2,
                                "mins": 70,
                                "missedTackles": 4,
                                "penalties": 1,
                                "supports": 13,
                                "tackles": 35,
                                "hitupRunMeters": 59,
                                "ptbNeutral": 100,
                                "ptbAll": 6
                            },
                            "playerTookTheField": true,
                            "shirtNum": 12
                        },
                        {
                            "playerFirstName": "Isaac",
                            "playerId": 500038,
                            "playerLastName": "Liu",
                            "playerName": "Isaac Liu",
                            "playerPosition": "Lock",
                            "playerPositionId": 500013,
                            "playerStats": {
                                "allRunMetres": 40,
                                "allRuns": 5,
                                "decoys": 4,
                                "fantasyPointsTotal": 28,
                                "hitUps": 5,
                                "ineffectiveTackles": 2,
                                "mins": 39,
                                "supports": 10,
                                "tackleBreaks": 2,
                                "tackles": 18,
                                "hitupRunMeters": 40,
                                "ptbFast": 20,
                                "ptbNeutral": 80,
                                "ptbAll": 5
                            },
                            "playerTookTheField": true,
                            "shirtNum": 13
                        },
                        {
                            "playerFirstName": "Mitchell",
                            "playerId": 500016,
                            "playerLastName": "Aubusson",
                            "playerName": "Mitchell Aubusson",
                            "playerPosition": "Interchange",
                            "playerPositionId": 500014,
                            "playerStats": {
                                "allRunMetres": 38,
                                "allRuns": 5,
                                "decoys": 1,
                                "dummyHalfRuns": 3,
                                "errors": 1,
                                "fantasyPointsTotal": 17,
                                "hitUps": 2,
                                "mins": 51,
                                "supports": 2,
                                "tackles": 16,
                                "hitupRunMeters": 12,
                                "dummyHalfRunMetres": 26,
                                "ptbFast": 33.33,
                                "ptbNeutral": 66.67,
                                "ptbAll": 3
                            },
                            "playerTookTheField": true,
                            "shirtNum": 14
                        },
                        {
                            "playerFirstName": "Dylan",
                            "playerId": 500039,
                            "playerLastName": "Napa",
                            "playerName": "Dylan Napa",
                            "playerPosition": "Interchange",
                            "playerPositionId": 500014,
                            "playerStats": {
                                "allRunMetres": 105,
                                "allRuns": 12,
                                "decoys": 4,
                                "fantasyPointsTotal": 36,
                                "hitUps": 10,
                                "ineffectiveTackles": 2,
                                "kickReturnMetres": 14,
                                "kickReturns": 1,
                                "mins": 56,
                                "missedTackles": 3,
                                "oneOnOneTackles": 1,
                                "supports": 7,
                                "tackles": 32,
                                "hitupRunMeters": 87,
                                "evasionRuns": 1,
                                "evasionRunMetres": 4,
                                "ptbNeutral": 100,
                                "ptbAll": 11
                            },
                            "playerTookTheField": true,
                            "shirtNum": 15
                        },
                        {
                            "playerFirstName": "Kane",
                            "playerId": 500118,
                            "playerLastName": "Evans",
                            "playerName": "Kane Evans",
                            "playerPosition": "Interchange",
                            "playerPositionId": 500014,
                            "playerStats": {
                                "allRunMetres": 107,
                                "allRuns": 12,
                                "decoys": 5,
                                "dummyHalfRuns": 1,
                                "errors": 1,
                                "fantasyPointsTotal": 37,
                                "hitUps": 7,
                                "kickReturnMetres": 37,
                                "kickReturns": 3,
                                "mins": 44,
                                "penalties": 1,
                                "supports": 11,
                                "tackleBreaks": 1,
                                "tackles": 28,
                                "hitupRunMeters": 65,
                                "evasionRuns": 1,
                                "evasionRunMetres": 3,
                                "dummyHalfRunMetres": 2,
                                "ptbFast": 10,
                                "ptbNeutral": 90,
                                "ptbAll": 10
                            },
                            "playerTookTheField": true,
                            "shirtNum": 16
                        },
                        {
                            "playerFirstName": "Sio Siua",
                            "playerId": 501179,
                            "playerLastName": "Taukeiaho",
                            "playerName": "Sio Siua Taukeiaho",
                            "playerPosition": "Interchange",
                            "playerPositionId": 500014,
                            "playerStats": {
                                "allRunMetres": 89,
                                "allRuns": 9,
                                "decoys": 5,
                                "fantasyPointsTotal": 40,
                                "hitUps": 8,
                                "ineffectiveTackles": 2,
                                "mins": 41,
                                "supports": 6,
                                "tackleBreaks": 3,
                                "tackles": 23,
                                "hitupRunMeters": 83,
                                "evasionRuns": 1,
                                "evasionRunMetres": 6,
                                "ptbNeutral": 100,
                                "ptbAll": 8
                            },
                            "playerTookTheField": true,
                            "shirtNum": 17
                        }
                    ]
                },
                "teamName": "Sydney Roosters",
                "teamNickName": "Roosters",
                "teamStats": {
                    "allRunMetres": 1635,
                    "allRuns": 173,
                    "bombKicks": 5,
                    "bombKickMetres": 117,
                    "bombKicksDefused": 3,
                    "completeSets": 28,
                    "completionPercentage": 72,
                    "conversions": 5,
                    "conversionsAttempts": 6,
                    "conversionsMissed": 1,
                    "decoys": 39,
                    "dummyHalfRuns": 16,
                    "errors": 12,
                    "hitUps": 62,
                    "incompleteSets": 11,
                    "ineffectiveTackles": 21,
                    "kickMetres": 584,
                    "kickReturnMetres": 160,
                    "kickReturns": 16,
                    "kicks": 18,
                    "kicksDefused": 6,
                    "lineDropouts": 1,
                    "linebreakAssists": 6,
                    "linebreaks": 6,
                    "missedTackles": 19,
                    "oneOnOneTackles": 8,
                    "penalties": 7,
                    "points": 34,
                    "pointsConceded": 6,
                    "possession": 50,
                    "scrumWins": 6,
                    "supports": 162,
                    "tackleBreaks": 26,
                    "tackles": 308,
                    "sets": 39,
                    "tries": 6,
                    "triesConceded": 1,
                    "tryAssists": 6,
                    "offloads": 7,
                    "hitupRunMeters": 559,
                    "evasionRuns": 79,
                    "evasionRunMetres": 763,
                    "dummyHalfRunMetres": 153,
                    "ptbFast": 14,
                    "ptbNeutral": 85,
                    "ptbSlow": 1,
                    "ptbTotal": 138
                }
            },
            {
                "score": {
                    "conversions": 1,
                    "points": 6,
                    "tries": 1
                },
                "team1stHalfScore": 6,
                "team2ndHalfScore": 0,
                "teamAbbr": "CAN",
                "teamFinalScore": 6,
                "teamFullTimeScore": 6,
                "teamHalfTimeScore": 6,
                "teamId": 500013,
                "teamLineup": {
                    "injuriesAndSuspensions": {
                        "injury": [],
                        "suspension": []
                    },
                    "insAndOuts": {
                        "inOut": [
                            {
                                "inOut": "Out",
                                "playerFirstName": "Bill",
                                "playerId": "500336",
                                "playerLastName": "Tupou",
                                "playerName": "Bill Tupou"
                            },
                            {
                                "inOut": "In",
                                "playerFirstName": "Glen",
                                "playerId": "500310",
                                "playerLastName": "Buttriss",
                                "playerName": "Glen Buttriss"
                            },
                            {
                                "inOut": "In",
                                "playerFirstName": "Jack",
                                "playerId": "500339",
                                "playerLastName": "Wighton",
                                "playerName": "Jack Wighton"
                            },
                            {
                                "inOut": "In",
                                "playerFirstName": "Jeremy",
                                "playerId": "500318",
                                "playerLastName": "Hawkins",
                                "playerName": "Jeremy Hawkins"
                            },
                            {
                                "inOut": "Out",
                                "playerFirstName": "Josh",
                                "playerId": "500972",
                                "playerLastName": "McCrone",
                                "playerName": "Josh McCrone"
                            },
                            {
                                "inOut": "In",
                                "playerFirstName": "Mark",
                                "playerId": "500327",
                                "playerLastName": "Nicholls",
                                "playerName": "Mark Nicholls"
                            },
                            {
                                "inOut": "Out",
                                "playerFirstName": "Shannon",
                                "playerId": "500309",
                                "playerLastName": "Boyd",
                                "playerName": "Shannon Boyd"
                            },
                            {
                                "inOut": "Out",
                                "playerFirstName": "Sisa",
                                "playerId": "500612",
                                "playerLastName": "Waqa",
                                "playerName": "Sisa Waqa"
                            }
                        ]
                    },
                    "teamPlayer": [
                        {
                            "playerFirstName": "Jack",
                            "playerId": 500339,
                            "playerLastName": "Wighton",
                            "playerName": "Jack Wighton",
                            "playerPosition": "Fullback",
                            "playerPositionId": 500001,
                            "playerStats": {
                                "allRunMetres": 186,
                                "allRuns": 20,
                                "bombKicksDefused": 1,
                                "dummyHalfRuns": 4,
                                "errors": 2,
                                "fantasyPointsTotal": 23,
                                "ineffectiveTackles": 1,
                                "kickReturnMetres": 58,
                                "kickReturns": 6,
                                "kicksDefused": 1,
                                "kicksNotDefused": 1,
                                "mins": 80,
                                "missedTackles": 2,
                                "offloads": 1,
                                "supports": 11,
                                "tackleBreaks": 2,
                                "tackles": 4,
                                "evasionRuns": 10,
                                "evasionRunMetres": 93,
                                "dummyHalfRunMetres": 35,
                                "ptbFast": 17.65,
                                "ptbNeutral": 82.35,
                                "ptbAll": 17
                            },
                            "playerTookTheField": true,
                            "shirtNum": 1
                        },
                        {
                            "playerFirstName": "Jeremy",
                            "playerId": 500318,
                            "playerLastName": "Hawkins",
                            "playerName": "Jeremy Hawkins",
                            "playerPosition": "Winger 1",
                            "playerPositionId": 500002,
                            "playerStats": {
                                "allRunMetres": 69,
                                "allRuns": 8,
                                "decoys": 2,
                                "dummyHalfRuns": 1,
                                "fantasyPointsTotal": 17,
                                "ineffectiveTackles": 1,
                                "kickReturnMetres": 4,
                                "kickReturns": 1,
                                "mins": 80,
                                "missedTackles": 2,
                                "supports": 14,
                                "tackles": 15,
                                "tryCause": 2,
                                "evasionRuns": 6,
                                "evasionRunMetres": 54,
                                "dummyHalfRunMetres": 11,
                                "ptbFast": 14.29,
                                "ptbNeutral": 85.71,
                                "ptbAll": 7
                            },
                            "playerTookTheField": true,
                            "shirtNum": 19
                        },
                        {
                            "playerFirstName": "Jarrod",
                            "playerId": 500313,
                            "playerLastName": "Croker",
                            "playerName": "Jarrod Croker",
                            "playerPosition": "Centre 1",
                            "playerPositionId": 500003,
                            "playerStats": {
                                "allRunMetres": 79,
                                "allRuns": 10,
                                "conversions": 1,
                                "conversionsAttempts": 1,
                                "decoys": 1,
                                "dummyHalfRuns": 1,
                                "errors": 2,
                                "fantasyPointsTotal": 24,
                                "ineffectiveTackles": 1,
                                "mins": 80,
                                "missedTackles": 3,
                                "oneOnOneTackles": 1,
                                "supports": 12,
                                "tackleBreaks": 1,
                                "tackles": 14,
                                "tries": 1,
                                "tryCause": 4,
                                "evasionRuns": 9,
                                "evasionRunMetres": 63,
                                "dummyHalfRunMetres": 16,
                                "ptbFast": 14.29,
                                "ptbNeutral": 85.71,
                                "ptbAll": 7
                            },
                            "playerTookTheField": true,
                            "shirtNum": 3,
                            "isCaptain": true
                        },
                        {
                            "playerFirstName": "Edrick",
                            "playerId": 500322,
                            "playerLastName": "Lee",
                            "playerName": "Edrick Lee",
                            "playerPosition": "Centre 2",
                            "playerPositionId": 500004,
                            "playerStats": {
                                "allRunMetres": 124,
                                "allRuns": 12,
                                "bombKicksDefused": 1,
                                "bombKicksNotDefused": 1,
                                "decoys": 2,
                                "dummyHalfRuns": 1,
                                "fantasyPointsTotal": 21,
                                "kickReturnMetres": 21,
                                "kickReturns": 4,
                                "kicksDefused": 3,
                                "kicksNotDefused": 1,
                                "linebreaks": 1,
                                "mins": 80,
                                "missedTackles": 3,
                                "offloads": 1,
                                "supports": 12,
                                "tackleBreaks": 1,
                                "tackles": 3,
                                "tryCause": 3,
                                "evasionRuns": 7,
                                "evasionRunMetres": 94,
                                "dummyHalfRunMetres": 9,
                                "ptbNeutral": 100,
                                "ptbAll": 10
                            },
                            "playerTookTheField": true,
                            "shirtNum": 4,
                            "isCaptain": true
                        },
                        {
                            "playerFirstName": "Jordan",
                            "playerId": 500330,
                            "playerLastName": "Rapana",
                            "playerName": "Jordan Rapana",
                            "playerPosition": "Winger 2",
                            "playerPositionId": 500005,
                            "playerStats": {
                                "allRunMetres": 147,
                                "allRuns": 14,
                                "bombKicksNotDefused": 2,
                                "decoys": 1,
                                "dummyHalfRuns": 2,
                                "errors": 1,
                                "fantasyPointsTotal": 27,
                                "kicksNotDefused": 2,
                                "mins": 80,
                                "missedTackles": 2,
                                "offloads": 1,
                                "oneOnOneTackles": 1,
                                "penalties": 1,
                                "supports": 6,
                                "tackleBreaks": 4,
                                "tackles": 7,
                                "tryCause": 3,
                                "evasionRuns": 12,
                                "evasionRunMetres": 131,
                                "dummyHalfRunMetres": 16,
                                "ptbNeutral": 90.91,
                                "ptbSlow": 9.09,
                                "ptbAll": 11
                            },
                            "playerTookTheField": true,
                            "shirtNum": 5
                        },
                        {
                            "playerFirstName": "Blake",
                            "playerId": 501375,
                            "playerLastName": "Austin",
                            "playerName": "Blake Austin",
                            "playerPosition": "Five-eighth",
                            "playerPositionId": 500006,
                            "playerStats": {
                                "allRunMetres": 72,
                                "allRuns": 9,
                                "errors": 2,
                                "fantasyPointsTotal": 25,
                                "ineffectiveTackles": 1,
                                "kickMetres": 30,
                                "kicks": 1,
                                "mins": 80,
                                "missedTackles": 3,
                                "oneOnOneTackles": 3,
                                "penalties": 2,
                                "supports": 11,
                                "tackleBreaks": 3,
                                "tackles": 22,
                                "evasionRuns": 9,
                                "evasionRunMetres": 72,
                                "ptbFast": 50,
                                "ptbNeutral": 50,
                                "ptbAll": 4
                            },
                            "playerTookTheField": true,
                            "shirtNum": 6
                        },
                        {
                            "playerFirstName": "Mitchell",
                            "playerId": 500312,
                            "playerLastName": "Cornish",
                            "playerName": "Mitchell Cornish",
                            "playerPosition": "Halfback",
                            "playerPositionId": 500007,
                            "playerStats": {
                                "allRunMetres": 54,
                                "allRuns": 6,
                                "bombKicks": 4,
                                "bombKickMetres": 114,
                                "decoys": 1,
                                "dummyHalfRuns": 1,
                                "fantasyPointsTotal": 47,
                                "ineffectiveTackles": 1,
                                "kickMetres": 319,
                                "kicks": 13,
                                "linebreakAssists": 1,
                                "mins": 80,
                                "missedTackles": 1,
                                "oneOnOneTackles": 1,
                                "penalties": 1,
                                "supports": 8,
                                "tackleBreaks": 3,
                                "tackles": 15,
                                "tryAssists": 1,
                                "tryCause": 1,
                                "evasionRuns": 5,
                                "evasionRunMetres": 51,
                                "dummyHalfRunMetres": 3,
                                "ptbNeutral": 100,
                                "ptbAll": 3
                            },
                            "playerTookTheField": true,
                            "shirtNum": 7
                        },
                        {
                            "playerFirstName": "Josh",
                            "playerId": 500973,
                            "playerLastName": "Papalii",
                            "playerName": "Josh Papalii",
                            "playerPosition": "Prop 1",
                            "playerPositionId": 500008,
                            "playerStats": {
                                "allRunMetres": 67,
                                "allRuns": 6,
                                "decoys": 5,
                                "fantasyPointsTotal": 36,
                                "hitUps": 5,
                                "kickReturnMetres": 14,
                                "kickReturns": 1,
                                "mins": 44,
                                "oneOnOneTackles": 3,
                                "penalties": 1,
                                "supports": 6,
                                "tackles": 32,
                                "hitupRunMeters": 53,
                                "ptbNeutral": 100,
                                "ptbAll": 7
                            },
                            "playerTookTheField": true,
                            "shirtNum": 8
                        },
                        {
                            "playerFirstName": "Josh",
                            "playerId": 502181,
                            "playerLastName": "Hodgson",
                            "playerName": "Josh Hodgson",
                            "playerPosition": "Hooker",
                            "playerPositionId": 500009,
                            "playerStats": {
                                "allRunMetres": 24,
                                "allRuns": 3,
                                "dummyHalfRuns": 3,
                                "fantasyPointsTotal": 39,
                                "ineffectiveTackles": 1,
                                "mins": 59,
                                "offloads": 1,
                                "oneOnOneTackles": 1,
                                "penalties": 1,
                                "supports": 2,
                                "tackleBreaks": 1,
                                "tackles": 34,
                                "dummyHalfRunMetres": 24,
                                "ptbNeutral": 100,
                                "ptbAll": 2
                            },
                            "playerTookTheField": true,
                            "shirtNum": 9
                        },
                        {
                            "playerFirstName": "Dane",
                            "playerId": 500335,
                            "playerLastName": "Tilse",
                            "playerName": "Dane Tilse",
                            "playerPosition": "Prop 2",
                            "playerPositionId": 500010,
                            "playerStats": {
                                "allRunMetres": 48,
                                "allRuns": 6,
                                "decoys": 4,
                                "errors": 2,
                                "fantasyPointsTotal": 13,
                                "hitUps": 6,
                                "ineffectiveTackles": 1,
                                "mins": 28,
                                "offloads": 1,
                                "supports": 4,
                                "tackles": 11,
                                "hitupRunMeters": 48,
                                "ptbFast": 33.33,
                                "ptbNeutral": 66.67,
                                "ptbAll": 3
                            },
                            "playerTookTheField": true,
                            "shirtNum": 10
                        },
                        {
                            "playerFirstName": "Jarrad",
                            "playerId": 500319,
                            "playerLastName": "Kennedy",
                            "playerName": "Jarrad Kennedy",
                            "playerPosition": "2nd Row 1",
                            "playerPositionId": 500011,
                            "playerStats": {
                                "allRunMetres": 92,
                                "allRuns": 10,
                                "decoys": 4,
                                "errors": 1,
                                "fantasyPointsTotal": 38,
                                "hitUps": 10,
                                "ineffectiveTackles": 1,
                                "mins": 80,
                                "missedTackles": 5,
                                "oneOnOneTackles": 4,
                                "supports": 12,
                                "tackles": 41,
                                "tryCause": 1,
                                "hitupRunMeters": 92,
                                "ptbFast": 12.5,
                                "ptbNeutral": 75,
                                "ptbSlow": 12.5,
                                "ptbAll": 8
                            },
                            "playerTookTheField": true,
                            "shirtNum": 11
                        },
                        {
                            "playerFirstName": "Sia",
                            "playerId": 502331,
                            "playerLastName": "Soliola",
                            "playerName": "Sia Soliola",
                            "playerPosition": "2nd Row 2",
                            "playerPositionId": 500012,
                            "playerStats": {
                                "allRunMetres": 52,
                                "allRuns": 7,
                                "decoys": 5,
                                "errors": 1,
                                "fantasyPointsTotal": 47,
                                "hitUps": 7,
                                "ineffectiveTackles": 1,
                                "mins": 72,
                                "missedTackles": 1,
                                "oneOnOneTackles": 1,
                                "supports": 16,
                                "tackles": 46,
                                "hitupRunMeters": 52,
                                "ptbFast": 14.29,
                                "ptbNeutral": 85.71,
                                "ptbAll": 7
                            },
                            "playerTookTheField": true,
                            "shirtNum": 12
                        },
                        {
                            "playerFirstName": "Shaun",
                            "playerId": 500316,
                            "playerLastName": "Fensom",
                            "playerName": "Shaun Fensom",
                            "playerPosition": "Lock",
                            "playerPositionId": 500013,
                            "playerStats": {
                                "allRunMetres": 44,
                                "allRuns": 6,
                                "decoys": 5,
                                "fantasyPointsTotal": 51,
                                "hitUps": 6,
                                "mins": 60,
                                "offloads": 1,
                                "oneOnOneTackles": 2,
                                "supports": 14,
                                "tackles": 45,
                                "hitupRunMeters": 44,
                                "ptbNeutral": 80,
                                "ptbSlow": 20,
                                "ptbAll": 5
                            },
                            "playerTookTheField": true,
                            "shirtNum": 13
                        },
                        {
                            "playerFirstName": "Glen",
                            "playerId": 500310,
                            "playerLastName": "Buttriss",
                            "playerName": "Glen Buttriss",
                            "playerPosition": "Interchange",
                            "playerPositionId": 500014,
                            "playerStats": {
                                "allRunMetres": 36,
                                "allRuns": 4,
                                "dummyHalfRuns": 3,
                                "fantasyPointsTotal": 21,
                                "hitUps": 1,
                                "mins": 22,
                                "missedTackles": 1,
                                "oneOnOneTackles": 1,
                                "tackleBreaks": 2,
                                "tackles": 14,
                                "hitupRunMeters": 10,
                                "dummyHalfRunMetres": 26,
                                "ptbNeutral": 100,
                                "ptbAll": 4
                            },
                            "playerTookTheField": true,
                            "shirtNum": 14
                        },
                        {
                            "playerFirstName": "Frank-Paul",
                            "playerId": 500014,
                            "playerLastName": "Nuuausala",
                            "playerName": "Frank-Paul Nuuausala",
                            "playerPosition": "Interchange",
                            "playerPositionId": 500014,
                            "playerStats": {
                                "allRunMetres": 63,
                                "allRuns": 6,
                                "decoys": 3,
                                "fantasyPointsTotal": 28,
                                "hitUps": 5,
                                "kickReturnMetres": 10,
                                "kickReturns": 1,
                                "mins": 46,
                                "missedTackles": 1,
                                "offloads": 1,
                                "supports": 12,
                                "tackleBreaks": 1,
                                "tackles": 19,
                                "hitupRunMeters": 53,
                                "ptbNeutral": 100,
                                "ptbAll": 5
                            },
                            "playerTookTheField": true,
                            "shirtNum": 15
                        },
                        {
                            "playerFirstName": "Paul",
                            "playerId": 500337,
                            "playerLastName": "Vaughan",
                            "playerName": "Paul Vaughan",
                            "playerPosition": "Interchange",
                            "playerPositionId": 500014,
                            "playerStats": {
                                "allRunMetres": 144,
                                "allRuns": 16,
                                "decoys": 3,
                                "errors": 2,
                                "fantasyPointsTotal": 29,
                                "hitUps": 15,
                                "ineffectiveTackles": 1,
                                "kickReturnMetres": 12,
                                "kickReturns": 1,
                                "mins": 42,
                                "supports": 6,
                                "tackleBreaks": 1,
                                "tackles": 16,
                                "hitupRunMeters": 132,
                                "ptbNeutral": 92.86,
                                "ptbSlow": 7.14,
                                "ptbAll": 14
                            },
                            "playerTookTheField": true,
                            "shirtNum": 16
                        },
                        {
                            "playerFirstName": "Mark",
                            "playerId": 500327,
                            "playerLastName": "Nicholls",
                            "playerName": "Mark Nicholls",
                            "playerPosition": "Interchange",
                            "playerPositionId": 500014,
                            "playerStats": {
                                "allRunMetres": 59,
                                "allRuns": 7,
                                "decoys": 2,
                                "fantasyPointsTotal": 19,
                                "hitUps": 7,
                                "mins": 27,
                                "missedTackles": 2,
                                "supports": 3,
                                "tackles": 18,
                                "hitupRunMeters": 59,
                                "ptbNeutral": 100,
                                "ptbAll": 6
                            },
                            "playerTookTheField": true,
                            "shirtNum": 18
                        }
                    ]
                },
                "teamName": "Canberra Raiders",
                "teamNickName": "Raiders",
                "teamStats": {
                    "allRunMetres": 1359,
                    "allRuns": 150,
                    "bombKicks": 4,
                    "bombKickMetres": 114,
                    "bombKicksDefused": 2,
                    "bombKicksNotDefused": 3,
                    "completeSets": 23,
                    "completionPercentage": 62,
                    "conversions": 1,
                    "conversionsAttempts": 1,
                    "decoys": 38,
                    "dummyHalfRuns": 16,
                    "errors": 13,
                    "hitUps": 62,
                    "incompleteSets": 14,
                    "ineffectiveTackles": 10,
                    "kickMetres": 348,
                    "kickReturnMetres": 118,
                    "kickReturns": 14,
                    "kicks": 14,
                    "kicksDefused": 4,
                    "kicksNotDefused": 4,
                    "linebreakAssists": 1,
                    "linebreaks": 1,
                    "missedTackles": 26,
                    "oneOnOneTackles": 18,
                    "penalties": 6,
                    "points": 6,
                    "pointsConceded": 34,
                    "possession": 50,
                    "scrumWins": 10,
                    "supports": 149,
                    "tackleBreaks": 19,
                    "tackles": 356,
                    "sets": 37,
                    "tries": 1,
                    "triesConceded": 6,
                    "tryAssists": 1,
                    "offloads": 7,
                    "hitupRunMeters": 542,
                    "evasionRuns": 58,
                    "evasionRunMetres": 558,
                    "dummyHalfRunMetres": 141,
                    "ptbFast": 8,
                    "ptbNeutral": 88,
                    "ptbSlow": 3,
                    "ptbTotal": 120
                }
            }
        ]
    }
}