{
    "vod": [
        {
            "id": "U5MWRodDpmBudxRLqGf8jceLjEjOVA4o",
            "contentId": 737779,
            "title": "Rd 6: Panthers v Sea Eagles (2)",
            "description": "2nd half replay of the match between the Panthers & Sea Eagles",
            "publishDate": "2015-04-12T09:30:00+10:00",
            "publisher": "NRL Chief",
            "thumbnailUrl": "http://bigpondvideo.com/Web/Images/Content/20150411214039a_89x50.jpg",
            "largeThumbnailUrl": "http://bigpondvideo.com/Web/Images/Content/20150411214039a_326x184.jpg",
            "programType": "Matches",
            "programCategory": "Replay: 2nd Half",
            "priority": null,
            "lastUpdateDate": "2015-04-11T23:12:30+10:00",
            "isPremium": true,
            "club": [
                500002,
                500014
            ]
        },
        {
            "id": "NvMGRodDplEVcbm6CSHpJ5ivvi-q6sfc",
            "contentId": 737778,
            "title": "Rd 6: Panthers v Sea Eagles (1)",
            "description": "1st half replay of the match between the Panthers & Sea Eagles",
            "publishDate": "2015-04-12T09:30:00+10:00",
            "publisher": "NRL Chief",
            "thumbnailUrl": "http://bigpondvideo.com/Web/Images/Content/20150411214020a_89x50.jpg",
            "largeThumbnailUrl": "http://bigpondvideo.com/Web/Images/Content/20150411214020a_326x184.jpg",
            "programType": "Matches",
            "programCategory": "Replay: 1st Half",
            "priority": null,
            "lastUpdateDate": "2015-04-11T23:06:26+10:00",
            "isPremium": true,
            "club": [
                500002,
                500014
            ]
        },
        {
            "id": "42MmRodDoa82LSZo_7UpA7_YjmV_9jLu",
            "contentId": 739353,
            "title": "Rd 6: Panthers v Sea Eagles (Hls)",
            "description": "Highlights of the match between the Panthers & Sea Eagles from Pepper Stadium.",
            "publishDate": "2015-04-12T11:53:30+10:00",
            "publisher": "NRL Chief",
            "thumbnailUrl": "http://bigpondvideo.com/Web/Images/Content/20150411223602a_89x50.jpg",
            "largeThumbnailUrl": "http://bigpondvideo.com/Web/Images/Content/20150411223602a_326x184.jpg",
            "programType": "Highlights",
            "programCategory": "Match",
            "priority": null,
            "lastUpdateDate": "2015-04-12T11:49:39+10:00",
            "isPremium": false,
            "club": [
                500002,
                500014
            ]
        },
        {
            "id": "kxcWNodDrIFcmHvbrVurh34E5U394eWr",
            "contentId": 737741,
            "title": "Rd 6 Press Conference: Panthers",
            "description": "The Panthers coach faces the media following the match",
            "publishDate": "2015-04-11T22:11:00+10:00",
            "publisher": "NRL Chief",
            "thumbnailUrl": "http://bigpondvideo.com/Web/Images/Content/20150411221226a_89x50.jpg",
            "largeThumbnailUrl": "http://bigpondvideo.com/Web/Images/Content/20150411221226a_326x184.jpg",
            "programType": "Press Conference",
            "programCategory": null,
            "priority": null,
            "lastUpdateDate": "2015-04-11T22:27:16+10:00",
            "isPremium": false,
            "club": [
                500002,
                500014
            ]
        },
        {
            "id": "N4bWNodDr_pSkJ9SbLvQtMnBbpanzmf8",
            "contentId": 737744,
            "title": "Rd 6 Press Conference: Sea Eagles",
            "description": "The Sea Eagles coach faces the media following the match",
            "publishDate": "2015-04-11T22:03:00+10:00",
            "publisher": "NRL Chief",
            "thumbnailUrl": "http://bigpondvideo.com/Web/Images/Content/20150411215835a_89x50.jpg",
            "largeThumbnailUrl": "http://bigpondvideo.com/Web/Images/Content/20150411215835a_326x184.jpg",
            "programType": "Press Conference",
            "programCategory": null,
            "priority": null,
            "lastUpdateDate": "2015-04-11T22:10:51+10:00",
            "isPremium": false,
            "club": [
                500002,
                500014
            ]
        },
        {
            "id": "9rOWNodDrHsa8N1xh2J43dFuKpTLpy7X",
            "contentId": 738299,
            "title": "Rd 6: TRY Steve Matai (71st min)",
            "description": "Sea Eagles strike back through a scrappy try to Steve Matai",
            "publishDate": "2015-04-11T21:18:00+10:00",
            "publisher": "NRL Chief",
            "thumbnailUrl": "http://bigpondvideo.com/Web/Images/Content/20150411211911a_89x50.jpg",
            "largeThumbnailUrl": "http://bigpondvideo.com/Web/Images/Content/20150411211911a_326x184.jpg",
            "programType": "Instant Replay",
            "programCategory": "Score",
            "priority": 1,
            "lastUpdateDate": "2015-04-11T21:38:42+10:00",
            "isPremium": true,
            "club": [
                500002,
                500014
            ]
        },
        {
            "id": "pyNmNodDobX42OJtbEZPLtuaqwCAeLGZ",
            "contentId": 738298,
            "title": "Rd 6: GOAL Matt Moylan (67th min)",
            "description": "Conversion gives the Panthers a 14 point lead",
            "publishDate": "2015-04-11T21:11:00+10:00",
            "publisher": "NRL Chief",
            "thumbnailUrl": "http://bigpondvideo.com/Web/Images/Content/20150411211146a_89x50.jpg",
            "largeThumbnailUrl": "http://bigpondvideo.com/Web/Images/Content/20150411211146a_326x184.jpg",
            "programType": "Instant Replay",
            "programCategory": "Score",
            "priority": 2,
            "lastUpdateDate": "2015-04-11T21:37:43+10:00",
            "isPremium": true,
            "club": [
                500002,
                500014
            ]
        },
        {
            "id": "FoNmNodDr7klHs_Ptg70ZK2jtQyMTidQ",
            "contentId": 738302,
            "title": "Rd 6: TRY Apisai Koroisau (65th min)",
            "description": "Apisai Koroisau is on the end of a fantastic team try by the Panthers",
            "publishDate": "2015-04-11T21:10:00+10:00",
            "publisher": "NRL Chief",
            "thumbnailUrl": "http://bigpondvideo.com/Web/Images/Content/20150411211058a_89x50.jpg",
            "largeThumbnailUrl": "http://bigpondvideo.com/Web/Images/Content/20150411211058a_326x184.jpg",
            "programType": "Instant Replay",
            "programCategory": "Score",
            "priority": 3,
            "lastUpdateDate": "2015-04-11T21:37:41+10:00",
            "isPremium": true,
            "club": [
                500002,
                500014
            ]
        },
        {
            "id": "E4NWNodDoJfKDQOOsu10RibjEPA7T1qI",
            "contentId": 738301,
            "title": "Rd 6: GOAL Matt Moylan (62nd min)",
            "description": "Conversion sees the Panthers lead 16-8",
            "publishDate": "2015-04-11T21:08:00+10:00",
            "publisher": "NRL Chief",
            "thumbnailUrl": "http://bigpondvideo.com/Web/Images/Content/20150411210738a_89x50.jpg",
            "largeThumbnailUrl": "http://bigpondvideo.com/Web/Images/Content/20150411210738a_326x184.jpg",
            "programType": "Instant Replay",
            "programCategory": "Score",
            "priority": 4,
            "lastUpdateDate": "2015-04-11T21:36:42+10:00",
            "isPremium": true,
            "club": [
                500002,
                500014
            ]
        },
        {
            "id": "cwNWNodDponfrhY6JUPpd_l8csme9Qcl",
            "contentId": 738295,
            "title": "Rd 6: TRY Waqa Blake (61st min)",
            "description": "Great short ball by Tyrone Peachey sends Waqa Blake over to score his first try in the NRL",
            "publishDate": "2015-04-11T21:06:10+10:00",
            "publisher": "NRL Chief",
            "thumbnailUrl": "http://bigpondvideo.com/Web/Images/Content/20150411210525a_89x50.jpg",
            "largeThumbnailUrl": "http://bigpondvideo.com/Web/Images/Content/20150411210525a_326x184.jpg",
            "programType": "Instant Replay",
            "programCategory": "Score",
            "priority": 5,
            "lastUpdateDate": "2015-04-11T21:36:41+10:00",
            "isPremium": true,
            "club": [
                500002,
                500014
            ]
        },
        {
            "id": "MwM2NodDrBp9CsZzkxw0BK9pmiTpITxj",
            "contentId": 738294,
            "title": "Rd 6: TRY Josh Mansour (57th min)",
            "description": "Panthers hit the lead as Josh Mansour dives over in the corner to score his 2nd for the night",
            "publishDate": "2015-04-11T21:02:00+10:00",
            "publisher": "NRL Chief",
            "thumbnailUrl": "http://bigpondvideo.com/Web/Images/Content/20150411210138a_89x50.jpg",
            "largeThumbnailUrl": "http://bigpondvideo.com/Web/Images/Content/20150411210138a_326x184.jpg",
            "programType": "Instant Replay",
            "programCategory": "Score",
            "priority": 6,
            "lastUpdateDate": "2015-04-11T21:35:42+10:00",
            "isPremium": true,
            "club": [
                500002,
                500014
            ]
        },
        {
            "id": "k5cGJodDr_BxvVZjwbm58EQJsAOKeWFs",
            "contentId": 738296,
            "title": "Rd 6: PENALTY GOAL Peta Hiku (40th min)",
            "description": "Penalty goal to the Sea Eagles on the stroke of half time gives them a 2 point lead",
            "publishDate": "2015-04-11T20:28:00+10:00",
            "publisher": "NRL Chief",
            "thumbnailUrl": "http://bigpondvideo.com/Web/Images/Content/20150411202902a_89x50.jpg",
            "largeThumbnailUrl": "http://bigpondvideo.com/Web/Images/Content/20150411202902a_326x184.jpg",
            "programType": "Instant Replay",
            "programCategory": "Score",
            "priority": 7,
            "lastUpdateDate": "2015-04-11T21:35:40+10:00",
            "isPremium": true,
            "club": [
                500002,
                500014
            ]
        },
        {
            "id": "Fna2JodDrclbYCMWM25sOSuNrbatWdXQ",
            "contentId": 738293,
            "title": "Rd 6: GOAL Peta Hiku (25th min)",
            "description": "Conversion locks the score up at 6-all",
            "publishDate": "2015-04-11T20:12:00+10:00",
            "publisher": "NRL Chief",
            "thumbnailUrl": "http://bigpondvideo.com/Web/Images/Content/20150411201132a_89x50.jpg",
            "largeThumbnailUrl": "http://bigpondvideo.com/Web/Images/Content/20150411201132a_326x184.jpg",
            "programType": "Instant Replay",
            "programCategory": "Score",
            "priority": null,
            "lastUpdateDate": "2015-04-11T20:15:19+10:00",
            "isPremium": true,
            "club": [
                500002,
                500014
            ]
        },
        {
            "id": "oya2JodDoEgMjSjMXFUFjt2u6cvdGiII",
            "contentId": 738291,
            "title": "Rd 6: TRY Justin Horo (24th min)",
            "description": "Sea Eagles hit back through a good try to Justin Horo",
            "publishDate": "2015-04-11T20:11:00+10:00",
            "publisher": "NRL Chief",
            "thumbnailUrl": "http://bigpondvideo.com/Web/Images/Content/20150411201022a_89x50.jpg",
            "largeThumbnailUrl": "http://bigpondvideo.com/Web/Images/Content/20150411201022a_326x184.jpg",
            "programType": "Instant Replay",
            "programCategory": "Score",
            "priority": 8,
            "lastUpdateDate": "2015-04-11T21:34:43+10:00",
            "isPremium": true,
            "club": [
                500002,
                500014
            ]
        },
        {
            "id": "1vZ2JodDpZsL5i6s__kMD0sNYxygHUFv",
            "contentId": 738289,
            "title": "Rd 6: GOAL Matt Moylan (5th min)",
            "description": "Conversion gives the Panthers a 6-0 lead",
            "publishDate": "2015-04-11T19:59:00+10:00",
            "publisher": "NRL Chief",
            "thumbnailUrl": "http://bigpondvideo.com/Web/Images/Content/20150411195838a_89x50.jpg",
            "largeThumbnailUrl": "http://bigpondvideo.com/Web/Images/Content/20150411195838a_326x184.jpg",
            "programType": "Instant Replay",
            "programCategory": "Score",
            "priority": 9,
            "lastUpdateDate": "2015-04-11T21:34:41+10:00",
            "isPremium": true,
            "club": [
                500002,
                500014
            ]
        },
        {
            "id": "JtZ2JodDoXLY42jgExz8uVC3BfzbxZKs",
            "contentId": 738288,
            "title": "Rd 6: TRY Josh Mansour (3rd min)",
            "description": "Panthers open the scoring in this match through a try to Josh Mansour",
            "publishDate": "2015-04-11T19:57:00+10:00",
            "publisher": "NRL Chief",
            "thumbnailUrl": "http://bigpondvideo.com/Web/Images/Content/20150411195724a_89x50.jpg",
            "largeThumbnailUrl": "http://bigpondvideo.com/Web/Images/Content/20150411195724a_326x184.jpg",
            "programType": "Instant Replay",
            "programCategory": "Score",
            "priority": 10,
            "lastUpdateDate": "2015-04-11T21:31:45+10:00",
            "isPremium": true,
            "club": [
                500002,
                500014
            ]
        }
    ],
    "scores": [
        {
            "gameState": "First Half",
            "gameStateId": 3,
            "gameTime": "0:02:41",
            "gameSeconds": 161,
            "playerId": 500352,
            "playerName": "Josh Mansour",
            "scoreMethod": "Try",
            "statId": 38,
            "statValue": 4,
            "vidRef": 8359,
            "homeScore": 4,
            "teamId": 500014,
            "teamName": "Penrith Panthers",
            "homeTeamAbbrv": "PEN",
            "awayTeamAbbrv": "MAN"
        },
        {
            "gameState": "First Half",
            "gameStateId": 3,
            "gameTime": "0:04:00",
            "gameSeconds": 240,
            "playerId": 500356,
            "playerName": "Matt Moylan",
            "scoreMethod": "Conversion",
            "statId": 1,
            "statValue": 2,
            "vidRef": 12070,
            "homeScore": 6,
            "teamId": 500014,
            "teamName": "Penrith Panthers",
            "homeTeamAbbrv": "PEN",
            "awayTeamAbbrv": "MAN"
        },
        {
            "gameState": "Second Half",
            "gameStateId": 5,
            "gameTime": "0:56:35",
            "gameSeconds": 3395,
            "playerId": 500352,
            "playerName": "Josh Mansour",
            "scoreMethod": "Try",
            "statId": 38,
            "statValue": 4,
            "vidRef": 99402,
            "homeScore": 10,
            "awayScore": 8,
            "teamId": 500014,
            "teamName": "Penrith Panthers",
            "homeTeamAbbrv": "PEN",
            "awayTeamAbbrv": "MAN"
        },
        {
            "gameState": "Second Half",
            "gameStateId": 5,
            "gameTime": "1:00:11",
            "gameSeconds": 3611,
            "playerId": 500496,
            "playerName": "Waqa Blake",
            "scoreMethod": "Try",
            "statId": 38,
            "statValue": 4,
            "vidRef": 104962,
            "homeScore": 14,
            "awayScore": 8,
            "teamId": 500014,
            "teamName": "Penrith Panthers",
            "homeTeamAbbrv": "PEN",
            "awayTeamAbbrv": "MAN"
        },
        {
            "gameState": "Second Half",
            "gameStateId": 5,
            "gameTime": "1:01:40",
            "gameSeconds": 3700,
            "playerId": 500356,
            "playerName": "Matt Moylan",
            "scoreMethod": "Conversion",
            "statId": 1,
            "statValue": 2,
            "vidRef": 107541,
            "homeScore": 16,
            "awayScore": 8,
            "teamId": 500014,
            "teamName": "Penrith Panthers",
            "homeTeamAbbrv": "PEN",
            "awayTeamAbbrv": "MAN"
        },
        {
            "gameState": "Second Half",
            "gameStateId": 5,
            "gameTime": "1:04:31",
            "gameSeconds": 3871,
            "playerId": 500109,
            "playerName": "Apisai Koroisau",
            "scoreMethod": "Try",
            "statId": 38,
            "statValue": 4,
            "vidRef": 111797,
            "homeScore": 20,
            "awayScore": 8,
            "teamId": 500014,
            "teamName": "Penrith Panthers",
            "homeTeamAbbrv": "PEN",
            "awayTeamAbbrv": "MAN"
        },
        {
            "gameState": "Second Half",
            "gameStateId": 5,
            "gameTime": "1:06:23",
            "gameSeconds": 3983,
            "playerId": 500356,
            "playerName": "Matt Moylan",
            "scoreMethod": "Conversion",
            "statId": 1,
            "statValue": 2,
            "vidRef": 114608,
            "homeScore": 22,
            "awayScore": 8,
            "teamId": 500014,
            "teamName": "Penrith Panthers",
            "homeTeamAbbrv": "PEN",
            "awayTeamAbbrv": "MAN"
        },
        {
            "gameState": "First Half",
            "gameStateId": 3,
            "gameTime": "0:23:17",
            "gameSeconds": 1397,
            "playerId": 500029,
            "playerName": "Justin Horo",
            "scoreMethod": "Try",
            "statId": 38,
            "statValue": 4,
            "vidRef": 40986,
            "homeScore": 6,
            "awayScore": 4,
            "teamId": 500002,
            "teamName": "Manly-Warringah Sea Eagles",
            "homeTeamAbbrv": "PEN",
            "awayTeamAbbrv": "MAN"
        },
        {
            "gameState": "First Half",
            "gameStateId": 3,
            "gameTime": "0:24:57",
            "gameSeconds": 1497,
            "playerId": 500579,
            "playerName": "Peta Hiku",
            "scoreMethod": "Conversion",
            "statId": 1,
            "statValue": 2,
            "vidRef": 43503,
            "homeScore": 6,
            "awayScore": 6,
            "teamId": 500002,
            "teamName": "Manly-Warringah Sea Eagles",
            "homeTeamAbbrv": "PEN",
            "awayTeamAbbrv": "MAN"
        },
        {
            "gameState": "First Half",
            "gameStateId": 3,
            "gameTime": "0:40:00",
            "gameSeconds": 2400,
            "playerId": 500579,
            "playerName": "Peta Hiku",
            "scoreMethod": "Penalty Goal",
            "statId": 67,
            "statValue": 2,
            "vidRef": 65714,
            "homeScore": 6,
            "awayScore": 8,
            "teamId": 500002,
            "teamName": "Manly-Warringah Sea Eagles",
            "homeTeamAbbrv": "PEN",
            "awayTeamAbbrv": "MAN"
        },
        {
            "gameState": "Second Half",
            "gameStateId": 5,
            "gameTime": "1:11:00",
            "gameSeconds": 4260,
            "playerId": 500021,
            "playerName": "Steve Matai",
            "scoreMethod": "Try",
            "statId": 38,
            "statValue": 4,
            "vidRef": 124491,
            "homeScore": 22,
            "awayScore": 12,
            "teamId": 500002,
            "teamName": "Manly-Warringah Sea Eagles",
            "homeTeamAbbrv": "PEN",
            "awayTeamAbbrv": "MAN"
        }
    ]
}