{
    "vod": [
        {
            "id": "50bTQ2NTE64bVjh1yJ_cHf7pdJBih2pb",
            "contentId": 868356,
            "title": "Rd 22: Sharks v Raiders (Hls)",
            "description": "Highlights of the match between the Sharks and Raiders from Southern Cross Group Stadium",
            "publishDate": "2016-08-06T19:36:00+10:00",
            "publisher": "NRL Chief",
            "thumbnailUrl": "http://bigpondvideo.com/web/images/content/20160806193700a_89x50.jpg",
            "largeThumbnailUrl": "http://bigpondvideo.com/web/images/content/20160806193700a_326x184.jpg",
            "programType": "Highlights",
            "programCategory": "Match",
            "priority": null,
            "lastUpdateDate": "2016-08-06T19:41:01+10:00",
            "isPremium": false,
            "club": [
                500013,
                500028
            ]
        },
        {
            "id": "5rMjU2NTE6rFMuSGAx5MGzFOhnxNqRs5",
            "contentId": 868368,
            "title": "Rd 22 Press Conference: Raiders",
            "description": "The Raiders coach faces the media following the match",
            "publishDate": "2016-08-06T20:28:00+10:00",
            "publisher": "NRL Chief",
            "thumbnailUrl": "http://bigpondvideo.com/web/images/content/20160806200237a_89x50.jpg",
            "largeThumbnailUrl": "http://bigpondvideo.com/web/images/content/20160806200237a_326x184.jpg",
            "programType": "Press Conference",
            "programCategory": null,
            "priority": null,
            "lastUpdateDate": "2016-08-06T20:34:13+10:00",
            "isPremium": false,
            "club": [
                500013,
                500028
            ]
        },
        {
            "id": "VlMjU2NTE66-L4Pkf-iJFOltH_SqzZPE",
            "contentId": 868367,
            "title": "Rd 22 Press Conference: Sharks",
            "description": "The Sharks coach faces the media following the match",
            "publishDate": "2016-08-06T20:27:00+10:00",
            "publisher": "NRL Chief",
            "thumbnailUrl": "http://bigpondvideo.com/web/images/content/20160806195752a_89x50.jpg",
            "largeThumbnailUrl": "http://bigpondvideo.com/web/images/content/20160806195752a_326x184.jpg",
            "programType": "Press Conference",
            "programCategory": null,
            "priority": null,
            "lastUpdateDate": "2016-08-06T20:41:15+10:00",
            "isPremium": false,
            "club": [
                500013,
                500028
            ]
        },
        {
            "id": "ZyZzQ2NTE62jmU4mElADUeAmUSagNsb_",
            "contentId": 867947,
            "title": "Rd 22: PENALTY GOAL Jarrod Croker (67th min)",
            "description": "Another penalty goal to the Raiders sees them lead 30-14",
            "publishDate": "2016-08-06T19:10:00+10:00",
            "publisher": "NRL Chief",
            "thumbnailUrl": "http://bigpondvideo.com/web/images/content/20160806191053a_89x50.jpg",
            "largeThumbnailUrl": "http://bigpondvideo.com/web/images/content/20160806191053a_326x184.jpg",
            "programType": "Instant Replay",
            "programCategory": "Score",
            "priority": 1,
            "lastUpdateDate": "2016-08-06T19:27:57+10:00",
            "isPremium": true,
            "club": [
                500013,
                500028
            ]
        },
        {
            "id": "JzZjQ2NTE6p5APmLwkUcBxV2_M2Pu-s9",
            "contentId": 867946,
            "title": "Rd 22: GOAL Jarrod Croker (60th min)",
            "description": "Conversion sees the Raiders lead 28-14",
            "publishDate": "2016-08-06T19:01:00+10:00",
            "publisher": "NRL Chief",
            "thumbnailUrl": "http://bigpondvideo.com/web/images/content/20160806190201a_89x50.jpg",
            "largeThumbnailUrl": "http://bigpondvideo.com/web/images/content/20160806190201a_326x184.jpg",
            "programType": "Instant Replay",
            "programCategory": "Score",
            "priority": null,
            "lastUpdateDate": "2016-08-06T19:09:52+10:00",
            "isPremium": true,
            "club": [
                500013,
                500028
            ]
        },
        {
            "id": "JxZjQ2NTE63eB2V83Wa03b0FkuRYD95-",
            "contentId": 867945,
            "title": "Rd 22: TRY Blake Austin (59th min)",
            "description": "The Raiders strike back as Blake Austin gets the green light from the bunker",
            "publishDate": "2016-08-06T19:00:00+10:00",
            "publisher": "NRL Chief",
            "thumbnailUrl": "http://bigpondvideo.com/web/images/content/20160806190149a_89x50.jpg",
            "largeThumbnailUrl": "http://bigpondvideo.com/web/images/content/20160806190149a_326x184.jpg",
            "programType": "Instant Replay",
            "programCategory": "Score",
            "priority": 2,
            "lastUpdateDate": "2016-08-06T19:27:57+10:00",
            "isPremium": true,
            "club": [
                500013,
                500028
            ]
        },
        {
            "id": "FxZDQ2NTE6Efnxzy8QEOukGWsuUEVLZI",
            "contentId": 867938,
            "title": "Rd 22: GOAL James Maloney (56th min)",
            "description": "Conversion sees the Sharks trail by 8",
            "publishDate": "2016-08-06T18:55:00+10:00",
            "publisher": "NRL Chief",
            "thumbnailUrl": "http://bigpondvideo.com/web/images/content/20160806185831a_89x50.jpg",
            "largeThumbnailUrl": "http://bigpondvideo.com/web/images/content/20160806185831a_326x184.jpg",
            "programType": "Instant Replay",
            "programCategory": "Score",
            "priority": null,
            "lastUpdateDate": "2016-08-06T19:01:50+10:00",
            "isPremium": true,
            "club": [
                500013,
                500028
            ]
        },
        {
            "id": "FvZDQ2NTE6LpJ12svyzLmQTVoSIXI_PF",
            "contentId": 867937,
            "title": "Rd 22: TRY Paul Gallen (55th min)",
            "description": "The Sharks are in as their skipper Paul Gallen goes over for his 3rd try for the year",
            "publishDate": "2016-08-06T18:54:00+10:00",
            "publisher": "NRL Chief",
            "thumbnailUrl": "http://bigpondvideo.com/web/images/content/20160806185818a_89x50.jpg",
            "largeThumbnailUrl": "http://bigpondvideo.com/web/images/content/20160806185818a_326x184.jpg",
            "programType": "Instant Replay",
            "programCategory": "Score",
            "priority": 3,
            "lastUpdateDate": "2016-08-06T19:27:56+10:00",
            "isPremium": true,
            "club": [
                500013,
                500028
            ]
        },
        {
            "id": "J3YjQ2NTE63UngEMUHSjmTP8AXYBPDAq",
            "contentId": 867936,
            "title": "Rd 22: PENALTY GOAL Jarrod Croker (49th min)",
            "description": "Another penalty goal to the Raiders takes them out to a 22-8 lead",
            "publishDate": "2016-08-06T18:47:00+10:00",
            "publisher": "NRL Chief",
            "thumbnailUrl": "http://bigpondvideo.com/web/images/content/20160806185100a_89x50.jpg",
            "largeThumbnailUrl": "http://bigpondvideo.com/web/images/content/20160806185100a_326x184.jpg",
            "programType": "Instant Replay",
            "programCategory": "Score",
            "priority": 4,
            "lastUpdateDate": "2016-08-06T19:26:56+10:00",
            "isPremium": true,
            "club": [
                500013,
                500028
            ]
        },
        {
            "id": "s0MTQ2NTE6cQ4AL3dZdGOOlswBf_Zypt",
            "contentId": 867933,
            "title": "Rd 22: PENALTY GOAL Jarrod Croker (31st min)",
            "description": "Penalty goal to the Raiders takes them out to a 20-8 lead",
            "publishDate": "2016-08-06T18:15:00+10:00",
            "publisher": "NRL Chief",
            "thumbnailUrl": "http://bigpondvideo.com/web/images/content/20160806181604a_89x50.jpg",
            "largeThumbnailUrl": "http://bigpondvideo.com/web/images/content/20160806181604a_326x184.jpg",
            "programType": "Instant Replay",
            "programCategory": "Score",
            "priority": 5,
            "lastUpdateDate": "2016-08-06T19:26:56+10:00",
            "isPremium": true,
            "club": [
                500013,
                500028
            ]
        },
        {
            "id": "NteTM2NTE6b75iAny3WO7OnCEq9zKF-i",
            "contentId": 867931,
            "title": "Rd 22: GOAL Jarrod Croker (27th min)",
            "description": "Conversion sees the Raiders lead by 10",
            "publishDate": "2016-08-06T18:11:00+10:00",
            "publisher": "NRL Chief",
            "thumbnailUrl": "http://bigpondvideo.com/web/images/content/20160806181206a_89x50.jpg",
            "largeThumbnailUrl": "http://bigpondvideo.com/web/images/content/20160806181206a_326x184.jpg",
            "programType": "Instant Replay",
            "programCategory": "Score",
            "priority": null,
            "lastUpdateDate": "2016-08-06T18:15:39+10:00",
            "isPremium": true,
            "club": [
                500013,
                500028
            ]
        },
        {
            "id": "RneTM2NTE6oFb-dIf3ddDjPJttJh38hg",
            "contentId": 867929,
            "title": "Rd 22: TRY Jordan Rapana (26th min)",
            "description": "The visitors go back to back as Jordan Rapana crosses for a super Raiders try",
            "publishDate": "2016-08-06T18:10:00+10:00",
            "publisher": "NRL Chief",
            "thumbnailUrl": "http://bigpondvideo.com/web/images/content/20160806181152a_89x50.jpg",
            "largeThumbnailUrl": "http://bigpondvideo.com/web/images/content/20160806181152a_326x184.jpg",
            "programType": "Instant Replay",
            "programCategory": "Score",
            "priority": 6,
            "lastUpdateDate": "2016-08-06T19:26:56+10:00",
            "isPremium": true,
            "club": [
                500013,
                500028
            ]
        },
        {
            "id": "g3eDM2NTE650t4j1LPbOTt92dELkpDjS",
            "contentId": 867927,
            "title": "Rd 22: GOAL Jarrod Croker (25th min)",
            "description": "Conversion sees the Raiders lead 12-8",
            "publishDate": "2016-08-06T18:08:00+10:00",
            "publisher": "NRL Chief",
            "thumbnailUrl": "http://bigpondvideo.com/web/images/content/20160806180826a_89x50.jpg",
            "largeThumbnailUrl": "http://bigpondvideo.com/web/images/content/20160806180826a_326x184.jpg",
            "programType": "Instant Replay",
            "programCategory": "Score",
            "priority": null,
            "lastUpdateDate": "2016-08-06T18:12:38+10:00",
            "isPremium": true,
            "club": [
                500013,
                500028
            ]
        },
        {
            "id": "R3dzM2NTE6pddswyDctEZ2THjP6QVZ2N",
            "contentId": 867926,
            "title": "Rd 22: TRY Jack Wighton (23rd min)",
            "description": "The Raiders head back in front as Jack Wighton powers over from close range",
            "publishDate": "2016-08-06T18:07:00+10:00",
            "publisher": "NRL Chief",
            "thumbnailUrl": "http://bigpondvideo.com/web/images/content/20160806180712a_89x50.jpg",
            "largeThumbnailUrl": "http://bigpondvideo.com/web/images/content/20160806180712a_326x184.jpg",
            "programType": "Instant Replay",
            "programCategory": "Score",
            "priority": 7,
            "lastUpdateDate": "2016-08-06T19:26:56+10:00",
            "isPremium": true,
            "club": [
                500013,
                500028
            ]
        },
        {
            "id": "l1dzM2NTE6d4qzGtk9I5AKM6H-tws6Zt",
            "contentId": 867925,
            "title": "Rd 22: GOAL James Maloney (19th min)",
            "description": "Conversion sees the Sharks lead by 2",
            "publishDate": "2016-08-06T18:01:00+10:00",
            "publisher": "NRL Chief",
            "thumbnailUrl": "http://bigpondvideo.com/web/images/content/20160806180516a_89x50.jpg",
            "largeThumbnailUrl": "http://bigpondvideo.com/web/images/content/20160806180516a_326x184.jpg",
            "programType": "Instant Replay",
            "programCategory": "Score",
            "priority": null,
            "lastUpdateDate": "2016-08-06T18:11:38+10:00",
            "isPremium": true,
            "club": [
                500013,
                500028
            ]
        },
        {
            "id": "w1djM2NTE6Cs7nGT_qKNpJ8EN31OEune",
            "contentId": 867924,
            "title": "Rd 22: TRY James Maloney (17th min)",
            "description": "The Sharks strike back through a solo effort to James Maloney",
            "publishDate": "2016-08-06T18:00:00+10:00",
            "publisher": "NRL Chief",
            "thumbnailUrl": "http://bigpondvideo.com/web/images/content/20160806180054a_89x50.jpg",
            "largeThumbnailUrl": "http://bigpondvideo.com/web/images/content/20160806180054a_326x184.jpg",
            "programType": "Instant Replay",
            "programCategory": "Score",
            "priority": 8,
            "lastUpdateDate": "2016-08-06T19:25:57+10:00",
            "isPremium": true,
            "club": [
                500013,
                500028
            ]
        },
        {
            "id": "c0dTM2NTE6TsU-J1hzAFtGt2DfDofGEV",
            "contentId": 867923,
            "title": "Rd 22: GOAL Jarrod Croker (12th min)",
            "description": "Conversion sees the Raiders lead 6-2",
            "publishDate": "2016-08-06T17:55:00+10:00",
            "publisher": "NRL Chief",
            "thumbnailUrl": "http://bigpondvideo.com/web/images/content/20160806175531a_89x50.jpg",
            "largeThumbnailUrl": "http://bigpondvideo.com/web/images/content/20160806175531a_326x184.jpg",
            "programType": "Instant Replay",
            "programCategory": "Score",
            "priority": null,
            "lastUpdateDate": "2016-08-06T18:00:35+10:00",
            "isPremium": true,
            "club": [
                500013,
                500028
            ]
        },
        {
            "id": "dydDM2NTE6OSoicnMfZJ53gXs71NZGun",
            "contentId": 867922,
            "title": "Rd 22: TRY Jordan Rapana (11th min)",
            "description": "The Raiders get the first try of the night through Jordan Rapana",
            "publishDate": "2016-08-06T17:54:00+10:00",
            "publisher": "NRL Chief",
            "thumbnailUrl": "http://bigpondvideo.com/web/images/content/20160806175443a_89x50.jpg",
            "largeThumbnailUrl": "http://bigpondvideo.com/web/images/content/20160806175443a_326x184.jpg",
            "programType": "Instant Replay",
            "programCategory": "Score",
            "priority": 9,
            "lastUpdateDate": "2016-08-06T19:25:57+10:00",
            "isPremium": true,
            "club": [
                500013,
                500028
            ]
        },
        {
            "id": "o5cjM2NTE6nczxItck65sX0IHeq0R4sC",
            "contentId": 867921,
            "title": "Rd 22: PENALTY GOAL James Maloney (5th min)",
            "description": "A Penalty goal to the Sharks opens the scoring in this match",
            "publishDate": "2016-08-06T17:45:00+10:00",
            "publisher": "NRL Chief",
            "thumbnailUrl": "http://bigpondvideo.com/web/images/content/20160806174501a_89x50.jpg",
            "largeThumbnailUrl": "http://bigpondvideo.com/web/images/content/20160806174501a_326x184.jpg",
            "programType": "Instant Replay",
            "programCategory": "Score",
            "priority": 10,
            "lastUpdateDate": "2016-08-06T19:25:57+10:00",
            "isPremium": true,
            "club": [
                500013,
                500028
            ]
        }
    ],
    "scores": [
        {
            "gameState": "First Half",
            "gameStateId": 3,
            "gameTime": "0:04:08",
            "gameSeconds": 248,
            "GameMinutes": "04:08",
            "playerId": 500006,
            "playerName": "James Maloney",
            "scoreMethod": "Penalty Goal",
            "statEvent": "Penalty Shot-Made",
            "statId": 67,
            "statValue": 2,
            "vidRef": 6230,
            "homeScore": 2,
            "commentary": "Penalty Shot-Made by James Maloney",
            "tackleNum": -1,
            "teamId": 500028,
            "teamName": "Cronulla-Sutherland Sharks",
            "homeTeamAbbrv": "CRO",
            "awayTeamAbbrv": "CAN"
        },
        {
            "gameState": "First Half",
            "gameStateId": 3,
            "gameTime": "0:16:48",
            "gameSeconds": 1008,
            "GameMinutes": "16:48",
            "playerId": 500006,
            "playerName": "James Maloney",
            "scoreMethod": "Try",
            "statEvent": "Try",
            "statId": 38,
            "statValue": 4,
            "vidRef": 30724,
            "homeScore": 6,
            "awayScore": 6,
            "commentary": "Try by James Maloney",
            "tackleNum": 3,
            "teamId": 500028,
            "teamName": "Cronulla-Sutherland Sharks",
            "homeTeamAbbrv": "CRO",
            "awayTeamAbbrv": "CAN"
        },
        {
            "gameState": "First Half",
            "gameStateId": 3,
            "gameTime": "0:18:32",
            "gameSeconds": 1112,
            "GameMinutes": "18:32",
            "playerId": 500006,
            "playerName": "James Maloney",
            "scoreMethod": "Conversion",
            "statEvent": "Conversion-Made",
            "statId": 1,
            "statValue": 2,
            "vidRef": 33544,
            "homeScore": 8,
            "awayScore": 6,
            "commentary": "Conversion-Made by James Maloney",
            "tackleNum": -1,
            "teamId": 500028,
            "teamName": "Cronulla-Sutherland Sharks",
            "homeTeamAbbrv": "CRO",
            "awayTeamAbbrv": "CAN"
        },
        {
            "gameState": "Second Half",
            "gameStateId": 5,
            "gameTime": "0:54:37",
            "gameSeconds": 3277,
            "GameMinutes": "54:37",
            "playerId": 500794,
            "playerName": "Paul Gallen",
            "scoreMethod": "Try",
            "statEvent": "Try",
            "statId": 38,
            "statValue": 4,
            "vidRef": 93130,
            "homeScore": 12,
            "awayScore": 22,
            "commentary": "Try by Paul Gallen",
            "tackleNum": 6,
            "teamId": 500028,
            "teamName": "Cronulla-Sutherland Sharks",
            "homeTeamAbbrv": "CRO",
            "awayTeamAbbrv": "CAN"
        },
        {
            "gameState": "Second Half",
            "gameStateId": 5,
            "gameTime": "0:55:13",
            "gameSeconds": 3313,
            "GameMinutes": "55:13",
            "playerId": 500006,
            "playerName": "James Maloney",
            "scoreMethod": "Conversion",
            "statEvent": "Conversion-Made",
            "statId": 1,
            "statValue": 2,
            "vidRef": 94021,
            "homeScore": 14,
            "awayScore": 22,
            "commentary": "Conversion-Made by James Maloney",
            "tackleNum": -1,
            "teamId": 500028,
            "teamName": "Cronulla-Sutherland Sharks",
            "homeTeamAbbrv": "CRO",
            "awayTeamAbbrv": "CAN"
        },
        {
            "gameState": "First Half",
            "gameStateId": 3,
            "gameTime": "0:10:51",
            "gameSeconds": 651,
            "GameMinutes": "10:51",
            "playerId": 500330,
            "playerName": "Jordan Rapana",
            "scoreMethod": "Try",
            "statEvent": "Try",
            "statId": 38,
            "statValue": 4,
            "vidRef": 21790,
            "homeScore": 2,
            "awayScore": 4,
            "commentary": "Try by Jordan Rapana",
            "tackleNum": 1,
            "teamId": 500013,
            "teamName": "Canberra Raiders",
            "homeTeamAbbrv": "CRO",
            "awayTeamAbbrv": "CAN"
        },
        {
            "gameState": "First Half",
            "gameStateId": 3,
            "gameTime": "0:11:31",
            "gameSeconds": 691,
            "GameMinutes": "11:31",
            "playerId": 500313,
            "playerName": "Jarrod Croker",
            "scoreMethod": "Conversion",
            "statEvent": "Conversion-Made",
            "statId": 1,
            "statValue": 2,
            "vidRef": 22794,
            "homeScore": 2,
            "awayScore": 6,
            "commentary": "Conversion-Made by Jarrod Croker",
            "tackleNum": -1,
            "teamId": 500013,
            "teamName": "Canberra Raiders",
            "homeTeamAbbrv": "CRO",
            "awayTeamAbbrv": "CAN"
        },
        {
            "gameState": "First Half",
            "gameStateId": 3,
            "gameTime": "0:22:58",
            "gameSeconds": 1378,
            "GameMinutes": "22:58",
            "playerId": 500339,
            "playerName": "Jack Wighton",
            "scoreMethod": "Try",
            "statEvent": "Try",
            "statId": 38,
            "statValue": 4,
            "vidRef": 40195,
            "homeScore": 8,
            "awayScore": 10,
            "commentary": "Try by Jack Wighton",
            "tackleNum": 6,
            "teamId": 500013,
            "teamName": "Canberra Raiders",
            "homeTeamAbbrv": "CRO",
            "awayTeamAbbrv": "CAN"
        },
        {
            "gameState": "First Half",
            "gameStateId": 3,
            "gameTime": "0:24:17",
            "gameSeconds": 1457,
            "GameMinutes": "24:17",
            "playerId": 500313,
            "playerName": "Jarrod Croker",
            "scoreMethod": "Conversion",
            "statEvent": "Conversion-Made",
            "statId": 1,
            "statValue": 2,
            "vidRef": 42155,
            "homeScore": 8,
            "awayScore": 12,
            "commentary": "Conversion-Made by Jarrod Croker",
            "tackleNum": -1,
            "teamId": 500013,
            "teamName": "Canberra Raiders",
            "homeTeamAbbrv": "CRO",
            "awayTeamAbbrv": "CAN"
        },
        {
            "gameState": "First Half",
            "gameStateId": 3,
            "gameTime": "0:25:40",
            "gameSeconds": 1540,
            "GameMinutes": "25:40",
            "playerId": 500330,
            "playerName": "Jordan Rapana",
            "scoreMethod": "Try",
            "statEvent": "Try",
            "statId": 38,
            "statValue": 4,
            "vidRef": 45040,
            "homeScore": 8,
            "awayScore": 16,
            "commentary": "Try by Jordan Rapana",
            "tackleNum": 3,
            "teamId": 500013,
            "teamName": "Canberra Raiders",
            "homeTeamAbbrv": "CRO",
            "awayTeamAbbrv": "CAN"
        },
        {
            "gameState": "First Half",
            "gameStateId": 3,
            "gameTime": "0:26:39",
            "gameSeconds": 1599,
            "GameMinutes": "26:39",
            "playerId": 500313,
            "playerName": "Jarrod Croker",
            "scoreMethod": "Conversion",
            "statEvent": "Conversion-Made",
            "statId": 1,
            "statValue": 2,
            "vidRef": 46531,
            "homeScore": 8,
            "awayScore": 18,
            "commentary": "Conversion-Made by Jarrod Croker",
            "tackleNum": -1,
            "teamId": 500013,
            "teamName": "Canberra Raiders",
            "homeTeamAbbrv": "CRO",
            "awayTeamAbbrv": "CAN"
        },
        {
            "gameState": "First Half",
            "gameStateId": 3,
            "gameTime": "0:30:25",
            "gameSeconds": 1825,
            "GameMinutes": "30:25",
            "playerId": 500313,
            "playerName": "Jarrod Croker",
            "scoreMethod": "Penalty Goal",
            "statEvent": "Penalty Shot-Made",
            "statId": 67,
            "statValue": 2,
            "vidRef": 52171,
            "homeScore": 8,
            "awayScore": 20,
            "commentary": "Penalty Shot-Made by Jarrod Croker",
            "tackleNum": -1,
            "teamId": 500013,
            "teamName": "Canberra Raiders",
            "homeTeamAbbrv": "CRO",
            "awayTeamAbbrv": "CAN"
        },
        {
            "gameState": "Second Half",
            "gameStateId": 5,
            "gameTime": "0:48:32",
            "gameSeconds": 2912,
            "GameMinutes": "48:32",
            "playerId": 500313,
            "playerName": "Jarrod Croker",
            "scoreMethod": "Penalty Goal",
            "statEvent": "Penalty Shot-Made",
            "statId": 67,
            "statValue": 2,
            "vidRef": 82532,
            "homeScore": 8,
            "awayScore": 22,
            "commentary": "Penalty Shot-Made by Jarrod Croker",
            "tackleNum": -1,
            "teamId": 500013,
            "teamName": "Canberra Raiders",
            "homeTeamAbbrv": "CRO",
            "awayTeamAbbrv": "CAN"
        },
        {
            "gameState": "Second Half",
            "gameStateId": 5,
            "gameTime": "0:58:02",
            "gameSeconds": 3482,
            "GameMinutes": "58:02",
            "playerId": 501375,
            "playerName": "Blake Austin",
            "scoreMethod": "Try",
            "statEvent": "Try",
            "statId": 38,
            "statValue": 4,
            "vidRef": 100306,
            "homeScore": 14,
            "awayScore": 26,
            "commentary": "Try by Blake Austin",
            "tackleNum": 5,
            "teamId": 500013,
            "teamName": "Canberra Raiders",
            "homeTeamAbbrv": "CRO",
            "awayTeamAbbrv": "CAN"
        },
        {
            "gameState": "Second Half",
            "gameStateId": 5,
            "gameTime": "0:59:25",
            "gameSeconds": 3565,
            "GameMinutes": "59:25",
            "playerId": 500313,
            "playerName": "Jarrod Croker",
            "scoreMethod": "Conversion",
            "statEvent": "Conversion-Made",
            "statId": 1,
            "statValue": 2,
            "vidRef": 102535,
            "homeScore": 14,
            "awayScore": 28,
            "commentary": "Conversion-Made by Jarrod Croker",
            "tackleNum": -1,
            "teamId": 500013,
            "teamName": "Canberra Raiders",
            "homeTeamAbbrv": "CRO",
            "awayTeamAbbrv": "CAN"
        },
        {
            "gameState": "Second Half",
            "gameStateId": 5,
            "gameTime": "1:06:42",
            "gameSeconds": 4002,
            "GameMinutes": "66:42",
            "playerId": 500313,
            "playerName": "Jarrod Croker",
            "scoreMethod": "Penalty Goal",
            "statEvent": "Penalty Shot-Made",
            "statId": 67,
            "statValue": 2,
            "vidRef": 115261,
            "homeScore": 14,
            "awayScore": 30,
            "commentary": "Penalty Shot-Made by Jarrod Croker",
            "tackleNum": -1,
            "teamId": 500013,
            "teamName": "Canberra Raiders",
            "homeTeamAbbrv": "CRO",
            "awayTeamAbbrv": "CAN"
        }
    ]
}