{
    "competitionId": 111,
    "competitionName": "NRL Telstra Premiership",
    "gameId": 20161111710,
    "gameInfo": {
        "assistantReferee1Id": 500020,
        "numberOfPeriods": 2,
        "assistantReferee1Name": "Jason Walsh",
        "assistantReferee2Id": 500068,
        "assistantReferee2Name": "Chris Sutton",
        "gameDate": "2016-06-30",
        "gameHashTag": "#NRLRoostersBulldogs",
        "gameNumber": 1,
        "gameSeconds": 4800,
        "gameMinutes": "80:00",
        "gameTime": "1:20:00",
        "groundConditionId": 1,
        "groundConditionName": "N/A",
        "referee1Id": 500067,
        "referee1Name": "Grant Atkins",
        "referee2Id": 500009,
        "referee2Name": "Alan Shortall",
        "startTime": "2016-06-30T19:50:00",
        "startTimeUTC": "2016-06-30T09:50:00Z",
        "venueId": 500001,
        "venueName": "Allianz Stadium",
        "videoReferee1Id": 500232,
        "videoReferee1Name": "Luke Patten",
        "videoReferee2Id": 500033,
        "videoReferee2Name": "Steve Chiddy",
        "weatherId": 11,
        "weatherName": "Partly Cloudy",
        "broadcastChannel": null,
        "venueLatitude": -33.8892,
        "venueLongitude": 151.2253,
        "broadcastInfo": {
            "radioNetwork": []
        }
    },
    "gameState": "Final",
    "gameStateId": 8,
    "roundId": 17,
    "roundName": "Round 17",
    "seasonId": 2016,
    "teams": {
        "teamsMatch": [
            {
                "isHomeTeam": true,
                "score": {
                    "conversions": 2,
                    "points": 20,
                    "penaltyGoals": 2,
                    "tries": 3
                },
                "team1stHalfScore": 12,
                "team2ndHalfScore": 8,
                "teamAbbr": "SYD",
                "teamFinalScore": 20,
                "teamFullTimeScore": 20,
                "teamHalfTimeScore": 12,
                "teamId": 500001,
                "teamLineup": {
                    "teamLineUpStatusID": 4,
                    "teamLineUpStatus": "Final",
                    "injuriesAndSuspensions": {
                        "injury": [],
                        "suspension": []
                    },
                    "insAndOuts": {
                        "inOut": []
                    },
                    "teamPlayer": [
                        {
                            "playerFirstName": "Latrell",
                            "playerId": 502502,
                            "playerLastName": "Mitchell",
                            "playerName": "Latrell Mitchell",
                            "playerPosition": "Fullback",
                            "playerPositionId": 500001,
                            "playerStats": {
                                "allRunMetres": 155,
                                "allRuns": 12,
                                "decoys": 3,
                                "errors": 1,
                                "fantasyPointsTotal": 36,
                                "kickReturnMetres": 51,
                                "kickReturns": 6,
                                "kicksDefused": 1,
                                "linebreaks": 1,
                                "mins": 65,
                                "missedTackles": 1,
                                "offloads": 1,
                                "passes": 8,
                                "passesPerRun": 0.67,
                                "points": 4,
                                "supports": 4,
                                "tackleBreaks": 2,
                                "tackles": 4,
                                "tries": 1,
                                "evasionRuns": 6,
                                "evasionRunMetres": 104,
                                "ptbAll": 10,
                                "receipts": 22,
                                "postContactMetres": 28,
                                "dummyPasses": 1,
                                "ptbOneToTwo": 1,
                                "ptbTwoToThree": 2,
                                "ptbThreeToFour": 5,
                                "ptbFourToFive": 1,
                                "ptbFivePlus": 1,
                                "doubles": 1,
                                "effectiveTacklePercentage": 80,
                                "stint1": 3924
                            },
                            "playerTookTheField": true,
                            "shirtNum": 1,
                            "playerFirstInitial": "L",
                            "playerPositionAbbrev": "FB",
                            "fantasyPrice": 293000,
                            "fantasySeasonPriceChange": 163000
                        },
                        {
                            "playerFirstName": "Daniel",
                            "playerId": 500002,
                            "playerLastName": "Tupou",
                            "playerName": "Daniel Tupou",
                            "playerPosition": "Winger 1",
                            "playerPositionId": 500002,
                            "playerStats": {
                                "allRunMetres": 189,
                                "allRuns": 23,
                                "bombKicksDefused": 2,
                                "errors": 2,
                                "fantasyPointsTotal": 42,
                                "ineffectiveTackles": 1,
                                "kickReturnMetres": 16,
                                "kickReturns": 4,
                                "kicksDefused": 2,
                                "kicksNotDefused": 1,
                                "mins": 80,
                                "missedTackles": 3,
                                "offloads": 4,
                                "passes": 3,
                                "passesPerRun": 0.13,
                                "points": 8,
                                "supports": 5,
                                "tackleBreaks": 1,
                                "tackles": 5,
                                "tries": 2,
                                "tryCause": 1,
                                "evasionRuns": 19,
                                "evasionRunMetres": 173,
                                "ptbAll": 17,
                                "receipts": 30,
                                "postContactMetres": 57,
                                "lineEngagedRuns": 1,
                                "ptbOneToTwo": 1,
                                "ptbTwoToThree": 4,
                                "ptbThreeToFour": 9,
                                "ptbFourToFive": 3,
                                "effectiveTacklePercentage": 55.6,
                                "stint1": 4800
                            },
                            "playerTookTheField": true,
                            "shirtNum": 2,
                            "playerFirstInitial": "D",
                            "playerPositionAbbrev": "WG",
                            "onTheField": true,
                            "fantasyPrice": 248000,
                            "fantasySeasonPriceChange": -36000
                        },
                        {
                            "playerFirstName": "Blake",
                            "playerId": 501569,
                            "playerLastName": "Ferguson",
                            "playerName": "Blake Ferguson",
                            "playerPosition": "Centre 1",
                            "playerPositionId": 500003,
                            "playerStats": {
                                "allRunMetres": 87,
                                "allRuns": 9,
                                "fantasyPointsTotal": 15,
                                "kickReturnMetres": 11,
                                "kickReturns": 1,
                                "mins": 80,
                                "missedTackles": 4,
                                "passes": 1,
                                "passesPerRun": 0.11,
                                "oneOnOneTackles": 1,
                                "supports": 8,
                                "tackleBreaks": 1,
                                "tackles": 12,
                                "tryCause": 2,
                                "evasionRuns": 8,
                                "evasionRunMetres": 76,
                                "ptbAll": 9,
                                "receipts": 10,
                                "postContactMetres": 32,
                                "ptbTwoToThree": 3,
                                "ptbThreeToFour": 4,
                                "ptbFourToFive": 1,
                                "ptbFivePlus": 1,
                                "doubles": 2,
                                "effectiveTacklePercentage": 75,
                                "stint1": 4800
                            },
                            "playerTookTheField": true,
                            "shirtNum": 3,
                            "playerFirstInitial": "B",
                            "playerPositionAbbrev": "CT",
                            "onTheField": true,
                            "fantasyPrice": 272000,
                            "fantasySeasonPriceChange": -36000
                        },
                        {
                            "playerFirstName": "Dale",
                            "playerId": 500245,
                            "playerLastName": "Copley",
                            "playerName": "Dale Copley",
                            "playerPosition": "Centre 2",
                            "playerPositionId": 500004,
                            "playerStats": {
                                "allRunMetres": 111,
                                "allRuns": 11,
                                "decoys": 2,
                                "fantasyPointsTotal": 37,
                                "kickMetres": 4,
                                "kicks": 1,
                                "linebreaks": 1,
                                "mins": 80,
                                "missedTackles": 2,
                                "offloads": 1,
                                "passes": 4,
                                "passesPerRun": 0.36,
                                "oneOnOneTackles": 3,
                                "supports": 4,
                                "tackleBreaks": 2,
                                "tackles": 13,
                                "tryAssists": 1,
                                "tryCause": 1,
                                "evasionRuns": 11,
                                "evasionRunMetres": 111,
                                "ptbAll": 6,
                                "receipts": 13,
                                "grubberKick": 1,
                                "postContactMetres": 26,
                                "dummyPasses": 1,
                                "lineEngagedRuns": 2,
                                "ptbTwoToThree": 1,
                                "ptbThreeToFour": 3,
                                "ptbFourToFive": 2,
                                "effectiveTacklePercentage": 86.7,
                                "stint1": 4800
                            },
                            "playerTookTheField": true,
                            "shirtNum": 4,
                            "playerFirstInitial": "D",
                            "playerPositionAbbrev": "CT",
                            "onTheField": true,
                            "fantasyPrice": 148000,
                            "fantasySeasonPriceChange": -23000
                        },
                        {
                            "playerFirstName": "Shaun",
                            "playerId": 500004,
                            "playerLastName": "Kenny-Dowall",
                            "playerName": "Shaun Kenny-Dowall",
                            "playerPosition": "Winger 2",
                            "playerPositionId": 500005,
                            "playerStats": {
                                "allRunMetres": 168,
                                "allRuns": 17,
                                "dummyHalfRuns": 2,
                                "errors": 1,
                                "fantasyPointsTotal": 46,
                                "hitUps": 4,
                                "kickReturnMetres": 17,
                                "kickReturns": 2,
                                "kicksDefused": 1,
                                "linebreaks": 1,
                                "mins": 80,
                                "offloads": 3,
                                "passes": 5,
                                "passesPerRun": 0.29,
                                "penalties": 1,
                                "supports": 12,
                                "tackleBreaks": 7,
                                "tackles": 2,
                                "tryCause": 2,
                                "hitupRunMeters": 42,
                                "evasionRuns": 9,
                                "evasionRunMetres": 83,
                                "dummyHalfRunMetres": 26,
                                "ptbAll": 10,
                                "receipts": 20,
                                "postContactMetres": 31,
                                "dummyPasses": 2,
                                "lineEngagedRuns": 1,
                                "ptbTwoToThree": 6,
                                "ptbThreeToFour": 3,
                                "ptbFivePlus": 1,
                                "effectiveTacklePercentage": 100,
                                "generalPlayPenalties": 1,
                                "foulPlayPenalties": 1,
                                "stint1": 4800
                            },
                            "playerTookTheField": true,
                            "shirtNum": 5,
                            "playerFirstInitial": "S",
                            "playerPositionAbbrev": "WG",
                            "onTheField": true,
                            "fantasyPrice": 333000,
                            "fantasySeasonPriceChange": 18000
                        },
                        {
                            "playerFirstName": "Jackson",
                            "playerId": 500202,
                            "playerLastName": "Hastings",
                            "playerName": "Jackson Hastings",
                            "playerPosition": "Five-Eighth",
                            "playerPositionId": 500006,
                            "playerStats": {
                                "allRunMetres": 58,
                                "allRuns": 7,
                                "bombKicks": 2,
                                "bombKickMetres": 38,
                                "conversions": 1,
                                "conversionsAttempts": 1,
                                "fantasyPointsTotal": 24,
                                "goalConversionRate": 100,
                                "allGoals": 2,
                                "allGoalsAttempted": 2,
                                "ineffectiveTackles": 4,
                                "kickMetres": 47,
                                "kickReturnMetres": 11,
                                "kickReturns": 1,
                                "kicks": 4,
                                "mins": 80,
                                "missedTackles": 2,
                                "passes": 32,
                                "passesPerRun": 4.57,
                                "penaltyGoals": 1,
                                "penaltyGoalsAttempts": 1,
                                "points": 4,
                                "supports": 3,
                                "tackleBreaks": 2,
                                "tackles": 11,
                                "tryCause": 2,
                                "evasionRuns": 6,
                                "evasionRunMetres": 47,
                                "ptbAll": 5,
                                "receipts": 41,
                                "grubberKick": 1,
                                "crossFieldKick": 1,
                                "postContactMetres": 12,
                                "dummyPasses": 4,
                                "kickPressures": 1,
                                "lineEngagedRuns": 1,
                                "ptbTwoToThree": 2,
                                "ptbThreeToFour": 2,
                                "ptbFivePlus": 1,
                                "doubles": 1,
                                "effectiveTacklePercentage": 64.7,
                                "stint1": 4800
                            },
                            "playerTookTheField": true,
                            "shirtNum": 6,
                            "playerFirstInitial": "J",
                            "playerPositionAbbrev": "FE",
                            "onTheField": true,
                            "fantasyPrice": 409000,
                            "fantasySeasonPriceChange": 260000
                        },
                        {
                            "playerFirstName": "Mitchell",
                            "playerId": 500007,
                            "playerLastName": "Pearce",
                            "playerName": "Mitchell Pearce",
                            "playerPosition": "Halfback",
                            "playerPositionId": 500007,
                            "playerStats": {
                                "allRunMetres": 102,
                                "allRuns": 13,
                                "bombKicks": 6,
                                "bombKickMetres": 149,
                                "dummyHalfRuns": 1,
                                "errors": 1,
                                "fantasyPointsTotal": 57,
                                "fieldGoalsAttempts": 1,
                                "fieldGoalsMissed": 1,
                                "ineffectiveTackles": 1,
                                "kickMetres": 362,
                                "kicks": 14,
                                "linebreakAssists": 2,
                                "mins": 80,
                                "missedTackles": 4,
                                "offloads": 2,
                                "passes": 39,
                                "passesPerRun": 3,
                                "oneOnOneTackles": 4,
                                "penalties": 1,
                                "supports": 9,
                                "tackleBreaks": 1,
                                "tackles": 25,
                                "tryAssists": 1,
                                "tryCause": 2,
                                "evasionRuns": 12,
                                "evasionRunMetres": 88,
                                "dummyHalfRunMetres": 14,
                                "ptbAll": 3,
                                "receipts": 60,
                                "grubberKick": 2,
                                "crossFieldKick": 1,
                                "postContactMetres": 11,
                                "dummyPasses": 2,
                                "lineEngagedRuns": 8,
                                "ptbThreeToFour": 3,
                                "doubles": 2,
                                "effectiveTacklePercentage": 83.3,
                                "ptbPenalties": 1,
                                "stint1": 4800
                            },
                            "playerTookTheField": true,
                            "shirtNum": 7,
                            "playerFirstInitial": "M",
                            "playerPositionAbbrev": "HB",
                            "onTheField": true,
                            "fantasyPrice": 423000,
                            "fantasySeasonPriceChange": 20000
                        },
                        {
                            "playerFirstName": "Jared",
                            "playerId": 500008,
                            "playerLastName": "Waerea-Hargreaves",
                            "playerName": "Jared Waerea-Hargreaves",
                            "playerPosition": "Prop 1",
                            "playerPositionId": 500008,
                            "playerStats": {
                                "allRunMetres": 147,
                                "allRuns": 14,
                                "decoys": 4,
                                "fantasyPointsTotal": 46,
                                "hitUps": 13,
                                "ineffectiveTackles": 1,
                                "kickReturnMetres": 10,
                                "kickReturns": 1,
                                "mins": 50,
                                "missedTackles": 2,
                                "offloads": 2,
                                "passes": 3,
                                "passesPerRun": 0.21,
                                "supports": 9,
                                "tackles": 32,
                                "hitupRunMeters": 137,
                                "ptbAll": 12,
                                "receipts": 17,
                                "postContactMetres": 49,
                                "dummyPasses": 1,
                                "kickPressures": 1,
                                "ptbOneToTwo": 1,
                                "ptbTwoToThree": 4,
                                "ptbThreeToFour": 6,
                                "ptbFourToFive": 1,
                                "doubles": 6,
                                "effectiveTacklePercentage": 91.4,
                                "stint1": 1635,
                                "stint2": 1410
                            },
                            "playerTookTheField": true,
                            "shirtNum": 8,
                            "playerFirstInitial": "J",
                            "playerPositionAbbrev": "PR",
                            "onTheField": true,
                            "fantasyPrice": 330000,
                            "fantasySeasonPriceChange": -68000
                        },
                        {
                            "playerFirstName": "Jake",
                            "playerId": 500009,
                            "playerLastName": "Friend",
                            "playerName": "Jake Friend",
                            "playerPosition": "Hooker",
                            "playerPositionId": 500009,
                            "playerStats": {
                                "allRunMetres": 18,
                                "allRuns": 3,
                                "dummyHalfRuns": 2,
                                "errors": 1,
                                "fantasyPointsTotal": 44,
                                "hitUps": 1,
                                "ineffectiveTackles": 1,
                                "kickMetres": 25,
                                "kicks": 1,
                                "mins": 80,
                                "missedTackles": 4,
                                "offloads": 1,
                                "passes": 129,
                                "passesPerRun": 43,
                                "tackles": 50,
                                "tryCause": 1,
                                "hitupRunMeters": 1,
                                "dummyHalfRunMetres": 17,
                                "ptbAll": 1,
                                "receipts": 130,
                                "postContactMetres": 8,
                                "dummyPasses": 1,
                                "lineEngagedRuns": 1,
                                "ptbTwoToThree": 1,
                                "doubles": 12,
                                "longKicksSpace": 1,
                                "effectiveTacklePercentage": 90.9,
                                "stint1": 4800
                            },
                            "playerTookTheField": true,
                            "shirtNum": 9,
                            "playerFirstInitial": "J",
                            "playerPositionAbbrev": "HK",
                            "onTheField": true,
                            "fantasyPrice": 505000,
                            "fantasySeasonPriceChange": 40000
                        },
                        {
                            "playerFirstName": "Dylan",
                            "playerId": 500039,
                            "playerLastName": "Napa",
                            "playerName": "Dylan Napa",
                            "playerPosition": "Prop 2",
                            "playerPositionId": 500010,
                            "playerStats": {
                                "allRunMetres": 146,
                                "allRuns": 12,
                                "decoys": 1,
                                "fantasyPointsTotal": 39,
                                "hitUps": 9,
                                "kickReturnMetres": 41,
                                "kickReturns": 3,
                                "mins": 44,
                                "missedTackles": 1,
                                "passes": 1,
                                "passesPerRun": 0.08,
                                "supports": 6,
                                "tackleBreaks": 2,
                                "tackles": 21,
                                "hitupRunMeters": 105,
                                "ptbAll": 12,
                                "receipts": 13,
                                "postContactMetres": 47,
                                "kickPressures": 2,
                                "ptbTwoToThree": 1,
                                "ptbThreeToFour": 7,
                                "ptbFourToFive": 3,
                                "ptbFivePlus": 1,
                                "doubles": 4,
                                "effectiveTacklePercentage": 95.5,
                                "stint1": 1548,
                                "stint2": 1090
                            },
                            "playerTookTheField": true,
                            "shirtNum": 10,
                            "playerFirstInitial": "D",
                            "playerPositionAbbrev": "PR",
                            "fantasyPrice": 407000,
                            "fantasySeasonPriceChange": 57000
                        },
                        {
                            "playerFirstName": "Aidan",
                            "playerId": 500011,
                            "playerLastName": "Guerra",
                            "playerName": "Aidan Guerra",
                            "playerPosition": "2nd Row 1",
                            "playerPositionId": 500011,
                            "playerStats": {
                                "allRunMetres": 106,
                                "allRuns": 11,
                                "decoys": 8,
                                "errors": 2,
                                "fantasyPointsTotal": 35,
                                "hitUps": 11,
                                "ineffectiveTackles": 2,
                                "mins": 80,
                                "missedTackles": 6,
                                "offloads": 1,
                                "passes": 1,
                                "passesPerRun": 0.09,
                                "oneOnOneTackles": 1,
                                "penalties": 1,
                                "supports": 8,
                                "tackleBreaks": 1,
                                "tackles": 38,
                                "tryCause": 1,
                                "hitupRunMeters": 106,
                                "ptbAll": 9,
                                "receipts": 13,
                                "postContactMetres": 33,
                                "kickPressures": 5,
                                "ptbTwoToThree": 5,
                                "ptbThreeToFour": 2,
                                "ptbFourToFive": 2,
                                "doubles": 7,
                                "effectiveTacklePercentage": 82.6,
                                "ptbPenalties": 1,
                                "stint1": 4800
                            },
                            "playerTookTheField": true,
                            "shirtNum": 11,
                            "playerFirstInitial": "A",
                            "playerPositionAbbrev": "2R",
                            "onTheField": true,
                            "fantasyPrice": 422000,
                            "fantasySeasonPriceChange": 7000
                        },
                        {
                            "playerFirstName": "Mitchell",
                            "playerId": 500016,
                            "playerLastName": "Aubusson",
                            "playerName": "Mitchell Aubusson",
                            "playerPosition": "2nd Row 2",
                            "playerPositionId": 500012,
                            "playerStats": {
                                "allRunMetres": 112,
                                "allRuns": 13,
                                "decoys": 2,
                                "fantasyPointsTotal": 61,
                                "hitUps": 12,
                                "ineffectiveTackles": 1,
                                "linebreakAssists": 1,
                                "mins": 80,
                                "missedTackles": 2,
                                "offloads": 2,
                                "passes": 1,
                                "passesPerRun": 0.08,
                                "oneOnOneTackles": 1,
                                "supports": 8,
                                "tackleBreaks": 2,
                                "tackles": 42,
                                "hitupRunMeters": 107,
                                "evasionRuns": 1,
                                "evasionRunMetres": 5,
                                "ptbAll": 10,
                                "receipts": 13,
                                "postContactMetres": 35,
                                "kickPressures": 2,
                                "lineEngagedRuns": 1,
                                "ptbOneToTwo": 1,
                                "ptbTwoToThree": 4,
                                "ptbThreeToFour": 4,
                                "ptbFourToFive": 1,
                                "doubles": 12,
                                "effectiveTacklePercentage": 93.3,
                                "stint1": 4800
                            },
                            "playerTookTheField": true,
                            "shirtNum": 12,
                            "playerFirstInitial": "M",
                            "playerPositionAbbrev": "2R",
                            "onTheField": true,
                            "fantasyPrice": 290000,
                            "fantasySeasonPriceChange": -46000
                        },
                        {
                            "playerFirstName": "Sio Siua",
                            "playerId": 501179,
                            "playerLastName": "Taukeiaho",
                            "playerName": "Sio Siua Taukeiaho",
                            "playerPosition": "Lock",
                            "playerPositionId": 500013,
                            "playerStats": {
                                "allRunMetres": 192,
                                "allRuns": 18,
                                "conversions": 1,
                                "conversionsAttempts": 2,
                                "conversionsMissed": 1,
                                "decoys": 4,
                                "errors": 1,
                                "fantasyPointsTotal": 48,
                                "goalConversionRate": 66.67,
                                "allGoals": 2,
                                "allGoalsMissed": 1,
                                "allGoalsAttempted": 3,
                                "hitUps": 17,
                                "ineffectiveTackles": 1,
                                "mins": 49,
                                "missedTackles": 1,
                                "passes": 2,
                                "passesPerRun": 0.11,
                                "penaltyGoals": 1,
                                "penaltyGoalsAttempts": 1,
                                "points": 4,
                                "supports": 3,
                                "tackles": 29,
                                "tryCause": 1,
                                "hitupRunMeters": 184,
                                "evasionRuns": 1,
                                "evasionRunMetres": 8,
                                "ptbAll": 16,
                                "receipts": 19,
                                "postContactMetres": 70,
                                "dummyPasses": 5,
                                "kickPressures": 1,
                                "lineEngagedRuns": 1,
                                "ptbOneToTwo": 1,
                                "ptbTwoToThree": 1,
                                "ptbThreeToFour": 6,
                                "ptbFourToFive": 8,
                                "doubles": 4,
                                "effectiveTacklePercentage": 93.5,
                                "stint1": 1848,
                                "stint2": 1077
                            },
                            "playerTookTheField": true,
                            "shirtNum": 13,
                            "playerFirstInitial": "S",
                            "playerPositionAbbrev": "LK",
                            "onTheField": true,
                            "fantasyPrice": 404000,
                            "fantasySeasonPriceChange": 26000
                        },
                        {
                            "playerFirstName": "Sam",
                            "playerId": 500010,
                            "playerLastName": "Moa",
                            "playerName": "Sam Moa",
                            "playerPosition": "Interchange",
                            "playerPositionId": 500014,
                            "playerStats": {
                                "allRunMetres": 52,
                                "allRuns": 6,
                                "decoys": 1,
                                "fantasyPointsTotal": 18,
                                "hitUps": 4,
                                "ineffectiveTackles": 2,
                                "kickReturnMetres": 13,
                                "kickReturns": 1,
                                "mins": 31,
                                "passes": 2,
                                "passesPerRun": 0.33,
                                "penalties": 1,
                                "supports": 1,
                                "tackles": 15,
                                "hitupRunMeters": 33,
                                "evasionRuns": 1,
                                "evasionRunMetres": 6,
                                "ptbAll": 5,
                                "receipts": 7,
                                "postContactMetres": 12,
                                "kickPressures": 1,
                                "lineEngagedRuns": 1,
                                "ptbTwoToThree": 1,
                                "ptbThreeToFour": 4,
                                "doubles": 2,
                                "effectiveTacklePercentage": 88.2,
                                "ptbPenalties": 1,
                                "stint1": 1842
                            },
                            "playerTookTheField": true,
                            "shirtNum": 14,
                            "playerFirstInitial": "S",
                            "playerPositionAbbrev": "INT",
                            "fantasyPrice": 271000,
                            "fantasySeasonPriceChange": -33000
                        },
                        {
                            "playerFirstName": "Isaac",
                            "playerId": 500038,
                            "playerLastName": "Liu",
                            "playerName": "Isaac Liu",
                            "playerPosition": "Interchange",
                            "playerPositionId": 500014,
                            "playerStats": {
                                "allRunMetres": 55,
                                "allRuns": 7,
                                "fantasyPointsTotal": 25,
                                "hitUps": 5,
                                "ineffectiveTackles": 1,
                                "mins": 31,
                                "passes": 2,
                                "passesPerRun": 0.29,
                                "tackles": 20,
                                "hitupRunMeters": 45,
                                "evasionRuns": 2,
                                "evasionRunMetres": 10,
                                "ptbAll": 4,
                                "receipts": 7,
                                "postContactMetres": 13,
                                "lineEngagedRuns": 2,
                                "ptbTwoToThree": 2,
                                "ptbThreeToFour": 1,
                                "ptbFourToFive": 1,
                                "doubles": 1,
                                "effectiveTacklePercentage": 95.2,
                                "stint1": 1875
                            },
                            "playerTookTheField": true,
                            "shirtNum": 15,
                            "playerFirstInitial": "I",
                            "playerPositionAbbrev": "INT",
                            "fantasyPrice": 299000,
                            "fantasySeasonPriceChange": -16000
                        },
                        {
                            "playerFirstName": "Kane",
                            "playerId": 500118,
                            "playerLastName": "Evans",
                            "playerName": "Kane Evans",
                            "playerPosition": "Interchange",
                            "playerPositionId": 500014,
                            "playerStats": {
                                "allRunMetres": 94,
                                "allRuns": 11,
                                "decoys": 1,
                                "errors": 1,
                                "fantasyPointsTotal": 36,
                                "hitUps": 10,
                                "ineffectiveTackles": 1,
                                "kickReturnMetres": 16,
                                "kickReturns": 1,
                                "mins": 35,
                                "missedTackles": 1,
                                "offloads": 2,
                                "penalties": 1,
                                "supports": 5,
                                "tackleBreaks": 1,
                                "tackles": 26,
                                "hitupRunMeters": 78,
                                "ptbAll": 8,
                                "receipts": 11,
                                "postContactMetres": 26,
                                "dummyPasses": 1,
                                "kickPressures": 1,
                                "ptbTwoToThree": 2,
                                "ptbThreeToFour": 2,
                                "ptbFourToFive": 4,
                                "doubles": 4,
                                "effectiveTacklePercentage": 92.9,
                                "ptbPenalties": 1,
                                "stint1": 1755,
                                "stint2": 320
                            },
                            "playerTookTheField": true,
                            "shirtNum": 16,
                            "playerFirstInitial": "K",
                            "playerPositionAbbrev": "INT",
                            "onTheField": true,
                            "fantasyPrice": 294000,
                            "fantasySeasonPriceChange": 21000
                        },
                        {
                            "playerFirstName": "Connor",
                            "playerId": 503327,
                            "playerLastName": "Watson",
                            "playerName": "Connor Watson",
                            "playerPosition": "Interchange",
                            "playerPositionId": 500014,
                            "playerStats": {
                                "allRunMetres": 48,
                                "allRuns": 5,
                                "decoys": 1,
                                "fantasyPointsTotal": 19,
                                "kickReturnMetres": 33,
                                "kickReturns": 2,
                                "kicksDefused": 1,
                                "mins": 15,
                                "passes": 1,
                                "passesPerRun": 0.2,
                                "oneOnOneTackles": 1,
                                "tackleBreaks": 4,
                                "tackles": 2,
                                "evasionRuns": 3,
                                "evasionRunMetres": 15,
                                "ptbAll": 5,
                                "receipts": 6,
                                "postContactMetres": 12,
                                "ptbOneToTwo": 1,
                                "ptbTwoToThree": 2,
                                "ptbThreeToFour": 2,
                                "effectiveTacklePercentage": 100,
                                "stint1": 876
                            },
                            "playerTookTheField": true,
                            "shirtNum": 17,
                            "playerFirstInitial": "C",
                            "playerPositionAbbrev": "INT",
                            "onTheField": true,
                            "fantasyPrice": 152000
                        }
                    ]
                },
                "teamName": "Sydney Roosters",
                "teamNickName": "Roosters",
                "teamStats": {
                    "allRunMetres": 1841,
                    "allRuns": 192,
                    "bombKicks": 8,
                    "bombKickMetres": 187,
                    "bombKicksDefused": 2,
                    "completeSets": 28,
                    "completionPercentage": 72,
                    "conversions": 2,
                    "conversionsAttempts": 3,
                    "conversionsMissed": 1,
                    "decoys": 27,
                    "dummyHalfRuns": 5,
                    "errors": 10,
                    "fieldGoalsAttempts": 1,
                    "fieldGoalsMissed": 1,
                    "goalConversionRate": 80,
                    "allGoals": 4,
                    "allGoalsAttempted": 5,
                    "allGoalsMissed": 1,
                    "hitUps": 86,
                    "incompleteSets": 11,
                    "ineffectiveTackles": 16,
                    "kickMetres": 438,
                    "kickReturnMetres": 219,
                    "kickReturns": 22,
                    "kicks": 20,
                    "kicksDefused": 5,
                    "kicksNotDefused": 1,
                    "linebreakAssists": 3,
                    "linebreaks": 3,
                    "missedTackles": 33,
                    "offloads": 19,
                    "oneOnOneTackles": 11,
                    "passes": 234,
                    "passesPerRun": 1.22,
                    "penalties": 5,
                    "penaltyGoals": 2,
                    "penaltyGoalsAttempts": 2,
                    "points": 20,
                    "pointsConceded": 24,
                    "possession": 53,
                    "scrumWins": 7,
                    "supports": 85,
                    "tackleBreaks": 26,
                    "tackles": 347,
                    "sets": 39,
                    "tries": 3,
                    "triesConceded": 4,
                    "tryAssists": 2,
                    "tryCause": 13,
                    "hitupRunMeters": 839,
                    "evasionRuns": 79,
                    "evasionRunMetres": 726,
                    "dummyHalfRunMetres": 57,
                    "ptbTotal": 142,
                    "twoManTackles": 67,
                    "threeManTackles": 60,
                    "fourManPlusTackles": 1,
                    "tryScoringPercentage": 10.71,
                    "shiftsLeft": 17,
                    "shiftsRight": 16,
                    "receipts": 432,
                    "grubberKick": 4,
                    "crossFieldKick": 2,
                    "postContactMetres": 501,
                    "dummyPasses": 18,
                    "kickPressures": 14,
                    "lineEngagedRuns": 19,
                    "ptbOneToTwo": 6,
                    "ptbTwoToThree": 41,
                    "ptbThreeToFour": 63,
                    "ptbFourToFive": 27,
                    "ptbFivePlus": 5,
                    "interchangeUsed": 8,
                    "doubles": 58,
                    "longKicksSpace": 1,
                    "effectiveTacklePercentage": 87.6,
                    "ptbPenalties": 4,
                    "generalPlayPenalties": 1,
                    "foulPlayPenalties": 1,
                    "averageSetDistance": 47.2,
                    "completeSets1stHalf": 15,
                    "completeSets2ndHalf": 13,
                    "completionPercentage1stHalf": 78.95,
                    "completionPercentage2ndHalf": 65,
                    "incompleteSets1stHalf": 4,
                    "incompleteSets2ndHalf": 7,
                    "incompletionPercentage1stHalf": 21.05,
                    "incompletionPercentage2ndHalf": 35
                },
                "teamHexColour": "062f67",
                "teamHexColour2": "ff1200"
            },
            {
                "score": {
                    "conversions": 4,
                    "points": 24,
                    "tries": 4
                },
                "team1stHalfScore": 12,
                "team2ndHalfScore": 12,
                "teamAbbr": "CBY",
                "teamFinalScore": 24,
                "teamFullTimeScore": 24,
                "teamHalfTimeScore": 12,
                "teamId": 500010,
                "teamLineup": {
                    "teamLineUpStatusID": 4,
                    "teamLineUpStatus": "Final",
                    "injuriesAndSuspensions": {
                        "injury": [],
                        "suspension": []
                    },
                    "insAndOuts": {
                        "inOut": [
                            {
                                "inOut": "Out",
                                "playerFirstName": "Craig",
                                "playerId": "500623",
                                "playerLastName": "Garvey",
                                "playerName": "Craig Garvey"
                            },
                            {
                                "inOut": "In",
                                "playerFirstName": "Josh",
                                "playerId": "500232",
                                "playerLastName": "Morris",
                                "playerName": "Josh Morris"
                            },
                            {
                                "inOut": "Out",
                                "playerFirstName": "Kerrod",
                                "playerId": "503388",
                                "playerLastName": "Holland",
                                "playerName": "Kerrod Holland"
                            },
                            {
                                "inOut": "In",
                                "playerFirstName": "Raymond",
                                "playerId": "500916",
                                "playerLastName": "Faitala-Mariner",
                                "playerName": "Raymond Faitala-Mariner"
                            }
                        ]
                    },
                    "teamPlayer": [
                        {
                            "playerFirstName": "Will",
                            "playerId": 500672,
                            "playerLastName": "Hopoate",
                            "playerName": "Will Hopoate",
                            "playerPosition": "Fullback",
                            "playerPositionId": 500001,
                            "playerStats": {
                                "allRunMetres": 131,
                                "allRuns": 18,
                                "bombKicksDefused": 4,
                                "dummyHalfRuns": 1,
                                "errors": 1,
                                "fantasyPointsTotal": 30,
                                "kickReturnMetres": 50,
                                "kickReturns": 8,
                                "kicksDefused": 5,
                                "mins": 80,
                                "offloads": 2,
                                "passes": 19,
                                "passesPerRun": 1.06,
                                "supports": 7,
                                "tackleBreaks": 3,
                                "tackles": 1,
                                "evasionRuns": 9,
                                "evasionRunMetres": 74,
                                "dummyHalfRunMetres": 7,
                                "ptbAll": 15,
                                "receipts": 37,
                                "postContactMetres": 19,
                                "lineEngagedRuns": 2,
                                "ptbZeroToOne": 1,
                                "ptbTwoToThree": 2,
                                "ptbThreeToFour": 6,
                                "ptbFourToFive": 6,
                                "effectiveTacklePercentage": 100,
                                "stint1": 4800
                            },
                            "playerTookTheField": true,
                            "shirtNum": 1,
                            "playerFirstInitial": "W",
                            "playerPositionAbbrev": "FB",
                            "onTheField": true,
                            "fantasyPrice": 375000,
                            "fantasySeasonPriceChange": 111000,
                            "fantasyRoundPriceChange": 12000
                        },
                        {
                            "playerFirstName": "Brett",
                            "playerId": 500633,
                            "playerLastName": "Morris",
                            "playerName": "Brett Morris",
                            "playerPosition": "Winger 1",
                            "playerPositionId": 500002,
                            "playerStats": {
                                "allRunMetres": 141,
                                "allRuns": 10,
                                "dummyHalfRuns": 2,
                                "fantasyPointsTotal": 59,
                                "ineffectiveTackles": 1,
                                "linebreaks": 3,
                                "mins": 80,
                                "missedTackles": 2,
                                "oneOnOneTackles": 1,
                                "points": 8,
                                "supports": 3,
                                "tackleBreaks": 5,
                                "tackles": 6,
                                "tries": 2,
                                "evasionRuns": 8,
                                "evasionRunMetres": 128,
                                "dummyHalfRunMetres": 13,
                                "ptbAll": 7,
                                "receipts": 10,
                                "postContactMetres": 17,
                                "dummyPasses": 1,
                                "ptbOneToTwo": 1,
                                "ptbTwoToThree": 1,
                                "ptbThreeToFour": 4,
                                "ptbFivePlus": 1,
                                "effectiveTacklePercentage": 66.7,
                                "stint1": 4800
                            },
                            "playerTookTheField": true,
                            "shirtNum": 2,
                            "playerFirstInitial": "B",
                            "playerPositionAbbrev": "WG",
                            "onTheField": true,
                            "fantasyPrice": 372000,
                            "fantasySeasonPriceChange": 7000,
                            "fantasyRoundPriceChange": 7000
                        },
                        {
                            "playerFirstName": "Curtis",
                            "playerId": 500294,
                            "playerLastName": "Rona",
                            "playerName": "Curtis Rona",
                            "playerPosition": "Centre 1",
                            "playerPositionId": 500003,
                            "playerStats": {
                                "allRunMetres": 120,
                                "allRuns": 11,
                                "decoys": 2,
                                "fantasyPointsTotal": 64,
                                "hitUps": 1,
                                "ineffectiveTackles": 1,
                                "linebreaks": 1,
                                "mins": 80,
                                "missedTackles": 2,
                                "offloads": 1,
                                "passes": 8,
                                "passesPerRun": 0.73,
                                "oneOnOneTackles": 4,
                                "points": 4,
                                "supports": 6,
                                "tackleBreaks": 7,
                                "tackles": 21,
                                "tries": 1,
                                "tryCause": 1,
                                "hitupRunMeters": 7,
                                "evasionRuns": 10,
                                "evasionRunMetres": 113,
                                "ptbAll": 7,
                                "receipts": 17,
                                "postContactMetres": 23,
                                "kickPressures": 1,
                                "lineEngagedRuns": 1,
                                "ptbTwoToThree": 2,
                                "ptbThreeToFour": 3,
                                "ptbFourToFive": 1,
                                "ptbFivePlus": 1,
                                "doubles": 2,
                                "effectiveTacklePercentage": 87.5,
                                "stint1": 4800
                            },
                            "playerTookTheField": true,
                            "shirtNum": 3,
                            "playerFirstInitial": "C",
                            "playerPositionAbbrev": "CT",
                            "onTheField": true,
                            "fantasyPrice": 251000,
                            "fantasySeasonPriceChange": -57000,
                            "fantasyRoundPriceChange": 8000
                        },
                        {
                            "playerFirstName": "Josh",
                            "playerId": 500232,
                            "playerLastName": "Morris",
                            "playerName": "Josh Morris",
                            "playerPosition": "Centre 2",
                            "playerPositionId": 500004,
                            "playerStats": {
                                "allRunMetres": 62,
                                "allRuns": 8,
                                "decoys": 2,
                                "fantasyPointsTotal": 27,
                                "ineffectiveTackles": 1,
                                "linebreakAssists": 2,
                                "mins": 80,
                                "missedTackles": 2,
                                "offloads": 1,
                                "passes": 5,
                                "passesPerRun": 0.62,
                                "oneOnOneTackles": 1,
                                "supports": 5,
                                "tackles": 9,
                                "tryAssists": 2,
                                "evasionRuns": 8,
                                "evasionRunMetres": 62,
                                "ptbAll": 3,
                                "receipts": 10,
                                "postContactMetres": 14,
                                "lineEngagedRuns": 3,
                                "ptbThreeToFour": 2,
                                "ptbFourToFive": 1,
                                "effectiveTacklePercentage": 75,
                                "stint1": 4800
                            },
                            "playerTookTheField": true,
                            "shirtNum": 23,
                            "playerFirstInitial": "J",
                            "playerPositionAbbrev": "CT",
                            "onTheField": true,
                            "fantasyPrice": 282000,
                            "fantasySeasonPriceChange": -35000
                        },
                        {
                            "playerFirstName": "Sam",
                            "playerId": 500234,
                            "playerLastName": "Perrett",
                            "playerName": "Sam Perrett",
                            "playerPosition": "Winger 2",
                            "playerPositionId": 500005,
                            "playerStats": {
                                "allRunMetres": 156,
                                "allRuns": 16,
                                "bombKicksDefused": 2,
                                "bombKicksNotDefused": 2,
                                "dummyHalfRuns": 4,
                                "errors": 2,
                                "fantasyPointsTotal": 34,
                                "hitUps": 2,
                                "kickReturnMetres": 31,
                                "kickReturns": 3,
                                "kicksDefused": 3,
                                "kicksNotDefused": 4,
                                "mins": 80,
                                "passes": 7,
                                "passesPerRun": 0.44,
                                "oneOnOneTackles": 1,
                                "supports": 5,
                                "tackleBreaks": 4,
                                "tackles": 8,
                                "tryCause": 1,
                                "hitupRunMeters": 18,
                                "evasionRuns": 7,
                                "evasionRunMetres": 70,
                                "dummyHalfRunMetres": 37,
                                "ptbAll": 15,
                                "receipts": 23,
                                "postContactMetres": 58,
                                "ptbOneToTwo": 1,
                                "ptbTwoToThree": 8,
                                "ptbThreeToFour": 4,
                                "ptbFourToFive": 1,
                                "ptbFivePlus": 1,
                                "effectiveTacklePercentage": 100,
                                "stint1": 4800
                            },
                            "playerTookTheField": true,
                            "shirtNum": 5,
                            "playerFirstInitial": "S",
                            "playerPositionAbbrev": "WG",
                            "onTheField": true,
                            "fantasyPrice": 237000,
                            "fantasySeasonPriceChange": -34000,
                            "fantasyRoundPriceChange": -25000
                        },
                        {
                            "playerFirstName": "Josh",
                            "playerId": 500237,
                            "playerLastName": "Reynolds",
                            "playerName": "Josh Reynolds",
                            "playerPosition": "Five-Eighth",
                            "playerPositionId": 500006,
                            "playerStats": {
                                "allRunMetres": 59,
                                "allRuns": 9,
                                "bombKicks": 2,
                                "bombKickMetres": 34,
                                "errors": 1,
                                "fantasyPointsTotal": 57,
                                "ineffectiveTackles": 3,
                                "kickDead": 1,
                                "kickMetres": 429,
                                "kickReturnMetres": 4,
                                "kickReturns": 1,
                                "kicks": 15,
                                "kicksDefused": 2,
                                "linebreakAssists": 1,
                                "mins": 80,
                                "missedTackles": 3,
                                "offloads": 3,
                                "passes": 21,
                                "passesPerRun": 2.33,
                                "oneOnOneTackles": 2,
                                "penalties": 1,
                                "supports": 2,
                                "tackleBreaks": 3,
                                "tackles": 17,
                                "tryAssists": 1,
                                "tryCause": 1,
                                "evasionRuns": 8,
                                "evasionRunMetres": 55,
                                "ptbAll": 4,
                                "receipts": 45,
                                "grubberKick": 1,
                                "crossFieldKick": 1,
                                "postContactMetres": 11,
                                "dummyPasses": 1,
                                "lineEngagedRuns": 2,
                                "ptbTwoToThree": 1,
                                "ptbThreeToFour": 1,
                                "ptbFourToFive": 1,
                                "ptbFivePlus": 1,
                                "doubles": 2,
                                "longKicksSpace": 3,
                                "effectiveTacklePercentage": 73.9,
                                "ptbPenalties": 1,
                                "stint1": 4800
                            },
                            "playerTookTheField": true,
                            "shirtNum": 6,
                            "playerFirstInitial": "J",
                            "playerPositionAbbrev": "FE",
                            "onTheField": true,
                            "fantasyPrice": 428000,
                            "fantasySeasonPriceChange": 94000,
                            "fantasyRoundPriceChange": -3000
                        },
                        {
                            "playerFirstName": "Moses",
                            "playerId": 500243,
                            "playerLastName": "Mbye",
                            "playerName": "Moses Mbye",
                            "playerPosition": "Halfback",
                            "playerPositionId": 500007,
                            "playerStats": {
                                "allRunMetres": 78,
                                "allRuns": 13,
                                "conversions": 4,
                                "conversionsAttempts": 4,
                                "decoys": 1,
                                "fantasyPointsTotal": 41,
                                "goalConversionRate": 100,
                                "allGoals": 4,
                                "allGoalsAttempted": 4,
                                "ineffectiveTackles": 5,
                                "kickMetres": 135,
                                "kicks": 3,
                                "linebreakAssists": 1,
                                "mins": 80,
                                "missedTackles": 3,
                                "passes": 25,
                                "passesPerRun": 1.92,
                                "oneOnOneTackles": 1,
                                "points": 8,
                                "supports": 9,
                                "tackleBreaks": 2,
                                "tackles": 18,
                                "tryCause": 1,
                                "evasionRuns": 13,
                                "evasionRunMetres": 78,
                                "ptbAll": 4,
                                "receipts": 32,
                                "postContactMetres": 13,
                                "kickPressures": 1,
                                "lineEngagedRuns": 8,
                                "ptbThreeToFour": 1,
                                "ptbFourToFive": 2,
                                "ptbFivePlus": 1,
                                "doubles": 1,
                                "longKicksSpace": 1,
                                "effectiveTacklePercentage": 69.2,
                                "stint1": 4800
                            },
                            "playerTookTheField": true,
                            "shirtNum": 7,
                            "playerFirstInitial": "M",
                            "playerPositionAbbrev": "HB",
                            "onTheField": true,
                            "fantasyPrice": 359000,
                            "fantasySeasonPriceChange": 31000,
                            "fantasyRoundPriceChange": 8000
                        },
                        {
                            "playerFirstName": "Aiden",
                            "playerId": 500241,
                            "playerLastName": "Tolman",
                            "playerName": "Aiden Tolman",
                            "playerPosition": "Prop 1",
                            "playerPositionId": 500008,
                            "playerStats": {
                                "allRunMetres": 165,
                                "allRuns": 20,
                                "decoys": 4,
                                "fantasyPointsTotal": 57,
                                "hitUps": 20,
                                "ineffectiveTackles": 1,
                                "kicksDefused": 1,
                                "mins": 80,
                                "missedTackles": 3,
                                "passes": 7,
                                "passesPerRun": 0.35,
                                "penalties": 1,
                                "supports": 4,
                                "tackleBreaks": 2,
                                "tackles": 42,
                                "hitupRunMeters": 165,
                                "ptbAll": 20,
                                "receipts": 28,
                                "postContactMetres": 58,
                                "kickPressures": 3,
                                "ptbOneToTwo": 2,
                                "ptbTwoToThree": 5,
                                "ptbThreeToFour": 11,
                                "ptbFourToFive": 2,
                                "doubles": 6,
                                "effectiveTacklePercentage": 91.3,
                                "ptbPenalties": 1,
                                "stint1": 4800
                            },
                            "playerTookTheField": true,
                            "shirtNum": 8,
                            "playerFirstInitial": "A",
                            "playerPositionAbbrev": "PR",
                            "onTheField": true,
                            "fantasyPrice": 414000,
                            "fantasySeasonPriceChange": -43000,
                            "fantasyRoundPriceChange": 16000
                        },
                        {
                            "playerFirstName": "Michael",
                            "playerId": 500803,
                            "playerLastName": "Lichaa",
                            "playerName": "Michael Lichaa",
                            "playerPosition": "Hooker",
                            "playerPositionId": 500009,
                            "playerStats": {
                                "allRunMetres": 18,
                                "allRuns": 2,
                                "dummyHalfRuns": 2,
                                "fantasyPointsTotal": 55,
                                "ineffectiveTackles": 4,
                                "linebreakAssists": 1,
                                "mins": 80,
                                "missedTackles": 3,
                                "offloads": 1,
                                "passes": 94,
                                "passesPerRun": 47,
                                "oneOnOneTackles": 1,
                                "supports": 1,
                                "tackles": 51,
                                "tryAssists": 1,
                                "dummyHalfRunMetres": 18,
                                "ptbAll": 1,
                                "receipts": 94,
                                "postContactMetres": 2,
                                "ptbZeroToOne": 1,
                                "doubles": 9,
                                "effectiveTacklePercentage": 87.9,
                                "stint1": 4800
                            },
                            "playerTookTheField": true,
                            "shirtNum": 9,
                            "playerFirstInitial": "M",
                            "playerPositionAbbrev": "HK",
                            "onTheField": true,
                            "fantasyPrice": 393000,
                            "fantasySeasonPriceChange": -54000,
                            "fantasyRoundPriceChange": 3000
                        },
                        {
                            "playerFirstName": "James",
                            "playerId": 500223,
                            "playerLastName": "Graham",
                            "playerName": "James Graham",
                            "playerPosition": "Prop 2",
                            "playerPositionId": 500010,
                            "playerStats": {
                                "allRunMetres": 126,
                                "allRuns": 16,
                                "decoys": 1,
                                "errors": 1,
                                "fantasyPointsTotal": 42,
                                "hitUps": 14,
                                "ineffectiveTackles": 1,
                                "mins": 55,
                                "missedTackles": 2,
                                "passes": 4,
                                "passesPerRun": 0.25,
                                "penalties": 1,
                                "supports": 5,
                                "tackles": 38,
                                "hitupRunMeters": 121,
                                "evasionRuns": 2,
                                "evasionRunMetres": 5,
                                "ptbAll": 14,
                                "receipts": 18,
                                "postContactMetres": 45,
                                "dummyPasses": 2,
                                "kickPressures": 4,
                                "lineEngagedRuns": 2,
                                "ptbOneToTwo": 1,
                                "ptbTwoToThree": 6,
                                "ptbThreeToFour": 6,
                                "ptbFourToFive": 1,
                                "doubles": 5,
                                "effectiveTacklePercentage": 92.7,
                                "offsidePenalties": 1,
                                "stint1": 1555,
                                "stint2": 1753
                            },
                            "playerTookTheField": true,
                            "shirtNum": 10,
                            "playerFirstInitial": "J",
                            "playerPositionAbbrev": "PR",
                            "onTheField": true,
                            "fantasyPrice": 500000,
                            "fantasySeasonPriceChange": 70000,
                            "fantasyRoundPriceChange": -5000
                        },
                        {
                            "playerFirstName": "Josh",
                            "playerId": 500226,
                            "playerLastName": "Jackson",
                            "playerName": "Josh Jackson",
                            "playerPosition": "2nd Row 1",
                            "playerPositionId": 500011,
                            "playerStats": {
                                "allRunMetres": 106,
                                "allRuns": 11,
                                "decoys": 1,
                                "errors": 1,
                                "fantasyPointsTotal": 59,
                                "hitUps": 10,
                                "kicksNotDefused": 1,
                                "linebreaks": 1,
                                "mins": 74,
                                "missedTackles": 3,
                                "passes": 5,
                                "passesPerRun": 0.45,
                                "oneOnOneTackles": 3,
                                "penalties": 2,
                                "points": 4,
                                "supports": 6,
                                "tackleBreaks": 3,
                                "tackles": 38,
                                "tries": 1,
                                "hitupRunMeters": 99,
                                "evasionRuns": 1,
                                "evasionRunMetres": 7,
                                "ptbAll": 9,
                                "receipts": 16,
                                "postContactMetres": 35,
                                "dummyPasses": 3,
                                "kickPressures": 1,
                                "lineEngagedRuns": 1,
                                "ptbTwoToThree": 7,
                                "ptbThreeToFour": 1,
                                "ptbFourToFive": 1,
                                "doubles": 6,
                                "effectiveTacklePercentage": 92.7,
                                "ptbPenalties": 1,
                                "generalPlayPenalties": 1,
                                "stint1": 4429
                            },
                            "playerTookTheField": true,
                            "shirtNum": 11,
                            "playerFirstInitial": "J",
                            "playerPositionAbbrev": "2R",
                            "fantasyPrice": 415000,
                            "fantasySeasonPriceChange": -17000,
                            "fantasyRoundPriceChange": 8000
                        },
                        {
                            "playerFirstName": "Asipeli",
                            "playerId": 501373,
                            "playerLastName": "Fine",
                            "playerName": "Asipeli Fine",
                            "playerPosition": "2nd Row 2",
                            "playerPositionId": 500012,
                            "playerStats": {
                                "allRunMetres": 21,
                                "allRuns": 2,
                                "fantasyPointsTotal": 18,
                                "hitUps": 2,
                                "ineffectiveTackles": 2,
                                "mins": 26,
                                "missedTackles": 2,
                                "oneOnOneTackles": 1,
                                "tackleBreaks": 1,
                                "tackles": 17,
                                "tryCause": 1,
                                "hitupRunMeters": 21,
                                "ptbAll": 2,
                                "receipts": 2,
                                "postContactMetres": 3,
                                "ptbTwoToThree": 1,
                                "ptbFourToFive": 1,
                                "doubles": 1,
                                "effectiveTacklePercentage": 81,
                                "stint1": 1192,
                                "stint2": 371
                            },
                            "playerTookTheField": true,
                            "shirtNum": 20,
                            "playerFirstInitial": "A",
                            "playerPositionAbbrev": "2R",
                            "onTheField": true
                        },
                        {
                            "playerFirstName": "David",
                            "playerId": 500228,
                            "playerLastName": "Klemmer",
                            "playerName": "David Klemmer",
                            "playerPosition": "Lock",
                            "playerPositionId": 500013,
                            "playerStats": {
                                "allRunMetres": 165,
                                "allRuns": 17,
                                "decoys": 5,
                                "fantasyPointsTotal": 54,
                                "hitUps": 14,
                                "ineffectiveTackles": 1,
                                "kickReturnMetres": 48,
                                "kickReturns": 3,
                                "mins": 65,
                                "passes": 2,
                                "passesPerRun": 0.12,
                                "oneOnOneTackles": 1,
                                "penalties": 1,
                                "supports": 2,
                                "tackles": 40,
                                "hitupRunMeters": 117,
                                "ptbAll": 16,
                                "receipts": 19,
                                "postContactMetres": 67,
                                "dummyPasses": 1,
                                "kickPressures": 1,
                                "ptbTwoToThree": 3,
                                "ptbThreeToFour": 9,
                                "ptbFourToFive": 4,
                                "doubles": 7,
                                "effectiveTacklePercentage": 97.6,
                                "ptbPenalties": 1,
                                "stint1": 3048,
                                "stint2": 852
                            },
                            "playerTookTheField": true,
                            "shirtNum": 13,
                            "playerFirstInitial": "D",
                            "playerPositionAbbrev": "LK",
                            "onTheField": true,
                            "fantasyPrice": 400000,
                            "fantasySeasonPriceChange": 44000,
                            "fantasyRoundPriceChange": 6000
                        },
                        {
                            "playerFirstName": "Sam",
                            "playerId": 500227,
                            "playerLastName": "Kasiano",
                            "playerName": "Sam Kasiano",
                            "playerPosition": "Interchange",
                            "playerPositionId": 500014,
                            "playerStats": {
                                "allRunMetres": 73,
                                "allRuns": 8,
                                "decoys": 2,
                                "errors": 1,
                                "fantasyPointsTotal": 25,
                                "hitUps": 7,
                                "ineffectiveTackles": 1,
                                "mins": 25,
                                "offloads": 2,
                                "passes": 3,
                                "passesPerRun": 0.38,
                                "supports": 1,
                                "tackleBreaks": 2,
                                "tackles": 10,
                                "hitupRunMeters": 70,
                                "evasionRuns": 1,
                                "evasionRunMetres": 3,
                                "ptbAll": 4,
                                "receipts": 10,
                                "postContactMetres": 27,
                                "dummyPasses": 1,
                                "kickPressures": 1,
                                "lineEngagedRuns": 1,
                                "ptbOneToTwo": 2,
                                "ptbTwoToThree": 2,
                                "doubles": 1,
                                "effectiveTacklePercentage": 90.9,
                                "stint1": 1492
                            },
                            "playerTookTheField": true,
                            "shirtNum": 14,
                            "playerFirstInitial": "S",
                            "playerPositionAbbrev": "INT",
                            "fantasyPrice": 221000,
                            "fantasySeasonPriceChange": -30000,
                            "fantasyRoundPriceChange": 26000
                        },
                        {
                            "playerFirstName": "Tony",
                            "playerId": 500242,
                            "playerLastName": "Williams",
                            "playerName": "Tony Williams",
                            "playerPosition": "Interchange",
                            "playerPositionId": 500014,
                            "playerStats": {
                                "allRunMetres": 84,
                                "allRuns": 10,
                                "decoys": 1,
                                "fantasyPointsTotal": 30,
                                "hitUps": 8,
                                "ineffectiveTackles": 3,
                                "mins": 53,
                                "passes": 6,
                                "passesPerRun": 0.6,
                                "tackleBreaks": 1,
                                "tackles": 19,
                                "tryCause": 1,
                                "hitupRunMeters": 71,
                                "evasionRuns": 2,
                                "evasionRunMetres": 13,
                                "ptbAll": 7,
                                "receipts": 13,
                                "postContactMetres": 34,
                                "lineEngagedRuns": 2,
                                "ptbOneToTwo": 1,
                                "ptbTwoToThree": 1,
                                "ptbThreeToFour": 3,
                                "ptbFourToFive": 2,
                                "doubles": 3,
                                "effectiveTacklePercentage": 86.4,
                                "stint1": 2863,
                                "stint2": 320
                            },
                            "playerTookTheField": true,
                            "shirtNum": 15,
                            "playerFirstInitial": "T",
                            "playerPositionAbbrev": "INT",
                            "onTheField": true,
                            "fantasyPrice": 273000,
                            "fantasySeasonPriceChange": 9000,
                            "fantasyRoundPriceChange": 19000
                        },
                        {
                            "playerFirstName": "Danny",
                            "playerId": 500131,
                            "playerLastName": "Fualalo",
                            "playerName": "Danny Fualalo",
                            "playerPosition": "Interchange",
                            "playerPositionId": 500014,
                            "playerStats": {
                                "allRunMetres": 69,
                                "allRuns": 7,
                                "decoys": 1,
                                "fantasyPointsTotal": 9,
                                "hitUps": 5,
                                "kickReturnMetres": 29,
                                "kickReturns": 2,
                                "mins": 15,
                                "missedTackles": 1,
                                "supports": 4,
                                "tackles": 5,
                                "hitupRunMeters": 40,
                                "ptbAll": 7,
                                "receipts": 7,
                                "postContactMetres": 22,
                                "kickPressures": 1,
                                "ptbTwoToThree": 1,
                                "ptbThreeToFour": 4,
                                "ptbFourToFive": 2,
                                "doubles": 1,
                                "effectiveTacklePercentage": 83.3,
                                "stint1": 899
                            },
                            "playerTookTheField": true,
                            "shirtNum": 16,
                            "playerFirstInitial": "D",
                            "playerPositionAbbrev": "INT",
                            "fantasyPrice": 144000,
                            "fantasySeasonPriceChange": 10000,
                            "fantasyRoundPriceChange": 9000
                        },
                        {
                            "playerFirstName": "Raymond",
                            "playerId": 500916,
                            "playerLastName": "Faitala-Mariner",
                            "playerName": "Raymond Faitala-Mariner",
                            "playerPosition": "Interchange",
                            "playerPositionId": 500014,
                            "playerStats": {
                                "allRunMetres": 24,
                                "allRuns": 2,
                                "fantasyPointsTotal": 8,
                                "hitUps": 2,
                                "mins": 7,
                                "offloads": 1,
                                "tackles": 4,
                                "hitupRunMeters": 24,
                                "ptbAll": 1,
                                "receipts": 2,
                                "postContactMetres": 11,
                                "ptbFivePlus": 1,
                                "effectiveTacklePercentage": 100,
                                "stint1": 425
                            },
                            "playerTookTheField": true,
                            "shirtNum": 19,
                            "playerFirstInitial": "R",
                            "playerPositionAbbrev": "INT",
                            "fantasyPrice": 262000,
                            "fantasySeasonPriceChange": -44000
                        }
                    ]
                },
                "teamName": "Canterbury-Bankstown Bulldogs",
                "teamNickName": "Bulldogs",
                "teamStats": {
                    "allRunMetres": 1600,
                    "allRuns": 180,
                    "bombKicks": 2,
                    "bombKickMetres": 34,
                    "bombKicksDefused": 6,
                    "bombKicksNotDefused": 2,
                    "completeSets": 27,
                    "completionPercentage": 77,
                    "conversions": 4,
                    "conversionsAttempts": 4,
                    "decoys": 20,
                    "dummyHalfRuns": 9,
                    "errors": 7,
                    "goalConversionRate": 100,
                    "allGoals": 4,
                    "allGoalsAttempted": 4,
                    "hitUps": 85,
                    "incompleteSets": 8,
                    "ineffectiveTackles": 24,
                    "kickDead": 1,
                    "kickMetres": 564,
                    "kickReturnMetres": 163,
                    "kickReturns": 17,
                    "kicks": 18,
                    "kicksDefused": 11,
                    "kicksNotDefused": 5,
                    "linebreakAssists": 5,
                    "linebreaks": 5,
                    "missedTackles": 26,
                    "offloads": 11,
                    "oneOnOneTackles": 16,
                    "passes": 206,
                    "passesPerRun": 1.14,
                    "penalties": 6,
                    "points": 24,
                    "pointsConceded": 20,
                    "possession": 47,
                    "scrumWins": 5,
                    "supports": 60,
                    "tackleBreaks": 33,
                    "tackles": 344,
                    "sets": 35,
                    "tries": 4,
                    "triesConceded": 3,
                    "tryAssists": 4,
                    "tryCause": 6,
                    "hitupRunMeters": 753,
                    "evasionRuns": 69,
                    "evasionRunMetres": 608,
                    "dummyHalfRunMetres": 76,
                    "ptbTotal": 136,
                    "twoManTackles": 66,
                    "threeManTackles": 57,
                    "fourManPlusTackles": 6,
                    "tryScoringPercentage": 14.81,
                    "shiftsLeft": 9,
                    "shiftsRight": 10,
                    "receipts": 383,
                    "grubberKick": 1,
                    "crossFieldKick": 1,
                    "postContactMetres": 459,
                    "dummyPasses": 9,
                    "kickPressures": 13,
                    "lineEngagedRuns": 22,
                    "ptbZeroToOne": 2,
                    "ptbOneToTwo": 8,
                    "ptbTwoToThree": 40,
                    "ptbThreeToFour": 55,
                    "ptbFourToFive": 25,
                    "ptbFivePlus": 6,
                    "interchangeUsed": 7,
                    "interchangeLeft": 1,
                    "doubles": 44,
                    "longKicksSpace": 4,
                    "effectiveTacklePercentage": 87.3,
                    "ptbPenalties": 4,
                    "generalPlayPenalties": 1,
                    "offsidePenalties": 1,
                    "averageSetDistance": 45.7,
                    "completeSets1stHalf": 14,
                    "completeSets2ndHalf": 13,
                    "completionPercentage1stHalf": 77.78,
                    "completionPercentage2ndHalf": 76.47,
                    "incompleteSets1stHalf": 4,
                    "incompleteSets2ndHalf": 4,
                    "incompletionPercentage1stHalf": 22.22,
                    "incompletionPercentage2ndHalf": 23.53
                },
                "teamHexColour": "0055a5",
                "teamHexColour2": "b4b4be"
            }
        ]
    }
}