{
    "competitionId": 111,
    "competitionName": "NRL Telstra Premiership",
    "gameId": 20151110840,
    "gameInfo": {
        "assistantReferee1Id": 500040,
        "numberOfPeriods": 2,
        "assistantReferee1Name": "Nick Beashel",
        "assistantReferee2Id": 500014,
        "assistantReferee2Name": "Jeff Younis",
        "gameDate": "2015-04-25",
        "gameHashTag": "#NRLRoostersDragons",
        "gameNumber": 4,
        "gameSeconds": 4800,
        "gameTime": "1:20:00",
        "groundConditionId": 5,
        "groundConditionName": "Fair",
        "referee1Id": 500004,
        "referee1Name": "Gerard Sutton",
        "referee2Id": 500005,
        "referee2Name": "Gavin Reynolds",
        "startTime": "2015-04-25T16:00:00",
        "startTimeUTC": "2015-04-25T06:00:00Z",
        "venueId": 500001,
        "venueName": "Allianz Stadium",
        "videoReferee1Id": 500232,
        "videoReferee1Name": "Luke Patten",
        "videoReferee2Id": 500027,
        "videoReferee2Name": "Bernard Sutton",
        "weatherId": 4,
        "weatherName": "Rain"
    },
    "gameState": "Final",
    "gameStateId": 8,
    "roundId": 8,
    "seasonId": 2015,
    "teams": {
        "teamsMatch": [
            {
                "isHomeTeam": true,
                "score": {
                    "conversions": 2,
                    "points": 12,
                    "tries": 2
                },
                "team1stHalfScore": 6,
                "team2ndHalfScore": 6,
                "teamAbbr": "SYD",
                "teamFinalScore": 12,
                "teamFullTimeScore": 12,
                "teamHalfTimeScore": 6,
                "teamId": 500001,
                "teamLineup": {
                    "injuriesAndSuspensions": {
                        "injury": [],
                        "suspension": []
                    },
                    "insAndOuts": {
                        "inOut": [
                            {
                                "inOut": "Out",
                                "playerFirstName": "Mitchell",
                                "playerId": "500016",
                                "playerLastName": "Aubusson",
                                "playerName": "Mitchell Aubusson"
                            },
                            {
                                "inOut": "In",
                                "playerFirstName": "Sam",
                                "playerId": "500010",
                                "playerLastName": "Moa",
                                "playerName": "Sam Moa"
                            }
                        ]
                    },
                    "teamPlayer": [
                        {
                            "playerFirstName": "Roger",
                            "playerId": 500005,
                            "playerLastName": "Tuivasa-Sheck",
                            "playerName": "Roger Tuivasa-Sheck",
                            "playerPosition": "Fullback",
                            "playerPositionId": 500001,
                            "playerStats": {
                                "allRunMetres": 171,
                                "allRuns": 19,
                                "decoys": 2,
                                "dummyHalfRuns": 1,
                                "errors": 2,
                                "fantasyPointsTotal": 39,
                                "kickReturnMetres": 73,
                                "kickReturns": 7,
                                "kicksDefused": 4,
                                "linebreaks": 1,
                                "mins": 80,
                                "missedTackles": 1,
                                "supports": 5,
                                "tackleBreaks": 3,
                                "tackles": 3,
                                "tries": 1,
                                "tryCause": 1,
                                "evasionRuns": 11,
                                "evasionRunMetres": 90,
                                "dummyHalfRunMetres": 8,
                                "ptbFast": 7.14,
                                "ptbNeutral": 85.71,
                                "ptbSlow": 7.14,
                                "ptbAll": 14
                            },
                            "playerTookTheField": true,
                            "shirtNum": 1
                        },
                        {
                            "playerFirstName": "Daniel",
                            "playerId": 500002,
                            "playerLastName": "Tupou",
                            "playerName": "Daniel Tupou",
                            "playerPosition": "Winger 1",
                            "playerPositionId": 500002,
                            "playerStats": {
                                "allRunMetres": 98,
                                "allRuns": 12,
                                "bombKicksNotDefused": 1,
                                "dummyHalfRuns": 2,
                                "errors": 3,
                                "fantasyPointsTotal": 18,
                                "kickReturns": 1,
                                "kicksNotDefused": 1,
                                "mins": 80,
                                "supports": 7,
                                "tackleBreaks": 3,
                                "tackles": 6,
                                "evasionRuns": 9,
                                "evasionRunMetres": 82,
                                "dummyHalfRunMetres": 16,
                                "ptbFast": 18.18,
                                "ptbNeutral": 81.82,
                                "ptbAll": 11
                            },
                            "playerTookTheField": true,
                            "shirtNum": 2
                        },
                        {
                            "playerFirstName": "Michael",
                            "playerId": 500003,
                            "playerLastName": "Jennings",
                            "playerName": "Michael Jennings",
                            "playerPosition": "Centre 1",
                            "playerPositionId": 500003,
                            "playerStats": {
                                "allRunMetres": 89,
                                "allRuns": 9,
                                "decoys": 1,
                                "dummyHalfRuns": 1,
                                "errors": 3,
                                "fantasyPointsTotal": 34,
                                "kickReturnMetres": 3,
                                "kickReturns": 1,
                                "kicksDefused": 2,
                                "mins": 80,
                                "missedTackles": 1,
                                "offloads": 1,
                                "supports": 6,
                                "tackleBreaks": 4,
                                "tackles": 18,
                                "evasionRuns": 7,
                                "evasionRunMetres": 85,
                                "dummyHalfRunMetres": 1,
                                "ptbFast": 28.57,
                                "ptbNeutral": 71.43,
                                "ptbAll": 7
                            },
                            "playerTookTheField": true,
                            "shirtNum": 3
                        },
                        {
                            "playerFirstName": "Shaun",
                            "playerId": 500004,
                            "playerLastName": "Kenny-Dowall",
                            "playerName": "Shaun Kenny-Dowall",
                            "playerPosition": "Centre 2",
                            "playerPositionId": 500004,
                            "playerStats": {
                                "allRunMetres": 63,
                                "allRuns": 8,
                                "chargeDowns": 1,
                                "fantasyPointsTotal": 36,
                                "hitUps": 1,
                                "mins": 80,
                                "missedTackles": 2,
                                "oneOnOneTackles": 2,
                                "penalties": 1,
                                "supports": 5,
                                "tackleBreaks": 2,
                                "tackles": 22,
                                "tries": 1,
                                "tryCause": 1,
                                "hitupRunMeters": 8,
                                "evasionRuns": 7,
                                "evasionRunMetres": 55,
                                "ptbFast": 75,
                                "ptbNeutral": 25,
                                "ptbAll": 8
                            },
                            "playerTookTheField": true,
                            "shirtNum": 4
                        },
                        {
                            "playerFirstName": "Nene",
                            "playerId": 500206,
                            "playerLastName": "Macdonald",
                            "playerName": "Nene Macdonald",
                            "playerPosition": "Winger 2",
                            "playerPositionId": 500005,
                            "playerStats": {
                                "allRunMetres": 87,
                                "allRuns": 9,
                                "dummyHalfRuns": 1,
                                "errors": 1,
                                "fantasyPointsTotal": 16,
                                "kickMetres": 14,
                                "kickReturnMetres": 30,
                                "kickReturns": 2,
                                "kicks": 1,
                                "kicksNotDefused": 1,
                                "mins": 80,
                                "supports": 1,
                                "tackleBreaks": 2,
                                "tackles": 4,
                                "tryCause": 1,
                                "evasionRuns": 6,
                                "evasionRunMetres": 57,
                                "ptbFast": 83.33,
                                "ptbNeutral": 16.67,
                                "ptbAll": 6
                            },
                            "playerTookTheField": true,
                            "shirtNum": 5
                        },
                        {
                            "playerFirstName": "James",
                            "playerId": 500006,
                            "playerLastName": "Maloney",
                            "playerName": "James Maloney",
                            "playerPosition": "Five-eighth",
                            "playerPositionId": 500006,
                            "playerStats": {
                                "allRunMetres": 43,
                                "allRuns": 8,
                                "bombKicks": 3,
                                "bombKickMetres": 60,
                                "chargeDowns": 2,
                                "conversions": 2,
                                "conversionsAttempts": 2,
                                "decoys": 1,
                                "fantasyPointsTotal": 37,
                                "kickMetres": 197,
                                "kickReturns": 1,
                                "kicks": 8,
                                "kicksDefused": 1,
                                "kicksNotDefused": 1,
                                "lineDropouts": 2,
                                "mins": 80,
                                "missedTackles": 2,
                                "supports": 16,
                                "tackles": 23,
                                "evasionRuns": 7,
                                "evasionRunMetres": 43,
                                "ptbFast": 20,
                                "ptbNeutral": 80,
                                "ptbAll": 5
                            },
                            "playerTookTheField": true,
                            "shirtNum": 6
                        },
                        {
                            "playerFirstName": "Mitchell",
                            "playerId": 500007,
                            "playerLastName": "Pearce",
                            "playerName": "Mitchell Pearce",
                            "playerPosition": "Halfback",
                            "playerPositionId": 500007,
                            "playerStats": {
                                "allRunMetres": 126,
                                "allRuns": 16,
                                "bombKicks": 1,
                                "bombKickMetres": 33,
                                "chargeDowns": 1,
                                "errors": 1,
                                "fantasyPointsTotal": 42,
                                "kickMetres": 140,
                                "kicks": 7,
                                "kicksDefused": 1,
                                "kicksNotDefused": 1,
                                "mins": 80,
                                "missedTackles": 3,
                                "offloads": 2,
                                "oneOnOneTackles": 1,
                                "penalties": 1,
                                "supports": 17,
                                "tackleBreaks": 1,
                                "tackles": 25,
                                "tryCause": 2,
                                "evasionRuns": 16,
                                "evasionRunMetres": 126,
                                "ptbFast": 28.57,
                                "ptbNeutral": 71.43,
                                "ptbAll": 7
                            },
                            "playerTookTheField": true,
                            "shirtNum": 7
                        },
                        {
                            "playerFirstName": "Jared",
                            "playerId": 500008,
                            "playerLastName": "Waerea-Hargreaves",
                            "playerName": "Jared Waerea-Hargreaves",
                            "playerPosition": "Prop 1",
                            "playerPositionId": 500008,
                            "playerStats": {
                                "allRunMetres": 85,
                                "allRuns": 11,
                                "decoys": 2,
                                "fantasyPointsTotal": 48,
                                "hitUps": 9,
                                "mins": 56,
                                "missedTackles": 2,
                                "offloads": 3,
                                "penalties": 1,
                                "supports": 12,
                                "tackles": 40,
                                "hitupRunMeters": 72,
                                "evasionRuns": 2,
                                "evasionRunMetres": 13,
                                "ptbFast": 60,
                                "ptbNeutral": 40,
                                "ptbAll": 5
                            },
                            "playerTookTheField": true,
                            "shirtNum": 23
                        },
                        {
                            "playerFirstName": "Jake",
                            "playerId": 500009,
                            "playerLastName": "Friend",
                            "playerName": "Jake Friend",
                            "playerPosition": "Hooker",
                            "playerPositionId": 500009,
                            "playerStats": {
                                "allRunMetres": 12,
                                "allRuns": 4,
                                "chargeDowns": 1,
                                "dummyHalfRuns": 2,
                                "fantasyPointsTotal": 60,
                                "hitUps": 2,
                                "ineffectiveTackles": 3,
                                "kickMetres": 99,
                                "kicks": 4,
                                "mins": 80,
                                "missedTackles": 1,
                                "offloads": 1,
                                "oneOnOneTackles": 2,
                                "tackles": 55,
                                "hitupRunMeters": 4,
                                "dummyHalfRunMetres": 8,
                                "ptbNeutral": 100,
                                "ptbAll": 2
                            },
                            "playerTookTheField": true,
                            "shirtNum": 9
                        },
                        {
                            "playerFirstName": "Sam",
                            "playerId": 500010,
                            "playerLastName": "Moa",
                            "playerName": "Sam Moa",
                            "playerPosition": "Prop 2",
                            "playerPositionId": 500010,
                            "playerStats": {
                                "allRunMetres": 62,
                                "allRuns": 9,
                                "errors": 1,
                                "fantasyPointsTotal": 40,
                                "hitUps": 8,
                                "ineffectiveTackles": 1,
                                "mins": 40,
                                "offloads": 1,
                                "oneOnOneTackles": 1,
                                "penalties": 1,
                                "supports": 1,
                                "tackleBreaks": 1,
                                "tackles": 33,
                                "hitupRunMeters": 59,
                                "evasionRuns": 1,
                                "evasionRunMetres": 3,
                                "ptbFast": 33.33,
                                "ptbNeutral": 66.67,
                                "ptbAll": 6
                            },
                            "playerTookTheField": true,
                            "shirtNum": 10
                        },
                        {
                            "playerFirstName": "Boyd",
                            "playerId": 500013,
                            "playerLastName": "Cordner",
                            "playerName": "Boyd Cordner",
                            "playerPosition": "2nd Row 1",
                            "playerPositionId": 500011,
                            "playerStats": {
                                "allRunMetres": 99,
                                "allRuns": 11,
                                "decoys": 6,
                                "fantasyPointsTotal": 42,
                                "hitUps": 11,
                                "ineffectiveTackles": 2,
                                "mins": 80,
                                "missedTackles": 3,
                                "offloads": 2,
                                "oneOnOneTackles": 1,
                                "supports": 7,
                                "tackleBreaks": 1,
                                "tackles": 32,
                                "hitupRunMeters": 99,
                                "ptbFast": 11.11,
                                "ptbNeutral": 88.89,
                                "ptbAll": 9
                            },
                            "playerTookTheField": true,
                            "shirtNum": 11
                        },
                        {
                            "playerFirstName": "Dylan",
                            "playerId": 500039,
                            "playerLastName": "Napa",
                            "playerName": "Dylan Napa",
                            "playerPosition": "2nd Row 2",
                            "playerPositionId": 500012,
                            "playerStats": {
                                "allRunMetres": 83,
                                "allRuns": 9,
                                "decoys": 5,
                                "errors": 1,
                                "fantasyPointsTotal": 27,
                                "hitUps": 8,
                                "kickReturnMetres": 12,
                                "kickReturns": 1,
                                "kicksNotDefused": 1,
                                "mins": 75,
                                "missedTackles": 5,
                                "onReport": 2,
                                "oneOnOneTackles": 1,
                                "penalties": 2,
                                "supports": 8,
                                "tackles": 35,
                                "hitupRunMeters": 71,
                                "ptbFast": 22.22,
                                "ptbNeutral": 77.78,
                                "ptbAll": 9
                            },
                            "playerTookTheField": true,
                            "shirtNum": 17
                        },
                        {
                            "playerFirstName": "Sio Siua",
                            "playerId": 501179,
                            "playerLastName": "Taukeiaho",
                            "playerName": "Sio Siua Taukeiaho",
                            "playerPosition": "Lock",
                            "playerPositionId": 500013,
                            "playerStats": {
                                "allRunMetres": 74,
                                "allRuns": 7,
                                "decoys": 2,
                                "fantasyPointsTotal": 38,
                                "hitUps": 7,
                                "ineffectiveTackles": 1,
                                "mins": 44,
                                "penalties": 1,
                                "supports": 4,
                                "tackles": 28,
                                "trySaves": 1,
                                "hitupRunMeters": 74,
                                "ptbFast": 14.29,
                                "ptbNeutral": 85.71,
                                "ptbAll": 7
                            },
                            "playerTookTheField": true,
                            "shirtNum": 13
                        },
                        {
                            "playerFirstName": "Willie",
                            "playerId": 503118,
                            "playerLastName": "Manu",
                            "playerName": "Willie Manu",
                            "playerPosition": "Interchange",
                            "playerPositionId": 500014,
                            "playerStats": {
                                "allRunMetres": 17,
                                "allRuns": 1,
                                "decoys": 1,
                                "fantasyPointsTotal": 7,
                                "hitUps": 1,
                                "mins": 12,
                                "missedTackles": 1,
                                "supports": 1,
                                "tackleBreaks": 1,
                                "tackles": 5,
                                "hitupRunMeters": 17,
                                "ptbNeutral": 100,
                                "ptbAll": 1
                            },
                            "playerTookTheField": true,
                            "shirtNum": 14
                        },
                        {
                            "playerFirstName": "Isaac",
                            "playerId": 500038,
                            "playerLastName": "Liu",
                            "playerName": "Isaac Liu",
                            "playerPosition": "Interchange",
                            "playerPositionId": 500014,
                            "playerStats": {
                                "allRunMetres": 120,
                                "allRuns": 11,
                                "decoys": 4,
                                "fantasyPointsTotal": 39,
                                "hitUps": 11,
                                "ineffectiveTackles": 1,
                                "mins": 42,
                                "supports": 5,
                                "tackles": 27,
                                "hitupRunMeters": 120,
                                "ptbFast": 27.27,
                                "ptbNeutral": 72.73,
                                "ptbAll": 11
                            },
                            "playerTookTheField": true,
                            "shirtNum": 15
                        },
                        {
                            "playerFirstName": "Kane",
                            "playerId": 500118,
                            "playerLastName": "Evans",
                            "playerName": "Kane Evans",
                            "playerPosition": "Interchange",
                            "playerPositionId": 500014,
                            "playerStats": {
                                "allRunMetres": 85,
                                "allRuns": 7,
                                "decoys": 4,
                                "errors": 1,
                                "fantasyPointsTotal": 27,
                                "hitUps": 3,
                                "kickReturnMetres": 50,
                                "kickReturns": 4,
                                "mins": 33,
                                "supports": 4,
                                "tackles": 21,
                                "hitupRunMeters": 35,
                                "ptbFast": 16.67,
                                "ptbNeutral": 83.33,
                                "ptbAll": 6
                            },
                            "playerTookTheField": true,
                            "shirtNum": 16
                        },
                        {
                            "playerFirstName": "Lagi",
                            "playerId": 500333,
                            "playerLastName": "Setu",
                            "playerName": "Lagi Setu",
                            "playerPosition": "Interchange",
                            "playerPositionId": 500014,
                            "playerStats": {
                                "allRunMetres": 59,
                                "allRuns": 6,
                                "decoys": 2,
                                "fantasyPointsTotal": 12,
                                "hitUps": 5,
                                "ineffectiveTackles": 1,
                                "mins": 18,
                                "oneOnOneTackles": 1,
                                "supports": 2,
                                "tackles": 7,
                                "hitupRunMeters": 55,
                                "evasionRuns": 1,
                                "evasionRunMetres": 4,
                                "ptbNeutral": 100,
                                "ptbAll": 5
                            },
                            "playerTookTheField": true,
                            "shirtNum": 18
                        }
                    ]
                },
                "teamName": "Sydney Roosters",
                "teamNickName": "Roosters",
                "teamStats": {
                    "allRunMetres": 1372,
                    "allRuns": 157,
                    "bombKicks": 4,
                    "bombKickMetres": 93,
                    "bombKicksNotDefused": 1,
                    "chargeDowns": 5,
                    "completeSets": 27,
                    "completionPercentage": 68,
                    "conversions": 2,
                    "conversionsAttempts": 2,
                    "decoys": 30,
                    "dummyHalfRuns": 7,
                    "errors": 13,
                    "hitUps": 66,
                    "incompleteSets": 13,
                    "ineffectiveTackles": 9,
                    "kickMetres": 448,
                    "kickReturnMetres": 168,
                    "kickReturns": 17,
                    "kicks": 20,
                    "kicksDefused": 8,
                    "kicksNotDefused": 5,
                    "lineDropouts": 2,
                    "linebreaks": 1,
                    "missedTackles": 21,
                    "onReports": 2,
                    "oneOnOneTackles": 9,
                    "penalties": 7,
                    "points": 12,
                    "pointsConceded": 14,
                    "possession": 46,
                    "scrumWins": 6,
                    "supports": 101,
                    "tackleBreaks": 18,
                    "tackles": 384,
                    "sets": 40,
                    "tries": 2,
                    "triesConceded": 2,
                    "offloads": 10,
                    "trySaves": 1,
                    "hitupRunMeters": 614,
                    "evasionRuns": 67,
                    "evasionRunMetres": 557,
                    "dummyHalfRunMetres": 33,
                    "ptbFast": 27,
                    "ptbNeutral": 72,
                    "ptbSlow": 1,
                    "ptbTotal": 119
                }
            },
            {
                "score": {
                    "conversions": 1,
                    "points": 14,
                    "penaltyGoals": 2,
                    "tries": 2
                },
                "team1stHalfScore": 10,
                "team2ndHalfScore": 4,
                "teamAbbr": "SGI",
                "teamFinalScore": 14,
                "teamFullTimeScore": 14,
                "teamHalfTimeScore": 10,
                "teamId": 500022,
                "teamLineup": {
                    "injuriesAndSuspensions": {
                        "injury": [],
                        "suspension": []
                    },
                    "insAndOuts": {
                        "inOut": [
                            {
                                "inOut": "Out",
                                "playerFirstName": "Etonia",
                                "playerId": "500357",
                                "playerLastName": "Nabuli",
                                "playerName": "Etonia Nabuli"
                            },
                            {
                                "inOut": "In",
                                "playerFirstName": "Jason",
                                "playerId": "500634",
                                "playerLastName": "Nightingale",
                                "playerName": "Jason Nightingale"
                            }
                        ]
                    },
                    "teamPlayer": [
                        {
                            "playerFirstName": "Josh",
                            "playerId": 500621,
                            "playerLastName": "Dugan",
                            "playerName": "Josh Dugan",
                            "playerPosition": "Fullback",
                            "playerPositionId": 500001,
                            "playerStats": {
                                "allRunMetres": 153,
                                "allRuns": 17,
                                "bombKicksDefused": 2,
                                "decoys": 2,
                                "errors": 1,
                                "fantasyPointsTotal": 27,
                                "kickReturnMetres": 44,
                                "kickReturns": 6,
                                "kicksDefused": 5,
                                "kicksNotDefused": 1,
                                "lineDropouts": 2,
                                "mins": 80,
                                "oneOnOneTackles": 1,
                                "supports": 8,
                                "tackleBreaks": 1,
                                "tackles": 6,
                                "tryCause": 1,
                                "evasionRuns": 11,
                                "evasionRunMetres": 109,
                                "ptbFast": 26.67,
                                "ptbNeutral": 73.33,
                                "ptbAll": 15
                            },
                            "playerTookTheField": true,
                            "shirtNum": 1
                        },
                        {
                            "playerFirstName": "Jason",
                            "playerId": 500634,
                            "playerLastName": "Nightingale",
                            "playerName": "Jason Nightingale",
                            "playerPosition": "Winger 1",
                            "playerPositionId": 500002,
                            "playerStats": {
                                "allRunMetres": 104,
                                "allRuns": 14,
                                "bombKicksDefused": 1,
                                "dummyHalfRuns": 2,
                                "errors": 1,
                                "fantasyPointsTotal": 17,
                                "ineffectiveTackles": 1,
                                "kickReturnMetres": 13,
                                "kickReturns": 3,
                                "kicksDefused": 1,
                                "mins": 80,
                                "missedTackles": 2,
                                "offloads": 1,
                                "supports": 8,
                                "tackles": 10,
                                "evasionRuns": 9,
                                "evasionRunMetres": 64,
                                "dummyHalfRunMetres": 27,
                                "ptbFast": 45.45,
                                "ptbNeutral": 54.55,
                                "ptbAll": 11
                            },
                            "playerTookTheField": true,
                            "shirtNum": 22
                        },
                        {
                            "playerFirstName": "Euan",
                            "playerId": 500441,
                            "playerLastName": "Aitken",
                            "playerName": "Euan Aitken",
                            "playerPosition": "Centre 1",
                            "playerPositionId": 500003,
                            "playerStats": {
                                "allRunMetres": 149,
                                "allRuns": 14,
                                "fantasyPointsTotal": 28,
                                "mins": 80,
                                "missedTackles": 2,
                                "oneOnOneTackles": 3,
                                "penalties": 1,
                                "supports": 4,
                                "tackleBreaks": 1,
                                "tackles": 17,
                                "tryCause": 1,
                                "evasionRuns": 14,
                                "evasionRunMetres": 149,
                                "ptbFast": 30.77,
                                "ptbNeutral": 69.23,
                                "ptbAll": 13
                            },
                            "playerTookTheField": true,
                            "shirtNum": 3
                        },
                        {
                            "playerFirstName": "Dylan",
                            "playerId": 500084,
                            "playerLastName": "Farrell",
                            "playerName": "Dylan Farrell",
                            "playerPosition": "Centre 2",
                            "playerPositionId": 500004,
                            "playerStats": {
                                "allRunMetres": 72,
                                "allRuns": 10,
                                "decoys": 4,
                                "fantasyPointsTotal": 23,
                                "hitUps": 1,
                                "mins": 80,
                                "missedTackles": 4,
                                "oneOnOneTackles": 1,
                                "supports": 5,
                                "tackleBreaks": 1,
                                "tackles": 21,
                                "hitupRunMeters": 7,
                                "evasionRuns": 9,
                                "evasionRunMetres": 65,
                                "ptbFast": 22.22,
                                "ptbNeutral": 77.78,
                                "ptbAll": 9
                            },
                            "playerTookTheField": true,
                            "shirtNum": 4
                        },
                        {
                            "playerFirstName": "Peter",
                            "playerId": 500630,
                            "playerLastName": "Mata'utia",
                            "playerName": "Peter Mata'utia",
                            "playerPosition": "Winger 2",
                            "playerPositionId": 500005,
                            "playerStats": {
                                "allRunMetres": 91,
                                "allRuns": 9,
                                "decoys": 2,
                                "errors": 2,
                                "fantasyPointsTotal": 14,
                                "kickReturnMetres": 29,
                                "kickReturns": 2,
                                "kicksNotDefused": 1,
                                "mins": 80,
                                "missedTackles": 1,
                                "supports": 8,
                                "tackles": 3,
                                "tries": 1,
                                "tryCause": 1,
                                "evasionRuns": 7,
                                "evasionRunMetres": 62,
                                "ptbNeutral": 100,
                                "ptbAll": 9
                            },
                            "playerTookTheField": true,
                            "shirtNum": 5
                        },
                        {
                            "playerFirstName": "Gareth",
                            "playerId": 500641,
                            "playerLastName": "Widdop",
                            "playerName": "Gareth Widdop",
                            "playerPosition": "Five-eighth",
                            "playerPositionId": 500006,
                            "playerStats": {
                                "allRunMetres": 66,
                                "allRuns": 10,
                                "chargedDown": 3,
                                "conversions": 1,
                                "conversionsAttempts": 2,
                                "conversionsMissed": 1,
                                "errors": 3,
                                "fantasyPointsTotal": 44,
                                "goalConversionRate": 50,
                                "kickMetres": 221,
                                "kickReturnMetres": 16,
                                "kickReturns": 1,
                                "kicks": 10,
                                "kicksDefused": 1,
                                "mins": 80,
                                "missedTackles": 1,
                                "oneOnOneTackles": 2,
                                "penalties": 1,
                                "penaltyGoals": 2,
                                "penaltyGoalsAttempts": 2,
                                "supports": 5,
                                "tackleBreaks": 5,
                                "tackles": 10,
                                "tryAssists": 1,
                                "evasionRuns": 9,
                                "evasionRunMetres": 50,
                                "ptbNeutral": 100,
                                "ptbAll": 5
                            },
                            "playerTookTheField": true,
                            "shirtNum": 6
                        },
                        {
                            "playerFirstName": "Benji",
                            "playerId": 500948,
                            "playerLastName": "Marshall",
                            "playerName": "Benji Marshall",
                            "playerPosition": "Halfback",
                            "playerPositionId": 500007,
                            "playerStats": {
                                "allRunMetres": 14,
                                "allRuns": 2,
                                "bombKicks": 1,
                                "bombKickMetres": 19,
                                "chargedDown": 2,
                                "errors": 1,
                                "fantasyPointsTotal": 30,
                                "ineffectiveTackles": 1,
                                "kickMetres": 517,
                                "kicks": 16,
                                "mins": 80,
                                "missedTackles": 2,
                                "oneOnOneTackles": 1,
                                "supports": 6,
                                "tackleBreaks": 1,
                                "tackles": 7,
                                "evasionRuns": 2,
                                "evasionRunMetres": 14,
                                "ptbNeutral": 100,
                                "ptbAll": 1
                            },
                            "playerTookTheField": true,
                            "shirtNum": 7
                        },
                        {
                            "playerFirstName": "Leeson",
                            "playerId": 500614,
                            "playerLastName": "Ah Mau",
                            "playerName": "Leeson Ah Mau",
                            "playerPosition": "Prop 1",
                            "playerPositionId": 500008,
                            "playerStats": {
                                "allRunMetres": 92,
                                "allRuns": 9,
                                "decoys": 6,
                                "fantasyPointsTotal": 30,
                                "hitUps": 6,
                                "kickReturnMetres": 36,
                                "kickReturns": 3,
                                "mins": 41,
                                "supports": 8,
                                "tackles": 21,
                                "hitupRunMeters": 56,
                                "ptbNeutral": 88.89,
                                "ptbSlow": 11.11,
                                "ptbAll": 9
                            },
                            "playerTookTheField": true,
                            "shirtNum": 8
                        },
                        {
                            "playerFirstName": "Mitch",
                            "playerId": 500636,
                            "playerLastName": "Rein",
                            "playerName": "Mitch Rein",
                            "playerPosition": "Hooker",
                            "playerPositionId": 500009,
                            "playerStats": {
                                "allRunMetres": 61,
                                "allRuns": 10,
                                "dummyHalfRuns": 9,
                                "fantasyPointsTotal": 54,
                                "hitUps": 1,
                                "ineffectiveTackles": 2,
                                "kickMetres": 11,
                                "kicks": 1,
                                "linebreaks": 1,
                                "mins": 58,
                                "missedTackles": 1,
                                "offloads": 1,
                                "oneOnOneTackles": 3,
                                "penalties": 1,
                                "tackleBreaks": 4,
                                "tackles": 26,
                                "tries": 1,
                                "hitupRunMeters": 7,
                                "dummyHalfRunMetres": 54,
                                "ptbNeutral": 83.33,
                                "ptbSlow": 16.67,
                                "ptbAll": 6
                            },
                            "playerTookTheField": true,
                            "shirtNum": 9
                        },
                        {
                            "playerFirstName": "Mike",
                            "playerId": 501282,
                            "playerLastName": "Cooper",
                            "playerName": "Mike Cooper",
                            "playerPosition": "Prop 2",
                            "playerPositionId": 500010,
                            "playerStats": {
                                "allRunMetres": 155,
                                "allRuns": 15,
                                "decoys": 3,
                                "fantasyPointsTotal": 71,
                                "hitUps": 15,
                                "mins": 65,
                                "offloads": 1,
                                "supports": 5,
                                "tackleBreaks": 2,
                                "tackles": 48,
                                "hitupRunMeters": 155,
                                "ptbFast": 14.29,
                                "ptbNeutral": 85.71,
                                "ptbAll": 14
                            },
                            "playerTookTheField": true,
                            "shirtNum": 10
                        },
                        {
                            "playerFirstName": "Will",
                            "playerId": 500631,
                            "playerLastName": "Matthews",
                            "playerName": "Will Matthews",
                            "playerPosition": "2nd Row 1",
                            "playerPositionId": 500011,
                            "playerStats": {
                                "allRunMetres": 59,
                                "allRuns": 7,
                                "decoys": 2,
                                "fantasyPointsTotal": 32,
                                "hitUps": 7,
                                "ineffectiveTackles": 1,
                                "mins": 58,
                                "penalties": 1,
                                "supports": 5,
                                "tackleBreaks": 1,
                                "tackles": 26,
                                "hitupRunMeters": 59,
                                "ptbFast": 66.67,
                                "ptbNeutral": 33.33,
                                "ptbAll": 6
                            },
                            "playerTookTheField": true,
                            "shirtNum": 11
                        },
                        {
                            "playerFirstName": "Joel",
                            "playerId": 500640,
                            "playerLastName": "Thompson",
                            "playerName": "Joel Thompson",
                            "playerPosition": "2nd Row 2",
                            "playerPositionId": 500012,
                            "playerStats": {
                                "allRunMetres": 109,
                                "allRuns": 10,
                                "decoys": 2,
                                "errors": 1,
                                "fantasyPointsTotal": 38,
                                "hitUps": 10,
                                "ineffectiveTackles": 2,
                                "mins": 80,
                                "missedTackles": 5,
                                "oneOnOneTackles": 1,
                                "penalties": 3,
                                "supports": 5,
                                "tackleBreaks": 3,
                                "tackles": 37,
                                "tryCause": 1,
                                "hitupRunMeters": 109,
                                "ptbFast": 10,
                                "ptbNeutral": 90,
                                "ptbAll": 10
                            },
                            "playerTookTheField": true,
                            "shirtNum": 12
                        },
                        {
                            "playerFirstName": "Trent",
                            "playerId": 500632,
                            "playerLastName": "Merrin",
                            "playerName": "Trent Merrin",
                            "playerPosition": "Lock",
                            "playerPositionId": 500013,
                            "playerStats": {
                                "allRunMetres": 175,
                                "allRuns": 18,
                                "decoys": 4,
                                "errors": 1,
                                "fantasyPointsTotal": 40,
                                "hitUps": 18,
                                "ineffectiveTackles": 3,
                                "mins": 58,
                                "supports": 7,
                                "tackleBreaks": 1,
                                "tackles": 22,
                                "hitupRunMeters": 175,
                                "ptbFast": 29.41,
                                "ptbNeutral": 70.59,
                                "ptbAll": 17
                            },
                            "playerTookTheField": true,
                            "shirtNum": 13
                        },
                        {
                            "playerFirstName": "Ben",
                            "playerId": 500618,
                            "playerLastName": "Creagh",
                            "playerName": "Ben Creagh",
                            "playerPosition": "Interchange",
                            "playerPositionId": 500014,
                            "playerStats": {
                                "allRunMetres": 56,
                                "allRuns": 7,
                                "decoys": 4,
                                "fantasyPointsTotal": 25,
                                "hitUps": 6,
                                "kickReturnMetres": 12,
                                "kickReturns": 1,
                                "mins": 19,
                                "oneOnOneTackles": 1,
                                "tackles": 20,
                                "hitupRunMeters": 44,
                                "ptbNeutral": 100,
                                "ptbAll": 7
                            },
                            "playerTookTheField": true,
                            "shirtNum": 14
                        },
                        {
                            "playerFirstName": "Jack",
                            "playerId": 500619,
                            "playerLastName": "de Belin",
                            "playerName": "Jack de Belin",
                            "playerPosition": "Interchange",
                            "playerPositionId": 500014,
                            "playerStats": {
                                "allRunMetres": 123,
                                "allRuns": 13,
                                "decoys": 6,
                                "fantasyPointsTotal": 52,
                                "hitUps": 12,
                                "ineffectiveTackles": 1,
                                "kickReturnMetres": 16,
                                "kickReturns": 1,
                                "kicksDefused": 1,
                                "mins": 57,
                                "offloads": 2,
                                "supports": 9,
                                "tackleBreaks": 1,
                                "tackles": 32,
                                "hitupRunMeters": 107,
                                "ptbFast": 9.09,
                                "ptbNeutral": 90.91,
                                "ptbAll": 11
                            },
                            "playerTookTheField": true,
                            "shirtNum": 15
                        },
                        {
                            "playerFirstName": "Jake",
                            "playerId": 501088,
                            "playerLastName": "Marketo",
                            "playerName": "Jake Marketo",
                            "playerPosition": "Interchange",
                            "playerPositionId": 500014,
                            "playerStats": {
                                "allRunMetres": 38,
                                "allRuns": 4,
                                "decoys": 1,
                                "fantasyPointsTotal": 11,
                                "hitUps": 4,
                                "ineffectiveTackles": 3,
                                "mins": 22,
                                "supports": 3,
                                "tackles": 8,
                                "hitupRunMeters": 38,
                                "ptbFast": 25,
                                "ptbNeutral": 75,
                                "ptbAll": 4
                            },
                            "playerTookTheField": true,
                            "shirtNum": 16
                        },
                        {
                            "playerFirstName": "Heath",
                            "playerId": 501749,
                            "playerLastName": "L'Estrange",
                            "playerName": "Heath L'Estrange",
                            "playerPosition": "Interchange",
                            "playerPositionId": 500014,
                            "playerStats": {
                                "bombKicksDefused": 1,
                                "fantasyPointsTotal": 19,
                                "kicksDefused": 1,
                                "mins": 22,
                                "tackles": 18,
                                "ptbNeutral": 100,
                                "ptbAll": 1
                            },
                            "playerTookTheField": true,
                            "shirtNum": 17
                        }
                    ]
                },
                "teamName": "St. George Illawarra Dragons",
                "teamNickName": "Dragons",
                "teamStats": {
                    "allRunMetres": 1515,
                    "allRuns": 169,
                    "bombKicks": 1,
                    "bombKickMetres": 19,
                    "bombKicksDefused": 4,
                    "chargedDown": 5,
                    "completeSets": 33,
                    "completionPercentage": 80,
                    "conversions": 1,
                    "conversionsAttempts": 2,
                    "conversionsMissed": 1,
                    "decoys": 36,
                    "dummyHalfRuns": 11,
                    "errors": 10,
                    "hitUps": 80,
                    "incompleteSets": 8,
                    "ineffectiveTackles": 14,
                    "kickMetres": 749,
                    "kickReturnMetres": 166,
                    "kickReturns": 17,
                    "kicks": 27,
                    "kicksDefused": 9,
                    "kicksNotDefused": 2,
                    "lineDropouts": 2,
                    "linebreaks": 1,
                    "missedTackles": 18,
                    "oneOnOneTackles": 13,
                    "penalties": 7,
                    "penaltyGoals": 2,
                    "penaltyGoalsAttempts": 2,
                    "points": 14,
                    "pointsConceded": 12,
                    "possession": 54,
                    "scrumWins": 8,
                    "supports": 86,
                    "tackleBreaks": 21,
                    "tackles": 332,
                    "sets": 41,
                    "tries": 2,
                    "triesConceded": 2,
                    "tryAssists": 1,
                    "offloads": 5,
                    "hitupRunMeters": 756,
                    "evasionRuns": 61,
                    "evasionRunMetres": 513,
                    "dummyHalfRunMetres": 80,
                    "ptbFast": 20,
                    "ptbNeutral": 79,
                    "ptbSlow": 1,
                    "ptbTotal": 148
                }
            }
        ]
    }
}