{
    "vod": [
        {
            "id": "dmM3d1MjE6Hr_zHo6SSCd0tszz80R6Fh",
            "contentId": 837030,
            "title": "Rd 7: Bulldogs v Warriors (Hls)",
            "description": "Highlights of the match between the Bulldogs and Warriors from Westpac Stadium",
            "publishDate": "2016-04-16T19:43:00+10:00",
            "publisher": "NRL Chief",
            "thumbnailUrl": "http://bigpondvideo.com/web/images/content/20160416193433a_89x50.jpg",
            "largeThumbnailUrl": "http://bigpondvideo.com/web/images/content/20160416193433a_326x184.jpg",
            "programType": "Highlights",
            "programCategory": "Match",
            "priority": null,
            "lastUpdateDate": "2016-04-16T19:47:02+10:00",
            "isPremium": false,
            "club": [
                500010,
                500032
            ]
        },
        {
            "id": "12c3h1MjE6lN4T1TzrUVs50cPxQe2MkW",
            "contentId": 837043,
            "title": "Rd 7 Press Conference: Warriors",
            "description": "The Warriors coach faces the media following the match",
            "publishDate": "2016-04-16T20:35:00+10:00",
            "publisher": "NRL Chief",
            "thumbnailUrl": "http://bigpondvideo.com/web/images/content/20160416201213a_89x50.jpg",
            "largeThumbnailUrl": "http://bigpondvideo.com/web/images/content/20160416201213a_326x184.jpg",
            "programType": "Press Conference",
            "programCategory": null,
            "priority": null,
            "lastUpdateDate": "2016-04-16T20:39:14+10:00",
            "isPremium": false,
            "club": [
                500010,
                500032
            ]
        },
        {
            "id": "Rsc3h1MjE6xDDNtl3LzrudRFZWB22UtH",
            "contentId": 837042,
            "title": "Rd 7 Press Conference: Bulldogs",
            "description": "The Bulldogs coach faces the media following the match",
            "publishDate": "2016-04-16T20:34:00+10:00",
            "publisher": "NRL Chief",
            "thumbnailUrl": "http://bigpondvideo.com/web/images/content/20160416201159a_89x50.jpg",
            "largeThumbnailUrl": "http://bigpondvideo.com/web/images/content/20160416201159a_326x184.jpg",
            "programType": "Press Conference",
            "programCategory": null,
            "priority": null,
            "lastUpdateDate": "2016-04-16T20:39:14+10:00",
            "isPremium": false,
            "club": [
                500010,
                500032
            ]
        },
        {
            "id": "BqZXZ1MjE6K0J79qi25lBLvQv_yxhcBU",
            "contentId": 836388,
            "title": "Rd 7: GOAL Kerrod Holland (76th min)",
            "description": "Conversion sees the Dogs trail 24-20",
            "publishDate": "2016-04-16T19:19:00+10:00",
            "publisher": "NRL Chief",
            "thumbnailUrl": "http://bigpondvideo.com/web/images/content/20160416192159a_89x50.jpg",
            "largeThumbnailUrl": "http://bigpondvideo.com/web/images/content/20160416192159a_326x184.jpg",
            "programType": "Instant Replay",
            "programCategory": "Score",
            "priority": 1,
            "lastUpdateDate": "2016-04-16T19:25:57+10:00",
            "isPremium": true,
            "club": [
                500010,
                500032
            ]
        },
        {
            "id": "Z1ZHZ1MjE6spwcDfisjG0Sp_0ZEMKZEO",
            "contentId": 836387,
            "title": "Rd 7: TRY Kerrod Holland (75th min)",
            "description": "The Bulldogs set up a grandstand finish as Kerrod Holland crosses for a double",
            "publishDate": "2016-04-16T19:17:00+10:00",
            "publisher": "NRL Chief",
            "thumbnailUrl": "http://bigpondvideo.com/web/images/content/20160416192019a_89x50.jpg",
            "largeThumbnailUrl": "http://bigpondvideo.com/web/images/content/20160416192019a_326x184.jpg",
            "programType": "Instant Replay",
            "programCategory": "Score",
            "priority": 2,
            "lastUpdateDate": "2016-04-16T19:24:57+10:00",
            "isPremium": true,
            "club": [
                500010,
                500032
            ]
        },
        {
            "id": "pzeXV1MjE6SuA3MFDN9pQYTXW6Is8KtZ",
            "contentId": 836385,
            "title": "Rd 7: GOAL Shaun Johnson (65th min)",
            "description": "Conversion sees the Warriors lead by 10",
            "publishDate": "2016-04-16T19:07:00+10:00",
            "publisher": "NRL Chief",
            "thumbnailUrl": "http://bigpondvideo.com/web/images/content/20160416190915a_89x50.jpg",
            "largeThumbnailUrl": "http://bigpondvideo.com/web/images/content/20160416190915a_326x184.jpg",
            "programType": "Instant Replay",
            "programCategory": "Score",
            "priority": null,
            "lastUpdateDate": "2016-04-16T19:13:54+10:00",
            "isPremium": true,
            "club": [
                500010,
                500032
            ]
        },
        {
            "id": "Q4eXV1MjE69ImU8XZHZa7YiucjvBb3r9",
            "contentId": 836384,
            "title": "Rd 7: TRY Blake Ayshford (64th min)",
            "description": "The Warriors are in again as Blake Ayshford crosses for a double",
            "publishDate": "2016-04-16T19:06:00+10:00",
            "publisher": "NRL Chief",
            "thumbnailUrl": "http://bigpondvideo.com/web/images/content/20160416190736a_89x50.jpg",
            "largeThumbnailUrl": "http://bigpondvideo.com/web/images/content/20160416190736a_326x184.jpg",
            "programType": "Instant Replay",
            "programCategory": "Score",
            "priority": 3,
            "lastUpdateDate": "2016-04-16T19:26:57+10:00",
            "isPremium": true,
            "club": [
                500010,
                500032
            ]
        },
        {
            "id": "Y2Z3V1MjE63AX1yji7if7Yhym4MuM_D9",
            "contentId": 836383,
            "title": "Rd 7: GOAL Shaun Johnson (51st min)",
            "description": "Conversion sees the Warriors lead 18-12",
            "publishDate": "2016-04-16T18:55:00+10:00",
            "publisher": "NRL Chief",
            "thumbnailUrl": "http://bigpondvideo.com/web/images/content/20160416185438a_89x50.jpg",
            "largeThumbnailUrl": "http://bigpondvideo.com/web/images/content/20160416185438a_326x184.jpg",
            "programType": "Instant Replay",
            "programCategory": "Score",
            "priority": null,
            "lastUpdateDate": "2016-04-16T18:58:51+10:00",
            "isPremium": true,
            "club": [
                500010,
                500032
            ]
        },
        {
            "id": "IwZ3V1MjE64Cw1FaqiEHTTcJ1n4E5jmI",
            "contentId": 836382,
            "title": "Rd 7: TRY Tuimoala Lolohea (50th min)",
            "description": "The Warriors hit the lead as Tuimoala Lolohea catches the Bulldogs defense napping",
            "publishDate": "2016-04-16T18:54:00+10:00",
            "publisher": "NRL Chief",
            "thumbnailUrl": "http://bigpondvideo.com/web/images/content/20160416185328a_89x50.jpg",
            "largeThumbnailUrl": "http://bigpondvideo.com/web/images/content/20160416185328a_326x184.jpg",
            "programType": "Instant Replay",
            "programCategory": "Score",
            "priority": 4,
            "lastUpdateDate": "2016-04-16T19:26:57+10:00",
            "isPremium": true,
            "club": [
                500010,
                500032
            ]
        },
        {
            "id": "N1YXV1MjE6D47I90xeZlugQYRk1PNsI9",
            "contentId": 836381,
            "title": "Rd 7: TRY Jonathan Wright (46th min)",
            "description": "The Warriors score 1st in the 2nd half as Jonathan Wright crosses in the corner",
            "publishDate": "2016-04-16T18:49:00+10:00",
            "publisher": "NRL Chief",
            "thumbnailUrl": "http://bigpondvideo.com/web/images/content/20160416185116a_89x50.jpg",
            "largeThumbnailUrl": "http://bigpondvideo.com/web/images/content/20160416185116a_326x184.jpg",
            "programType": "Instant Replay",
            "programCategory": "Score",
            "priority": 5,
            "lastUpdateDate": "2016-04-16T19:26:57+10:00",
            "isPremium": true,
            "club": [
                500010,
                500032
            ]
        },
        {
            "id": "Y2eXN1MjE62SE2DC9Np-UmVRO3s6y9PH",
            "contentId": 836380,
            "title": "Rd 7: TRY Kerrod Holland (39th min)",
            "description": "The Bulldogs are in again as this time Kerrod Holland crosses in the corner",
            "publishDate": "2016-04-16T18:26:00+10:00",
            "publisher": "NRL Chief",
            "thumbnailUrl": "http://bigpondvideo.com/web/images/content/20160416182716a_89x50.jpg",
            "largeThumbnailUrl": "http://bigpondvideo.com/web/images/content/20160416182716a_326x184.jpg",
            "programType": "Instant Replay",
            "programCategory": "Score",
            "priority": 6,
            "lastUpdateDate": "2016-04-16T19:25:57+10:00",
            "isPremium": true,
            "club": [
                500010,
                500032
            ]
        },
        {
            "id": "dha3N1MjE6ImF-OupwChZQe07yezzCIr",
            "contentId": 836377,
            "title": "Rd 7: GOAL Kerrod Holland (29th min)",
            "description": "Conversion sees the Bulldogs lead 10-8",
            "publishDate": "2016-04-16T18:14:00+10:00",
            "publisher": "NRL Chief",
            "thumbnailUrl": "http://bigpondvideo.com/web/images/content/20160416181602a_89x50.jpg",
            "largeThumbnailUrl": "http://bigpondvideo.com/web/images/content/20160416181602a_326x184.jpg",
            "programType": "Instant Replay",
            "programCategory": "Score",
            "priority": null,
            "lastUpdateDate": "2016-04-16T18:19:42+10:00",
            "isPremium": true,
            "club": [
                500010,
                500032
            ]
        },
        {
            "id": "l0anN1MjE6YvWBlMKG01Cf5lFU_gfIR1",
            "contentId": 836375,
            "title": "Rd 7: TRY Sam Perrett (27th min)",
            "description": "The Bulldogs go back to back as Sam Perrett crosses for a 1st half double",
            "publishDate": "2016-04-16T18:12:00+10:00",
            "publisher": "NRL Chief",
            "thumbnailUrl": "http://bigpondvideo.com/web/images/content/20160416181437a_89x50.jpg",
            "largeThumbnailUrl": "http://bigpondvideo.com/web/images/content/20160416181437a_326x184.jpg",
            "programType": "Instant Replay",
            "programCategory": "Score",
            "priority": 7,
            "lastUpdateDate": "2016-04-16T19:25:57+10:00",
            "isPremium": true,
            "club": [
                500010,
                500032
            ]
        },
        {
            "id": "85ZHN1MjE6EaZAzpO3uV_1zTLwur7BYH",
            "contentId": 836374,
            "title": "Rd 7: TRY Sam Perrett (23rd min)",
            "description": "The Bulldogs open their scoring through a try to Sam Perrett who crosses in the corner",
            "publishDate": "2016-04-16T18:09:00+10:00",
            "publisher": "NRL Chief",
            "thumbnailUrl": "http://bigpondvideo.com/web/images/content/20160416181004a_89x50.jpg",
            "largeThumbnailUrl": "http://bigpondvideo.com/web/images/content/20160416181004a_326x184.jpg",
            "programType": "Instant Replay",
            "programCategory": "Score",
            "priority": 8,
            "lastUpdateDate": "2016-04-16T19:25:57+10:00",
            "isPremium": true,
            "club": [
                500010,
                500032
            ]
        },
        {
            "id": "dpdnJ1MjE6iExCkw81yM5HPSudn82HJ3",
            "contentId": 836373,
            "title": "Rd 7: TRY Blake Ayshford (13th min)",
            "description": "The Warriors go back to back as Blake Ayshford crosses out wide",
            "publishDate": "2016-04-16T17:52:00+10:00",
            "publisher": "NRL Chief",
            "thumbnailUrl": "http://bigpondvideo.com/web/images/content/20160416175521a_89x50.jpg",
            "largeThumbnailUrl": "http://bigpondvideo.com/web/images/content/20160416175521a_326x184.jpg",
            "programType": "Instant Replay",
            "programCategory": "Score",
            "priority": 9,
            "lastUpdateDate": "2016-04-16T19:25:57+10:00",
            "isPremium": true,
            "club": [
                500010,
                500032
            ]
        },
        {
            "id": "hzcnJ1MjE6WaXCIojvF6P5Gj6Mx3w_wB",
            "contentId": 836370,
            "title": "Rd 7: TRY David Fusitua (10th min)",
            "description": "The Warriors open the scoring in this match through a try to David Fusitua",
            "publishDate": "2016-04-16T17:50:00+10:00",
            "publisher": "NRL Chief",
            "thumbnailUrl": "http://bigpondvideo.com/web/images/content/20160416175245a_89x50.jpg",
            "largeThumbnailUrl": "http://bigpondvideo.com/web/images/content/20160416175245a_326x184.jpg",
            "programType": "Instant Replay",
            "programCategory": "Score",
            "priority": 10,
            "lastUpdateDate": "2016-04-16T19:24:57+10:00",
            "isPremium": true,
            "club": [
                500010,
                500032
            ]
        }
    ],
    "scores": [
        {
            "gameState": "First Half",
            "gameStateId": 3,
            "gameTime": "0:22:34",
            "gameSeconds": 1354,
            "playerId": 500234,
            "playerName": "Sam Perrett",
            "scoreMethod": "Try",
            "statEvent": "Try",
            "statId": 38,
            "statValue": 4,
            "vidRef": 44466,
            "homeScore": 4,
            "awayScore": 8,
            "commentary": "22:34, Try by Sam Perrett(Canterbury-Bankstown Bulldogs)",
            "tackleNum": 2,
            "teamId": 500010,
            "teamName": "Canterbury-Bankstown Bulldogs",
            "homeTeamAbbrv": "CBY",
            "awayTeamAbbrv": "WAR"
        },
        {
            "gameState": "First Half",
            "gameStateId": 3,
            "gameTime": "0:26:51",
            "gameSeconds": 1611,
            "playerId": 500234,
            "playerName": "Sam Perrett",
            "scoreMethod": "Try",
            "statEvent": "Try",
            "statId": 38,
            "statValue": 4,
            "vidRef": 52261,
            "homeScore": 8,
            "awayScore": 8,
            "commentary": "26:51, Try by Sam Perrett(Canterbury-Bankstown Bulldogs)",
            "tackleNum": 2,
            "teamId": 500010,
            "teamName": "Canterbury-Bankstown Bulldogs",
            "homeTeamAbbrv": "CBY",
            "awayTeamAbbrv": "WAR"
        },
        {
            "gameState": "First Half",
            "gameStateId": 3,
            "gameTime": "0:27:35",
            "gameSeconds": 1655,
            "playerId": 503388,
            "playerName": "Kerrod Holland",
            "scoreMethod": "Conversion",
            "statEvent": "Conversion-Made",
            "statId": 1,
            "statValue": 2,
            "vidRef": 53863,
            "homeScore": 10,
            "awayScore": 8,
            "commentary": "27:35, Conversion-Made by Kerrod Holland(Canterbury-Bankstown Bulldogs)",
            "tackleNum": -1,
            "teamId": 500010,
            "teamName": "Canterbury-Bankstown Bulldogs",
            "homeTeamAbbrv": "CBY",
            "awayTeamAbbrv": "WAR"
        },
        {
            "gameState": "First Half",
            "gameStateId": 3,
            "gameTime": "0:38:57",
            "gameSeconds": 2337,
            "playerId": 503388,
            "playerName": "Kerrod Holland",
            "scoreMethod": "Try",
            "statEvent": "Try",
            "statId": 38,
            "statValue": 4,
            "vidRef": 71412,
            "homeScore": 14,
            "awayScore": 8,
            "commentary": "38:57, Try by Kerrod Holland(Canterbury-Bankstown Bulldogs)",
            "tackleNum": 5,
            "teamId": 500010,
            "teamName": "Canterbury-Bankstown Bulldogs",
            "homeTeamAbbrv": "CBY",
            "awayTeamAbbrv": "WAR"
        },
        {
            "gameState": "Second Half",
            "gameStateId": 5,
            "gameTime": "1:14:47",
            "gameSeconds": 4487,
            "playerId": 503388,
            "playerName": "Kerrod Holland",
            "scoreMethod": "Try",
            "statEvent": "Try",
            "statId": 38,
            "statValue": 4,
            "vidRef": 131791,
            "homeScore": 18,
            "awayScore": 24,
            "commentary": "74:47, Try by Kerrod Holland(Canterbury-Bankstown Bulldogs)",
            "tackleNum": 6,
            "teamId": 500010,
            "teamName": "Canterbury-Bankstown Bulldogs",
            "homeTeamAbbrv": "CBY",
            "awayTeamAbbrv": "WAR"
        },
        {
            "gameState": "Second Half",
            "gameStateId": 5,
            "gameTime": "1:15:29",
            "gameSeconds": 4529,
            "playerId": 503388,
            "playerName": "Kerrod Holland",
            "scoreMethod": "Conversion",
            "statEvent": "Conversion-Made",
            "statId": 1,
            "statValue": 2,
            "vidRef": 133098,
            "homeScore": 20,
            "awayScore": 24,
            "commentary": "75:29, Conversion-Made by Kerrod Holland(Canterbury-Bankstown Bulldogs)",
            "tackleNum": -1,
            "teamId": 500010,
            "teamName": "Canterbury-Bankstown Bulldogs",
            "homeTeamAbbrv": "CBY",
            "awayTeamAbbrv": "WAR"
        },
        {
            "gameState": "First Half",
            "gameStateId": 3,
            "gameTime": "0:10:03",
            "gameSeconds": 603,
            "playerId": 500919,
            "playerName": "David Fusitua",
            "scoreMethod": "Try",
            "statEvent": "Try",
            "statId": 38,
            "statValue": 4,
            "vidRef": 18658,
            "awayScore": 4,
            "commentary": "10:03, Try by David Fusitua(New Zealand Warriors)",
            "tackleNum": 3,
            "teamId": 500032,
            "teamName": "New Zealand Warriors",
            "homeTeamAbbrv": "CBY",
            "awayTeamAbbrv": "WAR"
        },
        {
            "gameState": "First Half",
            "gameStateId": 3,
            "gameTime": "0:13:02",
            "gameSeconds": 782,
            "playerId": 500787,
            "playerName": "Blake Ayshford",
            "scoreMethod": "Try",
            "statEvent": "Try",
            "statId": 38,
            "statValue": 4,
            "vidRef": 23879,
            "awayScore": 8,
            "commentary": "13:02, Try by Blake Ayshford(New Zealand Warriors)",
            "tackleNum": 6,
            "teamId": 500032,
            "teamName": "New Zealand Warriors",
            "homeTeamAbbrv": "CBY",
            "awayTeamAbbrv": "WAR"
        },
        {
            "gameState": "Second Half",
            "gameStateId": 5,
            "gameTime": "0:46:00",
            "gameSeconds": 2760,
            "playerId": 500815,
            "playerName": "Jonathan Wright",
            "scoreMethod": "Try",
            "statEvent": "Try",
            "statId": 38,
            "statValue": 4,
            "vidRef": 86823,
            "homeScore": 14,
            "awayScore": 12,
            "commentary": "46:00, Try by Jonathan Wright(New Zealand Warriors)",
            "tackleNum": 6,
            "teamId": 500032,
            "teamName": "New Zealand Warriors",
            "homeTeamAbbrv": "CBY",
            "awayTeamAbbrv": "WAR"
        },
        {
            "gameState": "Second Half",
            "gameStateId": 5,
            "gameTime": "0:49:10",
            "gameSeconds": 2950,
            "playerId": 500927,
            "playerName": "Tuimoala Lolohea",
            "scoreMethod": "Try",
            "statEvent": "Try",
            "statId": 38,
            "statValue": 4,
            "vidRef": 91581,
            "homeScore": 14,
            "awayScore": 16,
            "commentary": "49:10, Try by Tuimoala Lolohea(New Zealand Warriors)",
            "tackleNum": 4,
            "teamId": 500032,
            "teamName": "New Zealand Warriors",
            "homeTeamAbbrv": "CBY",
            "awayTeamAbbrv": "WAR"
        },
        {
            "gameState": "Second Half",
            "gameStateId": 5,
            "gameTime": "0:50:39",
            "gameSeconds": 3039,
            "playerId": 500705,
            "playerName": "Shaun Johnson",
            "scoreMethod": "Conversion",
            "statEvent": "Conversion-Made",
            "statId": 1,
            "statValue": 2,
            "vidRef": 93950,
            "homeScore": 14,
            "awayScore": 18,
            "commentary": "50:39, Conversion-Made by Shaun Johnson(New Zealand Warriors)",
            "tackleNum": -1,
            "teamId": 500032,
            "teamName": "New Zealand Warriors",
            "homeTeamAbbrv": "CBY",
            "awayTeamAbbrv": "WAR"
        },
        {
            "gameState": "Second Half",
            "gameStateId": 5,
            "gameTime": "1:03:16",
            "gameSeconds": 3796,
            "playerId": 500787,
            "playerName": "Blake Ayshford",
            "scoreMethod": "Try",
            "statEvent": "Try",
            "statId": 38,
            "statValue": 4,
            "vidRef": 112898,
            "homeScore": 14,
            "awayScore": 22,
            "commentary": "63:16, Try by Blake Ayshford(New Zealand Warriors)",
            "tackleNum": 5,
            "teamId": 500032,
            "teamName": "New Zealand Warriors",
            "homeTeamAbbrv": "CBY",
            "awayTeamAbbrv": "WAR"
        },
        {
            "gameState": "Second Half",
            "gameStateId": 5,
            "gameTime": "1:04:51",
            "gameSeconds": 3891,
            "playerId": 500705,
            "playerName": "Shaun Johnson",
            "scoreMethod": "Conversion",
            "statEvent": "Conversion-Made",
            "statId": 1,
            "statValue": 2,
            "vidRef": 115259,
            "homeScore": 14,
            "awayScore": 24,
            "commentary": "64:51, Conversion-Made by Shaun Johnson(New Zealand Warriors)",
            "tackleNum": -1,
            "teamId": 500032,
            "teamName": "New Zealand Warriors",
            "homeTeamAbbrv": "CBY",
            "awayTeamAbbrv": "WAR"
        }
    ]
}