{
    "vod": [
        {
            "id": "9seWw2YjE6Y-JVEMleUD3xwsaMUwkhj3",
            "contentId": 910700,
            "title": "Rd 10: Sea Eagles v Broncos (Hls)",
            "description": "Highlights of the Round 10 clash between the Sea Eagles & Broncos",
            "publishDate": "2017-05-13T21:54:20+10:00",
            "publisher": "NRL Chief",
            "thumbnailUrl": "http://bpvideos.telstra.insnw.net/web/images/20170513215002a_89x50.jpg",
            "largeThumbnailUrl": "http://bpvideos.telstra.insnw.net/web/images/20170513215002a_326x184.jpg",
            "programType": "Highlights",
            "programCategory": "Match",
            "priority": null,
            "lastUpdateDate": "2017-05-13T21:58:28+10:00",
            "isPremium": false,
            "club": [
                500011,
                500002
            ]
        },
        {
            "id": "s1dWw2YjE6JqZYfqlTL4rqnw2o5LbKvp",
            "contentId": 911615,
            "title": "Rd 10: GOAL Jordan Kahu (77th min)",
            "description": "Jordan Kahu converts the try of Corey Oates from out wide",
            "publishDate": "2017-05-13T21:36:28+10:00",
            "publisher": "NRL Chief",
            "thumbnailUrl": "http://bpvideos.telstra.insnw.net/web/images/20170513213532a_89x50.jpg",
            "largeThumbnailUrl": "http://bpvideos.telstra.insnw.net/web/images/20170513213532a_326x184.jpg",
            "programType": "Instant Replay",
            "programCategory": "Score",
            "priority": null,
            "lastUpdateDate": "2017-05-13T21:40:24+10:00",
            "isPremium": true,
            "club": [
                500011,
                500002
            ]
        },
        {
            "id": "ttdGw2YjE6G0s5TPJWdjSr_Xtdrv3f4S",
            "contentId": 911613,
            "title": "Rd 10: TRY Corey Oates (75th min)",
            "description": "Corey Oates crosses to seal the win for the Broncos",
            "publishDate": "2017-05-13T21:34:44+10:00",
            "publisher": "NRL Chief",
            "thumbnailUrl": "http://bpvideos.telstra.insnw.net/web/images/20170513213313a_89x50.jpg",
            "largeThumbnailUrl": "http://bpvideos.telstra.insnw.net/web/images/20170513213313a_326x184.jpg",
            "programType": "Instant Replay",
            "programCategory": "Score",
            "priority": null,
            "lastUpdateDate": "2017-05-13T21:37:23+10:00",
            "isPremium": true,
            "club": [
                500011,
                500002
            ]
        },
        {
            "id": "xvcmw2YjE6uWvLYCP2IucH3ZAbuPfMuJ",
            "contentId": 911609,
            "title": "Rd 10: GOAL Jordan Kahu (68th min)",
            "description": "Jordan Kahu converts the try of Kodi Nikorima",
            "publishDate": "2017-05-13T21:27:01+10:00",
            "publisher": "NRL Chief",
            "thumbnailUrl": "http://bpvideos.telstra.insnw.net/web/images/20170513212604a_89x50.jpg",
            "largeThumbnailUrl": "http://bpvideos.telstra.insnw.net/web/images/20170513212604a_326x184.jpg",
            "programType": "Instant Replay",
            "programCategory": "Score",
            "priority": null,
            "lastUpdateDate": "2017-05-13T21:31:22+10:00",
            "isPremium": true,
            "club": [
                500011,
                500002
            ]
        },
        {
            "id": "M4cmw2YjE6YnBJEdE6q3WoWUXmm1HjWE",
            "contentId": 911608,
            "title": "Rd 10: TRY Kodi Nikorima (66th min)",
            "description": "Kodi Nikorima scampers away for the Broncos to take the lead",
            "publishDate": "2017-05-13T21:24:54+10:00",
            "publisher": "NRL Chief",
            "thumbnailUrl": "http://bpvideos.telstra.insnw.net/web/images/20170513212426a_89x50.jpg",
            "largeThumbnailUrl": "http://bpvideos.telstra.insnw.net/web/images/20170513212426a_326x184.jpg",
            "programType": "Instant Replay",
            "programCategory": "Score",
            "priority": null,
            "lastUpdateDate": "2017-05-13T21:28:21+10:00",
            "isPremium": true,
            "club": [
                500011,
                500002
            ]
        },
        {
            "id": "A1cWw2YjE65mIL7EWKAToeqfEgWCOgQL",
            "contentId": 911607,
            "title": "Rd 10: GOAL Jordan Kahu (65th min)",
            "description": "Jordan Kahu converts the try of Corey Oates",
            "publishDate": "2017-05-13T21:21:23+10:00",
            "publisher": "NRL Chief",
            "thumbnailUrl": "http://bpvideos.telstra.insnw.net/web/images/20170513212138a_89x50.jpg",
            "largeThumbnailUrl": "http://bpvideos.telstra.insnw.net/web/images/20170513212138a_326x184.jpg",
            "programType": "Instant Replay",
            "programCategory": "Score",
            "priority": null,
            "lastUpdateDate": "2017-05-13T21:25:20+10:00",
            "isPremium": true,
            "club": [
                500011,
                500002
            ]
        },
        {
            "id": "d1cGw2YjE69d718-5zE6XMqVo2AORg7p",
            "contentId": 911606,
            "title": "Rd 10: TRY Corey Oates (64th min)",
            "description": "Corey Oates scores out wide to narrow Manly's lead",
            "publishDate": "2017-05-13T21:20:21+10:00",
            "publisher": "NRL Chief",
            "thumbnailUrl": "http://bpvideos.telstra.insnw.net/web/images/20170513212041a_89x50.jpg",
            "largeThumbnailUrl": "http://bpvideos.telstra.insnw.net/web/images/20170513212041a_326x184.jpg",
            "programType": "Instant Replay",
            "programCategory": "Score",
            "priority": null,
            "lastUpdateDate": "2017-05-13T21:24:20+10:00",
            "isPremium": true,
            "club": [
                500011,
                500002
            ]
        },
        {
            "id": "4xbWw2YjE6n6R0ZErIlabCblYKZTER1q",
            "contentId": 911588,
            "title": "Rd 10: GOAL Jordan Kahu (45th min)",
            "description": "Jordan Kahu converts the try of Anthony Milford",
            "publishDate": "2017-05-13T21:07:54+10:00",
            "publisher": "NRL Chief",
            "thumbnailUrl": "http://bpvideos.telstra.insnw.net/web/images/20170513210726a_89x50.jpg",
            "largeThumbnailUrl": "http://bpvideos.telstra.insnw.net/web/images/20170513210726a_326x184.jpg",
            "programType": "Instant Replay",
            "programCategory": "Score",
            "priority": null,
            "lastUpdateDate": "2017-05-13T21:11:17+10:00",
            "isPremium": true,
            "club": [
                500011,
                500002
            ]
        },
        {
            "id": "R1amw2YjE6MdTvVT-2IIaLXfRJw2RGYJ",
            "contentId": 911586,
            "title": "Rd 10: TRY Anthony Milford (44th min)",
            "description": "Anthony Milford scores the Broncos' first points of the night",
            "publishDate": "2017-05-13T20:58:19+10:00",
            "publisher": "NRL Chief",
            "thumbnailUrl": "http://bpvideos.telstra.insnw.net/web/images/20170513205819a_89x50.jpg",
            "largeThumbnailUrl": "http://bpvideos.telstra.insnw.net/web/images/20170513205819a_326x184.jpg",
            "programType": "Instant Replay",
            "programCategory": "Score",
            "priority": null,
            "lastUpdateDate": "2017-05-13T21:03:15+10:00",
            "isPremium": true,
            "club": [
                500011,
                500002
            ]
        },
        {
            "id": "hhN2w2YjE6A5FBII7Yh7fqRrKrtsam4_",
            "contentId": 911553,
            "title": "Rd 10: TRY Jorge Taufua (9th min)",
            "description": "Jorge Taufua crosses out wide",
            "publishDate": "2017-05-13T20:08:43+10:00",
            "publisher": "NRL Chief",
            "thumbnailUrl": "http://bpvideos.telstra.insnw.net/web/images/20170513200744a_89x50.jpg",
            "largeThumbnailUrl": "http://bpvideos.telstra.insnw.net/web/images/20170513200744a_326x184.jpg",
            "programType": "Instant Replay",
            "programCategory": "Score",
            "priority": null,
            "lastUpdateDate": "2017-05-13T20:12:04+10:00",
            "isPremium": true,
            "club": [
                500011,
                500002
            ]
        },
        {
            "id": "hyNmw2YjE6aFA1uQMcRXwUlcBKbyLTJt",
            "contentId": 911552,
            "title": "Rd 10: GOAL Apisai Koroisau (8th min)",
            "description": "Apisai Koroisau converts his own try",
            "publishDate": "2017-05-13T20:06:20+10:00",
            "publisher": "NRL Chief",
            "thumbnailUrl": "http://bpvideos.telstra.insnw.net/web/images/20170513200639a_89x50.jpg",
            "largeThumbnailUrl": "http://bpvideos.telstra.insnw.net/web/images/20170513200639a_326x184.jpg",
            "programType": "Instant Replay",
            "programCategory": "Score",
            "priority": null,
            "lastUpdateDate": "2017-05-13T20:10:03+10:00",
            "isPremium": true,
            "club": [
                500011,
                500002
            ]
        },
        {
            "id": "ZoNmw2YjE6Wefab2yQxACxyfGGp_DSZH",
            "contentId": 911551,
            "title": "Rd 10: TRY Apisai Koroisau (7th min)",
            "description": "Apisai Koroisau scores the Sea Eagles' second try",
            "publishDate": "2017-05-13T20:04:08+10:00",
            "publisher": "NRL Chief",
            "thumbnailUrl": "http://bpvideos.telstra.insnw.net/web/images/20170513200435a_89x50.jpg",
            "largeThumbnailUrl": "http://bpvideos.telstra.insnw.net/web/images/20170513200435a_326x184.jpg",
            "programType": "Instant Replay",
            "programCategory": "Score",
            "priority": null,
            "lastUpdateDate": "2017-05-13T20:09:02+10:00",
            "isPremium": true,
            "club": [
                500011,
                500002
            ]
        },
        {
            "id": "Q5Nmw2YjE6aO-Nvdf9BjnZ3qo9H3gdmp",
            "contentId": 911548,
            "title": "Rd 10: TRY Tom Trbojevic (2nd min)",
            "description": "Tom Trbojevic scores an early try for the Sea Eagles",
            "publishDate": "2017-05-13T20:03:54+10:00",
            "publisher": "NRL Chief",
            "thumbnailUrl": "http://bpvideos.telstra.insnw.net/web/images/20170513200351a_89x50.jpg",
            "largeThumbnailUrl": "http://bpvideos.telstra.insnw.net/web/images/20170513200351a_326x184.jpg",
            "programType": "Instant Replay",
            "programCategory": "Score",
            "priority": null,
            "lastUpdateDate": "2017-05-13T20:08:02+10:00",
            "isPremium": true,
            "club": [
                500011,
                500002
            ]
        }
    ],
    "scores": [
        {
            "gameState": "First Half",
            "gameStateId": 3,
            "gameTime": "0:01:51",
            "gameSeconds": 111,
            "GameMinutes": "01:51",
            "playerId": 501505,
            "playerName": "Tom Trbojevic",
            "scoreMethod": "Try",
            "statEvent": "Try",
            "statId": 38,
            "statValue": 4,
            "vidRef": 5120,
            "homeScore": 4,
            "commentary": "Try by Tom Trbojevic",
            "tackleNum": 4,
            "utcTime": "2017-05-13T09:57:31Z",
            "teamId": 500002,
            "teamName": "Manly-Warringah Sea Eagles",
            "homeTeamAbbrv": "MAN",
            "awayTeamAbbrv": "BRI"
        },
        {
            "gameState": "First Half",
            "gameStateId": 3,
            "gameTime": "0:06:08",
            "gameSeconds": 368,
            "GameMinutes": "06:08",
            "playerId": 500109,
            "playerName": "Apisai Koroisau",
            "scoreMethod": "Try",
            "statEvent": "Try",
            "statId": 38,
            "statValue": 4,
            "vidRef": 11538,
            "homeScore": 8,
            "commentary": "Try by Apisai Koroisau",
            "tackleNum": 5,
            "utcTime": "2017-05-13T10:01:48Z",
            "teamId": 500002,
            "teamName": "Manly-Warringah Sea Eagles",
            "homeTeamAbbrv": "MAN",
            "awayTeamAbbrv": "BRI"
        },
        {
            "gameState": "First Half",
            "gameStateId": 3,
            "gameTime": "0:07:36",
            "gameSeconds": 456,
            "GameMinutes": "07:36",
            "playerId": 500109,
            "playerName": "Apisai Koroisau",
            "scoreMethod": "Conversion",
            "statEvent": "Conversion-Made",
            "statId": 1,
            "statValue": 2,
            "vidRef": 13921,
            "homeScore": 10,
            "commentary": "Conversion-Made by Apisai Koroisau",
            "tackleNum": -1,
            "utcTime": "2017-05-13T10:03:23Z",
            "teamId": 500002,
            "teamName": "Manly-Warringah Sea Eagles",
            "homeTeamAbbrv": "MAN",
            "awayTeamAbbrv": "BRI"
        },
        {
            "gameState": "First Half",
            "gameStateId": 3,
            "gameTime": "0:08:58",
            "gameSeconds": 538,
            "GameMinutes": "08:58",
            "playerId": 500019,
            "playerName": "Jorge Taufua",
            "scoreMethod": "Try",
            "statEvent": "Try",
            "statId": 38,
            "statValue": 4,
            "vidRef": 15979,
            "homeScore": 14,
            "commentary": "Try by Jorge Taufua",
            "tackleNum": 5,
            "utcTime": "2017-05-13T10:04:45Z",
            "teamId": 500002,
            "teamName": "Manly-Warringah Sea Eagles",
            "homeTeamAbbrv": "MAN",
            "awayTeamAbbrv": "BRI"
        },
        {
            "gameState": "Second Half",
            "gameStateId": 5,
            "gameTime": "0:43:10",
            "gameSeconds": 2590,
            "GameMinutes": "43:10",
            "playerId": 500326,
            "playerName": "Anthony Milford",
            "scoreMethod": "Try",
            "statEvent": "Try",
            "statId": 38,
            "statValue": 4,
            "vidRef": 92145,
            "homeScore": 14,
            "awayScore": 4,
            "commentary": "Try by Anthony Milford",
            "tackleNum": 4,
            "utcTime": "2017-05-13T10:55:32Z",
            "teamId": 500011,
            "teamName": "Brisbane Broncos",
            "homeTeamAbbrv": "MAN",
            "awayTeamAbbrv": "BRI"
        },
        {
            "gameState": "Second Half",
            "gameStateId": 5,
            "gameTime": "0:44:29",
            "gameSeconds": 2669,
            "GameMinutes": "44:29",
            "playerId": 500258,
            "playerName": "Jordan Kahu",
            "scoreMethod": "Conversion",
            "statEvent": "Conversion-Made",
            "statId": 1,
            "statValue": 2,
            "vidRef": 94126,
            "homeScore": 14,
            "awayScore": 6,
            "commentary": "Conversion-Made by Jordan Kahu",
            "tackleNum": -1,
            "utcTime": "2017-05-13T10:56:51Z",
            "teamId": 500011,
            "teamName": "Brisbane Broncos",
            "homeTeamAbbrv": "MAN",
            "awayTeamAbbrv": "BRI"
        },
        {
            "gameState": "Second Half",
            "gameStateId": 5,
            "gameTime": "1:03:19",
            "gameSeconds": 3799,
            "GameMinutes": "63:19",
            "playerId": 500266,
            "playerName": "Corey Oates",
            "scoreMethod": "Try",
            "statEvent": "Try",
            "statId": 38,
            "statValue": 4,
            "vidRef": 124842,
            "homeScore": 14,
            "awayScore": 10,
            "commentary": "Try by Corey Oates",
            "tackleNum": 1,
            "utcTime": "2017-05-13T11:17:20Z",
            "teamId": 500011,
            "teamName": "Brisbane Broncos",
            "homeTeamAbbrv": "MAN",
            "awayTeamAbbrv": "BRI"
        },
        {
            "gameState": "Second Half",
            "gameStateId": 5,
            "gameTime": "1:04:29",
            "gameSeconds": 3869,
            "GameMinutes": "64:29",
            "playerId": 500258,
            "playerName": "Jordan Kahu",
            "scoreMethod": "Conversion",
            "statEvent": "Conversion-Made",
            "statId": 1,
            "statValue": 2,
            "vidRef": 126586,
            "homeScore": 14,
            "awayScore": 12,
            "commentary": "Conversion-Made by Jordan Kahu",
            "tackleNum": -1,
            "utcTime": "2017-05-13T11:18:29Z",
            "teamId": 500011,
            "teamName": "Brisbane Broncos",
            "homeTeamAbbrv": "MAN",
            "awayTeamAbbrv": "BRI"
        },
        {
            "gameState": "Second Half",
            "gameStateId": 5,
            "gameTime": "1:05:54",
            "gameSeconds": 3954,
            "GameMinutes": "65:54",
            "playerId": 500265,
            "playerName": "Kodi Nikorima",
            "scoreMethod": "Try",
            "statEvent": "Try",
            "statId": 38,
            "statValue": 4,
            "vidRef": 130386,
            "homeScore": 14,
            "awayScore": 16,
            "commentary": "Try by Kodi Nikorima",
            "utcTime": "2017-05-13T11:21:01Z",
            "teamId": 500011,
            "teamName": "Brisbane Broncos",
            "homeTeamAbbrv": "MAN",
            "awayTeamAbbrv": "BRI"
        },
        {
            "gameState": "Second Half",
            "gameStateId": 5,
            "gameTime": "1:07:06",
            "gameSeconds": 4026,
            "GameMinutes": "67:06",
            "playerId": 500258,
            "playerName": "Jordan Kahu",
            "scoreMethod": "Conversion",
            "statEvent": "Conversion-Made",
            "statId": 1,
            "statValue": 2,
            "vidRef": 132180,
            "homeScore": 14,
            "awayScore": 18,
            "commentary": "Conversion-Made by Jordan Kahu",
            "tackleNum": -1,
            "utcTime": "2017-05-13T11:22:13Z",
            "teamId": 500011,
            "teamName": "Brisbane Broncos",
            "homeTeamAbbrv": "MAN",
            "awayTeamAbbrv": "BRI"
        },
        {
            "gameState": "Second Half",
            "gameStateId": 5,
            "gameTime": "1:14:51",
            "gameSeconds": 4491,
            "GameMinutes": "74:51",
            "playerId": 500266,
            "playerName": "Corey Oates",
            "scoreMethod": "Try",
            "statEvent": "Try",
            "statId": 38,
            "statValue": 4,
            "vidRef": 144866,
            "homeScore": 14,
            "awayScore": 22,
            "commentary": "Try by Corey Oates",
            "tackleNum": 3,
            "utcTime": "2017-05-13T11:30:41Z",
            "teamId": 500011,
            "teamName": "Brisbane Broncos",
            "homeTeamAbbrv": "MAN",
            "awayTeamAbbrv": "BRI"
        },
        {
            "gameState": "Second Half",
            "gameStateId": 5,
            "gameTime": "1:16:19",
            "gameSeconds": 4579,
            "GameMinutes": "76:19",
            "playerId": 500258,
            "playerName": "Jordan Kahu",
            "scoreMethod": "Conversion",
            "statEvent": "Conversion-Made",
            "statId": 1,
            "statValue": 2,
            "vidRef": 147657,
            "homeScore": 14,
            "awayScore": 24,
            "commentary": "Conversion-Made by Jordan Kahu",
            "tackleNum": -1,
            "utcTime": "2017-05-13T11:32:32Z",
            "teamId": 500011,
            "teamName": "Brisbane Broncos",
            "homeTeamAbbrv": "MAN",
            "awayTeamAbbrv": "BRI"
        }
    ],
    "twitter": [
        {
            "id": "863359905507311616",
            "gameSeconds": 4740
        },
        {
            "id": "863359546604920833",
            "gameSeconds": 4740
        },
        {
            "id": "863354642150809600",
            "gameSeconds": 3960
        },
        {
            "id": "863354306925215744",
            "gameSeconds": 3960
        },
        {
            "id": "863354216340832257",
            "gameSeconds": 3840
        },
        {
            "id": "863352791762296832",
            "gameSeconds": 3840
        },
        {
            "id": "863336683571339265",
            "gameSeconds": 900
        },
        {
            "id": "863336085652295682",
            "gameSeconds": 900
        }
    ]
}