{
    "vod": [
        {
            "id": "h3NHg0dzofKpI13VKFb62zv-scScc2lk",
            "contentId": 782545,
            "title": "Rd 24: Rabbitohs v Bulldogs (2)",
            "description": "2nd half replay of the match between the Rabbitohs & Bulldogs",
            "publishDate": "2015-08-22T09:30:00+10:00",
            "publisher": "NRL Chief",
            "thumbnailUrl": "http://bigpondvideo.com/Web/Images/Content/20150821220301a_89x50.jpg",
            "largeThumbnailUrl": "http://bigpondvideo.com/Web/Images/Content/20150821220301a_326x184.jpg",
            "programType": "Matches",
            "programCategory": "Replay: 2nd Half",
            "priority": null,
            "lastUpdateDate": "2015-08-21T23:59:20+10:00",
            "isPremium": true,
            "club": [
                500010,
                500005
            ]
        },
        {
            "id": "hhNHg0dzpgQmp1f7HqkhrEWWPBcUC54t",
            "contentId": 782544,
            "title": "Rd 24: Rabbitohs v Bulldogs (1)",
            "description": "1st half replay of the match between the Rabbitohs & Bulldogs",
            "publishDate": "2015-08-22T09:30:00+10:00",
            "publisher": "NRL Chief",
            "thumbnailUrl": "http://bigpondvideo.com/Web/Images/Content/20150821220213a_89x50.jpg",
            "largeThumbnailUrl": "http://bigpondvideo.com/Web/Images/Content/20150821220213a_326x184.jpg",
            "programType": "Matches",
            "programCategory": "Replay: 1st Half",
            "priority": null,
            "lastUpdateDate": "2015-08-21T23:56:50+10:00",
            "isPremium": true,
            "club": [
                500010,
                500005
            ]
        },
        {
            "id": "c5Mnc0dzphfDvvlE7bB1O4wIuSk0Uji-",
            "contentId": 782508,
            "title": "Rd 24: Rabbitohs v Bulldogs (Hls)",
            "description": "Highlights of the match between the Rabbitohs & Bulldogs from ANZ Stadium",
            "publishDate": "2015-08-21T22:11:00+10:00",
            "publisher": "NRL Chief",
            "thumbnailUrl": "http://bigpondvideo.com/Web/Images/Content/20150821220628a_89x50.jpg",
            "largeThumbnailUrl": "http://bigpondvideo.com/Web/Images/Content/20150821220628a_326x184.jpg",
            "programType": "Highlights",
            "programCategory": "Match",
            "priority": null,
            "lastUpdateDate": "2015-08-21T22:15:29+10:00",
            "isPremium": false,
            "club": [
                500010,
                500005
            ]
        },
        {
            "id": "sxZ3c0dzokamzW-svo-MJukTZG3ksCRc",
            "contentId": 782528,
            "title": "Rd 24 Press Conference: Rabbitohs",
            "description": "The Rabbitohs coach faces the media following the match",
            "publishDate": "2015-08-21T22:43:00+10:00",
            "publisher": "NRL Chief",
            "thumbnailUrl": "http://bigpondvideo.com/Web/Images/Content/20150821224127a_89x50.jpg",
            "largeThumbnailUrl": "http://bigpondvideo.com/Web/Images/Content/20150821224127a_326x184.jpg",
            "programType": "Press Conference",
            "programCategory": null,
            "priority": null,
            "lastUpdateDate": "2015-08-21T22:52:34+10:00",
            "isPremium": false,
            "club": [
                500010,
                500005
            ]
        },
        {
            "id": "w0Znc0dzqwgFxtM8tHY6c3GvLVP1787K",
            "contentId": 782529,
            "title": "Rd 24 Press Conference: Bulldogs",
            "description": "The Bulldogs coach faces the media following the match",
            "publishDate": "2015-08-21T22:40:00+10:00",
            "publisher": "NRL Chief",
            "thumbnailUrl": "http://bigpondvideo.com/Web/Images/Content/20150821224039a_89x50.jpg",
            "largeThumbnailUrl": "http://bigpondvideo.com/Web/Images/Content/20150821224039a_326x184.jpg",
            "programType": "Press Conference",
            "programCategory": null,
            "priority": null,
            "lastUpdateDate": "2015-08-21T22:51:35+10:00",
            "isPremium": false,
            "club": [
                500010,
                500005
            ]
        },
        {
            "id": "Uyb3Y0dzr3PkILB5IYgNBsy2jwT8WFbG",
            "contentId": 783384,
            "title": "Rd 24: GOAL Adam Reynolds (75th min)",
            "description": "Conversion sees the Rabbitohs trail 32-18",
            "publishDate": "2015-08-21T21:45:00+10:00",
            "publisher": "NRL Chief",
            "thumbnailUrl": "http://bigpondvideo.com/Web/Images/Content/20150821214634a_89x50.jpg",
            "largeThumbnailUrl": "http://bigpondvideo.com/Web/Images/Content/20150821214634a_326x184.jpg",
            "programType": "Instant Replay",
            "programCategory": "Score",
            "priority": null,
            "lastUpdateDate": "2015-08-21T21:51:19+10:00",
            "isPremium": true,
            "club": [
                500010,
                500005
            ]
        },
        {
            "id": "VubnY0dzq62biyHBFT6p2tlmFj97lSJ9",
            "contentId": 783383,
            "title": "Rd 24: TRY Jason Clark (75th min)",
            "description": "Rabbitohs get a late one as Jason Clark dives over from close range",
            "publishDate": "2015-08-21T21:44:00+10:00",
            "publisher": "NRL Chief",
            "thumbnailUrl": "http://bigpondvideo.com/Web/Images/Content/20150821214516a_89x50.jpg",
            "largeThumbnailUrl": "http://bigpondvideo.com/Web/Images/Content/20150821214516a_326x184.jpg",
            "programType": "Instant Replay",
            "programCategory": "Score",
            "priority": 1,
            "lastUpdateDate": "2015-08-21T21:59:21+10:00",
            "isPremium": true,
            "club": [
                500010,
                500005
            ]
        },
        {
            "id": "l5a3Y0dzqrW_cCnqN1HIvq1HhPgl0DZA",
            "contentId": 783382,
            "title": "Rd 24: GOAL Trent Hodkinson (69th min)",
            "description": "Conversion sees the Bulldogs lead 32-12",
            "publishDate": "2015-08-21T21:38:00+10:00",
            "publisher": "NRL Chief",
            "thumbnailUrl": "http://bigpondvideo.com/Web/Images/Content/20150821213919a_89x50.jpg",
            "largeThumbnailUrl": "http://bigpondvideo.com/Web/Images/Content/20150821213919a_326x184.jpg",
            "programType": "Instant Replay",
            "programCategory": "Score",
            "priority": 2,
            "lastUpdateDate": "2015-08-21T21:58:56+10:00",
            "isPremium": true,
            "club": [
                500010,
                500005
            ]
        },
        {
            "id": "pxa3Y0dzrIC6Rk358CvtS4YiB14m-xUa",
            "contentId": 783381,
            "title": "Rd 24: TRY Shaun Lane (65th min)",
            "description": "Bulldogs are in again as this time Shaun Lane is on hand to score",
            "publishDate": "2015-08-21T21:37:00+10:00",
            "publisher": "NRL Chief",
            "thumbnailUrl": "http://bigpondvideo.com/Web/Images/Content/20150821213725a_89x50.jpg",
            "largeThumbnailUrl": "http://bigpondvideo.com/Web/Images/Content/20150821213725a_326x184.jpg",
            "programType": "Instant Replay",
            "programCategory": "Score",
            "priority": 3,
            "lastUpdateDate": "2015-08-21T21:58:56+10:00",
            "isPremium": true,
            "club": [
                500010,
                500005
            ]
        },
        {
            "id": "BlaXY0dzrOH3qIh5WC_B8oCWkRSrOeDn",
            "contentId": 783380,
            "title": "Rd 24: GOAL Adam Reynolds (65th min)",
            "description": "Conversion sees the Rabbitohs trail 26-12",
            "publishDate": "2015-08-21T21:32:00+10:00",
            "publisher": "NRL Chief",
            "thumbnailUrl": "http://bigpondvideo.com/Web/Images/Content/20150821213345a_89x50.jpg",
            "largeThumbnailUrl": "http://bigpondvideo.com/Web/Images/Content/20150821213345a_326x184.jpg",
            "programType": "Instant Replay",
            "programCategory": "Score",
            "priority": null,
            "lastUpdateDate": "2015-08-21T21:37:15+10:00",
            "isPremium": true,
            "club": [
                500010,
                500005
            ]
        },
        {
            "id": "42aXY0dzr7kXP2a_yvclRazc3zMFF0QJ",
            "contentId": 783379,
            "title": "Rd 24: TRY Alex Johnston (64th min)",
            "description": "Rabbitohs strike back through a try to Alex Johnston",
            "publishDate": "2015-08-21T21:30:00+10:00",
            "publisher": "NRL Chief",
            "thumbnailUrl": "http://bigpondvideo.com/Web/Images/Content/20150821213241a_89x50.jpg",
            "largeThumbnailUrl": "http://bigpondvideo.com/Web/Images/Content/20150821213241a_326x184.jpg",
            "programType": "Instant Replay",
            "programCategory": "Score",
            "priority": 4,
            "lastUpdateDate": "2015-08-21T21:57:21+10:00",
            "isPremium": true,
            "club": [
                500010,
                500005
            ]
        },
        {
            "id": "swZXY0dzqE7kDfM2dr4bS1GT0pRauThz",
            "contentId": 783378,
            "title": "Rd 24: TRY Curtis Rona (58th min)",
            "description": "Curtis Rona turns a half chance into a try as he shows great skill and strength to score in the corner",
            "publishDate": "2015-08-21T21:26:00+10:00",
            "publisher": "NRL Chief",
            "thumbnailUrl": "http://bigpondvideo.com/Web/Images/Content/20150821212611a_89x50.jpg",
            "largeThumbnailUrl": "http://bigpondvideo.com/Web/Images/Content/20150821212611a_326x184.jpg",
            "programType": "Instant Replay",
            "programCategory": "Score",
            "priority": 5,
            "lastUpdateDate": "2015-08-21T21:57:21+10:00",
            "isPremium": true,
            "club": [
                500010,
                500005
            ]
        },
        {
            "id": "NnY3Y0dzov7pwPLasujU3BzzhgN-Wm12",
            "contentId": 783377,
            "title": "Rd 24: GOAL Adam Reynolds (52nd min)",
            "description": "Conversion sees the Rabbitohs trail 22-6",
            "publishDate": "2015-08-21T21:17:00+10:00",
            "publisher": "NRL Chief",
            "thumbnailUrl": "http://bigpondvideo.com/Web/Images/Content/20150821212032a_89x50.jpg",
            "largeThumbnailUrl": "http://bigpondvideo.com/Web/Images/Content/20150821212032a_326x184.jpg",
            "programType": "Instant Replay",
            "programCategory": "Score",
            "priority": null,
            "lastUpdateDate": "2015-08-21T21:24:11+10:00",
            "isPremium": true,
            "club": [
                500010,
                500005
            ]
        },
        {
            "id": "B4YnY0dzpqAvOfG1Hq6m2TGq3uXkD91u",
            "contentId": 783375,
            "title": "Rd 24: TRY Bryson Goodwin (50th min)",
            "description": "Pin point kick by John Sutton sends Bryson Goodwin over for the first try of the night for the Rabbitohs",
            "publishDate": "2015-08-21T21:16:00+10:00",
            "publisher": "NRL Chief",
            "thumbnailUrl": "http://bigpondvideo.com/Web/Images/Content/20150821211735a_89x50.jpg",
            "largeThumbnailUrl": "http://bigpondvideo.com/Web/Images/Content/20150821211735a_326x184.jpg",
            "programType": "Instant Replay",
            "programCategory": "Score",
            "priority": 6,
            "lastUpdateDate": "2015-08-21T21:56:21+10:00",
            "isPremium": true,
            "club": [
                500010,
                500005
            ]
        },
        {
            "id": "t5MHY0dzr4vII5LEz-APh9oP699mzScH",
            "contentId": 783374,
            "title": "Rd 24: TRY Sam Perrett (40th min)",
            "description": "The Bulldogs are in again as a charge down on the field goal goes wrong for the Rabbitohs and Damien Cook does some great work to see Sam Perrett score",
            "publishDate": "2015-08-21T20:47:00+10:00",
            "publisher": "NRL Chief",
            "thumbnailUrl": "http://bigpondvideo.com/Web/Images/Content/20150821204826a_89x50.jpg",
            "largeThumbnailUrl": "http://bigpondvideo.com/Web/Images/Content/20150821204826a_326x184.jpg",
            "programType": "Instant Replay",
            "programCategory": "Score",
            "priority": 7,
            "lastUpdateDate": "2015-08-21T21:55:20+10:00",
            "isPremium": true,
            "club": [
                500010,
                500005
            ]
        },
        {
            "id": "hudXU0dzoKSQbVDOcGT4mIqmNqUGGeNr",
            "contentId": 783373,
            "title": "Rd 24: GOAL Trent Hodkinson (30th min)",
            "description": "Conversion sees the Bulldogs lead 18-0",
            "publishDate": "2015-08-21T20:33:00+10:00",
            "publisher": "NRL Chief",
            "thumbnailUrl": "http://bigpondvideo.com/Web/Images/Content/20150821203341a_89x50.jpg",
            "largeThumbnailUrl": "http://bigpondvideo.com/Web/Images/Content/20150821203341a_326x184.jpg",
            "programType": "Instant Replay",
            "programCategory": "Score",
            "priority": null,
            "lastUpdateDate": "2015-08-21T20:38:01+10:00",
            "isPremium": true,
            "club": [
                500010,
                500005
            ]
        },
        {
            "id": "lodXU0dzptqbdRGZ6pL_mrLzzgMX1bMm",
            "contentId": 783372,
            "title": "Rd 24: TRY Brett Morris (28th min)",
            "description": "Its the Bulldogs once again as Frank Pritchard does some great lead up work to send Brett Morris over for the 3rd try for the night",
            "publishDate": "2015-08-21T20:32:00+10:00",
            "publisher": "NRL Chief",
            "thumbnailUrl": "http://bigpondvideo.com/Web/Images/Content/20150821203330a_89x50.jpg",
            "largeThumbnailUrl": "http://bigpondvideo.com/Web/Images/Content/20150821203330a_326x184.jpg",
            "programType": "Instant Replay",
            "programCategory": "Score",
            "priority": 8,
            "lastUpdateDate": "2015-08-21T21:55:20+10:00",
            "isPremium": true,
            "club": [
                500010,
                500005
            ]
        },
        {
            "id": "thcnU0dzqONYrtnkIZ7kM1NAleGJff0Y",
            "contentId": 783370,
            "title": "Rd 24: GOAL Trent Hodkinson (19th min)",
            "description": "Conversion sees the Bulldogs lead 12-0",
            "publishDate": "2015-08-21T20:22:00+10:00",
            "publisher": "NRL Chief",
            "thumbnailUrl": "http://bigpondvideo.com/Web/Images/Content/20150821202146a_89x50.jpg",
            "largeThumbnailUrl": "http://bigpondvideo.com/Web/Images/Content/20150821202146a_326x184.jpg",
            "programType": "Instant Replay",
            "programCategory": "Score",
            "priority": null,
            "lastUpdateDate": "2015-08-21T20:25:58+10:00",
            "isPremium": true,
            "club": [
                500010,
                500005
            ]
        },
        {
            "id": "Z4cXU0dzpwN51bQ47tasVU0jv7l5PoCv",
            "contentId": 783369,
            "title": "Rd 24: TRY Sam Perrett (17th min)",
            "description": "Bulldogs on fire as Trent Hodkinson produces a gem of a pass to send Sam Perrett over in the corner",
            "publishDate": "2015-08-21T20:21:00+10:00",
            "publisher": "NRL Chief",
            "thumbnailUrl": "http://bigpondvideo.com/Web/Images/Content/20150821202032a_89x50.jpg",
            "largeThumbnailUrl": "http://bigpondvideo.com/Web/Images/Content/20150821202032a_326x184.jpg",
            "programType": "Instant Replay",
            "programCategory": "Score",
            "priority": 9,
            "lastUpdateDate": "2015-08-21T21:54:20+10:00",
            "isPremium": true,
            "club": [
                500010,
                500005
            ]
        },
        {
            "id": "E3cXU0dzr2OVYMlm8tL0aztzWKNvEnK2",
            "contentId": 783367,
            "title": "Rd 24: GOAL Trent Hodkinson (12th min)",
            "description": "Conversion sees the Bulldogs lead 6-0",
            "publishDate": "2015-08-21T20:14:00+10:00",
            "publisher": "NRL Chief",
            "thumbnailUrl": "http://bigpondvideo.com/Web/Images/Content/20150821201905a_89x50.jpg",
            "largeThumbnailUrl": "http://bigpondvideo.com/Web/Images/Content/20150821201905a_326x184.jpg",
            "programType": "Instant Replay",
            "programCategory": "Score",
            "priority": null,
            "lastUpdateDate": "2015-08-21T20:22:57+10:00",
            "isPremium": true,
            "club": [
                500010,
                500005
            ]
        },
        {
            "id": "VvcHU0dzqTUloWrmtbev05zZIsmNboNB",
            "contentId": 783366,
            "title": "Rd 24: TRY Damien Cook (10th min)",
            "description": "Bulldogs get the opening try as they keep the ball alive on the last and Damien Cook is on hand to score",
            "publishDate": "2015-08-21T20:13:00+10:00",
            "publisher": "NRL Chief",
            "thumbnailUrl": "http://bigpondvideo.com/Web/Images/Content/20150821201642a_89x50.jpg",
            "largeThumbnailUrl": "http://bigpondvideo.com/Web/Images/Content/20150821201642a_326x184.jpg",
            "programType": "Instant Replay",
            "programCategory": "Score",
            "priority": 10,
            "lastUpdateDate": "2015-08-21T21:53:20+10:00",
            "isPremium": true,
            "club": [
                500010,
                500005
            ]
        }
    ],
    "scores": [
        {
            "gameState": "Second Half",
            "gameStateId": 5,
            "gameTime": "0:49:47",
            "gameSeconds": 2987,
            "playerId": 500082,
            "playerName": "Bryson Goodwin",
            "scoreMethod": "Try",
            "statEvent": "Try",
            "statId": 38,
            "statValue": 4,
            "vidRef": 93347,
            "homeScore": 4,
            "awayScore": 22,
            "teamId": 500005,
            "teamName": "South Sydney Rabbitohs",
            "homeTeamAbbrv": "SOU",
            "awayTeamAbbrv": "CBY"
        },
        {
            "gameState": "Second Half",
            "gameStateId": 5,
            "gameTime": "0:51:10",
            "gameSeconds": 3070,
            "playerId": 500086,
            "playerName": "Adam Reynolds",
            "scoreMethod": "Conversion",
            "statEvent": "Conversion-Made",
            "statId": 1,
            "statValue": 2,
            "vidRef": 95598,
            "homeScore": 6,
            "awayScore": 22,
            "teamId": 500005,
            "teamName": "South Sydney Rabbitohs",
            "homeTeamAbbrv": "SOU",
            "awayTeamAbbrv": "CBY"
        },
        {
            "gameState": "Second Half",
            "gameStateId": 5,
            "gameTime": "1:03:30",
            "gameSeconds": 3810,
            "playerId": 500108,
            "playerName": "Alex Johnston",
            "scoreMethod": "Try",
            "statEvent": "Try",
            "statId": 38,
            "statValue": 4,
            "vidRef": 116317,
            "homeScore": 10,
            "awayScore": 26,
            "teamId": 500005,
            "teamName": "South Sydney Rabbitohs",
            "homeTeamAbbrv": "SOU",
            "awayTeamAbbrv": "CBY"
        },
        {
            "gameState": "Second Half",
            "gameStateId": 5,
            "gameTime": "1:04:12",
            "gameSeconds": 3852,
            "playerId": 500086,
            "playerName": "Adam Reynolds",
            "scoreMethod": "Conversion",
            "statEvent": "Conversion-Made",
            "statId": 1,
            "statValue": 2,
            "vidRef": 117361,
            "homeScore": 12,
            "awayScore": 26,
            "teamId": 500005,
            "teamName": "South Sydney Rabbitohs",
            "homeTeamAbbrv": "SOU",
            "awayTeamAbbrv": "CBY"
        },
        {
            "gameState": "Second Half",
            "gameStateId": 5,
            "gameTime": "1:14:25",
            "gameSeconds": 4465,
            "playerId": 500096,
            "playerName": "Jason Clark",
            "scoreMethod": "Try",
            "statEvent": "Try",
            "statId": 38,
            "statValue": 4,
            "vidRef": 135279,
            "homeScore": 16,
            "awayScore": 32,
            "teamId": 500005,
            "teamName": "South Sydney Rabbitohs",
            "homeTeamAbbrv": "SOU",
            "awayTeamAbbrv": "CBY"
        },
        {
            "gameState": "Second Half",
            "gameStateId": 5,
            "gameTime": "1:14:55",
            "gameSeconds": 4495,
            "playerId": 500086,
            "playerName": "Adam Reynolds",
            "scoreMethod": "Conversion",
            "statEvent": "Conversion-Made",
            "statId": 1,
            "statValue": 2,
            "vidRef": 136038,
            "homeScore": 18,
            "awayScore": 32,
            "teamId": 500005,
            "teamName": "South Sydney Rabbitohs",
            "homeTeamAbbrv": "SOU",
            "awayTeamAbbrv": "CBY"
        },
        {
            "gameState": "First Half",
            "gameStateId": 3,
            "gameTime": "0:09:40",
            "gameSeconds": 580,
            "playerId": 501600,
            "playerName": "Damien Cook",
            "scoreMethod": "Try",
            "statEvent": "Try",
            "statId": 38,
            "statValue": 4,
            "vidRef": 17627,
            "awayScore": 4,
            "teamId": 500010,
            "teamName": "Canterbury-Bankstown Bulldogs",
            "homeTeamAbbrv": "SOU",
            "awayTeamAbbrv": "CBY"
        },
        {
            "gameState": "First Half",
            "gameStateId": 3,
            "gameTime": "0:11:04",
            "gameSeconds": 664,
            "playerId": 500224,
            "playerName": "Trent Hodkinson",
            "scoreMethod": "Conversion",
            "statEvent": "Conversion-Made",
            "statId": 1,
            "statValue": 2,
            "vidRef": 20046,
            "awayScore": 6,
            "teamId": 500010,
            "teamName": "Canterbury-Bankstown Bulldogs",
            "homeTeamAbbrv": "SOU",
            "awayTeamAbbrv": "CBY"
        },
        {
            "gameState": "First Half",
            "gameStateId": 3,
            "gameTime": "0:16:42",
            "gameSeconds": 1002,
            "playerId": 500234,
            "playerName": "Sam Perrett",
            "scoreMethod": "Try",
            "statEvent": "Try",
            "statId": 38,
            "statValue": 4,
            "vidRef": 28496,
            "awayScore": 10,
            "teamId": 500010,
            "teamName": "Canterbury-Bankstown Bulldogs",
            "homeTeamAbbrv": "SOU",
            "awayTeamAbbrv": "CBY"
        },
        {
            "gameState": "First Half",
            "gameStateId": 3,
            "gameTime": "0:18:07",
            "gameSeconds": 1087,
            "playerId": 500224,
            "playerName": "Trent Hodkinson",
            "scoreMethod": "Conversion",
            "statEvent": "Conversion-Made",
            "statId": 1,
            "statValue": 2,
            "vidRef": 31013,
            "awayScore": 12,
            "teamId": 500010,
            "teamName": "Canterbury-Bankstown Bulldogs",
            "homeTeamAbbrv": "SOU",
            "awayTeamAbbrv": "CBY"
        },
        {
            "gameState": "First Half",
            "gameStateId": 3,
            "gameTime": "0:27:55",
            "gameSeconds": 1675,
            "playerId": 500633,
            "playerName": "Brett Morris",
            "scoreMethod": "Try",
            "statEvent": "Try",
            "statId": 38,
            "statValue": 4,
            "vidRef": 46147,
            "awayScore": 16,
            "teamId": 500010,
            "teamName": "Canterbury-Bankstown Bulldogs",
            "homeTeamAbbrv": "SOU",
            "awayTeamAbbrv": "CBY"
        },
        {
            "gameState": "First Half",
            "gameStateId": 3,
            "gameTime": "0:29:18",
            "gameSeconds": 1758,
            "playerId": 500224,
            "playerName": "Trent Hodkinson",
            "scoreMethod": "Conversion",
            "statEvent": "Conversion-Made",
            "statId": 1,
            "statValue": 2,
            "vidRef": 48625,
            "awayScore": 18,
            "teamId": 500010,
            "teamName": "Canterbury-Bankstown Bulldogs",
            "homeTeamAbbrv": "SOU",
            "awayTeamAbbrv": "CBY"
        },
        {
            "gameState": "First Half",
            "gameStateId": 3,
            "gameTime": "0:39:45",
            "gameSeconds": 2385,
            "playerId": 500234,
            "playerName": "Sam Perrett",
            "scoreMethod": "Try",
            "statEvent": "Try",
            "statId": 38,
            "statValue": 4,
            "vidRef": 69911,
            "awayScore": 22,
            "teamId": 500010,
            "teamName": "Canterbury-Bankstown Bulldogs",
            "homeTeamAbbrv": "SOU",
            "awayTeamAbbrv": "CBY"
        },
        {
            "gameState": "Second Half",
            "gameStateId": 5,
            "gameTime": "0:58:00",
            "gameSeconds": 3480,
            "playerId": 500294,
            "playerName": "Curtis Rona",
            "scoreMethod": "Try",
            "statEvent": "Try",
            "statId": 38,
            "statValue": 4,
            "vidRef": 107133,
            "homeScore": 6,
            "awayScore": 26,
            "teamId": 500010,
            "teamName": "Canterbury-Bankstown Bulldogs",
            "homeTeamAbbrv": "SOU",
            "awayTeamAbbrv": "CBY"
        },
        {
            "gameState": "Second Half",
            "gameStateId": 5,
            "gameTime": "1:07:27",
            "gameSeconds": 4047,
            "playerId": 500140,
            "playerName": "Shaun Lane",
            "scoreMethod": "Try",
            "statEvent": "Try",
            "statId": 38,
            "statValue": 4,
            "vidRef": 124292,
            "homeScore": 12,
            "awayScore": 30,
            "teamId": 500010,
            "teamName": "Canterbury-Bankstown Bulldogs",
            "homeTeamAbbrv": "SOU",
            "awayTeamAbbrv": "CBY"
        },
        {
            "gameState": "Second Half",
            "gameStateId": 5,
            "gameTime": "1:08:30",
            "gameSeconds": 4110,
            "playerId": 500224,
            "playerName": "Trent Hodkinson",
            "scoreMethod": "Conversion",
            "statEvent": "Conversion-Made",
            "statId": 1,
            "statValue": 2,
            "vidRef": 125879,
            "homeScore": 12,
            "awayScore": 32,
            "teamId": 500010,
            "teamName": "Canterbury-Bankstown Bulldogs",
            "homeTeamAbbrv": "SOU",
            "awayTeamAbbrv": "CBY"
        }
    ]
}