{
    "competitionId": 111,
    "competitionName": "NRL Telstra Premiership",
    "gameId": 20171110830,
    "gameInfo": {
        "assistantReferee1Id": 500040,
        "assistantReferee1Name": "Nick Beashel",
        "assistantReferee2Id": 500045,
        "assistantReferee2Name": "Belinda Sleeman",
        "crowd": 14070,
        "gameDate": "2017-04-22",
        "gameHashTag": "#NRLEelsPanthers",
        "gameNumber": 3,
        "gameSeconds": 4800,
        "gameMinutes": "80:00",
        "gameTime": "1:20:00",
        "groundConditionId": 2,
        "groundConditionName": "Good",
        "numberOfPeriods": 2,
        "referee1Id": 500008,
        "referee1Name": "Gavin Badger",
        "referee2Id": 500069,
        "referee2Name": "Jon Stone",
        "startTime": "2017-04-22T15:00:00",
        "startTimeUTC": "2017-04-22T05:00:00Z",
        "venueId": 500002,
        "venueName": "ANZ Stadium",
        "videoReferee1Id": 500203,
        "videoReferee1Name": "Ben Galea",
        "seniorReviewOfficialId": 500027,
        "seniorReviewOfficialName": "Bernard Sutton",
        "weatherId": 2,
        "weatherName": "Fine",
        "broadcastChannel": "FOX",
        "broadcastScheduledTimeUTC": "2017-04-22T04:50:00Z",
        "broadcastScheduledTime": "2017-04-22T14:50:00",
        "venueLatitude": -33.8472,
        "venueLongitude": 151.0633,
        "broadcastInfo": {
            "radioNetwork": []
        }
    },
    "gameState": "Final",
    "gameStateId": 8,
    "roundId": 8,
    "roundName": "Round 8",
    "seasonId": 2017,
    "teams": {
        "teamsMatch": [
            {
                "isHomeTeam": true,
                "score": {
                    "conversions": 2,
                    "points": 18,
                    "penaltyGoals": 1,
                    "tries": 3,
                    "allGoals": 3
                },
                "team1stHalfScore": 12,
                "team2ndHalfScore": 6,
                "teamAbbr": "PAR",
                "teamFinalScore": 18,
                "teamFullTimeScore": 18,
                "teamHalfTimeScore": 12,
                "teamId": 500031,
                "teamLineup": {
                    "teamLineUpStatusID": 4,
                    "teamLineUpStatus": "Final",
                    "injuriesAndSuspensions": {
                        "injury": [],
                        "suspension": []
                    },
                    "insAndOuts": {
                        "inOut": [
                            {
                                "inOut": "In",
                                "playerFirstName": "Kenny",
                                "playerId": "500667",
                                "playerLastName": "Edwards",
                                "playerName": "Kenny Edwards"
                            },
                            {
                                "inOut": "Out",
                                "playerFirstName": "Peni",
                                "playerId": "500696",
                                "playerLastName": "Terepo",
                                "playerName": "Peni Terepo"
                            }
                        ]
                    },
                    "teamPlayer": [
                        {
                            "playerFirstName": "Clinton",
                            "playerId": 500729,
                            "playerLastName": "Gutherson",
                            "playerName": "Clinton Gutherson",
                            "playerPosition": "Fullback",
                            "playerPositionId": 500001,
                            "playerStats": {
                                "allRunMetres": 159,
                                "allRuns": 19,
                                "bombKicksDefused": 1,
                                "conversions": 2,
                                "conversionsAttempts": 3,
                                "conversionsMissed": 1,
                                "decoys": 1,
                                "dummyHalfRuns": 2,
                                "errors": 3,
                                "fantasyPointsTotal": 40,
                                "goalConversionRate": 75,
                                "allGoals": 3,
                                "allGoalsMissed": 1,
                                "allGoalsAttempted": 4,
                                "kickMetres": 75,
                                "kickReturnMetres": 42,
                                "kickReturns": 5,
                                "kicks": 4,
                                "kicksDefused": 2,
                                "linebreaks": 1,
                                "mins": 80,
                                "missedTackles": 1,
                                "passes": 18,
                                "passesPerRun": 0.95,
                                "oneOnOneTackles": 1,
                                "penaltyGoals": 1,
                                "penaltyGoalsAttempts": 1,
                                "points": 6,
                                "supports": 16,
                                "tackleBreaks": 3,
                                "tackles": 4,
                                "tryAssists": 1,
                                "evasionRuns": 12,
                                "evasionRunMetres": 109,
                                "dummyHalfRunMetres": 8,
                                "ptbAll": 13,
                                "receipts": 40,
                                "chipKick": 1,
                                "postContactMetres": 43,
                                "dummyPasses": 4,
                                "lineEngagedRuns": 4,
                                "ptbAverage": 3.79,
                                "ptbTwoToThree": 3,
                                "ptbThreeToFour": 5,
                                "ptbFourToFive": 5,
                                "ptbOpp20m": 1,
                                "effectiveTacklePercentage": 80,
                                "stint1": 4800,
                                "kickReceiptRuns": 5,
                                "kickReceiptMetres": 42
                            },
                            "playerTookTheField": true,
                            "shirtNum": 1,
                            "playerFirstInitial": "C",
                            "playerPositionAbbrev": "FB",
                            "onTheField": true,
                            "fantasyPrice": 404000,
                            "fantasySeasonPriceChange": 58000,
                            "fantasyRoundPriceChange": -29000
                        },
                        {
                            "playerFirstName": "Semi",
                            "playerId": 500690,
                            "playerLastName": "Radradra",
                            "playerName": "Semi Radradra",
                            "playerPosition": "Winger 1",
                            "playerPositionId": 500002,
                            "playerStats": {
                                "allRunMetres": 119,
                                "allRuns": 15,
                                "bombKicksDefused": 1,
                                "bombKicksNotDefused": 1,
                                "dummyHalfRuns": 1,
                                "errors": 1,
                                "fantasyPointsTotal": 24,
                                "ineffectiveTackles": 1,
                                "kickReturnMetres": 14,
                                "kickReturns": 2,
                                "kicksDefused": 1,
                                "kicksNotDefused": 1,
                                "mins": 80,
                                "missedTackles": 1,
                                "offloads": 1,
                                "points": 4,
                                "supports": 20,
                                "tackleBreaks": 1,
                                "tackles": 3,
                                "tries": 1,
                                "tryCause": 1,
                                "evasionRuns": 12,
                                "evasionRunMetres": 95,
                                "dummyHalfRunMetres": 10,
                                "ptbAll": 12,
                                "receipts": 15,
                                "postContactMetres": 40,
                                "ptbAverage": 4.09,
                                "ptbTwoToThree": 3,
                                "ptbThreeToFour": 2,
                                "ptbFourToFive": 5,
                                "ptbFivePlus": 2,
                                "effectiveTacklePercentage": 60,
                                "stint1": 4800,
                                "kickReceiptRuns": 2,
                                "kickReceiptMetres": 14
                            },
                            "playerTookTheField": true,
                            "shirtNum": 2,
                            "playerFirstInitial": "S",
                            "playerPositionAbbrev": "WG",
                            "onTheField": true,
                            "fantasyPrice": 303000,
                            "fantasySeasonPriceChange": -70000,
                            "fantasyRoundPriceChange": -44000
                        },
                        {
                            "playerFirstName": "Michael",
                            "playerId": 500003,
                            "playerLastName": "Jennings",
                            "playerName": "Michael Jennings",
                            "playerPosition": "Centre 1",
                            "playerPositionId": 500003,
                            "playerStats": {
                                "allRunMetres": 72,
                                "allRuns": 9,
                                "decoys": 2,
                                "dummyHalfRuns": 1,
                                "errors": 1,
                                "fantasyPointsTotal": 19,
                                "mins": 80,
                                "missedTackles": 2,
                                "offloads": 1,
                                "passes": 16,
                                "passesPerRun": 1.78,
                                "supports": 11,
                                "tackleBreaks": 4,
                                "tackles": 4,
                                "tryCause": 1,
                                "evasionRuns": 8,
                                "evasionRunMetres": 62,
                                "dummyHalfRunMetres": 10,
                                "ptbAll": 6,
                                "receipts": 23,
                                "postContactMetres": 18,
                                "dummyPasses": 1,
                                "ptbAverage": 3.28,
                                "ptbTwoToThree": 2,
                                "ptbThreeToFour": 3,
                                "ptbFourToFive": 1,
                                "effectiveTacklePercentage": 66.7,
                                "stint1": 4800
                            },
                            "playerTookTheField": true,
                            "shirtNum": 3,
                            "playerFirstInitial": "M",
                            "playerPositionAbbrev": "CT",
                            "onTheField": true,
                            "fantasyPrice": 303000,
                            "fantasySeasonPriceChange": 10000,
                            "fantasyRoundPriceChange": -9000
                        },
                        {
                            "playerFirstName": "Kirisome",
                            "playerId": 500102,
                            "playerLastName": "Auva'a",
                            "playerName": "Kirisome Auva'a",
                            "playerPosition": "Centre 2",
                            "playerPositionId": 500004,
                            "playerStats": {
                                "allRunMetres": 91,
                                "allRuns": 12,
                                "decoys": 2,
                                "dummyHalfRuns": 1,
                                "errors": 3,
                                "fantasyPointsTotal": 8,
                                "mins": 80,
                                "missedTackles": 2,
                                "passes": 7,
                                "passesPerRun": 0.58,
                                "oneOnOneTackles": 2,
                                "supports": 9,
                                "tackles": 9,
                                "evasionRuns": 11,
                                "evasionRunMetres": 89,
                                "dummyHalfRunMetres": 2,
                                "ptbAll": 9,
                                "receipts": 19,
                                "postContactMetres": 33,
                                "ptbAverage": 3.27,
                                "ptbTwoToThree": 5,
                                "ptbThreeToFour": 3,
                                "ptbFivePlus": 1,
                                "effectiveTacklePercentage": 81.8,
                                "stint1": 4800
                            },
                            "playerTookTheField": true,
                            "shirtNum": 4,
                            "playerFirstInitial": "K",
                            "playerPositionAbbrev": "CT",
                            "onTheField": true,
                            "fantasyPrice": 203000
                        },
                        {
                            "playerFirstName": "Josh",
                            "playerId": 500256,
                            "playerLastName": "Hoffman",
                            "playerName": "Josh Hoffman",
                            "playerPosition": "Winger 2",
                            "playerPositionId": 500005,
                            "playerStats": {
                                "allRunMetres": 77,
                                "allRuns": 11,
                                "bombKicksDefused": 2,
                                "bombKicksNotDefused": 1,
                                "dummyHalfRuns": 3,
                                "errors": 2,
                                "fantasyPointsTotal": 9,
                                "kickReturnMetres": 22,
                                "kickReturns": 3,
                                "kicksDefused": 3,
                                "kicksNotDefused": 1,
                                "mins": 80,
                                "missedTackles": 5,
                                "passes": 5,
                                "passesPerRun": 0.45,
                                "supports": 7,
                                "tackleBreaks": 3,
                                "tackles": 4,
                                "tryCause": 1,
                                "evasionRuns": 5,
                                "evasionRunMetres": 32,
                                "dummyHalfRunMetres": 23,
                                "ptbAll": 12,
                                "receipts": 21,
                                "postContactMetres": 23,
                                "dummyPasses": 1,
                                "ptbAverage": 3.72,
                                "ptbTwoToThree": 2,
                                "ptbThreeToFour": 8,
                                "ptbFourToFive": 1,
                                "ptbFivePlus": 1,
                                "effectiveTacklePercentage": 44.4,
                                "stint1": 4800,
                                "kickReceiptRuns": 2,
                                "kickReceiptMetres": 10
                            },
                            "playerTookTheField": true,
                            "shirtNum": 5,
                            "playerFirstInitial": "J",
                            "playerPositionAbbrev": "WG",
                            "onTheField": true,
                            "fantasyPrice": 202000,
                            "fantasySeasonPriceChange": -66000,
                            "fantasyRoundPriceChange": 4000
                        },
                        {
                            "playerFirstName": "Brad",
                            "playerId": 500065,
                            "playerLastName": "Takairangi",
                            "playerName": "Brad Takairangi",
                            "playerPosition": "Five-Eighth",
                            "playerPositionId": 500006,
                            "playerStats": {
                                "allRunMetres": 20,
                                "allRuns": 4,
                                "fantasyPointsTotal": 14,
                                "kickMetres": 48,
                                "kicks": 3,
                                "mins": 40,
                                "offloads": 1,
                                "passes": 15,
                                "passesPerRun": 3.75,
                                "oneOnOneTackles": 1,
                                "supports": 7,
                                "tackles": 8,
                                "evasionRuns": 4,
                                "evasionRunMetres": 20,
                                "receipts": 19,
                                "chipKick": 1,
                                "grubberKick": 1,
                                "dummyPasses": 1,
                                "lineEngagedRuns": 3,
                                "doubles": 1,
                                "effectiveTacklePercentage": 100,
                                "stint1": 2404
                            },
                            "playerTookTheField": true,
                            "shirtNum": 6,
                            "playerFirstInitial": "B",
                            "playerPositionAbbrev": "FE",
                            "fantasyPrice": 272000,
                            "fantasySeasonPriceChange": 20000,
                            "fantasyRoundPriceChange": 18000
                        },
                        {
                            "playerFirstName": "Corey",
                            "playerId": 500684,
                            "playerLastName": "Norman",
                            "playerName": "Corey Norman",
                            "playerPosition": "Halfback",
                            "playerPositionId": 500007,
                            "playerStats": {
                                "allRunMetres": 168,
                                "allRuns": 17,
                                "bombKicks": 1,
                                "bombKickMetres": 29,
                                "dummyHalfRuns": 1,
                                "errors": 1,
                                "fantasyPointsTotal": 85,
                                "ineffectiveTackles": 3,
                                "kickMetres": 379,
                                "kickReturns": 1,
                                "kicks": 13,
                                "kicksDefused": 1,
                                "lineDropouts": 2,
                                "linebreaks": 1,
                                "mins": 80,
                                "passes": 35,
                                "passesPerRun": 2.06,
                                "oneOnOneTackles": 1,
                                "penalties": 2,
                                "points": 8,
                                "supports": 13,
                                "tackleBreaks": 5,
                                "tackles": 16,
                                "tries": 2,
                                "tryAssists": 1,
                                "tryCause": 1,
                                "evasionRuns": 15,
                                "evasionRunMetres": 151,
                                "dummyHalfRunMetres": 17,
                                "ptbAll": 6,
                                "receipts": 56,
                                "forcedDropOutKicker": 2,
                                "chipKick": 2,
                                "grubberKick": 1,
                                "postContactMetres": 38,
                                "dummyPasses": 9,
                                "kickPressures": 1,
                                "lineEngagedRuns": 9,
                                "ptbAverage": 3.47,
                                "ptbTwoToThree": 2,
                                "ptbThreeToFour": 2,
                                "ptbFourToFive": 2,
                                "ptbOpp20m": 1,
                                "doubles": 2,
                                "longKicksSpace": 3,
                                "effectiveTacklePercentage": 84.2,
                                "ptbPenalties": 2,
                                "stint1": 4800,
                                "kickReceiptRuns": 1
                            },
                            "playerTookTheField": true,
                            "shirtNum": 7,
                            "playerFirstInitial": "C",
                            "playerPositionAbbrev": "HB",
                            "onTheField": true,
                            "fantasyPrice": 477000,
                            "fantasySeasonPriceChange": 17000,
                            "fantasyRoundPriceChange": -28000
                        },
                        {
                            "playerFirstName": "Suaia",
                            "playerId": 500713,
                            "playerLastName": "Matagi",
                            "playerName": "Suaia Matagi",
                            "playerPosition": "Prop 1",
                            "playerPositionId": 500008,
                            "playerStats": {
                                "allRunMetres": 101,
                                "allRuns": 12,
                                "decoys": 4,
                                "fantasyPointsTotal": 39,
                                "hitUps": 11,
                                "mins": 39,
                                "missedTackles": 2,
                                "offloads": 1,
                                "passes": 3,
                                "passesPerRun": 0.25,
                                "oneOnOneTackles": 1,
                                "supports": 3,
                                "tackleBreaks": 2,
                                "tackles": 25,
                                "hitupRunMeters": 95,
                                "evasionRuns": 1,
                                "evasionRunMetres": 6,
                                "ptbAll": 9,
                                "receipts": 15,
                                "postContactMetres": 37,
                                "dummyPasses": 1,
                                "kickPressures": 2,
                                "lineEngagedRuns": 1,
                                "ptbAverage": 4.25,
                                "ptbTwoToThree": 3,
                                "ptbThreeToFour": 3,
                                "ptbFourToFive": 1,
                                "ptbFivePlus": 2,
                                "ptbOpp20m": 1,
                                "doubles": 5,
                                "effectiveTacklePercentage": 92.6,
                                "stint1": 1327,
                                "stint2": 1025
                            },
                            "playerTookTheField": true,
                            "shirtNum": 8,
                            "playerFirstInitial": "S",
                            "playerPositionAbbrev": "PR",
                            "onTheField": true,
                            "fantasyPrice": 247000,
                            "fantasySeasonPriceChange": 43000,
                            "fantasyRoundPriceChange": -2000
                        },
                        {
                            "playerFirstName": "Kaysa",
                            "playerId": 500911,
                            "playerLastName": "Pritchard",
                            "playerName": "Kaysa Pritchard",
                            "playerPosition": "Hooker",
                            "playerPositionId": 500009,
                            "playerStats": {
                                "allRunMetres": 38,
                                "allRuns": 3,
                                "dummyHalfRuns": 1,
                                "errors": 1,
                                "fantasyPointsTotal": 61,
                                "hitUps": 2,
                                "ineffectiveTackles": 1,
                                "linebreakAssists": 1,
                                "mins": 73,
                                "missedTackles": 2,
                                "offloads": 3,
                                "passes": 82,
                                "passesPerRun": 27.33,
                                "supports": 2,
                                "tackleBreaks": 1,
                                "tackles": 53,
                                "hitupRunMeters": 22,
                                "dummyHalfRunMetres": 16,
                                "receipts": 84,
                                "postContactMetres": 11,
                                "dummyPasses": 1,
                                "kickPressures": 3,
                                "doubles": 9,
                                "effectiveTacklePercentage": 94.6,
                                "stint1": 3922,
                                "stint2": 477
                            },
                            "playerTookTheField": true,
                            "shirtNum": 9,
                            "playerFirstInitial": "K",
                            "playerPositionAbbrev": "HK",
                            "onTheField": true,
                            "fantasyPrice": 303000,
                            "fantasySeasonPriceChange": 118000,
                            "fantasyRoundPriceChange": 30000
                        },
                        {
                            "playerFirstName": "Tim",
                            "playerId": 500679,
                            "playerLastName": "Mannah",
                            "playerName": "Tim Mannah",
                            "playerPosition": "Prop 2",
                            "playerPositionId": 500010,
                            "playerStats": {
                                "allRunMetres": 127,
                                "allRuns": 13,
                                "decoys": 4,
                                "errors": 1,
                                "fantasyPointsTotal": 32,
                                "hitUps": 8,
                                "kickReturnMetres": 71,
                                "kickReturns": 5,
                                "mins": 38,
                                "missedTackles": 1,
                                "offloads": 1,
                                "supports": 2,
                                "tackleBreaks": 1,
                                "tackles": 19,
                                "hitupRunMeters": 56,
                                "ptbAll": 10,
                                "receipts": 13,
                                "postContactMetres": 29,
                                "kickPressures": 1,
                                "ptbAverage": 4.08,
                                "ptbTwoToThree": 1,
                                "ptbThreeToFour": 2,
                                "ptbFourToFive": 6,
                                "ptbFivePlus": 1,
                                "doubles": 2,
                                "effectiveTacklePercentage": 95,
                                "stint1": 1123,
                                "stint2": 1125
                            },
                            "playerTookTheField": true,
                            "shirtNum": 10,
                            "isCaptain": true,
                            "playerFirstInitial": "T",
                            "playerPositionAbbrev": "PR",
                            "fantasyPrice": 301000,
                            "fantasySeasonPriceChange": -26000,
                            "fantasyRoundPriceChange": -7000
                        },
                        {
                            "playerFirstName": "Manu",
                            "playerId": 500680,
                            "playerLastName": "Ma'u",
                            "playerName": "Manu Ma'u",
                            "playerPosition": "2nd Row 1",
                            "playerPositionId": 500011,
                            "playerStats": {
                                "allRunMetres": 132,
                                "allRuns": 16,
                                "decoys": 2,
                                "fantasyPointsTotal": 42,
                                "hitUps": 14,
                                "ineffectiveTackles": 2,
                                "mins": 80,
                                "missedTackles": 1,
                                "offloads": 1,
                                "passes": 2,
                                "passesPerRun": 0.12,
                                "supports": 7,
                                "tackleBreaks": 1,
                                "tackles": 26,
                                "hitupRunMeters": 124,
                                "evasionRuns": 2,
                                "evasionRunMetres": 8,
                                "ptbAll": 13,
                                "receipts": 17,
                                "postContactMetres": 49,
                                "lineEngagedRuns": 2,
                                "ptbAverage": 3.41,
                                "ptbOneToTwo": 1,
                                "ptbTwoToThree": 5,
                                "ptbThreeToFour": 4,
                                "ptbFourToFive": 2,
                                "ptbFivePlus": 1,
                                "ptbOpp20m": 2,
                                "doubles": 4,
                                "effectiveTacklePercentage": 89.7,
                                "stint1": 4800
                            },
                            "playerTookTheField": true,
                            "shirtNum": 11,
                            "playerFirstInitial": "M",
                            "playerPositionAbbrev": "2R",
                            "onTheField": true,
                            "fantasyPrice": 382000,
                            "fantasySeasonPriceChange": -46000,
                            "fantasyRoundPriceChange": -9000
                        },
                        {
                            "playerFirstName": "Tepai",
                            "playerId": 500908,
                            "playerLastName": "Moeroa",
                            "playerName": "Tepai Moeroa",
                            "playerPosition": "2nd Row 2",
                            "playerPositionId": 500012,
                            "playerStats": {
                                "allRunMetres": 111,
                                "allRuns": 12,
                                "decoys": 3,
                                "fantasyPointsTotal": 40,
                                "hitUps": 12,
                                "ineffectiveTackles": 2,
                                "mins": 64,
                                "missedTackles": 1,
                                "passes": 3,
                                "passesPerRun": 0.25,
                                "oneOnOneTackles": 1,
                                "supports": 10,
                                "tackleBreaks": 1,
                                "tackles": 28,
                                "hitupRunMeters": 111,
                                "ptbAll": 13,
                                "receipts": 16,
                                "postContactMetres": 41,
                                "kickPressures": 1,
                                "ptbAverage": 3.51,
                                "ptbTwoToThree": 3,
                                "ptbThreeToFour": 6,
                                "ptbFourToFive": 4,
                                "ptbOpp20m": 3,
                                "doubles": 2,
                                "effectiveTacklePercentage": 90.3,
                                "stint1": 2963,
                                "stint2": 878
                            },
                            "playerTookTheField": true,
                            "shirtNum": 12,
                            "playerFirstInitial": "T",
                            "playerPositionAbbrev": "2R",
                            "onTheField": true,
                            "fantasyPrice": 315000,
                            "fantasySeasonPriceChange": -28000,
                            "fantasyRoundPriceChange": -13000
                        },
                        {
                            "playerFirstName": "Nathan",
                            "playerId": 500647,
                            "playerLastName": "Brown",
                            "playerName": "Nathan Brown",
                            "playerPosition": "Lock",
                            "playerPositionId": 500013,
                            "playerStats": {
                                "allRunMetres": 132,
                                "allRuns": 19,
                                "decoys": 5,
                                "fantasyPointsTotal": 59,
                                "hitUps": 15,
                                "ineffectiveTackles": 2,
                                "kicksNotDefused": 1,
                                "mins": 73,
                                "missedTackles": 3,
                                "offloads": 3,
                                "passes": 12,
                                "passesPerRun": 0.63,
                                "penalties": 1,
                                "supports": 3,
                                "tackleBreaks": 4,
                                "tackles": 36,
                                "hitupRunMeters": 115,
                                "evasionRuns": 4,
                                "evasionRunMetres": 17,
                                "ptbAll": 12,
                                "receipts": 27,
                                "postContactMetres": 36,
                                "dummyPasses": 1,
                                "lineEngagedRuns": 4,
                                "ptbAverage": 4.04,
                                "ptbOneToTwo": 1,
                                "ptbTwoToThree": 1,
                                "ptbThreeToFour": 8,
                                "ptbFourToFive": 1,
                                "ptbFivePlus": 1,
                                "ptbOpp20m": 4,
                                "doubles": 7,
                                "effectiveTacklePercentage": 87.8,
                                "generalPlayPenalties": 1,
                                "stint1": 1986,
                                "stint2": 2396
                            },
                            "playerTookTheField": true,
                            "shirtNum": 13,
                            "playerFirstInitial": "N",
                            "playerPositionAbbrev": "LK",
                            "onTheField": true,
                            "fantasyPrice": 401000,
                            "fantasySeasonPriceChange": 25000,
                            "fantasyRoundPriceChange": 29000
                        },
                        {
                            "playerFirstName": "Beau",
                            "playerId": 500051,
                            "playerLastName": "Scott",
                            "playerName": "Beau Scott",
                            "playerPosition": "Interchange",
                            "playerPositionId": 500014,
                            "playerStats": {
                                "allRunMetres": 85,
                                "allRuns": 10,
                                "decoys": 4,
                                "fantasyPointsTotal": 37,
                                "hitUps": 10,
                                "ineffectiveTackles": 1,
                                "mins": 53,
                                "passes": 1,
                                "passesPerRun": 0.1,
                                "oneOnOneTackles": 2,
                                "penalties": 2,
                                "supports": 3,
                                "tackles": 33,
                                "hitupRunMeters": 85,
                                "ptbAll": 10,
                                "receipts": 11,
                                "postContactMetres": 27,
                                "ptbAverage": 3.91,
                                "ptbTwoToThree": 3,
                                "ptbThreeToFour": 2,
                                "ptbFourToFive": 3,
                                "ptbFivePlus": 2,
                                "ptbOpp20m": 1,
                                "doubles": 9,
                                "effectiveTacklePercentage": 97.1,
                                "ptbPenalties": 1,
                                "offsidePenalties": 1,
                                "stint1": 3169
                            },
                            "playerTookTheField": true,
                            "shirtNum": 14,
                            "isCaptain": true,
                            "playerFirstInitial": "B",
                            "playerPositionAbbrev": "INT",
                            "fantasyPrice": 320000,
                            "fantasySeasonPriceChange": -20000,
                            "fantasyRoundPriceChange": -2000
                        },
                        {
                            "playerFirstName": "Daniel",
                            "playerId": 501335,
                            "playerLastName": "Alvaro",
                            "playerName": "Daniel Alvaro",
                            "playerPosition": "Interchange",
                            "playerPositionId": 500014,
                            "playerStats": {
                                "allRunMetres": 31,
                                "allRuns": 4,
                                "decoys": 1,
                                "errors": 1,
                                "fantasyPointsTotal": 29,
                                "hitUps": 4,
                                "mins": 22,
                                "missedTackles": 1,
                                "oneOnOneTackles": 1,
                                "supports": 3,
                                "tackleBreaks": 1,
                                "tackles": 27,
                                "hitupRunMeters": 31,
                                "ptbAll": 4,
                                "receipts": 5,
                                "postContactMetres": 11,
                                "ptbAverage": 4.11,
                                "ptbThreeToFour": 2,
                                "ptbFourToFive": 2,
                                "doubles": 8,
                                "effectiveTacklePercentage": 96.4,
                                "stint1": 812,
                                "stint2": 508
                            },
                            "playerTookTheField": true,
                            "shirtNum": 15,
                            "playerFirstInitial": "D",
                            "playerPositionAbbrev": "INT",
                            "onTheField": true,
                            "fantasyPrice": 309000,
                            "fantasySeasonPriceChange": -22000
                        },
                        {
                            "playerFirstName": "Kenny",
                            "playerId": 500667,
                            "playerLastName": "Edwards",
                            "playerName": "Kenny Edwards",
                            "playerPosition": "Interchange",
                            "playerPositionId": 500014,
                            "playerStats": {
                                "allRunMetres": 28,
                                "allRuns": 5,
                                "decoys": 1,
                                "errors": 1,
                                "fantasyPointsTotal": 21,
                                "hitUps": 3,
                                "ineffectiveTackles": 2,
                                "kicks": 1,
                                "mins": 58,
                                "passes": 10,
                                "passesPerRun": 2,
                                "oneOnOneTackles": 2,
                                "supports": 7,
                                "tackles": 21,
                                "hitupRunMeters": 18,
                                "evasionRuns": 2,
                                "evasionRunMetres": 10,
                                "ptbAll": 3,
                                "receipts": 14,
                                "postContactMetres": 6,
                                "dummyPasses": 1,
                                "lineEngagedRuns": 2,
                                "ptbAverage": 4.12,
                                "ptbTwoToThree": 1,
                                "ptbFourToFive": 1,
                                "ptbFivePlus": 1,
                                "doubles": 4,
                                "effectiveTacklePercentage": 91.3,
                                "stint1": 3473
                            },
                            "playerTookTheField": true,
                            "shirtNum": 16,
                            "playerFirstInitial": "K",
                            "playerPositionAbbrev": "INT",
                            "onTheField": true,
                            "fantasyPrice": 348000
                        },
                        {
                            "playerFirstName": "Siosaia",
                            "playerId": 501337,
                            "playerLastName": "Vave",
                            "playerName": "Siosaia Vave",
                            "playerPosition": "Interchange",
                            "playerPositionId": 500014,
                            "playerStats": {
                                "allRunMetres": 75,
                                "allRuns": 7,
                                "decoys": 1,
                                "fantasyPointsTotal": 23,
                                "hitUps": 6,
                                "kickReturnMetres": 8,
                                "kickReturns": 1,
                                "mins": 20,
                                "offloads": 1,
                                "passes": 1,
                                "passesPerRun": 0.14,
                                "penalties": 1,
                                "tackleBreaks": 1,
                                "tackles": 13,
                                "hitupRunMeters": 67,
                                "ptbAll": 6,
                                "receipts": 8,
                                "postContactMetres": 29,
                                "ptbAverage": 2.69,
                                "ptbOneToTwo": 1,
                                "ptbTwoToThree": 3,
                                "ptbThreeToFour": 2,
                                "doubles": 2,
                                "effectiveTacklePercentage": 100,
                                "ptbPenalties": 1,
                                "stint1": 1212
                            },
                            "playerTookTheField": true,
                            "shirtNum": 17,
                            "playerFirstInitial": "S",
                            "playerPositionAbbrev": "INT",
                            "fantasyPrice": 264000,
                            "fantasySeasonPriceChange": -10000,
                            "fantasyRoundPriceChange": -4000
                        }
                    ]
                },
                "teamName": "Parramatta Eels",
                "teamNickName": "Eels",
                "teamStats": {
                    "allRunMetres": 1564,
                    "allRuns": 188,
                    "bombKicks": 1,
                    "bombKickMetres": 29,
                    "bombKicksDefused": 4,
                    "bombKicksNotDefused": 2,
                    "completeSets": 25,
                    "completionPercentage": 66,
                    "conversions": 2,
                    "conversionsAttempts": 3,
                    "conversionsMissed": 1,
                    "decoys": 30,
                    "dummyHalfRuns": 10,
                    "errors": 15,
                    "goalConversionRate": 75,
                    "allGoals": 3,
                    "allGoalsAttempted": 4,
                    "allGoalsMissed": 1,
                    "hitUps": 85,
                    "incompleteSets": 13,
                    "ineffectiveTackles": 14,
                    "kickMetres": 502,
                    "kickReturnMetres": 157,
                    "kickReturns": 17,
                    "kicks": 21,
                    "kicksDefused": 7,
                    "kicksNotDefused": 3,
                    "lineDropouts": 2,
                    "linebreakAssists": 1,
                    "linebreaks": 2,
                    "missedTackles": 22,
                    "offloads": 13,
                    "oneOnOneTackles": 12,
                    "passes": 210,
                    "passesPerRun": 1.12,
                    "penalties": 6,
                    "penaltyGoals": 1,
                    "penaltyGoalsAttempts": 1,
                    "points": 18,
                    "pointsConceded": 12,
                    "possession": 51,
                    "scrumWins": 7,
                    "supports": 123,
                    "tackleBreaks": 28,
                    "tackles": 329,
                    "sets": 38,
                    "tries": 3,
                    "triesConceded": 2,
                    "tryAssists": 2,
                    "tryCause": 4,
                    "hitupRunMeters": 723,
                    "evasionRuns": 76,
                    "evasionRunMetres": 599,
                    "dummyHalfRunMetres": 85,
                    "ptbTotal": 138,
                    "twoManTackles": 58,
                    "threeManTackles": 52,
                    "fourManPlusTackles": 2,
                    "tryScoringPercentage": 7.89,
                    "shiftsLeft": 8,
                    "shiftsRight": 9,
                    "receipts": 403,
                    "forcedDropOutKicker": 2,
                    "chipKick": 4,
                    "grubberKick": 2,
                    "postContactMetres": 471,
                    "dummyPasses": 20,
                    "kickPressures": 8,
                    "lineEngagedRuns": 25,
                    "ptbAverage": 3.73,
                    "ptbOneToTwo": 3,
                    "ptbTwoToThree": 37,
                    "ptbThreeToFour": 52,
                    "ptbFourToFive": 34,
                    "ptbFivePlus": 12,
                    "ptbOpp20m": 13,
                    "interchangeUsed": 8,
                    "doubles": 55,
                    "longKicksSpace": 3,
                    "effectiveTacklePercentage": 90.1,
                    "ptbPenalties": 4,
                    "generalPlayPenalties": 1,
                    "offsidePenalties": 1,
                    "averageSetDistance": 41.2,
                    "completeSets1stHalf": 18,
                    "completeSets2ndHalf": 7,
                    "completionPercentage1stHalf": 78,
                    "completionPercentage2ndHalf": 47,
                    "incompleteSets1stHalf": 5,
                    "incompleteSets2ndHalf": 8,
                    "incompletionPercentage1stHalf": 22,
                    "incompletionPercentage2ndHalf": 53,
                    "kickReceiptRuns": 10,
                    "kickReceiptMetres": 65,
                    "averageOneManTackleTiming": 3.52,
                    "averageTwoManTackleTiming": 3.5,
                    "averageThreeManTackleTiming": 4.08,
                    "averageFourManTackleTiming": 4.22
                },
                "teamHexColour": "ffd900",
                "teamHexColour2": "0058a4",
                "teamCoaches": {
                    "teamCoach": [
                        {
                            "coachId": 50010,
                            "coachName": "Brad Arthur",
                            "coachRoleId": 12,
                            "coachRole": "Coach"
                        }
                    ]
                }
            },
            {
                "score": {
                    "conversions": 2,
                    "points": 12,
                    "tries": 2,
                    "allGoals": 2
                },
                "team1stHalfScore": 0,
                "team2ndHalfScore": 12,
                "teamAbbr": "PEN",
                "teamFinalScore": 12,
                "teamFullTimeScore": 12,
                "teamHalfTimeScore": 0,
                "teamId": 500014,
                "teamLineup": {
                    "teamLineUpStatusID": 4,
                    "teamLineUpStatus": "Final",
                    "injuriesAndSuspensions": {
                        "injury": [],
                        "suspension": []
                    },
                    "insAndOuts": {
                        "inOut": [
                            {
                                "inOut": "In",
                                "playerFirstName": "Bryce",
                                "playerId": "500499",
                                "playerLastName": "Cartwright",
                                "playerName": "Bryce Cartwright"
                            },
                            {
                                "inOut": "In",
                                "playerFirstName": "Corey",
                                "playerId": "501241",
                                "playerLastName": "Harawira-Naera",
                                "playerName": "Corey Harawira-Naera"
                            },
                            {
                                "inOut": "Out",
                                "playerFirstName": "James",
                                "playerId": "502580",
                                "playerLastName": "Fisher-Harris",
                                "playerName": "James Fisher-Harris"
                            },
                            {
                                "inOut": "Out",
                                "playerFirstName": "Te Maire",
                                "playerId": "501293",
                                "playerLastName": "Martin",
                                "playerName": "Te Maire Martin"
                            }
                        ]
                    },
                    "teamPlayer": [
                        {
                            "playerFirstName": "Matt",
                            "playerId": 500356,
                            "playerLastName": "Moylan",
                            "playerName": "Matt Moylan",
                            "playerPosition": "Fullback",
                            "playerPositionId": 500001,
                            "playerStats": {
                                "allRunMetres": 140,
                                "allRuns": 16,
                                "bombKicksDefused": 1,
                                "decoys": 1,
                                "dummyHalfRuns": 1,
                                "errors": 1,
                                "fantasyPointsTotal": 21,
                                "ineffectiveTackles": 1,
                                "kickMetres": 10,
                                "kickReturnMetres": 45,
                                "kickReturns": 5,
                                "kicks": 1,
                                "kicksDefused": 2,
                                "kicksNotDefused": 2,
                                "lineDropouts": 2,
                                "mins": 80,
                                "missedTackles": 2,
                                "offloads": 1,
                                "passes": 31,
                                "passesPerRun": 1.94,
                                "oneOnOneTackles": 2,
                                "supports": 16,
                                "tackleBreaks": 1,
                                "tackles": 6,
                                "tryCause": 1,
                                "evasionRuns": 10,
                                "evasionRunMetres": 81,
                                "dummyHalfRunMetres": 14,
                                "ptbAll": 10,
                                "receipts": 45,
                                "grubberKick": 1,
                                "postContactMetres": 20,
                                "dummyPasses": 4,
                                "lineEngagedRuns": 3,
                                "ptbAverage": 3.9,
                                "ptbOneToTwo": 1,
                                "ptbTwoToThree": 1,
                                "ptbThreeToFour": 4,
                                "ptbFourToFive": 3,
                                "ptbFivePlus": 1,
                                "doubles": 1,
                                "effectiveTacklePercentage": 66.7,
                                "stint1": 4800,
                                "kickReceiptRuns": 5,
                                "kickReceiptMetres": 45
                            },
                            "playerTookTheField": true,
                            "shirtNum": 1,
                            "isCaptain": true,
                            "playerFirstInitial": "M",
                            "playerPositionAbbrev": "FB",
                            "onTheField": true,
                            "fantasyPrice": 320000,
                            "fantasySeasonPriceChange": -51000
                        },
                        {
                            "playerFirstName": "Waqa",
                            "playerId": 500496,
                            "playerLastName": "Blake",
                            "playerName": "Waqa Blake",
                            "playerPosition": "Winger 1",
                            "playerPositionId": 500002,
                            "playerStats": {
                                "allRunMetres": 66,
                                "allRuns": 11,
                                "decoys": 2,
                                "dummyHalfRuns": 1,
                                "errors": 1,
                                "fantasyPointsTotal": 29,
                                "kickReturnMetres": 5,
                                "kickReturns": 1,
                                "kicksNotDefused": 1,
                                "linebreakAssists": 1,
                                "mins": 80,
                                "missedTackles": 1,
                                "passes": 4,
                                "passesPerRun": 0.36,
                                "oneOnOneTackles": 4,
                                "penalties": 1,
                                "supports": 7,
                                "tackleBreaks": 3,
                                "tackles": 13,
                                "tryAssists": 1,
                                "evasionRuns": 9,
                                "evasionRunMetres": 53,
                                "dummyHalfRunMetres": 8,
                                "ptbAll": 7,
                                "receipts": 14,
                                "postContactMetres": 22,
                                "ptbAverage": 3.65,
                                "ptbTwoToThree": 3,
                                "ptbThreeToFour": 1,
                                "ptbFourToFive": 2,
                                "ptbFivePlus": 1,
                                "ptbOpp20m": 3,
                                "doubles": 2,
                                "effectiveTacklePercentage": 92.9,
                                "offsidePenalties": 1,
                                "stint1": 4800,
                                "kickReceiptRuns": 1,
                                "kickReceiptMetres": 5
                            },
                            "playerTookTheField": true,
                            "shirtNum": 2,
                            "playerFirstInitial": "W",
                            "playerPositionAbbrev": "WG",
                            "onTheField": true,
                            "fantasyPrice": 262000,
                            "fantasySeasonPriceChange": -7000
                        },
                        {
                            "playerFirstName": "Dean",
                            "playerId": 500368,
                            "playerLastName": "Whare",
                            "playerName": "Dean Whare",
                            "playerPosition": "Centre 1",
                            "playerPositionId": 500003,
                            "playerStats": {
                                "allRunMetres": 60,
                                "allRuns": 5,
                                "dummyHalfRuns": 1,
                                "errors": 1,
                                "fantasyPointsTotal": 7,
                                "ineffectiveTackles": 1,
                                "mins": 80,
                                "missedTackles": 3,
                                "passes": 3,
                                "passesPerRun": 0.6,
                                "supports": 12,
                                "tackles": 9,
                                "evasionRuns": 4,
                                "evasionRunMetres": 44,
                                "dummyHalfRunMetres": 16,
                                "ptbAll": 4,
                                "receipts": 7,
                                "postContactMetres": 23,
                                "ptbAverage": 3.45,
                                "ptbTwoToThree": 1,
                                "ptbThreeToFour": 2,
                                "ptbFourToFive": 1,
                                "ptbOpp20m": 1,
                                "doubles": 1,
                                "effectiveTacklePercentage": 69.2,
                                "stint1": 4800
                            },
                            "playerTookTheField": true,
                            "shirtNum": 3,
                            "playerFirstInitial": "D",
                            "playerPositionAbbrev": "CT",
                            "onTheField": true,
                            "fantasyPrice": 234000,
                            "fantasySeasonPriceChange": 29000,
                            "fantasyRoundPriceChange": 3000
                        },
                        {
                            "playerFirstName": "Peta",
                            "playerId": 500579,
                            "playerLastName": "Hiku",
                            "playerName": "Peta Hiku",
                            "playerPosition": "Centre 2",
                            "playerPositionId": 500004,
                            "playerStats": {
                                "allRunMetres": 136,
                                "allRuns": 15,
                                "dummyHalfRuns": 3,
                                "errors": 1,
                                "fantasyPointsTotal": 43,
                                "ineffectiveTackles": 1,
                                "kickMetres": 17,
                                "kickReturnMetres": 15,
                                "kickReturns": 2,
                                "kicks": 1,
                                "kicksNotDefused": 1,
                                "linebreaks": 1,
                                "mins": 80,
                                "offloads": 1,
                                "passes": 5,
                                "passesPerRun": 0.33,
                                "oneOnOneTackles": 1,
                                "points": 4,
                                "supports": 7,
                                "tackleBreaks": 4,
                                "tackles": 6,
                                "tries": 1,
                                "tryCause": 1,
                                "evasionRuns": 10,
                                "evasionRunMetres": 87,
                                "dummyHalfRunMetres": 34,
                                "ptbAll": 12,
                                "receipts": 20,
                                "forcedDropOutKicker": 1,
                                "grubberKick": 1,
                                "postContactMetres": 27,
                                "dummyPasses": 2,
                                "kickPressures": 1,
                                "lineEngagedRuns": 1,
                                "ptbAverage": 3.45,
                                "ptbTwoToThree": 3,
                                "ptbThreeToFour": 6,
                                "ptbFourToFive": 3,
                                "ptbOpp20m": 1,
                                "doubles": 1,
                                "effectiveTacklePercentage": 85.7,
                                "stint1": 4800,
                                "kickReceiptRuns": 2,
                                "kickReceiptMetres": 15
                            },
                            "playerTookTheField": true,
                            "shirtNum": 14,
                            "playerFirstInitial": "P",
                            "playerPositionAbbrev": "CT",
                            "onTheField": true,
                            "fantasyPrice": 201000,
                            "fantasySeasonPriceChange": -59000
                        },
                        {
                            "playerFirstName": "Dallin",
                            "playerId": 500532,
                            "playerLastName": "Watene Zelezniak",
                            "playerName": "Dallin Watene Zelezniak",
                            "playerPosition": "Winger 2",
                            "playerPositionId": 500005,
                            "playerStats": {
                                "allRunMetres": 123,
                                "allRuns": 13,
                                "fantasyPointsTotal": 14,
                                "kickReturnMetres": 27,
                                "kickReturns": 2,
                                "kicksNotDefused": 1,
                                "mins": 80,
                                "missedTackles": 2,
                                "passes": 2,
                                "passesPerRun": 0.15,
                                "oneOnOneTackles": 1,
                                "supports": 7,
                                "tackleBreaks": 1,
                                "tackles": 3,
                                "tryCause": 1,
                                "evasionRuns": 11,
                                "evasionRunMetres": 96,
                                "ptbAll": 13,
                                "receipts": 15,
                                "postContactMetres": 38,
                                "ptbAverage": 3.5,
                                "ptbTwoToThree": 3,
                                "ptbThreeToFour": 7,
                                "ptbFourToFive": 3,
                                "effectiveTacklePercentage": 60,
                                "stint1": 4800,
                                "kickReceiptRuns": 2,
                                "kickReceiptMetres": 27
                            },
                            "playerTookTheField": true,
                            "shirtNum": 5,
                            "playerFirstInitial": "D",
                            "playerPositionAbbrev": "WG",
                            "onTheField": true,
                            "fantasyPrice": 292000,
                            "fantasySeasonPriceChange": 29000
                        },
                        {
                            "playerFirstName": "Bryce",
                            "playerId": 500499,
                            "playerLastName": "Cartwright",
                            "playerName": "Bryce Cartwright",
                            "playerPosition": "Five-Eighth",
                            "playerPositionId": 500006,
                            "playerStats": {
                                "allRunMetres": 61,
                                "allRuns": 8,
                                "errors": 4,
                                "fantasyPointsTotal": 26,
                                "ineffectiveTackles": 3,
                                "kickMetres": 9,
                                "kicks": 1,
                                "kicksNotDefused": 1,
                                "mins": 80,
                                "missedTackles": 1,
                                "offloads": 1,
                                "passes": 22,
                                "passesPerRun": 2.75,
                                "oneOnOneTackles": 4,
                                "supports": 4,
                                "tackleBreaks": 2,
                                "tackles": 22,
                                "evasionRuns": 8,
                                "evasionRunMetres": 61,
                                "ptbAll": 5,
                                "receipts": 31,
                                "grubberKick": 1,
                                "postContactMetres": 12,
                                "dummyPasses": 6,
                                "kickPressures": 1,
                                "lineEngagedRuns": 1,
                                "ptbAverage": 3.52,
                                "ptbTwoToThree": 1,
                                "ptbThreeToFour": 3,
                                "ptbFourToFive": 1,
                                "ptbOpp20m": 1,
                                "doubles": 1,
                                "effectiveTacklePercentage": 84.6,
                                "stint1": 4800
                            },
                            "playerTookTheField": true,
                            "shirtNum": 21,
                            "playerFirstInitial": "B",
                            "playerPositionAbbrev": "FE",
                            "onTheField": true,
                            "fantasyPrice": 433000,
                            "fantasySeasonPriceChange": -50000
                        },
                        {
                            "playerFirstName": "Nathan",
                            "playerId": 504120,
                            "playerLastName": "Cleary",
                            "playerName": "Nathan Cleary",
                            "playerPosition": "Halfback",
                            "playerPositionId": 500007,
                            "playerStats": {
                                "allRunMetres": 43,
                                "allRuns": 7,
                                "bombKicks": 5,
                                "bombKickMetres": 134,
                                "conversions": 2,
                                "conversionsAttempts": 2,
                                "errors": 1,
                                "fantasyPointsTotal": 39,
                                "goalConversionRate": 100,
                                "allGoals": 2,
                                "allGoalsAttempted": 2,
                                "kickMetres": 243,
                                "kicks": 9,
                                "kicksDefused": 2,
                                "lineDropouts": 1,
                                "mins": 80,
                                "missedTackles": 2,
                                "passes": 29,
                                "passesPerRun": 4.14,
                                "oneOnOneTackles": 2,
                                "penalties": 1,
                                "points": 4,
                                "supports": 21,
                                "tackleBreaks": 1,
                                "tackles": 22,
                                "evasionRuns": 7,
                                "evasionRunMetres": 43,
                                "ptbAll": 6,
                                "receipts": 45,
                                "grubberKick": 1,
                                "postContactMetres": 13,
                                "dummyPasses": 4,
                                "kickPressures": 1,
                                "lineEngagedRuns": 1,
                                "ptbAverage": 3.31,
                                "ptbTwoToThree": 3,
                                "ptbThreeToFour": 2,
                                "ptbFivePlus": 1,
                                "ptbOpp20m": 5,
                                "doubles": 5,
                                "longKicksSpace": 3,
                                "effectiveTacklePercentage": 91.7,
                                "generalPlayPenalties": 1,
                                "stint1": 4800
                            },
                            "playerTookTheField": true,
                            "shirtNum": 7,
                            "playerFirstInitial": "N",
                            "playerPositionAbbrev": "HB",
                            "onTheField": true,
                            "fantasyPrice": 486000,
                            "fantasySeasonPriceChange": -16000,
                            "fantasyRoundPriceChange": -2000
                        },
                        {
                            "playerFirstName": "James",
                            "playerId": 500299,
                            "playerLastName": "Tamou",
                            "playerName": "James Tamou",
                            "playerPosition": "Prop 1",
                            "playerPositionId": 500008,
                            "playerStats": {
                                "allRunMetres": 51,
                                "allRuns": 6,
                                "decoys": 1,
                                "fantasyPointsTotal": 33,
                                "hitUps": 6,
                                "mins": 33,
                                "offloads": 1,
                                "passes": 1,
                                "passesPerRun": 0.17,
                                "oneOnOneTackles": 2,
                                "penalties": 1,
                                "supports": 4,
                                "tackles": 28,
                                "hitupRunMeters": 51,
                                "ptbAll": 5,
                                "receipts": 7,
                                "postContactMetres": 18,
                                "kickPressures": 2,
                                "ptbAverage": 3.48,
                                "ptbOneToTwo": 1,
                                "ptbTwoToThree": 1,
                                "ptbFourToFive": 3,
                                "doubles": 3,
                                "effectiveTacklePercentage": 100,
                                "ptbPenalties": 1,
                                "stint1": 1252,
                                "stint2": 697
                            },
                            "playerTookTheField": true,
                            "shirtNum": 8,
                            "playerFirstInitial": "J",
                            "playerPositionAbbrev": "PR",
                            "fantasyPrice": 379000,
                            "fantasySeasonPriceChange": -20000
                        },
                        {
                            "playerFirstName": "Peter",
                            "playerId": 500956,
                            "playerLastName": "Wallace",
                            "playerName": "Peter Wallace",
                            "playerPosition": "Hooker",
                            "playerPositionId": 500009,
                            "playerStats": {
                                "allRunMetres": 43,
                                "allRuns": 7,
                                "decoys": 1,
                                "dummyHalfRuns": 7,
                                "fantasyPointsTotal": 42,
                                "kickMetres": 131,
                                "kicks": 4,
                                "mins": 80,
                                "missedTackles": 2,
                                "passes": 109,
                                "passesPerRun": 15.57,
                                "oneOnOneTackles": 3,
                                "supports": 2,
                                "tackleBreaks": 1,
                                "tackles": 33,
                                "dummyHalfRunMetres": 43,
                                "ptbAll": 4,
                                "receipts": 115,
                                "forcedDropOutKicker": 1,
                                "grubberKick": 1,
                                "postContactMetres": 2,
                                "kickPressures": 4,
                                "lineEngagedRuns": 2,
                                "ptbAverage": 4.07,
                                "ptbTwoToThree": 1,
                                "ptbThreeToFour": 1,
                                "ptbFourToFive": 1,
                                "ptbFivePlus": 1,
                                "doubles": 6,
                                "longKicksSpace": 2,
                                "effectiveTacklePercentage": 94.3,
                                "stint1": 4800
                            },
                            "playerTookTheField": true,
                            "shirtNum": 9,
                            "playerFirstInitial": "P",
                            "playerPositionAbbrev": "HK",
                            "onTheField": true,
                            "fantasyPrice": 382000,
                            "fantasySeasonPriceChange": 10000,
                            "fantasyRoundPriceChange": 2000
                        },
                        {
                            "playerFirstName": "Reagan",
                            "playerId": 500498,
                            "playerLastName": "Campbell-Gillard",
                            "playerName": "Reagan Campbell-Gillard",
                            "playerPosition": "Prop 2",
                            "playerPositionId": 500010,
                            "playerStats": {
                                "allRunMetres": 128,
                                "allRuns": 9,
                                "decoys": 9,
                                "errors": 1,
                                "fantasyPointsTotal": 39,
                                "hitUps": 6,
                                "ineffectiveTackles": 3,
                                "kickReturnMetres": 62,
                                "kickReturns": 3,
                                "linebreakAssists": 1,
                                "mins": 59,
                                "missedTackles": 4,
                                "passes": 1,
                                "passesPerRun": 0.11,
                                "oneOnOneTackles": 1,
                                "supports": 12,
                                "tackles": 30,
                                "tryAssists": 1,
                                "hitupRunMeters": 66,
                                "ptbAll": 7,
                                "receipts": 10,
                                "postContactMetres": 33,
                                "kickPressures": 3,
                                "ptbAverage": 3.94,
                                "ptbTwoToThree": 1,
                                "ptbThreeToFour": 2,
                                "ptbFourToFive": 4,
                                "ptbOpp20m": 1,
                                "doubles": 4,
                                "effectiveTacklePercentage": 81.1,
                                "stint1": 1492,
                                "stint2": 2029
                            },
                            "playerTookTheField": true,
                            "shirtNum": 10,
                            "playerFirstInitial": "R",
                            "playerPositionAbbrev": "PR",
                            "onTheField": true,
                            "fantasyPrice": 311000,
                            "fantasySeasonPriceChange": 25000,
                            "fantasyRoundPriceChange": 1000
                        },
                        {
                            "playerFirstName": "Corey",
                            "playerId": 501241,
                            "playerLastName": "Harawira-Naera",
                            "playerName": "Corey Harawira-Naera",
                            "playerPosition": "2nd Row 1",
                            "playerPositionId": 500011,
                            "playerStats": {
                                "allRunMetres": 173,
                                "allRuns": 16,
                                "decoys": 1,
                                "errors": 1,
                                "fantasyPointsTotal": 69,
                                "hitUps": 16,
                                "ineffectiveTackles": 2,
                                "linebreaks": 2,
                                "mins": 80,
                                "missedTackles": 3,
                                "offloads": 2,
                                "passes": 1,
                                "passesPerRun": 0.06,
                                "oneOnOneTackles": 2,
                                "penalties": 1,
                                "points": 4,
                                "supports": 5,
                                "tackleBreaks": 4,
                                "tackles": 30,
                                "tries": 1,
                                "hitupRunMeters": 173,
                                "ptbAll": 12,
                                "receipts": 17,
                                "postContactMetres": 45,
                                "ptbAverage": 3.32,
                                "ptbTwoToThree": 5,
                                "ptbThreeToFour": 5,
                                "ptbFourToFive": 2,
                                "ptbOpp20m": 5,
                                "doubles": 6,
                                "effectiveTacklePercentage": 85.7,
                                "ptbPenalties": 1,
                                "stint1": 4800
                            },
                            "playerTookTheField": true,
                            "shirtNum": 18,
                            "playerFirstInitial": "C",
                            "playerPositionAbbrev": "2R",
                            "onTheField": true,
                            "fantasyPrice": 246000
                        },
                        {
                            "playerFirstName": "Isaah",
                            "playerId": 500534,
                            "playerLastName": "Yeo",
                            "playerName": "Isaah Yeo",
                            "playerPosition": "2nd Row 2",
                            "playerPositionId": 500012,
                            "playerStats": {
                                "allRunMetres": 85,
                                "allRuns": 11,
                                "decoys": 12,
                                "errors": 2,
                                "fantasyPointsTotal": 41,
                                "hitUps": 10,
                                "ineffectiveTackles": 2,
                                "mins": 80,
                                "passes": 3,
                                "passesPerRun": 0.27,
                                "oneOnOneTackles": 1,
                                "supports": 11,
                                "tackleBreaks": 2,
                                "tackles": 31,
                                "hitupRunMeters": 77,
                                "evasionRuns": 1,
                                "evasionRunMetres": 8,
                                "ptbAll": 9,
                                "receipts": 14,
                                "postContactMetres": 36,
                                "dummyPasses": 2,
                                "kickPressures": 2,
                                "lineEngagedRuns": 1,
                                "ptbAverage": 3.56,
                                "ptbOneToTwo": 1,
                                "ptbTwoToThree": 1,
                                "ptbThreeToFour": 3,
                                "ptbFourToFive": 4,
                                "ptbOpp20m": 4,
                                "doubles": 4,
                                "effectiveTacklePercentage": 93.9,
                                "stint1": 4800
                            },
                            "playerTookTheField": true,
                            "shirtNum": 12,
                            "playerFirstInitial": "I",
                            "playerPositionAbbrev": "2R",
                            "onTheField": true,
                            "fantasyPrice": 402000,
                            "fantasySeasonPriceChange": 16000,
                            "fantasyRoundPriceChange": 17000
                        },
                        {
                            "playerFirstName": "Trent",
                            "playerId": 500632,
                            "playerLastName": "Merrin",
                            "playerName": "Trent Merrin",
                            "playerPosition": "Lock",
                            "playerPositionId": 500013,
                            "playerStats": {
                                "allRunMetres": 87,
                                "allRuns": 10,
                                "decoys": 5,
                                "errors": 1,
                                "fantasyPointsTotal": 21,
                                "hitUps": 10,
                                "ineffectiveTackles": 1,
                                "mins": 48,
                                "missedTackles": 5,
                                "oneOnOneTackles": 1,
                                "penalties": 1,
                                "supports": 2,
                                "tackles": 27,
                                "hitupRunMeters": 87,
                                "ptbAll": 10,
                                "receipts": 11,
                                "postContactMetres": 30,
                                "dummyPasses": 2,
                                "kickPressures": 1,
                                "ptbAverage": 3.94,
                                "ptbTwoToThree": 1,
                                "ptbThreeToFour": 4,
                                "ptbFourToFive": 5,
                                "ptbOpp20m": 4,
                                "doubles": 4,
                                "effectiveTacklePercentage": 81.8,
                                "ptbPenalties": 1,
                                "stint1": 1492,
                                "stint2": 1372
                            },
                            "playerTookTheField": true,
                            "shirtNum": 13,
                            "playerFirstInitial": "T",
                            "playerPositionAbbrev": "LK",
                            "fantasyPrice": 437000,
                            "fantasySeasonPriceChange": -93000,
                            "fantasyRoundPriceChange": -30000
                        },
                        {
                            "playerFirstName": "Tyrone",
                            "playerId": 501184,
                            "playerLastName": "Peachey",
                            "playerName": "Tyrone Peachey",
                            "playerPosition": "Interchange",
                            "playerPositionId": 500014,
                            "playerStats": {
                                "allRunMetres": 76,
                                "allRuns": 8,
                                "decoys": 1,
                                "dummyHalfRuns": 1,
                                "errors": 1,
                                "fantasyPointsTotal": 27,
                                "hitUps": 7,
                                "ineffectiveTackles": 2,
                                "mins": 30,
                                "missedTackles": 2,
                                "offloads": 2,
                                "passes": 3,
                                "passesPerRun": 0.38,
                                "oneOnOneTackles": 2,
                                "supports": 3,
                                "tackleBreaks": 1,
                                "tackles": 19,
                                "hitupRunMeters": 63,
                                "dummyHalfRunMetres": 13,
                                "ptbAll": 5,
                                "receipts": 11,
                                "postContactMetres": 14,
                                "dummyPasses": 1,
                                "kickPressures": 2,
                                "ptbAverage": 3.3,
                                "ptbTwoToThree": 2,
                                "ptbThreeToFour": 2,
                                "ptbFourToFive": 1,
                                "ptbOpp20m": 2,
                                "doubles": 2,
                                "effectiveTacklePercentage": 82.6,
                                "stint1": 1279,
                                "stint2": 535
                            },
                            "playerTookTheField": true,
                            "shirtNum": 4,
                            "playerFirstInitial": "T",
                            "playerPositionAbbrev": "INT",
                            "onTheField": true,
                            "fantasyPrice": 436000,
                            "fantasySeasonPriceChange": 18000
                        },
                        {
                            "playerFirstName": "Leilani",
                            "playerId": 501254,
                            "playerLastName": "Latu",
                            "playerName": "Leilani Latu",
                            "playerPosition": "Interchange",
                            "playerPositionId": 500014,
                            "playerStats": {
                                "allRunMetres": 37,
                                "allRuns": 5,
                                "decoys": 2,
                                "fantasyPointsTotal": 14,
                                "hitUps": 3,
                                "mins": 27,
                                "missedTackles": 1,
                                "offloads": 1,
                                "passes": 4,
                                "passesPerRun": 0.8,
                                "oneOnOneTackles": 1,
                                "supports": 5,
                                "tackles": 11,
                                "hitupRunMeters": 25,
                                "evasionRuns": 2,
                                "evasionRunMetres": 12,
                                "ptbAll": 2,
                                "receipts": 7,
                                "postContactMetres": 10,
                                "kickPressures": 1,
                                "lineEngagedRuns": 2,
                                "ptbAverage": 2.96,
                                "ptbTwoToThree": 1,
                                "ptbThreeToFour": 1,
                                "effectiveTacklePercentage": 91.7,
                                "stint1": 1641
                            },
                            "playerTookTheField": true,
                            "shirtNum": 15,
                            "playerFirstInitial": "L",
                            "playerPositionAbbrev": "INT",
                            "fantasyPrice": 242000,
                            "fantasySeasonPriceChange": -87000,
                            "fantasyRoundPriceChange": -5000
                        },
                        {
                            "playerFirstName": "Tim",
                            "playerId": 500218,
                            "playerLastName": "Browne",
                            "playerName": "Tim Browne",
                            "playerPosition": "Interchange",
                            "playerPositionId": 500014,
                            "playerStats": {
                                "allRunMetres": 90,
                                "allRuns": 12,
                                "decoys": 1,
                                "dummyHalfRuns": 1,
                                "fantasyPointsTotal": 29,
                                "hitUps": 11,
                                "ineffectiveTackles": 1,
                                "mins": 32,
                                "oneOnOneTackles": 1,
                                "supports": 3,
                                "tackleBreaks": 1,
                                "tackles": 17,
                                "hitupRunMeters": 83,
                                "dummyHalfRunMetres": 7,
                                "ptbAll": 11,
                                "receipts": 12,
                                "postContactMetres": 27,
                                "ptbAverage": 2.73,
                                "ptbZeroToOne": 1,
                                "ptbOneToTwo": 2,
                                "ptbTwoToThree": 4,
                                "ptbThreeToFour": 2,
                                "ptbFourToFive": 2,
                                "ptbOpp20m": 3,
                                "doubles": 5,
                                "effectiveTacklePercentage": 94.4,
                                "stint1": 1900
                            },
                            "playerTookTheField": true,
                            "shirtNum": 16,
                            "playerFirstInitial": "T",
                            "playerPositionAbbrev": "INT",
                            "fantasyPrice": 229000,
                            "fantasySeasonPriceChange": 1000
                        },
                        {
                            "playerFirstName": "Moses",
                            "playerId": 501461,
                            "playerLastName": "Leota",
                            "playerName": "Moses Leota",
                            "playerPosition": "Interchange",
                            "playerPositionId": 500014,
                            "playerStats": {
                                "allRunMetres": 73,
                                "allRuns": 6,
                                "decoys": 3,
                                "fantasyPointsTotal": 18,
                                "hitUps": 5,
                                "kickReturnMetres": 20,
                                "kickReturns": 1,
                                "mins": 12,
                                "oneOnOneTackles": 1,
                                "supports": 3,
                                "tackleBreaks": 1,
                                "tackles": 8,
                                "hitupRunMeters": 53,
                                "ptbAll": 6,
                                "receipts": 6,
                                "postContactMetres": 30,
                                "kickPressures": 1,
                                "ptbAverage": 3.1,
                                "ptbZeroToOne": 1,
                                "ptbTwoToThree": 1,
                                "ptbThreeToFour": 2,
                                "ptbFourToFive": 2,
                                "doubles": 4,
                                "effectiveTacklePercentage": 100,
                                "stint1": 711
                            },
                            "playerTookTheField": true,
                            "shirtNum": 17,
                            "playerFirstInitial": "M",
                            "playerPositionAbbrev": "INT",
                            "onTheField": true,
                            "fantasyPrice": 153000,
                            "fantasySeasonPriceChange": 10000,
                            "fantasyRoundPriceChange": -1000
                        }
                    ]
                },
                "teamName": "Penrith Panthers",
                "teamNickName": "Panthers",
                "teamStats": {
                    "allRunMetres": 1470,
                    "allRuns": 165,
                    "bombKicks": 5,
                    "bombKickMetres": 134,
                    "bombKicksDefused": 1,
                    "completeSets": 26,
                    "completionPercentage": 65,
                    "conversions": 2,
                    "conversionsAttempts": 2,
                    "decoys": 39,
                    "dummyHalfRuns": 15,
                    "errors": 15,
                    "goalConversionRate": 100,
                    "allGoals": 2,
                    "allGoalsAttempted": 2,
                    "hitUps": 74,
                    "incompleteSets": 14,
                    "ineffectiveTackles": 17,
                    "kickMetres": 409,
                    "kickReturnMetres": 174,
                    "kickReturns": 14,
                    "kicks": 16,
                    "kicksDefused": 4,
                    "kicksNotDefused": 6,
                    "lineDropouts": 3,
                    "linebreakAssists": 2,
                    "linebreaks": 3,
                    "missedTackles": 28,
                    "offloads": 9,
                    "oneOnOneTackles": 29,
                    "passes": 218,
                    "passesPerRun": 1.32,
                    "penalties": 5,
                    "points": 12,
                    "pointsConceded": 18,
                    "possession": 49,
                    "scrumWins": 8,
                    "supports": 124,
                    "tackleBreaks": 22,
                    "tackles": 315,
                    "sets": 40,
                    "tries": 2,
                    "triesConceded": 3,
                    "tryAssists": 2,
                    "tryCause": 3,
                    "hitupRunMeters": 678,
                    "evasionRuns": 62,
                    "evasionRunMetres": 484,
                    "dummyHalfRunMetres": 134,
                    "ptbTotal": 128,
                    "twoManTackles": 53,
                    "threeManTackles": 67,
                    "fourManPlusTackles": 2,
                    "tryScoringPercentage": 5,
                    "shiftsLeft": 15,
                    "shiftsRight": 9,
                    "receipts": 387,
                    "forcedDropOutKicker": 2,
                    "grubberKick": 5,
                    "postContactMetres": 398,
                    "dummyPasses": 21,
                    "kickPressures": 19,
                    "lineEngagedRuns": 11,
                    "ptbAverage": 3.49,
                    "ptbZeroToOne": 2,
                    "ptbOneToTwo": 5,
                    "ptbTwoToThree": 33,
                    "ptbThreeToFour": 47,
                    "ptbFourToFive": 37,
                    "ptbFivePlus": 4,
                    "ptbOpp20m": 30,
                    "interchangeUsed": 8,
                    "doubles": 49,
                    "longKicksSpace": 5,
                    "effectiveTacklePercentage": 87.5,
                    "ptbPenalties": 3,
                    "generalPlayPenalties": 1,
                    "offsidePenalties": 1,
                    "averageSetDistance": 36.8,
                    "completeSets1stHalf": 11,
                    "completeSets2ndHalf": 15,
                    "completionPercentage1stHalf": 65,
                    "completionPercentage2ndHalf": 65,
                    "incompleteSets1stHalf": 6,
                    "incompleteSets2ndHalf": 8,
                    "incompletionPercentage1stHalf": 35,
                    "incompletionPercentage2ndHalf": 35,
                    "kickReceiptRuns": 10,
                    "kickReceiptMetres": 93,
                    "averageOneManTackleTiming": 3.53,
                    "averageTwoManTackleTiming": 3.26,
                    "averageThreeManTackleTiming": 3.6,
                    "averageFourManTackleTiming": 4.72
                },
                "teamHexColour": "00687d",
                "teamHexColour2": "232020",
                "teamCoaches": {
                    "teamCoach": [
                        {
                            "coachId": 50009,
                            "coachName": "Anthony Griffin",
                            "coachRoleId": 12,
                            "coachRole": "Coach"
                        }
                    ]
                }
            }
        ]
    }
}