{
    "competitionId": 111,
    "competitionName": "NRL Telstra Premiership",
    "gameId": 20161112810,
    "gameInfo": {
        "assistantReferee1Id": 500038,
        "numberOfPeriods": 4,
        "assistantReferee1Name": "Michael Wise",
        "assistantReferee2Id": 500014,
        "assistantReferee2Name": "Jeff Younis",
        "crowd": 23804,
        "gameDate": "2016-09-16",
        "gameHashTag": "#NRLCowboysBroncos",
        "gameNumber": 1,
        "gameSeconds": 5400,
        "gameMinutes": "90:00",
        "gameTime": "1:30:00",
        "groundConditionId": 2,
        "groundConditionName": "Good",
        "referee1Id": 500002,
        "referee1Name": "Matt Cecchin",
        "referee2Id": 500009,
        "referee2Name": "Alan Shortall",
        "startTime": "2016-09-16T19:55:00",
        "startTimeUTC": "2016-09-16T09:55:00Z",
        "venueId": 500003,
        "venueName": "1300SMILES Stadium",
        "videoReferee1Id": 500232,
        "videoReferee1Name": "Luke Patten",
        "videoReferee2Id": 500039,
        "videoReferee2Name": "Ashley Klein",
        "weatherId": 2,
        "weatherName": "Fine",
        "finalSeriesBanner": "http://prozone.staff.s3.amazonaws.com/Team%20Graphic%20Logos/111/Final%20Series/Final%20Series%20Banner.png",
        "broadcastChannel": null,
        "venueLatitude": -19.3161,
        "venueLongitude": 146.7119,
        "broadcastInfo": {
            "radioNetwork": []
        }
    },
    "gameState": "Final",
    "gameStateId": 8,
    "roundId": 28,
    "roundName": "Finals Week 2",
    "seasonId": 2016,
    "teams": {
        "teamsMatch": [
            {
                "isHomeTeam": true,
                "score": {
                    "conversions": 3,
                    "points": 26,
                    "penaltyGoals": 2,
                    "tries": 4
                },
                "team1stHalfScore": 6,
                "team2ndHalfScore": 14,
                "teamAbbr": "NQL",
                "teamExtraTimeScore": 6,
                "teamFinalScore": 26,
                "teamFullTimeScore": 20,
                "teamHalfTimeScore": 6,
                "teamId": 500012,
                "teamLineup": {
                    "teamLineUpStatusID": 4,
                    "teamLineUpStatus": "Final",
                    "injuriesAndSuspensions": {
                        "injury": [],
                        "suspension": []
                    },
                    "insAndOuts": {
                        "inOut": [
                            {
                                "inOut": "Out",
                                "playerFirstName": "Antonio",
                                "playerId": "500305",
                                "playerLastName": "Winterstein",
                                "playerName": "Antonio Winterstein"
                            },
                            {
                                "inOut": "Out",
                                "playerFirstName": "Ethan",
                                "playerId": "500289",
                                "playerLastName": "Lowe",
                                "playerName": "Ethan Lowe"
                            },
                            {
                                "inOut": "In",
                                "playerFirstName": "Javid",
                                "playerId": "500279",
                                "playerLastName": "Bowen",
                                "playerName": "Javid Bowen"
                            },
                            {
                                "inOut": "In",
                                "playerFirstName": "John",
                                "playerId": "500277",
                                "playerLastName": "Asiata",
                                "playerName": "John Asiata"
                            },
                            {
                                "inOut": "In",
                                "playerFirstName": "Kalyn",
                                "playerId": "504870",
                                "playerLastName": "Ponga",
                                "playerName": "Kalyn Ponga"
                            },
                            {
                                "inOut": "Out",
                                "playerFirstName": "Kane",
                                "playerId": "500288",
                                "playerLastName": "Linnett",
                                "playerName": "Kane Linnett"
                            }
                        ]
                    },
                    "teamPlayer": [
                        {
                            "playerFirstName": "Lachlan",
                            "playerId": 500281,
                            "playerLastName": "Coote",
                            "playerName": "Lachlan Coote",
                            "playerPosition": "Fullback",
                            "playerPositionId": 500001,
                            "playerStats": {
                                "allRunMetres": 105,
                                "allRuns": 13,
                                "bombKicks": 1,
                                "bombKickMetres": 37,
                                "bombKicksDefused": 1,
                                "errors": 4,
                                "fantasyPointsTotal": 34,
                                "kickMetres": 134,
                                "kickReturnMetres": 56,
                                "kickReturns": 4,
                                "kicks": 6,
                                "kicksDefused": 4,
                                "kicksNotDefused": 2,
                                "linebreakAssists": 1,
                                "mins": 90,
                                "missedTackles": 3,
                                "offloads": 1,
                                "passes": 36,
                                "passesPerRun": 2.77,
                                "oneOnOneTackles": 3,
                                "supports": 13,
                                "tackleBreaks": 6,
                                "tackles": 6,
                                "tryCause": 2,
                                "evasionRuns": 9,
                                "evasionRunMetres": 49,
                                "ptbAll": 8,
                                "receipts": 56,
                                "forcedDropOutKicker": 1,
                                "grubberKick": 2,
                                "crossFieldKick": 1,
                                "postContactMetres": 29,
                                "dummyPasses": 3,
                                "lineEngagedRuns": 3,
                                "ptbOneToTwo": 1,
                                "ptbTwoToThree": 1,
                                "ptbThreeToFour": 3,
                                "ptbFourToFive": 2,
                                "ptbFivePlus": 1,
                                "longKicksSpace": 2,
                                "effectiveTacklePercentage": 66.7,
                                "stint1": 5400
                            },
                            "playerTookTheField": true,
                            "shirtNum": 1,
                            "playerFirstInitial": "L",
                            "playerPositionAbbrev": "FB",
                            "onTheField": true,
                            "fantasyPrice": 181000,
                            "fantasySeasonPriceChange": -194000,
                            "fantasyRoundPriceChange": 8000
                        },
                        {
                            "playerFirstName": "Kyle",
                            "playerId": 500282,
                            "playerLastName": "Feldt",
                            "playerName": "Kyle Feldt",
                            "playerPosition": "Winger 1",
                            "playerPositionId": 500002,
                            "playerStats": {
                                "allRunMetres": 153,
                                "allRuns": 12,
                                "dummyHalfRuns": 1,
                                "errors": 1,
                                "fantasyPointsTotal": 44,
                                "ineffectiveTackles": 1,
                                "interceptedPass": 1,
                                "kicksDefused": 1,
                                "linebreaks": 1,
                                "mins": 90,
                                "passes": 10,
                                "passesPerRun": 0.83,
                                "supports": 10,
                                "tackleBreaks": 8,
                                "tackles": 2,
                                "tryCause": 1,
                                "evasionRuns": 11,
                                "evasionRunMetres": 141,
                                "dummyHalfRunMetres": 12,
                                "ptbAll": 10,
                                "receipts": 22,
                                "postContactMetres": 40,
                                "dummyPasses": 1,
                                "kickPressures": 1,
                                "ptbOneToTwo": 2,
                                "ptbTwoToThree": 4,
                                "ptbThreeToFour": 4,
                                "effectiveTacklePercentage": 66.7,
                                "stint1": 5400
                            },
                            "playerTookTheField": true,
                            "shirtNum": 2,
                            "playerFirstInitial": "K",
                            "playerPositionAbbrev": "WG",
                            "onTheField": true,
                            "fantasyPrice": 218000,
                            "fantasySeasonPriceChange": -52000,
                            "fantasyRoundPriceChange": -12000
                        },
                        {
                            "playerFirstName": "Justin",
                            "playerId": 500605,
                            "playerLastName": "O'Neill",
                            "playerName": "Justin O'Neill",
                            "playerPosition": "Centre 1",
                            "playerPositionId": 500003,
                            "playerStats": {
                                "allRunMetres": 123,
                                "allRuns": 12,
                                "decoys": 1,
                                "dummyHalfRuns": 1,
                                "errors": 2,
                                "fantasyPointsTotal": 64,
                                "ineffectiveTackles": 2,
                                "linebreaks": 2,
                                "mins": 90,
                                "missedTackles": 2,
                                "offloads": 2,
                                "passes": 5,
                                "passesPerRun": 0.42,
                                "points": 8,
                                "supports": 8,
                                "tackleBreaks": 5,
                                "tackles": 7,
                                "tries": 2,
                                "tryAssists": 1,
                                "tryCause": 1,
                                "trySaves": 1,
                                "evasionRuns": 11,
                                "evasionRunMetres": 104,
                                "dummyHalfRunMetres": 19,
                                "ptbAll": 6,
                                "receipts": 19,
                                "postContactMetres": 35,
                                "dummyPasses": 1,
                                "kickPressures": 1,
                                "ptbTwoToThree": 2,
                                "ptbThreeToFour": 2,
                                "ptbFourToFive": 2,
                                "effectiveTacklePercentage": 63.6,
                                "stint1": 5400
                            },
                            "playerTookTheField": true,
                            "shirtNum": 3,
                            "playerFirstInitial": "J",
                            "playerPositionAbbrev": "CT",
                            "onTheField": true,
                            "fantasyPrice": 236000,
                            "fantasySeasonPriceChange": -46000
                        },
                        {
                            "playerFirstName": "Javid",
                            "playerId": 500279,
                            "playerLastName": "Bowen",
                            "playerName": "Javid Bowen",
                            "playerPosition": "Centre 2",
                            "playerPositionId": 500004,
                            "playerStats": {
                                "allRunMetres": 122,
                                "allRuns": 14,
                                "decoys": 3,
                                "fantasyPointsTotal": 36,
                                "mins": 90,
                                "offloads": 3,
                                "passes": 1,
                                "passesPerRun": 0.07,
                                "oneOnOneTackles": 1,
                                "penalties": 1,
                                "supports": 7,
                                "tackleBreaks": 3,
                                "tackles": 11,
                                "evasionRuns": 14,
                                "evasionRunMetres": 122,
                                "ptbAll": 10,
                                "receipts": 15,
                                "postContactMetres": 51,
                                "ptbOneToTwo": 2,
                                "ptbTwoToThree": 4,
                                "ptbThreeToFour": 4,
                                "doubles": 2,
                                "effectiveTacklePercentage": 100,
                                "foulPlayPenalties": 1,
                                "stint1": 5400
                            },
                            "playerTookTheField": true,
                            "shirtNum": 4,
                            "playerFirstInitial": "J",
                            "playerPositionAbbrev": "CT",
                            "onTheField": true,
                            "fantasyPrice": 287000,
                            "fantasySeasonPriceChange": 157000
                        },
                        {
                            "playerFirstName": "Kalyn",
                            "playerId": 504870,
                            "playerLastName": "Ponga",
                            "playerName": "Kalyn Ponga",
                            "playerPosition": "Winger 2",
                            "playerPositionId": 500005,
                            "playerStats": {
                                "allRunMetres": 177,
                                "allRuns": 16,
                                "bombKicksDefused": 3,
                                "bombKicksNotDefused": 1,
                                "dummyHalfRuns": 1,
                                "errors": 1,
                                "fantasyPointsTotal": 34,
                                "kickReturnMetres": 5,
                                "kickReturns": 1,
                                "kicksDefused": 4,
                                "kicksNotDefused": 1,
                                "linebreaks": 1,
                                "mins": 90,
                                "missedTackles": 1,
                                "offloads": 1,
                                "penalties": 1,
                                "supports": 8,
                                "tackleBreaks": 4,
                                "tackles": 1,
                                "evasionRuns": 14,
                                "evasionRunMetres": 158,
                                "dummyHalfRunMetres": 14,
                                "ptbAll": 13,
                                "receipts": 18,
                                "postContactMetres": 34,
                                "ptbZeroToOne": 1,
                                "ptbOneToTwo": 1,
                                "ptbThreeToFour": 7,
                                "ptbFourToFive": 3,
                                "ptbFivePlus": 1,
                                "effectiveTacklePercentage": 50,
                                "generalPlayPenalties": 1,
                                "foulPlayPenalties": 1,
                                "stint1": 5400
                            },
                            "playerTookTheField": true,
                            "shirtNum": 18,
                            "playerFirstInitial": "K",
                            "playerPositionAbbrev": "WG",
                            "onTheField": true
                        },
                        {
                            "playerFirstName": "Michael",
                            "playerId": 500292,
                            "playerLastName": "Morgan",
                            "playerName": "Michael Morgan",
                            "playerPosition": "Five-Eighth",
                            "playerPositionId": 500006,
                            "playerStats": {
                                "allRunMetres": 92,
                                "allRuns": 12,
                                "dummyHalfRuns": 1,
                                "fantasyPointsTotal": 60,
                                "kickMetres": 29,
                                "kicks": 2,
                                "linebreakAssists": 3,
                                "mins": 90,
                                "missedTackles": 2,
                                "offloads": 2,
                                "passes": 30,
                                "passesPerRun": 2.5,
                                "oneOnOneTackles": 5,
                                "points": 4,
                                "supports": 10,
                                "tackleBreaks": 3,
                                "tackles": 17,
                                "tries": 1,
                                "tryAssists": 2,
                                "evasionRuns": 11,
                                "evasionRunMetres": 86,
                                "dummyHalfRunMetres": 6,
                                "ptbAll": 6,
                                "receipts": 40,
                                "forcedDropOutKicker": 1,
                                "chipKick": 1,
                                "grubberKick": 1,
                                "postContactMetres": 32,
                                "dummyPasses": 6,
                                "kickPressures": 1,
                                "lineEngagedRuns": 3,
                                "ptbOneToTwo": 1,
                                "ptbTwoToThree": 1,
                                "ptbThreeToFour": 2,
                                "ptbFourToFive": 1,
                                "ptbFivePlus": 1,
                                "doubles": 3,
                                "effectiveTacklePercentage": 89.5,
                                "stint1": 5400
                            },
                            "playerTookTheField": true,
                            "shirtNum": 6,
                            "playerFirstInitial": "M",
                            "playerPositionAbbrev": "FE",
                            "onTheField": true,
                            "fantasyPrice": 350000,
                            "fantasySeasonPriceChange": -32000,
                            "fantasyRoundPriceChange": 11000
                        },
                        {
                            "playerFirstName": "Johnathan",
                            "playerId": 500304,
                            "playerLastName": "Thurston",
                            "playerName": "Johnathan Thurston",
                            "playerPosition": "Halfback",
                            "playerPositionId": 500007,
                            "playerStats": {
                                "allRunMetres": 106,
                                "allRuns": 13,
                                "bombKicks": 4,
                                "bombKickMetres": 90,
                                "conversions": 3,
                                "conversionsAttempts": 4,
                                "conversionsMissed": 1,
                                "errors": 2,
                                "fantasyPointsTotal": 44,
                                "goalConversionRate": 83.33,
                                "allGoals": 5,
                                "allGoalsMissed": 1,
                                "allGoalsAttempted": 6,
                                "ineffectiveTackles": 1,
                                "kickDead": 1,
                                "kickMetres": 122,
                                "kicks": 7,
                                "linebreaks": 1,
                                "mins": 90,
                                "missedTackles": 2,
                                "passes": 50,
                                "passesPerRun": 3.85,
                                "oneOnOneTackles": 2,
                                "penalties": 1,
                                "penaltyGoals": 2,
                                "penaltyGoalsAttempts": 2,
                                "points": 10,
                                "supports": 5,
                                "tackleBreaks": 1,
                                "tackles": 11,
                                "tryAssists": 1,
                                "trySaves": 1,
                                "evasionRuns": 13,
                                "evasionRunMetres": 106,
                                "ptbAll": 4,
                                "receipts": 64,
                                "grubberKick": 1,
                                "crossFieldKick": 1,
                                "postContactMetres": 15,
                                "dummyPasses": 6,
                                "kickPressures": 1,
                                "lineEngagedRuns": 7,
                                "ptbTwoToThree": 2,
                                "ptbThreeToFour": 1,
                                "ptbFivePlus": 1,
                                "doubles": 1,
                                "effectiveTacklePercentage": 78.6,
                                "ptbPenalties": 1,
                                "stint1": 5400
                            },
                            "playerTookTheField": true,
                            "shirtNum": 7,
                            "playerFirstInitial": "J",
                            "playerPositionAbbrev": "HB",
                            "onTheField": true,
                            "fantasyPrice": 407000,
                            "fantasySeasonPriceChange": -121000,
                            "fantasyRoundPriceChange": 7000
                        },
                        {
                            "playerFirstName": "Matthew",
                            "playerId": 500296,
                            "playerLastName": "Scott",
                            "playerName": "Matthew Scott",
                            "playerPosition": "Prop 1",
                            "playerPositionId": 500008,
                            "playerStats": {
                                "allRunMetres": 126,
                                "allRuns": 13,
                                "decoys": 7,
                                "fantasyPointsTotal": 30,
                                "hitUps": 9,
                                "ineffectiveTackles": 2,
                                "kickReturnMetres": 51,
                                "kickReturns": 3,
                                "mins": 55,
                                "missedTackles": 3,
                                "offloads": 1,
                                "passes": 7,
                                "passesPerRun": 0.54,
                                "supports": 1,
                                "tackles": 22,
                                "hitupRunMeters": 69,
                                "evasionRuns": 1,
                                "evasionRunMetres": 6,
                                "ptbAll": 9,
                                "receipts": 19,
                                "postContactMetres": 48,
                                "lineEngagedRuns": 1,
                                "ptbTwoToThree": 2,
                                "ptbThreeToFour": 4,
                                "ptbFourToFive": 1,
                                "ptbFivePlus": 2,
                                "doubles": 4,
                                "effectiveTacklePercentage": 81.5,
                                "stint1": 1603,
                                "stint2": 1332,
                                "stint3": 367
                            },
                            "playerTookTheField": true,
                            "shirtNum": 8,
                            "playerFirstInitial": "M",
                            "playerPositionAbbrev": "PR",
                            "onTheField": true,
                            "fantasyPrice": 309000,
                            "fantasySeasonPriceChange": -108000
                        },
                        {
                            "playerFirstName": "Jake",
                            "playerId": 500251,
                            "playerLastName": "Granville",
                            "playerName": "Jake Granville",
                            "playerPosition": "Hooker",
                            "playerPositionId": 500009,
                            "playerStats": {
                                "allRunMetres": 73,
                                "allRuns": 7,
                                "dummyHalfRuns": 7,
                                "fantasyPointsTotal": 31,
                                "mins": 58,
                                "missedTackles": 2,
                                "passes": 73,
                                "passesPerRun": 10.43,
                                "oneOnOneTackles": 2,
                                "tackles": 28,
                                "dummyHalfRunMetres": 73,
                                "ptbAll": 3,
                                "receipts": 75,
                                "postContactMetres": 14,
                                "dummyPasses": 3,
                                "kickPressures": 1,
                                "lineEngagedRuns": 4,
                                "ptbOneToTwo": 2,
                                "ptbThreeToFour": 1,
                                "doubles": 3,
                                "effectiveTacklePercentage": 93.3,
                                "stint1": 2151,
                                "stint2": 1290
                            },
                            "playerTookTheField": true,
                            "shirtNum": 9,
                            "playerFirstInitial": "J",
                            "playerPositionAbbrev": "HK",
                            "fantasyPrice": 253000,
                            "fantasySeasonPriceChange": -126000,
                            "fantasyRoundPriceChange": -6000
                        },
                        {
                            "playerFirstName": "James",
                            "playerId": 500299,
                            "playerLastName": "Tamou",
                            "playerName": "James Tamou",
                            "playerPosition": "Prop 2",
                            "playerPositionId": 500010,
                            "playerStats": {
                                "allRunMetres": 118,
                                "allRuns": 14,
                                "decoys": 5,
                                "dummyHalfRuns": 1,
                                "fantasyPointsTotal": 46,
                                "hitUps": 13,
                                "ineffectiveTackles": 2,
                                "mins": 55,
                                "missedTackles": 1,
                                "passes": 1,
                                "passesPerRun": 0.07,
                                "oneOnOneTackles": 1,
                                "penalties": 1,
                                "supports": 6,
                                "tackleBreaks": 2,
                                "tackles": 33,
                                "hitupRunMeters": 106,
                                "dummyHalfRunMetres": 12,
                                "ptbAll": 15,
                                "receipts": 16,
                                "postContactMetres": 36,
                                "ptbOneToTwo": 3,
                                "ptbTwoToThree": 3,
                                "ptbThreeToFour": 4,
                                "ptbFourToFive": 5,
                                "doubles": 14,
                                "effectiveTacklePercentage": 91.7,
                                "ptbPenalties": 1,
                                "stint1": 1379,
                                "stint2": 1893
                            },
                            "playerTookTheField": true,
                            "shirtNum": 10,
                            "playerFirstInitial": "J",
                            "playerPositionAbbrev": "PR",
                            "onTheField": true,
                            "fantasyPrice": 374000,
                            "fantasySeasonPriceChange": 25000,
                            "fantasyRoundPriceChange": 12000
                        },
                        {
                            "playerFirstName": "Gavin",
                            "playerId": 500280,
                            "playerLastName": "Cooper",
                            "playerName": "Gavin Cooper",
                            "playerPosition": "2nd Row 1",
                            "playerPositionId": 500011,
                            "playerStats": {
                                "allRunMetres": 124,
                                "allRuns": 12,
                                "decoys": 7,
                                "dummyHalfRuns": 1,
                                "fantasyPointsTotal": 59,
                                "hitUps": 11,
                                "kicksDefused": 1,
                                "mins": 90,
                                "passes": 10,
                                "passesPerRun": 0.83,
                                "oneOnOneTackles": 2,
                                "supports": 11,
                                "tackleBreaks": 4,
                                "tackles": 34,
                                "hitupRunMeters": 116,
                                "dummyHalfRunMetres": 8,
                                "ptbAll": 12,
                                "receipts": 25,
                                "postContactMetres": 60,
                                "dummyPasses": 1,
                                "ptbOneToTwo": 1,
                                "ptbTwoToThree": 4,
                                "ptbThreeToFour": 5,
                                "ptbFourToFive": 2,
                                "doubles": 6,
                                "effectiveTacklePercentage": 100,
                                "stint1": 5400
                            },
                            "playerTookTheField": true,
                            "shirtNum": 11,
                            "playerFirstInitial": "G",
                            "playerPositionAbbrev": "2R",
                            "onTheField": true,
                            "fantasyPrice": 326000,
                            "fantasySeasonPriceChange": -109000,
                            "fantasyRoundPriceChange": 37000
                        },
                        {
                            "playerFirstName": "Coen",
                            "playerId": 500405,
                            "playerLastName": "Hess",
                            "playerName": "Coen Hess",
                            "playerPosition": "2nd Row 2",
                            "playerPositionId": 500012,
                            "playerStats": {
                                "allRunMetres": 188,
                                "allRuns": 18,
                                "decoys": 8,
                                "fantasyPointsTotal": 68,
                                "hitUps": 18,
                                "ineffectiveTackles": 1,
                                "kickDead": 1,
                                "kickMetres": 54,
                                "kicks": 2,
                                "mins": 90,
                                "missedTackles": 1,
                                "passes": 1,
                                "passesPerRun": 0.06,
                                "oneOnOneTackles": 3,
                                "penalties": 1,
                                "points": 4,
                                "supports": 7,
                                "tackleBreaks": 5,
                                "tackles": 29,
                                "tries": 1,
                                "tryCause": 1,
                                "hitupRunMeters": 188,
                                "ptbAll": 18,
                                "receipts": 22,
                                "postContactMetres": 76,
                                "dummyPasses": 1,
                                "kickPressures": 3,
                                "ptbOneToTwo": 2,
                                "ptbTwoToThree": 8,
                                "ptbThreeToFour": 5,
                                "ptbFourToFive": 2,
                                "ptbFivePlus": 1,
                                "doubles": 3,
                                "effectiveTacklePercentage": 93.5,
                                "ptbPenalties": 1,
                                "stint1": 5400
                            },
                            "playerTookTheField": true,
                            "shirtNum": 15,
                            "playerFirstInitial": "C",
                            "playerPositionAbbrev": "2R",
                            "onTheField": true,
                            "fantasyPrice": 302000,
                            "fantasySeasonPriceChange": -24000,
                            "fantasyRoundPriceChange": 2000
                        },
                        {
                            "playerFirstName": "Jason",
                            "playerId": 500301,
                            "playerLastName": "Taumalolo",
                            "playerName": "Jason Taumalolo",
                            "playerPosition": "Lock",
                            "playerPositionId": 500013,
                            "playerStats": {
                                "allRunMetres": 265,
                                "allRuns": 23,
                                "decoys": 6,
                                "dummyHalfRuns": 1,
                                "errors": 1,
                                "fantasyPointsTotal": 79,
                                "hitUps": 21,
                                "ineffectiveTackles": 3,
                                "kickReturnMetres": 15,
                                "kickReturns": 1,
                                "mins": 76,
                                "missedTackles": 2,
                                "passes": 3,
                                "passesPerRun": 0.13,
                                "penalties": 1,
                                "supports": 3,
                                "tackleBreaks": 11,
                                "tackles": 28,
                                "tryCause": 1,
                                "hitupRunMeters": 238,
                                "dummyHalfRunMetres": 12,
                                "ptbAll": 21,
                                "receipts": 27,
                                "postContactMetres": 111,
                                "kickPressures": 1,
                                "ptbOneToTwo": 1,
                                "ptbTwoToThree": 8,
                                "ptbThreeToFour": 6,
                                "ptbFourToFive": 4,
                                "ptbFivePlus": 2,
                                "doubles": 4,
                                "effectiveTacklePercentage": 84.8,
                                "foulPlayPenalties": 1,
                                "stint1": 2846,
                                "stint2": 1692
                            },
                            "playerTookTheField": true,
                            "shirtNum": 13,
                            "playerFirstInitial": "J",
                            "playerPositionAbbrev": "LK",
                            "onTheField": true,
                            "fantasyPrice": 446000,
                            "fantasySeasonPriceChange": 55000,
                            "fantasyRoundPriceChange": 2000
                        },
                        {
                            "playerFirstName": "Rory",
                            "playerId": 500287,
                            "playerLastName": "Kostjasyn",
                            "playerName": "Rory Kostjasyn",
                            "playerPosition": "Interchange",
                            "playerPositionId": 500014,
                            "playerStats": {
                                "allRunMetres": 24,
                                "allRuns": 2,
                                "dummyHalfRuns": 2,
                                "errors": 1,
                                "fantasyPointsTotal": 17,
                                "ineffectiveTackles": 1,
                                "mins": 32,
                                "passes": 53,
                                "passesPerRun": 26.5,
                                "oneOnOneTackles": 2,
                                "tackles": 17,
                                "dummyHalfRunMetres": 24,
                                "ptbAll": 2,
                                "receipts": 51,
                                "postContactMetres": 7,
                                "dummyPasses": 1,
                                "kickPressures": 1,
                                "ptbTwoToThree": 2,
                                "doubles": 5,
                                "effectiveTacklePercentage": 94.4,
                                "stint1": 1894,
                                "stint2": 65
                            },
                            "playerTookTheField": true,
                            "shirtNum": 14,
                            "playerFirstInitial": "R",
                            "playerPositionAbbrev": "INT",
                            "onTheField": true,
                            "fantasyPrice": 185000,
                            "fantasySeasonPriceChange": -13000,
                            "fantasyRoundPriceChange": 3000
                        },
                        {
                            "playerFirstName": "Scott",
                            "playerId": 500278,
                            "playerLastName": "Bolton",
                            "playerName": "Scott Bolton",
                            "playerPosition": "Interchange",
                            "playerPositionId": 500014,
                            "playerStats": {
                                "allRunMetres": 131,
                                "allRuns": 14,
                                "decoys": 2,
                                "fantasyPointsTotal": 39,
                                "hitUps": 14,
                                "ineffectiveTackles": 2,
                                "mins": 35,
                                "missedTackles": 2,
                                "offloads": 1,
                                "passes": 1,
                                "passesPerRun": 0.07,
                                "oneOnOneTackles": 1,
                                "supports": 2,
                                "tackleBreaks": 2,
                                "tackles": 22,
                                "hitupRunMeters": 131,
                                "ptbAll": 14,
                                "receipts": 16,
                                "postContactMetres": 49,
                                "ptbOneToTwo": 3,
                                "ptbTwoToThree": 6,
                                "ptbThreeToFour": 3,
                                "ptbFourToFive": 1,
                                "ptbFivePlus": 1,
                                "doubles": 6,
                                "effectiveTacklePercentage": 84.6,
                                "stint1": 2128
                            },
                            "playerTookTheField": true,
                            "shirtNum": 16,
                            "playerFirstInitial": "S",
                            "playerPositionAbbrev": "INT",
                            "fantasyPrice": 302000,
                            "fantasySeasonPriceChange": -1000,
                            "fantasyRoundPriceChange": 9000
                        },
                        {
                            "playerFirstName": "Ben",
                            "playerId": 500254,
                            "playerLastName": "Hannant",
                            "playerName": "Ben Hannant",
                            "playerPosition": "Interchange",
                            "playerPositionId": 500014,
                            "playerStats": {
                                "allRunMetres": 88,
                                "allRuns": 10,
                                "decoys": 1,
                                "errors": 1,
                                "fantasyPointsTotal": 22,
                                "hitUps": 6,
                                "ineffectiveTackles": 1,
                                "kickReturnMetres": 42,
                                "kickReturns": 3,
                                "mins": 28,
                                "missedTackles": 2,
                                "passes": 1,
                                "passesPerRun": 0.1,
                                "oneOnOneTackles": 2,
                                "supports": 2,
                                "tackles": 20,
                                "hitupRunMeters": 40,
                                "evasionRuns": 1,
                                "evasionRunMetres": 6,
                                "ptbAll": 8,
                                "receipts": 10,
                                "postContactMetres": 26,
                                "lineEngagedRuns": 1,
                                "ptbOneToTwo": 1,
                                "ptbTwoToThree": 2,
                                "ptbThreeToFour": 4,
                                "ptbFourToFive": 1,
                                "doubles": 5,
                                "effectiveTacklePercentage": 87,
                                "stint1": 1689
                            },
                            "playerTookTheField": true,
                            "shirtNum": 17,
                            "playerFirstInitial": "B",
                            "playerPositionAbbrev": "INT",
                            "fantasyPrice": 279000,
                            "fantasySeasonPriceChange": -52000,
                            "fantasyRoundPriceChange": 3000
                        },
                        {
                            "playerFirstName": "John",
                            "playerId": 500277,
                            "playerLastName": "Asiata",
                            "playerName": "John Asiata",
                            "playerPosition": "Interchange",
                            "playerPositionId": 500014,
                            "playerStats": {
                                "allRunMetres": 71,
                                "allRuns": 8,
                                "decoys": 3,
                                "fantasyPointsTotal": 20,
                                "hitUps": 4,
                                "ineffectiveTackles": 1,
                                "kickReturnMetres": 21,
                                "kickReturns": 2,
                                "mins": 21,
                                "offloads": 1,
                                "passes": 5,
                                "passesPerRun": 0.62,
                                "oneOnOneTackles": 1,
                                "supports": 1,
                                "tackles": 11,
                                "hitupRunMeters": 39,
                                "evasionRuns": 2,
                                "evasionRunMetres": 11,
                                "ptbAll": 5,
                                "receipts": 11,
                                "postContactMetres": 21,
                                "dummyPasses": 1,
                                "lineEngagedRuns": 2,
                                "ptbOneToTwo": 1,
                                "ptbTwoToThree": 3,
                                "ptbThreeToFour": 1,
                                "doubles": 3,
                                "effectiveTacklePercentage": 91.7,
                                "stint1": 862,
                                "stint2": 408
                            },
                            "playerTookTheField": true,
                            "shirtNum": 20,
                            "playerFirstInitial": "J",
                            "playerPositionAbbrev": "INT",
                            "fantasyPrice": 205000,
                            "fantasySeasonPriceChange": -23000
                        }
                    ]
                },
                "teamName": "North Queensland Cowboys",
                "teamNickName": "Cowboys",
                "teamStats": {
                    "allRunMetres": 2085,
                    "allRuns": 213,
                    "bombKicks": 5,
                    "bombKickMetres": 127,
                    "bombKicksDefused": 4,
                    "bombKicksNotDefused": 1,
                    "completeSets": 35,
                    "completionPercentage": 73,
                    "conversions": 3,
                    "conversionsAttempts": 4,
                    "conversionsMissed": 1,
                    "decoys": 43,
                    "dummyHalfRuns": 16,
                    "errors": 16,
                    "goalConversionRate": 83.33,
                    "allGoals": 5,
                    "allGoalsAttempted": 6,
                    "allGoalsMissed": 1,
                    "hitUps": 96,
                    "incompleteSets": 13,
                    "ineffectiveTackles": 17,
                    "interceptedPass": 1,
                    "kickDead": 2,
                    "kickMetres": 340,
                    "kickReturnMetres": 189,
                    "kickReturns": 14,
                    "kicks": 17,
                    "kicksDefused": 10,
                    "kicksNotDefused": 3,
                    "linebreakAssists": 4,
                    "linebreaks": 5,
                    "missedTackles": 23,
                    "offloads": 12,
                    "oneOnOneTackles": 25,
                    "passes": 287,
                    "passesPerRun": 1.35,
                    "penalties": 6,
                    "penaltyGoals": 2,
                    "penaltyGoalsAttempts": 2,
                    "points": 26,
                    "pointsConceded": 20,
                    "possession": 56,
                    "scrumWins": 8,
                    "supports": 94,
                    "tackleBreaks": 54,
                    "tackles": 299,
                    "sets": 48,
                    "tries": 4,
                    "triesConceded": 3,
                    "tryAssists": 4,
                    "tryCause": 6,
                    "trySaves": 2,
                    "hitupRunMeters": 926,
                    "evasionRuns": 87,
                    "evasionRunMetres": 791,
                    "dummyHalfRunMetres": 179,
                    "ptbTotal": 164,
                    "twoManTackles": 91,
                    "threeManTackles": 45,
                    "fourManPlusTackles": 3,
                    "tryScoringPercentage": 11.43,
                    "shiftsLeft": 16,
                    "shiftsRight": 22,
                    "receipts": 506,
                    "forcedDropOutKicker": 2,
                    "chipKick": 1,
                    "grubberKick": 4,
                    "crossFieldKick": 2,
                    "postContactMetres": 685,
                    "dummyPasses": 24,
                    "kickPressures": 10,
                    "lineEngagedRuns": 21,
                    "ptbZeroToOne": 1,
                    "ptbOneToTwo": 21,
                    "ptbTwoToThree": 52,
                    "ptbThreeToFour": 56,
                    "ptbFourToFive": 24,
                    "ptbFivePlus": 10,
                    "interchangeUsed": 9,
                    "interchangeLeft": 1,
                    "doubles": 59,
                    "longKicksSpace": 2,
                    "effectiveTacklePercentage": 88.2,
                    "ptbPenalties": 3,
                    "generalPlayPenalties": 1,
                    "foulPlayPenalties": 3,
                    "averageSetDistance": 43.4,
                    "completeSets1stHalf": 13,
                    "completeSets2ndHalf": 17,
                    "completionPercentage1stHalf": 76.47,
                    "completionPercentage2ndHalf": 70.83,
                    "incompleteSets1stHalf": 4,
                    "incompleteSets2ndHalf": 7,
                    "incompletionPercentage1stHalf": 23.53,
                    "incompletionPercentage2ndHalf": 29.17
                },
                "teamHomeFinalsGraphicURL": "http://prozone.staff.s3.amazonaws.com/Team%20Graphic%20Logos/111/500012/Home%20Logo/Cowboys%20Home.jpg",
                "teamHexColour": "fcde05",
                "teamHexColour2": "102247"
            },
            {
                "score": {
                    "conversions": 3,
                    "points": 20,
                    "penaltyGoals": 1,
                    "tries": 3
                },
                "team1stHalfScore": 14,
                "team2ndHalfScore": 6,
                "teamAbbr": "BRI",
                "teamExtraTimeScore": 0,
                "teamFinalScore": 20,
                "teamFullTimeScore": 20,
                "teamHalfTimeScore": 14,
                "teamId": 500011,
                "teamLineup": {
                    "teamLineUpStatusID": 4,
                    "teamLineUpStatus": "Final",
                    "injuriesAndSuspensions": {
                        "injury": [],
                        "suspension": []
                    },
                    "insAndOuts": {
                        "inOut": [
                            {
                                "inOut": "Out",
                                "playerFirstName": "James",
                                "playerId": "500517",
                                "playerLastName": "Roberts",
                                "playerName": "James Roberts"
                            },
                            {
                                "inOut": "In",
                                "playerFirstName": "Tom",
                                "playerId": "500154",
                                "playerLastName": "Opacic",
                                "playerName": "Tom Opacic"
                            }
                        ]
                    },
                    "teamPlayer": [
                        {
                            "playerFirstName": "Darius",
                            "playerId": 500040,
                            "playerLastName": "Boyd",
                            "playerName": "Darius Boyd",
                            "playerPosition": "Fullback",
                            "playerPositionId": 500001,
                            "playerStats": {
                                "allRunMetres": 228,
                                "allRuns": 20,
                                "bombKicksDefused": 1,
                                "dummyHalfRuns": 13,
                                "errors": 1,
                                "fantasyPointsTotal": 49,
                                "hitUps": 1,
                                "ineffectiveTackles": 1,
                                "kickMetres": 35,
                                "kickReturnMetres": 4,
                                "kickReturns": 1,
                                "kicks": 2,
                                "kicksDefused": 2,
                                "linebreakAssists": 2,
                                "mins": 90,
                                "missedTackles": 1,
                                "passes": 26,
                                "passesPerRun": 1.3,
                                "supports": 1,
                                "tackleBreaks": 5,
                                "tackles": 4,
                                "tryAssists": 1,
                                "hitupRunMeters": 7,
                                "evasionRuns": 5,
                                "evasionRunMetres": 45,
                                "dummyHalfRunMetres": 172,
                                "ptbAll": 19,
                                "receipts": 48,
                                "grubberKick": 2,
                                "postContactMetres": 91,
                                "lineEngagedRuns": 2,
                                "ptbTwoToThree": 4,
                                "ptbThreeToFour": 7,
                                "ptbFourToFive": 7,
                                "ptbFivePlus": 1,
                                "effectiveTacklePercentage": 66.7,
                                "stint1": 5400
                            },
                            "playerTookTheField": true,
                            "shirtNum": 1,
                            "playerFirstInitial": "D",
                            "playerPositionAbbrev": "FB",
                            "onTheField": true,
                            "fantasyPrice": 260000,
                            "fantasySeasonPriceChange": -39000,
                            "fantasyRoundPriceChange": 3000
                        },
                        {
                            "playerFirstName": "Corey",
                            "playerId": 500266,
                            "playerLastName": "Oates",
                            "playerName": "Corey Oates",
                            "playerPosition": "Winger 1",
                            "playerPositionId": 500002,
                            "playerStats": {
                                "allRunMetres": 186,
                                "allRuns": 12,
                                "bombKicksNotDefused": 1,
                                "errors": 1,
                                "fantasyPointsTotal": 40,
                                "ineffectiveTackles": 2,
                                "kickReturnMetres": 2,
                                "kickReturns": 1,
                                "kicksDefused": 1,
                                "kicksNotDefused": 2,
                                "linebreaks": 1,
                                "mins": 90,
                                "missedTackles": 2,
                                "oneOnOneTackles": 1,
                                "points": 4,
                                "supports": 5,
                                "tackleBreaks": 4,
                                "tackles": 3,
                                "tries": 1,
                                "tryCause": 2,
                                "evasionRuns": 11,
                                "evasionRunMetres": 184,
                                "ptbAll": 10,
                                "receipts": 12,
                                "postContactMetres": 66,
                                "ptbOneToTwo": 1,
                                "ptbTwoToThree": 6,
                                "ptbThreeToFour": 2,
                                "ptbFourToFive": 1,
                                "effectiveTacklePercentage": 42.9,
                                "stint1": 5400
                            },
                            "playerTookTheField": true,
                            "shirtNum": 2,
                            "playerFirstInitial": "C",
                            "playerPositionAbbrev": "WG",
                            "onTheField": true,
                            "fantasyPrice": 273000,
                            "fantasySeasonPriceChange": 20000,
                            "fantasyRoundPriceChange": 20000
                        },
                        {
                            "playerFirstName": "Tom",
                            "playerId": 500154,
                            "playerLastName": "Opacic",
                            "playerName": "Tom Opacic",
                            "playerPosition": "Centre 1",
                            "playerPositionId": 500003,
                            "playerStats": {
                                "allRunMetres": 72,
                                "allRuns": 5,
                                "errors": 1,
                                "fantasyPointsTotal": 15,
                                "ineffectiveTackles": 1,
                                "linebreaks": 1,
                                "mins": 58,
                                "missedTackles": 3,
                                "passes": 4,
                                "passesPerRun": 0.8,
                                "oneOnOneTackles": 1,
                                "supports": 3,
                                "tackleBreaks": 1,
                                "tackles": 9,
                                "tryCause": 2,
                                "evasionRuns": 5,
                                "evasionRunMetres": 72,
                                "ptbAll": 3,
                                "receipts": 8,
                                "postContactMetres": 14,
                                "ptbTwoToThree": 1,
                                "ptbThreeToFour": 1,
                                "ptbFourToFive": 1,
                                "effectiveTacklePercentage": 69.2,
                                "stint1": 3504
                            },
                            "playerTookTheField": true,
                            "shirtNum": 3,
                            "playerFirstInitial": "T",
                            "playerPositionAbbrev": "CT",
                            "fantasyPrice": 228000,
                            "fantasySeasonPriceChange": 98000,
                            "fantasyRoundPriceChange": 11000
                        },
                        {
                            "playerFirstName": "Jordan",
                            "playerId": 500258,
                            "playerLastName": "Kahu",
                            "playerName": "Jordan Kahu",
                            "playerPosition": "Centre 2",
                            "playerPositionId": 500004,
                            "playerStats": {
                                "allRunMetres": 63,
                                "allRuns": 7,
                                "conversions": 3,
                                "conversionsAttempts": 3,
                                "dummyHalfRuns": 1,
                                "errors": 1,
                                "fantasyPointsTotal": 33,
                                "goalConversionRate": 100,
                                "allGoals": 4,
                                "allGoalsAttempted": 4,
                                "ineffectiveTackles": 3,
                                "kickMetres": 5,
                                "kicks": 1,
                                "kicksDefused": 1,
                                "kicksNotDefused": 1,
                                "mins": 90,
                                "missedTackles": 5,
                                "passes": 5,
                                "passesPerRun": 0.71,
                                "oneOnOneTackles": 2,
                                "penaltyGoals": 1,
                                "penaltyGoalsAttempts": 1,
                                "points": 12,
                                "tackleBreaks": 2,
                                "tackles": 16,
                                "tries": 1,
                                "evasionRuns": 6,
                                "evasionRunMetres": 57,
                                "dummyHalfRunMetres": 6,
                                "ptbAll": 7,
                                "receipts": 15,
                                "grubberKick": 1,
                                "postContactMetres": 21,
                                "ptbZeroToOne": 1,
                                "ptbTwoToThree": 1,
                                "ptbThreeToFour": 4,
                                "ptbFourToFive": 1,
                                "doubles": 1,
                                "effectiveTacklePercentage": 66.7,
                                "stint1": 5400
                            },
                            "playerTookTheField": true,
                            "shirtNum": 5,
                            "playerFirstInitial": "J",
                            "playerPositionAbbrev": "CT",
                            "onTheField": true,
                            "fantasyPrice": 224000,
                            "fantasySeasonPriceChange": -64000,
                            "fantasyRoundPriceChange": 24000
                        },
                        {
                            "playerFirstName": "Jonus",
                            "playerId": 503735,
                            "playerLastName": "Pearson",
                            "playerName": "Jonus Pearson",
                            "playerPosition": "Winger 2",
                            "playerPositionId": 500005,
                            "playerStats": {
                                "allRunMetres": 91,
                                "allRuns": 13,
                                "bombKicksDefused": 2,
                                "bombKicksNotDefused": 1,
                                "dummyHalfRuns": 1,
                                "errors": 1,
                                "fantasyPointsTotal": 15,
                                "kickReturnMetres": 7,
                                "kickReturns": 1,
                                "kicksDefused": 2,
                                "kicksNotDefused": 1,
                                "mins": 90,
                                "missedTackles": 1,
                                "oneOnOneTackles": 2,
                                "tackles": 8,
                                "evasionRuns": 11,
                                "evasionRunMetres": 80,
                                "dummyHalfRunMetres": 4,
                                "ptbAll": 13,
                                "receipts": 15,
                                "postContactMetres": 25,
                                "ptbOneToTwo": 3,
                                "ptbTwoToThree": 2,
                                "ptbThreeToFour": 3,
                                "ptbFourToFive": 3,
                                "ptbFivePlus": 2,
                                "effectiveTacklePercentage": 88.9,
                                "stint1": 5400
                            },
                            "playerTookTheField": true,
                            "shirtNum": 18,
                            "playerFirstInitial": "J",
                            "playerPositionAbbrev": "WG",
                            "onTheField": true,
                            "fantasyPrice": 148000
                        },
                        {
                            "playerFirstName": "Anthony",
                            "playerId": 500326,
                            "playerLastName": "Milford",
                            "playerName": "Anthony Milford",
                            "playerPosition": "Five-Eighth",
                            "playerPositionId": 500006,
                            "playerStats": {
                                "allRunMetres": 118,
                                "allRuns": 16,
                                "bombKicks": 1,
                                "bombKickMetres": 25,
                                "decoys": 1,
                                "errors": 3,
                                "fantasyPointsTotal": 27,
                                "kickMetres": 143,
                                "kickReturnMetres": 7,
                                "kickReturns": 1,
                                "kicks": 5,
                                "kicksDefused": 1,
                                "linebreakAssists": 1,
                                "mins": 90,
                                "missedTackles": 5,
                                "offloads": 2,
                                "passes": 13,
                                "passesPerRun": 0.81,
                                "oneOnOneTackles": 3,
                                "supports": 4,
                                "tackleBreaks": 2,
                                "tackles": 12,
                                "tryCause": 3,
                                "evasionRuns": 15,
                                "evasionRunMetres": 111,
                                "ptbAll": 7,
                                "receipts": 29,
                                "chipKick": 1,
                                "postContactMetres": 20,
                                "dummyPasses": 4,
                                "lineEngagedRuns": 4,
                                "ptbTwoToThree": 2,
                                "ptbThreeToFour": 1,
                                "ptbFourToFive": 4,
                                "longKicksSpace": 3,
                                "effectiveTacklePercentage": 70.6,
                                "stint1": 5400
                            },
                            "playerTookTheField": true,
                            "shirtNum": 6,
                            "playerFirstInitial": "A",
                            "playerPositionAbbrev": "FE",
                            "onTheField": true,
                            "fantasyPrice": 381000,
                            "fantasySeasonPriceChange": 18000,
                            "fantasyRoundPriceChange": 11000
                        },
                        {
                            "playerFirstName": "Ben",
                            "playerId": 500257,
                            "playerLastName": "Hunt",
                            "playerName": "Ben Hunt",
                            "playerPosition": "Halfback",
                            "playerPositionId": 500007,
                            "playerStats": {
                                "allRunMetres": 117,
                                "allRuns": 9,
                                "bombKicks": 4,
                                "bombKickMetres": 84,
                                "dummyHalfRuns": 1,
                                "errors": 1,
                                "fantasyPointsTotal": 49,
                                "ineffectiveTackles": 2,
                                "kickDead": 1,
                                "kickMetres": 211,
                                "kicks": 7,
                                "lineDropouts": 2,
                                "linebreakAssists": 1,
                                "linebreaks": 2,
                                "mins": 90,
                                "missedTackles": 5,
                                "passes": 26,
                                "passesPerRun": 2.89,
                                "oneOnOneTackles": 4,
                                "penalties": 2,
                                "supports": 1,
                                "tackleBreaks": 3,
                                "tackles": 25,
                                "evasionRuns": 8,
                                "evasionRunMetres": 110,
                                "dummyHalfRunMetres": 7,
                                "ptbAll": 5,
                                "receipts": 39,
                                "postContactMetres": 19,
                                "dummyPasses": 5,
                                "lineEngagedRuns": 2,
                                "ptbTwoToThree": 1,
                                "ptbThreeToFour": 2,
                                "ptbFourToFive": 1,
                                "ptbFivePlus": 1,
                                "doubles": 6,
                                "effectiveTacklePercentage": 78.1,
                                "ptbPenalties": 1,
                                "foulPlayPenalties": 1,
                                "stint1": 5400
                            },
                            "playerTookTheField": true,
                            "shirtNum": 7,
                            "playerFirstInitial": "B",
                            "playerPositionAbbrev": "HB",
                            "onTheField": true,
                            "fantasyPrice": 415000,
                            "fantasySeasonPriceChange": -100000,
                            "fantasyRoundPriceChange": -11000
                        },
                        {
                            "playerFirstName": "Josh",
                            "playerId": 500262,
                            "playerLastName": "McGuire",
                            "playerName": "Josh McGuire",
                            "playerPosition": "Prop 1",
                            "playerPositionId": 500008,
                            "playerStats": {
                                "allRunMetres": 163,
                                "allRuns": 19,
                                "decoys": 1,
                                "errors": 1,
                                "fantasyPointsTotal": 46,
                                "hitUps": 15,
                                "ineffectiveTackles": 1,
                                "intercepts": 1,
                                "kickReturnMetres": 44,
                                "kickReturns": 4,
                                "mins": 74,
                                "missedTackles": 4,
                                "passes": 4,
                                "passesPerRun": 0.21,
                                "oneOnOneTackles": 2,
                                "penalties": 1,
                                "tackleBreaks": 1,
                                "tackles": 39,
                                "hitupRunMeters": 119,
                                "ptbAll": 19,
                                "receipts": 24,
                                "postContactMetres": 59,
                                "ptbTwoToThree": 1,
                                "ptbThreeToFour": 13,
                                "ptbFourToFive": 3,
                                "ptbFivePlus": 2,
                                "doubles": 5,
                                "effectiveTacklePercentage": 88.6,
                                "foulPlayPenalties": 1,
                                "stint1": 1838,
                                "stint2": 2554
                            },
                            "playerTookTheField": true,
                            "shirtNum": 8,
                            "playerFirstInitial": "J",
                            "playerPositionAbbrev": "PR",
                            "onTheField": true,
                            "fantasyPrice": 416000,
                            "fantasySeasonPriceChange": -14000,
                            "fantasyRoundPriceChange": -8000
                        },
                        {
                            "playerFirstName": "Andrew",
                            "playerId": 500261,
                            "playerLastName": "McCullough",
                            "playerName": "Andrew McCullough",
                            "playerPosition": "Hooker",
                            "playerPositionId": 500009,
                            "playerStats": {
                                "allRunMetres": 18,
                                "allRuns": 3,
                                "dummyHalfRuns": 2,
                                "errors": 1,
                                "fantasyPointsTotal": 61,
                                "hitUps": 1,
                                "kickMetres": 82,
                                "kicks": 2,
                                "linebreaks": 1,
                                "mins": 86,
                                "missedTackles": 2,
                                "passes": 83,
                                "passesPerRun": 27.67,
                                "oneOnOneTackles": 1,
                                "penalties": 1,
                                "points": 4,
                                "tackleBreaks": 2,
                                "tackles": 46,
                                "tries": 1,
                                "hitupRunMeters": 2,
                                "dummyHalfRunMetres": 16,
                                "ptbAll": 2,
                                "receipts": 85,
                                "postContactMetres": 7,
                                "dummyPasses": 2,
                                "kickPressures": 2,
                                "ptbThreeToFour": 1,
                                "ptbFivePlus": 1,
                                "doubles": 7,
                                "longKicksSpace": 1,
                                "effectiveTacklePercentage": 95.8,
                                "ptbPenalties": 1,
                                "stint1": 4697,
                                "stint2": 464
                            },
                            "playerTookTheField": true,
                            "shirtNum": 9,
                            "playerFirstInitial": "A",
                            "playerPositionAbbrev": "HK",
                            "onTheField": true,
                            "fantasyPrice": 428000,
                            "fantasySeasonPriceChange": -71000,
                            "fantasyRoundPriceChange": 2000
                        },
                        {
                            "playerFirstName": "Adam",
                            "playerId": 500645,
                            "playerLastName": "Blair",
                            "playerName": "Adam Blair",
                            "playerPosition": "Prop 2",
                            "playerPositionId": 500010,
                            "playerStats": {
                                "allRunMetres": 112,
                                "allRuns": 12,
                                "decoys": 1,
                                "errors": 1,
                                "fantasyPointsTotal": 46,
                                "hitUps": 11,
                                "mins": 56,
                                "offloads": 2,
                                "passes": 2,
                                "passesPerRun": 0.17,
                                "oneOnOneTackles": 1,
                                "penalties": 1,
                                "supports": 1,
                                "tackleBreaks": 1,
                                "tackles": 32,
                                "hitupRunMeters": 106,
                                "evasionRuns": 1,
                                "evasionRunMetres": 6,
                                "ptbAll": 6,
                                "receipts": 13,
                                "postContactMetres": 41,
                                "lineEngagedRuns": 1,
                                "ptbOneToTwo": 1,
                                "ptbTwoToThree": 4,
                                "ptbThreeToFour": 1,
                                "doubles": 6,
                                "effectiveTacklePercentage": 100,
                                "ptbPenalties": 1,
                                "stint1": 1292,
                                "stint2": 2057
                            },
                            "playerTookTheField": true,
                            "shirtNum": 10,
                            "playerFirstInitial": "A",
                            "playerPositionAbbrev": "PR",
                            "onTheField": true,
                            "fantasyPrice": 254000,
                            "fantasySeasonPriceChange": -87000,
                            "fantasyRoundPriceChange": -14000
                        },
                        {
                            "playerFirstName": "Sam",
                            "playerId": 500273,
                            "playerLastName": "Thaiday",
                            "playerName": "Sam Thaiday",
                            "playerPosition": "2nd Row 1",
                            "playerPositionId": 500011,
                            "playerStats": {
                                "allRunMetres": 92,
                                "allRuns": 10,
                                "decoys": 4,
                                "fantasyPointsTotal": 41,
                                "hitUps": 10,
                                "kickMetres": 9,
                                "kicks": 1,
                                "mins": 87,
                                "missedTackles": 4,
                                "passes": 1,
                                "passesPerRun": 0.1,
                                "oneOnOneTackles": 3,
                                "supports": 8,
                                "tackleBreaks": 1,
                                "tackles": 37,
                                "tryCause": 1,
                                "hitupRunMeters": 92,
                                "ptbAll": 11,
                                "receipts": 13,
                                "chipKick": 1,
                                "postContactMetres": 41,
                                "ptbOneToTwo": 2,
                                "ptbTwoToThree": 4,
                                "ptbThreeToFour": 4,
                                "ptbFourToFive": 1,
                                "doubles": 4,
                                "effectiveTacklePercentage": 90.2,
                                "stint1": 3343,
                                "stint2": 1895
                            },
                            "playerTookTheField": true,
                            "shirtNum": 11,
                            "playerFirstInitial": "S",
                            "playerPositionAbbrev": "2R",
                            "onTheField": true,
                            "fantasyPrice": 349000,
                            "fantasySeasonPriceChange": -20000,
                            "fantasyRoundPriceChange": -9000
                        },
                        {
                            "playerFirstName": "Matt",
                            "playerId": 500249,
                            "playerLastName": "Gillett",
                            "playerName": "Matt Gillett",
                            "playerPosition": "2nd Row 2",
                            "playerPositionId": 500012,
                            "playerStats": {
                                "allRunMetres": 67,
                                "allRuns": 9,
                                "dummyHalfRuns": 2,
                                "fantasyPointsTotal": 30,
                                "hitUps": 6,
                                "kickMetres": 5,
                                "kickReturns": 1,
                                "kicks": 1,
                                "kicksDefused": 1,
                                "mins": 90,
                                "missedTackles": 6,
                                "onReport": 1,
                                "passes": 2,
                                "passesPerRun": 0.22,
                                "oneOnOneTackles": 4,
                                "penalties": 1,
                                "supports": 2,
                                "tackles": 37,
                                "hitupRunMeters": 47,
                                "dummyHalfRunMetres": 20,
                                "ptbAll": 8,
                                "receipts": 12,
                                "chipKick": 1,
                                "postContactMetres": 24,
                                "kickPressures": 1,
                                "ptbZeroToOne": 1,
                                "ptbOneToTwo": 1,
                                "ptbTwoToThree": 1,
                                "ptbThreeToFour": 4,
                                "ptbFourToFive": 1,
                                "doubles": 4,
                                "effectiveTacklePercentage": 86,
                                "foulPlayPenalties": 1,
                                "stint1": 5400
                            },
                            "playerTookTheField": true,
                            "shirtNum": 12,
                            "playerFirstInitial": "M",
                            "playerPositionAbbrev": "2R",
                            "onTheField": true,
                            "fantasyPrice": 373000,
                            "fantasySeasonPriceChange": -72000,
                            "fantasyRoundPriceChange": -17000
                        },
                        {
                            "playerFirstName": "Corey",
                            "playerId": 500268,
                            "playerLastName": "Parker",
                            "playerName": "Corey Parker",
                            "playerPosition": "Lock",
                            "playerPositionId": 500013,
                            "playerStats": {
                                "allRunMetres": 85,
                                "allRuns": 9,
                                "decoys": 2,
                                "errors": 1,
                                "fantasyPointsTotal": 28,
                                "hitUps": 8,
                                "ineffectiveTackles": 3,
                                "mins": 64,
                                "missedTackles": 5,
                                "passes": 6,
                                "passesPerRun": 0.67,
                                "supports": 3,
                                "tackles": 32,
                                "hitupRunMeters": 78,
                                "evasionRuns": 1,
                                "evasionRunMetres": 7,
                                "ptbAll": 6,
                                "receipts": 14,
                                "postContactMetres": 27,
                                "lineEngagedRuns": 1,
                                "ptbTwoToThree": 2,
                                "ptbThreeToFour": 4,
                                "doubles": 2,
                                "effectiveTacklePercentage": 80,
                                "stint1": 1568,
                                "stint2": 2255
                            },
                            "playerTookTheField": true,
                            "shirtNum": 13,
                            "playerFirstInitial": "C",
                            "playerPositionAbbrev": "LK",
                            "fantasyPrice": 401000,
                            "fantasySeasonPriceChange": -158000,
                            "fantasyRoundPriceChange": -7000
                        },
                        {
                            "playerFirstName": "Jarrod",
                            "playerId": 500275,
                            "playerLastName": "Wallace",
                            "playerName": "Jarrod Wallace",
                            "playerPosition": "Interchange",
                            "playerPositionId": 500014,
                            "playerStats": {
                                "allRunMetres": 57,
                                "allRuns": 6,
                                "decoys": 2,
                                "fantasyPointsTotal": 22,
                                "hitUps": 6,
                                "ineffectiveTackles": 1,
                                "mins": 25,
                                "missedTackles": 1,
                                "offloads": 1,
                                "passes": 1,
                                "passesPerRun": 0.17,
                                "penalties": 1,
                                "supports": 1,
                                "tackles": 19,
                                "hitupRunMeters": 57,
                                "ptbAll": 5,
                                "receipts": 7,
                                "postContactMetres": 16,
                                "ptbThreeToFour": 3,
                                "ptbFourToFive": 2,
                                "doubles": 3,
                                "effectiveTacklePercentage": 90.5,
                                "foulPlayPenalties": 1,
                                "stint1": 1554
                            },
                            "playerTookTheField": true,
                            "shirtNum": 14,
                            "playerFirstInitial": "J",
                            "playerPositionAbbrev": "INT",
                            "fantasyPrice": 258000,
                            "fantasySeasonPriceChange": -50000,
                            "fantasyRoundPriceChange": -12000
                        },
                        {
                            "playerFirstName": "Tevita",
                            "playerId": 500438,
                            "playerLastName": "Pangai Junior",
                            "playerName": "Tevita Pangai Junior",
                            "playerPosition": "Interchange",
                            "playerPositionId": 500014,
                            "playerStats": {
                                "allRunMetres": 19,
                                "allRuns": 2,
                                "decoys": 1,
                                "errors": 1,
                                "fantasyPointsTotal": 2,
                                "hitUps": 2,
                                "mins": 5,
                                "missedTackles": 1,
                                "oneOnOneTackles": 1,
                                "tackles": 5,
                                "hitupRunMeters": 19,
                                "ptbAll": 2,
                                "receipts": 2,
                                "postContactMetres": 8,
                                "ptbFourToFive": 2,
                                "doubles": 1,
                                "effectiveTacklePercentage": 83.3,
                                "stint1": 299
                            },
                            "playerTookTheField": true,
                            "shirtNum": 15,
                            "playerFirstInitial": "T",
                            "playerPositionAbbrev": "INT",
                            "onTheField": true,
                            "fantasyPrice": 174000,
                            "fantasySeasonPriceChange": 44000,
                            "fantasyRoundPriceChange": -12000
                        },
                        {
                            "playerFirstName": "Jai",
                            "playerId": 500149,
                            "playerLastName": "Arrow",
                            "playerName": "Jai Arrow",
                            "playerPosition": "Interchange",
                            "playerPositionId": 500014,
                            "playerStats": {
                                "allRunMetres": 28,
                                "allRuns": 4,
                                "fantasyPointsTotal": 18,
                                "hitUps": 4,
                                "mins": 20,
                                "missedTackles": 2,
                                "offloads": 1,
                                "supports": 1,
                                "tackles": 18,
                                "hitupRunMeters": 28,
                                "ptbAll": 3,
                                "receipts": 4,
                                "postContactMetres": 10,
                                "ptbZeroToOne": 1,
                                "ptbTwoToThree": 1,
                                "ptbThreeToFour": 1,
                                "doubles": 2,
                                "effectiveTacklePercentage": 90,
                                "stint1": 1008,
                                "stint2": 238
                            },
                            "playerTookTheField": true,
                            "shirtNum": 16,
                            "playerFirstInitial": "J",
                            "playerPositionAbbrev": "INT",
                            "fantasyPrice": 174000
                        },
                        {
                            "playerFirstName": "Alex",
                            "playerId": 500250,
                            "playerLastName": "Glenn",
                            "playerName": "Alex Glenn",
                            "playerPosition": "Interchange",
                            "playerPositionId": 500014,
                            "playerStats": {
                                "allRunMetres": 120,
                                "allRuns": 13,
                                "decoys": 1,
                                "errors": 1,
                                "fantasyPointsTotal": 31,
                                "hitUps": 10,
                                "ineffectiveTackles": 2,
                                "kickMetres": 14,
                                "kicks": 1,
                                "linebreaks": 1,
                                "mins": 64,
                                "missedTackles": 7,
                                "offloads": 2,
                                "passes": 2,
                                "passesPerRun": 0.15,
                                "oneOnOneTackles": 4,
                                "penalties": 1,
                                "supports": 3,
                                "tackleBreaks": 1,
                                "tackles": 26,
                                "tryCause": 1,
                                "hitupRunMeters": 82,
                                "evasionRuns": 3,
                                "evasionRunMetres": 38,
                                "ptbAll": 9,
                                "receipts": 17,
                                "grubberKick": 1,
                                "postContactMetres": 42,
                                "ptbOneToTwo": 2,
                                "ptbTwoToThree": 5,
                                "ptbThreeToFour": 2,
                                "doubles": 2,
                                "effectiveTacklePercentage": 74.3,
                                "ptbPenalties": 1,
                                "stint1": 3832
                            },
                            "playerTookTheField": true,
                            "shirtNum": 17,
                            "playerFirstInitial": "A",
                            "playerPositionAbbrev": "INT",
                            "onTheField": true,
                            "fantasyPrice": 248000,
                            "fantasySeasonPriceChange": -136000,
                            "fantasyRoundPriceChange": -13000
                        }
                    ]
                },
                "teamName": "Brisbane Broncos",
                "teamNickName": "Broncos",
                "teamStats": {
                    "allRunMetres": 1639,
                    "allRuns": 169,
                    "bombKicks": 5,
                    "bombKickMetres": 109,
                    "bombKicksDefused": 3,
                    "bombKicksNotDefused": 2,
                    "completeSets": 27,
                    "completionPercentage": 68,
                    "conversions": 3,
                    "conversionsAttempts": 3,
                    "decoys": 13,
                    "dummyHalfRuns": 20,
                    "errors": 16,
                    "goalConversionRate": 100,
                    "allGoals": 4,
                    "allGoalsAttempted": 4,
                    "hitUps": 74,
                    "incompleteSets": 13,
                    "ineffectiveTackles": 16,
                    "intercepts": 1,
                    "kickDead": 1,
                    "kickMetres": 505,
                    "kickReturnMetres": 64,
                    "kickReturns": 9,
                    "kicks": 20,
                    "kicksDefused": 8,
                    "kicksNotDefused": 4,
                    "lineDropouts": 2,
                    "linebreakAssists": 4,
                    "linebreaks": 6,
                    "missedTackles": 54,
                    "offloads": 8,
                    "onReports": 1,
                    "oneOnOneTackles": 29,
                    "passes": 175,
                    "passesPerRun": 1.04,
                    "penalties": 8,
                    "penaltyGoals": 1,
                    "penaltyGoalsAttempts": 1,
                    "points": 20,
                    "pointsConceded": 26,
                    "possession": 44,
                    "scrumWins": 6,
                    "supports": 33,
                    "tackleBreaks": 23,
                    "tackles": 368,
                    "sets": 40,
                    "tries": 3,
                    "triesConceded": 4,
                    "tryAssists": 1,
                    "tryCause": 9,
                    "hitupRunMeters": 639,
                    "evasionRuns": 66,
                    "evasionRunMetres": 710,
                    "dummyHalfRunMetres": 226,
                    "ptbTotal": 135,
                    "twoManTackles": 82,
                    "threeManTackles": 35,
                    "tryScoringPercentage": 11.11,
                    "shiftsLeft": 10,
                    "shiftsRight": 4,
                    "receipts": 357,
                    "chipKick": 3,
                    "grubberKick": 4,
                    "postContactMetres": 528,
                    "dummyPasses": 11,
                    "kickPressures": 3,
                    "lineEngagedRuns": 10,
                    "ptbZeroToOne": 3,
                    "ptbOneToTwo": 10,
                    "ptbTwoToThree": 35,
                    "ptbThreeToFour": 53,
                    "ptbFourToFive": 27,
                    "ptbFivePlus": 7,
                    "interchangeUsed": 10,
                    "doubles": 43,
                    "longKicksSpace": 4,
                    "effectiveTacklePercentage": 84,
                    "ptbPenalties": 4,
                    "foulPlayPenalties": 4,
                    "averageSetDistance": 41,
                    "completeSets1stHalf": 13,
                    "completeSets2ndHalf": 12,
                    "completionPercentage1stHalf": 72.22,
                    "completionPercentage2ndHalf": 75,
                    "incompleteSets1stHalf": 5,
                    "incompleteSets2ndHalf": 4,
                    "incompletionPercentage1stHalf": 27.78,
                    "incompletionPercentage2ndHalf": 25
                },
                "teamAwayFinalsGraphicURL": "http://prozone.staff.s3.amazonaws.com/Team%20Graphic%20Logos/111/500011/Away%20Logo/Broncos%20Away.jpg",
                "teamHexColour": "650038",
                "teamHexColour2": "ffce35"
            }
        ]
    }
}