{
    "vod": [
        {
            "id": "o5Y2djYzE6uGOZCxDeoW5jmXLrmPnCC-",
            "contentId": 932649,
            "title": "Rd 24: Roosters v Wests Tigers (Hls)",
            "description": "Highlights of the Round 24 clash between the Roosters & Wests Tigers",
            "publishDate": "2017-08-19T19:23:30+10:00",
            "publisher": "NRL Chief",
            "thumbnailUrl": "http://bpvideos.telstra.insnw.net/web/images/20170819192147a_89x50.jpg",
            "largeThumbnailUrl": "http://bpvideos.telstra.insnw.net/web/images/20170819192147a_326x184.jpg",
            "programType": "Highlights",
            "programCategory": "Match",
            "priority": null,
            "lastUpdateDate": "2017-08-19T19:28:44+10:00",
            "isPremium": false,
            "club": [
                500001,
                500023
            ]
        },
        {
            "id": "5idWdjYzE6axxNqw4_loV2JUb4dy_R28",
            "contentId": 932673,
            "title": "Rd 24 Press Conference: Wests Tigers",
            "description": "Wests Tigers coach Ivan Cleary speaks with the media following his side's Round 24 clash",
            "publishDate": "2017-08-19T20:29:50+10:00",
            "publisher": "NRL Chief",
            "thumbnailUrl": "http://bpvideos.telstra.insnw.net/web/images/20170819203601a_89x50.jpg",
            "largeThumbnailUrl": "http://bpvideos.telstra.insnw.net/web/images/20170819203601a_326x184.jpg",
            "programType": "Press Conference",
            "programCategory": null,
            "priority": null,
            "lastUpdateDate": "2017-08-19T20:41:02+10:00",
            "isPremium": false,
            "club": [
                500001,
                500023
            ]
        },
        {
            "id": "kxbWdjYzE6MiALnecwL2iBfD9LToP2UN",
            "contentId": 932671,
            "title": "Rd 24 Press Conference: Roosters",
            "description": "Roosters coach Trent Robinson speaks with the media following his side's Round 24 clash",
            "publishDate": "2017-08-19T20:02:00+10:00",
            "publisher": "NRL Chief",
            "thumbnailUrl": "http://bpvideos.telstra.insnw.net/web/images/20170819200201a_89x50.jpg",
            "largeThumbnailUrl": "http://bpvideos.telstra.insnw.net/web/images/20170819200201a_326x184.jpg",
            "programType": "Press Conference",
            "programCategory": null,
            "priority": null,
            "lastUpdateDate": "2017-08-19T20:08:54+10:00",
            "isPremium": false,
            "club": [
                500001,
                500023
            ]
        },
        {
            "id": "ozYWdjYzE6RCeM6L5wX5XqjxCLnrDak-",
            "contentId": 933159,
            "title": "Rd 24: GOAL Michael Gordon (73rd min)",
            "description": "Michael Gordon converts from the touch line",
            "publishDate": "2017-08-19T19:12:55+10:00",
            "publisher": "NRL Chief",
            "thumbnailUrl": "http://bpvideos.telstra.insnw.net/web/images/20170819190951a_89x50.jpg",
            "largeThumbnailUrl": "http://bpvideos.telstra.insnw.net/web/images/20170819190951a_326x184.jpg",
            "programType": "Instant Replay",
            "programCategory": "Score",
            "priority": null,
            "lastUpdateDate": "2017-08-19T19:18:41+10:00",
            "isPremium": true,
            "club": [
                500001,
                500023
            ]
        },
        {
            "id": "94aWdjYzE6yxcTf6qBtMIKWFoWw6sSlG",
            "contentId": 933157,
            "title": "Rd 24: TRY Latrell Mitchell (72nd min)",
            "description": "The Roosters winger goes over to snatch back the lead",
            "publishDate": "2017-08-19T19:08:35+10:00",
            "publisher": "NRL Chief",
            "thumbnailUrl": "http://bpvideos.telstra.insnw.net/web/images/20170819190734a_89x50.jpg",
            "largeThumbnailUrl": "http://bpvideos.telstra.insnw.net/web/images/20170819190734a_326x184.jpg",
            "programType": "Instant Replay",
            "programCategory": "Score",
            "priority": null,
            "lastUpdateDate": "2017-08-19T19:53:50+10:00",
            "isPremium": true,
            "club": [
                500001,
                500023
            ]
        },
        {
            "id": "NqZWdjYzE6h84QgsK2WqDScTxYct8cyh",
            "contentId": 933150,
            "title": "Rd 24: GOAL Tuimoala Lolohea (62nd min)",
            "description": "Tuimoala Lolohea converts his own try for his side to take the lead",
            "publishDate": "2017-08-19T18:59:00+10:00",
            "publisher": "NRL Chief",
            "thumbnailUrl": "http://bpvideos.telstra.insnw.net/web/images/20170819185457a_89x50.jpg",
            "largeThumbnailUrl": "http://bpvideos.telstra.insnw.net/web/images/20170819185457a_326x184.jpg",
            "programType": "Instant Replay",
            "programCategory": "Score",
            "priority": null,
            "lastUpdateDate": "2017-08-19T19:37:47+10:00",
            "isPremium": true,
            "club": [
                500001,
                500023
            ]
        },
        {
            "id": "I0d2ZjYzE68VWFenYLFjW7PUTcJcgCr0",
            "contentId": 933149,
            "title": "Rd 24: TRY Tuimoala Lolohea (60th min)",
            "description": "Tuimoala Lolohea scores to bring the scores level",
            "publishDate": "2017-08-19T18:53:59+10:00",
            "publisher": "NRL Chief",
            "thumbnailUrl": "http://bpvideos.telstra.insnw.net/web/images/20170819185355a_89x50.jpg",
            "largeThumbnailUrl": "http://bpvideos.telstra.insnw.net/web/images/20170819185355a_326x184.jpg",
            "programType": "Instant Replay",
            "programCategory": "Score",
            "priority": null,
            "lastUpdateDate": "2017-08-19T18:58:36+10:00",
            "isPremium": true,
            "club": [
                500001,
                500023
            ]
        },
        {
            "id": "drZWZjYzE6yZfL-ZtU_PiJTsL-3W04kB",
            "contentId": 933126,
            "title": "Rd 24: GOAL Tuimoala Lolohea (40th min)",
            "description": "Tuimoala Lolohea converts to bring the deficit to four points",
            "publishDate": "2017-08-19T18:18:47+10:00",
            "publisher": "NRL Chief",
            "thumbnailUrl": "http://bpvideos.telstra.insnw.net/web/images/20170819181843a_89x50.jpg",
            "largeThumbnailUrl": "http://bpvideos.telstra.insnw.net/web/images/20170819181843a_326x184.jpg",
            "programType": "Instant Replay",
            "programCategory": "Score",
            "priority": null,
            "lastUpdateDate": "2017-08-19T18:23:29+10:00",
            "isPremium": true,
            "club": [
                500001,
                500023
            ]
        },
        {
            "id": "1jZWZjYzE60ZNSyp69CvNIQgxV8zlbVa",
            "contentId": 933124,
            "title": "Rd 24: TRY James Tedesco (40th min)",
            "description": "The Wests Tigers' fullback scores right on halftime",
            "publishDate": "2017-08-19T18:17:46+10:00",
            "publisher": "NRL Chief",
            "thumbnailUrl": "http://bpvideos.telstra.insnw.net/web/images/20170819181739a_89x50.jpg",
            "largeThumbnailUrl": "http://bpvideos.telstra.insnw.net/web/images/20170819181739a_326x184.jpg",
            "programType": "Instant Replay",
            "programCategory": "Score",
            "priority": null,
            "lastUpdateDate": "2017-08-19T18:22:28+10:00",
            "isPremium": true,
            "club": [
                500001,
                500023
            ]
        },
        {
            "id": "0zZGZjYzE6yeVb88oxu-g3eUmaC_3Zm4",
            "contentId": 933119,
            "title": "Rd 24: GOAL Tuimoala Lolohea (34th min)",
            "description": "Tuimoala Lolohea converts the try of Josh Aloiai",
            "publishDate": "2017-08-19T18:10:55+10:00",
            "publisher": "NRL Chief",
            "thumbnailUrl": "http://bpvideos.telstra.insnw.net/web/images/20170819181026a_89x50.jpg",
            "largeThumbnailUrl": "http://bpvideos.telstra.insnw.net/web/images/20170819181026a_326x184.jpg",
            "programType": "Instant Replay",
            "programCategory": "Score",
            "priority": null,
            "lastUpdateDate": "2017-08-19T18:15:27+10:00",
            "isPremium": true,
            "club": [
                500001,
                500023
            ]
        },
        {
            "id": "gxZGZjYzE6IWcGRF_fNjwjnuGQE5yWq2",
            "contentId": 933118,
            "title": "Rd 24: TRY Josh Aloiai (33rd min)",
            "description": "Josh Aloiai scores to open the Wests Tigers' account",
            "publishDate": "2017-08-19T18:10:01+10:00",
            "publisher": "NRL Chief",
            "thumbnailUrl": "http://bpvideos.telstra.insnw.net/web/images/20170819180933a_89x50.jpg",
            "largeThumbnailUrl": "http://bpvideos.telstra.insnw.net/web/images/20170819180933a_326x184.jpg",
            "programType": "Instant Replay",
            "programCategory": "Score",
            "priority": null,
            "lastUpdateDate": "2017-08-19T18:15:27+10:00",
            "isPremium": true,
            "club": [
                500001,
                500023
            ]
        },
        {
            "id": "pyYmZjYzE68H6xlQbgz7a6O6GFQE5ac0",
            "contentId": 933115,
            "title": "Rd 24: TRY Mitchell Aubusson (29th min)",
            "description": "Mitchell Aubusson touches down out wide",
            "publishDate": "2017-08-19T18:04:35+10:00",
            "publisher": "NRL Chief",
            "thumbnailUrl": "http://bpvideos.telstra.insnw.net/web/images/20170819180428a_89x50.jpg",
            "largeThumbnailUrl": "http://bpvideos.telstra.insnw.net/web/images/20170819180428a_326x184.jpg",
            "programType": "Instant Replay",
            "programCategory": "Score",
            "priority": null,
            "lastUpdateDate": "2017-08-19T18:08:25+10:00",
            "isPremium": true,
            "club": [
                500001,
                500023
            ]
        },
        {
            "id": "Z1OGZjYzE6DA3t9h_4yl3-rmyz752p84",
            "contentId": 933109,
            "title": "Rd 24: GOAL Michael Gordon (19th min)",
            "description": "Michael Gordon converts the try of Aidan Guerra",
            "publishDate": "2017-08-19T17:53:33+10:00",
            "publisher": "NRL Chief",
            "thumbnailUrl": "http://bpvideos.telstra.insnw.net/web/images/20170819175320a_89x50.jpg",
            "largeThumbnailUrl": "http://bpvideos.telstra.insnw.net/web/images/20170819175320a_326x184.jpg",
            "programType": "Instant Replay",
            "programCategory": "Score",
            "priority": null,
            "lastUpdateDate": "2017-08-19T17:57:23+10:00",
            "isPremium": true,
            "club": [
                500001,
                500023
            ]
        },
        {
            "id": "s4OGZjYzE6Ajd8FghAcnAanuWEV5VebJ",
            "contentId": 933107,
            "title": "Rd 24: TRY Aidan Guerra (17th min)",
            "description": "Aidan Guerra crosses for the Roosters' second try",
            "publishDate": "2017-08-19T17:51:52+10:00",
            "publisher": "NRL Chief",
            "thumbnailUrl": "http://bpvideos.telstra.insnw.net/web/images/20170819175128a_89x50.jpg",
            "largeThumbnailUrl": "http://bpvideos.telstra.insnw.net/web/images/20170819175128a_326x184.jpg",
            "programType": "Instant Replay",
            "programCategory": "Score",
            "priority": null,
            "lastUpdateDate": "2017-08-19T17:56:22+10:00",
            "isPremium": true,
            "club": [
                500001,
                500023
            ]
        },
        {
            "id": "VuN2ZjYzE6zMA8dz7JhjguIuKyHJlTX-",
            "contentId": 933104,
            "title": "Rd 24: GOAL Michael Gordon (14th min)",
            "description": "Michael Gordon converts the try of Mitchell Pearce",
            "publishDate": "2017-08-19T17:49:24+10:00",
            "publisher": "NRL Chief",
            "thumbnailUrl": "http://bpvideos.telstra.insnw.net/web/images/20170819174841a_89x50.jpg",
            "largeThumbnailUrl": "http://bpvideos.telstra.insnw.net/web/images/20170819174841a_326x184.jpg",
            "programType": "Instant Replay",
            "programCategory": "Score",
            "priority": null,
            "lastUpdateDate": "2017-08-19T17:53:21+10:00",
            "isPremium": true,
            "club": [
                500001,
                500023
            ]
        },
        {
            "id": "NkN2ZjYzE6H3f-hkeoPQbaVLW9FbOmUz",
            "contentId": 933102,
            "title": "Rd 24: TRY Mitchell Pearce (13th min)",
            "description": "Mitchell Pearce crosses to open the scoring",
            "publishDate": "2017-08-19T17:47:53+10:00",
            "publisher": "NRL Chief",
            "thumbnailUrl": "http://bpvideos.telstra.insnw.net/web/images/20170819174750a_89x50.jpg",
            "largeThumbnailUrl": "http://bpvideos.telstra.insnw.net/web/images/20170819174750a_326x184.jpg",
            "programType": "Instant Replay",
            "programCategory": "Score",
            "priority": null,
            "lastUpdateDate": "2017-08-19T17:52:21+10:00",
            "isPremium": true,
            "club": [
                500001,
                500023
            ]
        }
    ],
    "scores": [
        {
            "gameState": "First Half",
            "gameStateId": 3,
            "gameTime": "0:12:00",
            "gameSeconds": 720,
            "GameMinutes": "12:00",
            "playerId": 500007,
            "playerName": "Mitchell Pearce",
            "scoreMethod": "Try",
            "statEvent": "Try",
            "statId": 38,
            "statValue": 4,
            "vidRef": 18045,
            "homeScore": 4,
            "commentary": "Try by Mitchell Pearce",
            "tackleNum": 4,
            "teamId": 500001,
            "teamName": "Sydney Roosters",
            "homeTeamAbbrv": "SYD",
            "awayTeamAbbrv": "WST"
        },
        {
            "gameState": "First Half",
            "gameStateId": 3,
            "gameTime": "0:13:27",
            "gameSeconds": 807,
            "GameMinutes": "13:27",
            "playerId": 500797,
            "playerName": "Michael Gordon",
            "scoreMethod": "Conversion",
            "statEvent": "Conversion-Made",
            "statId": 1,
            "statValue": 2,
            "vidRef": 20217,
            "homeScore": 6,
            "commentary": "Conversion-Made by Michael Gordon",
            "tackleNum": -1,
            "teamId": 500001,
            "teamName": "Sydney Roosters",
            "homeTeamAbbrv": "SYD",
            "awayTeamAbbrv": "WST"
        },
        {
            "gameState": "First Half",
            "gameStateId": 3,
            "gameTime": "0:16:38",
            "gameSeconds": 998,
            "GameMinutes": "16:38",
            "playerId": 500011,
            "playerName": "Aidan Guerra",
            "scoreMethod": "Try",
            "statEvent": "Try",
            "statId": 38,
            "statValue": 4,
            "vidRef": 24995,
            "homeScore": 10,
            "commentary": "Try by Aidan Guerra",
            "tackleNum": 2,
            "teamId": 500001,
            "teamName": "Sydney Roosters",
            "homeTeamAbbrv": "SYD",
            "awayTeamAbbrv": "WST"
        },
        {
            "gameState": "First Half",
            "gameStateId": 3,
            "gameTime": "0:18:06",
            "gameSeconds": 1086,
            "GameMinutes": "18:06",
            "playerId": 500797,
            "playerName": "Michael Gordon",
            "scoreMethod": "Conversion",
            "statEvent": "Conversion-Made",
            "statId": 1,
            "statValue": 2,
            "vidRef": 27542,
            "homeScore": 12,
            "commentary": "Conversion-Made by Michael Gordon",
            "tackleNum": -1,
            "teamId": 500001,
            "teamName": "Sydney Roosters",
            "homeTeamAbbrv": "SYD",
            "awayTeamAbbrv": "WST"
        },
        {
            "gameState": "First Half",
            "gameStateId": 3,
            "gameTime": "0:28:20",
            "gameSeconds": 1700,
            "GameMinutes": "28:20",
            "playerId": 500016,
            "playerName": "Mitchell Aubusson",
            "scoreMethod": "Try",
            "statEvent": "Try",
            "statId": 38,
            "statValue": 4,
            "vidRef": 44496,
            "homeScore": 16,
            "commentary": "Try by Mitchell Aubusson",
            "tackleNum": 6,
            "teamId": 500001,
            "teamName": "Sydney Roosters",
            "homeTeamAbbrv": "SYD",
            "awayTeamAbbrv": "WST"
        },
        {
            "gameState": "Second Half",
            "gameStateId": 5,
            "gameTime": "1:11:28",
            "gameSeconds": 4288,
            "GameMinutes": "71:28",
            "playerId": 502502,
            "playerName": "Latrell Mitchell",
            "scoreMethod": "Try",
            "statEvent": "Try",
            "statId": 38,
            "statValue": 4,
            "vidRef": 116992,
            "homeScore": 20,
            "awayScore": 18,
            "commentary": "Try by Latrell Mitchell",
            "tackleNum": 5,
            "teamId": 500001,
            "teamName": "Sydney Roosters",
            "homeTeamAbbrv": "SYD",
            "awayTeamAbbrv": "WST"
        },
        {
            "gameState": "Second Half",
            "gameStateId": 5,
            "gameTime": "1:12:58",
            "gameSeconds": 4378,
            "GameMinutes": "72:58",
            "playerId": 500797,
            "playerName": "Michael Gordon",
            "scoreMethod": "Conversion",
            "statEvent": "Conversion-Made",
            "statId": 1,
            "statValue": 2,
            "vidRef": 120279,
            "homeScore": 22,
            "awayScore": 18,
            "commentary": "Conversion-Made by Michael Gordon",
            "tackleNum": -1,
            "teamId": 500001,
            "teamName": "Sydney Roosters",
            "homeTeamAbbrv": "SYD",
            "awayTeamAbbrv": "WST"
        },
        {
            "gameState": "First Half",
            "gameStateId": 3,
            "gameTime": "0:32:06",
            "gameSeconds": 1926,
            "GameMinutes": "32:06",
            "playerId": 500882,
            "playerName": "Josh Aloiai",
            "scoreMethod": "Try",
            "statEvent": "Try",
            "statId": 38,
            "statValue": 4,
            "vidRef": 51748,
            "homeScore": 16,
            "awayScore": 4,
            "commentary": "Try by Josh Aloiai",
            "tackleNum": 6,
            "teamId": 500023,
            "teamName": "Wests Tigers",
            "homeTeamAbbrv": "SYD",
            "awayTeamAbbrv": "WST"
        },
        {
            "gameState": "First Half",
            "gameStateId": 3,
            "gameTime": "0:33:34",
            "gameSeconds": 2014,
            "GameMinutes": "33:34",
            "playerId": 500927,
            "playerName": "Tuimoala Lolohea",
            "scoreMethod": "Conversion",
            "statEvent": "Conversion-Made",
            "statId": 1,
            "statValue": 2,
            "vidRef": 54185,
            "homeScore": 16,
            "awayScore": 6,
            "commentary": "Conversion-Made by Tuimoala Lolohea",
            "tackleNum": -1,
            "teamId": 500023,
            "teamName": "Wests Tigers",
            "homeTeamAbbrv": "SYD",
            "awayTeamAbbrv": "WST"
        },
        {
            "gameState": "First Half",
            "gameStateId": 3,
            "gameTime": "0:39:59",
            "gameSeconds": 2399,
            "GameMinutes": "39:59",
            "playerId": 500663,
            "playerName": "James Tedesco",
            "scoreMethod": "Try",
            "statEvent": "Try",
            "statId": 38,
            "statValue": 4,
            "vidRef": 63808,
            "homeScore": 16,
            "awayScore": 10,
            "commentary": "Try by James Tedesco",
            "tackleNum": 3,
            "teamId": 500023,
            "teamName": "Wests Tigers",
            "homeTeamAbbrv": "SYD",
            "awayTeamAbbrv": "WST"
        },
        {
            "gameState": "First Half",
            "gameStateId": 3,
            "gameTime": "0:40:00",
            "gameSeconds": 2400,
            "GameMinutes": "40:00",
            "playerId": 500927,
            "playerName": "Tuimoala Lolohea",
            "scoreMethod": "Conversion",
            "statEvent": "Conversion-Made",
            "statId": 1,
            "statValue": 2,
            "vidRef": 65993,
            "homeScore": 16,
            "awayScore": 12,
            "commentary": "Conversion-Made by Tuimoala Lolohea",
            "tackleNum": -1,
            "teamId": 500023,
            "teamName": "Wests Tigers",
            "homeTeamAbbrv": "SYD",
            "awayTeamAbbrv": "WST"
        },
        {
            "gameState": "Second Half",
            "gameStateId": 5,
            "gameTime": "0:59:35",
            "gameSeconds": 3575,
            "GameMinutes": "59:35",
            "playerId": 500927,
            "playerName": "Tuimoala Lolohea",
            "scoreMethod": "Try",
            "statEvent": "Try",
            "statId": 38,
            "statValue": 4,
            "vidRef": 97471,
            "homeScore": 16,
            "awayScore": 16,
            "commentary": "Try by Tuimoala Lolohea",
            "tackleNum": 5,
            "teamId": 500023,
            "teamName": "Wests Tigers",
            "homeTeamAbbrv": "SYD",
            "awayTeamAbbrv": "WST"
        },
        {
            "gameState": "Second Half",
            "gameStateId": 5,
            "gameTime": "1:01:02",
            "gameSeconds": 3662,
            "GameMinutes": "61:02",
            "playerId": 500927,
            "playerName": "Tuimoala Lolohea",
            "scoreMethod": "Conversion",
            "statEvent": "Conversion-Made",
            "statId": 1,
            "statValue": 2,
            "vidRef": 99638,
            "homeScore": 16,
            "awayScore": 18,
            "commentary": "Conversion-Made by Tuimoala Lolohea",
            "tackleNum": -1,
            "teamId": 500023,
            "teamName": "Wests Tigers",
            "homeTeamAbbrv": "SYD",
            "awayTeamAbbrv": "WST"
        }
    ],
    "twitter": [
        {
            "id": "898817944905367552",
            "gameSeconds": 1740
        },
        {
            "id": "898817656307843073",
            "gameSeconds": 1740
        }
    ]
}