{
    "vod": [
        {
            "id": "BzczBtdDpmtY8WnitiJN_NnarTvsyG2f",
            "contentId": 740208,
            "title": "Rd 7: Knights v Eels (2)",
            "description": "2nd half replay of the match between the Knights & Eels",
            "publishDate": "2015-04-20T06:01:00+10:00",
            "publisher": "NRL Chief",
            "thumbnailUrl": "http://bigpondvideo.com/Web/Images/Content/20150419182034a_89x50.jpg",
            "largeThumbnailUrl": "http://bigpondvideo.com/Web/Images/Content/20150419182034a_326x184.jpg",
            "programType": "Matches",
            "programCategory": "Replay: 2nd Half",
            "priority": null,
            "lastUpdateDate": "2015-04-20T01:57:47+10:00",
            "isPremium": true,
            "club": [
                500003,
                500031
            ]
        },
        {
            "id": "M0d3ZsdDqrGN7Lurn1avVXNntCPfBVGG",
            "contentId": 740207,
            "title": "Rd 7: Knights v Eels (1)",
            "description": "1st half replay of the match between the Knights & Eels",
            "publishDate": "2015-04-20T06:00:00+10:00",
            "publisher": "NRL Chief",
            "thumbnailUrl": "http://bigpondvideo.com/Web/Images/Content/20150419182027a_89x50.jpg",
            "largeThumbnailUrl": "http://bigpondvideo.com/Web/Images/Content/20150419182027a_326x184.jpg",
            "programType": "Matches",
            "programCategory": "Replay: 1st Half",
            "priority": null,
            "lastUpdateDate": "2015-04-19T19:44:21+10:00",
            "isPremium": true,
            "club": [
                500003,
                500031
            ]
        },
        {
            "id": "M1ZnZsdDqVMQSmVFDbyyw-VItmpkS_0s",
            "contentId": 740132,
            "title": "Rd 7: Knights v Eels (Hls)",
            "description": "Highlights of the match between the Knights & Eels from Hunter Stadium.",
            "publishDate": "2015-04-19T18:05:00+10:00",
            "publisher": "NRL Chief",
            "thumbnailUrl": "http://bigpondvideo.com/Web/Images/Content/20150419180727a_89x50.jpg",
            "largeThumbnailUrl": "http://bigpondvideo.com/Web/Images/Content/20150419180727a_326x184.jpg",
            "programType": "Highlights",
            "programCategory": "Match",
            "priority": null,
            "lastUpdateDate": "2015-04-19T18:11:36+10:00",
            "isPremium": false,
            "club": [
                500003,
                500031
            ]
        },
        {
            "id": "Rvb3ZsdDoFB_sgW4Wh-6lGnG5dppie8T",
            "contentId": 740180,
            "title": "Rd 7 Press Conference: Knights",
            "description": "The Knights coach faces the media following the match",
            "publishDate": "2015-04-19T18:44:00+10:00",
            "publisher": "NRL Chief",
            "thumbnailUrl": "http://bigpondvideo.com/Web/Images/Content/20150419184459a_89x50.jpg",
            "largeThumbnailUrl": "http://bigpondvideo.com/Web/Images/Content/20150419184459a_326x184.jpg",
            "programType": "Press Conference",
            "programCategory": null,
            "priority": null,
            "lastUpdateDate": "2015-04-19T18:51:56+10:00",
            "isPremium": false,
            "club": [
                500003,
                500031
            ]
        },
        {
            "id": "MybXZsdDrf2vgVfntOMBzoS8uSsJ6vcv",
            "contentId": 740181,
            "title": "Rd 7 Press Conference: Eels",
            "description": "The Eels coach faces the media following the match",
            "publishDate": "2015-04-19T18:34:00+10:00",
            "publisher": "NRL Chief",
            "thumbnailUrl": "http://bigpondvideo.com/Web/Images/Content/20150419182655a_89x50.jpg",
            "largeThumbnailUrl": "http://bigpondvideo.com/Web/Images/Content/20150419182655a_326x184.jpg",
            "programType": "Press Conference",
            "programCategory": null,
            "priority": null,
            "lastUpdateDate": "2015-04-19T18:48:54+10:00",
            "isPremium": false,
            "club": [
                500003,
                500031
            ]
        },
        {
            "id": "9oOXZsdDrliec6xnPX5ADlIF12Zgqup_",
            "contentId": 740794,
            "title": "Rd 7: TRY Nathan Peats (75th min)",
            "description": "Eels are in again as Nathan Peats crosses for a double",
            "publishDate": "2015-04-19T17:50:00+10:00",
            "publisher": "NRL Chief",
            "thumbnailUrl": "http://bigpondvideo.com/Web/Images/Content/20150419175114a_89x50.jpg",
            "largeThumbnailUrl": "http://bigpondvideo.com/Web/Images/Content/20150419175114a_326x184.jpg",
            "programType": "Instant Replay",
            "programCategory": "Score",
            "priority": 1,
            "lastUpdateDate": "2015-04-19T18:06:34+10:00",
            "isPremium": true,
            "club": [
                500003,
                500031
            ]
        },
        {
            "id": "R0NXZsdDqdA00SbSLjGPU-pkHSyjrryc",
            "contentId": 740792,
            "title": "Rd 7: GOAL Chris Sandow (68th min)",
            "description": "Conversion gives the Eels a 24-22 lead",
            "publishDate": "2015-04-19T17:41:00+10:00",
            "publisher": "NRL Chief",
            "thumbnailUrl": "http://bigpondvideo.com/Web/Images/Content/20150419174114a_89x50.jpg",
            "largeThumbnailUrl": "http://bigpondvideo.com/Web/Images/Content/20150419174114a_326x184.jpg",
            "programType": "Instant Replay",
            "programCategory": "Score",
            "priority": 2,
            "lastUpdateDate": "2015-04-19T18:06:34+10:00",
            "isPremium": true,
            "club": [
                500003,
                500031
            ]
        },
        {
            "id": "pmNXZsdDq6vvMPGnY3ulK4kbyBlJiqqJ",
            "contentId": 740787,
            "title": "Rd 7: TRY Nathan Peats (67th min)",
            "description": "Eels level the scores as Nathan Peats dives over from dummy half",
            "publishDate": "2015-04-19T17:39:00+10:00",
            "publisher": "NRL Chief",
            "thumbnailUrl": "http://bigpondvideo.com/Web/Images/Content/20150419174053a_89x50.jpg",
            "largeThumbnailUrl": "http://bigpondvideo.com/Web/Images/Content/20150419174053a_326x184.jpg",
            "programType": "Instant Replay",
            "programCategory": "Score",
            "priority": 3,
            "lastUpdateDate": "2015-04-19T18:05:34+10:00",
            "isPremium": true,
            "club": [
                500003,
                500031
            ]
        },
        {
            "id": "13MHZsdDqMPXwJqki2aY7rndRnyfVu0W",
            "contentId": 740790,
            "title": "Rd 7: TRY James McManus (57th min)",
            "description": "Great work from dummy half by Joseph Leilua sends James McManus over to score for the Knights",
            "publishDate": "2015-04-19T17:29:00+10:00",
            "publisher": "NRL Chief",
            "thumbnailUrl": "http://bigpondvideo.com/Web/Images/Content/20150419172958a_89x50.jpg",
            "largeThumbnailUrl": "http://bigpondvideo.com/Web/Images/Content/20150419172958a_326x184.jpg",
            "programType": "Instant Replay",
            "programCategory": "Score",
            "priority": 4,
            "lastUpdateDate": "2015-04-19T18:05:34+10:00",
            "isPremium": true,
            "club": [
                500003,
                500031
            ]
        },
        {
            "id": "Q1eXVsdDoUxMQa52-9aNkfJKzFb92BAk",
            "contentId": 740791,
            "title": "Rd 7: TRY Dane Gagai (50th min)",
            "description": "Knights level the scores through a try to Dane Gagai",
            "publishDate": "2015-04-19T17:22:00+10:00",
            "publisher": "NRL Chief",
            "thumbnailUrl": "http://bigpondvideo.com/Web/Images/Content/20150419172258a_89x50.jpg",
            "largeThumbnailUrl": "http://bigpondvideo.com/Web/Images/Content/20150419172258a_326x184.jpg",
            "programType": "Instant Replay",
            "programCategory": "Score",
            "priority": 5,
            "lastUpdateDate": "2015-04-19T18:05:34+10:00",
            "isPremium": true,
            "club": [
                500003,
                500031
            ]
        },
        {
            "id": "Z5eHVsdDpa4UczcOdRADlI6FOyx_L6nn",
            "contentId": 740788,
            "title": "Rd 7: GOAL Chris Sandow (49th min)",
            "description": "Conversion sees the Eels lead 18-14",
            "publishDate": "2015-04-19T17:21:00+10:00",
            "publisher": "NRL Chief",
            "thumbnailUrl": "http://bigpondvideo.com/Web/Images/Content/20150419172247a_89x50.jpg",
            "largeThumbnailUrl": "http://bigpondvideo.com/Web/Images/Content/20150419172247a_326x184.jpg",
            "programType": "Instant Replay",
            "programCategory": "Score",
            "priority": null,
            "lastUpdateDate": "2015-04-19T17:28:15+10:00",
            "isPremium": true,
            "club": [
                500003,
                500031
            ]
        },
        {
            "id": "tqd3VsdDomGagngpJB_4buLAvKJ8FtDp",
            "contentId": 740786,
            "title": "Rd 7: TRY Bureta Faraimo (47th min)",
            "description": "Great little grubber by Chris Sandow sees Bureta Faraimo storm through to score for the Eels",
            "publishDate": "2015-04-19T17:20:00+10:00",
            "publisher": "NRL Chief",
            "thumbnailUrl": "http://bigpondvideo.com/Web/Images/Content/20150419172108a_89x50.jpg",
            "largeThumbnailUrl": "http://bigpondvideo.com/Web/Images/Content/20150419172108a_326x184.jpg",
            "programType": "Instant Replay",
            "programCategory": "Score",
            "priority": 6,
            "lastUpdateDate": "2015-04-19T18:04:32+10:00",
            "isPremium": true,
            "club": [
                500003,
                500031
            ]
        },
        {
            "id": "NtdnVsdDqh287ysdKv3Dwxv2j_ehzlq_",
            "contentId": 740785,
            "title": "Rd 7: PENALTY GOAL Tyrone Roberts (45th min)",
            "description": "Penalty goal to the Knights sees them lead by 2",
            "publishDate": "2015-04-19T17:17:10+10:00",
            "publisher": "NRL Chief",
            "thumbnailUrl": "http://bigpondvideo.com/Web/Images/Content/20150419171749a_89x50.jpg",
            "largeThumbnailUrl": "http://bigpondvideo.com/Web/Images/Content/20150419171749a_326x184.jpg",
            "programType": "Instant Replay",
            "programCategory": "Score",
            "priority": null,
            "lastUpdateDate": "2015-04-19T17:27:13+10:00",
            "isPremium": true,
            "club": [
                500003,
                500031
            ]
        },
        {
            "id": "5hdnVsdDr6f5CrV2Jo2DKilgfC0EWWmx",
            "contentId": 740784,
            "title": "Rd 7: PENALTY GOAL Chris Sandow (43rd min)",
            "description": "Penalty goal to Parramatta locks the score up at 12-all",
            "publishDate": "2015-04-19T17:16:00+10:00",
            "publisher": "NRL Chief",
            "thumbnailUrl": "http://bigpondvideo.com/Web/Images/Content/20150419171638a_89x50.jpg",
            "largeThumbnailUrl": "http://bigpondvideo.com/Web/Images/Content/20150419171638a_326x184.jpg",
            "programType": "Instant Replay",
            "programCategory": "Score",
            "priority": null,
            "lastUpdateDate": "2015-04-19T17:20:10+10:00",
            "isPremium": true,
            "club": [
                500003,
                500031
            ]
        },
        {
            "id": "11anVsdDpziSlGfRex1RL1LU91X0dRlI",
            "contentId": 740782,
            "title": "Rd 7: TRY John Folau (35th min)",
            "description": "John Folau crosses for his 2nd try for the afternoon for the Eels",
            "publishDate": "2015-04-19T16:51:00+10:00",
            "publisher": "NRL Chief",
            "thumbnailUrl": "http://bigpondvideo.com/Web/Images/Content/20150419165128a_89x50.jpg",
            "largeThumbnailUrl": "http://bigpondvideo.com/Web/Images/Content/20150419165128a_326x184.jpg",
            "programType": "Instant Replay",
            "programCategory": "Score",
            "priority": 7,
            "lastUpdateDate": "2015-04-19T18:03:32+10:00",
            "isPremium": true,
            "club": [
                500003,
                500031
            ]
        },
        {
            "id": "VxZHVsdDr_Bt6NT6q00aUVtTZ73ii9kV",
            "contentId": 740780,
            "title": "Rd 7: GOAL Chris Sandow (17th min)",
            "description": "Conversion sees the visitors trail by 6",
            "publishDate": "2015-04-19T16:30:00+10:00",
            "publisher": "NRL Chief",
            "thumbnailUrl": "http://bigpondvideo.com/Web/Images/Content/20150419163153a_89x50.jpg",
            "largeThumbnailUrl": "http://bigpondvideo.com/Web/Images/Content/20150419163153a_326x184.jpg",
            "programType": "Instant Replay",
            "programCategory": "Score",
            "priority": null,
            "lastUpdateDate": "2015-04-19T16:35:49+10:00",
            "isPremium": true,
            "club": [
                500003,
                500031
            ]
        },
        {
            "id": "U2ZHVsdDrvzAPCVx1UwC5lmkgJUwNyfc",
            "contentId": 740781,
            "title": "Rd 7: TRY John Folau (15th min)",
            "description": "Eels go down the short side and John Folau shows great strength to score",
            "publishDate": "2015-04-19T16:29:00+10:00",
            "publisher": "NRL Chief",
            "thumbnailUrl": "http://bigpondvideo.com/Web/Images/Content/20150419163051a_89x50.jpg",
            "largeThumbnailUrl": "http://bigpondvideo.com/Web/Images/Content/20150419163051a_326x184.jpg",
            "programType": "Instant Replay",
            "programCategory": "Score",
            "priority": 8,
            "lastUpdateDate": "2015-04-19T18:02:31+10:00",
            "isPremium": true,
            "club": [
                500003,
                500031
            ]
        },
        {
            "id": "Q1Y3VsdDpGJnLotY7uTaqQ46qXx9hsgI",
            "contentId": 740783,
            "title": "Rd 7: GOAL Tyrone Roberts (14th min)",
            "description": "Conversion sees the Knights lead 12-0",
            "publishDate": "2015-04-19T16:26:00+10:00",
            "publisher": "NRL Chief",
            "thumbnailUrl": "http://bigpondvideo.com/Web/Images/Content/20150419162758a_89x50.jpg",
            "largeThumbnailUrl": "http://bigpondvideo.com/Web/Images/Content/20150419162758a_326x184.jpg",
            "programType": "Instant Replay",
            "programCategory": "Score",
            "priority": null,
            "lastUpdateDate": "2015-04-19T16:30:45+10:00",
            "isPremium": true,
            "club": [
                500003,
                500031
            ]
        },
        {
            "id": "drYnVsdDqkmyEjPZ7OYuy25qugBu1iO9",
            "contentId": 740779,
            "title": "Rd 7: TRY Akuila Uate (12th min)",
            "description": "Knights shift the ball to the right and Akuila Uate finds space out wide to score for the home side",
            "publishDate": "2015-04-19T16:25:00+10:00",
            "publisher": "NRL Chief",
            "thumbnailUrl": "http://bigpondvideo.com/Web/Images/Content/20150419162606a_89x50.jpg",
            "largeThumbnailUrl": "http://bigpondvideo.com/Web/Images/Content/20150419162606a_326x184.jpg",
            "programType": "Instant Replay",
            "programCategory": "Score",
            "priority": 9,
            "lastUpdateDate": "2015-04-19T18:02:31+10:00",
            "isPremium": true,
            "club": [
                500003,
                500031
            ]
        },
        {
            "id": "BrOXVsdDrqSNLpl0k7Q9NPvn2rS-b3Nt",
            "contentId": 740778,
            "title": "Rd 7: GOAL Tyrone Roberts (6th min)",
            "description": "Conversion sees the Knights lead 6-0",
            "publishDate": "2015-04-19T16:19:00+10:00",
            "publisher": "NRL Chief",
            "thumbnailUrl": "http://bigpondvideo.com/Web/Images/Content/20150419162028a_89x50.jpg",
            "largeThumbnailUrl": "http://bigpondvideo.com/Web/Images/Content/20150419162028a_326x184.jpg",
            "programType": "Instant Replay",
            "programCategory": "Score",
            "priority": null,
            "lastUpdateDate": "2015-04-19T16:23:41+10:00",
            "isPremium": true,
            "club": [
                500003,
                500031
            ]
        },
        {
            "id": "hjOXVsdDoZIDDTc5zycu7VazS_9ov_Vy",
            "contentId": 740777,
            "title": "Rd 7: TRY Chris Houston (5th min)",
            "description": "Knights open the scoring in this match through a great try to Chris Houston of the back of a Akuila Uate bust",
            "publishDate": "2015-04-19T16:18:00+10:00",
            "publisher": "NRL Chief",
            "thumbnailUrl": "http://bigpondvideo.com/Web/Images/Content/20150419161712a_89x50.jpg",
            "largeThumbnailUrl": "http://bigpondvideo.com/Web/Images/Content/20150419161712a_326x184.jpg",
            "programType": "Instant Replay",
            "programCategory": "Score",
            "priority": 10,
            "lastUpdateDate": "2015-04-19T18:01:30+10:00",
            "isPremium": true,
            "club": [
                500003,
                500031
            ]
        }
    ],
    "scores": [
        {
            "gameState": "First Half",
            "gameStateId": 3,
            "gameTime": "0:04:03",
            "gameSeconds": 243,
            "playerId": 500054,
            "playerName": "Chris Houston",
            "scoreMethod": "Try",
            "statId": 38,
            "statValue": 4,
            "vidRef": 9097,
            "homeScore": 4,
            "teamId": 500003,
            "teamName": "Newcastle Knights",
            "homeTeamAbbrv": "NEW",
            "awayTeamAbbrv": "PAR"
        },
        {
            "gameState": "First Half",
            "gameStateId": 3,
            "gameTime": "0:05:27",
            "gameSeconds": 327,
            "playerId": 500046,
            "playerName": "Tyrone Roberts",
            "scoreMethod": "Conversion",
            "statId": 1,
            "statValue": 2,
            "vidRef": 11185,
            "homeScore": 6,
            "teamId": 500003,
            "teamName": "Newcastle Knights",
            "homeTeamAbbrv": "NEW",
            "awayTeamAbbrv": "PAR"
        },
        {
            "gameState": "First Half",
            "gameStateId": 3,
            "gameTime": "0:11:55",
            "gameSeconds": 715,
            "playerId": 500044,
            "playerName": "Akuila Uate",
            "scoreMethod": "Try",
            "statId": 38,
            "statValue": 4,
            "vidRef": 20901,
            "homeScore": 10,
            "teamId": 500003,
            "teamName": "Newcastle Knights",
            "homeTeamAbbrv": "NEW",
            "awayTeamAbbrv": "PAR"
        },
        {
            "gameState": "First Half",
            "gameStateId": 3,
            "gameTime": "0:13:24",
            "gameSeconds": 804,
            "playerId": 500046,
            "playerName": "Tyrone Roberts",
            "scoreMethod": "Conversion",
            "statId": 1,
            "statValue": 2,
            "vidRef": 23581,
            "homeScore": 12,
            "teamId": 500003,
            "teamName": "Newcastle Knights",
            "homeTeamAbbrv": "NEW",
            "awayTeamAbbrv": "PAR"
        },
        {
            "gameState": "Second Half",
            "gameStateId": 5,
            "gameTime": "0:44:26",
            "gameSeconds": 2666,
            "playerId": 500046,
            "playerName": "Tyrone Roberts",
            "scoreMethod": "Penalty Goal",
            "statId": 67,
            "statValue": 2,
            "vidRef": 77672,
            "homeScore": 14,
            "awayScore": 12,
            "teamId": 500003,
            "teamName": "Newcastle Knights",
            "homeTeamAbbrv": "NEW",
            "awayTeamAbbrv": "PAR"
        },
        {
            "gameState": "Second Half",
            "gameStateId": 5,
            "gameTime": "0:49:41",
            "gameSeconds": 2981,
            "playerId": 500043,
            "playerName": "Dane Gagai",
            "scoreMethod": "Try",
            "statId": 38,
            "statValue": 4,
            "vidRef": 85556,
            "homeScore": 18,
            "awayScore": 18,
            "teamId": 500003,
            "teamName": "Newcastle Knights",
            "homeTeamAbbrv": "NEW",
            "awayTeamAbbrv": "PAR"
        },
        {
            "gameState": "Second Half",
            "gameStateId": 5,
            "gameTime": "0:56:03",
            "gameSeconds": 3363,
            "playerId": 500378,
            "playerName": "James McManus",
            "scoreMethod": "Try",
            "statId": 38,
            "statValue": 4,
            "vidRef": 95099,
            "homeScore": 22,
            "awayScore": 18,
            "teamId": 500003,
            "teamName": "Newcastle Knights",
            "homeTeamAbbrv": "NEW",
            "awayTeamAbbrv": "PAR"
        },
        {
            "gameState": "First Half",
            "gameStateId": 3,
            "gameTime": "0:14:42",
            "gameSeconds": 882,
            "playerId": 500891,
            "playerName": "John Folau",
            "scoreMethod": "Try",
            "statId": 38,
            "statValue": 4,
            "vidRef": 25524,
            "homeScore": 12,
            "awayScore": 4,
            "teamId": 500031,
            "teamName": "Parramatta Eels",
            "homeTeamAbbrv": "NEW",
            "awayTeamAbbrv": "PAR"
        },
        {
            "gameState": "First Half",
            "gameStateId": 3,
            "gameTime": "0:15:58",
            "gameSeconds": 958,
            "playerId": 500691,
            "playerName": "Chris Sandow",
            "scoreMethod": "Conversion",
            "statId": 1,
            "statValue": 2,
            "vidRef": 27425,
            "homeScore": 12,
            "awayScore": 6,
            "teamId": 500031,
            "teamName": "Parramatta Eels",
            "homeTeamAbbrv": "NEW",
            "awayTeamAbbrv": "PAR"
        },
        {
            "gameState": "First Half",
            "gameStateId": 3,
            "gameTime": "0:34:57",
            "gameSeconds": 2097,
            "playerId": 500891,
            "playerName": "John Folau",
            "scoreMethod": "Try",
            "statId": 38,
            "statValue": 4,
            "vidRef": 58901,
            "homeScore": 12,
            "awayScore": 10,
            "teamId": 500031,
            "teamName": "Parramatta Eels",
            "homeTeamAbbrv": "NEW",
            "awayTeamAbbrv": "PAR"
        },
        {
            "gameState": "Second Half",
            "gameStateId": 5,
            "gameTime": "0:42:09",
            "gameSeconds": 2529,
            "playerId": 500691,
            "playerName": "Chris Sandow",
            "scoreMethod": "Penalty Goal",
            "statId": 67,
            "statValue": 2,
            "vidRef": 74258,
            "homeScore": 12,
            "awayScore": 12,
            "teamId": 500031,
            "teamName": "Parramatta Eels",
            "homeTeamAbbrv": "NEW",
            "awayTeamAbbrv": "PAR"
        },
        {
            "gameState": "Second Half",
            "gameStateId": 5,
            "gameTime": "0:46:45",
            "gameSeconds": 2805,
            "playerId": 500668,
            "playerName": "Bureta Faraimo",
            "scoreMethod": "Try",
            "statId": 38,
            "statValue": 4,
            "vidRef": 81151,
            "homeScore": 14,
            "awayScore": 16,
            "teamId": 500031,
            "teamName": "Parramatta Eels",
            "homeTeamAbbrv": "NEW",
            "awayTeamAbbrv": "PAR"
        },
        {
            "gameState": "Second Half",
            "gameStateId": 5,
            "gameTime": "0:48:03",
            "gameSeconds": 2883,
            "playerId": 500691,
            "playerName": "Chris Sandow",
            "scoreMethod": "Conversion",
            "statId": 1,
            "statValue": 2,
            "vidRef": 83099,
            "homeScore": 14,
            "awayScore": 18,
            "teamId": 500031,
            "teamName": "Parramatta Eels",
            "homeTeamAbbrv": "NEW",
            "awayTeamAbbrv": "PAR"
        },
        {
            "gameState": "Second Half",
            "gameStateId": 5,
            "gameTime": "1:06:36",
            "gameSeconds": 3996,
            "playerId": 500688,
            "playerName": "Nathan Peats",
            "scoreMethod": "Try",
            "statId": 38,
            "statValue": 4,
            "vidRef": 110937,
            "homeScore": 22,
            "awayScore": 22,
            "teamId": 500031,
            "teamName": "Parramatta Eels",
            "homeTeamAbbrv": "NEW",
            "awayTeamAbbrv": "PAR"
        },
        {
            "gameState": "Second Half",
            "gameStateId": 5,
            "gameTime": "1:07:30",
            "gameSeconds": 4050,
            "playerId": 500691,
            "playerName": "Chris Sandow",
            "scoreMethod": "Conversion",
            "statId": 1,
            "statValue": 2,
            "vidRef": 113683,
            "homeScore": 22,
            "awayScore": 24,
            "teamId": 500031,
            "teamName": "Parramatta Eels",
            "homeTeamAbbrv": "NEW",
            "awayTeamAbbrv": "PAR"
        },
        {
            "gameState": "Second Half",
            "gameStateId": 5,
            "gameTime": "1:14:31",
            "gameSeconds": 4471,
            "playerId": 500688,
            "playerName": "Nathan Peats",
            "scoreMethod": "Try",
            "statId": 38,
            "statValue": 4,
            "vidRef": 125249,
            "homeScore": 22,
            "awayScore": 28,
            "teamId": 500031,
            "teamName": "Parramatta Eels",
            "homeTeamAbbrv": "NEW",
            "awayTeamAbbrv": "PAR"
        }
    ]
}