{
    "vod": [
        {
            "id": "lkc3JudTotbCJS4KwX6Vr9eUVecSjOKe",
            "contentId": 759436,
            "title": "Rd 14: Storm v Eels (2)",
            "description": "2nd half replay of the match between the Storm & Eels",
            "publishDate": "2015-06-16T09:00:00+10:00",
            "publisher": "NRL Chief",
            "thumbnailUrl": "http://bigpondvideo.com/Web/Images/Content/20150615211640a_89x50.jpg",
            "largeThumbnailUrl": "http://bigpondvideo.com/Web/Images/Content/20150615211640a_326x184.jpg",
            "programType": "Matches",
            "programCategory": "Replay: 2nd Half",
            "priority": null,
            "lastUpdateDate": "2015-06-15T23:15:05+10:00",
            "isPremium": true,
            "club": [
                500021,
                500031
            ]
        },
        {
            "id": "81c3JudTpkqw2pH_zMkGLXr92GUkNdSt",
            "contentId": 759435,
            "title": "Rd 14: Storm v Eels (1)",
            "description": "1st half replay of the match between the Storm & Eels",
            "publishDate": "2015-06-16T09:00:00+10:00",
            "publisher": "NRL Chief",
            "thumbnailUrl": "http://bigpondvideo.com/Web/Images/Content/20150615211620a_89x50.jpg",
            "largeThumbnailUrl": "http://bigpondvideo.com/Web/Images/Content/20150615211620a_326x184.jpg",
            "programType": "Matches",
            "programCategory": "Replay: 1st Half",
            "priority": null,
            "lastUpdateDate": "2015-06-15T23:10:05+10:00",
            "isPremium": true,
            "club": [
                500021,
                500031
            ]
        },
        {
            "id": "B4cHFudTqKciAgUZpWBStdjsDDaeJHzS",
            "contentId": 759404,
            "title": "Rd 14: Storm v Eels (Hls)",
            "description": "Highlights of the match between the Storm & Eels from AAMI Park",
            "publishDate": "2015-06-15T21:20:00+10:00",
            "publisher": "NRL Chief",
            "thumbnailUrl": "http://bigpondvideo.com/Web/Images/Content/20150615211814a_89x50.jpg",
            "largeThumbnailUrl": "http://bigpondvideo.com/Web/Images/Content/20150615211814a_326x184.jpg",
            "programType": "Highlights",
            "programCategory": "Match",
            "priority": null,
            "lastUpdateDate": "2015-06-15T21:23:37+10:00",
            "isPremium": false,
            "club": [
                500021,
                500031
            ]
        },
        {
            "id": "VpNXJudTpQPCAII8XWTwT76urEtDS-dd",
            "contentId": 759422,
            "title": "Rd 14 Press Conference: Storm",
            "description": "The Storm coach faces the media following the match",
            "publishDate": "2015-06-15T21:55:00+10:00",
            "publisher": "NRL Chief",
            "thumbnailUrl": "http://bigpondvideo.com/Web/Images/Content/20150615212502a_89x50.jpg",
            "largeThumbnailUrl": "http://bigpondvideo.com/Web/Images/Content/20150615212502a_326x184.jpg",
            "programType": "Press Conference",
            "programCategory": null,
            "priority": null,
            "lastUpdateDate": "2015-06-15T22:05:48+10:00",
            "isPremium": false,
            "club": [
                500021,
                500031
            ]
        },
        {
            "id": "hydnFudTorXZTmBKRWNkTRpclw0K6fU3",
            "contentId": 759423,
            "title": "Rd 14 Press Conference: Eels",
            "description": "The Eels coach faces the media following the match",
            "publishDate": "2015-06-15T21:32:00+10:00",
            "publisher": "NRL Chief",
            "thumbnailUrl": "http://bigpondvideo.com/Web/Images/Content/20150615212010a_89x50.jpg",
            "largeThumbnailUrl": "http://bigpondvideo.com/Web/Images/Content/20150615212010a_326x184.jpg",
            "programType": "Press Conference",
            "programCategory": null,
            "priority": null,
            "lastUpdateDate": "2015-06-15T21:39:42+10:00",
            "isPremium": false,
            "club": [
                500021,
                500031
            ]
        },
        {
            "id": "x4ZHFudToAO01cIF4LBezf2btEiyDPUY",
            "contentId": 760162,
            "title": "Rd 14: GOAL Chris Sandow (78th min)",
            "description": "Conversion sees the Eels lead 26-22",
            "publishDate": "2015-06-15T20:49:00+10:00",
            "publisher": "NRL Chief",
            "thumbnailUrl": "http://bigpondvideo.com/Web/Images/Content/20150615204813a_89x50.jpg",
            "largeThumbnailUrl": "http://bigpondvideo.com/Web/Images/Content/20150615204813a_326x184.jpg",
            "programType": "Instant Replay",
            "programCategory": "Score",
            "priority": 1,
            "lastUpdateDate": "2015-06-15T20:59:24+10:00",
            "isPremium": true,
            "club": [
                500021,
                500031
            ]
        },
        {
            "id": "BwZHFudTqr4rhI2qXH7z8a8owotFWdnB",
            "contentId": 760161,
            "title": "Rd 14: TRY Tepai Moeroa (76th min)",
            "description": "Eels take the lead through a barnstorming try to Tepai Moeroa",
            "publishDate": "2015-06-15T20:48:00+10:00",
            "publisher": "NRL Chief",
            "thumbnailUrl": "http://bigpondvideo.com/Web/Images/Content/20150615204630a_89x50.jpg",
            "largeThumbnailUrl": "http://bigpondvideo.com/Web/Images/Content/20150615204630a_326x184.jpg",
            "programType": "Instant Replay",
            "programCategory": "Score",
            "priority": 2,
            "lastUpdateDate": "2015-06-15T20:58:24+10:00",
            "isPremium": true,
            "club": [
                500021,
                500031
            ]
        },
        {
            "id": "02YXFudTrjpSMz5T8kLwvmUy1QLGVjbm",
            "contentId": 760155,
            "title": "Rd 14: TRY Ryan Morgan (69th min)",
            "description": "Great hands by the Eels big men sends Ryan Morgan over for a try out of nothing",
            "publishDate": "2015-06-15T20:38:00+10:00",
            "publisher": "NRL Chief",
            "thumbnailUrl": "http://bigpondvideo.com/Web/Images/Content/20150615203810a_89x50.jpg",
            "largeThumbnailUrl": "http://bigpondvideo.com/Web/Images/Content/20150615203810a_326x184.jpg",
            "programType": "Instant Replay",
            "programCategory": "Score",
            "priority": 3,
            "lastUpdateDate": "2015-06-15T20:58:24+10:00",
            "isPremium": true,
            "club": [
                500021,
                500031
            ]
        },
        {
            "id": "Y1OXFudTpEJ17H7PUPQtPXrsLqdZyd7X",
            "contentId": 760160,
            "title": "Rd 14: GOAL Tohu Harris (67th min)",
            "description": "Conversion sees the Storm lead 22-16",
            "publishDate": "2015-06-15T20:37:00+10:00",
            "publisher": "NRL Chief",
            "thumbnailUrl": "http://bigpondvideo.com/Web/Images/Content/20150615203714a_89x50.jpg",
            "largeThumbnailUrl": "http://bigpondvideo.com/Web/Images/Content/20150615203714a_326x184.jpg",
            "programType": "Instant Replay",
            "programCategory": "Score",
            "priority": null,
            "lastUpdateDate": "2015-06-15T20:40:18+10:00",
            "isPremium": true,
            "club": [
                500021,
                500031
            ]
        },
        {
            "id": "1xOHFudTrz-Jj1TRMZQ2-itH1as4AJlQ",
            "contentId": 760159,
            "title": "Rd 14: TRY Hyel Hunt (66th min)",
            "description": "Hyel Hunt grabs his first try in the NRL for the Storm off the back of an Eels error",
            "publishDate": "2015-06-15T20:36:00+10:00",
            "publisher": "NRL Chief",
            "thumbnailUrl": "http://bigpondvideo.com/Web/Images/Content/20150615203604a_89x50.jpg",
            "largeThumbnailUrl": "http://bigpondvideo.com/Web/Images/Content/20150615203604a_326x184.jpg",
            "programType": "Instant Replay",
            "programCategory": "Score",
            "priority": 4,
            "lastUpdateDate": "2015-06-15T20:57:24+10:00",
            "isPremium": true,
            "club": [
                500021,
                500031
            ]
        },
        {
            "id": "ZmMXFudToeZiyQysb_WvhnwV7boL0jGu",
            "contentId": 760158,
            "title": "Rd 14: TRY Blake Green (49th min)",
            "description": "Storm level the scores as Blake Green crosses after the Eels fail to clean up a Melbourne kick",
            "publishDate": "2015-06-15T20:18:00+10:00",
            "publisher": "NRL Chief",
            "thumbnailUrl": "http://bigpondvideo.com/Web/Images/Content/20150615201740a_89x50.jpg",
            "largeThumbnailUrl": "http://bigpondvideo.com/Web/Images/Content/20150615201740a_326x184.jpg",
            "programType": "Instant Replay",
            "programCategory": "Score",
            "priority": 5,
            "lastUpdateDate": "2015-06-15T20:57:24+10:00",
            "isPremium": true,
            "club": [
                500021,
                500031
            ]
        },
        {
            "id": "pkd3BudTrayNidHG3Nypks19Ed2j6Y5z",
            "contentId": 760157,
            "title": "Rd 14: GOAL Chris Sandow (43rd min)",
            "description": "Conversion sees the Eels lead 16-12",
            "publishDate": "2015-06-15T20:09:00+10:00",
            "publisher": "NRL Chief",
            "thumbnailUrl": "http://bigpondvideo.com/Web/Images/Content/20150615200858a_89x50.jpg",
            "largeThumbnailUrl": "http://bigpondvideo.com/Web/Images/Content/20150615200858a_326x184.jpg",
            "programType": "Instant Replay",
            "programCategory": "Score",
            "priority": null,
            "lastUpdateDate": "2015-06-15T20:12:11+10:00",
            "isPremium": true,
            "club": [
                500021,
                500031
            ]
        },
        {
            "id": "t5dnBudTpSmD8CilP9k2dNk2uQZUcNR1",
            "contentId": 760156,
            "title": "Rd 14: TRY Corey Norman (42nd min)",
            "description": "Eels take the lead through a try to Corey Norman",
            "publishDate": "2015-06-15T20:08:00+10:00",
            "publisher": "NRL Chief",
            "thumbnailUrl": "http://bigpondvideo.com/Web/Images/Content/20150615200740a_89x50.jpg",
            "largeThumbnailUrl": "http://bigpondvideo.com/Web/Images/Content/20150615200740a_326x184.jpg",
            "programType": "Instant Replay",
            "programCategory": "Score",
            "priority": 6,
            "lastUpdateDate": "2015-06-15T20:56:23+10:00",
            "isPremium": true,
            "club": [
                500021,
                500031
            ]
        },
        {
            "id": "xsbXBudTrhDXfGIuqJOO5ncPXiVfFAMR",
            "contentId": 760151,
            "title": "Rd 14: TRY Semi Radradra (36th min)",
            "description": "Fantastic kick by Chris Sandow finds Semi Radradra leap over to record a 1st half double for the Eels",
            "publishDate": "2015-06-15T19:48:00+10:00",
            "publisher": "NRL Chief",
            "thumbnailUrl": "http://bigpondvideo.com/Web/Images/Content/20150615194532a_89x50.jpg",
            "largeThumbnailUrl": "http://bigpondvideo.com/Web/Images/Content/20150615194532a_326x184.jpg",
            "programType": "Instant Replay",
            "programCategory": "Score",
            "priority": 7,
            "lastUpdateDate": "2015-06-15T20:56:23+10:00",
            "isPremium": true,
            "club": [
                500021,
                500031
            ]
        },
        {
            "id": "BkaXBudTrR6qEgGhNp3w4J_z3hFb4gyE",
            "contentId": 760150,
            "title": "Rd 14: GOAL Chris Sandow (29th min)",
            "description": "Conversion sees the Eels trail 12-6",
            "publishDate": "2015-06-15T19:38:00+10:00",
            "publisher": "NRL Chief",
            "thumbnailUrl": "http://bigpondvideo.com/Web/Images/Content/20150615193745a_89x50.jpg",
            "largeThumbnailUrl": "http://bigpondvideo.com/Web/Images/Content/20150615193745a_326x184.jpg",
            "programType": "Instant Replay",
            "programCategory": "Score",
            "priority": null,
            "lastUpdateDate": "2015-06-15T19:40:04+10:00",
            "isPremium": true,
            "club": [
                500021,
                500031
            ]
        },
        {
            "id": "E3aXBudTrrFZICyUchAy1KzdhkZl0Y5L",
            "contentId": 760149,
            "title": "Rd 14: TRY Semi Radradra (27th min)",
            "description": "Eels keep the ball alive and its Semi Radradra who scores a great try for the Eels",
            "publishDate": "2015-06-15T19:35:00+10:00",
            "publisher": "NRL Chief",
            "thumbnailUrl": "http://bigpondvideo.com/Web/Images/Content/20150615193553a_89x50.jpg",
            "largeThumbnailUrl": "http://bigpondvideo.com/Web/Images/Content/20150615193553a_326x184.jpg",
            "programType": "Instant Replay",
            "programCategory": "Score",
            "priority": 8,
            "lastUpdateDate": "2015-06-15T20:55:23+10:00",
            "isPremium": true,
            "club": [
                500021,
                500031
            ]
        },
        {
            "id": "l2YXBudTrGXR9YcwLNZYok4Tn1f5g_Ng",
            "contentId": 760148,
            "title": "Rd 14: GOAL Tohu Harris (14th min)",
            "description": "Conversion gives the Storm a 12-0 lead",
            "publishDate": "2015-06-15T19:18:00+10:00",
            "publisher": "NRL Chief",
            "thumbnailUrl": "http://bigpondvideo.com/Web/Images/Content/20150615191759a_89x50.jpg",
            "largeThumbnailUrl": "http://bigpondvideo.com/Web/Images/Content/20150615191759a_326x184.jpg",
            "programType": "Instant Replay",
            "programCategory": "Score",
            "priority": null,
            "lastUpdateDate": "2015-06-15T19:21:58+10:00",
            "isPremium": true,
            "club": [
                500021,
                500031
            ]
        },
        {
            "id": "Q3YXBudTqfyES_m9pGi0KmYqCVs-R9qo",
            "contentId": 760154,
            "title": "Rd 14: TRY Ben Hampton (12th min)",
            "description": "Storm are in again as Ben Hampton steps his way through the Eels defense",
            "publishDate": "2015-06-15T19:17:00+10:00",
            "publisher": "NRL Chief",
            "thumbnailUrl": "http://bigpondvideo.com/Web/Images/Content/20150615191715a_89x50.jpg",
            "largeThumbnailUrl": "http://bigpondvideo.com/Web/Images/Content/20150615191715a_326x184.jpg",
            "programType": "Instant Replay",
            "programCategory": "Score",
            "priority": 9,
            "lastUpdateDate": "2015-06-15T20:55:23+10:00",
            "isPremium": true,
            "club": [
                500021,
                500031
            ]
        },
        {
            "id": "BuOHBudTq4J0vHKULjwhQHl8KrEqMBQ0",
            "contentId": 760153,
            "title": "Rd 14: GOAL Tohu Harris (7th min)",
            "description": "Conversion sees the Storm lead 6-0",
            "publishDate": "2015-06-15T19:12:00+10:00",
            "publisher": "NRL Chief",
            "thumbnailUrl": "http://bigpondvideo.com/Web/Images/Content/20150615191224a_89x50.jpg",
            "largeThumbnailUrl": "http://bigpondvideo.com/Web/Images/Content/20150615191224a_326x184.jpg",
            "programType": "Instant Replay",
            "programCategory": "Score",
            "priority": null,
            "lastUpdateDate": "2015-06-15T19:14:56+10:00",
            "isPremium": true,
            "club": [
                500021,
                500031
            ]
        },
        {
            "id": "hmOHBudTosNHMPswz3I5zGsS3S_2uzUX",
            "contentId": 760152,
            "title": "Rd 14: TRY Tohu Harris (5th min)",
            "description": "Storm open the scoring through a try to Tohu Harris",
            "publishDate": "2015-06-15T19:10:00+10:00",
            "publisher": "NRL Chief",
            "thumbnailUrl": "http://bigpondvideo.com/Web/Images/Content/20150615191055a_89x50.jpg",
            "largeThumbnailUrl": "http://bigpondvideo.com/Web/Images/Content/20150615191055a_326x184.jpg",
            "programType": "Instant Replay",
            "programCategory": "Score",
            "priority": 10,
            "lastUpdateDate": "2015-06-15T20:54:23+10:00",
            "isPremium": true,
            "club": [
                500021,
                500031
            ]
        }
    ],
    "scores": [
        {
            "gameState": "First Half",
            "gameStateId": 3,
            "gameTime": "0:04:34",
            "gameSeconds": 274,
            "playerId": 500594,
            "playerName": "Tohu Harris",
            "scoreMethod": "Try",
            "statEvent": "Try",
            "statId": 38,
            "statValue": 4,
            "vidRef": 8683,
            "homeScore": 4,
            "teamId": 500021,
            "teamName": "Melbourne Storm",
            "homeTeamAbbrv": "MEL",
            "awayTeamAbbrv": "PAR"
        },
        {
            "gameState": "First Half",
            "gameStateId": 3,
            "gameTime": "0:06:03",
            "gameSeconds": 363,
            "playerId": 500594,
            "playerName": "Tohu Harris",
            "scoreMethod": "Conversion",
            "statEvent": "Conversion-Made",
            "statId": 1,
            "statValue": 2,
            "vidRef": 11306,
            "homeScore": 6,
            "teamId": 500021,
            "teamName": "Melbourne Storm",
            "homeTeamAbbrv": "MEL",
            "awayTeamAbbrv": "PAR"
        },
        {
            "gameState": "First Half",
            "gameStateId": 3,
            "gameTime": "0:11:43",
            "gameSeconds": 703,
            "playerId": 500593,
            "playerName": "Ben Hampton",
            "scoreMethod": "Try",
            "statEvent": "Try",
            "statId": 38,
            "statValue": 4,
            "vidRef": 19821,
            "homeScore": 10,
            "teamId": 500021,
            "teamName": "Melbourne Storm",
            "homeTeamAbbrv": "MEL",
            "awayTeamAbbrv": "PAR"
        },
        {
            "gameState": "First Half",
            "gameStateId": 3,
            "gameTime": "0:13:17",
            "gameSeconds": 797,
            "playerId": 500594,
            "playerName": "Tohu Harris",
            "scoreMethod": "Conversion",
            "statEvent": "Conversion-Made",
            "statId": 1,
            "statValue": 2,
            "vidRef": 22153,
            "homeScore": 12,
            "teamId": 500021,
            "teamName": "Melbourne Storm",
            "homeTeamAbbrv": "MEL",
            "awayTeamAbbrv": "PAR"
        },
        {
            "gameState": "Second Half",
            "gameStateId": 5,
            "gameTime": "0:48:47",
            "gameSeconds": 2927,
            "playerId": 502209,
            "playerName": "Blake Green",
            "scoreMethod": "Try",
            "statEvent": "Try",
            "statId": 38,
            "statValue": 4,
            "vidRef": 91435,
            "homeScore": 16,
            "awayScore": 16,
            "teamId": 500021,
            "teamName": "Melbourne Storm",
            "homeTeamAbbrv": "MEL",
            "awayTeamAbbrv": "PAR"
        },
        {
            "gameState": "Second Half",
            "gameStateId": 5,
            "gameTime": "1:05:28",
            "gameSeconds": 3928,
            "playerId": 500597,
            "playerName": "Hymel Hunt",
            "scoreMethod": "Try",
            "statEvent": "Try",
            "statId": 38,
            "statValue": 4,
            "vidRef": 116460,
            "homeScore": 20,
            "awayScore": 16,
            "teamId": 500021,
            "teamName": "Melbourne Storm",
            "homeTeamAbbrv": "MEL",
            "awayTeamAbbrv": "PAR"
        },
        {
            "gameState": "Second Half",
            "gameStateId": 5,
            "gameTime": "1:06:55",
            "gameSeconds": 4015,
            "playerId": 500594,
            "playerName": "Tohu Harris",
            "scoreMethod": "Conversion",
            "statEvent": "Conversion-Made",
            "statId": 1,
            "statValue": 2,
            "vidRef": 119071,
            "homeScore": 22,
            "awayScore": 16,
            "teamId": 500021,
            "teamName": "Melbourne Storm",
            "homeTeamAbbrv": "MEL",
            "awayTeamAbbrv": "PAR"
        },
        {
            "gameState": "First Half",
            "gameStateId": 3,
            "gameTime": "0:26:55",
            "gameSeconds": 1615,
            "playerId": 500690,
            "playerName": "Semi Radradra",
            "scoreMethod": "Try",
            "statEvent": "Try",
            "statId": 38,
            "statValue": 4,
            "vidRef": 49085,
            "homeScore": 12,
            "awayScore": 4,
            "teamId": 500031,
            "teamName": "Parramatta Eels",
            "homeTeamAbbrv": "MEL",
            "awayTeamAbbrv": "PAR"
        },
        {
            "gameState": "First Half",
            "gameStateId": 3,
            "gameTime": "0:28:24",
            "gameSeconds": 1704,
            "playerId": 500691,
            "playerName": "Chris Sandow",
            "scoreMethod": "Conversion",
            "statEvent": "Conversion-Made",
            "statId": 1,
            "statValue": 2,
            "vidRef": 51310,
            "homeScore": 12,
            "awayScore": 6,
            "teamId": 500031,
            "teamName": "Parramatta Eels",
            "homeTeamAbbrv": "MEL",
            "awayTeamAbbrv": "PAR"
        },
        {
            "gameState": "First Half",
            "gameStateId": 3,
            "gameTime": "0:35:06",
            "gameSeconds": 2106,
            "playerId": 500690,
            "playerName": "Semi Radradra",
            "scoreMethod": "Try",
            "statEvent": "Try",
            "statId": 38,
            "statValue": 4,
            "vidRef": 63479,
            "homeScore": 12,
            "awayScore": 10,
            "teamId": 500031,
            "teamName": "Parramatta Eels",
            "homeTeamAbbrv": "MEL",
            "awayTeamAbbrv": "PAR"
        },
        {
            "gameState": "Second Half",
            "gameStateId": 5,
            "gameTime": "0:41:48",
            "gameSeconds": 2508,
            "playerId": 500684,
            "playerName": "Corey Norman",
            "scoreMethod": "Try",
            "statEvent": "Try",
            "statId": 38,
            "statValue": 4,
            "vidRef": 77185,
            "homeScore": 12,
            "awayScore": 14,
            "teamId": 500031,
            "teamName": "Parramatta Eels",
            "homeTeamAbbrv": "MEL",
            "awayTeamAbbrv": "PAR"
        },
        {
            "gameState": "Second Half",
            "gameStateId": 5,
            "gameTime": "0:42:28",
            "gameSeconds": 2548,
            "playerId": 500691,
            "playerName": "Chris Sandow",
            "scoreMethod": "Conversion",
            "statEvent": "Conversion-Made",
            "statId": 1,
            "statValue": 2,
            "vidRef": 78189,
            "homeScore": 12,
            "awayScore": 16,
            "teamId": 500031,
            "teamName": "Parramatta Eels",
            "homeTeamAbbrv": "MEL",
            "awayTeamAbbrv": "PAR"
        },
        {
            "gameState": "Second Half",
            "gameStateId": 5,
            "gameTime": "1:09:10",
            "gameSeconds": 4150,
            "playerId": 500682,
            "playerName": "Ryan Morgan",
            "scoreMethod": "Try",
            "statEvent": "Try",
            "statId": 38,
            "statValue": 4,
            "vidRef": 122452,
            "homeScore": 22,
            "awayScore": 20,
            "teamId": 500031,
            "teamName": "Parramatta Eels",
            "homeTeamAbbrv": "MEL",
            "awayTeamAbbrv": "PAR"
        },
        {
            "gameState": "Second Half",
            "gameStateId": 5,
            "gameTime": "1:16:06",
            "gameSeconds": 4566,
            "playerId": 500908,
            "playerName": "Tepai Moeroa",
            "scoreMethod": "Try",
            "statEvent": "Try",
            "statId": 38,
            "statValue": 4,
            "vidRef": 133948,
            "homeScore": 22,
            "awayScore": 24,
            "teamId": 500031,
            "teamName": "Parramatta Eels",
            "homeTeamAbbrv": "MEL",
            "awayTeamAbbrv": "PAR"
        },
        {
            "gameState": "Second Half",
            "gameStateId": 5,
            "gameTime": "1:17:34",
            "gameSeconds": 4654,
            "playerId": 500691,
            "playerName": "Chris Sandow",
            "scoreMethod": "Conversion",
            "statEvent": "Conversion-Made",
            "statId": 1,
            "statValue": 2,
            "vidRef": 136145,
            "homeScore": 22,
            "awayScore": 26,
            "teamId": 500031,
            "teamName": "Parramatta Eels",
            "homeTeamAbbrv": "MEL",
            "awayTeamAbbrv": "PAR"
        }
    ]
}