{
  "swagger": "2.0",
  "info": {
    "description": "API para comunicação entre forumulários de suporte e a plataforma GLPi",
    "version": "1.0.1",
    "title": "Ecotrace Suporte API",
    "contacts": { "email": "ti@ecotrace.info" },
    "license": {
      "name": "Apache 2.0",
      "url": "http://www.apache.org/licenses/LICENSE-2.0.html"
    }
  },
  "host": "10.137.1.249:5008",
  "basePath": "/",
  "schemes": ["https"],
  "tags": [{ "name": "Ticket" }],
  "paths": {
    "/": {
      "post": {
        "tags": ["Ticket"],
        "summary": "Registrar Chamado",
        "description": "Registra um novo chamado no painel do GLPi",
        "operationId": "postTicket",
        "consumes": ["application/json"],
        "produces": ["application/json"],
        "parameters": [
          {
            "description": "Campos marcados como obrigatório deverão seguir o padrão exigido pelo sistema.",
            "in": "body",
            "name": "body",
            "required": true,
            "schema": {
              "$ref": "#/definitions/Ticket"
            }
          }
        ],
        "responses": {
          "201": {
            "description": "Ticket criado",
            "schema": {
              "$ref": "#/definitions/TicketCreated"
            }
          },
          "400": {
            "description": "Erro de valicação do payload",
            "schema": {
              "$ref": "#/definitions/Error"
            }
          },
          "500": {
            "description": "Erro interno ou de comunicação com o GLPi",
            "schema": {
              "$ref": "#/definitions/Error"
            }
          }
        }
      }
    }
  },
  "definitions": {
    "Ticket": {
      "type": "object",
      "required": ["content", "email", "name", "phone", "title"],
      "properties": {
        "category": {
          "type": "integer",
          "format": "int32",
          "description": "Código da categoria ITIL registrada dentro do GLPi",
          "default": 1
        },
        "content": {
          "type": "string",
          "description": "Conteúdo do Ticket, descrição do problema"
        },
        "entity": {
          "type": "integer",
          "format": "int32",
          "description": "Código da entidade ativa e registrada no GLPi"
        },
        "email": {
          "type": "string",
          "description": "Email do Autor do Ticket"
        },
        "name": {
          "type": "string",
          "description": "Nome do Autor do Ticket"
        },
        "phone": {
          "type": "string",
          "description": "Telefone do Autor do Ticket"
        },
        "title": {
          "type": "string",
          "description": "Título do Chamado"
        },
        "requestType": {
          "type": "integer",
          "format": "int32",
          "description": "Origem da requisição no GLPi [0 - Direct, 1 - Email, 2 - Helpdesk, 3 - Other, 4 - Phone, 5 - Written]",
          "default": "2"
        },
        "type": {
          "type": "integer",
          "format": "int32",
          "description": "Código da categoria ITIL registrada dentro do GLPi [1 - Incidente, 2 - Requisição]",
          "default": "1"
        },
        "urgency": {
          "type": "integer",
          "format": "int32",
          "description": "Código da categoria ITIL registrada dentro do GLPi [1 - Muito Baixa, 2 - Baixa, 3 - Médio, 4 - Alta, 5 - Muito Alta]",
          "default": "3"
        },
        "status": {
          "type": "integer",
          "format": "int32",
          "description": "Código da categoria ITIL registrada dentro do GLPi [1 - Novo, 2 - Processando (Atribuído), 3 - Processando (planejado), 4 - Pendente, 5 - Solucionado, 6 - Fechado]",
          "default": 1
        }
      }
    },
    "TicketCreated": {
      "type": "object",
      "properties": {
        "id": {
          "type": "integer",
          "format": "int32",
          "description": "ID do Ticket criado"
        }
      }
    },
    "Error": {
      "type": "object",
      "properties": {
        "status": {
          "type": "integer",
          "format": "int32",
          "description": "HTTP Status Code"
        },
        "code": {
          "type": "string",
          "description": "Um código de identificação do erro"
        },
        "message": {
          "type": "string",
          "description": "Um mensagem de erro agradável"
        }
      }
    }
  }
}
