{
  "bss.label": {
    "ru": "Клиент-Банк"
  },
  "bsc.label": {
    "ru": "Банковское сопровождение контрактов"
  },
  "continue": {
    "ru": "Продолжить"
  },
  "done": {
    "ru": "Готово"
  },
  "client.label": {
    "ru": "Заявитель"
  },
  "account": {
    "@accountNum": "string",
    "ru": "Счет {accountNum, account}"
  },
  "action.closeWindow": {
    "ru": "Закрыть окно"
  },
  "action.reserveAccount": {
    "ru": "Зарезервировать счёт"
  },
  "action.collapse": {
    "ru": "Свернуть"
  },
  "action.expand": {
    "ru": "Развернуть"
  },
  "action.error": {
    "ru": "Не удалось выполнить операцию"
  },
  "action.errorSignAndSend": {
    "ru": "Недостаточно прав для подписи документа, поскольку Вы не являетесь ЕИО (единоличным исполнительным органом)"
  },
  "action.sign": {
    "ru": "Подписать"
  },
  "action.cancel": {
    "ru": "Отменить"
  },
  "action.accept": {
    "ru": "Применить"
  },
  "action.close": {
    "ru": "Закрыть"
  },
  "action.repeat": {
    "ru": "Повторить"
  },
  "action.show": {
    "ru": "Посмотреть"
  },
  "action.details.show": {
    "ru": "Показать подробности"
  },
  "action.details.hide": {
    "ru": "Скрыть подробности"
  },
  "action.yes": {
    "ru": "Да"
  },
  "action.no": {
    "ru": "Нет"
  },
  "action.install": {
    "ru": "Установить"
  },
  "action.reTry": {
    "ru": "Повторить"
  },
  "action.signOthers": {
    "ru": "Подписать другие документы"
  },
  "action.cancelSign": {
    "ru": "Прервать"
  },
  "action.openAccount": {
    "ru": "Открыть счёт"
  },
  "action.create": {
    "ru": "Создать"
  },
  "action.openAccountWithSign": {
    "ru": "Открыть дополнительный счёт (необходима ЭП)"
  },
  "action.regDoc": {
    "ru": "Открыть первый счёт"
  },
  "action.currencyControl": {
    "ru": "ЛК ВЭД"
  },
  "action.OrganizationNotDefined.label": {
    "ru": "Организация не определена"
  },
  "alert.sessionEnded": {
    "ru": "Ваша сессия завершена."
  },
  "action.organizations.label": {
    "ru": "Все организации"
  },
  "action.generateCertificate": {
    "ru": "Выпустить новый сертификат"
  },
  "action.registration": {
    "ru": "Регистрация"
  },
  "action.notShowAgain": {
    "ru": "Больше не показывать"
  },
  "action.loginClientBank": {
    "ru": "Войти под учетной записью Клиент-Банк.WEB"
  },
  "action.toConstitution": {
    "ru": "Заключить соглашение"
  },
  "menuService.certificates": {
    "ru": "Сертификаты"
  },
  "errors.passwordErrors.minLength": {
    "ru": "Длина пароля должна превышать 7 символов"
  },
  "errors.passwordErrors.maxLength": {
    "ru": "Пароль слишком длинный"
  },
  "errors.passwordErrors.lowerCase": {
    "ru": "Пароль должен содержать символы в нижнем регистре"
  },
  "errors.passwordErrors.upperCase": {
    "ru": "Пароль должен содержать символы в верхнем регистре"
  },
  "errors.passwordErrors.minNum": {
    "ru": "Пароль должен содержать как минимум одну цифру"
  },
  "errors.passwordErrors.minSymb": {
    "ru": "Пароль должен содержать как минимум один специальный символ"
  },
  "errors.passwordErrors.minGroup": {
    "ru": "Пароль должен содержать минимум три из четырех групп символов (большие, маленькие цифры, спецсимволы)"
  },
  "errors.passwordErrors.unacceptable": {
    "ru": "Пароль содержит недопустимые символы"
  },
  "errors.passwordErrors.coincidence": {
    "ru": "Пароль совпадает с логином"
  },
  "errors.incorrectData": {
    "ru": "Введены некорректные учетные данные. Измените данные и повторите попытку"
  },
  "errors.numberAttemptsExceededBlock": {
    "ru": "Превышено количество попыток ввода кода подтверждения. Ваша учетная запись временно заблокирована. Обратитесь в службу поддержки Банка: 8 (800) 100-11-89"
  },
  "errors.numberOfTriesExceededSendSMS": {
    "ru": "Превышено количество попыток ввода кода подтверждения."
  },
  "errors.accountBlocked": {
    "ru": "Ваша учетная запись заблокирована. Обратитесь в службу поддержки Банка: 8 (800) 100-11-89"
  },
  "errors.networkError": {
    "ru": "Произошла ошибка сети, пожалуйста проверьте подключение к интернету."
  },
  "errors.serverError": {
    "ru": "При обращении к серверу произошла ошибка.\nПопробуйте обновить страницу.\n\nЕсли ошибка повторится, свяжитесь с нами, пожалуйста.\nКонтакты для справок: 8 (800) 100-11-89"
  },
  "errors.email": {
    "ru": "Проверьте адрес электронной почты"
  },
  "error.verificationCodesendFailed": {
    "ru": "Ошибка проверки кода подтверждения"
  },
  "error.text": {
    "ru": "Ошибка"
  },
  "error.callStreamError": {
    "ru": "Ошибка выполнения операции"
  },
  "error.codeRequest": {
    "ru": "Запросить код не удалось, попробуйте позже."
  },
  "error.codeCheck": {
    "ru": "Не удалось проверить код подтверждения. Повторите ввод или запросите код еще раз."
  },
  "errors.numberAttemptsExceeded": {
    "ru": "Превышено количество попыток ввода кода подтверждения. Повторите операцию позже или обратитесь в службу поддержки Банка: 8 (800) 100-11-89"
  },
  "errors.mfaTotpUserNotFound": {
    "ru": "Для пользователя не заданы настройки для входа по временному паролю. Обратитесь в службу поддержки Банка: 8 (800) 100-11-89"
  },
  "errors.fatalHandler.header": {
    "ru": "Упс, что-то пошло не так"
  },
  "errors.fatalHandler.firstBlock": {
    "ru": "При обращении к серверу произошла ошибка, попробуйте обновить страницу"
  },
  "errors.fatalHandler.secondBlock": {
    "ru": "Если ошибка повторится, свяжитесь с нами, пожалуйста"
  },
  "errors.fatalHandler.phone": {
    "ru": "8 800 100 11 89"
  },
  "errors.phoneNumber": {
    "ru": "Код не может быть выслан на указанный телефон. Попробуйте запросить код еще раз или обратитесь в службу поддержки Банка. Контакты для справок: 8 (800) 100-11-89"
  },
  "errors.loadingModule": {
    "ru": "Произошла ошибка при загрузке модуля."
  },
  "errors.fatalGetDigest": {
    "ru": "Произошла ошибка при получении дайджеста документа."
  },
  "crypto.error.certsNotFound": {
    "ru": "Отсутствуют сертификаты"
  },
  "crypto.error.cryptomodulNotInstalled": {
    "ru": "Не установлено средство\nэлектронной подписи"
  },
  "crypto.error.cryptomodulNotInstalledText1": {
    "ru": "Для создания электронной подписи\nдокументов используется средство\nэлектронной подписи «Криптоплагин»."
  },
  "crypto.error.cryptomodulNotInstalledText2": {
    "ru": "Установите средство подписи и попытайтесь\nзаново подписать документ."
  },
  "crypto.error.access.header": {
    "ru": "Не установлено средство электронной подписи"
  },
  "crypto.error.access.text1": {
    "ru": "Вы отказали в доступе к Вашим ключам электронной подписи."
  },
  "crypto.error.access.text2": {
    "ru": "Повторите операцию, чтобы разрешить доступ и подписать документ."
  },
  "crypto.error.noCerts.text1": {
    "ru": "У Вас нет ни одного действующего сертификата."
  },
  "crypto.error.noCerts.text2": {
    "ru": "Для уточнения причин, обратитесь в банк по телефону."
  },
  "crypto.error.cantRetrieveInfoAboutSignerOrCertificate": {
    "ru": "Не найдена информация о подписанте или сертификате"
  },
  "crypto.error.invalidSign": {
    "ru": "Возникла ошибка при проверке ключа ЭП выбранного абонента. Для уточнения информации обратитесь в службу технической поддержки по телефону 8 800 100 11 89 (по России бесплатно)"
  },
  "statuses.successful": {
    "ru": "Готово"
  },
  "action.сancel": {
    "ru": "Отмена"
  },
  "dialog.error.title": {
    "ru": "Произошла ошибка"
  },
  "dialog.error.delete": {
    "ru": "Произошла ошибка при удалении"
  },
  "dialog.remove.title": {
    "ru": "Удаление заявки"
  },
  "action.remove": {
    "ru": "Удалить"
  },
  "dialog.delete.removed": {
    "@count": "num",
    "ru": {
      "count > 1": "Документы успешно удалены",
      "true": "Документ успешно удален"
    }
  },
  "dialog.delete.text": {
    "@count": "num",
    "ru": {
      "count > 1": "Вы действительно хотите удалить документы?",
      "true": "Вы действительно хотите удалить документ?"
    }
  },
  "dialog.sign.internalServerError": {
    "ru": "Внутренняя ошибка сервера"
  },
  "dialog.sign.errorCode": {
    "ru": "Код ошибки"
  },
  "dialog.sign.header": {
    "ru": "Установка подписи"
  },
  "dialog.verifySign.header": {
    "ru": "Проверка подписи"
  },
  "dialog.updateContactInfo.mainStep.header": {
    "ru": "Подтверждение контактной информации"
  },
  "dialog.updateContactInfo.mainStep.text": {
    "ru": "Если вы не подтвердите телефон и адрес электронной почты, то вы не сможете войти в систему"
  },
  "dialog.updateContactInfo.mainStep.notShow": {
    "ru": "Не показывать уведомление в ближайшее время"
  },
  "dialog.updateContactInfo.mainStep.action.logout": {
    "ru": "Выйти"
  },
  "dialog.updateContactInfo.mainStep.action.update": {
    "ru": "Подтвердить информацию"
  },
  "dialog.updateContactInfo.updateEmail.text": {
    "ru": "Для подтверждения почтового адреса, мы направим Вам сообщение на почту с 6-значным кодом, который нужно будет ввести здесь в отдельном окне"
  },
  "dialog.updateContactInfo.updatePhone.text": {
    "ru": "Для подтверждения номера телефона, мы направим Вам SMS с 6-значным кодом, который нужно будет ввести здесь в отдельном окне"
  },
  "dialog.updateContactInfo.updatePhone.header": {
    "ru": "Изменение номера телефона"
  },
  "dialog.updateContactInfo.confirmPhone.header": {
    "ru": "Подтверждение номера телефона"
  },
  "dialog.updateContactInfo.updateEmail.header": {
    "ru": "Изменение адреса электронной почты"
  },
  "dialog.updateContactInfo.confirmEmail.header": {
    "ru": "Подтверждение адреса электронной почты"
  },
  "dialog.updateContactInfo.updatePhone.field.phoneNumber": {
    "ru": "Телефон"
  },
  "dialog.updateContactInfo.updateEmail.field.email": {
    "ru": "E-mail"
  },
  "dialog.updateContactInfo.confirm.smsCodeMessageFirst": {
    "ru": "На указанный Вами номер телефона"
  },
  "dialog.updateContactInfo.confirm.emailCodeMessageFirst": {
    "ru": "На указанный Вами адрес электронной почты"
  },
  "dialog.updateContactInfo.confirm.smsCodeMessageSecond": {
    "ru": "отправлено смс с кодом подтверждения."
  },
  "dialog.updateContactInfo.confirm.emailCodeMessageSecond": {
    "ru": "отправлено письмо с кодом подтверждения."
  },
  "dialog.updateContactInfo.confirm.smsCodeNote": {
    "ru": "Обычно сообщение приходит в течение двух минут."
  },
  "dialog.updateContactInfo.confirm.emailCodeNote": {
    "ru": "Обычно письмо приходит в течение пяти минут."
  },
  "dialog.updateContactInfo.confirm.smsCode": {
    "ru": "Код подтверждения"
  },
  "dialog.updateContactInfo.confirm.sendAgain": {
    "ru": "Получить код еще раз"
  },
  "dialog.updateContactInfo.confirm.exceededCodeEntryAttempts": {
    "ru": "Превышено количество попыток ввода кода подтверждения. Ваша сессия завершена"
  },
  "dialog.updateContactInfo.confirm.incorrectValueCode": {
    "ru": "Неверное значение кода"
  },
  "dialog.updateContactInfo.passwordChangeSuccessfully": {
    "ru": "Операция смены пароля завершилась успешно"
  },
  "dialog.updateContactInfo.incorrectValue": {
    "ru": "Неверное значение"
  },
  "dialog.updateContactInfo.successfullyConfirmed": {
    "@text": "string",
    "ru": "{text} успешно подтвержден"
  },
  "dialog.importantNotification.postponeInfo": {
    "ru": "Есть уведомления, выполнение которых нельзя отложить. Показать эти уведомления?"
  },
  "statementType.standart": {
    "ru": "Стандартная"
  },
  "statementType.extended": {
    "ru": "Расширенная"
  },
  "openAccount.docName": {
    "@docNumber": "string",
    "@docDate": "string",
    "ru": "Заявка на открытие счета №{docNumber} от {docDate, date}"
  },
  "openAccount.main": {
    "ru": "Основная информация"
  },
  "openAccount.reserved": {
    "ru": "Резервированные ранее счета"
  },
  "openAccount.newAccounts": {
    "ru": "Не резервированные ранее счета"
  },
  "openAccount.fields.docNumber": {
    "ru": "Номер документа"
  },
  "openAccount.fields.docDate": {
    "ru": "Дата документа"
  },
  "openAccount.fields.client.name": {
    "ru": "Наименование организации"
  },
  "openAccount.fields.client.fullName": {
    "ru": "Полное наименование организации"
  },
  "openAccount.fields.client.shortName": {
    "ru": "Краткое наименование организации"
  },
  "openAccount.fields.contract.contractNumber": {
    "ru": "Номер договора банковского счета"
  },
  "openAccount.fields.contract.date": {
    "ru": "Дата заключения договора банковского счета"
  },
  "openAccount.fields.contract.accountNumber": {
    "ru": "Карточка ОПОП, привязанная к счету"
  },
  "openAccount.fields.onlineBanking": {
    "ru": "Подключить открываемые счета к интернет и мобильному банку"
  },
  "openAccount.fields.gozAgree": {
    "ru": "Согласие с условиями сопровождения счетов ГК"
  },
  "openAccount.fields.commission.accountNumber": {
    "ru": "Счет списания комиссии"
  },
  "openAccount.fields.accountInfo.accountNumber": {
    "ru": "Номер счета"
  },
  "openAccount.fields.accountInfo.accountType": {
    "ru": "Тип счета"
  },
  "openAccount.fields.accountInfo.branch": {
    "ru": "Подразделение Банка"
  },
  "openAccount.fields.accountInfo.statementType": {
    "ru": "Выписка"
  },
  "openAccount.fields.accountInfo.govContract.identify": {
    "ru": "Идентификатор государственного контракта"
  },
  "openAccount.fields.accountInfo.govContract.number": {
    "ru": "Номер государственного контракта"
  },
  "openAccount.fields.accountInfo.govContract.date": {
    "ru": "Дата государственного контракта"
  },
  "openAccount.fields.accountInfo.amount": {
    "ru": "Сумма государственного контракта"
  },
  "openAccount.fields.accountInfo.agentInn": {
    "ru": "ИНН контрагента по государственному контракту"
  },
  "openAccount.fields.accountInfo.agentName": {
    "ru": "Наименование контрагента по государственному контракту"
  },
  "openAccount.fields.newAccountsInfo.branch.name": {
    "ru": "Подразделение филиала"
  },
  "openAccount.fields.newAccountsInfo.branch.number": {
    "ru": "Номер подразделение филиала"
  },
  "openAccount.fields.newAccountsInfo.info.currency.name": {
    "ru": "Наименование валюты счета"
  },
  "openAccount.fields.newAccountsInfo.info.currency.code": {
    "ru": "Код валюты счета"
  },
  "openAccount.fields.newAccountsInfo.info.count": {
    "ru": "Количество счетов"
  },
  "openAccount.fields.confirmNoChanges": {
    "ru": "На дату отправки заявления изменения в документах и сведениях, предоставленных ранее при открытии предыдущих счетов отсутствуют"
  },
  "openAccount.fields.isResident": {
    "ru": "Компания-резидент"
  },
  "openAccount.fields.innKio": {
    "ru": "ИНН/КИО"
  },
  "openAccount.fields.ogrn": {
    "ru": "ОГРН/ОГРНИП"
  },
  "openAccount.fields.kpp": {
    "ru": "КПП"
  },
  "openAccount.fields.branchBic": {
    "ru": "БИК филиала"
  },
  "openAccount.fields.korAcc": {
    "ru": "Кор.счет филиала"
  },
  "openAccount.fields.custumerAccountNumber": {
    "ru": "Номер счета заказчика по контракту"
  },
  "signSend.succeded": {
    "@count": "num",
    "ru": {
      "count === 1": "Документ подписан и отправлен",
      "count % 10 === 1 && count % 11 !== 0": "Подписано и отправлено {count} документ",
      "count % 10 > 1 && count % 10 < 5": "Подписано и отправлено {count} документа",
      "true": "Подписано и отправлено {count} документов"
    }
  },
  "send.fatal": {
    "ru": "Не удалось отправить документы"
  },
  "send.succeded": {
    "@count": "num",
    "ru": {
      "count === 1": "Документ отправлен",
      "count % 10 === 1 && count % 11 !== 0": "Отправлено {count} документ",
      "count % 10 > 1 && count % 10 < 5": "Отправлено {count} документа",
      "true": "Отправлено {count} документов"
    }
  },
  "send.failed": {
    "@count": "num",
    "ru": {
      "count === 1": "Не удалось отправить документ",
      "count % 10 === 1 && count % 11 !== 0": "Не удалось отправить {count} документ",
      "count % 10 > 1 && count % 10 < 5": "Не удалось отправить {count} документа",
      "true": "Не удалось отправить {count} документов"
    }
  },
  "sign.fatal": {
    "ru": "Не удалось поставить подпись"
  },
  "sign.signFailed": {
    "ru": "Ошибка подписи"
  },
  "sign.fatalHeader": {
    "ru": "Возникла внутренняя ошибка сервера"
  },
  "sign.fatalText": {
    "ru": "Для уточнения информации обратитесь в службу технической поддержки по телефону 8 800 100 11 89 (по России бесплатно)"
  },
  "sign.fatalCollapsedHeader": {
    "ru": "Информация для службы технической поддержки"
  },
  "sign.succeded": {
    "@count": "num",
    "ru": {
      "count === 1": "Документ подписан",
      "count % 10 === 1 && count % 11 !== 0": "Подписан {count} документ",
      "count % 10 > 1 && count % 10 < 5": "Подписано {count} документа",
      "true": "Подписано {count} документов"
    }
  },
  "sign.successfullySignedDocument": {
    "ru": "Документ успешно подписан."
  },
  "sign.failed": {
    "@count": "num",
    "ru": {
      "count === 1": "Не удалось подписать документ",
      "count % 10 === 1 && count % 11 !== 0": "Не удалось подписать {count} документ",
      "count % 10 > 1 && count % 10 < 5": "Не удалось подписать {count} документа",
      "true": "Не удалось подписать {count} документов"
    }
  },
  "unload.failed": {
    "@count": "num",
    "ru": {
      "count === 1": "Не удалось выгрузить документ",
      "count % 10 === 1 && count % 11 !== 0": "Не удалось выгрузить {count} документ",
      "count % 10 > 1 && count % 10 < 5": "Не удалось выгрузить {count} документа",
      "true": "Не удалось выгрузить {count} документов"
    }
  },
  "upload.succeded": {
    "@count": "num",
    "ru": {
      "count === 1": "Документ выгружен",
      "count % 10 === 1 && count % 11 !== 0": "Выгружен {count} документ",
      "count % 10 > 1 && count % 10 < 5": "Выгружено {count} документа",
      "true": "Выгружено {count} документов"
    }
  },
  "unload.successfullyUnloadDocument": {
    "ru": "Документ успешно выгружен"
  },
  "verifySign.header": {
    "ru": "Основная информация"
  },
  "verifySign.error.code": {
    "ru": "Код ошибки:"
  },
  "verifySign.valid": {
    "ru": "Подпись верна"
  },
  "verifySign.invalid": {
    "ru": "Подпись неверна"
  },
  "verifySign.fields.digest.signData": {
    "ru": "Подписываемые данные"
  },
  "verifySign.fields.signature.profile.name": {
    "ru": "ФИО абонента"
  },
  "verifySign.fields.signature.profile.thumbprint": {
    "ru": "Хеш сертификата"
  },
  "verifySign.fields.signature.signDate": {
    "ru": "Дата подписи"
  },
  "verifySign.fields.signature.nameOfSignatory": {
    "ru": "Владелец сертификата"
  },
  "verifySign.fields.signature.certificate": {
    "ru": "Сертификат"
  },
  "verifySign.fields.signature.validPeriod": {
    "ru": "Срок действия"
  },
  "verifySign.fields.signature.issuerName": {
    "ru": "Издатель"
  },
  "verifySign.fields.signature.signature": {
    "ru": "Подпись"
  },
  "verifySign.verifiedDocs": {
    "ru": "Проверено документов:"
  },
  "verifySign.fatal": {
    "ru": "Не удалось выполнить проверку подписи"
  },
  "verifySign.failed": {
    "@count": "num",
    "ru": {
      "count === 1": "Не удалось выполнить проверку подписи документа",
      "count % 10 === 1 && count % 11 !== 0": "Не удалось выполнить проверку подписи у {count} документа",
      "true": "Не удалось выполнить проверку подписи {count} документов"
    }
  },
  "certificatesNotFound.title": {
    "ru": "Отсутствуют сертификаты входа в систему"
  },
  "certificatesNotFound.text1": {
    "ru": "У Вас нет ни одного действующего сертификата для входа в ситему."
  },
  "certificatesNotFound.text2": {
    "ru": "Для уточнения причин, обратитесь в банк по телефону."
  },
  "signCertificatesNotFound.error.title": {
    "ru": "Отсутствуют сертификаты для подписи"
  },
  "signCertificatesNotFound.error.message": {
    "ru": "У Вас нет ни одного сертификата для подписи."
  },
  "files.error.isMalware": {
    "ru": "Не пройдена проверка антивирусом, проверьте файл и загрузите его повторно"
  },
  "files.error.notLoaded": {
    "ru": "Не удалось загрузить файл, проверьте файл и загрузите его повторно"
  },
  "files.error.invalidExt": {
    "ru": "Вы пытаетесь добавить один или несколько файлов формат которых не поддерживается. Поддерживаемые форматы: "
  },
  "files.error.invalidExtenstions": {
    "ru": "Загрузка данного формата файла не поддерживается."
  },
  "files.error.dataSizeExceeded.multi": {
    "@size": "num",
    "ru": "Превышен допустимый максимальный суммарный размер всех файлов в {size,size}"
  },
  "files.error.dataSizeExceeded.single": {
    "@size": "num",
    "ru": "Превышен допустимый максимальный размер файла в {size,size}"
  },
  "files.error.dataSizeNotEnough.multi": {
    "ru": "Файлы не должны иметь нулевой размер"
  },
  "files.error.dataSizeNotEnough.single": {
    "ru": "Файл не должен иметь нулевой размер"
  },
  "files.error.singleOnly": {
    "ru": "Допустимо вложение только одного файла"
  },
  "validation.login.pattern": {
    "ru": "Логин должен состоять из английских букв и цифр. Длина логина не менее 7 символов."
  },
  "validation.login.phoneOrPassword": {
    "ru": "Логин не должен совпадать с номером телефона или паролем."
  },
  "validation.shorterThan": {
    "@length": "number",
    "ru": "Длина атрибута должны быть меньше {length}"
  },
  "validation.longerThan": {
    "@length": "number",
    "ru": "Длина атрибута должны быть больше {length}"
  },
  "validation.exactLength": {
    "@length": "number",
    "ru": "Длина атрибута должны быть равна {length}"
  },
  "validation.onlyNumbers": {
    "ru": "Значение атрибута должно содержать только цифры"
  },
  "validation.necessarilyField": {
    "ru": "Поле обязательно для заполнения"
  },
  "validation.invalidNumber": {
    "ru": "Номер телефона должен состоять из 11 цифр"
  },
  "validation.phoneMustBeBegin": {
    "ru": "Номер телефона должен начинаться с +79"
  },
  "validation.newNumberMatchesCurrent": {
    "ru": "Новый номер телефона совпадает с текущим"
  },
  "validation.newNumberMatchesLogin": {
    "ru": "Указанный номер телефона содержится в логине"
  },
  "validation.newEmailMatchesCurrent": {
    "ru": "Новый адрес электронной почты совпадает с текущим"
  },
  "dialog.history.header": {
    "ru": "История изменений заявки"
  },
  "dialog.history.numberAndDate": {
    "@num": "string",
    "@date": "string",
    "ru": "№ {num} от {date,date}"
  },
  "dialog.history.changedIn": {
    "ru": "Дата изменений"
  },
  "fileExtensions.pdf": {
    "ru": "PDF"
  },
  "fileExtensions.xls": {
    "ru": "EXCEL"
  },
  "print.confirmCount.header": {
    "ru": "Внимание!"
  },
  "print.documents.count": {
    "@count": "num",
    "ru": {
      "count > 10 && count < 15": "документов",
      "count % 10 === 1": "документ",
      "count % 10 > 1 && count % 10 < 5": "документа",
      "true": "документов"
    }
  },
  "print.confirmCount.context": {
    "@doc": "string",
    "@count": "num",
    "@total": "num",
    "ru": {
      "(count > 10 && count < 15) || (count % 10 != 1)": "Количество выбранных Вами документов превышает допустимое. Будет распечатано {count} {doc} из {total}.",
      "true": "Количество выбранных Вами документов превышает допустимое. Будет распечатан {count} {doc} из {total}."
    }
  },
  "print.text": {
    "ru": "Распечатать"
  },
  "print.confirmLastPrint.context": {
    "@last": "num",
    "ru": "хотите продолжить печать оставшихся документов: {last}?"
  },
  "print.confirmPrint.context": {
    "@doc": "string",
    "@count": "num",
    "@total": "num",
    "ru": {
      "(count > 10 && count < 15) || (count % 10 != 1)": "Распечатано {count} {doc} из {total}",
      "true": "Распечатан {count} {doc} из {total}"
    }
  },
  "page.error404": {
    "ru": "Страница не найдена"
  },
  "dialog.optimisticLockError.text": {
    "ru": "Другой пользователь изменил данный документ. Пожалуйста, перезагрузите страницу."
  },
  "segments.cas_acc_open_second_req": {
    "ru": "Заявка на открытие дополнительного счета"
  },
  "segments.cas_offer_rko_acceptance_req": {
    "ru": "Заявка на акцепт оферты к счету РКO"
  },
  "segments.cas_offer_join_gpb_bo1_req": {
    "ru": "Заявка на присоединение к ГПБ Бизнес-Онлайн"
  },
  "segments.cas_offer_join_gpb_bo2_req": {
    "ru": "Заявка на регистрацию / блокировку уполномоченного лица клиента"
  },
  "segments.cas_free_format_doc": {
    "ru": "Документ свободного формата"
  },
  "segments.cas_dbo_bss_frame": {
    "ru": "Фрэйм ДБО БСС для главной страницы"
  },
  "segments.cas_switching_to_dbo_bss": {
    "ru": "Бесшовный переход в ДБО БСС"
  },
  "segments.cas_offer_join_po_uved": {
    "ru": "Заявка на присоединение к ЛК УВЭД"
  },
  "segments.cas_switching_to_uved_process": {
    "ru": "Бесшовный переход в ЛК УВЭД (Обработка)"
  },
  "segments.cas_switching_to_uved_view": {
    "ru": "Бесшовный переход в ЛК УВЭД (Просмотр)"
  },
  "fallback.dbo.text": {
    "ru": "Для работы с функционалом Вам необходимо пройти аутентификацию под учетной записью Клиент-Банк.WEB."
  },
  "fallback.header": {
    "ru": "Функционал недоступен"
  },
  "fallback.dbo.signin": {
    "ru": "Войти под учетной записью ДБО"
  },
  "fallback.segment.text": {
    "ru": "Для данной организации отсутствует сертификат ЭП, обратитесь в Банк"
  },
  "fallback.notEnoughRight.header": {
    "ru": "Функционал недоступен"
  },
  "fallback.notEnoughRight.text": {
    "ru": "Недостаточно прав"
  },
  "actions.back": {
    "ru": "Назад"
  },
  "forms.certificateRequest.label.organization": {
    "ru": "Организация"
  },
  "forms.certificateRequest.label.fio": {
    "ru": "ФИО"
  },
  "forms.certificateRequest.label.innKio": {
    "ru": "ИНН"
  },
  "forms.certificateRequest.label.ogrn": {
    "ru": "ОГРН"
  },
  "forms.certificateRequest.label.kpp": {
    "ru": "КПП"
  },
  "forms.certificateRequest.label.mainInfo": {
    "ru": "Основная информация"
  },
  "forms.certificateRequest.label.certInfo": {
    "ru": "Информация о сертификате"
  },
  "forms.certificateRequest.label.certificateSubject": {
    "ru": "Субъект сертификата"
  },
  "forms.certificateRequest.label.serialNumber": {
    "ru": "Серийный номер сертификата"
  },
  "forms.certificateRequest.label.certificateValidFrom": {
    "ru": "Сертификат действителен с"
  },
  "forms.certificateRequest.label.certificateValidTo": {
    "ru": "Сертификат действителен по"
  },
  "forms.certificateRequest.label.certificateIssuer": {
    "ru": "Издатель сертификата"
  },
  "forms.certificateRequest.label.thumbprint": {
    "ru": "Отпечаток сертификата"
  },
  "forms.certificateRequest.label.certificate.commonName": {
    "ru": "Общепринятое имя (CN)"
  },
  "forms.certificateRequest.label.certificate.organization": {
    "ru": "Организация (O)"
  },
  "forms.certificateRequest.label.certificate.organizationUnit": {
    "ru": "Подразделение (OU)"
  },
  "forms.certificateRequest.label.certificate.location": {
    "ru": "Населенный пункт (L)"
  },
  "forms.certificateRequest.label.certificate.country": {
    "ru": "Страна (C)"
  },
  "forms.certificateRequest.label.certificate.email": {
    "ru": "E-mail (E)"
  },
  "forms.certificateRequest.label.certificate.title": {
    "ru": "Должность (T)"
  },
  "forms.certificateRequest.label.certificate.name": {
    "ru": "Имя и отчество (G)"
  },
  "forms.certificateRequest.label.certificate.lastName": {
    "ru": "Фамилия (SN)"
  },
  "forms.signForm.selectSigner": {
    "ru": "Выберите подписанта"
  },
  "requestType.reserve": {
    "ru": "Заявка на резервирование счета"
  },
  "requestType.booking": {
    "ru": "Заявка на открытие дополнительного счета"
  },
  "requestType.newBooking": {
    "ru": "Заявка на открытие дополнительного счета и заключение ДБС"
  },
  "requestType.regdoc": {
    "ru": "Заявка на открытие первого счета"
  },
  "requestType.constitution": {
    "ru": "Соглашение «ГПБ Бизнес-Онлайн»"
  },
  "requestType.constitution2new": {
    "ru": "Заявка на предоставление доступа и полномочий сотруднику в «ГПБ Бизнес-онлайн» "
  },
  "requestType.constitution2": {
    "ru": "Конституция. Заявление 2"
  },
  "requestType.offer": {
    "ru": "Заявка на акцепт оферты к счету РКО"
  },
  "requestType.ccert": {
    "ru": "Подключение КЭП"
  },
  "requestType.free": {
    "ru": "Документ свободного формата"
  },
  "requestType.uved": {
    "ru": "Соглашение о подключении к ЛК УВЭД"
  },
  "requestType.userUved": {
    "ru": "Предоставление/изменение доступа сотруднику к ЛК УВЭД"
  },
  "requestType.lkmp": {
    "ru": "Соглашение о присоединении к онлайн-сервисам услуги Материальный пулинг"
  },
  "requestType.lkmpAccess": {
    "ru": "Предоставление/изменение доступа к онлайн-сервисам услуги Материальный пулинг"
  },
  "requestType.carLease": {
    "ru": "Заявка на автолизинг"
  },
  "requestType.corpLease": {
    "ru": "Заявка на корпоративный лизинг"
  },
  "requestType.checkPriviligeO2": {
    "ru": "Запрос на проверку полномочий на заключение ДБС с открытием 2+ счетов"
  },
  "requestType.checkPriviligeOpen": {
    "ru": "Запрос на проверку полномочий на открытие счетов по существующему ДБС"
  },
  "requestType.requestForAccountInfo": {
    "ru": "Запрос справок для ЮЛ"
  },
  "requestType.rko": {
    "ru": "Распоряжение на периодический перевод денежных средств"
  },
  "requestType.offerGenCert": {
    "ru": "Генерация НЭП"
  },
  "userNotification.dialog.title": {
    "ru": "Уведомления"
  },
  "userNotification.dialog.close": {
    "ru": "Отложить на один день"
  },
  "signDialog.detailedInfo": {
    "ru": "Подробная информация о подписываемых данных"
  },
  "signDialog.summary": {
    "ru": "Выбрано документов"
  },
  "signDialog.userCancelErrorMessage": {
    "ru": "Пользователь отказался от выполнения операции"
  },
  "signDialog.signError": {
    "@docs": "string",
    "ru": "При установке электронной подписи для документов {docs} произошла ошибка"
  },
  "labels.before": {
    "ru": "До"
  },
  "labels.yes": {
    "ru": "Да"
  },
  "labels.no": {
    "ru": "Нет"
  },
  "labels.systemError": {
    "ru": "Произошла непредвиденная ошибка"
  },
  "labels.repeatOnMoreTimeLater": {
    "ru": "Попробуйте еще раз позднее"
  },
  "modal.generateCertificate.header": {
    "ru": "Выпуск нового сертификата"
  },
  "modal.generateCertificate.endDate": {
    "ru": "Дата окончания срока действия сертификата"
  },
  "modal.generateCertificate.owner": {
    "ru": "Владелец сертификата"
  },
  "modal.generateCertificate.selectCertificateType": {
    "ru": "Выберите тип нового сертификата"
  },
  "modal.generateCertificate.options.qes": {
    "ru": "Зарегистрировать сертификат КЭП"
  },
  "modal.generateCertificate.options.qesInfo.part1": {
    "ru": "Вы можете получить сертификат Квалифицированной Электронной Подписи"
  },
  "modal.generateCertificate.options.qesInfo.part2": {
    "ru": "и зарегистрировать его в системе «ГПБ Бизнес Онлайн». Сертификат КЭП позволит Вам работать со всеми дистанционными сервисами Банка ГПБ (АО) и других коммерческих и государственных организаций."
  },
  "modal.generateCertificate.options.qesInfo.link": {
    "ru": "в стороннем аккредитованном удостоверяющем центре"
  },
  "modal.generateCertificate.options.ues": {
    "ru": "Выпустить сертификат НЭП"
  },
  "modal.generateCertificate.options.uesInfo": {
    "ru": "Удостоверяющий Центр Банка ГПБ (АО) выпустит для Вас сертификат Неквалифицированной Электронной Подписи. Сертификат НЭП позволит Вам работать со всеми дистанционными сервисами Банка ГПБ (АО). Выпуск сертификата НЭП будет происходить на странице системы Клиент-Банк.Web."
  },
  "bankClient.labels.innKio": {
    "ru": "ИНН"
  },
  "bankClient.labels.ogrn": {
    "ru": "ОГРН"
  },
  "bankClient.labels.abs": {
    "ru": "РНК"
  },
  "bankClient.labels.showPotential": {
    "ru": "Показывать потенциальных клиентов"
  },
  "components.collapsedCheckInfo.signIsValid": {
    "ru": "Подпись верна"
  },
  "components.collapsedCheckInfo.signIsNotValid": {
    "ru": "Подпись неверна"
  },
  "components.collapsedCheckInfo.certInfo.title": {
    "ru": "Сертификат ЭП"
  },
  "components.collapsedCheckInfo.certInfo.owner": {
    "ru": "Владелец ЭП:"
  },
  "components.collapsedCheckInfo.certInfo.org": {
    "ru": "Организация:"
  },
  "components.collapsedCheckInfo.certInfo.num": {
    "ru": "Номер:"
  },
  "components.collapsedCheckInfo.certInfo.creator": {
    "ru": "Издатель:"
  },
  "components.collapsedCheckInfo.certInfo.valid": {
    "ru": "Срок действия:"
  },
  "components.collapsedCheckInfo.signExtInfo.signed": {
    "ru": "Подписано:"
  },
  "components.collapsedCheckInfo.signExtInfo.date": {
    "ru": "Дата:"
  },
  "components.collapsedCheckInfo.signExtInfo.role": {
    "ru": "Роль:"
  },
  "components.collapsedCheckInfo.signExtInfo.errorCode": {
    "ru": "Код ошибки:"
  },
  "components.authority.noCertificateErrorMessage": {
    "ru": "Заявление должно быть подписано единоличным исполнительным органом организации либо лицом, доверенность на которого предоставлена в банк."
  },
  "modals.signCheckDialog.title": {
    "ru": "Проверка подписи"
  },
  "modals.signCheckDialog.showAll": {
    "ru": "Показать все"
  },
  "modals.signCheckDialog.hideAll": {
    "ru": "Скрыть все"
  },
  "userType.client": {
    "ru": "Клиент"
  },
  "userType.bank": {
    "ru": "Банк"
  },
  "userType.technical": {
    "ru": "Технический пользователь"
  },
  "filter": {
    "ru": "Фильтр"
  },
  "consent.labels.personalData": {
    "ru": "Согласен на обработку и передачу персональных данных"
  },
  "consent.labels.documentNotAvailable": {
    "ru": "Документ временно недоступен, попробуйте еще раз позднее"
  },
  "consent.approve.header": {
    "ru": "Подтверждение согласия на обработку и передачу персональных данных"
  },
  "consent.approve.message": {
    "ru": "Для перехода на сайт партнёра Банка ГПБ (АО) необходимо принять согласие на обработку и передачу персональных данных"
  },
  "consent.toggle.collapse": {
    "ru": "Свернуть текст согласия"
  },
  "consent.labels.iAgreeWithPersonalData": {
    "ru": "Я соглашаюсь с условиями на передачу персональных данных"
  },
  "consent.labels.iAgree": {
    "ru": "Я соглашаюсь с"
  },
  "consent.labels.withPersonalData": {
    "ru": "условиями на передачу персональных данных"
  },
  "consent.labels.iAccept": {
    "ru": "Я принимаю"
  },
  "consent.labels.acceptWithPersonalData": {
    "ru": "условия соглашения на обработку и передачу данных"
  },
  "selectedDocumentsInfo": {
    "@selected": "num",
    "@total": "num",
    "ru": {
      "selected === 0": "Документы не выбраны",
      "selected === 1": "Выбран 1 документ из {total}",
      "selected > 1 && selected < 5": "Выбрано {selected} документа из {total}",
      "selected >= 5": "Выбрано {selected} документов из {total}"
    }
  },
  "serviceUnavailable.header": {
    "ru": "Сервис временно недоступен"
  },
  "serviceUnavailable.techWork": {
    "ru": "Проводятся технические работы. Попробуйте обратиться к сервису немного позже."
  },
  "serviceUnavailable.sorry": {
    "ru": "Приносим извинения за доставленные неудобства."
  },
  "confirmSpoForm.commentForClient": {
    "ru": "Комментарий для клиента"
  },
  "cryptoInstaller.title": {
    "ru": "Установка подписи"
  },
  "cryptoInstaller.checkSignTitle": {
    "ru": "Проверка подписи"
  },
  "cryptoInstaller.header": {
    "ru": "Для работы с ЭП не удалось обнаружить необходимое ПО или его версия устарела."
  },
  "cryptoInstaller.content": {
    "ru": "Нажмите кнопку «Установить ПО» для возможности работы с ЭП. Если ПО уже установлено, убедитесь, что оно запущено и нажмите кнопку «Продолжить»."
  },
  "cryptoInstaller.actions.installApp": {
    "ru": "Установить ПО"
  },
  "cryptoInstaller.actions.cancel": {
    "ru": "Отмена"
  },
  "products.constitution": {
    "ru": "Соглашение о присоединении к ГПБ БО"
  },
  "products.lkMp": {
    "ru": "Соглашение о подключении сервиса материального пулинга"
  },
  "products.lkUved": {
    "ru": "Соглашение о подключении сервиса внешнеэкономической деятельности"
  },
  "conferenceModal.clients": {
    "ru": "Уважаемые клиенты!"
  },
  "conferenceModal.info1": {
    "ru": "Приглашаем принять участие в"
  },
  "conferenceModal.info2": {
    "ru": "онлайн-конференции"
  },
  "conferenceModal.info3": {
    "ru": "Банка ГПБ (АО) на тему: Актуальные вопросы и изменения законодательства Российской Федерации в области валютного регулирования и валютного контроля"
  },
  "conferenceModal.date": {
    "ru": "28 мая 2021, 9:30 (МСК)"
  },
  "conferenceModal.program": {
    "ru": "Программа конференции"
  },
  "conferenceModal.greetingTime": {
    "ru": "09:30–09:40"
  },
  "conferenceModal.greeting": {
    "ru": "Приветственное слово"
  },
  "conferenceModal.greetingSpeaker": {
    "ru": "Владимир Бусько, Первый Вице-Президент Банка ГПБ (АО)"
  },
  "conferenceModal.legislationTime": {
    "ru": "09:40–11:00"
  },
  "conferenceModal.legislation": {
    "ru": "Обзор изменений законодательства Российской Федерации в области валютного регулирования и валютного контроля"
  },
  "conferenceModal.legislationSpeaker": {
    "ru": "Елена Шакина, заместитель Директора Департамента финансового мониторинга и валютного контроля Центрального банка Российской Федерации"
  },
  "conferenceModal.practiceTime": {
    "ru": "11:00–11:30"
  },
  "conferenceModal.practice": {
    "ru": "Практические вопросы сопровождения валютных операций в Банке ГПБ (АО). Личный кабинет участника ВЭД – текущие возможности и планы развития"
  },
  "conferenceModal.practiceSpeaker": {
    "ru": "Представители Департамента сопровождения валютных операций Банка ГПБ (АО)"
  },
  "conferenceModal.questionTime": {
    "ru": "11:30–12:00"
  },
  "conferenceModal.question": {
    "ru": "Сессия вопросов и ответов"
  },
  "conferenceModal.questionSpeaker": {
    "ru": "Представители Департамента сопровождения валютных операций Банка ГПБ (АО)"
  },
  "conferenceModal.conference": {
    "ru": "Конференция Банка ГПБ (АО). Контактный телефон: +7 495 719-19-32"
  },
  "changeStatusDialog.header": {
    "ru": "Изменить статус документа"
  },
  "changeStatusDialog.currentStatusLabel": {
    "ru": "Статус"
  },
  "changeStatusDialog.newStatusLabel": {
    "ru": "Новый статус"
  },
  "changeStatusDialog.selectPlaceholder": {
    "ru": "Выберите из списка"
  },
  "changeStatusDialog.buttons.set": {
    "ru": "Установить"
  },
  "changeStatusDialog.buttons.cancel": {
    "ru": "Отмена"
  },
  "changeStatusDialog.commentForClientLabel": {
    "ru": "Комментарий для Клиента"
  },
  "changeStatusDialog.commentForBankLabel": {
    "ru": "Комментарий для Банка"
  },
  "changeStatusDialog.emptyField": {
    "@fieldName": "string",
    "ru": "Реквизит \"{fieldName}\" является обязательным для заполнения, не может быть пустым"
  },
  "generateCertificate.certFileLoadError": {
    "ru": "Не удалось загрузить данные сертификата"
  },
  "historyDialog.header": {
    "@number": "number",
    "@date": "string",
    "ru": "История изменений заявки № {number} от {date, date}"
  },
  "historyDialog.date": {
    "ru": "Дата и время установки статуса"
  },
  "historyDialog.status": {
    "ru": "Статус"
  },
  "historyDialog.userType": {
    "ru": "Тип пользователя"
  },
  "historyDialog.userName": {
    "ru": "ФИО пользователя"
  },
  "historyDialog.infoForClient": {
    "ru": "Комментарий для клиента"
  },
  "historyDialog.infoForBank": {
    "ru": "Комментарий для банка"
  },
  "historyDialog.technicalUserType": {
    "ru": "Автомат"
  },
  "historyDialog.bankUserType": {
    "ru": "Операционист"
  },
  "historyDialog.hint.userType.client": {
    "ru": "Пользователь клиента"
  },
  "historyDialog.hint.userType.bank": {
    "ru": "Сотрудник Банка"
  },
  "historyDialog.hint.userType.technical": {
    "ru": "Автоматическая операция"
  },
  "outdatedCryptomoduleDialog.header": {
    "ru": "Криптографический модуль не установлен или его версия устарела"
  },
  "outdatedCryptomoduleDialog.content": {
    "ru": "Для продолжения работы необходимо установить актуальную версию"
  },
  "outdatedCryptomoduleDialog.cancel": {
    "ru": "Отмена"
  },
  "outdatedCryptomoduleDialog.install": {
    "ru": "Перейти к установке"
  },
  "dboInformationDialog.header": {
    "ru": "Уважаемый клиент!"
  },
  "dboInformationDialog.content1": {
    "ru": "Пользовательский интерфейс Клиент-Банк переведён на новую технологическую платформу ГПБ Бизнес-Онлайн. Старый интерфейс системы Клиент-Банк технически устарел и не отвечает требованиям по добавлению новой функциональности, в том числе, по осуществлению платежей, удобству использования, повышению скорости работы и общей безопасности."
  },
  "dboInformationDialog.content2": {
    "ru": "Старая версия Клиент-Банка со временем будет отключена, сейчас производится поэтапное переключение всех клиентов на новую версию. Понимаем, что новое часто бывает непривычным, поэтому будем рады Вашим комментариям и пожеланиям, чтобы учесть их в разработке. Экосистема ГПБ Бизнес-онлайн вместе с новым интерфейсом Клиент-Банка будет развиваться и совершенствоваться."
  },
  "dboInformationDialog.viewDocuments": {
    "ru": "Посмотреть документы"
  },
  "dboInformationDialog.mainPageFeatures.header": {
    "ru": "На главной странице уже доступны:"
  },
  "dboInformationDialog.mainPageFeatures.feature1": {
    "ru": "создание платежного поручения в один клик;"
  },
  "dboInformationDialog.mainPageFeatures.feature2": {
    "ru": "запрос выписки по счёту;"
  },
  "dboInformationDialog.mainPageFeatures.feature3": {
    "ru": "поиск платежа в истории и его повтор в одно нажатие."
  },
  "dboInformationDialog.gboFeatures.header": {
    "ru": "В ГПБ Бизнес-Онлайн Вам также доступны:"
  },
  "dboInformationDialog.gboFeatures.feature1": {
    "ru": "онлайн открытие второго и последующих расчётных счетов;"
  },
  "dboInformationDialog.gboFeatures.feature2": {
    "ru": "открытие специальных счетов участников закупок и счетов по гособоронзаказу;"
  },
  "dboInformationDialog.gboFeatures.feature3": {
    "ru": "просмотр и оплата задолженностей и штрафов от ФНС;"
  },
  "dboInformationDialog.gboFeatures.feature4": {
    "ru": "просмотр блокировок по счетам компании, поступившие от операторов электронных торговых площадок;"
  },
  "dboInformationDialog.gboFeatures.feature5": {
    "ru": "получение электронных банковских гарантий в режиме онлайн;"
  },
  "dboInformationDialog.gboFeatures.feature6": {
    "ru": "и многое другое."
  },
  "dboInformationDialog.feedback.header": {
    "ru": "Первые клиенты уже оценили удобство и скорость работы с новым интерфейсом ГПБ Бизнес-Онлайн"
  },
  "dboInformationDialog.feedback.part1Bold": {
    "ru": "Теперь хотим узнать ваше мнение!"
  },
  "dboInformationDialog.feedback.part2": {
    "ru": "Напишите нам если возникли проблемы, на почту:"
  },
  "dboInformationDialog.feedback.part3": {
    "ru": "или позвоните по телефону:"
  },
  "dboInformationDialog.feedback.info": {
    "ru": "Вы также можете перейти в прежний интерфейс по кнопке «Клиент Банк», расположенной в меню слева."
  },
  "dboInformationDialog.ending.part1": {
    "ru": "Мы постоянно работаем над улучшением и будем держать Вас в курсе новинок!"
  },
  "dboInformationDialog.ending.part2": {
    "ru": "Ваш Газпромбанк"
  },
  "dboInformationDialog.dontShowAgain": {
    "ru": "Больше не показывать"
  },
  "guardRouter.errors.mfa.message": {
    "ru": "Для доступа к функционалу войдите в систему с использованием сертификата электронной подписи"
  },
  "guardRouter.errors.authority.message": {
    "ru": "Недостаточно полномочий для использования сервиса"
  },
  "guardRouter.errors.allClientEco.title": {
    "ru": "Сервис недоступен."
  },
  "guardRouter.errors.allClientEco.message": {
    "ru": "Если вы хотите стать клиентом банка, то вам необходимо открыть счет.\nЕсли вы уже являетесь действующим клиентом банка, то вам необходимо авторизоваться с логином и паролем, используемыми для входа в систему \"Клиент-Банк.WEB\", или зарегистрировать сертификат КЭП в профиле пользователя"
  },
  "guardRouter.errors.allClientDbo.message": {
    "ru": "Недостаточно полномочий для использования сервиса"
  },
  "guardRouter.errors.potentialClientEco.title": {
    "ru": "Сервис не доступен для выбранной организации."
  },
  "guardRouter.errors.potentialClientEco.message": {
    "ru": "Если вы хотите стать клиентом банка, то вам необходимо открыть счет.\nЕсли вы уже являетесь действующим клиентом банка, то вам необходимо авторизоваться с логином и паролем, используемыми для входа в систему \"Клиент-Банк.WEB\", или зарегистрировать сертификат КЭП в профиле пользователя"
  },
  "guardRouter.errors.potentialClientDbo.message": {
    "ru": "Для работы с сервисом вам необходимо открыть счет для выбранной организации или выбрать другую организацию."
  },
  "guardRouter.errors.activeClientEco.message": {
    "ru": "Для работы с сервисом под выбранной организацией вам необходимо заключить Соглашения об использовании системы электронного документооборота \"ГПБ Бизнес-Онлайн\", Соглашение на использование системы «ГПБ Бизнес-онлайн» может быть подписано уполномоченным лицом организации имеющим ЭП зарегистрированную в Банке, или авторизоваться с логином и паролем, используемыми для входа в систему \"Клиент-Банк.WEB\"."
  },
  "guardRouter.errors.activeClientDbo.message": {
    "ru": "Недостаточно полномочий для использования сервиса под выбранной организацией. Выберите другую организацию"
  },
  "guardRouter.errors.activeClientConstitutionEco.message": {
    "ru": "Недостаточно полномочий для использования сервиса под выбранной организацией. Выберите другую организацию или авторизуйтесь с логином и паролем, используемыми для входа в систему \"Клиент-Банк.WEB\""
  },
  "guardRouter.errors.activeClientConstitutionDbo.message": {
    "ru": "Недостаточно полномочий для использования сервиса под выбранной организацией. Выберите другую организацию"
  },
  "guardRouter.errors.consultant.message": {
    "@code": "str",
    "ru": "При необходимости получения консультации, обратитесь в Банк по номеру телефона 8(800)100-11-89 с кодом ошибки: {code}"
  }
}
