{
    "fyrstOrderStates": {
        "label": "Status management",
        "labels": {
            "name": "Name",
            "technicalName": "Technical name",
            "stateGroup": "Status category"
        },
        "action": {
            "create": "Create",
            "edit": "Edit",
            "save": "Save",
            "cancel": "Cancel",
            "delete": "Delete",
            "newStateMachineState": "New status"
        },

        "messages": {
            "saveError": "Status could not be saved." , 
            "saveSuccess": "Status has been saved."  
        },
        "overview": {
            "restrictDelete": {
                "hasLinkedOrders": "This status has assigned orders and cannot be removed."
            },
            "deleteModalTitle": "Delete status",
            "deleteModalConfirmation": "Do you really want to delete this status?<br/>This action cannot be undone."
        }
    }
}