 NOTA 4,7


==================================
1.
5.0
- BUEN TRABAJO!!
- Recuerda NO definir métodos antes de __name__ == "__main__" (solo en casos extremos)
==================================
2.

4.6
-Recuerda NO definir variables antes de ___name__ == "__main__" _ (solo en casos extremos) 
-Muy bueno el gif 
-En el PDF no se presente la solución de problema

