NOTA 3,2


==================================
1.
4.5
- Favor revisar cada kernel, no es lo esperado en cada plot.
- EL ajuste esta por encima de los datos
==================================
2.

1.0
- Solo veo el inicio del modelo de Ising


==================================
3.
----------------------------------
p1
5.0
- BUEN TRABAJO!!
