NOTA 2,75



==================================
1.
5.0
BUEN TRABAJO!!
==================================

2.

2
- Faltan muchas variables

==================================
3.
----------------------------------
p1

3.5
- No ejecuta
- tienes buen código
----------------------------------
p2

2
- No ejecuta
==================================
4.
5
- BUEN TRABAJO!!