NOTA 4,8



==================================
1.
5.0
BUEN TRABAJO!!
==================================

2.

4,5
- el tRecorrido  esta bueno, sin embargo el plot va hasta 3.5.. why?

==================================
3.
----------------------------------
p1

5
- buen trabajo
----------------------------------
p2

5
- Buen trabajo
==================================
4.
5
- BUEN TRABAJO!!