%!PS-Adobe-3.0 EPSF-3.0
%%CreationDate: Fri Nov 30 06:00:38 2007
%%LanguageLevel: 3
%%BoundingBox: 98 3 317 59
%%EndComments
/mt { moveto } def
/ct { curveto } def
/lt { lineto } def
/np { newpath } def
/cp { closepath } def
/sc { setrgbcolor } def
/er { fill } def
/lw { setlinewidth } def
np
0.0 63.0 mt
340.0 63.0 lt
340.0 0.0 lt
0.0 0.0 lt
0.0 63.0 lt
cp
0.996 0.996 0.996 sc
er
np
211.1 59.0 mt
211.9 58.4 212.7 57.9 213.4 57.1 ct
211.2 54.5 208.9 52.0 206.0 50.4 ct
206.8 50.3 208.3 50.2 209.1 50.1 ct
210.7 48.2 207.5 46.9 207.1 45.4 ct
209.5 46.0 214.0 48.3 215.5 45.2 ct
213.7 42.0 210.0 40.7 206.9 39.1 ct
205.5 38.3 204.2 37.6 202.9 36.8 ct
204.2 38.3 205.7 39.7 206.6 41.5 ct
202.8 40.5 198.5 39.1 197.1 35.0 ct
196.2 36.5 195.3 38.1 194.3 39.6 ct
196.3 37.8 198.5 38.7 200.6 39.9 ct
200.0 40.5 199.4 41.1 198.8 41.7 ct
198.7 42.3 198.5 43.6 198.4 44.2 ct
197.6 45.3 196.8 46.5 196.1 47.6 ct
197.5 46.5 198.6 45.1 199.7 43.7 ct
200.5 42.9 201.2 42.2 201.9 41.5 ct
202.6 41.8 203.9 42.4 204.5 42.7 ct
205.7 45.1 206.8 47.5 207.9 50.0 ct
206.3 49.6 204.8 49.0 203.2 48.6 ct
206.6 51.3 209.9 54.6 211.1 59.0 ct
cp
0.082 0.090 0.094 sc
er
np
307.4 57.3 mt
308.2 57.3 309.6 57.3 310.3 57.3 ct
310.1 56.1 309.6 54.9 309.1 53.7 ct
308.5 54.9 308.0 56.1 307.4 57.3 ct
cp
0.082 0.090 0.094 sc
er
np
273.2 57.0 mt
273.2 56.1 273.2 55.2 273.3 54.4 ct
274.8 54.6 276.3 54.7 277.8 54.8 ct
278.2 51.8 275.0 50.5 273.6 48.4 ct
273.1 46.7 272.6 45.0 272.2 43.3 ct
273.5 43.8 274.8 44.4 276.2 44.9 ct
275.3 42.7 273.4 41.3 271.9 39.5 ct
273.1 40.0 275.7 40.8 276.9 41.3 ct
275.3 39.2 272.0 38.2 272.2 35.0 ct
276.3 36.4 280.0 38.7 284.0 40.5 ct
282.7 36.6 278.0 35.2 275.2 32.6 ct
275.4 31.7 275.6 30.8 275.8 29.9 ct
274.9 29.7 273.3 29.3 272.5 29.1 ct
274.1 28.3 275.7 27.4 277.2 26.4 ct
277.9 27.7 278.6 28.9 279.2 30.2 ct
279.3 31.0 279.5 32.7 279.6 33.6 ct
282.0 31.0 279.9 27.9 278.3 25.5 ct
277.2 24.0 275.8 22.4 273.8 22.2 ct
272.2 22.1 271.9 23.9 271.0 24.8 ct
272.8 24.3 274.6 23.9 276.4 24.6 ct
275.7 25.1 274.4 26.0 273.7 26.5 ct
272.8 26.0 271.9 25.6 270.9 25.1 ct
270.0 25.0 268.2 24.7 267.3 24.5 ct
268.2 26.3 269.6 27.6 271.1 28.9 ct
272.2 30.3 273.3 31.7 274.4 33.0 ct
274.5 33.6 274.8 34.7 275.0 35.3 ct
273.4 34.1 271.9 32.9 270.4 31.6 ct
269.2 30.7 267.8 30.3 266.4 30.0 ct
266.4 30.4 266.3 31.0 266.2 31.3 ct
267.4 31.6 268.5 31.9 269.7 32.2 ct
270.2 32.6 271.3 33.5 271.8 33.9 ct
271.4 35.5 270.6 36.9 269.5 38.0 ct
269.8 38.3 270.3 38.9 270.6 39.2 ct
270.9 40.7 271.3 42.2 271.8 43.6 ct
269.7 43.9 lt
268.1 40.8 265.6 38.3 263.5 35.6 ct
262.4 35.6 259.8 34.7 260.3 36.6 ct
263.3 39.1 267.7 40.3 269.2 44.2 ct
269.8 44.2 270.9 44.3 271.4 44.4 ct
271.2 48.7 271.8 52.9 273.2 57.0 ct
cp
0.082 0.090 0.094 sc
er
np
291.5 34.4 mt
294.4 42.0 298.5 49.0 301.1 56.7 ct
301.5 56.2 302.3 55.3 302.7 54.8 ct
302.4 54.6 301.8 54.4 301.5 54.2 ct
302.0 52.9 302.5 51.7 302.9 50.4 ct
302.5 50.7 301.5 51.3 301.0 51.6 ct
299.6 49.8 298.1 48.0 296.7 46.1 ct
298.2 46.4 299.6 46.8 301.1 47.2 ct
301.2 45.6 301.3 44.1 301.4 42.5 ct
302.9 43.5 305.1 43.8 305.9 45.6 ct
306.6 45.4 lt
306.5 46.6 lt
307.1 46.3 lt
308.4 48.7 310.4 50.5 312.3 52.3 ct
313.2 52.6 315.1 53.2 316.0 53.5 ct
315.3 51.4 314.4 49.4 313.4 47.5 ct
313.4 48.7 313.5 51.2 313.5 52.4 ct
311.8 50.6 310.1 48.8 308.2 47.1 ct
308.2 45.8 308.2 43.1 308.2 41.8 ct
309.8 42.8 311.0 44.1 311.9 45.8 ct
312.5 45.3 313.0 44.8 313.6 44.3 ct
312.0 42.1 311.4 39.4 311.2 36.7 ct
311.8 36.3 313.0 35.6 313.6 35.3 ct
313.4 34.3 313.2 33.3 313.1 32.4 ct
311.9 32.6 309.7 32.9 308.6 33.1 ct
309.6 32.8 311.6 32.3 312.6 32.0 ct
312.6 31.3 lt
312.1 31.1 311.1 30.8 310.7 30.7 ct
311.3 30.6 312.6 30.6 313.2 30.5 ct
314.6 29.2 lt
312.7 28.6 310.8 28.0 308.9 27.5 ct
309.2 28.8 309.5 30.2 309.8 31.6 ct
309.2 31.4 308.2 31.1 307.7 30.9 ct
307.2 28.0 308.1 25.2 308.4 22.3 ct
307.9 22.4 306.9 22.5 306.4 22.6 ct
306.5 29.6 305.9 36.7 306.8 43.7 ct
304.7 43.5 lt
304.6 40.5 304.8 37.6 304.6 34.7 ct
302.8 34.2 301.0 33.7 299.1 33.3 ct
300.0 34.8 301.2 36.1 302.6 37.2 ct
301.8 38.6 lt
299.5 37.0 297.6 34.8 297.8 31.8 ct
297.0 30.1 299.3 28.9 298.7 27.3 ct
298.1 27.0 296.9 26.4 296.3 26.2 ct
297.2 30.7 294.9 36.1 297.9 40.1 ct
298.2 39.6 298.7 38.5 299.0 38.0 ct
300.2 39.1 301.2 40.3 302.0 41.7 ct
301.2 41.6 299.6 41.3 298.7 41.1 ct
299.7 42.0 300.5 43.0 300.9 44.3 ct
299.9 44.2 297.8 44.2 296.8 44.2 ct
296.5 43.7 296.0 42.7 295.7 42.2 ct
294.4 39.5 293.7 36.5 291.5 34.4 ct
cp
0.082 0.090 0.094 sc
er
np
149.0 51.0 mt
150.3 52.5 151.5 54.2 152.6 55.9 ct
152.6 55.3 152.6 53.9 152.6 53.3 ct
151.2 53.4 lt
151.8 51.2 lt
153.4 52.2 155.5 55.4 156.6 52.1 ct
151.5 50.2 146.3 47.9 143.3 43.0 ct
146.2 42.9 148.1 45.2 150.3 46.7 ct
151.1 45.6 151.9 44.5 152.7 43.3 ct
149.6 40.9 147.0 37.9 144.6 34.8 ct
147.0 35.9 149.1 37.3 151.4 38.6 ct
151.7 38.3 152.2 37.6 152.5 37.3 ct
150.7 36.0 148.9 34.6 147.4 33.0 ct
148.6 32.5 149.8 31.9 151.0 31.3 ct
150.8 31.0 150.4 30.3 150.2 30.0 ct
148.2 28.9 146.2 27.8 144.3 26.5 ct
144.1 23.9 144.3 21.3 144.1 18.7 ct
142.6 20.4 142.4 22.7 142.3 24.9 ct
141.4 25.3 140.5 25.6 139.6 26.0 ct
142.9 26.4 142.4 29.4 142.3 31.8 ct
141.7 31.4 140.5 30.6 139.9 30.1 ct
138.0 28.7 136.1 26.3 133.5 27.6 ct
136.3 29.7 140.7 30.6 141.9 34.2 ct
142.1 35.2 142.6 37.4 142.9 38.4 ct
139.6 36.4 136.6 33.5 132.6 33.2 ct
134.4 34.5 136.4 35.6 138.1 37.1 ct
139.5 37.6 141.0 38.2 142.5 38.7 ct
142.5 40.5 142.5 42.3 142.4 44.1 ct
143.9 45.3 145.3 46.5 146.3 48.1 ct
144.9 47.6 143.5 47.0 142.1 46.4 ct
140.7 43.7 137.2 43.9 134.7 42.6 ct
134.6 43.0 134.4 43.7 134.3 44.0 ct
136.3 44.7 138.4 45.5 140.4 46.2 ct
140.6 47.9 140.7 49.6 140.8 51.2 ct
141.1 49.8 141.4 48.4 141.7 47.0 ct
143.5 47.6 145.2 48.2 147.0 48.9 ct
147.7 49.6 148.3 50.3 149.0 51.0 ct
cp
0.082 0.090 0.094 sc
er
np
118.4 51.1 mt
118.6 52.2 118.9 54.6 119.1 55.7 ct
119.4 53.5 119.3 51.3 119.3 49.1 ct
121.1 50.1 121.9 51.8 121.6 53.9 ct
122.4 52.8 123.8 51.9 123.8 50.4 ct
122.3 48.6 120.2 47.5 118.2 46.3 ct
118.3 45.1 118.4 44.0 118.5 42.8 ct
118.1 42.0 117.3 40.4 116.9 39.5 ct
116.4 40.1 115.9 40.6 115.4 41.1 ct
115.4 39.4 115.5 37.7 115.3 36.0 ct
116.8 38.2 118.7 40.2 121.2 41.1 ct
120.4 39.1 118.9 37.6 117.5 36.0 ct
118.1 35.9 119.3 35.8 119.9 35.7 ct
118.5 30.6 119.5 25.3 119.7 20.0 ct
117.4 19.9 116.2 21.7 114.9 23.3 ct
115.7 23.3 117.1 23.3 117.9 23.2 ct
117.4 24.6 116.8 26.0 116.3 27.4 ct
115.9 27.5 115.1 27.7 114.7 27.9 ct
114.3 25.0 113.8 22.2 113.3 19.4 ct
112.8 19.5 111.9 19.6 111.4 19.6 ct
112.0 23.1 112.9 26.6 113.9 30.0 ct
114.3 31.0 115.1 32.9 115.5 33.9 ct
114.6 33.9 112.8 33.8 111.8 33.7 ct
112.5 35.0 113.2 36.5 114.7 37.0 ct
114.5 38.3 114.2 39.6 114.0 40.9 ct
114.3 41.5 114.9 42.5 115.2 43.0 ct
115.3 45.5 116.6 47.5 117.6 49.6 ct
117.6 50.3 117.6 51.7 117.5 52.4 ct
118.4 51.1 lt
cp
0.082 0.090 0.094 sc
er
np
48.0 51.0 mt
53.5 53.8 59.9 54.5 65.9 53.0 ct
66.9 52.7 67.9 52.3 68.9 51.9 ct
70.3 51.3 71.6 50.6 72.9 49.9 ct
76.7 47.0 79.9 43.3 82.0 39.0 ct
82.3 37.9 82.7 36.9 83.1 35.9 ct
84.0 31.7 83.9 27.3 83.1 23.1 ct
80.6 15.0 74.0 8.4 65.9 5.9 ct
61.7 5.1 57.3 5.1 53.1 5.9 ct
51.4 6.6 49.7 7.3 48.1 8.0 ct
44.5 10.0 41.6 13.0 39.1 16.1 ct
35.3 22.3 33.9 30.1 36.4 37.1 ct
38.3 43.0 42.8 47.8 48.0 51.0 ct
cp
0.082 0.090 0.094 sc
er
np
51.1 51.1 mt
52.1 51.5 53.1 51.8 54.1 52.2 ct
60.2 53.1 66.7 52.5 72.0 48.9 ct
80.4 43.7 84.6 32.8 81.8 23.2 ct
81.3 21.8 80.7 20.3 80.2 18.8 ct
78.6 16.5 76.8 14.3 75.1 12.2 ct
73.8 13.5 72.4 14.7 72.0 16.5 ct
71.5 16.1 71.0 15.7 70.5 15.3 ct
70.5 15.0 70.5 14.4 70.5 14.1 ct
71.7 13.1 72.7 12.0 73.8 10.9 ct
67.8 7.2 60.5 5.1 53.5 7.1 ct
50.6 8.0 48.0 9.6 45.2 10.9 ct
46.3 12.0 47.3 13.0 48.3 14.1 ct
48.2 14.5 lt
48.6 14.6 49.3 14.8 49.6 14.9 ct
48.6 15.6 47.6 16.3 46.6 16.9 ct
46.6 16.3 46.6 15.1 46.6 14.5 ct
45.7 13.8 44.7 13.0 43.8 12.3 ct
43.4 12.8 42.6 14.0 42.3 14.5 ct
41.7 14.5 lt
40.8 16.0 39.8 17.5 38.8 19.0 ct
34.7 27.1 35.9 37.2 41.6 44.3 ct
43.0 45.6 44.4 46.9 45.8 48.2 ct
47.6 49.2 49.3 50.1 51.1 51.1 ct
cp
0.996 0.996 0.996 sc
er
np
236.1 45.3 mt
241.3 48.2 246.6 52.6 252.9 51.5 ct
251.9 47.1 250.8 42.6 251.4 38.0 ct
251.4 33.7 252.9 28.6 250.2 24.8 ct
248.5 22.4 245.9 24.2 244.1 25.4 ct
245.8 25.3 247.5 25.3 249.2 25.3 ct
250.0 32.3 248.8 39.4 250.0 46.4 ct
250.1 47.9 251.2 49.7 249.8 50.9 ct
244.7 50.9 241.0 46.4 236.1 45.3 ct
cp
0.082 0.090 0.094 sc
er
np
54.3 49.9 mt
57.4 50.6 60.6 50.3 63.8 50.5 ct
63.1 49.5 lt
65.6 49.6 67.9 48.7 70.2 48.1 ct
69.6 47.5 69.0 46.9 68.3 46.3 ct
68.1 46.9 67.6 48.0 67.3 48.6 ct
64.5 48.7 61.6 48.8 58.7 48.6 ct
60.6 47.6 62.6 46.7 64.0 45.0 ct
65.1 44.3 66.1 43.7 67.1 43.1 ct
68.8 35.3 68.5 27.3 70.6 19.6 ct
70.9 19.3 71.4 18.6 71.7 18.2 ct
68.2 19.2 64.9 17.9 62.0 16.0 ct
61.0 15.1 60.1 14.3 59.1 13.4 ct
58.5 14.3 57.9 15.2 57.3 16.0 ct
54.4 17.8 51.1 19.3 47.6 18.2 ct
48.2 19.8 48.7 21.4 49.2 23.1 ct
49.5 24.7 49.8 26.2 50.3 27.8 ct
50.5 33.3 50.5 39.0 52.8 44.2 ct
53.3 44.3 54.4 44.6 55.0 44.7 ct
56.0 46.4 58.8 47.5 57.6 49.9 ct
54.3 50.0 52.1 46.4 48.7 47.5 ct
50.5 48.5 52.3 49.2 54.3 49.9 ct
cp
0.082 0.090 0.094 sc
er
np
100.6 50.7 mt
101.6 49.9 104.2 49.7 103.8 48.1 ct
103.8 46.2 101.6 47.4 100.6 47.4 ct
100.6 48.5 100.6 49.6 100.6 50.7 ct
cp
0.082 0.090 0.094 sc
er
np
274.7 46.2 mt
276.0 48.7 278.3 51.0 281.4 50.8 ct
279.5 48.7 277.0 47.6 274.7 46.2 ct
cp
0.082 0.090 0.094 sc
er
np
175.4 42.3 mt
175.5 44.7 176.1 47.1 177.0 49.4 ct
178.4 46.8 177.1 43.8 175.6 41.5 ct
175.6 40.8 175.6 39.2 175.7 38.5 ct
177.1 39.6 178.2 41.0 179.1 42.6 ct
179.7 42.1 180.2 41.5 180.8 41.0 ct
178.9 38.9 176.9 36.8 174.5 35.2 ct
173.2 29.5 168.9 24.0 163.1 22.4 ct
167.5 25.0 170.3 29.3 172.4 33.9 ct
170.4 33.7 168.4 33.3 166.4 33.5 ct
166.6 35.4 169.7 35.0 171.0 35.9 ct
171.7 36.0 173.0 36.4 173.6 36.6 ct
174.3 38.5 174.6 40.4 174.8 42.3 ct
175.4 42.3 lt
cp
0.082 0.090 0.094 sc
er
np
46.3 45.7 mt
47.0 48.4 47.2 45.5 47.6 44.9 ct
47.3 44.6 46.6 44.1 46.2 43.8 ct
46.0 43.5 45.5 42.9 45.3 42.6 ct
44.9 42.6 44.1 42.8 43.8 42.9 ct
42.2 39.2 39.7 35.7 40.1 31.4 ct
39.5 31.5 38.4 31.6 37.8 31.6 ct
38.4 32.2 39.0 32.8 39.6 33.4 ct
39.4 35.1 39.6 36.7 40.8 38.0 ct
40.6 38.2 40.4 38.8 40.3 39.1 ct
42.7 39.6 42.7 42.5 43.8 44.3 ct
44.6 44.8 45.4 45.2 46.3 45.7 ct
cp
0.082 0.090 0.094 sc
er
np
70.7 45.4 mt
70.3 46.8 70.7 47.3 72.2 47.0 ct
72.7 45.7 72.2 45.1 70.7 45.4 ct
cp
0.373 0.376 0.380 sc
er
np
240.3 41.3 mt
239.8 44.5 242.3 46.2 245.0 47.1 ct
243.9 46.0 242.8 44.9 241.6 43.9 ct
241.6 41.6 241.5 39.3 241.0 37.1 ct
243.2 37.8 245.4 38.6 247.7 39.0 ct
246.0 35.8 244.7 32.4 243.4 28.9 ct
241.8 29.8 239.5 28.9 238.4 30.6 ct
237.5 30.8 236.5 31.0 235.6 31.3 ct
236.4 31.3 238.0 31.4 238.7 31.4 ct
238.7 32.6 238.6 34.9 238.6 36.1 ct
236.9 35.5 235.3 34.9 233.6 34.3 ct
233.6 33.2 lt
233.1 33.4 232.2 33.7 231.8 33.9 ct
234.9 35.3 238.5 36.1 240.2 39.4 ct
239.5 39.4 238.0 39.4 237.2 39.3 ct
237.2 40.5 237.3 41.6 237.3 42.7 ct
238.3 42.2 239.3 41.7 240.3 41.3 ct
cp
0.082 0.090 0.094 sc
er
np
57.5 46.4 mt
58.9 45.1 60.5 45.5 62.0 46.4 ct
62.4 45.4 63.1 43.4 63.4 42.4 ct
60.3 42.4 57.3 42.4 54.2 42.3 ct
55.3 43.7 56.4 45.0 57.5 46.4 ct
cp
0.996 0.996 0.996 sc
er
np
207.9 45.2 mt
209.7 45.5 211.4 45.9 213.2 46.2 ct
212.7 44.5 211.4 43.3 210.1 42.3 ct
208.4 42.6 206.6 42.4 205.0 41.9 ct
205.5 43.3 206.7 44.3 207.9 45.2 ct
cp
0.996 0.996 0.996 sc
er
np
73.6 43.1 mt
73.7 43.8 73.8 44.4 73.9 45.0 ct
74.3 43.6 75.1 42.6 76.4 41.9 ct
76.1 41.9 lt
78.8 39.8 79.4 36.4 79.5 33.2 ct
79.7 33.2 80.3 33.1 80.5 33.1 ct
80.5 31.7 80.4 30.3 80.4 29.0 ct
80.2 29.0 79.8 29.2 79.5 29.2 ct
79.6 29.7 79.7 30.6 79.7 31.1 ct
79.0 32.8 78.5 34.6 78.5 36.4 ct
76.6 38.4 76.0 41.5 73.6 43.1 ct
cp
0.082 0.090 0.094 sc
er
np
107.7 41.4 mt
109.8 42.4 111.7 43.5 113.8 44.6 ct
112.2 41.3 108.9 39.7 105.8 38.0 ct
105.9 31.2 103.2 24.9 102.7 18.1 ct
101.3 18.2 100.2 19.0 99.0 19.7 ct
99.5 25.7 99.4 31.7 99.6 37.7 ct
100.5 37.3 lt
100.6 38.6 100.8 39.9 101.0 41.1 ct
101.1 40.1 101.3 38.0 101.4 37.0 ct
104.2 37.3 105.5 40.0 107.7 41.4 ct
cp
0.082 0.090 0.094 sc
er
np
227.8 41.1 mt
229.2 34.8 229.9 28.3 230.4 21.9 ct
229.4 23.4 228.3 25.0 228.4 26.9 ct
228.4 31.7 228.5 36.4 227.8 41.1 ct
cp
0.082 0.090 0.094 sc
er
np
307.6 40.6 mt
310.4 43.4 310.3 36.2 307.4 38.2 ct
307.4 38.8 307.5 40.0 307.6 40.6 ct
cp
0.996 0.996 0.996 sc
er
np
51.3 31.1 mt
51.5 34.3 51.6 37.5 52.4 40.7 ct
57.2 40.6 61.9 40.7 66.6 40.7 ct
67.4 37.7 67.6 34.6 67.8 31.5 ct
66.9 31.2 65.1 30.6 64.2 30.3 ct
64.3 31.0 64.3 32.6 64.4 33.4 ct
62.4 36.3 58.3 36.0 55.5 34.3 ct
55.5 33.7 55.4 32.3 55.4 31.6 ct
54.3 31.5 52.3 31.2 51.3 31.1 ct
cp
0.996 0.996 0.996 sc
er
np
143.8 37.5 mt
143.0 38.9 145.4 40.2 146.6 39.8 ct
146.9 38.6 145.0 36.9 143.8 37.5 ct
cp
0.996 0.996 0.996 sc
er
np
206.4 33.1 mt
208.7 34.9 209.3 39.4 213.1 37.6 ct
210.7 34.2 207.3 31.9 203.6 30.2 ct
203.4 29.9 202.8 29.1 202.6 28.8 ct
202.7 29.4 202.8 30.7 202.9 31.4 ct
201.1 31.3 199.4 31.3 197.6 31.4 ct
200.0 32.7 202.7 33.6 205.4 34.7 ct
205.7 35.2 206.2 36.2 206.5 36.6 ct
206.5 35.8 206.4 34.0 206.4 33.1 ct
cp
0.082 0.090 0.094 sc
er
np
240.1 30.4 mt
239.5 33.1 240.5 36.5 243.8 36.0 ct
244.3 34.3 243.0 32.7 242.7 31.1 ct
242.0 30.9 240.7 30.5 240.1 30.4 ct
cp
0.996 0.996 0.996 sc
er
np
307.9 35.8 mt
309.5 36.5 310.0 36.0 309.4 34.3 ct
307.8 33.6 307.3 34.1 307.9 35.8 ct
cp
0.996 0.996 0.996 sc
er
np
55.7 32.6 mt
57.0 35.8 62.6 36.6 63.1 32.4 ct
60.7 32.5 58.2 32.7 55.7 32.6 ct
cp
0.996 0.996 0.996 sc
er
np
103.4 32.1 mt
102.6 33.5 102.8 34.3 104.1 34.6 ct
104.1 34.0 104.0 32.7 104.0 32.1 ct
103.4 32.1 lt
cp
0.996 0.996 0.996 sc
er
np
311.4 34.8 mt
312.0 34.2 312.0 34.2 311.4 34.8 ct
cp
0.667 0.671 0.671 sc
er
np
56.1 32.3 mt
58.5 31.7 60.9 31.1 63.3 30.5 ct
61.9 29.6 60.4 28.9 58.8 28.3 ct
57.6 29.4 56.5 30.7 56.1 32.3 ct
cp
0.996 0.996 0.996 sc
er
np
103.4 32.1 mt
104.0 32.1 lt
103.9 32.1 103.6 32.1 103.4 32.1 ct
cp
0.667 0.671 0.671 sc
er
np
144.2 28.2 mt
144.2 29.9 145.0 31.4 146.0 32.8 ct
146.7 32.0 147.3 31.3 148.0 30.6 ct
146.8 29.8 145.5 29.0 144.2 28.2 ct
cp
0.996 0.996 0.996 sc
er
np
175.0 31.3 mt
177.1 28.4 180.0 26.1 183.8 26.1 ct
182.3 25.3 180.9 23.9 179.0 24.0 ct
177.6 25.1 176.8 26.6 175.9 28.1 ct
175.6 29.1 175.2 30.2 175.0 31.3 ct
cp
0.082 0.090 0.094 sc
er
np
235.1 26.6 mt
233.2 25.9 232.5 30.2 234.0 30.8 ct
235.2 30.0 236.0 28.0 235.1 26.6 ct
cp
0.082 0.090 0.094 sc
er
np
299.8 30.4 mt
300.4 30.4 301.5 30.4 302.1 30.5 ct
303.3 29.7 302.5 27.6 301.1 28.1 ct
300.1 28.6 299.7 29.4 299.8 30.4 ct
cp
0.082 0.090 0.094 sc
er
np
37.5 29.2 mt
38.4 30.3 39.2 30.3 39.7 29.0 ct
38.9 27.9 38.1 28.0 37.5 29.2 ct
cp
0.082 0.090 0.094 sc
er
np
51.3 31.1 mt
53.9 30.9 56.1 29.8 58.2 28.4 ct
61.6 27.9 64.8 29.4 67.6 31.1 ct
68.0 29.6 68.3 28.2 68.6 26.7 ct
62.8 26.2 56.9 26.4 51.1 26.8 ct
51.2 28.3 51.2 29.7 51.3 31.1 ct
cp
0.996 0.996 0.996 sc
er
np
205.7 28.0 mt
206.9 28.1 208.2 28.3 209.5 28.4 ct
209.6 27.9 209.9 27.0 210.1 26.5 ct
208.8 25.9 207.5 25.3 206.2 24.7 ct
206.6 22.4 206.5 20.1 205.4 18.0 ct
203.5 18.6 201.7 19.3 200.0 20.3 ct
199.5 20.6 198.4 21.1 197.9 21.3 ct
200.0 21.0 202.2 20.7 204.4 20.5 ct
204.4 22.2 204.4 23.8 204.4 25.4 ct
202.8 24.7 201.3 23.7 199.7 23.2 ct
198.3 23.2 197.3 24.3 196.2 24.9 ct
197.8 25.4 199.4 25.8 201.0 26.4 ct
203.0 26.6 204.9 26.6 206.9 26.5 ct
206.6 26.8 206.0 27.6 205.7 28.0 ct
cp
0.082 0.090 0.094 sc
er
np
237.0 24.4 mt
239.5 25.7 241.8 27.2 244.5 28.1 ct
242.6 25.9 239.6 25.5 237.0 24.4 ct
cp
0.082 0.090 0.094 sc
er
np
50.6 26.6 mt
51.6 26.5 53.5 26.3 54.5 26.2 ct
54.7 25.5 54.9 24.8 55.1 24.1 ct
55.3 24.5 55.9 25.3 56.2 25.7 ct
56.5 25.8 57.1 25.9 57.4 26.0 ct
57.5 25.2 57.7 23.7 57.8 22.9 ct
55.3 22.8 52.8 22.8 50.2 22.7 ct
50.3 23.7 50.5 25.6 50.6 26.6 ct
cp
0.996 0.996 0.996 sc
er
np
58.8 23.2 mt
57.5 24.0 59.2 27.0 60.3 25.2 ct
60.6 23.8 60.1 23.2 58.8 23.2 ct
cp
0.996 0.996 0.996 sc
er
np
61.0 23.5 mt
60.2 24.4 61.5 26.7 62.5 25.4 ct
63.3 24.4 62.1 22.2 61.0 23.5 ct
cp
0.996 0.996 0.996 sc
er
np
63.4 26.1 mt
65.0 26.1 66.7 26.2 68.4 26.3 ct
68.5 25.4 68.7 23.7 68.8 22.8 ct
67.1 22.8 65.3 22.9 63.5 22.9 ct
63.5 23.7 63.4 25.3 63.4 26.1 ct
cp
0.996 0.996 0.996 sc
er
np
296.2 25.2 mt
296.5 26.7 298.4 26.4 299.6 26.2 ct
300.3 24.4 296.5 23.1 296.2 25.2 ct
cp
0.082 0.090 0.094 sc
er
np
100.3 22.9 mt
103.1 24.6 100.6 19.5 100.3 22.9 ct
cp
0.996 0.996 0.996 sc
er
np
42.7 20.1 mt
42.8 20.6 43.1 21.7 43.2 22.2 ct
43.2 21.7 43.2 20.6 43.2 20.1 ct
44.2 20.6 lt
44.6 20.1 45.4 19.2 45.8 18.7 ct
45.2 18.6 44.1 18.6 43.5 18.5 ct
43.4 18.1 43.1 17.1 43.0 16.6 ct
42.4 17.9 41.7 19.1 41.0 20.4 ct
42.7 20.1 lt
cp
0.082 0.090 0.094 sc
er
np
49.6 22.4 mt
56.2 22.5 62.8 22.8 69.4 22.4 ct
69.5 21.7 69.7 20.3 69.8 19.6 ct
67.4 19.7 65.2 18.8 63.0 17.8 ct
62.0 17.0 61.0 16.2 60.0 15.4 ct
59.1 15.4 lt
57.5 16.8 55.7 17.9 54.0 19.1 ct
52.4 19.3 50.8 19.5 49.1 19.6 ct
49.3 20.3 49.5 21.7 49.6 22.4 ct
cp
0.996 0.996 0.996 sc
er
np
75.4 20.5 mt
75.6 21.0 75.8 21.8 76.0 22.3 ct
76.1 21.8 76.3 20.7 76.4 20.2 ct
77.8 20.5 lt
77.6 19.5 77.4 18.6 77.2 17.6 ct
76.5 17.6 75.7 17.7 74.9 17.7 ct
74.5 18.1 73.6 18.8 73.2 19.2 ct
73.6 19.2 74.3 19.3 74.7 19.3 ct
74.5 20.5 lt
75.4 20.5 lt
cp
0.082 0.090 0.094 sc
er
np
66.6 12.6 mt
66.7 12.9 66.9 13.7 67.1 14.1 ct
67.2 12.7 67.4 11.2 67.6 9.8 ct
66.5 9.7 65.3 9.5 64.2 9.4 ct
64.4 9.8 64.7 10.8 64.8 11.3 ct
64.4 11.5 63.4 12.0 62.9 12.2 ct
63.8 12.3 65.7 12.5 66.6 12.6 ct
cp
0.082 0.090 0.094 sc
er
np
51.9 12.2 mt
52.3 12.4 53.2 12.7 53.6 12.9 ct
53.6 11.6 53.6 10.4 53.6 9.1 ct
52.9 9.7 52.2 10.3 51.5 10.8 ct
51.6 11.2 51.8 11.9 51.9 12.2 ct
cp
0.082 0.090 0.094 sc
er
np
100.6 11.7 mt
102.6 13.6 105.6 12.6 108.1 12.8 ct
108.2 12.5 108.4 11.9 108.5 11.6 ct
107.8 11.5 106.3 11.5 105.5 11.5 ct
105.5 8.5 105.7 5.6 105.0 2.7 ct
103.3 5.3 104.2 8.5 104.0 11.5 ct
103.1 11.5 101.4 11.6 100.6 11.7 ct
cp
0.082 0.090 0.094 sc
er
np
109.9 9.8 mt
109.5 14.2 116.7 14.1 117.2 10.0 ct
115.1 10.7 112.8 12.8 110.9 10.4 ct
112.8 9.5 114.9 9.0 116.7 7.9 ct
118.1 5.3 115.7 3.0 113.1 3.4 ct
110.8 3.2 109.8 5.5 109.5 7.4 ct
111.4 6.1 113.9 3.3 115.9 6.2 ct
114.2 7.7 110.9 7.6 109.9 9.8 ct
cp
0.082 0.090 0.094 sc
er
np
119.2 12.8 mt
119.6 12.8 120.4 12.8 120.8 12.8 ct
120.8 9.9 121.0 7.0 120.7 4.1 ct
120.3 3.9 119.6 3.6 119.2 3.4 ct
119.1 6.5 119.2 9.7 119.2 12.8 ct
cp
0.082 0.090 0.094 sc
er
np
123.4 13.0 mt
123.9 12.9 124.9 12.7 125.4 12.6 ct
126.6 10.6 127.8 8.6 129.1 6.7 ct
129.2 9.0 129.2 11.2 129.5 13.5 ct
132.0 10.6 130.6 6.2 130.2 2.8 ct
128.2 5.0 126.6 7.6 125.0 10.1 ct
125.0 8.0 125.0 5.9 125.0 3.8 ct
124.7 3.7 123.9 3.6 123.5 3.5 ct
123.5 6.6 123.5 9.8 123.4 13.0 ct
cp
0.082 0.090 0.094 sc
er
np
134.2 4.1 mt
131.0 6.6 132.3 13.5 136.9 13.1 ct
139.3 13.7 140.7 11.4 141.5 9.6 ct
139.3 10.2 136.4 13.3 134.7 10.4 ct
132.4 7.6 135.6 3.7 138.9 4.9 ct
139.1 5.4 139.5 6.4 139.7 6.9 ct
138.8 7.1 137.1 7.5 136.3 7.8 ct
137.7 8.5 139.4 8.6 141.0 8.6 ct
141.0 7.6 141.1 5.6 141.1 4.5 ct
138.9 3.7 136.4 2.8 134.2 4.1 ct
cp
0.082 0.090 0.094 sc
er
np
143.3 12.8 mt
143.6 12.8 144.3 12.8 144.7 12.8 ct
144.7 11.9 144.8 10.2 144.9 9.3 ct
146.2 9.3 147.5 9.2 148.8 9.2 ct
149.0 10.3 149.3 12.6 149.4 13.7 ct
151.5 10.7 150.1 6.8 150.5 3.5 ct
150.1 3.6 149.4 3.8 149.0 3.9 ct
149.0 5.2 149.0 6.6 149.0 8.0 ct
147.6 8.0 146.3 8.0 145.0 8.0 ct
144.8 6.2 144.7 4.4 144.0 2.6 ct
142.6 5.8 143.3 9.4 143.3 12.8 ct
cp
0.082 0.090 0.094 sc
er
np
153.0 6.9 mt
153.2 9.1 152.0 12.1 154.4 13.4 ct
154.6 10.7 154.2 7.9 155.0 5.3 ct
155.8 5.1 157.5 4.9 158.3 4.8 ct
158.7 7.4 158.7 10.1 158.8 12.8 ct
159.1 12.8 159.9 12.7 160.3 12.7 ct
160.2 10.1 160.5 7.5 159.9 5.0 ct
158.2 2.2 152.5 3.1 153.0 6.9 ct
cp
0.082 0.090 0.094 sc
er
np
165.5 13.5 mt
167.7 10.5 168.7 6.8 170.0 3.4 ct
168.3 3.7 167.5 5.3 166.7 6.7 ct
164.6 6.8 163.4 5.7 162.9 3.8 ct
162.3 3.8 161.8 3.8 161.3 3.8 ct
162.6 7.1 163.8 10.4 165.5 13.5 ct
cp
0.082 0.090 0.094 sc
er
np
175.1 5.9 mt
175.2 8.4 174.1 11.6 176.3 13.5 ct
176.6 10.7 176.3 7.9 177.0 5.1 ct
177.8 5.1 179.6 4.9 180.4 4.8 ct
180.7 7.5 180.7 10.2 180.7 12.8 ct
181.1 12.8 181.9 12.7 182.4 12.7 ct
182.2 9.6 182.9 6.1 180.9 3.5 ct
178.8 3.5 175.5 3.0 175.1 5.9 ct
cp
0.082 0.090 0.094 sc
er
np
184.6 13.4 mt
187.2 12.0 188.4 9.0 190.1 6.7 ct
190.6 8.9 189.2 12.0 191.6 13.4 ct
191.9 10.3 191.8 7.1 191.8 3.9 ct
191.5 3.8 190.7 3.6 190.4 3.4 ct
188.9 5.6 187.5 7.8 186.0 10.0 ct
186.0 7.8 186.0 5.6 185.9 3.3 ct
185.6 3.5 184.8 3.8 184.4 4.0 ct
184.5 7.1 184.5 10.3 184.6 13.4 ct
cp
0.082 0.090 0.094 sc
er
np
194.3 3.4 mt
194.7 6.7 192.8 11.0 195.5 13.4 ct
195.9 10.3 195.8 7.1 195.8 3.9 ct
195.4 3.8 194.6 3.6 194.3 3.4 ct
cp
0.082 0.090 0.094 sc
er
np
197.7 12.4 mt
198.1 12.6 198.7 12.9 199.0 13.1 ct
200.2 10.8 201.0 8.4 201.8 6.0 ct
203.1 8.6 203.2 12.2 206.1 13.5 ct
205.2 9.9 204.2 6.1 202.0 3.1 ct
199.7 5.7 198.9 9.2 197.7 12.4 ct
cp
0.082 0.090 0.094 sc
er
np
207.2 12.8 mt
209.4 12.8 211.6 12.8 213.8 12.8 ct
213.8 12.4 213.7 11.8 213.7 11.5 ct
212.1 11.5 210.5 11.5 208.9 11.5 ct
208.8 10.9 208.8 9.7 208.7 9.2 ct
210.6 9.1 212.5 9.0 214.4 8.7 ct
212.7 7.6 210.6 7.7 208.7 7.5 ct
208.7 6.9 208.8 5.7 208.8 5.0 ct
210.8 5.0 212.7 5.0 214.7 4.9 ct
212.8 2.8 209.7 4.0 207.3 3.7 ct
207.2 6.7 207.2 9.8 207.2 12.8 ct
cp
0.082 0.090 0.094 sc
er
np
216.2 12.8 mt
218.8 12.9 221.3 12.9 223.7 12.0 ct
223.6 10.3 223.1 8.7 222.0 7.3 ct
222.7 6.1 223.3 4.9 224.0 3.6 ct
223.6 3.7 222.7 3.8 222.3 3.8 ct
221.1 5.6 220.0 7.5 217.9 8.2 ct
217.9 7.1 217.8 4.9 217.8 3.8 ct
217.3 3.8 216.7 3.8 216.2 3.8 ct
216.2 6.8 216.2 9.8 216.2 12.8 ct
cp
0.082 0.090 0.094 sc
er
np
225.4 10.8 mt
226.4 14.4 232.6 13.6 232.6 9.7 ct
230.6 10.9 228.3 12.8 226.5 10.3 ct
229.0 9.3 233.9 8.6 232.3 4.7 ct
229.9 2.3 225.1 3.5 224.9 7.2 ct
226.8 6.3 228.5 4.2 230.8 5.2 ct
231.7 8.7 224.6 6.9 225.4 10.8 ct
cp
0.082 0.090 0.094 sc
er
np
234.7 12.9 mt
235.1 12.8 235.9 12.7 236.3 12.7 ct
236.3 9.4 236.5 6.0 235.7 2.8 ct
233.9 5.9 235.0 9.6 234.7 12.9 ct
cp
0.082 0.090 0.094 sc
er
np
237.4 12.5 mt
240.8 13.0 244.4 12.6 247.8 12.8 ct
248.7 11.6 249.5 10.3 250.4 9.1 ct
251.0 10.3 251.7 11.5 252.3 12.6 ct
252.9 12.7 254.0 12.8 254.5 12.9 ct
252.7 10.1 250.4 7.4 250.9 3.8 ct
250.6 3.7 250.0 3.5 249.7 3.4 ct
250.2 7.4 247.4 13.5 242.6 11.4 ct
242.5 8.6 242.6 5.7 242.2 2.9 ct
240.0 5.0 241.3 8.4 241.0 11.1 ct
239.8 11.5 238.6 11.9 237.4 12.5 ct
cp
0.082 0.090 0.094 sc
er
np
260.2 12.8 mt
260.6 12.8 261.4 12.7 261.8 12.7 ct
261.8 10.2 261.8 7.7 261.8 5.1 ct
263.5 5.1 265.1 5.0 266.8 4.8 ct
265.0 3.1 262.4 3.9 260.2 3.7 ct
260.2 6.7 260.2 9.7 260.2 12.8 ct
cp
0.082 0.090 0.094 sc
er
np
268.3 13.7 mt
270.8 10.9 269.1 6.8 269.4 3.5 ct
269.1 3.6 268.3 3.8 268.0 3.9 ct
268.0 7.2 267.8 10.4 268.3 13.7 ct
cp
0.082 0.090 0.094 sc
er
np
272.2 12.8 mt
274.3 12.5 277.1 13.6 278.7 11.8 ct
278.9 9.4 279.8 6.6 278.6 4.4 ct
276.7 3.4 274.4 3.8 272.3 3.6 ct
272.2 6.7 272.2 9.7 272.2 12.8 ct
cp
0.082 0.090 0.094 sc
er
np
281.0 12.9 mt
283.3 12.6 286.0 13.4 288.0 11.9 ct
288.9 10.2 287.8 8.6 286.6 7.4 ct
286.9 6.8 287.6 5.5 287.9 4.9 ct
288.6 4.8 289.4 4.8 290.2 4.7 ct
290.8 6.8 291.5 8.8 292.1 10.9 ct
292.8 9.6 293.5 8.2 294.2 6.9 ct
294.3 8.1 294.4 9.3 294.6 10.4 ct
293.9 10.6 292.6 10.8 292.0 10.9 ct
292.7 11.7 293.3 12.7 294.4 12.9 ct
296.0 9.8 297.2 6.5 298.2 3.1 ct
296.7 3.8 295.9 5.1 295.1 6.5 ct
294.4 6.5 293.2 6.4 292.5 6.4 ct
292.3 3.2 289.3 3.9 287.1 3.8 ct
285.9 5.6 284.7 7.4 282.7 8.3 ct
282.6 6.8 282.5 5.2 282.5 3.7 ct
281.0 3.7 lt
281.0 6.8 281.0 9.8 281.0 12.9 ct
cp
0.082 0.090 0.094 sc
er
np
299.4 12.9 mt
302.0 12.5 305.6 13.8 306.9 11.0 ct
307.0 9.5 305.9 8.4 305.1 7.4 ct
305.9 6.1 306.7 4.7 307.4 3.4 ct
304.6 3.9 303.7 7.0 301.5 8.5 ct
301.2 6.7 300.9 4.9 300.6 3.0 ct
298.4 5.8 299.9 9.7 299.4 12.9 ct
cp
0.082 0.090 0.094 sc
er
np
307.8 13.3 mt
309.9 12.9 310.8 10.9 312.0 9.4 ct
313.1 10.9 314.1 12.8 316.2 13.4 ct
314.6 10.1 312.4 7.1 312.5 3.3 ct
312.2 3.5 311.6 3.7 311.3 3.9 ct
311.8 7.5 309.2 10.2 307.8 13.3 ct
cp
0.082 0.090 0.094 sc
er
np
57.5 11.5 mt
58.8 11.5 60.0 11.5 61.3 11.5 ct
61.2 11.0 61.2 10.0 61.2 9.5 ct
60.8 9.5 60.0 9.6 59.5 9.6 ct
59.4 7.7 lt
58.9 8.9 58.4 10.1 58.0 11.3 ct
57.5 11.5 lt
cp
0.082 0.090 0.094 sc
er
np
218.3 11.8 mt
219.6 11.2 223.1 11.7 221.6 9.4 ct
220.3 9.1 219.0 9.0 217.6 8.9 ct
217.8 9.6 218.1 11.1 218.3 11.8 ct
cp
0.996 0.996 0.996 sc
er
np
274.3 11.2 mt
275.2 12.0 277.5 11.6 277.3 10.0 ct
276.5 7.9 272.3 9.2 274.3 11.2 ct
cp
0.996 0.996 0.996 sc
er
np
165.3 10.2 mt
166.6 9.9 166.8 9.2 166.0 8.0 ct
164.7 8.2 164.4 8.9 165.3 10.2 ct
cp
0.996 0.996 0.996 sc
er
np
283.1 10.8 mt
283.9 12.0 287.2 11.2 285.9 9.6 ct
285.0 8.5 281.8 9.1 283.1 10.8 ct
cp
0.996 0.996 0.996 sc
er
np
301.3 10.8 mt
302.2 11.8 304.5 11.7 304.9 10.2 ct
304.5 8.4 300.0 8.6 301.3 10.8 ct
cp
0.996 0.996 0.996 sc
er
np
274.3 5.5 mt
273.3 7.1 276.0 8.3 277.0 7.1 ct
278.2 5.6 275.3 4.4 274.3 5.5 ct
cp
0.996 0.996 0.996 sc
er
