\relax 
\providecommand\hyper@newdestlabel[2]{}
\providecommand\HyperFirstAtBeginDocument{\AtBeginDocument}
\HyperFirstAtBeginDocument{\ifx\hyper@anchor\@undefined
\global\let\oldcontentsline\contentsline
\gdef\contentsline#1#2#3#4{\oldcontentsline{#1}{#2}{#3}}
\global\let\oldnewlabel\newlabel
\gdef\newlabel#1#2{\newlabelxx{#1}#2}
\gdef\newlabelxx#1#2#3#4#5#6{\oldnewlabel{#1}{{#2}{#3}}}
\AtEndDocument{\ifx\hyper@anchor\@undefined
\let\contentsline\oldcontentsline
\let\newlabel\oldnewlabel
\fi}
\fi}
\global\let\hyper@last\relax 
\gdef\HyperFirstAtBeginDocument#1{#1}
\providecommand*\HyPL@Entry[1]{}
\HyPL@Entry{0<</S/D>>}
\babel@aux{english}{}
\@writefile{toc}{\contentsline {section}{\numberline {1}P2：为什么PI需要一个稳定的初始策略}{1}{section.1}}
\@writefile{toc}{\contentsline {section}{\numberline {2}P2：让系统状态和控制收敛于0是什么想法}{1}{section.2}}
\@writefile{toc}{\contentsline {section}{\numberline {3}P2：$ \mathcal  {H}_{ \infty }$problem是什么问题}{1}{section.3}}
\@writefile{toc}{\contentsline {section}{\numberline {4}P2：locally Lipschitz是什么}{1}{section.4}}
\@writefile{toc}{\contentsline {section}{\numberline {5}P3：$Q \left ( x \right ) \preceq 0 $和$R=R^T \prec 0$什么意思}{1}{section.5}}
\@writefile{toc}{\contentsline {section}{\numberline {6}P3：Hamiltonian的定义是什么}{1}{section.6}}
\@writefile{toc}{\contentsline {section}{\numberline {7}P3：DT algebraic Riccati equation是什么，那个公式怎么推导得到的}{2}{section.7}}
\@writefile{toc}{\contentsline {section}{\numberline {8}P3：DT algebraic Riccati equation是什么，那个公式怎么推导得到的}{2}{section.8}}
\@writefile{toc}{\contentsline {section}{\numberline {9}P3：流程图里的导数是怎么算出来的，是解析表达式还是迭代中的数值解}{2}{section.9}}
\@writefile{toc}{\contentsline {section}{\numberline {10}P4：公式9需要确认一下策略梯度}{2}{section.10}}
\@writefile{toc}{\contentsline {section}{\numberline {11}P4：同步算法回头复习一下}{2}{section.11}}
\@writefile{toc}{\contentsline {section}{\numberline {12}P4：事件触发的好处到底是什么}{2}{section.12}}
\@writefile{toc}{\contentsline {section}{\numberline {13}P4：$\epsilon _{m}$是指什么}{2}{section.13}}
\@writefile{toc}{\contentsline {section}{\numberline {14}P4：控制律指的是什么控制律}{2}{section.14}}
\@writefile{toc}{\contentsline {section}{\numberline {15}P5：stationarity condition是什么}{2}{section.15}}
\@writefile{toc}{\contentsline {section}{\numberline {16}P5：Alg2没看懂}{2}{section.16}}
\@writefile{toc}{\contentsline {section}{\numberline {17}P5：persistence of excitation (PE) condition指的什么}{2}{section.17}}
\@writefile{toc}{\contentsline {section}{\numberline {18}P6：Hamiltonian是什么}{2}{section.18}}
\@writefile{toc}{\contentsline {section}{\numberline {19}P7：Hamilton–Jacobi–Isaacs (HJI) equation是个什么玩意}{2}{section.19}}
\@writefile{toc}{\contentsline {section}{\numberline {20}P8：locally Lipschitz是什么}{2}{section.20}}
