\relax 
\citation{ANCPower}
\citation{ANCPower}
\citation{ANCPower}
\citation{ANCPower}
\citation{ANCPower}
\citation{ANCPower}
\@writefile{toc}{\contentsline {chapter}{\numberline {第\nobreakspace  {}\CJKnumber  {2}\nobreakspace  {}章}特殊场景下已知干扰消除技术的融合机制}{21}{chapter.2}}
\newlabel{cha2}{{2}{21}{特殊场景下已知干扰消除技术的融合机制\relax }{chapter.2}{}}
\@writefile{toc}{\contentsline {section}{\numberline {2.1}研究背景}{21}{section.2.1}}
\@writefile{toc}{\contentsline {section}{\numberline {2.2}中继方式融合机制在单中继多速率网络中的应用}{21}{section.2.2}}
\@writefile{toc}{\contentsline {subsection}{\numberline {2.2.1}可达传输速率分析}{21}{subsection.2.2.1}}
\@writefile{loe}{\contentsline {equation}{\numberline {2-1}}{21}{equation.2.2.1}}
\newlabel{eqn:two_hop_rate}{{2-1}{21}{可达传输速率分析\relax }{equation.2.2.1}{}}
\@writefile{loe}{\contentsline {equation}{\numberline {2-2}}{21}{equation.2.2.2}}
\newlabel{eqn:anc_mintime}{{2-2}{21}{可达传输速率分析\relax }{equation.2.2.2}{}}
\@writefile{loe}{\contentsline {equation}{\numberline {2-3}}{21}{equation.2.2.3}}
\newlabel{eqn:cnc_mintime}{{2-3}{21}{可达传输速率分析\relax }{equation.2.2.3}{}}
\citation{MAC}
\citation{MAC}
\citation{refBellNumber}
\citation{refBellNumber}
\@writefile{loe}{\contentsline {equation}{\numberline {2-4}}{22}{equation.2.2.4}}
\newlabel{equ_min_pr_time}{{2-4}{22}{可达传输速率分析\relax }{equation.2.2.4}{}}
\@writefile{loe}{\contentsline {equation}{\numberline {2-5}}{22}{equation.2.2.5}}
\newlabel{equ_min_nr_time}{{2-5}{22}{可达传输速率分析\relax }{equation.2.2.5}{}}
\@writefile{toc}{\contentsline {subsection}{\numberline {2.2.2}中继方式选择算法}{22}{subsection.2.2.2}}
\citation{matching}
\citation{matching}
\citation{matching}
\citation{matching}
\new@pagectr{footnote}{2}{23}
\newlabel{eqn:weight_calc}{{2-6}{23}{中继方式选择算法\relax }{equation.2.2.6}{}}
\@writefile{loe}{\contentsline {equation}{\numberline {2-6}}{23}{equation.2.2.6}}
\newlabel{eqn:scheme}{{2-7}{23}{中继方式选择算法\relax }{equation.2.2.7}{}}
\citation{MAC}
\citation{MAC}
\citation{ANCPower,letterAdaptive}
\citation{ANCPower}
\citation{letterAdaptive}
\@writefile{lot}{\contentsline {table}{\numberline {2.1}{\ignorespaces 自适应中继方式选择算法的伪代码\relax }}{24}{table.caption.22}}
\@writefile{lot}{\contentsline {table}{\numberline {2.1}{\ignorespaces Pseudo-code of adaptive relaying method selection scheme\relax }}{24}{table.caption.22}}
\newlabel{Tab2:AdaptiveRelaying}{{2.1}{24}{Pseudo-code of adaptive relaying method selection scheme\relax \relax }{table.caption.22}{}}
\@writefile{toc}{\contentsline {section}{\numberline {2.3}中继方式融合机制在多中继单速率网络中的应用}{24}{section.2.3}}
\@writefile{toc}{\contentsline {subsection}{\numberline {2.3.1}系统模型与问题描述}{24}{subsection.2.3.1}}
\@writefile{lof}{\contentsline {figure}{\numberline {2.1}{\ignorespaces ``X"拓扑中的侦听PNC。括号中的数字表示通信阶段。\relax }}{25}{figure.caption.23}}
\@writefile{lof}{\contentsline {figure}{\numberline {2.1}{\ignorespaces Overhearing PNC in ``X" topology. The number in the brackets indicates the comm. phase.\relax }}{25}{figure.caption.23}}
\newlabel{Fig2:overhearingPnc}{{2.1}{25}{Overhearing PNC in ``X" topology. The number in the brackets indicates the comm. phase.\relax \relax }{figure.caption.23}{}}
\citation{MAC}
\citation{MAC}
\citation{MAC}
\citation{MAC}
\citation{MAC}
\citation{MAC}
\citation{MAC,SMAC}
\citation{MAC}
\citation{SMAC}
\@writefile{toc}{\contentsline {subsection}{\numberline {2.3.2}OPNC-MAC的包交换过程}{26}{subsection.2.3.2}}
\newlabel{Chap2:sect_MAC}{{2.3.2}{26}{OPNC-MAC的包交换过程\relax }{subsection.2.3.2}{}}
\citation{DNF}
\citation{DNF}
\@writefile{lof}{\contentsline {figure}{\numberline {2.2}{\ignorespaces OPNC-MAC中包交换的标准时序图。\relax }}{27}{figure.caption.24}}
\@writefile{lof}{\contentsline {figure}{\numberline {2.2}{\ignorespaces Standard timing diagram of packet exchange in OPNC-MAC.\relax }}{27}{figure.caption.24}}
\newlabel{Fig2:standardTimingDiagram}{{2.2}{27}{Standard timing diagram of packet exchange in OPNC-MAC.\relax \relax }{figure.caption.24}{}}
\citation{MAC}
\citation{MAC}
\citation{CNCMAC}
\citation{CNCMAC}
\@writefile{loe}{\contentsline {equation}{\numberline {2-8}}{28}{equation.2.3.8}}
\newlabel{Eqn2:superposedSignal}{{2-8}{28}{OPNC-MAC的包交换过程\relax }{equation.2.3.8}{}}
\@writefile{loe}{\contentsline {equation}{\numberline {2-9}}{28}{equation.2.3.9}}
\newlabel{Eqn2:Overhear1}{{2-10}{28}{OPNC-MAC的包交换过程\relax }{equation.2.3.9}{}}
\newlabel{Eqn2:Overhear2}{{2-10}{28}{OPNC-MAC的包交换过程\relax }{equation.2.3.9}{}}
\@writefile{loe}{\contentsline {equation}{\numberline {2-10}}{28}{equation.2.3.9}}
\@writefile{loe}{\contentsline {equation}{\numberline {2-11}}{28}{equation.2.3.11}}
\newlabel{Eqn2:destinationReceivedSignal1}{{2-12}{28}{OPNC-MAC的包交换过程\relax }{equation.2.3.11}{}}
\newlabel{Eqn2:destinationReceivedSignal2}{{2-12}{28}{OPNC-MAC的包交换过程\relax }{equation.2.3.11}{}}
\@writefile{loe}{\contentsline {equation}{\numberline {2-12}}{28}{equation.2.3.11}}
\citation{M80211}
\citation{M80211}
\citation{gallager}
\citation{gallager}
\citation{MAC}
\citation{MAC}
\@writefile{toc}{\contentsline {subsection}{\numberline {2.3.3}第二层中继方式选择和异常情况处理}{29}{subsection.2.3.3}}
\newlabel{Chap2:relaying-selection}{{2.3.3}{29}{第二层中继方式选择和异常情况处理\relax }{subsection.2.3.3}{}}
\@writefile{loe}{\contentsline {equation}{\numberline {2-13}}{29}{equation.2.3.13}}
\newlabel{Eqn2:BER_comm}{{2-13}{29}{第二层中继方式选择和异常情况处理\relax }{equation.2.3.13}{}}
\citation{COPE}
\citation{COPE}
\@writefile{lof}{\contentsline {figure}{\numberline {2.3}{\ignorespaces 异常情况下包交换时序图。\relax }}{30}{figure.caption.25}}
\@writefile{lof}{\contentsline {figure}{\numberline {2.3}{\ignorespaces Timing diagram of packet exchange in exceptional cases.\relax }}{30}{figure.caption.25}}
\newlabel{Fig2:ExceptionsTiming}{{2.3}{30}{Timing diagram of packet exchange in exceptional cases.\relax \relax }{figure.caption.25}{}}
\@writefile{lot}{\contentsline {table}{\numberline {2.2}{\ignorespaces 异常和相应的中继方式。\relax }}{31}{table.caption.26}}
\@writefile{lot}{\contentsline {table}{\numberline {2.2}{\ignorespaces Exceptions and the corresponding relaying methods.\relax }}{31}{table.caption.26}}
\newlabel{Tab2:listException}{{2.2}{31}{Exceptions and the corresponding relaying methods.\relax \relax }{table.caption.26}{}}
\@writefile{toc}{\contentsline {section}{\numberline {2.4}仿真实现与性能分析}{31}{section.2.4}}
\newlabel{Chap2:Simulations}{{2.4}{31}{仿真实现与性能分析\relax }{section.2.4}{}}
\@writefile{toc}{\contentsline {subsection}{\numberline {2.4.1}单中继多速率网络}{31}{subsection.2.4.1}}
\@writefile{lof}{\contentsline {figure}{\numberline {2.4}{\ignorespaces 单中继网络吞吐量随着数据流(包含NR中继方式)数目的变化情况。\relax }}{32}{figure.caption.27}}
\@writefile{lof}{\contentsline {figure}{\numberline {2.4}{\ignorespaces Throughput of the network with a single relay vs. the number of flows including no relaying.\relax }}{32}{figure.caption.27}}
\newlabel{Fig2:Cha2throughputforall}{{2.4}{32}{Throughput of the network with a single relay vs. the number of flows including no relaying.\relax \relax }{figure.caption.27}{}}
\@writefile{lof}{\contentsline {figure}{\numberline {2.5}{\ignorespaces 当数据流数目为8时，被使用的中继方式(包含NR中继方式)比例图。\relax }}{33}{figure.caption.28}}
\@writefile{lof}{\contentsline {figure}{\numberline {2.5}{\ignorespaces Percentages of selected relaying methods including no relaying, with eight flows.\relax }}{33}{figure.caption.28}}
\newlabel{Fig2:Cha2percentageforall_flows8}{{2.5}{33}{Percentages of selected relaying methods including no relaying, with eight flows.\relax \relax }{figure.caption.28}{}}
\citation{ANCPower}
\citation{ANCPower}
\citation{CNCMAC}
\citation{CNCMAC}
\@writefile{lof}{\contentsline {figure}{\numberline {2.6}{\ignorespaces 单中继网络吞吐量随着数据流(不包含NR中继方式)数目的变化情况。\relax }}{34}{figure.caption.29}}
\@writefile{lof}{\contentsline {figure}{\numberline {2.6}{\ignorespaces Throughput of the network with a single relay vs. the number of flows excluding no relaying.\relax }}{34}{figure.caption.29}}
\newlabel{Fig2:Cha2throughputnorelay}{{2.6}{34}{Throughput of the network with a single relay vs. the number of flows excluding no relaying.\relax \relax }{figure.caption.29}{}}
\@writefile{lof}{\contentsline {figure}{\numberline {2.7}{\ignorespaces 当数据流数目为8时，被使用的中继方式(不包含NR中继方式)比例图。\relax }}{35}{figure.caption.30}}
\@writefile{lof}{\contentsline {figure}{\numberline {2.7}{\ignorespaces Percentages of selected relaying methods excluding no relaying, with eight flows.\relax }}{35}{figure.caption.30}}
\newlabel{Fig2:Cha2percentagenorelaynormal}{{2.7}{35}{Percentages of selected relaying methods excluding no relaying, with eight flows.\relax \relax }{figure.caption.30}{}}
\@writefile{toc}{\contentsline {subsection}{\numberline {2.4.2}多中继单速率网络}{35}{subsection.2.4.2}}
\newlabel{Chap2:SimulationsForOPNC}{{2.4.2}{35}{多中继单速率网络\relax }{subsection.2.4.2}{}}
\citation{MAC}
\citation{MAC}
\@writefile{lof}{\contentsline {figure}{\numberline {2.8}{\ignorespaces 仿真图：(a) 轮型拓扑，(b) \#型拓扑\relax }}{36}{figure.caption.31}}
\@writefile{lof}{\contentsline {figure}{\numberline {2.8}{\ignorespaces Simulation topologies: (a) wheel topology, (b) \#-shaped topology.\relax }}{36}{figure.caption.31}}
\newlabel{Fig2:Cha2WheelAndSharpTops}{{2.8}{36}{Simulation topologies: (a) wheel topology, (b) \#-shaped topology.\relax \relax }{figure.caption.31}{}}
\citation{MAC}
\citation{MAC}
\citation{MAC}
\citation{MAC}
\@writefile{lof}{\contentsline {figure}{\numberline {2.9}{\ignorespaces 轮型拓扑中吞吐量随节点数目变化图\relax }}{38}{figure.caption.32}}
\@writefile{lof}{\contentsline {figure}{\numberline {2.9}{\ignorespaces Throughput vs. number of nodes in the wheel topology.\relax }}{38}{figure.caption.32}}
\newlabel{Fig2:Cha2WheelThroughput}{{2.9}{38}{Throughput vs. number of nodes in the wheel topology.\relax \relax }{figure.caption.32}{}}
\@writefile{lof}{\contentsline {figure}{\numberline {2.10}{\ignorespaces 轮型拓扑中端到端延时随节点数目变化图\relax }}{39}{figure.caption.33}}
\@writefile{lof}{\contentsline {figure}{\numberline {2.10}{\ignorespaces End-to-end delay vs. number of nodes in the wheel topology.\relax }}{39}{figure.caption.33}}
\newlabel{Fig2:Cha2WheelDelay}{{2.10}{39}{End-to-end delay vs. number of nodes in the wheel topology.\relax \relax }{figure.caption.33}{}}
\@writefile{toc}{\contentsline {section}{\numberline {2.5}本章小结}{39}{section.2.5}}
\@writefile{lof}{\contentsline {figure}{\numberline {2.11}{\ignorespaces \#型拓扑中吞吐量随数据包速率变化图\relax }}{40}{figure.caption.34}}
\@writefile{lof}{\contentsline {figure}{\numberline {2.11}{\ignorespaces Throughput vs. packet rates in the \#-shaped topology.\relax }}{40}{figure.caption.34}}
\newlabel{Fig2:Cha2SharpThroughput}{{2.11}{40}{Throughput vs. packet rates in the \#-shaped topology.\relax \relax }{figure.caption.34}{}}
\@writefile{lof}{\contentsline {figure}{\numberline {2.12}{\ignorespaces \#型拓扑中端到端时延随数据包速率变化图\relax }}{41}{figure.caption.35}}
\@writefile{lof}{\contentsline {figure}{\numberline {2.12}{\ignorespaces End-to-end delay vs. packet rates in the \#-shaped topology.\relax }}{41}{figure.caption.35}}
\newlabel{Fig2:Cha2SharpDelay}{{2.12}{41}{End-to-end delay vs. packet rates in the \#-shaped topology.\relax \relax }{figure.caption.35}{}}
\@setckpt{data/chap02}{
\setcounter{page}{42}
\setcounter{equation}{13}
\setcounter{enumi}{3}
\setcounter{enumii}{0}
\setcounter{enumiii}{0}
\setcounter{enumiv}{0}
\setcounter{footnote}{1}
\setcounter{mpfootnote}{0}
\setcounter{part}{0}
\setcounter{chapter}{2}
\setcounter{section}{5}
\setcounter{subsection}{0}
\setcounter{subsubsection}{0}
\setcounter{paragraph}{0}
\setcounter{subparagraph}{0}
\setcounter{figure}{12}
\setcounter{table}{2}
\setcounter{parentequation}{0}
\setcounter{ContinuedFloat}{0}
\setcounter{KVtest}{2}
\setcounter{subfigure}{0}
\setcounter{subfigure@save}{0}
\setcounter{lofdepth}{1}
\setcounter{subtable}{0}
\setcounter{subtable@save}{0}
\setcounter{lotdepth}{1}
\setcounter{endNonectr}{30}
\setcounter{currNonectr}{0}
\setcounter{LT@tables}{0}
\setcounter{LT@chunks}{0}
\setcounter{NAT@ctr}{0}
\setcounter{Item}{3}
\setcounter{Hfootnote}{2}
\setcounter{bookmark@seq@number}{32}
\setcounter{pcabs@footnote}{2}
\setcounter{thu@bookmark}{1}
\setcounter{currproofctr}{0}
\setcounter{endproofctr}{0}
\setcounter{proof}{0}
\setcounter{currassumptionctr}{0}
\setcounter{endassumptionctr}{0}
\setcounter{assumption}{0}
\setcounter{currdefinitionctr}{0}
\setcounter{enddefinitionctr}{0}
\setcounter{definition}{0}
\setcounter{currpropositionctr}{0}
\setcounter{endpropositionctr}{0}
\setcounter{proposition}{0}
\setcounter{currlemmactr}{0}
\setcounter{endlemmactr}{0}
\setcounter{lemma}{0}
\setcounter{currtheoremctr}{0}
\setcounter{endtheoremctr}{0}
\setcounter{theorem}{0}
\setcounter{curraxiomctr}{0}
\setcounter{endaxiomctr}{0}
\setcounter{axiom}{0}
\setcounter{currcorollaryctr}{0}
\setcounter{endcorollaryctr}{0}
\setcounter{corollary}{0}
\setcounter{currexercisectr}{0}
\setcounter{endexercisectr}{0}
\setcounter{exercise}{0}
\setcounter{currexamplectr}{0}
\setcounter{endexamplectr}{0}
\setcounter{example}{0}
\setcounter{currremarkctr}{0}
\setcounter{endremarkctr}{0}
\setcounter{remark}{0}
\setcounter{currproblemctr}{0}
\setcounter{endproblemctr}{0}
\setcounter{problem}{0}
\setcounter{currconjecturectr}{0}
\setcounter{endconjecturectr}{0}
\setcounter{conjecture}{0}
\setcounter{float@type}{4}
\setcounter{ALC@unique}{0}
\setcounter{ALC@line}{0}
\setcounter{ALC@rem}{0}
\setcounter{ALC@depth}{0}
\setcounter{IEEEsubequation}{0}
\setcounter{currthmctr}{0}
\setcounter{endthmctr}{0}
\setcounter{thm}{0}
\setcounter{currlemctr}{0}
\setcounter{endlemctr}{0}
\setcounter{section@level}{1}
}
