import graph;
settings.tex="xelatex";
texpreamble("\usepackage{xeCJK}");
texpreamble("\usepackage{bm}");
texpreamble("\setCJKmainfont{SimSun}");
size(8cm,6cm,IgnoreAspect);

// res_size1_timestep0.01.h5
real[][] datas1t001 = {
{0.01, 0.02, 0.03, 0.04, 0.05, 0.06, 0.07, 0.08, 0.09, 0.1, 0.11, 0.12, 0.13, 0.14, 0.15, 0.16, 0.17, 0.18, 0.19, 0.2, 0.21, 0.22, 0.23, 0.24, 0.25, 0.26, 0.27, 0.28, 0.29, 0.3, 0.31, 0.32, 0.33, 0.34, 0.35, 0.36, 0.37, 0.38, 0.39, 0.4, 0.41, 0.42, 0.43, 0.44, 0.45, 0.46, 0.47, 0.48, 0.49, 0.5},
{1.520384, 1.781305, 1.914370, 1.982683, 2.018166, 2.037002, 2.047398, 2.053515, 2.057463, 2.060311, 2.062603, 2.064614, 2.066482, 2.068279, 2.070041, 2.071785, 2.073521, 2.075254, 2.076986, 2.078718, 2.080451, 2.082185, 2.083920, 2.085657, 2.087395, 2.089135, 2.090876, 2.092618, 2.094362, 2.096107, 2.097854, 2.099602, 2.101352, 2.103103, 2.104855, 2.106609, 2.108365, 2.110122, 2.111880, 2.113640, 2.115402, 2.117164, 2.118929, 2.120694, 2.122462, 2.124230, 2.126000, 2.127772, 2.129545, 2.131320},
{15.955, 13.978, 13.666, 13.842, 12.947, 13.629, 13.135, 13.492, 12.826, 12.730, 12.487, 12.033, 12.496, 12.117, 11.896, 11.996, 12.276, 11.986, 12.263, 11.830, 11.938, 11.961, 12.056, 11.957, 11.955, 11.946, 11.642, 11.330, 11.682, 11.105, 11.311, 11.412, 11.456, 11.361, 11.274, 12.022, 11.469, 11.801, 11.906, 11.967, 11.926, 11.381, 11.877, 12.013, 11.942, 11.985, 11.876, 12.190, 11.887, 11.946},
{0.000e+00, 0.000e+00, 0.000e+00, 0.000e+00, 0.000e+00, 0.000e+00, 0.000e+00, 0.000e+00, 0.000e+00, 0.000e+00, 0.000e+00, 0.000e+00, 0.000e+00, 0.000e+00, 0.000e+00, 0.000e+00, 0.000e+00, 0.000e+00, 0.000e+00, 0.000e+00, 0.000e+00, 0.000e+00, 0.000e+00, 0.000e+00, 0.000e+00, 0.000e+00, 0.000e+00, 0.000e+00, 0.000e+00, 0.000e+00, 0.000e+00, 0.000e+00, 0.000e+00, 0.000e+00, 0.000e+00, 0.000e+00, 0.000e+00, 0.000e+00, 0.000e+00, 0.000e+00, 0.000e+00, 0.000e+00, 0.000e+00, 0.000e+00, 0.000e+00, 0.000e+00, 0.000e+00, 0.000e+00, 0.000e+00, 0.000e+00},
};

draw(graph(datas1t001[0],datas1t001[1]));
ylimits(0,2.5);
xaxis("模型时间/s", BottomTop,LeftTicks);
yaxis("总功率",LeftRight,RightTicks);