\relax 
\citation{Rateadaption,ANCPower,chi2010joint}
\citation{Rateadaption}
\citation{ANCPower}
\citation{chi2010joint}
\citation{Rateadaption,Hwang_CL}
\citation{Rateadaption}
\citation{Hwang_CL}
\citation{ANCPower}
\citation{ANCPower}
\@writefile{toc}{\contentsline {chapter}{\numberline {第\nobreakspace  {}\CJKnumber  {3}\nobreakspace  {}章}一般场景下已知干扰消除技术的融合机制}{43}{chapter.3}}
\newlabel{cha3}{{3}{43}{一般场景下已知干扰消除技术的融合机制\relax }{chapter.3}{}}
\@writefile{toc}{\contentsline {section}{\numberline {3.1}研究背景}{43}{section.3.1}}
\@writefile{toc}{\contentsline {section}{\numberline {3.2}问题描述与系统模型}{43}{section.3.2}}
\@writefile{lof}{\contentsline {figure}{\numberline {3.1}{\ignorespaces 不同数据流类型的PNC。括号中的数字表示传输时隙。\relax }}{44}{figure.caption.37}}
\@writefile{lof}{\contentsline {figure}{\numberline {3.1}{\ignorespaces PNC with different traffic patterns. The number in the brackets indicates the transmission timeslots.\relax }}{44}{figure.caption.37}}
\newlabel{Fig3:allTop}{{3.1}{44}{PNC with different traffic patterns. The number in the brackets indicates the transmission timeslots.\relax \relax }{figure.caption.37}{}}
\@writefile{loe}{\contentsline {equation}{\numberline {3-1}}{44}{equation.3.2.1}}
\citation{ANCPower}
\citation{ANCPower}
\citation{ANCPower}
\citation{ANCPower}
\citation{gallager}
\citation{gallager}
\citation{MAC}
\citation{MAC}
\citation{goldsmith}
\citation{goldsmith}
\newlabel{equ_Overhear1}{{3-2}{45}{问题描述与系统模型\relax }{equation.3.2.2}{}}
\@writefile{loe}{\contentsline {equation}{\numberline {3-2}}{45}{equation.3.2.2}}
\newlabel{equ_Overhear2}{{3-3}{45}{问题描述与系统模型\relax }{equation.3.2.2}{}}
\@writefile{loe}{\contentsline {equation}{\numberline {3-3}}{45}{equation.3.2.2}}
\@writefile{loe}{\contentsline {equation}{\numberline {3-4}}{45}{equation.3.2.4}}
\@writefile{loe}{\contentsline {equation}{\numberline {3-5}}{45}{equation.3.2.4}}
\@writefile{toc}{\contentsline {section}{\numberline {3.3}传输速率可变的已知干扰消除方案}{45}{section.3.3}}
\@writefile{toc}{\contentsline {subsection}{\numberline {3.3.1}BER、速率和功率之间的关系}{45}{subsection.3.3.1}}
\newlabel{BERALL}{{3.3.1}{45}{BER、速率和功率之间的关系\relax }{subsection.3.3.1}{}}
\@writefile{loe}{\contentsline {equation}{\numberline {3-6}}{45}{equation.3.3.6}}
\newlabel{Eqn3:SER_MQAM2}{{3-6}{45}{BER、速率和功率之间的关系\relax }{equation.3.3.6}{}}
\citation{faraji2013non}
\citation{faraji2013non}
\citation{koike2009adaptive}
\citation{koike2009adaptive}
\citation{wang2012constellation}
\citation{wang2012constellation}
\@writefile{loe}{\contentsline {equation}{\numberline {3-7}}{46}{equation.3.3.7}}
\newlabel{Eqn3:BER_MQAM}{{3-7}{46}{BER、速率和功率之间的关系\relax }{equation.3.3.7}{}}
\newlabel{Eqn3:SER_MQAMr1}{{3-8}{46}{BER、速率和功率之间的关系\relax }{equation.3.3.8}{}}
\@writefile{loe}{\contentsline {equation}{\numberline {3-8}}{46}{equation.3.3.8}}
\newlabel{Eqn3:SER_MQAMd1_o}{{3-9}{46}{BER、速率和功率之间的关系\relax }{equation.3.3.9}{}}
\newlabel{Eqn3:SER_MQAMd2_o}{{3-10}{46}{BER、速率和功率之间的关系\relax }{equation.3.3.10}{}}
\newlabel{Eqn3:SER_MQAMd1}{{3-11}{46}{BER、速率和功率之间的关系\relax }{equation.3.3.11}{}}
\newlabel{Eqn3:SER_MQAMd2}{{3-12}{46}{BER、速率和功率之间的关系\relax }{equation.3.3.12}{}}
\@writefile{toc}{\contentsline {subsection}{\numberline {3.3.2}最佳传输速率与功率}{47}{subsection.3.3.2}}
\newlabel{Eqn3:BER_upper_bound}{{3-13}{47}{最佳传输速率与功率\relax }{equation.3.3.13}{}}
\@writefile{loe}{\contentsline {equation}{\numberline {3-14}}{47}{equation.3.3.14}}
\newlabel{Eqn3:MAX_p}{{3-14}{47}{最佳传输速率与功率\relax }{equation.3.3.14}{}}
\newlabel{Eqn3:MAX_sigma_sim1}{{3-15}{47}{最佳传输速率与功率\relax }{equation.3.3.15}{}}
\@writefile{loe}{\contentsline {equation}{\numberline {3-15}}{47}{equation.3.3.15}}
\newlabel{Eqn3:MAX_sigma_sim3}{{3-16}{47}{最佳传输速率与功率\relax }{equation.3.3.16}{}}
\newlabel{equ_weight_calc}{{3.3.2}{48}{最佳传输速率与功率\relax }{equation.3.3.15}{}}
\@writefile{thm}{\contentsline {lem}{{定理}{1}{}}{48}{thm.1}}
\@writefile{thm}{\contentsline {lem}{{定理}{2}{}}{48}{thm.2}}
\@writefile{toc}{\contentsline {subsection}{\numberline {3.3.3}速率和功率自适应}{49}{subsection.3.3.3}}
\@writefile{loe}{\contentsline {equation}{\numberline {3-17}}{49}{equation.3.3.17}}
\@writefile{loe}{\contentsline {equation}{\numberline {3-18}}{49}{equation.3.3.18}}
\@writefile{toc}{\contentsline {section}{\numberline {3.4}中继自适应选择机制在多中继多速率网络中的应用}{49}{section.3.4}}
\@writefile{lot}{\contentsline {table}{\numberline {3.1}{\ignorespaces 面向PNC第一个传输时隙的速率和功率自适应方案伪代码\relax }}{50}{table.caption.38}}
\@writefile{lot}{\contentsline {table}{\numberline {3.1}{\ignorespaces Pseudo-code of Rate and Power Adaptation for the first transmission timeslot of PNC\relax }}{50}{table.caption.38}}
\newlabel{Tab3:algo_opti}{{3.1}{50}{Pseudo-code of Rate and Power Adaptation for the first transmission timeslot of PNC\relax \relax }{table.caption.38}{}}
\@writefile{lof}{\contentsline {figure}{\numberline {3.2}{\ignorespaces RPOPNC-MAC跨层协议架构。\relax }}{51}{figure.caption.39}}
\@writefile{lof}{\contentsline {figure}{\numberline {3.2}{\ignorespaces RPOPNC-MAC cross-layer protocol architecture.\relax }}{51}{figure.caption.39}}
\newlabel{Fig3:StruRPOPNCMAC}{{3.2}{51}{RPOPNC-MAC cross-layer protocol architecture.\relax \relax }{figure.caption.39}{}}
\@writefile{toc}{\contentsline {subsection}{\numberline {3.4.1}RPOPNC-MAC的包交换过程}{52}{subsection.3.4.1}}
\@writefile{toc}{\contentsline {subsection}{\numberline {3.4.2}第二层中继方式选择和异常处理}{52}{subsection.3.4.2}}
\newlabel{Chap3:relaying-selection}{{3.4.2}{52}{第二层中继方式选择和异常处理\relax }{subsection.3.4.2}{}}
\@writefile{lof}{\contentsline {figure}{\numberline {3.3}{\ignorespaces RPOPNC-MAC包交换标准时序图。\relax }}{53}{figure.caption.40}}
\@writefile{lof}{\contentsline {figure}{\numberline {3.3}{\ignorespaces Standard timing diagram of packet exchange in RPOPNC-MAC.\relax }}{53}{figure.caption.40}}
\newlabel{Fig3:timingdiagram}{{3.3}{53}{Standard timing diagram of packet exchange in RPOPNC-MAC.\relax \relax }{figure.caption.40}{}}
\@writefile{loe}{\contentsline {equation}{\numberline {3-19}}{53}{equation.3.4.19}}
\@writefile{loe}{\contentsline {equation}{\numberline {3-20}}{53}{equation.3.4.20}}
\@writefile{loe}{\contentsline {equation}{\numberline {3-21}}{54}{equation.3.4.21}}
\newlabel{Eqn3:PNC_th1}{{3-22}{54}{第二层中继方式选择和异常处理\relax }{equation.3.4.22}{}}
\newlabel{Eqn3:CNC_th}{{3-23}{54}{第二层中继方式选择和异常处理\relax }{equation.3.4.23}{}}
\newlabel{Eqn3:PR_th}{{3-24}{54}{第二层中继方式选择和异常处理\relax }{equation.3.4.24}{}}
\@writefile{toc}{\contentsline {subsection}{\numberline {3.4.3}网络分配向量的设置与更新}{54}{subsection.3.4.3}}
\@writefile{loe}{\contentsline {equation}{\numberline {3-25}}{54}{equation.3.4.25}}
\newlabel{Eqn3:RTS-PNC-NAV}{{3-25}{54}{网络分配向量的设置与更新\relax }{equation.3.4.25}{}}
\newlabel{Eqn3:CTS_NAV_s1}{{3-26}{55}{网络分配向量的设置与更新\relax }{equation.3.4.26}{}}
\newlabel{Eqn3:COPNC_NAV}{{3-27}{55}{网络分配向量的设置与更新\relax }{equation.3.4.27}{}}
\newlabel{Eqn3:data1_NAV}{{3-28}{55}{网络分配向量的设置与更新\relax }{equation.3.4.28}{}}
\@writefile{loe}{\contentsline {equation}{\numberline {3-29}}{55}{equation.3.4.29}}
\newlabel{Eqn3:data2_NAV}{{3-29}{55}{网络分配向量的设置与更新\relax }{equation.3.4.29}{}}
\citation{CNCMAC}
\citation{CNCMAC}
\citation{holland2001rate}
\citation{holland2001rate}
\@writefile{toc}{\contentsline {section}{\numberline {3.5}仿真实现与性能分析}{56}{section.3.5}}
\@writefile{lof}{\contentsline {figure}{\numberline {3.4}{\ignorespaces 单中继网络中吞吐量随节点数目变化图\relax }}{57}{figure.caption.41}}
\@writefile{lof}{\contentsline {figure}{\numberline {3.4}{\ignorespaces Throughput vs. number of nodes in the single-relay topology.\relax }}{57}{figure.caption.41}}
\newlabel{Fig3:wheelthroughput}{{3.4}{57}{Throughput vs. number of nodes in the single-relay topology.\relax \relax }{figure.caption.41}{}}
\citation{MAC}
\citation{MAC}
\@writefile{lof}{\contentsline {figure}{\numberline {3.5}{\ignorespaces 单中继网络中端到端时延随节点数目变化图\relax }}{58}{figure.caption.42}}
\@writefile{lof}{\contentsline {figure}{\numberline {3.5}{\ignorespaces End-to-end delay vs. number of nodes in the single-relay topology.\relax }}{58}{figure.caption.42}}
\newlabel{Fig3:wheeldelay}{{3.5}{58}{End-to-end delay vs. number of nodes in the single-relay topology.\relax \relax }{figure.caption.42}{}}
\@writefile{toc}{\contentsline {subsection}{\numberline {3.5.1}单中继网络}{58}{subsection.3.5.1}}
\citation{CNCMAC}
\citation{CNCMAC}
\@writefile{lof}{\contentsline {figure}{\numberline {3.6}{\ignorespaces 特殊多中继网络中的吞吐量随包速率的变化图\relax }}{59}{figure.caption.43}}
\@writefile{lof}{\contentsline {figure}{\numberline {3.6}{\ignorespaces Throughput vs. packet rate in the special multi-relay topology.\relax }}{59}{figure.caption.43}}
\newlabel{Fig3:4xthroughput}{{3.6}{59}{Throughput vs. packet rate in the special multi-relay topology.\relax \relax }{figure.caption.43}{}}
\@writefile{lof}{\contentsline {figure}{\numberline {3.7}{\ignorespaces 特殊多中继网络中的端到端时延随包速率的变化图\relax }}{60}{figure.caption.44}}
\@writefile{lof}{\contentsline {figure}{\numberline {3.7}{\ignorespaces End-to-end delay vs. packet rate in the special multi-relay topology.\relax }}{60}{figure.caption.44}}
\newlabel{Fig3:4xdelay}{{3.7}{60}{End-to-end delay vs. packet rate in the special multi-relay topology.\relax \relax }{figure.caption.44}{}}
\@writefile{toc}{\contentsline {subsection}{\numberline {3.5.2}特殊多中继网络}{60}{subsection.3.5.2}}
\@writefile{lof}{\contentsline {figure}{\numberline {3.8}{\ignorespaces 一般多中继网络中的吞吐量随包速率的变化图\relax }}{61}{figure.caption.45}}
\@writefile{lof}{\contentsline {figure}{\numberline {3.8}{\ignorespaces Throughput vs. packet rate in general multi-relay topology.\relax }}{61}{figure.caption.45}}
\newlabel{Fig3:randomT}{{3.8}{61}{Throughput vs. packet rate in general multi-relay topology.\relax \relax }{figure.caption.45}{}}
\@writefile{toc}{\contentsline {subsection}{\numberline {3.5.3}一般多中继网络}{61}{subsection.3.5.3}}
\@writefile{lof}{\contentsline {figure}{\numberline {3.9}{\ignorespaces 一般多中继网络中的端到端时延随包速率的变化图\relax }}{62}{figure.caption.46}}
\@writefile{lof}{\contentsline {figure}{\numberline {3.9}{\ignorespaces End-to-end delay vs. packet rate in general multi-relay topology.\relax }}{62}{figure.caption.46}}
\newlabel{Fig3:randomD}{{3.9}{62}{End-to-end delay vs. packet rate in general multi-relay topology.\relax \relax }{figure.caption.46}{}}
\@writefile{toc}{\contentsline {section}{\numberline {3.6}本章小结}{63}{section.3.6}}
\@setckpt{data/chap03}{
\setcounter{page}{64}
\setcounter{equation}{29}
\setcounter{enumi}{4}
\setcounter{enumii}{0}
\setcounter{enumiii}{0}
\setcounter{enumiv}{0}
\setcounter{footnote}{0}
\setcounter{mpfootnote}{0}
\setcounter{part}{0}
\setcounter{chapter}{3}
\setcounter{section}{6}
\setcounter{subsection}{0}
\setcounter{subsubsection}{0}
\setcounter{paragraph}{0}
\setcounter{subparagraph}{0}
\setcounter{figure}{9}
\setcounter{table}{1}
\setcounter{parentequation}{0}
\setcounter{ContinuedFloat}{0}
\setcounter{KVtest}{2}
\setcounter{subfigure}{0}
\setcounter{subfigure@save}{0}
\setcounter{lofdepth}{1}
\setcounter{subtable}{0}
\setcounter{subtable@save}{0}
\setcounter{lotdepth}{1}
\setcounter{endNonectr}{67}
\setcounter{currNonectr}{0}
\setcounter{LT@tables}{0}
\setcounter{LT@chunks}{0}
\setcounter{NAT@ctr}{0}
\setcounter{Item}{7}
\setcounter{Hfootnote}{2}
\setcounter{bookmark@seq@number}{48}
\setcounter{pcabs@footnote}{2}
\setcounter{thu@bookmark}{1}
\setcounter{currproofctr}{0}
\setcounter{endproofctr}{0}
\setcounter{proof}{0}
\setcounter{currassumptionctr}{0}
\setcounter{endassumptionctr}{0}
\setcounter{assumption}{0}
\setcounter{currdefinitionctr}{0}
\setcounter{enddefinitionctr}{0}
\setcounter{definition}{0}
\setcounter{currpropositionctr}{0}
\setcounter{endpropositionctr}{0}
\setcounter{proposition}{0}
\setcounter{currlemmactr}{0}
\setcounter{endlemmactr}{0}
\setcounter{lemma}{0}
\setcounter{currtheoremctr}{0}
\setcounter{endtheoremctr}{0}
\setcounter{theorem}{0}
\setcounter{curraxiomctr}{0}
\setcounter{endaxiomctr}{0}
\setcounter{axiom}{0}
\setcounter{currcorollaryctr}{0}
\setcounter{endcorollaryctr}{0}
\setcounter{corollary}{0}
\setcounter{currexercisectr}{0}
\setcounter{endexercisectr}{0}
\setcounter{exercise}{0}
\setcounter{currexamplectr}{0}
\setcounter{endexamplectr}{0}
\setcounter{example}{0}
\setcounter{currremarkctr}{0}
\setcounter{endremarkctr}{0}
\setcounter{remark}{0}
\setcounter{currproblemctr}{0}
\setcounter{endproblemctr}{0}
\setcounter{problem}{0}
\setcounter{currconjecturectr}{0}
\setcounter{endconjecturectr}{0}
\setcounter{conjecture}{0}
\setcounter{float@type}{4}
\setcounter{ALC@unique}{22}
\setcounter{ALC@line}{22}
\setcounter{ALC@rem}{0}
\setcounter{ALC@depth}{0}
\setcounter{IEEEsubequation}{0}
\setcounter{currthmctr}{0}
\setcounter{endthmctr}{0}
\setcounter{thm}{2}
\setcounter{currlemctr}{2}
\setcounter{endlemctr}{2}
\setcounter{section@level}{1}
}
