\relax 
\citation{Bianchi1,ANCMAC,ng2007throughput,jang2012ieee,tsertou2005new,ThroughputTingChao}
\citation{Bianchi1}
\citation{ANCMAC}
\citation{ng2007throughput}
\citation{jang2012ieee}
\citation{tsertou2005new}
\citation{ThroughputTingChao}
\citation{Bianchi1,ANCMAC,ng2007throughput,jang2012ieee,tsertou2005new,ThroughputTingChao}
\citation{Bianchi1}
\citation{ANCMAC}
\citation{ng2007throughput}
\citation{jang2012ieee}
\citation{tsertou2005new}
\citation{ThroughputTingChao}
\citation{Bianchi1}
\citation{Bianchi1}
\citation{Bianchi1}
\citation{Bianchi1}
\@writefile{toc}{\contentsline {chapter}{\numberline {第\nobreakspace  {}\CJKnumber  {5}\nobreakspace  {}章}二维网格状网络中多跳KIC传输方案的吞吐量分析}{99}{chapter.5}}
\newlabel{cha5}{{5}{99}{二维网格状网络中多跳KIC传输方案的吞吐量分析\relax }{chapter.5}{}}
\@writefile{toc}{\contentsline {section}{\numberline {5.1}开启概率}{99}{section.5.1}}
\@writefile{loe}{\contentsline {equation}{\numberline {5-1}}{100}{equation.5.1.1}}
\newlabel{Eqn5:StateTransEqn}{{5-1}{100}{开启概率\relax }{equation.5.1.1}{}}
\@writefile{loe}{\contentsline {equation}{\numberline {5-2}}{100}{equation.5.1.2}}
\newlabel{Eqn5:StatDistriEqn}{{5-2}{100}{开启概率\relax }{equation.5.1.2}{}}
\newlabel{Eqn5:StatDistriClosedEqn}{{5-3}{100}{开启概率\relax }{equation.5.1.3}{}}
\newlabel{Eqn5:TransAndCoopRelaEqn}{{5-4}{100}{开启概率\relax }{equation.5.1.4}{}}
\@writefile{loe}{\contentsline {equation}{\numberline {5-5}}{100}{equation.5.1.5}}
\newlabel{Eqn5:TimeDomiEqn}{{5-5}{100}{开启概率\relax }{equation.5.1.5}{}}
\citation{Bianchi1,ANCMAC,jang2012ieee,ng2007throughput,tsertou2005new,ThroughputTingChao}
\citation{Bianchi1}
\citation{ANCMAC}
\citation{jang2012ieee}
\citation{ng2007throughput}
\citation{tsertou2005new}
\citation{ThroughputTingChao}
\citation{CapacityGupta}
\citation{CapacityGupta}
\@writefile{toc}{\contentsline {section}{\numberline {5.2}协作概率}{101}{section.5.2}}
\newlabel{Chap5:coopProba}{{5.2}{101}{协作概率\relax }{section.5.2}{}}
\@writefile{toc}{\contentsline {subsection}{\numberline {5.2.1}基本假设}{101}{subsection.5.2.1}}
\@writefile{lof}{\contentsline {figure}{\numberline {5.1}{\ignorespaces 二维网格状网络中的数据流配置示例：(a) 以$n_{1}$作为源节点的数据流，其中路径大小$N_{\text  {path}}$为四；(b) 以节点$n_{i+1}$作为第$(l=i+1)$个协作节点的数据流。变量$d$代表处于相同行或列的相邻节点的距离。变量$r$代表CS或者传输范围的半径。虚线大圆包含的范围表示节点$n_{i+1}$和$n_{i+2}$的CS或者传输范围。示例节点$n_{i+1}$可以是八条数据流(发源于网格背景标记的节点)的第$(i+1)$个协作者，因为它有八个邻居。\relax }}{102}{figure.caption.69}}
\@writefile{lof}{\contentsline {figure}{\numberline {5.1}{\ignorespaces An example of flow configurations at a two-dimensional grid network: (a) flows with $n_{1}$ as the source node, where the path size $N_{\text  {path}}$ is equal to four; (b) flows with $n_{i+1}$ as their $(l=i+1)$th cooperator. Variable $d$ denotes the distance between two nodes in the same row or column. Variable $r$ denotes the radius of the CS or transmission range. The big cycles with dashed line show the CS or transmission ranges of nodes $n_{i+1}$ and $n_{i+2}$. An example node $n_{i+1}$ can be $(i+1)$th cooperator of eight flows (which originate at nodes marked with grid background in the figure), because it has eight neighbors.\relax }}{102}{figure.caption.69}}
\newlabel{Fig5:RegurlarMeshGrid}{{5.1}{102}{An example of flow configurations at a two-dimensional grid network: (a) flows with $n_{1}$ as the source node, where the path size $N_{\text {path}}$ is equal to four; (b) flows with $n_{i+1}$ as their $(l=i+1)$th cooperator. Variable $d$ denotes the distance between two nodes in the same row or column. Variable $r$ denotes the radius of the CS or transmission range. The big cycles with dashed line show the CS or transmission ranges of nodes $n_{i+1}$ and $n_{i+2}$. An example node $n_{i+1}$ can be $(i+1)$th cooperator of eight flows (which originate at nodes marked with grid background in the figure), because it has eight neighbors.\relax \relax }{figure.caption.69}{}}
\citation{ThroughputTingChao}
\citation{ThroughputTingChao}
\@writefile{toc}{\contentsline {subsection}{\numberline {5.2.2}协作概率的计算}{103}{subsection.5.2.2}}
\@writefile{loe}{\contentsline {equation}{\numberline {5-6}}{103}{equation.5.2.6}}
\@writefile{loe}{\contentsline {equation}{\numberline {5-7}}{103}{equation.5.2.7}}
\@writefile{loe}{\contentsline {equation}{\numberline {5-8}}{103}{equation.5.2.8}}
\newlabel{Eqn5:CoopProba1}{{5-8}{103}{协作概率的计算\relax }{equation.5.2.8}{}}
\@writefile{loe}{\contentsline {equation}{\numberline {5-9}}{103}{equation.5.2.9}}
\citation{ThroughputTingChao}
\citation{ThroughputTingChao}
\@writefile{lot}{\contentsline {table}{\numberline {5.1}{\ignorespaces 五种导致状态转移的事件。\relax }}{104}{table.caption.70}}
\@writefile{lot}{\contentsline {table}{\numberline {5.1}{\ignorespaces Five cases leading to state transitions.\relax }}{104}{table.caption.70}}
\newlabel{Tab5:AllTable}{{5.1}{104}{Five cases leading to state transitions.\relax \relax }{table.caption.70}{}}
\@writefile{loe}{\contentsline {equation}{\numberline {5-10}}{104}{equation.5.2.10}}
\newlabel{Eqn5:AnotherRelation}{{5-10}{104}{协作概率的计算\relax }{equation.5.2.10}{}}
\@writefile{toc}{\contentsline {section}{\numberline {5.3}状态转移所需平均时间}{104}{section.5.3}}
\newlabel{DurationOfStateTxi}{{5.3}{104}{状态转移所需平均时间\relax }{section.5.3}{}}
\@writefile{loe}{\contentsline {equation}{\numberline {5-11}}{104}{equation.5.3.11}}
\newlabel{Eqn5:deltaOverallExpression}{{5-11}{104}{状态转移所需平均时间\relax }{equation.5.3.11}{}}
\@writefile{toc}{\contentsline {subsection}{\numberline {5.3.1}所考虑节点保持静止(情况1--3)}{104}{subsection.5.3.1}}
\newlabel{Eqn5:Xtrans1}{{5-12}{105}{所考虑节点保持静止(情况1--3)\relax }{equation.5.3.12}{}}
\@writefile{loe}{\contentsline {equation}{\numberline {5-14}}{105}{equation.5.3.14}}
\@writefile{loe}{\contentsline {equation}{\numberline {5-15}}{105}{equation.5.3.15}}
\newlabel{Eqn5:Xtrans2}{{5-16}{105}{所考虑节点保持静止(情况1--3)\relax }{equation.5.3.16}{}}
\@writefile{loe}{\contentsline {equation}{\numberline {5-17}}{105}{equation.5.3.17}}
\@writefile{loe}{\contentsline {equation}{\numberline {5-18}}{105}{equation.5.3.18}}
\@writefile{loe}{\contentsline {equation}{\numberline {5-19}}{105}{equation.5.3.19}}
\@writefile{loe}{\contentsline {equation}{\numberline {5-20}}{106}{equation.5.3.20}}
\new@pagectr{footnote}{4}{106}
\@writefile{loe}{\contentsline {equation}{\numberline {5-21}}{106}{equation.5.3.21}}
\@writefile{loe}{\contentsline {equation}{\numberline {5-22}}{106}{equation.5.3.22}}
\@writefile{toc}{\contentsline {subsection}{\numberline {5.3.2}节点$Y$开启一次传输(事件4)}{106}{subsection.5.3.2}}
\new@pagectr{footnote}{5}{106}
\@writefile{toc}{\contentsline {subsection}{\numberline {5.3.3}节点$Y$被协作(事件5)}{107}{subsection.5.3.3}}
\@writefile{loe}{\contentsline {equation}{\numberline {5-29}}{107}{equation.5.3.29}}
\@writefile{loe}{\contentsline {equation}{\numberline {5-30}}{107}{equation.5.3.30}}
\@writefile{toc}{\contentsline {subsection}{\numberline {5.3.4}吞吐量的计算}{107}{subsection.5.3.4}}
\newlabel{Chap5:ThrouFormu}{{5.3.4}{107}{吞吐量的计算\relax }{subsection.5.3.4}{}}
\new@pagectr{footnote}{6}{107}
\@writefile{loe}{\contentsline {equation}{\numberline {5-31}}{107}{equation.5.3.31}}
\newlabel{Eqn5:Throughput}{{5-31}{107}{吞吐量的计算\relax }{equation.5.3.31}{}}
\citation{MAC}
\citation{MAC}
\@writefile{lot}{\contentsline {table}{\numberline {5.2}{\ignorespaces 仿真参数配置\relax }}{108}{table.caption.71}}
\@writefile{lot}{\contentsline {table}{\numberline {5.2}{\ignorespaces Parameters in Simulations\relax }}{108}{table.caption.71}}
\newlabel{Tab5:Parameters}{{5.2}{108}{Parameters in Simulations\relax \relax }{table.caption.71}{}}
\@writefile{lof}{\contentsline {figure}{\numberline {5.2}{\ignorespaces 当$N_{\text  {path}}=11$、$N_{\text  {an}}=5$和$N_{\text  {pos}}=5$时，所提协议表现随竞争窗口的变化。\relax }}{108}{figure.caption.72}}
\@writefile{lof}{\contentsline {subfigure}{\numberline{((a))}{\ignorespaces {}}}{108}{subfigure.2.1}}
\@writefile{lof}{\contentsline {subfigure}{\numberline{((b))}{\ignorespaces {}}}{108}{subfigure.2.2}}
\@writefile{lof}{\contentsline {figure}{\numberline {5.2}{\ignorespaces Performances vs. size of contention window in two-dimensional grid network with $N_{\text  {path}}=11$, $N_{\text  {an}}=5$, and $N_{\text  {pos}}=5$: (a) $d=110$, (b) $d=150$.\relax }}{108}{figure.caption.72}}
\newlabel{Fig5:RegularGrid1}{{5.2}{108}{Performances vs. size of contention window in two-dimensional grid network with $N_{\text {path}}=11$, $N_{\text {an}}=5$, and $N_{\text {pos}}=5$: (a) $d=110$, (b) $d=150$.\relax \relax }{figure.caption.72}{}}
\@writefile{toc}{\contentsline {section}{\numberline {5.4}理论分析与仿真结果}{108}{section.5.4}}
\newlabel{Chap5:sectSim}{{5.4}{108}{理论分析与仿真结果\relax }{section.5.4}{}}
\@writefile{lof}{\contentsline {figure}{\numberline {5.3}{\ignorespaces 当$N_{\text  {path}}=7$、$N_{\text  {an}}=3$和$N_{\text  {pos}}=2$时，所提协议表现随竞争窗口的变化。\relax }}{109}{figure.caption.73}}
\@writefile{lof}{\contentsline {subfigure}{\numberline{((a))}{\ignorespaces {}}}{109}{subfigure.3.1}}
\@writefile{lof}{\contentsline {subfigure}{\numberline{((b))}{\ignorespaces {}}}{109}{subfigure.3.2}}
\@writefile{lof}{\contentsline {figure}{\numberline {5.3}{\ignorespaces Performances vs. size of contention window in two-dimensional grid network with $N_{\text  {path}}=7$, $N_{\text  {an}}=3$, and $N_{\text  {pos}}=2$: (a) $d=110$, (b) $d=150$.\relax }}{109}{figure.caption.73}}
\newlabel{Fig5:RegularGrid2}{{5.3}{109}{Performances vs. size of contention window in two-dimensional grid network with $N_{\text {path}}=7$, $N_{\text {an}}=3$, and $N_{\text {pos}}=2$: (a) $d=110$, (b) $d=150$.\relax \relax }{figure.caption.73}{}}
\@writefile{lof}{\contentsline {figure}{\numberline {5.4}{\ignorespaces 当$N_{\text  {path}}=13$、$N_{\text  {an}}=6$和$N_{\text  {pos}}=7$时，所提协议表现随竞争窗口的变化。\relax }}{109}{figure.caption.74}}
\@writefile{lof}{\contentsline {subfigure}{\numberline{((a))}{\ignorespaces {}}}{109}{subfigure.4.1}}
\@writefile{lof}{\contentsline {subfigure}{\numberline{((b))}{\ignorespaces {}}}{109}{subfigure.4.2}}
\@writefile{lof}{\contentsline {figure}{\numberline {5.4}{\ignorespaces Performances vs. size of contention window in two-dimensional grid network with $N_{\text  {path}}=13$, $N_{\text  {an}}=6$, and $N_{\text  {pos}}=7$: (a) $d=110$, (b) $d=150$.\relax }}{109}{figure.caption.74}}
\newlabel{Fig5:RegularGrid3}{{5.4}{109}{Performances vs. size of contention window in two-dimensional grid network with $N_{\text {path}}=13$, $N_{\text {an}}=6$, and $N_{\text {pos}}=7$: (a) $d=110$, (b) $d=150$.\relax \relax }{figure.caption.74}{}}
\@writefile{toc}{\contentsline {section}{\numberline {5.5}本章小结与未来工作}{110}{section.5.5}}
\@setckpt{data/chap05}{
\setcounter{page}{111}
\setcounter{equation}{31}
\setcounter{enumi}{6}
\setcounter{enumii}{0}
\setcounter{enumiii}{0}
\setcounter{enumiv}{0}
\setcounter{footnote}{1}
\setcounter{mpfootnote}{0}
\setcounter{part}{0}
\setcounter{chapter}{5}
\setcounter{section}{5}
\setcounter{subsection}{0}
\setcounter{subsubsection}{0}
\setcounter{paragraph}{0}
\setcounter{subparagraph}{0}
\setcounter{figure}{4}
\setcounter{table}{2}
\setcounter{parentequation}{0}
\setcounter{ContinuedFloat}{0}
\setcounter{KVtest}{2}
\setcounter{subfigure}{0}
\setcounter{subfigure@save}{2}
\setcounter{lofdepth}{1}
\setcounter{subtable}{0}
\setcounter{subtable@save}{0}
\setcounter{lotdepth}{1}
\setcounter{endNonectr}{68}
\setcounter{currNonectr}{0}
\setcounter{LT@tables}{0}
\setcounter{LT@chunks}{0}
\setcounter{NAT@ctr}{0}
\setcounter{Item}{20}
\setcounter{Hfootnote}{6}
\setcounter{bookmark@seq@number}{77}
\setcounter{pcabs@footnote}{6}
\setcounter{thu@bookmark}{1}
\setcounter{currproofctr}{0}
\setcounter{endproofctr}{0}
\setcounter{proof}{0}
\setcounter{currassumptionctr}{0}
\setcounter{endassumptionctr}{0}
\setcounter{assumption}{0}
\setcounter{currdefinitionctr}{0}
\setcounter{enddefinitionctr}{0}
\setcounter{definition}{0}
\setcounter{currpropositionctr}{1}
\setcounter{endpropositionctr}{43}
\setcounter{proposition}{0}
\setcounter{currlemmactr}{0}
\setcounter{endlemmactr}{0}
\setcounter{lemma}{0}
\setcounter{currtheoremctr}{0}
\setcounter{endtheoremctr}{0}
\setcounter{theorem}{0}
\setcounter{curraxiomctr}{0}
\setcounter{endaxiomctr}{0}
\setcounter{axiom}{0}
\setcounter{currcorollaryctr}{0}
\setcounter{endcorollaryctr}{0}
\setcounter{corollary}{0}
\setcounter{currexercisectr}{0}
\setcounter{endexercisectr}{0}
\setcounter{exercise}{0}
\setcounter{currexamplectr}{0}
\setcounter{endexamplectr}{0}
\setcounter{example}{0}
\setcounter{currremarkctr}{0}
\setcounter{endremarkctr}{0}
\setcounter{remark}{0}
\setcounter{currproblemctr}{0}
\setcounter{endproblemctr}{0}
\setcounter{problem}{0}
\setcounter{currconjecturectr}{0}
\setcounter{endconjecturectr}{0}
\setcounter{conjecture}{0}
\setcounter{float@type}{4}
\setcounter{ALC@unique}{29}
\setcounter{ALC@line}{7}
\setcounter{ALC@rem}{0}
\setcounter{ALC@depth}{0}
\setcounter{IEEEsubequation}{0}
\setcounter{currthmctr}{0}
\setcounter{endthmctr}{0}
\setcounter{thm}{2}
\setcounter{currlemctr}{2}
\setcounter{endlemctr}{2}
\setcounter{section@level}{1}
}
