\BOOKMARK [1][-]{section.1}{INTRODUCTION}{}% 1
\BOOKMARK [2][-]{subsection.1.1}{Related\040Theoretical\040Work}{section.1}% 2
\BOOKMARK [2][-]{subsection.1.2}{Structure}{section.1}% 3
\BOOKMARK [1][-]{section.2}{OPTIMAL\040CONTROL\040OF\040DT\040SYSTEMS\040AND\040ONLINE\040SOLUTIONS}{}% 4
\BOOKMARK [2][-]{subsection.2.1}{Optimal\040Regulation\040Problem}{section.2}% 5
\BOOKMARK [2][-]{subsection.2.2}{Special\040Case}{section.2}% 6
\BOOKMARK [2][-]{subsection.2.3}{Approximate\040Solution\040Using\040RL}{section.2}% 7
\BOOKMARK [3][-]{subsubsection.2.3.1}{Offline\040PI\040Algorithm}{subsection.2.3}% 8
\BOOKMARK [3][-]{subsubsection.2.3.2}{Actor\040and\040Critic\040Approximators}{subsection.2.3}% 9
\BOOKMARK [3][-]{subsubsection.2.3.3}{Event-Triggered\040RL}{subsection.2.3}% 10
\BOOKMARK [3][-]{subsubsection.2.3.4}{\040Q\040Function\040for\040the\040DT\040Linear\040Quadratic\040Regulation\040}{subsection.2.3}% 11
\BOOKMARK [2][-]{subsection.2.4}{Optimal\040Tracking\040Problem}{section.2}% 12
\BOOKMARK [2][-]{subsection.2.5}{Approximate\040Solution\040Using\040RL}{section.2}% 13
\BOOKMARK [3][-]{subsubsection.2.5.1}{Offline\040PI\040Algorithm}{subsection.2.5}% 14
\BOOKMARK [3][-]{subsubsection.2.5.2}{Online\040Actor\040and\040Critic\040Approximators}{subsection.2.5}% 15
\BOOKMARK [2][-]{subsection.2.6}{H\040\040Control\040of\040DT\040Systems}{section.2}% 16
\BOOKMARK [2][-]{subsection.2.7}{Approximate\040Solution\040Using\040RL}{section.2}% 17
\BOOKMARK [3][-]{subsubsection.2.7.1}{On-Policy\040RL\040to\040Solve\040H\040\040Control\040of\040DT\040Systems}{subsection.2.7}% 18
\BOOKMARK [3][-]{subsubsection.2.7.2}{Off-Policy\040RL\040for\040Solving\040Zero-Sum\040Game\040Problem\040of\040DT\040Systems}{subsection.2.7}% 19
\BOOKMARK [1][-]{section.3}{OPTIMAL\040CONTROL\040OF\040CT\040SYSTEMS\040AND\040ONLINE\040SOLUTIONS}{}% 20
\BOOKMARK [2][-]{subsection.3.1}{Optimal\040Regulation\040Problem}{section.3}% 21
\BOOKMARK [2][-]{subsection.3.2}{Approximate\040Solution\040Using\040RL}{section.3}% 22
\BOOKMARK [3][-]{subsubsection.3.2.1}{On-Policy\040IRL}{subsection.3.2}% 23
\BOOKMARK [3][-]{subsubsection.3.2.2}{On-Policy IRL With Experience Replay Learning Technique [70]–[72]}{subsection.3.2}% 24
\BOOKMARK [3][-]{subsubsection.3.2.3}{Event-Triggered\040On-Policy\040RL\040[74]}{subsection.3.2}% 25
\BOOKMARK [3][-]{subsubsection.3.2.4}{Off-Policy\040IRL\040[79],\040[80]}{subsection.3.2}% 26
\BOOKMARK [3][-]{subsubsection.3.2.5}{Robust\040Off-Policy\040IRL\040[79]}{subsection.3.2}% 27
\BOOKMARK [2][-]{subsection.3.3}{Optimal\040Tracking\040Problem}{section.3}% 28
\BOOKMARK [2][-]{subsection.3.4}{Approximate\040Solution\040Using\040RL}{section.3}% 29
\BOOKMARK [3][-]{subsubsection.3.4.1}{On-Policy\040IRL}{subsection.3.4}% 30
\BOOKMARK [3][-]{subsubsection.3.4.2}{Off-Policy\040IRL}{subsection.3.4}% 31
\BOOKMARK [3][-]{subsubsection.3.4.3}{H\040\040Control\040of\040CT\040Systems}{subsection.3.4}% 32
\BOOKMARK [2][-]{subsection.3.5}{Approximate\040Solution\040Using\040RL}{section.3}% 33
\BOOKMARK [3][-]{subsubsection.3.5.1}{On-Policy\040IRL}{subsection.3.5}% 34
\BOOKMARK [3][-]{subsubsection.3.5.2}{Off-Policy\040IRL\040[80]}{subsection.3.5}% 35
\BOOKMARK [2][-]{subsection.3.6}{Nash\040Games}{section.3}% 36
\BOOKMARK [2][-]{subsection.3.7}{Approximate\040Solution\040Using\040RL}{section.3}% 37
\BOOKMARK [3][-]{subsubsection.3.7.1}{On-Policy\040IRL:}{subsection.3.7}% 38
\BOOKMARK [1][-]{section.4}{GRAPHICAL\040GAMES}{}% 39
\BOOKMARK [2][-]{subsection.4.1}{Approximate\040Solution\040Using\040RL}{section.4}% 40
\BOOKMARK [1][-]{section.5}{APPLICATIONS}{}% 41
\BOOKMARK [2][-]{subsection.5.1}{Robot\040Control\040and\040Navigation}{section.5}% 42
\BOOKMARK [2][-]{subsection.5.2}{Power\040Systems}{section.5}% 43
\BOOKMARK [1][-]{section.6}{CONCLUSION}{}% 44
