\relax 
\providecommand\hyper@newdestlabel[2]{}
\providecommand\HyperFirstAtBeginDocument{\AtBeginDocument}
\HyperFirstAtBeginDocument{\ifx\hyper@anchor\@undefined
\global\let\oldcontentsline\contentsline
\gdef\contentsline#1#2#3#4{\oldcontentsline{#1}{#2}{#3}}
\global\let\oldnewlabel\newlabel
\gdef\newlabel#1#2{\newlabelxx{#1}#2}
\gdef\newlabelxx#1#2#3#4#5#6{\oldnewlabel{#1}{{#2}{#3}}}
\AtEndDocument{\ifx\hyper@anchor\@undefined
\let\contentsline\oldcontentsline
\let\newlabel\oldnewlabel
\fi}
\fi}
\global\let\hyper@last\relax 
\gdef\HyperFirstAtBeginDocument#1{#1}
\providecommand*\HyPL@Entry[1]{}
\HyPL@Entry{0<</S/D>>}
\babel@aux{english}{}
\@writefile{toc}{\contentsline {section}{\numberline {1}INTRODUCTION}{1}{section.1}}
\@writefile{toc}{\contentsline {subsection}{\numberline {1.1}Related Theoretical Work}{1}{subsection.1.1}}
\@writefile{toc}{\contentsline {subsection}{\numberline {1.2}Structure}{1}{subsection.1.2}}
\@writefile{toc}{\contentsline {section}{\numberline {2}OPTIMAL CONTROL OF DT SYSTEMS AND ONLINE SOLUTIONS}{1}{section.2}}
\@writefile{toc}{\contentsline {subsection}{\numberline {2.1}Optimal Regulation Problem}{1}{subsection.2.1}}
\newlabel{cost from time k to infty}{{2}{1}{Optimal Regulation Problem}{equation.2.2}{}}
\newlabel{opt cost from time k to infty}{{3}{1}{Optimal Regulation Problem}{equation.2.3}{}}
\newlabel{bellman equation}{{4}{1}{Optimal Regulation Problem}{equation.2.4}{}}
\newlabel{concept DT HJB}{{6}{1}{Optimal Regulation Problem}{equation.2.6}{}}
\newlabel{detail DT HJB}{{7}{1}{Optimal Regulation Problem}{equation.2.7}{}}
\@writefile{toc}{\contentsline {subsection}{\numberline {2.2}Special Case}{2}{subsection.2.2}}
\@writefile{toc}{\contentsline {subsection}{\numberline {2.3}Approximate Solution Using RL}{2}{subsection.2.3}}
\@writefile{toc}{\contentsline {subsubsection}{\numberline {2.3.1}Offline PI Algorithm}{2}{subsubsection.2.3.1}}
\@writefile{toc}{\contentsline {subsubsection}{\numberline {2.3.2}Actor and Critic Approximators}{2}{subsubsection.2.3.2}}
\newlabel{critic network in the approximate solution using RL on discrete time system}{{14}{2}{Actor and Critic Approximators}{equation.2.14}{}}
\newlabel{optimization objective of update critic network}{{15}{2}{Actor and Critic Approximators}{equation.2.15}{}}
\@writefile{toc}{\contentsline {subsubsection}{\numberline {2.3.3}Event-Triggered RL}{3}{subsubsection.2.3.3}}
\@writefile{toc}{\contentsline {subsubsection}{\numberline {2.3.4} Q Function for the DT Linear Quadratic Regulation }{3}{subsubsection.2.3.4}}
\@writefile{toc}{\contentsline {subsection}{\numberline {2.4}Optimal Tracking Problem}{4}{subsection.2.4}}
\@writefile{toc}{\contentsline {subsection}{\numberline {2.5}Approximate Solution Using RL}{4}{subsection.2.5}}
\@writefile{toc}{\contentsline {subsubsection}{\numberline {2.5.1}Offline PI Algorithm}{4}{subsubsection.2.5.1}}
\@writefile{toc}{\contentsline {subsubsection}{\numberline {2.5.2}Online Actor and Critic Approximators}{4}{subsubsection.2.5.2}}
\@writefile{toc}{\contentsline {subsection}{\numberline {2.6}$\mathcal  {H}_{ \infty }$ Control of DT Systems}{4}{subsection.2.6}}
\@writefile{toc}{\contentsline {subsection}{\numberline {2.7}Approximate Solution Using RL}{5}{subsection.2.7}}
\@writefile{toc}{\contentsline {subsubsection}{\numberline {2.7.1}On-Policy RL to Solve $\mathcal  {H}_{ \infty }$ Control of DT Systems}{5}{subsubsection.2.7.1}}
\@writefile{toc}{\contentsline {subsubsection}{\numberline {2.7.2}Off-Policy RL for Solving Zero-Sum Game Problem of DT Systems}{5}{subsubsection.2.7.2}}
\@writefile{toc}{\contentsline {section}{\numberline {3}OPTIMAL CONTROL OF CT SYSTEMS AND ONLINE SOLUTIONS}{5}{section.3}}
\@writefile{toc}{\contentsline {subsection}{\numberline {3.1}Optimal Regulation Problem}{5}{subsection.3.1}}
\@writefile{toc}{\contentsline {subsection}{\numberline {3.2}Approximate Solution Using RL}{6}{subsection.3.2}}
\@writefile{toc}{\contentsline {subsubsection}{\numberline {3.2.1}On-Policy IRL}{6}{subsubsection.3.2.1}}
\@writefile{toc}{\contentsline {subsubsection}{\numberline {3.2.2}On-Policy IRL With Experience Replay Learning Technique [70]–[72]}{6}{subsubsection.3.2.2}}
\@writefile{toc}{\contentsline {subsubsection}{\numberline {3.2.3}Event-Triggered On-Policy RL [74]}{6}{subsubsection.3.2.3}}
\@writefile{toc}{\contentsline {subsubsection}{\numberline {3.2.4}Off-Policy IRL [79], [80]}{6}{subsubsection.3.2.4}}
\@writefile{toc}{\contentsline {subsubsection}{\numberline {3.2.5}Robust Off-Policy IRL [79]}{6}{subsubsection.3.2.5}}
\@writefile{toc}{\contentsline {subsection}{\numberline {3.3}Optimal Tracking Problem}{6}{subsection.3.3}}
\@writefile{toc}{\contentsline {subsection}{\numberline {3.4}Approximate Solution Using RL}{6}{subsection.3.4}}
\@writefile{toc}{\contentsline {subsubsection}{\numberline {3.4.1}On-Policy IRL}{6}{subsubsection.3.4.1}}
\@writefile{toc}{\contentsline {subsubsection}{\numberline {3.4.2}Off-Policy IRL}{6}{subsubsection.3.4.2}}
\@writefile{toc}{\contentsline {subsubsection}{\numberline {3.4.3}$\mathcal  {H}_{ \infty }$ Control of CT Systems}{6}{subsubsection.3.4.3}}
\@writefile{toc}{\contentsline {subsection}{\numberline {3.5}Approximate Solution Using RL}{6}{subsection.3.5}}
\@writefile{toc}{\contentsline {subsubsection}{\numberline {3.5.1}On-Policy IRL}{6}{subsubsection.3.5.1}}
\@writefile{toc}{\contentsline {subsubsection}{\numberline {3.5.2}Off-Policy IRL [80]}{6}{subsubsection.3.5.2}}
\@writefile{toc}{\contentsline {subsection}{\numberline {3.6}Nash Games}{6}{subsection.3.6}}
\@writefile{toc}{\contentsline {subsection}{\numberline {3.7}Approximate Solution Using RL}{6}{subsection.3.7}}
\@writefile{toc}{\contentsline {subsubsection}{\numberline {3.7.1}On-Policy IRL:}{6}{subsubsection.3.7.1}}
\@writefile{toc}{\contentsline {section}{\numberline {4}GRAPHICAL GAMES}{6}{section.4}}
\@writefile{toc}{\contentsline {subsection}{\numberline {4.1}Approximate Solution Using RL}{6}{subsection.4.1}}
\@writefile{toc}{\contentsline {section}{\numberline {5}APPLICATIONS}{6}{section.5}}
\@writefile{toc}{\contentsline {subsection}{\numberline {5.1}Robot Control and Navigation}{6}{subsection.5.1}}
\@writefile{toc}{\contentsline {subsection}{\numberline {5.2}Power Systems}{6}{subsection.5.2}}
\@writefile{toc}{\contentsline {section}{\numberline {6}CONCLUSION}{6}{section.6}}
