\relax 
\citation{ashton2009internet,Nitti2015Friend,Ganz2015Prac,Hao2014DataClouds,Ortiz2014Cluster,Akyildiz2015Internet}
\citation{ashton2009internet}
\citation{Nitti2015Friend}
\citation{Ganz2015Prac}
\citation{Hao2014DataClouds}
\citation{Ortiz2014Cluster}
\citation{Akyildiz2015Internet}
\citation{ramanathan2002brief,frodigh2000wireless,pirinen2014brief,Yichuan2014Understanding,Kazienko2011Multi,Yagan2013Conjoining,Azimdoost2013Capacity,Dashun2015Impact}
\citation{ramanathan2002brief}
\citation{frodigh2000wireless}
\citation{pirinen2014brief}
\citation{Yichuan2014Understanding}
\citation{Kazienko2011Multi}
\citation{Yagan2013Conjoining}
\citation{Azimdoost2013Capacity}
\citation{Dashun2015Impact}
\citation{Wei2004Probabilistic,Gupta2003Adaptive,Chen2002Architectures,Chao2014Cooperative,DaSilva2009MANIAC}
\citation{Wei2004Probabilistic}
\citation{Gupta2003Adaptive}
\citation{Chen2002Architectures}
\citation{Chao2014Cooperative}
\citation{DaSilva2009MANIAC}
\citation{freebersyser2001dod}
\citation{freebersyser2001dod}
\citation{jubin1987darpa}
\citation{jubin1987darpa}
\citation{frodigh2000wireless}
\citation{frodigh2000wireless}
\citation{Shoji2006OFDM,Calin2006MAGNET,Wook2011AMY,Gutierrez2001IEEE,Siep2000Paving}
\citation{Shoji2006OFDM}
\citation{Calin2006MAGNET}
\citation{Wook2011AMY}
\citation{Gutierrez2001IEEE}
\citation{Siep2000Paving}
\citation{Baronti2011Design,Kyung2004IEEE,Abdalla2009Joint,Menglan2014Holistic,Alcaraz2011Link}
\citation{Baronti2011Design}
\citation{Kyung2004IEEE}
\citation{Abdalla2009Joint}
\citation{Menglan2014Holistic}
\citation{Alcaraz2011Link}
\citation{Qingquan2009Hierarchical,Vaa2007Intelligent,Tomas2013Intelligent,Pagano2013Is,Di2011Route,Rudin2010Intelligent}
\citation{Qingquan2009Hierarchical}
\citation{Vaa2007Intelligent}
\citation{Tomas2013Intelligent}
\citation{Pagano2013Is}
\citation{Di2011Route}
\citation{Rudin2010Intelligent}
\@writefile{toc}{\contentsline {chapter}{\numberline {第\nobreakspace  {}\CJKnumber  {1}\nobreakspace  {}章}说明文档}{1}{chapter.1}}
\newlabel{cha:intro}{{1}{1}{说明文档\relax }{chapter.1}{}}
\@writefile{toc}{\contentsline {section}{\numberline {1.1}命名规范}{1}{section.1.1}}
\@writefile{toc}{\contentsline {subsection}{\numberline {1.1.1}名字组成}{1}{subsection.1.1.1}}
\@writefile{lof}{\contentsline {figure}{\numberline {1.1}{\ignorespaces 2020年以前历年无线设备数量。\relax }}{2}{figure.caption.11}}
\@writefile{lof}{\contentsline {figure}{\numberline {1.1}{\ignorespaces Number of wireless devices in each year before 2020.\relax }}{2}{figure.caption.11}}
\providecommand*\caption@xref[2]{\@setref\relax\@undefined{#1}}
\newlabel{Fig0101:NumberOfWirelessDevices}{{1.1}{2}{Number of wireless devices in each year before 2020.\relax \relax }{figure.caption.11}{}}
\citation{Siep2000Paving,Petrova2006Performance,ElSawy2011Distributed,IEEEPANs,IEEEWAVE,IEEEWAVE1,IEEERedline}
\citation{Siep2000Paving}
\citation{Petrova2006Performance}
\citation{ElSawy2011Distributed}
\citation{IEEEPANs}
\citation{IEEEWAVE}
\citation{IEEEWAVE1}
\citation{IEEERedline}
\@writefile{lof}{\contentsline {figure}{\numberline {1.2}{\ignorespaces 2020年以前历年无线设备数量。\relax }}{3}{figure.caption.12}}
\@writefile{lof}{\contentsline {figure}{\numberline {1.2}{\ignorespaces Number of wireless devices in each year before 2020.\relax }}{3}{figure.caption.12}}
\newlabel{Fig1:NumberOfWirelessDevices}{{1.2}{3}{Number of wireless devices in each year before 2020.\relax \relax }{figure.caption.12}{}}
\citation{PengThesis,NingThesis}
\citation{PengThesis}
\citation{NingThesis}
\@writefile{toc}{\contentsline {section}{\numberline {1.2}无线Ad Hoc网络研究概述}{4}{section.1.2}}
\@writefile{toc}{\contentsline {subsection}{\numberline {1.2.1}无线Ad Hoc网络结构}{4}{subsection.1.2.1}}
\@writefile{lof}{\contentsline {figure}{\numberline {1.3}{\ignorespaces 异构无线Ad Hoc网络。\relax }}{5}{figure.caption.13}}
\@writefile{lof}{\contentsline {figure}{\numberline {1.3}{\ignorespaces Heterogeneous wireless Ad Hoc network.\relax }}{5}{figure.caption.13}}
\newlabel{Fig1:HeterogeneousAdhoc}{{1.3}{5}{Heterogeneous wireless Ad Hoc network.\relax \relax }{figure.caption.13}{}}
\@writefile{lof}{\contentsline {figure}{\numberline {1.4}{\ignorespaces 同构无线Ad Hoc网络。\relax }}{6}{figure.caption.14}}
\@writefile{lof}{\contentsline {figure}{\numberline {1.4}{\ignorespaces Homogeneous wireless Ad Hoc network.\relax }}{6}{figure.caption.14}}
\newlabel{Fig1:HomogeneousAdhoc}{{1.4}{6}{Homogeneous wireless Ad Hoc network.\relax \relax }{figure.caption.14}{}}
\@writefile{toc}{\contentsline {subsection}{\numberline {1.2.2}无线Ad Hoc网络特征}{6}{subsection.1.2.2}}
\@writefile{lof}{\contentsline {figure}{\numberline {1.5}{\ignorespaces 混合无线Ad Hoc网络。\relax }}{7}{figure.caption.15}}
\@writefile{lof}{\contentsline {figure}{\numberline {1.5}{\ignorespaces Hybrid wireless Ad Hoc network.\relax }}{7}{figure.caption.15}}
\newlabel{Fig1:HybridAdhoc}{{1.5}{7}{Hybrid wireless Ad Hoc network.\relax \relax }{figure.caption.15}{}}
\@writefile{toc}{\contentsline {subsection}{\numberline {1.2.3}无线Ad Hoc网络应用}{8}{subsection.1.2.3}}
\@writefile{toc}{\contentsline {subsection}{\numberline {1.2.4}无线Ad Hoc网络面临的挑战}{9}{subsection.1.2.4}}
\citation{kramer_cooperative_2006,letaief_cooperative_2009,laneman_cooperative_2006}
\citation{kramer_cooperative_2006}
\citation{letaief_cooperative_2009}
\citation{laneman_cooperative_2006}
\@writefile{toc}{\contentsline {section}{\numberline {1.3}利用已知干扰的协作通信相关研究概述}{10}{section.1.3}}
\@writefile{lof}{\contentsline {figure}{\numberline {1.6}{\ignorespaces 单源协作通信示例。\relax }}{11}{figure.caption.16}}
\@writefile{lof}{\contentsline {figure}{\numberline {1.6}{\ignorespaces An example of single-source cooperative communication.\relax }}{11}{figure.caption.16}}
\newlabel{Fig1:CooperativeComm}{{1.6}{11}{An example of single-source cooperative communication.\relax \relax }{figure.caption.16}{}}
\citation{refNCFirstPaper}
\citation{refNCFirstPaper}
\citation{refNCFirstPaper}
\citation{refNCFirstPaper}
\citation{refHotTopic,ANCori}
\citation{refHotTopic}
\citation{ANCori}
\citation{refHotTopic,ANCori,ANCPower}
\citation{refHotTopic}
\citation{ANCori}
\citation{ANCPower}
\citation{wang2007high,luo2007decode}
\citation{wang2007high}
\citation{luo2007decode}
\citation{ANCPower,COPE,le2010dcar,CooNC,yan2008rate,sengupta2007analysis,OnInterPlay,Rateadaption,chi2010joint,wang2012constellation,faraji2013non,OptimalFadingPNC,Mapping,refPNCSync,HuangYangTwc}
\citation{ANCPower}
\citation{COPE}
\citation{le2010dcar}
\citation{CooNC}
\citation{yan2008rate}
\citation{sengupta2007analysis}
\citation{OnInterPlay}
\citation{Rateadaption}
\citation{chi2010joint}
\citation{wang2012constellation}
\citation{faraji2013non}
\citation{OptimalFadingPNC}
\citation{Mapping}
\citation{refPNCSync}
\citation{HuangYangTwc}
\citation{COPE}
\citation{COPE}
\citation{COPE}
\citation{COPE}
\citation{le2010dcar}
\citation{le2010dcar}
\citation{CooNC}
\citation{CooNC}
\citation{yan2008rate}
\citation{yan2008rate}
\citation{sengupta2007analysis}
\citation{sengupta2007analysis}
\citation{OnInterPlay}
\citation{OnInterPlay}
\citation{Rateadaption}
\citation{Rateadaption}
\citation{chi2010joint}
\citation{chi2010joint}
\citation{ANCPower}
\citation{ANCPower}
\citation{ANCPower}
\citation{ANCPower}
\citation{wang2012constellation,faraji2013non,OptimalFadingPNC,Mapping}
\citation{wang2012constellation}
\citation{faraji2013non}
\citation{OptimalFadingPNC}
\citation{Mapping}
\citation{wang2012constellation}
\citation{wang2012constellation}
\citation{refPNCSync,HuangYangTwc}
\citation{refPNCSync}
\citation{HuangYangTwc}
\@writefile{toc}{\contentsline {subsection}{\numberline {1.3.1}多数据流已知干扰消除技术研究概述}{12}{subsection.1.3.1}}
\new@pagectr{footnote}{1}{12}
\citation{OCSMA}
\citation{OCSMA}
\citation{fullDuplex}
\citation{fullDuplex}
\citation{KIC2,BKIC}
\citation{KIC2}
\citation{BKIC}
\citation{fullDuplex}
\citation{fullDuplex}
\@writefile{lof}{\contentsline {figure}{\numberline {1.7}{\ignorespaces 存储转发和多数据流已知干扰消除：(a) 存储转发方式，(b) 传统网络编码，(c) 物理层网络编码\relax }}{13}{figure.caption.17}}
\@writefile{lof}{\contentsline {figure}{\numberline {1.7}{\ignorespaces Store-and-forward and multi-flow KIC: (a) store-and-farword, (b) CNC, (c) PNC.\relax }}{13}{figure.caption.17}}
\newlabel{Fig1:bidirecMultiSourceCooComm}{{1.7}{13}{Store-and-forward and multi-flow KIC: (a) store-and-farword, (b) CNC, (c) PNC.\relax \relax }{figure.caption.17}{}}
\@writefile{toc}{\contentsline {subsection}{\numberline {1.3.2}单数据流已知干扰消除技术研究概述}{13}{subsection.1.3.2}}
\citation{KIC2}
\citation{KIC2}
\citation{zigzag}
\citation{zigzag}
\citation{OCSMA}
\citation{OCSMA}
\citation{BKIC}
\citation{BKIC}
\citation{Achieving,Rethinking,PracticalFD,Limits,fullDuplex,UAVFD,sundaresan2014full,SIC5G}
\citation{Achieving}
\citation{Rethinking}
\citation{PracticalFD}
\citation{Limits}
\citation{fullDuplex}
\citation{UAVFD}
\citation{sundaresan2014full}
\citation{SIC5G}
\citation{Achieving}
\citation{Achieving}
\citation{Achieving}
\citation{Achieving}
\citation{Rethinking}
\citation{Rethinking}
\citation{PracticalFD,Limits}
\citation{PracticalFD}
\citation{Limits}
\citation{Achieving}
\citation{Achieving}
\citation{fullDuplex}
\citation{fullDuplex}
\citation{fullDuplex}
\citation{fullDuplex}
\citation{UAVFD}
\citation{UAVFD}
\citation{sundaresan2014full}
\citation{sundaresan2014full}
\citation{SIC5G}
\citation{SIC5G}
\citation{M80211}
\citation{M80211}
\@writefile{toc}{\contentsline {subsection}{\numberline {1.3.3}支持已知干扰消除通信技术的MAC协议研究概述}{14}{subsection.1.3.3}}
\@writefile{lof}{\contentsline {figure}{\numberline {1.8}{\ignorespaces 单数据流已知干扰消除：(a) 叠加传输，(b) 全双工\relax }}{15}{figure.caption.18}}
\@writefile{lof}{\contentsline {figure}{\numberline {1.8}{\ignorespaces Single-flow KIC: (a) overlapped transmission, (b) full-duplex radio.\relax }}{15}{figure.caption.18}}
\newlabel{Fig1:OverlappedFDTx}{{1.8}{15}{Single-flow KIC: (a) overlapped transmission, (b) full-duplex radio.\relax \relax }{figure.caption.18}{}}
\citation{Problems1,Problems2}
\citation{Problems1}
\citation{Problems2}
\citation{OCSMA,refMAC18,refMAC20,MAC,ANCMAC,Achieving,Rethinking,PracticalFD,UAVFD,sundaresan2014full,MuraFD,Limits,EFFD,MUD,Bianchi1,jang2012ieee,ng2007throughput,ThroughputTingChao,tsertou2005new}
\citation{OCSMA}
\citation{refMAC18}
\citation{refMAC20}
\citation{MAC}
\citation{ANCMAC}
\citation{Achieving}
\citation{Rethinking}
\citation{PracticalFD}
\citation{UAVFD}
\citation{sundaresan2014full}
\citation{MuraFD}
\citation{Limits}
\citation{EFFD}
\citation{MUD}
\citation{Bianchi1}
\citation{jang2012ieee}
\citation{ng2007throughput}
\citation{ThroughputTingChao}
\citation{tsertou2005new}
\@writefile{lof}{\contentsline {figure}{\numberline {1.9}{\ignorespaces 单数据流已知干扰消除：(a) 重传，(b) 广播\relax }}{16}{figure.caption.19}}
\@writefile{lof}{\contentsline {figure}{\numberline {1.9}{\ignorespaces Single-flow KIC: (a) retransmission, (b) broadcast.\relax }}{16}{figure.caption.19}}
\newlabel{Fig1:RetransAndBroadcast}{{1.9}{16}{Single-flow KIC: (a) retransmission, (b) broadcast.\relax \relax }{figure.caption.19}{}}
\citation{refMAC18,refMAC20}
\citation{refMAC18}
\citation{refMAC20}
\citation{OCSMA}
\citation{OCSMA}
\citation{MAC,ANCMAC}
\citation{MAC}
\citation{ANCMAC}
\citation{Achieving,Rethinking,PracticalFD,UAVFD,sundaresan2014full,MuraFD}
\citation{Achieving}
\citation{Rethinking}
\citation{PracticalFD}
\citation{UAVFD}
\citation{sundaresan2014full}
\citation{MuraFD}
\citation{Limits}
\citation{Limits}
\citation{EFFD}
\citation{EFFD}
\citation{Limits,EFFD}
\citation{Limits}
\citation{EFFD}
\citation{Bianchi1}
\citation{Bianchi1}
\citation{jang2012ieee}
\citation{jang2012ieee}
\citation{ng2007throughput}
\citation{ng2007throughput}
\citation{ThroughputTingChao,tsertou2005new}
\citation{ThroughputTingChao}
\citation{tsertou2005new}
\@writefile{lot}{\contentsline {table}{\numberline {1.1}{\ignorespaces IEEE 802.11标准族\relax }}{17}{table.caption.20}}
\@writefile{lot}{\contentsline {table}{\numberline {1.1}{\ignorespaces IEEE 802.11 Family of Standards\relax }}{17}{table.caption.20}}
\newlabel{Tab1:IEEE80211x}{{1.1}{17}{IEEE 802.11 Family of Standards\relax \relax }{table.caption.20}{}}
\@writefile{toc}{\contentsline {section}{\numberline {1.4}本文主要创新点}{18}{section.1.4}}
\@writefile{toc}{\contentsline {section}{\numberline {1.5}本文的内容安排}{19}{section.1.5}}
\@setckpt{data/chap01}{
\setcounter{page}{21}
\setcounter{equation}{0}
\setcounter{enumi}{0}
\setcounter{enumii}{0}
\setcounter{enumiii}{0}
\setcounter{enumiv}{0}
\setcounter{footnote}{1}
\setcounter{mpfootnote}{0}
\setcounter{part}{0}
\setcounter{chapter}{1}
\setcounter{section}{5}
\setcounter{subsection}{0}
\setcounter{subsubsection}{0}
\setcounter{paragraph}{0}
\setcounter{subparagraph}{0}
\setcounter{figure}{9}
\setcounter{table}{1}
\setcounter{parentequation}{0}
\setcounter{ContinuedFloat}{0}
\setcounter{KVtest}{2}
\setcounter{subfigure}{0}
\setcounter{subfigure@save}{0}
\setcounter{lofdepth}{1}
\setcounter{subtable}{0}
\setcounter{subtable@save}{0}
\setcounter{lotdepth}{1}
\setcounter{endNonectr}{18}
\setcounter{currNonectr}{0}
\setcounter{LT@tables}{0}
\setcounter{LT@chunks}{0}
\setcounter{NAT@ctr}{0}
\setcounter{Item}{0}
\setcounter{Hfootnote}{1}
\setcounter{bookmark@seq@number}{19}
\setcounter{pcabs@footnote}{1}
\setcounter{thu@bookmark}{1}
\setcounter{currproofctr}{0}
\setcounter{endproofctr}{0}
\setcounter{proof}{0}
\setcounter{currassumptionctr}{0}
\setcounter{endassumptionctr}{0}
\setcounter{assumption}{0}
\setcounter{currdefinitionctr}{0}
\setcounter{enddefinitionctr}{0}
\setcounter{definition}{0}
\setcounter{currpropositionctr}{0}
\setcounter{endpropositionctr}{0}
\setcounter{proposition}{0}
\setcounter{currlemmactr}{0}
\setcounter{endlemmactr}{0}
\setcounter{lemma}{0}
\setcounter{currtheoremctr}{0}
\setcounter{endtheoremctr}{0}
\setcounter{theorem}{0}
\setcounter{curraxiomctr}{0}
\setcounter{endaxiomctr}{0}
\setcounter{axiom}{0}
\setcounter{currcorollaryctr}{0}
\setcounter{endcorollaryctr}{0}
\setcounter{corollary}{0}
\setcounter{currexercisectr}{0}
\setcounter{endexercisectr}{0}
\setcounter{exercise}{0}
\setcounter{currexamplectr}{0}
\setcounter{endexamplectr}{0}
\setcounter{example}{0}
\setcounter{currremarkctr}{0}
\setcounter{endremarkctr}{0}
\setcounter{remark}{0}
\setcounter{currproblemctr}{0}
\setcounter{endproblemctr}{0}
\setcounter{problem}{0}
\setcounter{currconjecturectr}{0}
\setcounter{endconjecturectr}{0}
\setcounter{conjecture}{0}
\setcounter{float@type}{4}
\setcounter{ALC@unique}{0}
\setcounter{ALC@line}{0}
\setcounter{ALC@rem}{0}
\setcounter{ALC@depth}{0}
\setcounter{IEEEsubequation}{0}
\setcounter{currthmctr}{0}
\setcounter{endthmctr}{0}
\setcounter{thm}{0}
\setcounter{currlemctr}{0}
\setcounter{endlemctr}{0}
\setcounter{section@level}{1}
}
