\relax 
\citation{V2V,FeasiPNC}
\citation{V2V}
\citation{FeasiPNC}
\citation{refHotTopic,SMAC,fullDuplex}
\citation{refHotTopic}
\citation{SMAC}
\citation{fullDuplex}
\citation{refHotTopic,SMAC,OCSMA,fullDuplex}
\citation{refHotTopic}
\citation{SMAC}
\citation{OCSMA}
\citation{fullDuplex}
\citation{KIC2,BKIC}
\citation{KIC2}
\citation{BKIC}
\citation{fullDuplex}
\citation{fullDuplex}
\citation{OCSMA}
\citation{OCSMA}
\citation{refMAC18,refMAC20}
\citation{refMAC18}
\citation{refMAC20}
\citation{MAC}
\citation{MAC}
\citation{Achieving,Rethinking,PracticalFD,MuraFD,UAVFD,sundaresan2014full}
\citation{Achieving}
\citation{Rethinking}
\citation{PracticalFD}
\citation{MuraFD}
\citation{UAVFD}
\citation{sundaresan2014full}
\citation{Limits}
\citation{Limits}
\citation{EFFD}
\citation{EFFD}
\@writefile{toc}{\contentsline {chapter}{\numberline {第\nobreakspace  {}\CJKnumber  {4}\nobreakspace  {}章}已知干扰消除在多跳数据流中的应用}{65}{chapter.4}}
\newlabel{cha4}{{4}{65}{已知干扰消除在多跳数据流中的应用\relax }{chapter.4}{}}
\@writefile{toc}{\contentsline {section}{\numberline {4.1}研究背景}{65}{section.4.1}}
\@writefile{lof}{\contentsline {figure}{\numberline {4.1}{\ignorespaces 单数据流已知干扰消除：(a) 叠加传输，(b) 全双工\relax }}{66}{figure.caption.48}}
\@writefile{lof}{\contentsline {figure}{\numberline {4.1}{\ignorespaces Single-flow KIC: (a) overlapped transmission, (b) full-duplex radio.\relax }}{66}{figure.caption.48}}
\newlabel{Fig4:Chap4OverlappedFDTx}{{4.1}{66}{Single-flow KIC: (a) overlapped transmission, (b) full-duplex radio.\relax \relax }{figure.caption.48}{}}
\citation{fullDuplex}
\citation{fullDuplex}
\citation{wang2012constellation,Mapping}
\citation{wang2012constellation}
\citation{Mapping}
\@writefile{toc}{\contentsline {section}{\numberline {4.2}双向数据流端到端已知干扰消除}{67}{section.4.2}}
\@writefile{toc}{\contentsline {subsection}{\numberline {4.2.1}BE2E-KIC的基本原理}{67}{subsection.4.2.1}}
\@writefile{toc}{\contentsline {subsection}{\numberline {4.2.2}BE2E-KIC的可行性分析和吞吐量表现}{67}{subsection.4.2.2}}
\newlabel{chap4:secMotivation}{{4.2.2}{67}{BE2E-KIC的可行性分析和吞吐量表现\relax }{subsection.4.2.2}{}}
\new@pagectr{footnote}{3}{67}
\@writefile{lof}{\contentsline {figure}{\numberline {4.2}{\ignorespaces 以BE2E-KIC作为传输方式的四节点数据流。一些数据包被从$n_{1}$发送到$n_{4}$，同时另一些数据包被从$n_{4}$发送到$n_{1}$。变量$t$、$n$、$p$和$q$分别代表传输时隙、节点、从$n_{1}$到$n_{4}$的数据包和从$n_{4}$到$n_{1}$的数据包。\relax }}{68}{figure.caption.49}}
\@writefile{lof}{\contentsline {figure}{\numberline {4.2}{\ignorespaces Flow through four neighboring nodes transmitted by BE2E-KIC. Packets are sent from $n_{1}$ to $n_{4}$ and also from $n_{4}$ to $n_{1}$. Variables $t$, $n$, $p$ and $q$ respectively denote the timeslots, nodes, packets from $n_{1}$ to $n_{4}$, and packets from $n_{4}$ to $n_{1}$.\relax }}{68}{figure.caption.49}}
\newlabel{Fig4:Cha4BE2EKIC4Nodes}{{4.2}{68}{Flow through four neighboring nodes transmitted by BE2E-KIC. Packets are sent from $n_{1}$ to $n_{4}$ and also from $n_{4}$ to $n_{1}$. Variables $t$, $n$, $p$ and $q$ respectively denote the timeslots, nodes, packets from $n_{1}$ to $n_{4}$, and packets from $n_{4}$ to $n_{1}$.\relax \relax }{figure.caption.49}{}}
\@writefile{thm}{\contentsline {proposition}{{命题}{4.{1}}{}}{68}{proposition.4.1}}
\citation{KIC2}
\citation{KIC2}
\citation{fullDuplex}
\citation{fullDuplex}
\@writefile{loe}{\contentsline {equation}{\numberline {4-1}}{69}{equation.4.2.1}}
\newlabel{Eqn4:E2ET-BE2E-KIC}{{4-1}{69}{BE2E-KIC的可行性分析和吞吐量表现\relax }{equation.4.2.1}{}}
\@writefile{loe}{\contentsline {equation}{\numberline {4-2}}{69}{equation.4.2.2}}
\citation{refHotTopic}
\citation{refHotTopic}
\@writefile{lof}{\contentsline {figure}{\numberline {4.3}{\ignorespaces 已有KIC传输方式：(a) PNC，(b) FD。图中首个节点和最后一个节点想要交换数据。变量$t$、$n$、$p$和$q$分别代表传输时隙、节点、从首个节点到末尾节点的数据包和从末尾节点到首个节点的数据包。\relax }}{70}{figure.caption.50}}
\@writefile{lof}{\contentsline {figure}{\numberline {4.3}{\ignorespaces Basic scenarios for existing KIC methods: (a) PNC, (b) FD. In both subfigures, the first node and the last node want to exchange packets. Variables $t$, $n$, $p$ and $q$ respectively denote timeslots, nodes, packets from the first node to the last node, and packets from the last node to the first node.\relax }}{70}{figure.caption.50}}
\newlabel{Fig4:PNCandFD}{{4.3}{70}{Basic scenarios for existing KIC methods: (a) PNC, (b) FD. In both subfigures, the first node and the last node want to exchange packets. Variables $t$, $n$, $p$ and $q$ respectively denote timeslots, nodes, packets from the first node to the last node, and packets from the last node to the first node.\relax \relax }{figure.caption.50}{}}
\@writefile{loe}{\contentsline {equation}{\numberline {4-3}}{70}{equation.4.2.3}}
\@writefile{loe}{\contentsline {equation}{\numberline {4-4}}{70}{equation.4.2.4}}
\newlabel{Eqn4:differentKICThRatio}{{4-5}{70}{BE2E-KIC的可行性分析和吞吐量表现\relax }{equation.4.2.5}{}}
\newlabel{Eqn4:BE2E-KIC_th_MtoInf}{{4-6}{70}{BE2E-KIC的可行性分析和吞吐量表现\relax }{equation.4.2.6}{}}
\@writefile{toc}{\contentsline {subsection}{\numberline {4.2.3}面向BE2E-KIC的MAC方案}{71}{subsection.4.2.3}}
\newlabel{chap4:sectMAC}{{4.2.3}{71}{面向BE2E-KIC的MAC方案\relax }{subsection.4.2.3}{}}
\@writefile{lof}{\contentsline {figure}{\numberline {4.4}{\ignorespaces BE2E-KIC MAC帧交换标准时序图。\relax }}{72}{figure.caption.51}}
\@writefile{lof}{\contentsline {figure}{\numberline {4.4}{\ignorespaces Standard timing diagram of frame exchange in BE2E-KIC MAC.\relax }}{72}{figure.caption.51}}
\newlabel{Fig4:BE2EKICTiming}{{4.4}{72}{Standard timing diagram of frame exchange in BE2E-KIC MAC.\relax \relax }{figure.caption.51}{}}
\@writefile{lof}{\contentsline {figure}{\numberline {4.5}{\ignorespaces BE2E-KIC MAC帧格式。\relax }}{73}{figure.caption.52}}
\@writefile{lof}{\contentsline {figure}{\numberline {4.5}{\ignorespaces Frame formats of BE2E-KIC MAC.\relax }}{73}{figure.caption.52}}
\newlabel{Fig4:frameFormats}{{4.5}{73}{Frame formats of BE2E-KIC MAC.\relax \relax }{figure.caption.52}{}}
\@writefile{lof}{\contentsline {figure}{\numberline {4.6}{\ignorespaces IEEE 802.11 MAC帧格式。\relax }}{74}{figure.caption.53}}
\@writefile{lof}{\contentsline {figure}{\numberline {4.6}{\ignorespaces Frame formats of IEEE 802.11 MAC.\relax }}{74}{figure.caption.53}}
\newlabel{Fig4:IEEE80211MACFrameFormats}{{4.6}{74}{Frame formats of IEEE 802.11 MAC.\relax \relax }{figure.caption.53}{}}
\@writefile{lot}{\contentsline {table}{\numberline {4.1}{\ignorespaces 面向采用异或编码的BE2E-KIC消除算法的伪代码\relax }}{75}{table.caption.54}}
\@writefile{lot}{\contentsline {table}{\numberline {4.1}{\ignorespaces Pseudo-code of cancellation algorithm for BE2E-KIC with XOR encoding\relax }}{75}{table.caption.54}}
\newlabel{Tab4:algo_Cancellation}{{4.1}{75}{Pseudo-code of cancellation algorithm for BE2E-KIC with XOR encoding\relax \relax }{table.caption.54}{}}
\@writefile{lof}{\contentsline {figure}{\numberline {4.7}{\ignorespaces BE2E-KIC MAC消除算法原理图。\relax }}{76}{figure.caption.55}}
\@writefile{lof}{\contentsline {figure}{\numberline {4.7}{\ignorespaces Diagram of cancellation algorithm for BE2E-KIC with XOR encoding.\relax }}{76}{figure.caption.55}}
\newlabel{Fig4:DiagramOfCancellation}{{4.7}{76}{Diagram of cancellation algorithm for BE2E-KIC with XOR encoding.\relax \relax }{figure.caption.55}{}}
\@writefile{toc}{\contentsline {section}{\numberline {4.3}单向数据流端到端已知干扰消除}{76}{section.4.3}}
\@writefile{toc}{\contentsline {subsection}{\numberline {4.3.1}UE2E-KIC的基本原理}{76}{subsection.4.3.1}}
\@writefile{lof}{\contentsline {figure}{\numberline {4.8}{\ignorespaces 穿越四个节点以PR和UE2E-KIC作为传输方式的数据流。一条从节点$n_{1}$到$n_{4}$的数据流被配置。变量$t$、$n$和$m$分别代表传输时隙、节点和数据包。\relax }}{77}{figure.caption.56}}
\@writefile{lof}{\contentsline {figure}{\numberline {4.8}{\ignorespaces Flow through four neighboring nodes transmitted by PR and UE2E-KIC: (a) PR, (b) UE2E-KIC. One data flow from $n_{1}$ to $n_{4}$ is configured. Variables $t$, $n$ and $m$ respectively denote timeslots, nodes and packets.\relax }}{77}{figure.caption.56}}
\newlabel{Fig4:PRAndUE2E}{{4.8}{77}{Flow through four neighboring nodes transmitted by PR and UE2E-KIC: (a) PR, (b) UE2E-KIC. One data flow from $n_{1}$ to $n_{4}$ is configured. Variables $t$, $n$ and $m$ respectively denote timeslots, nodes and packets.\relax \relax }{figure.caption.56}{}}
\@writefile{toc}{\contentsline {subsection}{\numberline {4.3.2}UE2E-KIC的可行性分析与吞吐量表现}{77}{subsection.4.3.2}}
\newlabel{Cha4:UE2ETAna}{{4.3.2}{77}{UE2E-KIC的可行性分析与吞吐量表现\relax }{subsection.4.3.2}{}}
\citation{fullDuplex}
\citation{fullDuplex}
\@writefile{lof}{\contentsline {figure}{\numberline {4.9}{\ignorespaces 在一个由$N$个节点组成的多跳数据流中，节点$n_{i}$接收到的期望得到的信号和来自其他节点的干扰。图中UE2E-KIC传输方式被用于支持多个节点的共同传输。\relax }}{78}{figure.caption.57}}
\@writefile{lof}{\contentsline {figure}{\numberline {4.9}{\ignorespaces Intended signal and interferences received by $n_{i}$ in a multi-hop flow with $N$ nodes, where UE2E-KIC is used and nodes simultaneously transmit their signals.\relax }}{78}{figure.caption.57}}
\newlabel{Fig4:UE2EKICInterference}{{4.9}{78}{Intended signal and interferences received by $n_{i}$ in a multi-hop flow with $N$ nodes, where UE2E-KIC is used and nodes simultaneously transmit their signals.\relax \relax }{figure.caption.57}{}}
\citation{BKIC}
\citation{BKIC}
\@writefile{loe}{\contentsline {equation}{\numberline {4-8}}{79}{equation.4.3.8}}
\newlabel{Eqn4:received_signal}{{4-8}{79}{UE2E-KIC的可行性分析与吞吐量表现\relax }{equation.4.3.8}{}}
\@writefile{loe}{\contentsline {equation}{\numberline {4-9}}{79}{equation.4.3.9}}
\newlabel{E2ET-PR}{{4-9}{79}{UE2E-KIC的可行性分析与吞吐量表现\relax }{equation.4.3.9}{}}
\newlabel{Eqn4:E2ET-PNC}{{4-11}{79}{UE2E-KIC的可行性分析与吞吐量表现\relax }{equation.4.3.11}{}}
\newlabel{Eqn4:E2ET-E2EFD}{{4-11}{79}{UE2E-KIC的可行性分析与吞吐量表现\relax }{equation.4.3.11}{}}
\newlabel{Eqn4:E2ET-FD}{{4-12}{79}{UE2E-KIC的可行性分析与吞吐量表现\relax }{equation.4.3.12}{}}
\@writefile{toc}{\contentsline {subsection}{\numberline {4.3.3}UE2E-KIC MAC的设计原则}{80}{subsection.4.3.3}}
\newlabel{chap4:sectOverviewMAC}{{4.3.3}{80}{UE2E-KIC MAC的设计原则\relax }{subsection.4.3.3}{}}
\citation{lei2013challenges}
\citation{lei2013challenges}
\citation{AODV}
\citation{AODV}
\citation{EFFD}
\citation{EFFD}
\@writefile{toc}{\contentsline {subsection}{\numberline {4.3.4}UE2E-KIC MAC的包交换过程}{83}{subsection.4.3.4}}
\newlabel{Chap4:timingUE2E}{{4.3.4}{83}{UE2E-KIC MAC的包交换过程\relax }{subsection.4.3.4}{}}
\@writefile{lof}{\contentsline {figure}{\numberline {4.10}{\ignorespaces 当节点$n_{i}$发起UE2E-KIC过程时，UE2E-KIC MAC标准时序图。\relax }}{84}{figure.caption.58}}
\@writefile{lof}{\contentsline {figure}{\numberline {4.10}{\ignorespaces Standard timing diagram of packet exchange in UE2E-KIC MAC, when $n_{i}$ initiates an E2E-KIC process.\relax }}{84}{figure.caption.58}}
\newlabel{Fig4:timingDiagramUE2E}{{4.10}{84}{Standard timing diagram of packet exchange in UE2E-KIC MAC, when $n_{i}$ initiates an E2E-KIC process.\relax \relax }{figure.caption.58}{}}
\newlabel{DataSendTime3}{{4-13}{85}{UE2E-KIC MAC的包交换过程\relax }{equation.4.3.13}{}}
\newlabel{DataSendTime1}{{4-14}{85}{UE2E-KIC MAC的包交换过程\relax }{equation.4.3.14}{}}
\newlabel{DataSendTime2}{{4-15}{85}{UE2E-KIC MAC的包交换过程\relax }{equation.4.3.15}{}}
\@writefile{toc}{\contentsline {subsection}{\numberline {4.3.5}UE2E-KIC MAC中的异常处理与NAV设置}{86}{subsection.4.3.5}}
\newlabel{NAV_RTS}{{4-18}{86}{UE2E-KIC MAC中的异常处理与NAV设置\relax }{equation.4.3.18}{}}
\citation{MAC}
\citation{MAC}
\citation{MAC}
\citation{MAC}
\citation{EFFD}
\citation{EFFD}
\citation{M80211}
\citation{M80211}
\@writefile{loe}{\contentsline {equation}{\numberline {4-19}}{87}{equation.4.3.19}}
\newlabel{CTSNAV}{{4-19}{87}{UE2E-KIC MAC中的异常处理与NAV设置\relax }{equation.4.3.19}{}}
\@writefile{toc}{\contentsline {subsection}{\numberline {4.3.6}UE2E-KIC MAC的帧格式}{87}{subsection.4.3.6}}
\@writefile{toc}{\contentsline {section}{\numberline {4.4}仿真实现与结果分析}{87}{section.4.4}}
\@writefile{lof}{\contentsline {figure}{\numberline {4.11}{\ignorespaces UE2E-KIC MAC协议的帧格式。\relax }}{88}{figure.caption.59}}
\@writefile{lof}{\contentsline {figure}{\numberline {4.11}{\ignorespaces Frame formats of the UE2E-KIC MAC protocol.\relax }}{88}{figure.caption.59}}
\newlabel{Chap4:frameFormatsUE2E}{{4.11}{88}{Frame formats of the UE2E-KIC MAC protocol.\relax \relax }{figure.caption.59}{}}
\@writefile{toc}{\contentsline {subsection}{\numberline {4.4.1}BE2E-KIC传输方案仿真分析}{88}{subsection.4.4.1}}
\@writefile{lof}{\contentsline {figure}{\numberline {4.12}{\ignorespaces 不同节点数目下的吞吐量。\relax }}{89}{figure.caption.60}}
\@writefile{lof}{\contentsline {figure}{\numberline {4.12}{\ignorespaces Throughput under different number of nodes.\relax }}{89}{figure.caption.60}}
\newlabel{Fig4:ThroughputAll}{{4.12}{89}{Throughput under different number of nodes.\relax \relax }{figure.caption.60}{}}
\citation{OCSMA}
\citation{OCSMA}
\citation{EFFD}
\citation{EFFD}
\@writefile{lof}{\contentsline {figure}{\numberline {4.13}{\ignorespaces 不同节点数目下的端到端时延。\relax }}{90}{figure.caption.61}}
\@writefile{lof}{\contentsline {figure}{\numberline {4.13}{\ignorespaces End-to-end delay under different number of nodes.\relax }}{90}{figure.caption.61}}
\newlabel{Fig4:DelayAll}{{4.13}{90}{End-to-end delay under different number of nodes.\relax \relax }{figure.caption.61}{}}
\@writefile{lof}{\contentsline {figure}{\numberline {4.14}{\ignorespaces 线性拓扑中吞吐量随包速率的变化。\relax }}{91}{figure.caption.62}}
\@writefile{lof}{\contentsline {figure}{\numberline {4.14}{\ignorespaces Throughput vs. packet rate in chain topology.\relax }}{91}{figure.caption.62}}
\newlabel{Fig4:LinearPktRateT}{{4.14}{91}{Throughput vs. packet rate in chain topology.\relax \relax }{figure.caption.62}{}}
\@writefile{toc}{\contentsline {subsection}{\numberline {4.4.2}UE2E-KIC传输方案仿真分析}{91}{subsection.4.4.2}}
\@writefile{lof}{\contentsline {figure}{\numberline {4.15}{\ignorespaces 线性拓扑中端到端时延随包速率的变化。\relax }}{92}{figure.caption.63}}
\@writefile{lof}{\contentsline {figure}{\numberline {4.15}{\ignorespaces End-to-end delay vs. packet rate in chain topology.\relax }}{92}{figure.caption.63}}
\newlabel{Fig4:LinearPktRatedelay}{{4.15}{92}{End-to-end delay vs. packet rate in chain topology.\relax \relax }{figure.caption.63}{}}
\@writefile{lof}{\contentsline {figure}{\numberline {4.16}{\ignorespaces 链状拓扑中吞吐量随节点数目的变化图。\relax }}{93}{figure.caption.64}}
\@writefile{lof}{\contentsline {figure}{\numberline {4.16}{\ignorespaces Throughput vs. node number in chain topology.\relax }}{93}{figure.caption.64}}
\newlabel{Fig4:TLinearTopNodeNum}{{4.16}{93}{Throughput vs. node number in chain topology.\relax \relax }{figure.caption.64}{}}
\@writefile{lof}{\contentsline {figure}{\numberline {4.17}{\ignorespaces 链状拓扑中端到端时延随节点数目的变化图。\relax }}{94}{figure.caption.65}}
\@writefile{lof}{\contentsline {figure}{\numberline {4.17}{\ignorespaces End-to-end delay vs. node number in chain topology.\relax }}{94}{figure.caption.65}}
\newlabel{Fig4:DLinearTopNodeNum}{{4.17}{94}{End-to-end delay vs. node number in chain topology.\relax \relax }{figure.caption.65}{}}
\@writefile{lof}{\contentsline {figure}{\numberline {4.18}{\ignorespaces 随机拓扑中吞吐量随节点速率的变化图。\relax }}{95}{figure.caption.66}}
\@writefile{lof}{\contentsline {figure}{\numberline {4.18}{\ignorespaces Throughput vs. packet rate in random topology.\relax }}{95}{figure.caption.66}}
\newlabel{Fig4:randomT}{{4.18}{95}{Throughput vs. packet rate in random topology.\relax \relax }{figure.caption.66}{}}
\@writefile{lof}{\contentsline {figure}{\numberline {4.19}{\ignorespaces 随机拓扑中端到端时延随节点速率的变化图。\relax }}{96}{figure.caption.67}}
\@writefile{lof}{\contentsline {figure}{\numberline {4.19}{\ignorespaces End-to-end delay vs. packet rate in random topology.\relax }}{96}{figure.caption.67}}
\newlabel{Fig4:randomD}{{4.19}{96}{End-to-end delay vs. packet rate in random topology.\relax \relax }{figure.caption.67}{}}
\@writefile{toc}{\contentsline {section}{\numberline {4.5}本章小结}{97}{section.4.5}}
\@setckpt{data/chap04}{
\setcounter{page}{98}
\setcounter{equation}{20}
\setcounter{enumi}{6}
\setcounter{enumii}{0}
\setcounter{enumiii}{0}
\setcounter{enumiv}{0}
\setcounter{footnote}{1}
\setcounter{mpfootnote}{0}
\setcounter{part}{0}
\setcounter{chapter}{4}
\setcounter{section}{5}
\setcounter{subsection}{0}
\setcounter{subsubsection}{0}
\setcounter{paragraph}{0}
\setcounter{subparagraph}{0}
\setcounter{figure}{19}
\setcounter{table}{1}
\setcounter{parentequation}{0}
\setcounter{ContinuedFloat}{0}
\setcounter{KVtest}{2}
\setcounter{subfigure}{0}
\setcounter{subfigure@save}{0}
\setcounter{lofdepth}{1}
\setcounter{subtable}{0}
\setcounter{subtable@save}{0}
\setcounter{lotdepth}{1}
\setcounter{endNonectr}{68}
\setcounter{currNonectr}{0}
\setcounter{LT@tables}{0}
\setcounter{LT@chunks}{0}
\setcounter{NAT@ctr}{0}
\setcounter{Item}{20}
\setcounter{Hfootnote}{3}
\setcounter{bookmark@seq@number}{65}
\setcounter{pcabs@footnote}{3}
\setcounter{thu@bookmark}{1}
\setcounter{currproofctr}{0}
\setcounter{endproofctr}{0}
\setcounter{proof}{0}
\setcounter{currassumptionctr}{0}
\setcounter{endassumptionctr}{0}
\setcounter{assumption}{0}
\setcounter{currdefinitionctr}{0}
\setcounter{enddefinitionctr}{0}
\setcounter{definition}{0}
\setcounter{currpropositionctr}{1}
\setcounter{endpropositionctr}{23}
\setcounter{proposition}{1}
\setcounter{currlemmactr}{0}
\setcounter{endlemmactr}{0}
\setcounter{lemma}{0}
\setcounter{currtheoremctr}{0}
\setcounter{endtheoremctr}{0}
\setcounter{theorem}{0}
\setcounter{curraxiomctr}{0}
\setcounter{endaxiomctr}{0}
\setcounter{axiom}{0}
\setcounter{currcorollaryctr}{0}
\setcounter{endcorollaryctr}{0}
\setcounter{corollary}{0}
\setcounter{currexercisectr}{0}
\setcounter{endexercisectr}{0}
\setcounter{exercise}{0}
\setcounter{currexamplectr}{0}
\setcounter{endexamplectr}{0}
\setcounter{example}{0}
\setcounter{currremarkctr}{0}
\setcounter{endremarkctr}{0}
\setcounter{remark}{0}
\setcounter{currproblemctr}{0}
\setcounter{endproblemctr}{0}
\setcounter{problem}{0}
\setcounter{currconjecturectr}{0}
\setcounter{endconjecturectr}{0}
\setcounter{conjecture}{0}
\setcounter{float@type}{4}
\setcounter{ALC@unique}{29}
\setcounter{ALC@line}{7}
\setcounter{ALC@rem}{0}
\setcounter{ALC@depth}{0}
\setcounter{IEEEsubequation}{0}
\setcounter{currthmctr}{0}
\setcounter{endthmctr}{0}
\setcounter{thm}{2}
\setcounter{currlemctr}{2}
\setcounter{endlemctr}{2}
\setcounter{section@level}{1}
}
