{
  "questions":[
    {
      "question": "Это Второй билет!?\n",
      "a": "Остановившись непосредственно перед пешеходным переходом, чтобы уступить дорогу пешеходу",
      "b": "Остановившись на проезжей части из-за технической неисправности транспортного средства\n",
      "c": "В обоих перечисленных случаях",
      "d": "",
      "tip": "Правильный ответ: 2\n«Вынужденная остановка» - прекращение движения транспортного средства, связанное с его технической неисправностью, опасностью, создаваемой перевозимым грузом, состоянием водителя (пассажира) или появления препятствия на дороге. (Пункт 1.2 ПДД, термин «Вынужденная остановка»)",
      "answer": "b",
      "img_url": ""
    },
    {
      "question": "Разрешен ли Вам съезд на дорогу с грунтовым покрытием?\n",
      "a": "Разрешен",
      "b": "Разрешен только при технической неисправности транспортного средства\n",
      "c": "Запрещен",
      "d": "",
      "tip": "Правильный ответ: 1\nВпереди по ходу Вашего движения предупреждающий знак 1.11.2 «Опасный поворот» и знаки 1.34.2 «Направление поворота», которые указывают направление движения на закруглении дороги малого радиуса с ограниченной видимостью. Ничего, что бы Вам запрещало съезд на дорогу с грунтовым покрытием, нет. По Вашему желанию поворачиваете направо. («Дорожные знаки»).",
      "answer": "a",
      "img_url": "https://s.drom.ru/i24227/pdd/tickets/2016/1542608213.jpg"
    },
    {
      "question": "Можно ли Вам остановиться в указанном месте для посадки пассажира?\n",
      "a": "Можно",
      "b": "Можно, если Вы управляете такси\n",
      "c": "Нельзя",
      "d": "",
      "tip": "Правильный ответ: 1\nЗнак 3.28 «Стоянка запрещена» не запрещает производить остановку. В указанном месте Вам совершить остановку можно. («Дорожные знаки»)",
      "answer": "a",
      "img_url": "https://s.drom.ru/i24227/pdd/tickets/2016/1542608215.jpg"
    },
    {
      "question": "Какие из указанных знаков запрещают движение водителям мопедов?\n",
      "a": "Только А",
      "b": "Только Б\n",
      "c": "В и Г",
      "d": "Все",
      "tip": "Правильный ответ: 4\nЗапрещают движение водителям мопедов все знаки из перечисленных: А – 4.4.1 «Велосипедная дорожка»; Б – 5.14 «Полоса для маршрутных транспортных средств»; В – 4.5.2 «Пешеходная и велосипедная дорожка с совмещенным движением»; Г – 4.5.4 «Пешеходная и велосипедная дорожка с разделением движения». Правильный ответ - четвертый. (Дорожные знаки) Только знак 5.14.2 «Полоса для велосипедистов» разрешает движение мопедов, но он не представлен в вопросе Пункт 24.7 ПДД",
      "answer": "d",
      "img_url": "https://s.drom.ru/i24227/pdd/tickets/2016/1542608216.jpg"
    },
    {
      "question": "Вы намерены повернуть налево. Где следует остановиться, чтобы уступить дорогу легковому автомобилю?\n",
      "a": "Перед знаком",
      "b": "Перед перекрестком у линии разметки",
      "c": "На перекрестке перед прерывистой линией разметки",
      "d": "В любом месте по усмотрению водителя",
      "tip": "Правильный ответ: 2\nСогласно знаку 2.4 «Уступите дорогу» водители должны пропускать транспорт, движущийся по пересекаемой дороге. Разметка 1.13 в виде треугольников указывает место, где при необходимости следует остановиться. У Вас такая необходимость есть, так как при повороте налево Вы уступаете дорогу легковому автомобилю. («Дорожные знаки», «Горизонтальная разметка»)",
      "answer": "b",
      "img_url": "https://s.drom.ru/i24227/pdd/tickets/2016/1542608218.jpg"
    },
    {
      "question": "Что означает мигание зелёного сигнала светофора?\n",
      "a": "Предупреждает о неисправности светофора",
      "b": "Разрешает движение и информирует о том, что вскоре будет включен запрещающий сигнал",
      "c": "Запрещает дальнейшее движение",
      "d": "",
      "tip": "Правильный ответ: 2\nДлительность мигания зелёного сигнала светофора обычно составляет 3-4 с. Это позволяет водителю заблаговременно, в зависимости от конкретных условий, принять решение: 1) продолжить движение с прежней скоростью; 2) несколько увеличить скорость; 3) начать снижение скорости вплоть до остановки. Правильный ответ – второй. (Пункт 6.2 ПДД)",
      "answer": "b",
      "img_url": ""
    },
    {
      "question": "Водитель обязан подавать сигналы световыми указателями поворота (рукой):\n",
      "a": "Перед началом движения или перестроением",
      "b": "Перед поворотом или разворотом",
      "c": "Перед остановкой",
      "d": "Во всех перечисленных случаях",
      "tip": "Правильный ответ: 4\nПеред началом движения, перестроением, поворотом (разворотом) и остановкой водитель обязан подавать сигналы световыми указателями поворота соответствующего направления, а если они отсутствуют или неисправны – рукой. При выполнении маневра не должны создаваться опасность для движения, а также помехи другим участникам дорожного движения. (Пункт 8.1 ПДД)",
      "answer": "b",
      "img_url": ""
    },
    {
      "question": "Как Вам следует поступить при повороте направо?\n",
      "a": "Перестроиться на правую полосу, затем осуществить поворот",
      "b": "Продолжить движение по второй полосе до перекрёстка, затем повернуть",
      "c": "Возможны оба варианта действий",
      "d": "",
      "tip": "Правильный ответ: 3\nРазметка разрешает поворот направо с обеих полос, поэтому возможны оба варианта действий. В таких случаях, выполняя поворот на перекрёстке, соблюдайте избранную Вами рядность. («Горизонтальная разметка» 1.18, пункт 8.5 ПДД)",
      "answer": "c",
      "img_url": "https://s.drom.ru/i24227/pdd/tickets/2016/1542608220.jpg"
    },
    {
      "question": "По какой траектории Вам разрешено выполнить разворот?\n",
      "a": "Только по А",
      "b": "Только по Б",
      "c": "По любой из указанных",
      "d": "",
      "tip": "Правильный ответ: 1\nВыезд с пересечения проезжих частей должен быть выполнен на «свою» сторону, т.е. исходя из правостороннего движения без выезда на сторону встречного движения. Двигаясь по траектории «Б», Вы совершаете встречное движение по пересекаемой дороге, что крайне опасно, так как можете произвести лобовое столкновение с автомобилем, приближающимся слева. Развернуться следует по траектории «А». (Пункт 8.6 ПДД)",
      "answer": "a",
      "img_url": "https://s.drom.ru/i24227/pdd/tickets/2016/1542608221.jpg"
    },
    {
      "question": "С какой скоростью Вы можете продолжить движение вне населённого пункта по левой полосе на легковом автомобиле?",
      "a": "Не более 50 км/ч",
      "b": "Не менее 50 км/ч и не более 70 км/ч",
      "c": "Не менее 50 км/ч и не более 90 км/ч",
      "d": "",
      "tip": "Правильный ответ: 3\nНад левой полосой висит знак 4.6 «Ограничение минимальной скорости» с табличкой 8.14 «Полоса движения», указывающей полосу движения, на которую распространяется действие знака. Скорость движения по левой полосе не должна быть менее 50 км/ч и не должна превышать допустимой для дорог вне населённых пунктов, т.е. не более 90 км/ч. («Дорожные знаки», пункт 10.3 ПДД)",
      "answer": "c",
      "img_url": "https://s.drom.ru/i24227/pdd/tickets/2016/1542608223.jpg"
    },
    {
      "question": "Можно ли водителю легкового автомобиля выполнить опережение грузовых автомобилей вне населенного пункта по такой траектории?",
      "a": "Можно",
      "b": "Можно, если скорость грузовых автомобилей менее 30 км/ч",
      "c": "Нельзя",
      "d": "",
      "tip": "Правильный ответ: 1\nНа дорогах с двусторонним движением, имеющих четыре и более полос для движения обгон запрещён. В таких ситуациях можно совершать только опережение. Соблюдая правила маневрирования водитель легкового автомобиля на данном участке дороги может совершать опережение любых транспортных средств по различным траекториям включая и указанную. (Пункт 9.2 ПДД)",
      "answer": "a",
      "img_url": "https://s.drom.ru/i24227/pdd/tickets/2016/1542608225.jpg"
    },
    {
      "question": "В каком случае водителю разрешается поставить автомобиль на стоянку в указанном месте?",
      "a": "Только если расстояние до сплошной линии разметки не менее 3 м",
      "b": "Только если расстояние до края пересекаемой проезжей части не менее 5 м",
      "c": "При соблюдении обоих перечисленных условий",
      "d": "",
      "tip": "Правильный ответ: 3\nВодитель не нарушает правила остановки и стоянки. Расстояние до края проезжей части, до сплошной линии разметки соблюдается – не менее допустимых. Остановка и стоянка за пешеходным переходом также допустима. Правильный ответ – при соблюдении обоих перечисленных условий. (Пункт 12.4 ПДД)",
      "answer": "c",
      "img_url": "https://s.drom.ru/i24227/pdd/tickets/2016/1542608226.jpg"
    },
    {
      "question": "При повороте направо Вы должны уступить дорогу:\n",
      "a": "Только велосипедисту",
      "b": "Только пешеходам",
      "c": "Пешеходам и велосипедисту",
      "d": "Никому",
      "tip": "Правильный ответ: 3\nПри повороте направо или налево водитель обязан уступить дорогу пешеходам, переходящим проезжую часть дороги, на которую он поворачивает, и велосипедистам, независимо от того, регулируемый или нерегулируемый это перекресток. (Пункт 13.1 ПДД)",
      "answer": "c",
      "img_url": "https://s.drom.ru/i24227/pdd/tickets/2016/1542608228.jpg"
    },
    {
      "question": "Вы намерены проехать перекресток в прямом направлении. Кому Вы должны уступить дорогу?",
      "a": "Обоим трамваям",
      "b": "Только трамваю А",
      "c": "Только трамваю Б",
      "d": "Никому",
      "tip": "Правильный ответ: 3\nПри повороте направо или налево водитель обязан уступить дорогу пешеходам, переходящим проезжую часть дороги, на которую он поворачивает, и велосипедистам, независимо от того, регулируемый или нерегулируемый это перекресток. (Пункт 13.1 ПДД)",
      "answer": "a",
      "img_url": "https://s.drom.ru/i24227/pdd/tickets/2016/1542608229.jpg"
    },
    {
      "question": "Вы намерены проехать перекресток в прямом направлении. Кому Вы должны уступить дорогу?",
      "a": "Только автобусу",
      "b": "Только легковому автомобилю",
      "c": "Никому",
      "d": "",
      "tip": "Правильный ответ: 3\nПерекрёсток неравнозначный. Главная дорога меняет направление. Транспортные средства, находящиеся на главной дороге, имеют преимущество, а водители между собой руководствуются «правилом правой руки». Никому не уступая, первым проезжаете Вы, вторым автобус, легковой автомобиль последним, так как он находится на второстепенной дороге. («Дорожные знаки», пункты 13.9, 13.10, 13.11 ПДД)",
      "answer": "c",
      "img_url": "https://s.drom.ru/i24227/pdd/tickets/2016/1542608231.jpg"
    },
    {
      "question": "С какой максимальной скоростью можно продолжить движение за знаком?\n",
      "a": "60 км/ч",
      "b": "50 км/ч",
      "c": "30 км/ч",
      "d": "20 км/ч",
      "tip": "Правильный ответ: 4\nВ жилой зоне, согласно знаку, в которую Вы въезжаете, разрешается движение со скоростью не более 20 км/ч. («Дорожные знаки» 5.21, пункт 10.2 ПДД).",
      "answer": "d",
      "img_url": "https://s.drom.ru/i24227/pdd/tickets/2016/1542608233.jpg"
    },
    {
      "question": "Для перевозки людей на мотоцикле водитель должен иметь водительское удостоверение на право управления транспортными средствами:",
      "a": "Категории «A» или подкатегории «A1»",
      "b": "Любой категории или подкатегории в течение 2 и более лет",
      "c": "Только категории «A» или подкатегории «A1» в течение 2 и более лет",
      "d": "",
      "tip": "Правильный ответ: 3\nПеревозка людей на мотоцикле должна осуществляться водителем, имеющим водительское удостоверение на право управления ТС категории «A» или подкатегории «A1» в течение 2 и более лет. (Пункт 22.2(1) ПДД)",
      "answer": "c",
      "img_url": ""
    },
    {
      "question": "При какой неисправности разрешается эксплуатация транспортного средства?\n",
      "a": "Не работают пробки топливных баков",
      "b": "Не работает механизм регулировки положения сиденья водителя",
      "c": "Не работают устройства обогрева и обдува стекол",
      "d": "Не работает стеклоподъемник",
      "tip": "Правильный ответ: 4\nНеисправности, указанные в ответах 1, 2, 3, перечислены в «Перечне неисправностей». Неработающий стеклоподъемник в данном перечне не указан. Следовательно, это не может быть причиной запрещения эксплуатации транспортного средства. («Перечень неисправностей» п.7.4)",
      "answer": "d",
      "img_url": ""
    },
    {
      "question": "В случае, когда правые колёса автомобиля наезжают на неукреплённую влажную обочину, рекомендуется:",
      "a": "Затормозить и полностью остановиться",
      "b": "Затормозить и плавно направить автомобиль на проезжую часть",
      "c": "Не прибегая к торможению, плавно направить автомобиль на проезжую часть",
      "d": "",
      "tip": "Правильный ответ: 3\nТакая ситуация опасна вследствие возникновения момента сил, стремящегося развернуть автомобиль. Старайтесь выполнить действия, указанные в третьем ответе.",
      "answer": "c",
      "img_url": ""
    },
    {
      "question": "Что понимается под временем реакции водителя?\n",
      "a": "Время с момента обнаружения водителем опасности до полной остановки транспортного средства",
      "b": "Время с момента обнаружения водителем опасности до начала принятия мер по её избежанию",
      "c": "Время, необходимое для переноса ноги с педали управления подачи топлива на педаль тормоза",
      "d": "",
      "tip": "Правильный ответ: 2\nПод временем реакции водителя понимается время с момента обнаружения водителем опасности до начала принятия мер по её избежанию. Время реакции водителя - величина непостоянная. В основном зависит от возраста, самочувствия в данный момент. Компенсировать недостаток реакции можно снижением скорости. Правильный ответ – второй. («Техника управления автомобилем»)",
      "answer": "b",
      "img_url": ""
    }

  ]
}