{
  "$schema": "https://json-schema.org/draft/2020-12/schema",
  "$id": "https://hakkes.com/schemes/real_estate_add_post.json",
  "type": "object",
  "additionalProperties": false,
  "required": ["realEstateId", "currency", "prices", "name"],
  "properties": {
    "realEstateId": {
      "type": "integer"
    },
    "itemId": {
      "type": ["integer", "null"]
    },
    "payoutFrequency": {
      "type": "integer"
    },
    "payoutFrequencyPeriod": {
      "type": "string"
    },
    "interestAmount": {
      "type": "integer"
    },
    "currency": {
      "type": "string"
    },
    "name": {
      "type": "string"
    },
    "prices": {
      "type": "array",
      "items": {
        "type": "object",
        "additionalProperties": false,
        "required": ["realEstatePriceId", "amount", "currency", "date"],
        "properties": {
          "realEstatePriceId": {
            "type": ["integer", "null"]
          },
          "amount": {
            "type": "integer"
          },
          "currency": {
            "type": "string"
          },
          "date": {
            "type": "object",
            "additionalProperties": false,
            "required": ["date", "timezone"],
            "properties": {
              "date": {
                "type": "string"
              },
              "timezone": {
                "type": "string"
              },
              "timezone_type": {
                "type": "integer"
              }
            }
          }
        }
      }
    }
  }
}