{
  "$schema": "https://json-schema.org/draft/2020-12/schema",
  "$id": "https://hakkes.com/schemes/asset_crowdfunding_import_post.json",
  "type": "object",
  "additionalProperties": false,
  "required": ["platform"],
  "properties": {
    "platform": {
      "type": "string"
    }
  }
}