%YAML 1.1
%TAG !u! tag:unity3d.com,2011:
--- !u!114 &11400000
MonoBehaviour:
  m_ObjectHideFlags: 0
  m_CorrespondingSourceObject: {fileID: 0}
  m_PrefabInstance: {fileID: 0}
  m_PrefabAsset: {fileID: 0}
  m_GameObject: {fileID: 0}
  m_Enabled: 1
  m_EditorHideFlags: 0
  m_Script: {fileID: 11500000, guid: 4ad94968b5bc97946a493e00e5f188f7, type: 3}
  m_Name: LevelData
  m_EditorClassIdentifier: 
  levelControllerType:
    _classRef: GybeGames.Systems.Levels.LevelController.DefaultLevelController, Assembly-CSharp
  id: 
