%YAML 1.1
%TAG !u! tag:unity3d.com,2011:
--- !u!1001 &6313303188645686777
PrefabInstance:
  m_ObjectHideFlags: 0
  serializedVersion: 2
  m_Modification:
    m_TransformParent: {fileID: 0}
    m_Modifications:
    - target: {fileID: 686535187, guid: 2c924ae8b47ff254aa2cce2291cc1be0, type: 3}
      propertyPath: m_IsActive
      value: 0
      objectReference: {fileID: 0}
    - target: {fileID: 2129321488608418723, guid: 2c924ae8b47ff254aa2cce2291cc1be0,
        type: 3}
      propertyPath: m_Name
      value: SystemContainerLite Variant
      objectReference: {fileID: 0}
    - target: {fileID: 7539596875808949750, guid: 2c924ae8b47ff254aa2cce2291cc1be0,
        type: 3}
      propertyPath: m_RootOrder
      value: 0
      objectReference: {fileID: 0}
    - target: {fileID: 7539596875808949750, guid: 2c924ae8b47ff254aa2cce2291cc1be0,
        type: 3}
      propertyPath: m_LocalPosition.x
      value: 0
      objectReference: {fileID: 0}
    - target: {fileID: 7539596875808949750, guid: 2c924ae8b47ff254aa2cce2291cc1be0,
        type: 3}
      propertyPath: m_LocalPosition.y
      value: 1
      objectReference: {fileID: 0}
    - target: {fileID: 7539596875808949750, guid: 2c924ae8b47ff254aa2cce2291cc1be0,
        type: 3}
      propertyPath: m_LocalPosition.z
      value: -10
      objectReference: {fileID: 0}
    - target: {fileID: 7539596875808949750, guid: 2c924ae8b47ff254aa2cce2291cc1be0,
        type: 3}
      propertyPath: m_LocalRotation.w
      value: 1
      objectReference: {fileID: 0}
    - target: {fileID: 7539596875808949750, guid: 2c924ae8b47ff254aa2cce2291cc1be0,
        type: 3}
      propertyPath: m_LocalRotation.x
      value: 0
      objectReference: {fileID: 0}
    - target: {fileID: 7539596875808949750, guid: 2c924ae8b47ff254aa2cce2291cc1be0,
        type: 3}
      propertyPath: m_LocalRotation.y
      value: 0
      objectReference: {fileID: 0}
    - target: {fileID: 7539596875808949750, guid: 2c924ae8b47ff254aa2cce2291cc1be0,
        type: 3}
      propertyPath: m_LocalRotation.z
      value: 0
      objectReference: {fileID: 0}
    - target: {fileID: 7539596875808949750, guid: 2c924ae8b47ff254aa2cce2291cc1be0,
        type: 3}
      propertyPath: m_LocalEulerAnglesHint.x
      value: 0
      objectReference: {fileID: 0}
    - target: {fileID: 7539596875808949750, guid: 2c924ae8b47ff254aa2cce2291cc1be0,
        type: 3}
      propertyPath: m_LocalEulerAnglesHint.y
      value: 0
      objectReference: {fileID: 0}
    - target: {fileID: 7539596875808949750, guid: 2c924ae8b47ff254aa2cce2291cc1be0,
        type: 3}
      propertyPath: m_LocalEulerAnglesHint.z
      value: 0
      objectReference: {fileID: 0}
    m_RemovedComponents:
    - {fileID: 699839766844658837, guid: 2c924ae8b47ff254aa2cce2291cc1be0, type: 3}
  m_SourcePrefab: {fileID: 100100000, guid: 2c924ae8b47ff254aa2cce2291cc1be0, type: 3}
