%YAML 1.1
%TAG !u! tag:unity3d.com,2011:
--- !u!114 &11400000
MonoBehaviour:
  m_ObjectHideFlags: 0
  m_CorrespondingSourceObject: {fileID: 0}
  m_PrefabInstance: {fileID: 0}
  m_PrefabAsset: {fileID: 0}
  m_GameObject: {fileID: 0}
  m_Enabled: 1
  m_EditorHideFlags: 0
  m_Script: {fileID: 11500000, guid: d68985dc6ea3e87439c06481a7a48086, type: 3}
  m_Name: Gold
  m_EditorClassIdentifier: 
  key: GOLD
  icon: {fileID: 21300000, guid: eca6b6b8526004cdebeecce86d82514f, type: 3}
  sound: {fileID: 11400000, guid: 7355ba7461017894faa9d7cacf4062f8, type: 2}
  willAbbrivate: 1
  willFormat: 1
  specialFormat: 
  willTrackFlow: 1
  currenyPerPoint: 10
  maxAmount: 50
