%YAML 1.1
%TAG !u! tag:unity3d.com,2011:
--- !u!114 &11400000
MonoBehaviour:
  m_ObjectHideFlags: 0
  m_CorrespondingSourceObject: {fileID: 0}
  m_PrefabInstance: {fileID: 0}
  m_PrefabAsset: {fileID: 0}
  m_GameObject: {fileID: 0}
  m_Enabled: 1
  m_EditorHideFlags: 0
  m_Script: {fileID: 11500000, guid: 2f0b0c553be8edd4682e9180fdd13e37, type: 3}
  m_Name: I2Languages
  m_EditorClassIdentifier: 
  mSource:
    UserAgreesToHaveItOnTheScene: 0
    UserAgreesToHaveItInsideThePluginsFolder: 0
    GoogleLiveSyncIsUptoDate: 1
    mTerms:
    - Term: General/Music
      TermType: 0
      Description: 
      Languages:
      - Music
      - La Musique
      - "M\xFCzik"
      - Musica
      - "M\xFAsica"
      - "M\xFAsica"
      - "\u041C\u0443\u0437\u044B\u043A\u0430"
      Flags: 00000000000000
      Languages_Touch: []
    - Term: General/Play
      TermType: 0
      Description: 
      Languages:
      - Play
      - Jouer
      - Oyna
      - Giocare
      - Jogar
      - Tocar
      - "\u0418\u0433\u0440\u0430\u0442\u044C"
      Flags: 00000000000000
      Languages_Touch: []
    - Term: General/Sound
      TermType: 0
      Description: 
      Languages:
      - Sound
      - Du Son
      - Ses
      - Suono
      - Som
      - Sonido
      - "\u0417\u0432\u0443\u043A"
      Flags: 00000000000000
      Languages_Touch: []
    - Term: General/Stop
      TermType: 0
      Description: 
      Languages:
      - Stop
      - "Arr\xEAtez"
      - Dur
      - Fermare
      - Pare
      - Detener
      - "\u0421\u0442\u043E\u043F"
      Flags: 00000000000000
      Languages_Touch: []
    - Term: General/Vibration
      TermType: 0
      Description: 
      Languages:
      - Vibration
      - Vibration
      - "Titre\u015Fim"
      - Vibrazione
      - "Vibra\xE7\xE3o"
      - "Vibraci\xF3n"
      - "\u0412\u0438\u0431\u0440\u0430\u0446\u0438\u044F"
      Flags: 00000000000000
      Languages_Touch: []
    - Term: Settings/PrivacyPolicy
      TermType: 0
      Description: 
      Languages:
      - Privacy Policy
      - "Politique De Confidentialit\xE9"
      - "Gizlilik Politikas\u0131"
      - Politica Sulla Riservatezza
      - "Pol\xEDtica De Privacidade"
      - "Pol\xEDtica De Privacidad"
      - "\u041F\u043E\u043B\u0438\u0442\u0438\u043A\u0430 \u041A\u043E\u043D\u0444\u0438\u0434\u0435\u043D\u0446\u0438\u0430\u043B\u044C\u043D\u043E\u0441\u0442\u0438"
      Flags: 00000000000000
      Languages_Touch: []
    - Term: Store/RestorePurchase
      TermType: 0
      Description: 
      Languages:
      - Restore Purchases
      - Restaurer Les Achats
      - "Sat\u0131n Al\u0131mlar\u0131 Geri Y\xFCkle"
      - Ripristinare Gli Acquisti
      - Restaurar Compras
      - Restaurar Las Compras
      - "\u0412\u043E\u0441\u0441\u0442\u0430\u043D\u043E\u0432\u0438\u0442\u044C
        \u041F\u043E\u043A\u0443\u043F\u043A\u0438"
      Flags: 00000000000000
      Languages_Touch: []
    CaseInsensitiveTerms: 0
    OnMissingTranslation: 1
    mTerm_AppName: 
    mLanguages:
    - Name: English
      Code: en
      Flags: 0
    - Name: French
      Code: fr
      Flags: 0
    - Name: Turkish
      Code: tr
      Flags: 1
    - Name: Italian
      Code: it
      Flags: 0
    - Name: Portuguese
      Code: pt
      Flags: 0
    - Name: Spanish
      Code: es
      Flags: 0
    - Name: Russian
      Code: ru
      Flags: 0
    IgnoreDeviceLanguage: 0
    _AllowUnloadingLanguages: 0
    Google_WebServiceURL: https://script.google.com/macros/s/AKfycbxrmizo6dRw-wEUlpEvVUKnfhVxbEeRaJ0J1WDGo9W2p_XSAJnf/exec
    Google_SpreadsheetKey: 1r8Nhn07eJ_P01nyYbrqXnu7s5N1_wd4z4J8qV7m3SuQ
    Google_SpreadsheetName: I2Loc ImprovementSkills Localization
    Google_LastUpdatedVersion: 
    Google_Password: Cayb
    GoogleUpdateFrequency: 3
    GoogleInEditorCheckFrequency: 2
    GoogleUpdateSynchronization: 1
    GoogleUpdateDelay: 0
    Assets: []
    Spreadsheet_LocalFileName: Plugins/Localization/Localization.csv
    Spreadsheet_LocalCSVSeparator: ','
    Spreadsheet_LocalCSVEncoding: utf-8
    Spreadsheet_SpecializationAsRows: 1
