%YAML 1.1
%TAG !u! tag:unity3d.com,2011:
--- !u!114 &11400000
MonoBehaviour:
  m_ObjectHideFlags: 0
  m_CorrespondingSourceObject: {fileID: 0}
  m_PrefabInstance: {fileID: 0}
  m_PrefabAsset: {fileID: 0}
  m_GameObject: {fileID: 0}
  m_Enabled: 1
  m_EditorHideFlags: 0
  m_Script: {fileID: 11500000, guid: 6c9fd8573b2f90d49a72afc0b23f3d23, type: 3}
  m_Name: AppSettings
  m_EditorClassIdentifier: 
  qualityLevel: 2
  saveFormat: 1
  showTouches: 1
  unityLogType: 3
