%YAML 1.1
%TAG !u! tag:unity3d.com,2011:
--- !u!114 &11400000
MonoBehaviour:
  m_ObjectHideFlags: 0
  m_CorrespondingSourceObject: {fileID: 0}
  m_PrefabInstance: {fileID: 0}
  m_PrefabAsset: {fileID: 0}
  m_GameObject: {fileID: 0}
  m_Enabled: 1
  m_EditorHideFlags: 0
  m_Script: {fileID: 11500000, guid: 468a46d0ae32c3544b7d98094e6448a9, type: 3}
  m_Name: AddressableAssetSettings
  m_EditorClassIdentifier: 
  m_DefaultGroup: 7b7dda947252f31468dfe93cd9995cb8
  m_BuildRemoteCatalog: 0
  m_BundleLocalCatalog: 0
  m_DisableCatalogUpdateOnStart: 0
  m_UniqueBundleIds: 0
  m_RemoteCatalogBuildPath:
    m_Id: 
  m_RemoteCatalogLoadPath:
    m_Id: 
  m_overridePlayerVersion: 
  m_GroupAssets:
  - {fileID: 11400000, guid: 0c2e7505d52b25f48a95c4966dee0504, type: 2}
  - {fileID: 11400000, guid: 2bc12e63a84811d4e8a0577ee80de499, type: 2}
  m_BuildSettings:
    m_CompileScriptsInVirtualMode: 0
    m_CleanupStreamingAssetsAfterBuilds: 1
    m_LogResourceManagerExceptions: 1
    m_BundleBuildPath: Temp/com.unity.addressables/AssetBundles
  m_ProfileSettings:
    m_Profiles:
    - m_InheritedParent: 
      m_Id: 57f48a55553caee4faebb07626b6d43b
      m_ProfileName: Default
      m_Values:
      - m_Id: 27a977f16c6ca3a4aac397c186adb3f0
        m_Value: '[UnityEditor.EditorUserBuildSettings.activeBuildTarget]'
      - m_Id: badea3ebd4520244d84afa32626b461b
        m_Value: '[UnityEngine.AddressableAssets.Addressables.BuildPath]/[BuildTarget]'
      - m_Id: 32da4996bb1785d4cb095a6a12d0fb2a
        m_Value: '{UnityEngine.AddressableAssets.Addressables.RuntimePath}/[BuildTarget]'
      - m_Id: 1e348078dfb255c4d98d7e30ca93ec4a
        m_Value: ServerData/[BuildTarget]
      - m_Id: ec6547f2808809a409d734951a8a10db
        m_Value: http://localhost/[BuildTarget]
    m_ProfileEntryNames:
    - m_Id: 27a977f16c6ca3a4aac397c186adb3f0
      m_Name: BuildTarget
      m_InlineUsage: 0
    - m_Id: badea3ebd4520244d84afa32626b461b
      m_Name: LocalBuildPath
      m_InlineUsage: 0
    - m_Id: 32da4996bb1785d4cb095a6a12d0fb2a
      m_Name: LocalLoadPath
      m_InlineUsage: 0
    - m_Id: 1e348078dfb255c4d98d7e30ca93ec4a
      m_Name: RemoteBuildPath
      m_InlineUsage: 0
    - m_Id: ec6547f2808809a409d734951a8a10db
      m_Name: RemoteLoadPath
      m_InlineUsage: 0
    m_ProfileVersion: 1
  m_LabelTable:
    m_LabelNames:
    - default
  m_SchemaTemplates: []
  m_GroupTemplateObjects:
  - {fileID: 11400000, guid: 6fa6860ade11cec47b40fa1c423d2ff6, type: 2}
  m_InitializationObjects: []
  m_CertificateHandlerType:
    m_AssemblyName: 
    m_ClassName: 
  m_ActivePlayerDataBuilderIndex: 3
  m_DataBuilders:
  - {fileID: 11400000, guid: 75f1fac5acbb16c4fbefacc8ff483a21, type: 2}
  - {fileID: 11400000, guid: 23d2641c9a8574f44a624498971dd5db, type: 2}
  - {fileID: 11400000, guid: 16b61957b571f9c47b18324e13f7e4d2, type: 2}
  - {fileID: 11400000, guid: d9ab76366b972464d9996d8045487a9b, type: 2}
  m_ActiveProfileId: 57f48a55553caee4faebb07626b6d43b
  m_HostingServicesManager:
    m_HostingServiceInfos: []
    m_Settings: {fileID: 11400000}
    m_NextInstanceId: 0
    m_RegisteredServiceTypeRefs: []
