{
    "type": "crafting_shaped",
    "pattern": [
        "#",
        "#",
        "/"
    ],
    "key": {
        "#": {
            "tag": "minecraft:stone_crafting_materials"
        },
        "/": {
            "item": "minecraft:stick"
        }
    },
    "result": {
        "item": "minecraft:stone_sword",
        "count": 1
    }
}
