{
    "type": "minecraft:crafting_shaped",
    "pattern": [
        " # ",
        " / ",
        " / "
    ],
    "key": {
        "#": {
            "tag": "minecraft:stone_crafting_materials"
        },
        "/": {
            "item": "minecraft:stick"
        }
    },
    "result": {
        "item": "minecraft:stone_shovel",
        "count": 1
    }
}
