{
    "type": "crafting_shaped",
    "pattern": [
        "###",
        "# #",
        "# #"
    ],
    "key": {
        "#": {
            "item": "minecraft:chain"
        }
    },
    "result": {
        "item": "minecraft:chainmail_leggings",
        "count": 1
    }
}
