{
    "type": "crafting_shaped",
    "pattern": [
        "###",
        "# #",
        "###"
    ],
    "key": {
        "#": {
            "tag": "minecraft:stone_crafting_materials"
        }
    },
    "result": {
        "item": "minecraft:furnace",
        "count": 1
    }
}
