{
    "type": "crafting_shaped",
    "pattern": [
        "#"
    ],
    "key": {
        "#": {
            "item": "minecraft:clay"
        }
    },
    "result": {
        "item": "minecraft:clay_ball",
        "count": 4
    }
}
