{ 
	"messages": [
		{
			"code": "200",
			"message": "OK"
		}
	],
	"data": {
		"chillers": [
			{
				"id": 1,
				"data": {
					"Time":{},
					"ACC1 Flowrate l\/s":{},
					"ACC1 Delta Electricity consumption kWh":{},
					"Ambient temperature":{},
					"ACC1 Chilled water temperature":{},
					"ACC1 Delta T":{},
					"ACC1 cooling load kW (m*cp*dT)":{},
					"ACC1 Delta Cooling Load kWh":{},
					"ACC1 COP":{},
					"ACC1 load percentage":{},
					"ACC1 COP manufacturer Y0":{},
					"ACC1 COP manufacturer Yn":{},
					"ACC1 OPtimal Flowrate l\/s":{},
					"ACC1 Electricity saving kWh":{}
				}
			}
		]
	}
}