[
  {
    "name": {
      "original": "runLambda",
      "sanitized": "runLambda",
      "accessors": []
    },
    "type": {
      "annot": [
        {
          "binary": [
            "lambda",
            [
              {
                "base": "unit"
              },
              {
                "unary": [
                  "list",
                  {
                    "base": "operation"
                  }
                ]
              }
            ]
          ]
        },
        {
          "original": "%runLambda",
          "sanitized": "runLambda",
          "accessors": []
        }
      ]
    }
  },
  {
    "name": {
      "original": "%breakGlass",
      "sanitized": "breakGlass",
      "accessors": []
    },
    "type": {
      "base": "address"
    }
  },
  {
    "name": {
      "original": "storage",
      "sanitized": "_storage",
      "accessors": []
    },
    "type": {
      "record": {
        "PairP": [
          {
            "LeafP": [
              {
                "original": "%daoAddress",
                "sanitized": "daoAddress",
                "accessors": []
              },
              {
                "tvar": [
                  {
                    "original": "%breakGlass",
                    "sanitized": "breakGlass",
                    "accessors": []
                  },
                  {
                    "base": "address"
                  }
                ]
              }
            ]
          },
          {
            "PairP": [
              {
                "LeafP": [
                  {
                    "original": "%multisigAddress",
                    "sanitized": "multisigAddress",
                    "accessors": []
                  },
                  {
                    "tvar": [
                      {
                        "original": "%breakGlass",
                        "sanitized": "breakGlass",
                        "accessors": []
                      },
                      {
                        "base": "address"
                      }
                    ]
                  }
                ]
              },
              {
                "LeafP": [
                  {
                    "original": "%targetAddress",
                    "sanitized": "targetAddress",
                    "accessors": []
                  },
                  {
                    "tvar": [
                      {
                        "original": "%breakGlass",
                        "sanitized": "breakGlass",
                        "accessors": []
                      },
                      {
                        "base": "address"
                      }
                    ]
                  }
                ]
              }
            ]
          }
        ]
      }
    }
  },
  {
    "name": {
      "original": "breakGlass",
      "sanitized": "breakGlass",
      "accessors": [
        "0"
      ]
    },
    "type": {
      "annot": [
        {
          "tvar": [
            {
              "original": "%breakGlass",
              "sanitized": "breakGlass",
              "accessors": []
            },
            {
              "base": "address"
            }
          ]
        },
        {
          "original": "%breakGlass",
          "sanitized": "breakGlass",
          "accessors": []
        }
      ]
    }
  }
]