[
  {
    "name": {
      "original": "setDelegate",
      "sanitized": "setDelegate",
      "accessors": []
    },
    "type": {
      "annot": [
        {
          "unary": [
            "option",
            {
              "base": "keyhash"
            }
          ]
        },
        {
          "original": "%setDelegate",
          "sanitized": "setDelegate",
          "accessors": []
        }
      ]
    }
  },
  {
    "name": {
      "original": "storage",
      "sanitized": "_storage",
      "accessors": []
    },
    "type": {
      "record": {
        "PairP": [
          {
            "PairP": [
              {
                "LeafP": [
                  {
                    "original": "%borrowedTokens",
                    "sanitized": "borrowedTokens",
                    "accessors": []
                  },
                  {
                    "tvar": [
                      {
                        "original": "%repay",
                        "sanitized": "repay",
                        "accessors": []
                      },
                      {
                        "base": "nat"
                      }
                    ]
                  }
                ]
              },
              {
                "PairP": [
                  {
                    "LeafP": [
                      {
                        "original": "%interestIndex",
                        "sanitized": "interestIndex",
                        "accessors": []
                      },
                      {
                        "tvar": [
                          {
                            "original": "%stabilityFeeTokens",
                            "sanitized": "stabilityFeeTokens",
                            "accessors": []
                          },
                          {
                            "base": "int"
                          }
                        ]
                      }
                    ]
                  },
                  {
                    "LeafP": [
                      {
                        "original": "%isLiquidated",
                        "sanitized": "isLiquidated",
                        "accessors": []
                      },
                      {
                        "tvar": [
                          {
                            "original": "%isLiquidated",
                            "sanitized": "isLiquidated",
                            "accessors": []
                          },
                          {
                            "base": "bool"
                          }
                        ]
                      }
                    ]
                  }
                ]
              }
            ]
          },
          {
            "PairP": [
              {
                "LeafP": [
                  {
                    "original": "%ovenProxyContractAddress",
                    "sanitized": "ovenProxyContractAddress",
                    "accessors": []
                  },
                  {
                    "tvar": [
                      {
                        "original": "%owner",
                        "sanitized": "owner",
                        "accessors": []
                      },
                      {
                        "base": "address"
                      }
                    ]
                  }
                ]
              },
              {
                "PairP": [
                  {
                    "LeafP": [
                      {
                        "original": "%owner",
                        "sanitized": "owner",
                        "accessors": []
                      },
                      {
                        "tvar": [
                          {
                            "original": "%owner",
                            "sanitized": "owner",
                            "accessors": []
                          },
                          {
                            "base": "address"
                          }
                        ]
                      }
                    ]
                  },
                  {
                    "LeafP": [
                      {
                        "original": "%stabilityFeeTokens",
                        "sanitized": "stabilityFeeTokens",
                        "accessors": []
                      },
                      {
                        "tvar": [
                          {
                            "original": "%stabilityFeeTokens",
                            "sanitized": "stabilityFeeTokens",
                            "accessors": []
                          },
                          {
                            "base": "int"
                          }
                        ]
                      }
                    ]
                  }
                ]
              }
            ]
          }
        ]
      }
    }
  },
  {
    "name": {
      "original": "%repay",
      "sanitized": "repay",
      "accessors": []
    },
    "type": {
      "base": "nat"
    }
  },
  {
    "name": {
      "original": "%liquidate",
      "sanitized": "liquidate",
      "accessors": []
    },
    "type": {
      "base": "unit"
    }
  },
  {
    "name": {
      "original": "repay",
      "sanitized": "repay",
      "accessors": [
        "1"
      ]
    },
    "type": {
      "annot": [
        {
          "tvar": [
            {
              "original": "%repay",
              "sanitized": "repay",
              "accessors": []
            },
            {
              "base": "nat"
            }
          ]
        },
        {
          "original": "%repay",
          "sanitized": "repay",
          "accessors": []
        }
      ]
    }
  },
  {
    "name": {
      "original": "%isLiquidated",
      "sanitized": "isLiquidated",
      "accessors": []
    },
    "type": {
      "base": "bool"
    }
  },
  {
    "name": {
      "original": "%owner",
      "sanitized": "owner",
      "accessors": []
    },
    "type": {
      "base": "address"
    }
  },
  {
    "name": {
      "original": "updateState",
      "sanitized": "updateState",
      "accessors": []
    },
    "type": {
      "annot": [
        {
          "tvar": [
            {
              "original": "%updateState",
              "sanitized": "updateState",
              "accessors": []
            },
            {
              "pair": [
                {
                  "base": "address"
                },
                {
                  "pair": [
                    {
                      "base": "nat"
                    },
                    {
                      "pair": [
                        {
                          "base": "int"
                        },
                        {
                          "pair": [
                            {
                              "base": "int"
                            },
                            {
                              "base": "bool"
                            }
                          ]
                        }
                      ]
                    }
                  ]
                }
              ]
            }
          ]
        },
        {
          "original": "%updateState",
          "sanitized": "updateState",
          "accessors": []
        }
      ]
    }
  },
  {
    "name": {
      "original": "default",
      "sanitized": "_default",
      "accessors": []
    },
    "type": {
      "annot": [
        {
          "tvar": [
            {
              "original": "%liquidate",
              "sanitized": "liquidate",
              "accessors": []
            },
            {
              "base": "unit"
            }
          ]
        },
        {
          "original": "%default",
          "sanitized": "_default",
          "accessors": []
        }
      ]
    }
  },
  {
    "name": {
      "original": "liquidate",
      "sanitized": "liquidate",
      "accessors": [
        "2"
      ]
    },
    "type": {
      "annot": [
        {
          "tvar": [
            {
              "original": "%liquidate",
              "sanitized": "liquidate",
              "accessors": []
            },
            {
              "base": "unit"
            }
          ]
        },
        {
          "original": "%liquidate",
          "sanitized": "liquidate",
          "accessors": []
        }
      ]
    }
  },
  {
    "name": {
      "original": "%withdraw",
      "sanitized": "withdraw",
      "accessors": []
    },
    "type": {
      "base": "mutez"
    }
  },
  {
    "name": {
      "original": "borrow",
      "sanitized": "borrow",
      "accessors": []
    },
    "type": {
      "annot": [
        {
          "tvar": [
            {
              "original": "%repay",
              "sanitized": "repay",
              "accessors": []
            },
            {
              "base": "nat"
            }
          ]
        },
        {
          "original": "%borrow",
          "sanitized": "borrow",
          "accessors": []
        }
      ]
    }
  },
  {
    "name": {
      "original": "%stabilityFeeTokens",
      "sanitized": "stabilityFeeTokens",
      "accessors": []
    },
    "type": {
      "base": "int"
    }
  },
  {
    "name": {
      "original": "withdraw",
      "sanitized": "withdraw",
      "accessors": [
        "0"
      ]
    },
    "type": {
      "annot": [
        {
          "tvar": [
            {
              "original": "%withdraw",
              "sanitized": "withdraw",
              "accessors": []
            },
            {
              "base": "mutez"
            }
          ]
        },
        {
          "original": "%withdraw",
          "sanitized": "withdraw",
          "accessors": []
        }
      ]
    }
  }
]