{
  "storage": {
    "prim": "pair",
    "args": [
      {
        "prim": "pair",
        "args": [
          {
            "prim": "pair",
            "args": [
              {
                "prim": "option",
                "args": [
                  {
                    "prim": "pair",
                    "args": [
                      {
                        "prim": "address"
                      },
                      {
                        "prim": "pair",
                        "args": [
                          {
                            "prim": "address"
                          },
                          {
                            "prim": "pair",
                            "args": [
                              {
                                "prim": "nat"
                              },
                              {
                                "prim": "pair",
                                "args": [
                                  {
                                    "prim": "nat"
                                  },
                                  {
                                    "prim": "pair",
                                    "args": [
                                      {
                                        "prim": "bool"
                                      },
                                      {
                                        "prim": "pair",
                                        "args": [
                                          {
                                            "prim": "int"
                                          },
                                          {
                                            "prim": "pair",
                                            "args": [
                                              {
                                                "prim": "int"
                                              },
                                              {
                                                "prim": "nat"
                                              }
                                            ]
                                          }
                                        ]
                                      }
                                    ]
                                  }
                                ]
                              }
                            ]
                          }
                        ]
                      }
                    ]
                  }
                ],
                "annots": [
                  "%borrowParams"
                ]
              },
              {
                "prim": "address",
                "annots": [
                  "%governorContractAddress"
                ]
              }
            ]
          },
          {
            "prim": "pair",
            "args": [
              {
                "prim": "option",
                "args": [
                  {
                    "prim": "pair",
                    "args": [
                      {
                        "prim": "address"
                      },
                      {
                        "prim": "pair",
                        "args": [
                          {
                            "prim": "address"
                          },
                          {
                            "prim": "pair",
                            "args": [
                              {
                                "prim": "nat"
                              },
                              {
                                "prim": "pair",
                                "args": [
                                  {
                                    "prim": "nat"
                                  },
                                  {
                                    "prim": "pair",
                                    "args": [
                                      {
                                        "prim": "bool"
                                      },
                                      {
                                        "prim": "pair",
                                        "args": [
                                          {
                                            "prim": "int"
                                          },
                                          {
                                            "prim": "pair",
                                            "args": [
                                              {
                                                "prim": "int"
                                              },
                                              {
                                                "prim": "address"
                                              }
                                            ]
                                          }
                                        ]
                                      }
                                    ]
                                  }
                                ]
                              }
                            ]
                          }
                        ]
                      }
                    ]
                  }
                ],
                "annots": [
                  "%liquidateParams"
                ]
              },
              {
                "prim": "pair",
                "args": [
                  {
                    "prim": "address",
                    "annots": [
                      "%minterContractAddress"
                    ]
                  },
                  {
                    "prim": "address",
                    "annots": [
                      "%oracleContractAddress"
                    ]
                  }
                ]
              }
            ]
          }
        ]
      },
      {
        "prim": "pair",
        "args": [
          {
            "prim": "pair",
            "args": [
              {
                "prim": "address",
                "annots": [
                  "%ovenRegistryContractAddress"
                ]
              },
              {
                "prim": "address",
                "annots": [
                  "%pauseGuardianContractAddress"
                ]
              }
            ]
          },
          {
            "prim": "pair",
            "args": [
              {
                "prim": "bool",
                "annots": [
                  "%paused"
                ]
              },
              {
                "prim": "pair",
                "args": [
                  {
                    "prim": "int",
                    "annots": [
                      "%state"
                    ]
                  },
                  {
                    "prim": "option",
                    "args": [
                      {
                        "prim": "pair",
                        "args": [
                          {
                            "prim": "address"
                          },
                          {
                            "prim": "pair",
                            "args": [
                              {
                                "prim": "address"
                              },
                              {
                                "prim": "pair",
                                "args": [
                                  {
                                    "prim": "nat"
                                  },
                                  {
                                    "prim": "pair",
                                    "args": [
                                      {
                                        "prim": "nat"
                                      },
                                      {
                                        "prim": "pair",
                                        "args": [
                                          {
                                            "prim": "bool"
                                          },
                                          {
                                            "prim": "pair",
                                            "args": [
                                              {
                                                "prim": "int"
                                              },
                                              {
                                                "prim": "pair",
                                                "args": [
                                                  {
                                                    "prim": "int"
                                                  },
                                                  {
                                                    "prim": "mutez"
                                                  }
                                                ]
                                              }
                                            ]
                                          }
                                        ]
                                      }
                                    ]
                                  }
                                ]
                              }
                            ]
                          }
                        ]
                      }
                    ],
                    "annots": [
                      "%withdrawParams"
                    ]
                  }
                ]
              }
            ]
          }
        ]
      }
    ]
  },
  "entrypoints": {
    "entrypoints": {
      "withdraw_callback": {
        "prim": "nat",
        "annots": [
          "%withdraw_callback"
        ]
      },
      "withdraw": {
        "prim": "pair",
        "args": [
          {
            "prim": "address"
          },
          {
            "prim": "pair",
            "args": [
              {
                "prim": "address"
              },
              {
                "prim": "pair",
                "args": [
                  {
                    "prim": "nat"
                  },
                  {
                    "prim": "pair",
                    "args": [
                      {
                        "prim": "nat"
                      },
                      {
                        "prim": "pair",
                        "args": [
                          {
                            "prim": "bool"
                          },
                          {
                            "prim": "pair",
                            "args": [
                              {
                                "prim": "int"
                              },
                              {
                                "prim": "pair",
                                "args": [
                                  {
                                    "prim": "int"
                                  },
                                  {
                                    "prim": "mutez"
                                  }
                                ]
                              }
                            ]
                          }
                        ]
                      }
                    ]
                  }
                ]
              }
            ]
          }
        ],
        "annots": [
          "%withdraw"
        ]
      },
      "updateState": {
        "prim": "pair",
        "args": [
          {
            "prim": "address"
          },
          {
            "prim": "pair",
            "args": [
              {
                "prim": "nat"
              },
              {
                "prim": "pair",
                "args": [
                  {
                    "prim": "int"
                  },
                  {
                    "prim": "pair",
                    "args": [
                      {
                        "prim": "int"
                      },
                      {
                        "prim": "bool"
                      }
                    ]
                  }
                ]
              }
            ]
          }
        ],
        "annots": [
          "%updateState"
        ]
      },
      "unpause": {
        "prim": "unit",
        "annots": [
          "%unpause"
        ]
      },
      "setPauseGuardianContract": {
        "prim": "address",
        "annots": [
          "%setPauseGuardianContract"
        ]
      },
      "setOvenRegistryContract": {
        "prim": "address",
        "annots": [
          "%setOvenRegistryContract"
        ]
      },
      "setOracleContract": {
        "prim": "address",
        "annots": [
          "%setOracleContract"
        ]
      },
      "setMinterContract": {
        "prim": "address",
        "annots": [
          "%setMinterContract"
        ]
      },
      "setGovernorContract": {
        "prim": "address",
        "annots": [
          "%setGovernorContract"
        ]
      },
      "repay": {
        "prim": "pair",
        "args": [
          {
            "prim": "address"
          },
          {
            "prim": "pair",
            "args": [
              {
                "prim": "address"
              },
              {
                "prim": "pair",
                "args": [
                  {
                    "prim": "nat"
                  },
                  {
                    "prim": "pair",
                    "args": [
                      {
                        "prim": "nat"
                      },
                      {
                        "prim": "pair",
                        "args": [
                          {
                            "prim": "bool"
                          },
                          {
                            "prim": "pair",
                            "args": [
                              {
                                "prim": "int"
                              },
                              {
                                "prim": "pair",
                                "args": [
                                  {
                                    "prim": "int"
                                  },
                                  {
                                    "prim": "nat"
                                  }
                                ]
                              }
                            ]
                          }
                        ]
                      }
                    ]
                  }
                ]
              }
            ]
          }
        ],
        "annots": [
          "%repay"
        ]
      },
      "pause": {
        "prim": "unit",
        "annots": [
          "%pause"
        ]
      },
      "liquidate_callback": {
        "prim": "nat",
        "annots": [
          "%liquidate_callback"
        ]
      },
      "liquidate": {
        "prim": "pair",
        "args": [
          {
            "prim": "address"
          },
          {
            "prim": "pair",
            "args": [
              {
                "prim": "address"
              },
              {
                "prim": "pair",
                "args": [
                  {
                    "prim": "nat"
                  },
                  {
                    "prim": "pair",
                    "args": [
                      {
                        "prim": "nat"
                      },
                      {
                        "prim": "pair",
                        "args": [
                          {
                            "prim": "bool"
                          },
                          {
                            "prim": "pair",
                            "args": [
                              {
                                "prim": "int"
                              },
                              {
                                "prim": "pair",
                                "args": [
                                  {
                                    "prim": "int"
                                  },
                                  {
                                    "prim": "address"
                                  }
                                ]
                              }
                            ]
                          }
                        ]
                      }
                    ]
                  }
                ]
              }
            ]
          }
        ],
        "annots": [
          "%liquidate"
        ]
      },
      "deposit": {
        "prim": "pair",
        "args": [
          {
            "prim": "address"
          },
          {
            "prim": "pair",
            "args": [
              {
                "prim": "address"
              },
              {
                "prim": "pair",
                "args": [
                  {
                    "prim": "nat"
                  },
                  {
                    "prim": "pair",
                    "args": [
                      {
                        "prim": "nat"
                      },
                      {
                        "prim": "pair",
                        "args": [
                          {
                            "prim": "bool"
                          },
                          {
                            "prim": "pair",
                            "args": [
                              {
                                "prim": "int"
                              },
                              {
                                "prim": "int"
                              }
                            ]
                          }
                        ]
                      }
                    ]
                  }
                ]
              }
            ]
          }
        ],
        "annots": [
          "%deposit"
        ]
      },
      "default": {
        "prim": "unit",
        "annots": [
          "%default"
        ]
      },
      "borrow_callback": {
        "prim": "nat",
        "annots": [
          "%borrow_callback"
        ]
      },
      "borrow": {
        "prim": "pair",
        "args": [
          {
            "prim": "address"
          },
          {
            "prim": "pair",
            "args": [
              {
                "prim": "address"
              },
              {
                "prim": "pair",
                "args": [
                  {
                    "prim": "nat"
                  },
                  {
                    "prim": "pair",
                    "args": [
                      {
                        "prim": "nat"
                      },
                      {
                        "prim": "pair",
                        "args": [
                          {
                            "prim": "bool"
                          },
                          {
                            "prim": "pair",
                            "args": [
                              {
                                "prim": "int"
                              },
                              {
                                "prim": "pair",
                                "args": [
                                  {
                                    "prim": "int"
                                  },
                                  {
                                    "prim": "nat"
                                  }
                                ]
                              }
                            ]
                          }
                        ]
                      }
                    ]
                  }
                ]
              }
            ]
          }
        ],
        "annots": [
          "%borrow"
        ]
      }
    }
  }
}