[
	{
		"number": 6189,
		"text": "أَلَمْ تَرَ كَيْفَ فَعَلَ رَبُّكَ بِأَصْحَابِ الْفِيلِ",
		"numberInSurah": 1,
		"juz": 30,
		"manzil": 7,
		"page": 601,
		"ruku": 547,
		"hizbQuarter": 240,
		"meaning": "Apakah kamu tidak memperhatikan bagaimana Tuhanmu telah bertindak terhadap tentara bergajah?",
		"sajda": false
	},
	{
		"number": 6190,
		"text": "أَلَمْ يَجْعَلْ كَيْدَهُمْ فِي تَضْلِيلٍ",
		"numberInSurah": 2,
		"juz": 30,
		"manzil": 7,
		"page": 601,
		"ruku": 547,
		"hizbQuarter": 240,
		"meaning": "Bukankah Dia telah menjadikan tipu daya mereka (untuk menghancurkan Ka'bah) itu sia-sia?",
		"sajda": false
	},
	{
		"number": 6191,
		"text": "وَأَرْسَلَ عَلَيْهِمْ طَيْرًا أَبَابِيلَ",
		"numberInSurah": 3,
		"juz": 30,
		"manzil": 7,
		"page": 601,
		"ruku": 547,
		"hizbQuarter": 240,
		"meaning": "dan Dia mengirimkan kapada mereka burung yang berbondong-bondong,",
		"sajda": false
	},
	{
		"number": 6192,
		"text": "تَرْمِيهِمْ بِحِجَارَةٍ مِنْ سِجِّيلٍ",
		"numberInSurah": 4,
		"juz": 30,
		"manzil": 7,
		"page": 601,
		"ruku": 547,
		"hizbQuarter": 240,
		"meaning": "yang melempari mereka dengan batu (berasal) dari tanah yang terbakar,",
		"sajda": false
	},
	{
		"number": 6193,
		"text": "فَجَعَلَهُمْ كَعَصْفٍ مَأْكُولٍ",
		"numberInSurah": 5,
		"juz": 30,
		"manzil": 7,
		"page": 601,
		"ruku": 547,
		"hizbQuarter": 240,
		"meaning": "lalu Dia menjadikan mereka seperti daun-daun yang dimakan (ulat).",
		"sajda": false
	}
]