[
	{
		"number": 6080,
		"text": "وَالضُّحَىٰ",
		"numberInSurah": 1,
		"juz": 30,
		"manzil": 7,
		"page": 596,
		"ruku": 535,
		"hizbQuarter": 238,
		"meaning": "demi waktu matahari sepenggalahan naik,",
		"sajda": false
	},
	{
		"number": 6081,
		"text": "وَاللَّيْلِ إِذَا سَجَىٰ",
		"numberInSurah": 2,
		"juz": 30,
		"manzil": 7,
		"page": 596,
		"ruku": 535,
		"hizbQuarter": 238,
		"meaning": "dan demi malam apabila telah sunyi (gelap),",
		"sajda": false
	},
	{
		"number": 6082,
		"text": "مَا وَدَّعَكَ رَبُّكَ وَمَا قَلَىٰ",
		"numberInSurah": 3,
		"juz": 30,
		"manzil": 7,
		"page": 596,
		"ruku": 535,
		"hizbQuarter": 238,
		"meaning": "Tuhanmu tiada meninggalkan kamu dan tiada (pula) benci kepadamu.",
		"sajda": false
	},
	{
		"number": 6083,
		"text": "وَلَلْآخِرَةُ خَيْرٌ لَكَ مِنَ الْأُولَىٰ",
		"numberInSurah": 4,
		"juz": 30,
		"manzil": 7,
		"page": 596,
		"ruku": 535,
		"hizbQuarter": 238,
		"meaning": "dan Sesungguhnya hari kemudian itu lebih baik bagimu daripada yang sekarang (permulaan).",
		"sajda": false
	},
	{
		"number": 6084,
		"text": "وَلَسَوْفَ يُعْطِيكَ رَبُّكَ فَتَرْضَىٰ",
		"numberInSurah": 5,
		"juz": 30,
		"manzil": 7,
		"page": 596,
		"ruku": 535,
		"hizbQuarter": 238,
		"meaning": "dan kelak Tuhanmu pasti memberikan karunia-Nya kepadamu , lalu (hati) kamu menjadi puas.",
		"sajda": false
	},
	{
		"number": 6085,
		"text": "أَلَمْ يَجِدْكَ يَتِيمًا فَآوَىٰ",
		"numberInSurah": 6,
		"juz": 30,
		"manzil": 7,
		"page": 596,
		"ruku": 535,
		"hizbQuarter": 238,
		"meaning": "Bukankah Dia mendapatimu sebagai seorang yatim, lalu Dia melindungimu?",
		"sajda": false
	},
	{
		"number": 6086,
		"text": "وَوَجَدَكَ ضَالًّا فَهَدَىٰ",
		"numberInSurah": 7,
		"juz": 30,
		"manzil": 7,
		"page": 596,
		"ruku": 535,
		"hizbQuarter": 238,
		"meaning": "dan Dia mendapatimu sebagai seorang yang bingung, lalu Dia memberikan petunjuk.",
		"sajda": false
	},
	{
		"number": 6087,
		"text": "وَوَجَدَكَ عَائِلًا فَأَغْنَىٰ",
		"numberInSurah": 8,
		"juz": 30,
		"manzil": 7,
		"page": 596,
		"ruku": 535,
		"hizbQuarter": 238,
		"meaning": "dan Dia mendapatimu sebagai seorang yang kekurangan, lalu Dia memberikan kecukupan.",
		"sajda": false
	},
	{
		"number": 6088,
		"text": "فَأَمَّا الْيَتِيمَ فَلَا تَقْهَرْ",
		"numberInSurah": 9,
		"juz": 30,
		"manzil": 7,
		"page": 596,
		"ruku": 535,
		"hizbQuarter": 238,
		"meaning": "sebab itu, terhadap anak yatim janganlah kamu Berlaku sewenang-wenang.",
		"sajda": false
	},
	{
		"number": 6089,
		"text": "وَأَمَّا السَّائِلَ فَلَا تَنْهَرْ",
		"numberInSurah": 10,
		"juz": 30,
		"manzil": 7,
		"page": 596,
		"ruku": 535,
		"hizbQuarter": 238,
		"meaning": "dan terhadap orang yang minta-minta, janganlah kamu menghardiknya.",
		"sajda": false
	},
	{
		"number": 6090,
		"text": "وَأَمَّا بِنِعْمَةِ رَبِّكَ فَحَدِّثْ",
		"numberInSurah": 11,
		"juz": 30,
		"manzil": 7,
		"page": 596,
		"ruku": 535,
		"hizbQuarter": 238,
		"meaning": "dan terhadap nikmat Tuhanmu, Maka hendaklah kamu siarkan.",
		"sajda": false
	}
]