[
  {
    "number": 5713,
    "text": "وَالنَّازِعَاتِ غَرْقًا",
    "numberInSurah": 1,
    "juz": 30,
    "manzil": 7,
    "page": 583,
    "ruku": 520,
    "hizbQuarter": 233,
    "meaning": "Demi (malaikat-malaikat) yang mencabut (nyawa) dengan keras,",
    "sajda": false
  },
  {
    "number": 5714,
    "text": "وَالنَّاشِطَاتِ نَشْطًا",
    "numberInSurah": 2,
    "juz": 30,
    "manzil": 7,
    "page": 583,
    "ruku": 520,
    "hizbQuarter": 233,
    "meaning": "dan (malaikat-malaikat) yang mencabut (nyawa) dengan lemah-lembut,",
    "sajda": false
  },
  {
    "number": 5715,
    "text": "وَالسَّابِحَاتِ سَبْحًا",
    "numberInSurah": 3,
    "juz": 30,
    "manzil": 7,
    "page": 583,
    "ruku": 520,
    "hizbQuarter": 233,
    "meaning": "dan (malaikat-malaikat) yang turun dari langit dengan cepat,",
    "sajda": false
  },
  {
    "number": 5716,
    "text": "فَالسَّابِقَاتِ سَبْقًا",
    "numberInSurah": 4,
    "juz": 30,
    "manzil": 7,
    "page": 583,
    "ruku": 520,
    "hizbQuarter": 233,
    "meaning": "dan (malaikat-malaikat) yang mendahului dengan kencang,",
    "sajda": false
  },
  {
    "number": 5717,
    "text": "فَالْمُدَبِّرَاتِ أَمْرًا",
    "numberInSurah": 5,
    "juz": 30,
    "manzil": 7,
    "page": 583,
    "ruku": 520,
    "hizbQuarter": 233,
    "meaning": "dan (malaikat-malaikat) yang mengatur urusan (dunia).",
    "sajda": false
  },
  {
    "number": 5718,
    "text": "يَوْمَ تَرْجُفُ الرَّاجِفَةُ",
    "numberInSurah": 6,
    "juz": 30,
    "manzil": 7,
    "page": 583,
    "ruku": 520,
    "hizbQuarter": 233,
    "meaning": "(Sesungguhnya kamu akan dibangkitkan) pada hari ketika tiupan pertama menggoncang alam,",
    "sajda": false
  },
  {
    "number": 5719,
    "text": "تَتْبَعُهَا الرَّادِفَةُ",
    "numberInSurah": 7,
    "juz": 30,
    "manzil": 7,
    "page": 583,
    "ruku": 520,
    "hizbQuarter": 233,
    "meaning": "tiupan pertama itu diiringi oleh tiupan kedua.",
    "sajda": false
  },
  {
    "number": 5720,
    "text": "قُلُوبٌ يَوْمَئِذٍ وَاجِفَةٌ",
    "numberInSurah": 8,
    "juz": 30,
    "manzil": 7,
    "page": 583,
    "ruku": 520,
    "hizbQuarter": 233,
    "meaning": "hati manusia pada waktu itu sangat takut,",
    "sajda": false
  },
  {
    "number": 5721,
    "text": "أَبْصَارُهَا خَاشِعَةٌ",
    "numberInSurah": 9,
    "juz": 30,
    "manzil": 7,
    "page": 583,
    "ruku": 520,
    "hizbQuarter": 233,
    "meaning": "pandangannya tunduk.",
    "sajda": false
  },
  {
    "number": 5722,
    "text": "يَقُولُونَ أَإِنَّا لَمَرْدُودُونَ فِي الْحَافِرَةِ",
    "numberInSurah": 10,
    "juz": 30,
    "manzil": 7,
    "page": 583,
    "ruku": 520,
    "hizbQuarter": 233,
    "meaning": "(orang-orang kafir) berkata: \"Apakah Sesungguhnya Kami benar-benar dikembalikan kepada kehidupan semula?\"",
    "sajda": false
  },
  {
    "number": 5723,
    "text": "أَإِذَا كُنَّا عِظَامًا نَخِرَةً",
    "numberInSurah": 11,
    "juz": 30,
    "manzil": 7,
    "page": 583,
    "ruku": 520,
    "hizbQuarter": 233,
    "meaning": "Apakah (akan dibangkitkan juga) apabila Kami telah menjadi tulang belulang yang hancur lumat?",
    "sajda": false
  },
  {
    "number": 5724,
    "text": "قَالُوا تِلْكَ إِذًا كَرَّةٌ خَاسِرَةٌ",
    "numberInSurah": 12,
    "juz": 30,
    "manzil": 7,
    "page": 583,
    "ruku": 520,
    "hizbQuarter": 233,
    "meaning": "mereka berkata: \"Kalau demikian, itu adalah suatu pengembalian yang merugikan.\"",
    "sajda": false
  },
  {
    "number": 5725,
    "text": "فَإِنَّمَا هِيَ زَجْرَةٌ وَاحِدَةٌ",
    "numberInSurah": 13,
    "juz": 30,
    "manzil": 7,
    "page": 583,
    "ruku": 520,
    "hizbQuarter": 233,
    "meaning": "Sesungguhnya pengembalian itu hanyalah satu kali tiupan saja,",
    "sajda": false
  },
  {
    "number": 5726,
    "text": "فَإِذَا هُمْ بِالسَّاهِرَةِ",
    "numberInSurah": 14,
    "juz": 30,
    "manzil": 7,
    "page": 583,
    "ruku": 520,
    "hizbQuarter": 233,
    "meaning": "Maka dengan serta merta mereka hidup kembali di permukaan bumi.",
    "sajda": false
  },
  {
    "number": 5727,
    "text": "هَلْ أَتَاكَ حَدِيثُ مُوسَىٰ",
    "numberInSurah": 15,
    "juz": 30,
    "manzil": 7,
    "page": 583,
    "ruku": 520,
    "hizbQuarter": 233,
    "meaning": "sudah sampaikah kepadamu (ya Muhammad) kisah Musa.",
    "sajda": false
  },
  {
    "number": 5728,
    "text": "إِذْ نَادَاهُ رَبُّهُ بِالْوَادِ الْمُقَدَّسِ طُوًى",
    "numberInSurah": 16,
    "juz": 30,
    "manzil": 7,
    "page": 584,
    "ruku": 520,
    "hizbQuarter": 233,
    "meaning": "tatkala Tuhannya memanggilnya di lembah suci ialah lembah Thuwa;",
    "sajda": false
  },
  {
    "number": 5729,
    "text": "اذْهَبْ إِلَىٰ فِرْعَوْنَ إِنَّهُ طَغَىٰ",
    "numberInSurah": 17,
    "juz": 30,
    "manzil": 7,
    "page": 584,
    "ruku": 520,
    "hizbQuarter": 233,
    "meaning": "Pergilah kamu kepada Fir'aun, Sesungguhnya Dia telah melampaui batas,",
    "sajda": false
  },
  {
    "number": 5730,
    "text": "فَقُلْ هَلْ لَكَ إِلَىٰ أَنْ تَزَكَّىٰ",
    "numberInSurah": 18,
    "juz": 30,
    "manzil": 7,
    "page": 584,
    "ruku": 520,
    "hizbQuarter": 233,
    "meaning": "dan Katakanlah (kepada Fir'aun): \"Adakah keinginan bagimu untuk membersihkan diri (dari kesesatan)\".",
    "sajda": false
  },
  {
    "number": 5731,
    "text": "وَأَهْدِيَكَ إِلَىٰ رَبِّكَ فَتَخْشَىٰ",
    "numberInSurah": 19,
    "juz": 30,
    "manzil": 7,
    "page": 584,
    "ruku": 520,
    "hizbQuarter": 233,
    "meaning": "dan kamu akan kupimpin ke jalan Tuhanmu agar supaya kamu takut kepada-Nya?",
    "sajda": false
  },
  {
    "number": 5732,
    "text": "فَأَرَاهُ الْآيَةَ الْكُبْرَىٰ",
    "numberInSurah": 20,
    "juz": 30,
    "manzil": 7,
    "page": 584,
    "ruku": 520,
    "hizbQuarter": 233,
    "meaning": "lalu Musa memperlihatkan kepadanya mukjizat yang besar.",
    "sajda": false
  },
  {
    "number": 5733,
    "text": "فَكَذَّبَ وَعَصَىٰ",
    "numberInSurah": 21,
    "juz": 30,
    "manzil": 7,
    "page": 584,
    "ruku": 520,
    "hizbQuarter": 233,
    "meaning": "tetapi Fir´aun mendustakan dan mendurhakai.",
    "sajda": false
  },
  {
    "number": 5734,
    "text": "ثُمَّ أَدْبَرَ يَسْعَىٰ",
    "numberInSurah": 22,
    "juz": 30,
    "manzil": 7,
    "page": 584,
    "ruku": 520,
    "hizbQuarter": 233,
    "meaning": "kemudian Dia berpaling seraya berusaha menantang (Musa).",
    "sajda": false
  },
  {
    "number": 5735,
    "text": "فَحَشَرَ فَنَادَىٰ",
    "numberInSurah": 23,
    "juz": 30,
    "manzil": 7,
    "page": 584,
    "ruku": 520,
    "hizbQuarter": 233,
    "meaning": "Maka Dia mengumpulkan (pembesar-pembesarnya) lalu berseru memanggil kaumnya.",
    "sajda": false
  },
  {
    "number": 5736,
    "text": "فَقَالَ أَنَا رَبُّكُمُ الْأَعْلَىٰ",
    "numberInSurah": 24,
    "juz": 30,
    "manzil": 7,
    "page": 584,
    "ruku": 520,
    "hizbQuarter": 233,
    "meaning": "(seraya) berkata:\"Akulah Tuhanmu yang paling tinggi\".",
    "sajda": false
  },
  {
    "number": 5737,
    "text": "فَأَخَذَهُ اللَّهُ نَكَالَ الْآخِرَةِ وَالْأُولَىٰ",
    "numberInSurah": 25,
    "juz": 30,
    "manzil": 7,
    "page": 584,
    "ruku": 520,
    "hizbQuarter": 233,
    "meaning": "Maka Allah mengazabnya dengan azab di akhirat dan azab di dunia.",
    "sajda": false
  },
  {
    "number": 5738,
    "text": "إِنَّ فِي ذَٰلِكَ لَعِبْرَةً لِمَنْ يَخْشَىٰ",
    "numberInSurah": 26,
    "juz": 30,
    "manzil": 7,
    "page": 584,
    "ruku": 520,
    "hizbQuarter": 233,
    "meaning": "Sesungguhnya pada yang demikian itu terdapat pelajaran bagi orang yang takut (kepada Tuhannya).",
    "sajda": false
  },
  {
    "number": 5739,
    "text": "أَأَنْتُمْ أَشَدُّ خَلْقًا أَمِ السَّمَاءُ ۚ بَنَاهَا",
    "numberInSurah": 27,
    "juz": 30,
    "manzil": 7,
    "page": 584,
    "ruku": 521,
    "hizbQuarter": 233,
    "meaning": "Apakah kamu lebih sulit penciptaanya ataukah langit? Allah telah membinanya,",
    "sajda": false
  },
  {
    "number": 5740,
    "text": "رَفَعَ سَمْكَهَا فَسَوَّاهَا",
    "numberInSurah": 28,
    "juz": 30,
    "manzil": 7,
    "page": 584,
    "ruku": 521,
    "hizbQuarter": 233,
    "meaning": "Dia meninggikan bangunannya lalu menyempurnakannya,",
    "sajda": false
  },
  {
    "number": 5741,
    "text": "وَأَغْطَشَ لَيْلَهَا وَأَخْرَجَ ضُحَاهَا",
    "numberInSurah": 29,
    "juz": 30,
    "manzil": 7,
    "page": 584,
    "ruku": 521,
    "hizbQuarter": 233,
    "meaning": "dan Dia menjadikan malamnya gelap gulita, dan menjadikan siangnya terang benderang.",
    "sajda": false
  },
  {
    "number": 5742,
    "text": "وَالْأَرْضَ بَعْدَ ذَٰلِكَ دَحَاهَا",
    "numberInSurah": 30,
    "juz": 30,
    "manzil": 7,
    "page": 584,
    "ruku": 521,
    "hizbQuarter": 233,
    "meaning": "dan bumi sesudah itu dihamparkan-Nya.",
    "sajda": false
  },
  {
    "number": 5743,
    "text": "أَخْرَجَ مِنْهَا مَاءَهَا وَمَرْعَاهَا",
    "numberInSurah": 31,
    "juz": 30,
    "manzil": 7,
    "page": 584,
    "ruku": 521,
    "hizbQuarter": 233,
    "meaning": "ia memancarkan daripadanya mata airnya, dan (menumbuhkan) tumbuh-tumbuhannya.",
    "sajda": false
  },
  {
    "number": 5744,
    "text": "وَالْجِبَالَ أَرْسَاهَا",
    "numberInSurah": 32,
    "juz": 30,
    "manzil": 7,
    "page": 584,
    "ruku": 521,
    "hizbQuarter": 233,
    "meaning": "dan gunung-gunung dipancangkan-Nya dengan teguh,",
    "sajda": false
  },
  {
    "number": 5745,
    "text": "مَتَاعًا لَكُمْ وَلِأَنْعَامِكُمْ",
    "numberInSurah": 33,
    "juz": 30,
    "manzil": 7,
    "page": 584,
    "ruku": 521,
    "hizbQuarter": 233,
    "meaning": "(semua itu) untuk kesenanganmu dan untuk binatang-binatang ternakmu.",
    "sajda": false
  },
  {
    "number": 5746,
    "text": "فَإِذَا جَاءَتِ الطَّامَّةُ الْكُبْرَىٰ",
    "numberInSurah": 34,
    "juz": 30,
    "manzil": 7,
    "page": 584,
    "ruku": 521,
    "hizbQuarter": 233,
    "meaning": "Maka apabila malapetaka yang sangat besar (hari kiamat) telah datang.",
    "sajda": false
  },
  {
    "number": 5747,
    "text": "يَوْمَ يَتَذَكَّرُ الْإِنْسَانُ مَا سَعَىٰ",
    "numberInSurah": 35,
    "juz": 30,
    "manzil": 7,
    "page": 584,
    "ruku": 521,
    "hizbQuarter": 233,
    "meaning": "pada hari (ketika) manusia teringat akan apa yang telah dikerjakannya,",
    "sajda": false
  },
  {
    "number": 5748,
    "text": "وَبُرِّزَتِ الْجَحِيمُ لِمَنْ يَرَىٰ",
    "numberInSurah": 36,
    "juz": 30,
    "manzil": 7,
    "page": 584,
    "ruku": 521,
    "hizbQuarter": 233,
    "meaning": "dan diperlihatkan neraka dengan jelas kepada Setiap orang yang melihat.",
    "sajda": false
  },
  {
    "number": 5749,
    "text": "فَأَمَّا مَنْ طَغَىٰ",
    "numberInSurah": 37,
    "juz": 30,
    "manzil": 7,
    "page": 584,
    "ruku": 521,
    "hizbQuarter": 233,
    "meaning": "Adapun orang yang melampaui batas,",
    "sajda": false
  },
  {
    "number": 5750,
    "text": "وَآثَرَ الْحَيَاةَ الدُّنْيَا",
    "numberInSurah": 38,
    "juz": 30,
    "manzil": 7,
    "page": 584,
    "ruku": 521,
    "hizbQuarter": 233,
    "meaning": "dan lebih mengutamakan kehidupan dunia,",
    "sajda": false
  },
  {
    "number": 5751,
    "text": "فَإِنَّ الْجَحِيمَ هِيَ الْمَأْوَىٰ",
    "numberInSurah": 39,
    "juz": 30,
    "manzil": 7,
    "page": 584,
    "ruku": 521,
    "hizbQuarter": 233,
    "meaning": "Maka Sesungguhnya nerakalah tempat tinggal(nya).",
    "sajda": false
  },
  {
    "number": 5752,
    "text": "وَأَمَّا مَنْ خَافَ مَقَامَ رَبِّهِ وَنَهَى النَّفْسَ عَنِ الْهَوَىٰ",
    "numberInSurah": 40,
    "juz": 30,
    "manzil": 7,
    "page": 584,
    "ruku": 521,
    "hizbQuarter": 233,
    "meaning": "dan Adapun orang-orang yang takut kepada kebesaran Tuhannya dan menahan diri dari keinginan hawa nafsunya,",
    "sajda": false
  },
  {
    "number": 5753,
    "text": "فَإِنَّ الْجَنَّةَ هِيَ الْمَأْوَىٰ",
    "numberInSurah": 41,
    "juz": 30,
    "manzil": 7,
    "page": 584,
    "ruku": 521,
    "hizbQuarter": 233,
    "meaning": "Maka Sesungguhnya syurgalah tempat tinggal(nya).",
    "sajda": false
  },
  {
    "number": 5754,
    "text": "يَسْأَلُونَكَ عَنِ السَّاعَةِ أَيَّانَ مُرْسَاهَا",
    "numberInSurah": 42,
    "juz": 30,
    "manzil": 7,
    "page": 584,
    "ruku": 521,
    "hizbQuarter": 233,
    "meaning": "(orang-orang kafir) bertanya kepadamu (Muhammad) tentang hari kebangkitan, kapankah terjadinya?",
    "sajda": false
  },
  {
    "number": 5755,
    "text": "فِيمَ أَنْتَ مِنْ ذِكْرَاهَا",
    "numberInSurah": 43,
    "juz": 30,
    "manzil": 7,
    "page": 584,
    "ruku": 521,
    "hizbQuarter": 233,
    "meaning": "siapakah kamu (maka) dapat menyebutkan (waktunya)?",
    "sajda": false
  },
  {
    "number": 5756,
    "text": "إِلَىٰ رَبِّكَ مُنْتَهَاهَا",
    "numberInSurah": 44,
    "juz": 30,
    "manzil": 7,
    "page": 584,
    "ruku": 521,
    "hizbQuarter": 233,
    "meaning": "kepada Tuhanmulah dikembalikan kesudahannya (ketentuan waktunya).",
    "sajda": false
  },
  {
    "number": 5757,
    "text": "إِنَّمَا أَنْتَ مُنْذِرُ مَنْ يَخْشَاهَا",
    "numberInSurah": 45,
    "juz": 30,
    "manzil": 7,
    "page": 584,
    "ruku": 521,
    "hizbQuarter": 233,
    "meaning": "kamu hanyalah pemberi peringatan bagi siapa yang takut kepadanya (hari berbangkit)",
    "sajda": false
  },
  {
    "number": 5758,
    "text": "كَأَنَّهُمْ يَوْمَ يَرَوْنَهَا لَمْ يَلْبَثُوا إِلَّا عَشِيَّةً أَوْ ضُحَاهَا",
    "numberInSurah": 46,
    "juz": 30,
    "manzil": 7,
    "page": 584,
    "ruku": 521,
    "hizbQuarter": 233,
    "meaning": "pada hari mereka melihat hari berbangkit itu, mereka merasa seakan-akan tidak tinggal (di dunia) melainkan (sebentar saja) di waktu sore atau pagi hari.",
    "sajda": false
  }
]