[
	{
		"number": 6091,
		"text": "أَلَمْ نَشْرَحْ لَكَ صَدْرَكَ",
		"numberInSurah": 1,
		"juz": 30,
		"manzil": 7,
		"page": 596,
		"ruku": 536,
		"hizbQuarter": 239,
		"meaning": "Bukankah Kami telah melapangkan untukmu dadamu?,",
		"sajda": false
	},
	{
		"number": 6092,
		"text": "وَوَضَعْنَا عَنْكَ وِزْرَكَ",
		"numberInSurah": 2,
		"juz": 30,
		"manzil": 7,
		"page": 596,
		"ruku": 536,
		"hizbQuarter": 239,
		"meaning": "dan Kami telah menghilangkan daripadamu bebanmu,",
		"sajda": false
	},
	{
		"number": 6093,
		"text": "الَّذِي أَنْقَضَ ظَهْرَكَ",
		"numberInSurah": 3,
		"juz": 30,
		"manzil": 7,
		"page": 596,
		"ruku": 536,
		"hizbQuarter": 239,
		"meaning": "yang memberatkan punggungmu?",
		"sajda": false
	},
	{
		"number": 6094,
		"text": "وَرَفَعْنَا لَكَ ذِكْرَكَ",
		"numberInSurah": 4,
		"juz": 30,
		"manzil": 7,
		"page": 596,
		"ruku": 536,
		"hizbQuarter": 239,
		"meaning": "dan Kami tinggikan bagimu sebutan (nama)mu,",
		"sajda": false
	},
	{
		"number": 6095,
		"text": "فَإِنَّ مَعَ الْعُسْرِ يُسْرًا",
		"numberInSurah": 5,
		"juz": 30,
		"manzil": 7,
		"page": 596,
		"ruku": 536,
		"hizbQuarter": 239,
		"meaning": "karena Sesungguhnya sesudah kesulitan itu ada kemudahan,",
		"sajda": false
	},
	{
		"number": 6096,
		"text": "إِنَّ مَعَ الْعُسْرِ يُسْرًا",
		"numberInSurah": 6,
		"juz": 30,
		"manzil": 7,
		"page": 596,
		"ruku": 536,
		"hizbQuarter": 239,
		"meaning": "Sesungguhnya sesudah kesulitan itu ada kemudahan.",
		"sajda": false
	},
	{
		"number": 6097,
		"text": "فَإِذَا فَرَغْتَ فَانْصَبْ",
		"numberInSurah": 7,
		"juz": 30,
		"manzil": 7,
		"page": 596,
		"ruku": 536,
		"hizbQuarter": 239,
		"meaning": "Maka apabila kamu telah selesai (dari sesuatu urusan), kerjakanlah dengan sungguh-sungguh (urusan) yang lain,",
		"sajda": false
	},
	{
		"number": 6098,
		"text": "وَإِلَىٰ رَبِّكَ فَارْغَبْ",
		"numberInSurah": 8,
		"juz": 30,
		"manzil": 7,
		"page": 596,
		"ruku": 536,
		"hizbQuarter": 239,
		"meaning": "dan hanya kepada Tuhanmulah hendaknya kamu berharap.",
		"sajda": false
	}
]