[
	{
		"number": 5673,
		"text": "عَمَّ يَتَسَاءَلُونَ",
		"numberInSurah": 1,
		"juz": 30,
		"manzil": 7,
		"page": 582,
		"ruku": 518,
		"hizbQuarter": 233,
		"meaning" : "Tentang apakah mereka saling bertanya-tanya ?",
		"sajda": false
	},
	{
		"number": 5674,
		"text": "عَنِ النَّبَإِ الْعَظِيمِ",
		"numberInSurah": 2,
		"juz": 30,
		"manzil": 7,
		"page": 582,
		"ruku": 518,
		"hizbQuarter": 233,
		"meaning": "tentang berita yang besar,",
		"sajda": false
	},
	{
		"number": 5675,
		"text": "الَّذِي هُمْ فِيهِ مُخْتَلِفُونَ",
		"numberInSurah": 3,
		"juz": 30,
		"manzil": 7,
		"page": 582,
		"ruku": 518,
		"hizbQuarter": 233,
		"meaning": "yang mereka perselisihkan tentang ini.",
		"sajda": false
	},
	{
		"number": 5676,
		"text": "كَلَّا سَيَعْلَمُونَ",
		"numberInSurah": 4,
		"juz": 30,
		"manzil": 7,
		"page": 582,
		"ruku": 518,
		"hizbQuarter": 233,
		"meaning": "sekali-kali tidak[1545]; kelak mereka akan mengetahui,",
		"sajda": false
	},
	{
		"number": 5677,
		"text": "ثُمَّ كَلَّا سَيَعْلَمُونَ",
		"numberInSurah": 5,
		"juz": 30,
		"manzil": 7,
		"page": 582,
		"ruku": 518,
		"hizbQuarter": 233,
		"meaning": "kemudian sekali-kali tidak; kelak mereka mengetahui.",
		"sajda": false
	},
	{
		"number": 5678,
		"text": "أَلَمْ نَجْعَلِ الْأَرْضَ مِهَادًا",
		"numberInSurah": 6,
		"juz": 30,
		"manzil": 7,
		"page": 582,
		"ruku": 518,
		"hizbQuarter": 233,
		"meaning": "Bukankah Kami telah menjadikan bumi itu sebagai hamparan?,",
		"sajda": false
	},
	{
		"number": 5679,
		"text": "وَالْجِبَالَ أَوْتَادًا",
		"numberInSurah": 7,
		"juz": 30,
		"manzil": 7,
		"page": 582,
		"ruku": 518,
		"hizbQuarter": 233,
		"meaning": "dan gunung-gunung sebagai pasak?,",
		"sajda": false
	},
	{
		"number": 5680,
		"text": "وَخَلَقْنَاكُمْ أَزْوَاجًا",
		"numberInSurah": 8,
		"juz": 30,
		"manzil": 7,
		"page": 582,
		"ruku": 518,
		"hizbQuarter": 233,
		"meaning": "dan Kami jadikan kamu berpasang-pasangan,",
		"sajda": false
	},
	{
		"number": 5681,
		"text": "وَجَعَلْنَا نَوْمَكُمْ سُبَاتًا",
		"numberInSurah": 9,
		"juz": 30,
		"manzil": 7,
		"page": 582,
		"ruku": 518,
		"hizbQuarter": 233,
		"meaning": "dan Kami jadikan tidurmu untuk istirahat,",
		"sajda": false
	},
	{
		"number": 5682,
		"text": "وَجَعَلْنَا اللَّيْلَ لِبَاسًا",
		"numberInSurah": 10,
		"juz": 30,
		"manzil": 7,
		"page": 582,
		"ruku": 518,
		"hizbQuarter": 233,
		"meaning": "dan Kami jadikan malam sebagai pakaian,",
		"sajda": false
	},
	{
		"number": 5683,
		"text": "وَجَعَلْنَا النَّهَارَ مَعَاشًا",
		"numberInSurah": 11,
		"juz": 30,
		"manzil": 7,
		"page": 582,
		"ruku": 518,
		"hizbQuarter": 233,
		"meaning": "dan Kami jadikan siang untuk mencari penghidupan,",
		"sajda": false
	},
	{
		"number": 5684,
		"text": "وَبَنَيْنَا فَوْقَكُمْ سَبْعًا شِدَادًا",
		"numberInSurah": 12,
		"juz": 30,
		"manzil": 7,
		"page": 582,
		"ruku": 518,
		"hizbQuarter": 233,
		"meaning": "dan Kami bina di atas kamu tujuh buah (langit) yang kokoh,",
		"sajda": false
	},
	{
		"number": 5685,
		"text": "وَجَعَلْنَا سِرَاجًا وَهَّاجًا",
		"numberInSurah": 13,
		"juz": 30,
		"manzil": 7,
		"page": 582,
		"ruku": 518,
		"hizbQuarter": 233,
		"meaning": "dan Kami jadikan pelita yang Amat terang (matahari),",
		"sajda": false
	},
	{
		"number": 5686,
		"text": "وَأَنْزَلْنَا مِنَ الْمُعْصِرَاتِ مَاءً ثَجَّاجًا",
		"numberInSurah": 14,
		"juz": 30,
		"manzil": 7,
		"page": 582,
		"ruku": 518,
		"hizbQuarter": 233,
		"meaning": "dan Kami turunkan dari awan air yang banyak tercurah,",
		"sajda": false
	},
	{
		"number": 5687,
		"text": "لِنُخْرِجَ بِهِ حَبًّا وَنَبَاتًا",
		"numberInSurah": 15,
		"juz": 30,
		"manzil": 7,
		"page": 582,
		"ruku": 518,
		"hizbQuarter": 233,
		"meaning": "supaya Kami tumbuhkan dengan air itu biji-bijian dan tumbuh-tumbuhan,",
		"sajda": false
	},
	{
		"number": 5688,
		"text": "وَجَنَّاتٍ أَلْفَافًا",
		"numberInSurah": 16,
		"juz": 30,
		"manzil": 7,
		"page": 582,
		"ruku": 518,
		"hizbQuarter": 233,
		"meaning": "dan kebun-kebun yang lebat?",
		"sajda": false
	},
	{
		"number": 5689,
		"text": "إِنَّ يَوْمَ الْفَصْلِ كَانَ مِيقَاتًا",
		"numberInSurah": 17,
		"juz": 30,
		"manzil": 7,
		"page": 582,
		"ruku": 518,
		"hizbQuarter": 233,
		"meaning": "Sesungguhnya hari keputusan adalah suatu waktu yang ditetapkan,",
		"sajda": false
	},
	{
		"number": 5690,
		"text": "يَوْمَ يُنْفَخُ فِي الصُّورِ فَتَأْتُونَ أَفْوَاجًا",
		"numberInSurah": 18,
		"juz": 30,
		"manzil": 7,
		"page": 582,
		"ruku": 518,
		"hizbQuarter": 233,
		"meaning": "Yaitu hari (yang pada waktu itu) ditiup sangsakala lalu kamu datang berkelompok-kelompok,",
		"sajda": false
	},
	{
		"number": 5691,
		"text": "وَفُتِحَتِ السَّمَاءُ فَكَانَتْ أَبْوَابًا",
		"numberInSurah": 19,
		"juz": 30,
		"manzil": 7,
		"page": 582,
		"ruku": 518,
		"hizbQuarter": 233,
		"meaning": "dan dibukalah langit, Maka terdapatlah beberapa pintu,",
		"sajda": false
	},
	{
		"number": 5692,
		"text": "وَسُيِّرَتِ الْجِبَالُ فَكَانَتْ سَرَابًا",
		"numberInSurah": 20,
		"juz": 30,
		"manzil": 7,
		"page": 582,
		"ruku": 518,
		"hizbQuarter": 233,
		"meaning": "dan dijalankanlah gunung-gunung Maka menjadi fatamorganalah ia.",
		"sajda": false
	},
	{
		"number": 5693,
		"text": "إِنَّ جَهَنَّمَ كَانَتْ مِرْصَادًا",
		"numberInSurah": 21,
		"juz": 30,
		"manzil": 7,
		"page": 582,
		"ruku": 518,
		"hizbQuarter": 233,
		"meaning": "Sesungguhnya neraka Jahannam itu (padanya) ada tempat pengintai,",
		"sajda": false
	},
	{
		"number": 5694,
		"text": "لِلطَّاغِينَ مَآبًا",
		"numberInSurah": 22,
		"juz": 30,
		"manzil": 7,
		"page": 582,
		"ruku": 518,
		"hizbQuarter": 233,
		"meaning": "lagi menjadi tempat kembali bagi orang-orang yang melampaui batas,",
		"sajda": false
	},
	{
		"number": 5695,
		"text": "لَابِثِينَ فِيهَا أَحْقَابًا",
		"numberInSurah": 23,
		"juz": 30,
		"manzil": 7,
		"page": 582,
		"ruku": 518,
		"hizbQuarter": 233,
		"meaning": "mereka tinggal di dalamnya berabad-abad lamanya,",
		"sajda": false
	},
	{
		"number": 5696,
		"text": "لَا يَذُوقُونَ فِيهَا بَرْدًا وَلَا شَرَابًا",
		"numberInSurah": 24,
		"juz": 30,
		"manzil": 7,
		"page": 582,
		"ruku": 518,
		"hizbQuarter": 233,
		"meaning": "mereka tidak merasakan kesejukan di dalamnya dan tidak (pula mendapat) minuman,",
		"sajda": false
	},
	{
		"number": 5697,
		"text": "إِلَّا حَمِيمًا وَغَسَّاقًا",
		"numberInSurah": 25,
		"juz": 30,
		"manzil": 7,
		"page": 582,
		"ruku": 518,
		"hizbQuarter": 233,
		"meaning": "selain air yang mendidih dan nanah,",
		"sajda": false
	},
	{
		"number": 5698,
		"text": "جَزَاءً وِفَاقًا",
		"numberInSurah": 26,
		"juz": 30,
		"manzil": 7,
		"page": 582,
		"ruku": 518,
		"hizbQuarter": 233,
		"meaning": "sebagai pambalasan yang setimpal.",
		"sajda": false
	},
	{
		"number": 5699,
		"text": "إِنَّهُمْ كَانُوا لَا يَرْجُونَ حِسَابًا",
		"numberInSurah": 27,
		"juz": 30,
		"manzil": 7,
		"page": 582,
		"ruku": 518,
		"hizbQuarter": 233,
		"meaning": "Sesungguhnya mereka tidak berharap (takut) kepada hisab,",
		"sajda": false
	},
	{
		"number": 5700,
		"text": "وَكَذَّبُوا بِآيَاتِنَا كِذَّابًا",
		"numberInSurah": 28,
		"juz": 30,
		"manzil": 7,
		"page": 582,
		"ruku": 518,
		"hizbQuarter": 233,
		"meaning": "dan mereka mendustakan ayat-ayat Kami dengan Sesungguh- sungguhnya.",
		"sajda": false
	},
	{
		"number": 5701,
		"text": "وَكُلَّ شَيْءٍ أَحْصَيْنَاهُ كِتَابًا",
		"numberInSurah": 29,
		"juz": 30,
		"manzil": 7,
		"page": 582,
		"ruku": 518,
		"hizbQuarter": 233,
		"meaning": "dan segala sesuatu telah Kami catat dalam suatu kitab.",
		"sajda": false
	},
	{
		"number": 5702,
		"text": "فَذُوقُوا فَلَنْ نَزِيدَكُمْ إِلَّا عَذَابًا",
		"numberInSurah": 30,
		"juz": 30,
		"manzil": 7,
		"page": 582,
		"ruku": 518,
		"hizbQuarter": 233,
		"meaning": "karena itu rasakanlah dan Kami sekali-kali tidak akan menambah kepada kamu selain daripada azab.",
		"sajda": false
	},
	{
		"number": 5703,
		"text": "إِنَّ لِلْمُتَّقِينَ مَفَازًا",
		"numberInSurah": 31,
		"juz": 30,
		"manzil": 7,
		"page": 583,
		"ruku": 519,
		"hizbQuarter": 233,
		"meaning": "Sesungguhnya orang-orang yang bertaqwa mendapat kemenangan,",
		"sajda": false
	},
	{
		"number": 5704,
		"text": "حَدَائِقَ وَأَعْنَابًا",
		"numberInSurah": 32,
		"juz": 30,
		"manzil": 7,
		"page": 583,
		"ruku": 519,
		"hizbQuarter": 233,
		"meaning": "(yaitu) kebun-kebun dan buah anggur,",
		"sajda": false
	},
	{
		"number": 5705,
		"text": "وَكَوَاعِبَ أَتْرَابًا",
		"numberInSurah": 33,
		"juz": 30,
		"manzil": 7,
		"page": 583,
		"ruku": 519,
		"hizbQuarter": 233,
		"meaning": "dan gadis-gadis remaja yang sebaya,",
		"sajda": false
	},
	{
		"number": 5706,
		"text": "وَكَأْسًا دِهَاقًا",
		"numberInSurah": 34,
		"juz": 30,
		"manzil": 7,
		"page": 583,
		"ruku": 519,
		"hizbQuarter": 233,
		"meaning": "dan gelas-gelas yang penuh (berisi minuman).",
		"sajda": false
	},
	{
		"number": 5707,
		"text": "لَا يَسْمَعُونَ فِيهَا لَغْوًا وَلَا كِذَّابًا",
		"numberInSurah": 35,
		"juz": 30,
		"manzil": 7,
		"page": 583,
		"ruku": 519,
		"hizbQuarter": 233,
		"meaning": "di dalamnya mereka tidak mendengar Perkataan yang sia-sia dan tidak (pula) Perkataan dusta.",
		"sajda": false
	},
	{
		"number": 5708,
		"text": "جَزَاءً مِنْ رَبِّكَ عَطَاءً حِسَابًا",
		"numberInSurah": 36,
		"juz": 30,
		"manzil": 7,
		"page": 583,
		"ruku": 519,
		"hizbQuarter": 233,
		"meaning": "sebagai pembalasan dari Tuhanmu dan pemberian yang cukup banyak,",
		"sajda": false
	},
	{
		"number": 5709,
		"text": "رَبِّ السَّمَاوَاتِ وَالْأَرْضِ وَمَا بَيْنَهُمَا الرَّحْمَٰنِ ۖ لَا يَمْلِكُونَ مِنْهُ خِطَابًا",
		"numberInSurah": 37,
		"juz": 30,
		"manzil": 7,
		"page": 583,
		"ruku": 519,
		"hizbQuarter": 233,
		"meaning": "Tuhan yang memelihara langit dan bumi dan apa yang ada di antara keduanya; yang Maha Pemurah. Mereka tidak dapat berbicara dengan Dia.",
		"sajda": false
	},
	{
		"number": 5710,
		"text": "يَوْمَ يَقُومُ الرُّوحُ وَالْمَلَائِكَةُ صَفًّا ۖ لَا يَتَكَلَّمُونَ إِلَّا مَنْ أَذِنَ لَهُ الرَّحْمَٰنُ وَقَالَ صَوَابًا",
		"numberInSurah": 38,
		"juz": 30,
		"manzil": 7,
		"page": 583,
		"ruku": 519,
		"hizbQuarter": 233,
		"meaning": "pada hari, ketika ruh[1549] dan Para Malaikat berdiri bershaf- shaf, mereka tidak berkata-kata, kecuali siapa yang telah diberi izin kepadanya oleh Tuhan yang Maha Pemurah; dan ia mengucapkan kata yang benar.",
		"sajda": false
	},
	{
		"number": 5711,
		"text": "ذَٰلِكَ الْيَوْمُ الْحَقُّ ۖ فَمَنْ شَاءَ اتَّخَذَ إِلَىٰ رَبِّهِ مَآبًا",
		"numberInSurah": 39,
		"juz": 30,
		"manzil": 7,
		"page": 583,
		"ruku": 519,
		"hizbQuarter": 233,
		"meaning": "Itulah hari yang pasti terjadi. Maka Barangsiapa yang menghendaki, niscaya ia menempuh jalan kembali kepada Tuhannya.",
		"sajda": false
	},
	{
		"number": 5712,
		"text": "إِنَّا أَنْذَرْنَاكُمْ عَذَابًا قَرِيبًا يَوْمَ يَنْظُرُ الْمَرْءُ مَا قَدَّمَتْ يَدَاهُ وَيَقُولُ الْكَافِرُ يَا لَيْتَنِي كُنْتُ تُرَابًا",
		"numberInSurah": 40,
		"juz": 30,
		"manzil": 7,
		"page": 583,
		"ruku": 519,
		"hizbQuarter": 233,
		"meaning": "Sesungguhnya Kami telah memperingatkan kepadamu (hai orang kafir) siksa yang dekat, pada hari manusia melihat apa yang telah diperbuat oleh kedua tangannya; dan orang kafir berkata:\"Alangkah baiknya Sekiranya dahulu adalah tanah\".",
		"sajda": false
	}
]