[
	{
		"number": 5949,
		"text": "سَبِّحِ اسْمَ رَبِّكَ الْأَعْلَى",
		"numberInSurah": 1,
		"juz": 30,
		"manzil": 7,
		"page": 591,
		"ruku": 529,
		"hizbQuarter": 237,
		"meaning": "Sucikanlah nama Tuhanmu yang Maha Tingi,",
		"sajda": false
	},
	{
		"number": 5950,
		"text": "الَّذِي خَلَقَ فَسَوَّىٰ",
		"numberInSurah": 2,
		"juz": 30,
		"manzil": 7,
		"page": 591,
		"ruku": 529,
		"hizbQuarter": 237,
		"meaning": "yang Menciptakan, dan menyempurnakan (penciptaan-Nya),",
		"sajda": false
	},
	{
		"number": 5951,
		"text": "وَالَّذِي قَدَّرَ فَهَدَىٰ",
		"numberInSurah": 3,
		"juz": 30,
		"manzil": 7,
		"page": 591,
		"ruku": 529,
		"hizbQuarter": 237,
		"meaning": "dan yang menentukan kadar (masing-masing) dan memberi petunjuk,",
		"sajda": false
	},
	{
		"number": 5952,
		"text": "وَالَّذِي أَخْرَجَ الْمَرْعَىٰ",
		"numberInSurah": 4,
		"juz": 30,
		"manzil": 7,
		"page": 591,
		"ruku": 529,
		"hizbQuarter": 237,
		"meaning": "dan yang menumbuhkan rumput-rumputan,",
		"sajda": false
	},
	{
		"number": 5953,
		"text": "فَجَعَلَهُ غُثَاءً أَحْوَىٰ",
		"numberInSurah": 5,
		"juz": 30,
		"manzil": 7,
		"page": 591,
		"ruku": 529,
		"hizbQuarter": 237,
		"meaning": "lalu dijadikan-Nya rumput-rumput itu kering kehitam-hitaman.",
		"sajda": false
	},
	{
		"number": 5954,
		"text": "سَنُقْرِئُكَ فَلَا تَنْسَىٰ",
		"numberInSurah": 6,
		"juz": 30,
		"manzil": 7,
		"page": 591,
		"ruku": 529,
		"hizbQuarter": 237,
		"meaning": "Kami akan membacakan (Al Quran) kepadamu (Muhammad) Maka kamu tidak akan lupa,",
		"sajda": false
	},
	{
		"number": 5955,
		"text": "إِلَّا مَا شَاءَ اللَّهُ ۚ إِنَّهُ يَعْلَمُ الْجَهْرَ وَمَا يَخْفَىٰ",
		"numberInSurah": 7,
		"juz": 30,
		"manzil": 7,
		"page": 591,
		"ruku": 529,
		"hizbQuarter": 237,
		"meaning": "kecuali kalau Allah menghendaki. Sesungguhnya Dia mengetahui yang terang dan yang tersembunyi.",
		"sajda": false
	},
	{
		"number": 5956,
		"text": "وَنُيَسِّرُكَ لِلْيُسْرَىٰ",
		"numberInSurah": 8,
		"juz": 30,
		"manzil": 7,
		"page": 591,
		"ruku": 529,
		"hizbQuarter": 237,
		"meaning": "dan Kami akan memberi kamu taufik ke jalan yang mudah,",
		"sajda": false
	},
	{
		"number": 5957,
		"text": "فَذَكِّرْ إِنْ نَفَعَتِ الذِّكْرَىٰ",
		"numberInSurah": 9,
		"juz": 30,
		"manzil": 7,
		"page": 591,
		"ruku": 529,
		"hizbQuarter": 237,
		"meaning": "oleh sebab itu berikanlah peringatan karena peringatan itu bermanfaat,",
		"sajda": false
	},
	{
		"number": 5958,
		"text": "سَيَذَّكَّرُ مَنْ يَخْشَىٰ",
		"numberInSurah": 10,
		"juz": 30,
		"manzil": 7,
		"page": 591,
		"ruku": 529,
		"hizbQuarter": 237,
		"meaning": "orang yang takut (kepada Allah) akan mendapat pelajaran,",
		"sajda": false
	},
	{
		"number": 5959,
		"text": "وَيَتَجَنَّبُهَا الْأَشْقَى",
		"numberInSurah": 11,
		"juz": 30,
		"manzil": 7,
		"page": 591,
		"ruku": 529,
		"hizbQuarter": 237,
		"meaning": "dan orang-orang yang celaka (kafir) akan menjauhinya.",
		"sajda": false
	},
	{
		"number": 5960,
		"text": "الَّذِي يَصْلَى النَّارَ الْكُبْرَىٰ",
		"numberInSurah": 12,
		"juz": 30,
		"manzil": 7,
		"page": 591,
		"ruku": 529,
		"hizbQuarter": 237,
		"meaning": "(yaitu) orang yang akan memasuki api yang besar (neraka).",
		"sajda": false
	},
	{
		"number": 5961,
		"text": "ثُمَّ لَا يَمُوتُ فِيهَا وَلَا يَحْيَىٰ",
		"numberInSurah": 13,
		"juz": 30,
		"manzil": 7,
		"page": 591,
		"ruku": 529,
		"hizbQuarter": 237,
		"meaning": "kemudian Dia tidak akan mati di dalamnya dan tidak (pula) hidup.",
		"sajda": false
	},
	{
		"number": 5962,
		"text": "قَدْ أَفْلَحَ مَنْ تَزَكَّىٰ",
		"numberInSurah": 14,
		"juz": 30,
		"manzil": 7,
		"page": 591,
		"ruku": 529,
		"hizbQuarter": 237,
		"meaning": "Sesungguhnya beruntunglah orang yang membersihkan diri (dengan beriman),",
		"sajda": false
	},
	{
		"number": 5963,
		"text": "وَذَكَرَ اسْمَ رَبِّهِ فَصَلَّىٰ",
		"numberInSurah": 15,
		"juz": 30,
		"manzil": 7,
		"page": 591,
		"ruku": 529,
		"hizbQuarter": 237,
		"meaning": "dan Dia ingat nama Tuhannya, lalu Dia sembahyang.",
		"sajda": false
	},
	{
		"number": 5964,
		"text": "بَلْ تُؤْثِرُونَ الْحَيَاةَ الدُّنْيَا",
		"numberInSurah": 16,
		"juz": 30,
		"manzil": 7,
		"page": 592,
		"ruku": 529,
		"hizbQuarter": 237,
		"meaning": "tetapi kamu (orang-orang kafir) memilih kehidupan duniawi.",
		"sajda": false
	},
	{
		"number": 5965,
		"text": "وَالْآخِرَةُ خَيْرٌ وَأَبْقَىٰ",
		"numberInSurah": 17,
		"juz": 30,
		"manzil": 7,
		"page": 592,
		"ruku": 529,
		"hizbQuarter": 237,
		"meaning": "sedang kehidupan akhirat adalah lebih baik dan lebih kekal.",
		"sajda": false
	},
	{
		"number": 5966,
		"text": "إِنَّ هَٰذَا لَفِي الصُّحُفِ الْأُولَىٰ",
		"numberInSurah": 18,
		"juz": 30,
		"manzil": 7,
		"page": 592,
		"ruku": 529,
		"hizbQuarter": 237,
		"meaning": "Sesungguhnya ini benar-benar terdapat dalam Kitab-Kitab yang dahulu,",
		"sajda": false
	},
	{
		"number": 5967,
		"text": "صُحُفِ إِبْرَاهِيمَ وَمُوسَىٰ",
		"numberInSurah": 19,
		"juz": 30,
		"manzil": 7,
		"page": 592,
		"ruku": 529,
		"hizbQuarter": 237,
		"meaning": "(yaitu) Kitab-Kitab Ibrahim dan Musa",
		"sajda": false
	}
]