{
  "role": [
    {
      "id": "bb90778b-adb1-4119-bf8f-984a259e8806",
      "roleName": "FASTO.ADMIN"
    },
    {
      "id": "89c73f8a-b574-4027-a165-d3b47ef99242",
      "roleName": "STORE.ADMIN"
    },
    {
      "id": "0cc40f70-33ae-4236-a71a-fd046a86a636",
      "roleName": "STORE.MANAGER"
    },
    {
      "id": "51fd1598-b570-436f-a30a-75e3d09a3ea8",
      "roleName": "STORE.STAFF"
    },
    {
      "id": "56ad718f-c4ef-4a81-95ee-1b61963baf92",
      "roleName": "CUSTOMER"
    }
  ],
  "user": [
    {
      "name": "FastO Admin",
      "email": "admin@fasto.com",
      "password": "$2a$11$KEIeOVk2opMleFpIqcTDBugbPJCu8tu91iByl7OoeUOcfkqKV86TO",
      "roleId": "bb90778b-adb1-4119-bf8f-984a259e8806"
    },
    {
      "name": "Store Admin",
      "email": "store@fasto.com",
      "password": "$2a$11$KEIeOVk2opMleFpIqcTDBugbPJCu8tu91iByl7OoeUOcfkqKV86TO",
      "roleId": "89c73f8a-b574-4027-a165-d3b47ef99242",
      "storeId": "53a56e5b-aa9a-4a9e-b075-657738fa2ec5"
    },
    {
      "name": "Store Staff",
      "email": "staff@fasto.com",
      "password": "$2a$11$KEIeOVk2opMleFpIqcTDBugbPJCu8tu91iByl7OoeUOcfkqKV86TO",
      "roleId": "51fd1598-b570-436f-a30a-75e3d09a3ea8",
      "storeId": "53a56e5b-aa9a-4a9e-b075-657738fa2ec5"
    },
    {
      "name": "Customer",
      "email": "customer@fasto.com",
      "password": "$2a$11$KEIeOVk2opMleFpIqcTDBugbPJCu8tu91iByl7OoeUOcfkqKV86TO",
      "roleId": "56ad718f-c4ef-4a81-95ee-1b61963baf92"
    },
    {
      "name": "Customer 1",
      "email": "customer1@fasto.com",
      "password": "$2a$11$KEIeOVk2opMleFpIqcTDBugbPJCu8tu91iByl7OoeUOcfkqKV86TO",
      "roleId": "56ad718f-c4ef-4a81-95ee-1b61963baf92"
    }
  ]
}
