5
0;2
1;7;2
2;1;0;3
3;2;11
4;5
5;6;4
6;17;5
7;18;1;20;
8;9;21
9;24;8
10;24;26;25
11;3;27;12
12;11;13
13;12;31
14;33;15
15;14;16
16;15;38
17;40;6;39
18;42;7
19;20;43
20;21;19;7
21;8;20
22;23
23;47;22
24;48;9;10
25;10;49
26;50;10
27;11
28;29;52
29;53;28
30;54
31;13;32
32;31;33
33;32;14
34;58;35
35;34
36;37;60
37;61;36
38;16;39
39;38;40;17
40;39;41;17
41;40;65
42;66;18
43;19;44;66
44;43;45
45;44;46
46;45;47
47;46;23
48;49;24
49;25;48
50;51;26
51;52;50
52;28;51
53;54;29
54;30;53
55;56
56;57;55
57;58;56
58;59;34;57
59;60;58
60;36;59
61;62;37
62;63;61
63;64;62
64;65;63
65;41;64
66;43;42
