{
  "swagger": "2.0",
  "info": {
    "description": "This is a sample server Petstore server.  You can find out more about     Swagger at [http://swagger.io](http://swagger.io) or on [irc.freenode.net, #swagger](http://swagger.io/irc/).      For this sample, you can use the api key `special-key` to test the authorization     filters.",
    "version": "1.0.0",
    "title": "Challenge Chapter 8",
    "termsOfService": "http://swagger.io/terms/",
    "contact": {
      "email": "apiteam@swagger.io"
    },
    "license": {
      "name": "Apache 2.0",
      "url": "http://www.apache.org/licenses/LICENSE-2.0.html"
    }
  },
  "host": "localhost:5000",
  "basePath": "/api",
  "tags": [
    {
      "name": "player",
      "description": "Operations about user"
    }
  ],
  "schemes": [
    "http"
  ],
  "paths": {
    "/players": {
      "post": {
        "tags": [
          "player"
        ],
        "summary": "Create Player",
        "description": "end point to create player.",
        "operationId": "addPlayer",
        "produces": [
          "application/json"
        ],
        "parameters": [
          {
            "in": "body",
            "name": "body",
            "description": "Body Player",
            "required": true,
            "schema": {
              "$ref": "#/definitions/player"
            }
          }
        ],
        "responses": {
          "201": {
            "description": "SUCCESS",
            "schema": {
              "$ref": "#/definitions/responseplayer"
            }
          },
          "400": {
            "description": "FAILED",
            "schema": {
              "$ref": "#/definitions/response400player"
            }
          },
          "500": {
            "description": "FAILED",
            "schema": {
              "$ref": "#/definitions/response500player"
            }
          }
        }
      },
      "get": {
        "tags": [
          "player"
        ],
        "summary": "Get All Player",
        "description": "end point to get all player.",
        "operationId": "getAllPlayer",
        "produces": [
          "application/json"
        ],
        "responses": {
          "200": {
            "description": "SUCCESS",
            "schema": {
              "$ref": "#/definitions/responseplayer"
            }
          },
          "500": {
            "description": "FAILED",
            "schema": {
              "$ref": "#/definitions/response500player"
            }
          }
        }
      }
    },
    "/players/{id}": {
      "get": {
        "tags": [
          "player"
        ],
        "summary": "Get Detail Player",
        "description": "end point to get detail player.",
        "operationId": "getDetailPlayer",
        "produces": [
          "application/json"
        ],
        "parameters": [
          {
            "in": "path",
            "name": "id",
            "description": "Body of Player by ID",
            "required": true,
            "type": "integer",
            "format": "int64"
          }
        ],
        "responses": {
          "200": {
            "description": "SUCCESS",
            "schema": {
              "$ref": "#/definitions/responseplayer"
            }
          },
          "500": {
            "description": "FAILED",
            "schema": {
              "$ref": "#/definitions/response500player"
            }
          }
        }
      },
      "put": {
        "tags": [
          "player"
        ],
        "summary": "Update  Player",
        "description": "end point to update player.",
        "operationId": "updatePlayer",
        "produces": [
          "application/json"
        ],
        "parameters": [
          {
            "in": "path",
            "name": "id",
            "description": "Body of Player by ID",
            "required": true,
            "type": "integer",
            "format": "int64"
          },
          {
            "in": "body",
            "name": "body",
            "description": "Body Player",
            "required": true,
            "schema": {
              "$ref": "#/definitions/player"
            }
          }
        ],
        "responses": {
          "200": {
            "description": "SUCCESS",
            "schema": {
              "$ref": "#/definitions/response200updateplayer"
            }
          },
          "400": {
            "description": "FAILED",
            "schema": {
              "$ref": "#/definitions/response400updateplayer"
            }
          },
          "500": {
            "description": "FAILED",
            "schema": {
              "$ref": "#/definitions/response500player"
            }
          }
        }
      },
      "delete": {
        "tags": [
          "player"
        ],
        "summary": "Delete Player",
        "description": "end point to delete player.",
        "operationId": "deletePlayer",
        "produces": [
          "application/json"
        ],
        "parameters": [
          {
            "in": "path",
            "name": "id",
            "description": "Body of Player by ID",
            "required": true,
            "type": "integer",
            "format": "int64"
          }
        ],
        "responses": {
          "200": {
            "description": "SUCCESS",
            "schema": {
              "$ref": "#/definitions/response200deleteplayer"
            }
          },
          "400": {
            "description": "FAILED",
            "schema": {
              "$ref": "#/definitions/response400deleteplayer"
            }
          },
          "500": {
            "description": "FAILED",
            "schema": {
              "$ref": "#/definitions/response500deleteplayer"
            }
          }
        }
      }
    },
    "/players/exp/{id}": {
      "post": {
        "tags": [
          "player"
        ],
        "summary": "Post Experience Player",
        "description": "end point to post experience player.",
        "operationId": "getExperience",
        "produces": [
          "application/json"
        ],
        "parameters": [
          {
            "in": "path",
            "name": "id",
            "description": "Body of Player by ID",
            "required": true,
            "type": "integer",
            "format": "int64"
          },
          {
            "in": "body",
            "name": "body",
            "description": "Body Player",
            "required": true,
            "schema": {
              "$ref": "#/definitions/experience"
            }
          }
        ],
        "responses": {
          "200": {
            "description": "SUCCESS",
            "schema": {
              "$ref": "#/definitions/response200expplayer"
            }
          },
          "400": {
            "description": "FAILED",
            "schema": {
              "$ref": "#/definitions/response400expplayer"
            }
          },
          "500": {
            "description": "FAILED",
            "schema": {
              "$ref": "#/definitions/response500expplayer"
            }
          }
        }
      }
    }
  },
  "definitions": {
    "player": {
      "type": "object",
      "required": [
        "username",
        "email",
        "password"
      ],
      "properties": {
        "username": {
          "type": "string",
          "example": "angie"
        },
        "email": {
          "type": "string",
          "example": "angie@gmail.com"
        },
        "password": {
          "type": "string"
        }
      }
    },
    "experience": {
      "type": "object",
      "required": [
        "exp"
      ],
      "properties": {
        "exp": {
          "type": "integer",
          "example": 0
        }
      }
    },
    "responseplayer": {
      "type": "object",
      "properties": {
        "result": {
          "type": "string",
          "example": "success"
        },
        "message": {
          "type": "object",
          "properties": {
            "id": {
              "type": "integer",
              "example": "1"
            },
            "username": {
              "type": "string",
              "example": "angie"
            },
            "email": {
              "type": "string",
              "example": "angie@gmail.com"
            },
            "password": {
              "type": "string"
            },
            "experience": {
              "type": "integer",
              "example": "0"
            },
            "lvl": {
              "type": "integer",
              "example": "0"
            },
            "createdAt": {
              "type": "string",
              "format": "date-time"
            },
            "updatedAt": {
              "type": "string",
              "format": "date-time"
            }
          }
        }
      }
    },
    "response200updateplayer": {
      "type": "object",
      "properties": {
        "result": {
          "type": "string",
          "example": "SUCCESS"
        },
        "message": {
          "type": "string",
          "example": "Player was updated successfully!"
        }
      }
    },
    "response200deleteplayer": {
      "type": "object",
      "properties": {
        "result": {
          "type": "string",
          "example": "SUCCESS"
        },
        "message": {
          "type": "string",
          "example": "Player was deleted successfully!"
        }
      }
    },
    "response200expplayer": {
      "type": "object",
      "properties": {
        "result": {
          "type": "string",
          "example": "SUCCESS"
        },
        "message": {
          "type": "string",
          "example": "Player with id=${id} has more experience."
        }
      }
    },
    "response400player": {
      "type": "object",
      "properties": {
        "result": {
          "type": "string",
          "example": "FAILED"
        },
        "message": {
          "type": "string",
          "example": "username or email or password field cannot be empty"
        }
      }
    },
    "response400updateplayer": {
      "type": "object",
      "properties": {
        "result": {
          "type": "string",
          "example": "FAILED"
        },
        "message": {
          "type": "string",
          "example": "Cannot update Player with id=${id}. Maybe Player was not found or req.body is empty!"
        }
      }
    },
    "response400expplayer": {
      "type": "object",
      "properties": {
        "result": {
          "type": "string",
          "example": "FAILED"
        },
        "message": {
          "type": "string",
          "example": "Cannot update Player with id=${id}"
        }
      }
    },
    "response400deleteplayer": {
      "type": "object",
      "properties": {
        "result": {
          "type": "string",
          "example": "FAILED"
        },
        "message": {
          "type": "string",
          "example": "Cannot delete Player with id=${id}. Maybe Player was not found"
        }
      }
    },
    "response500player": {
      "type": "object",
      "properties": {
        "result": {
          "type": "string",
          "example": "FAILED"
        },
        "message": {
          "type": "string",
          "example": "Some error occurred while retrieving players "
        }
      }
    },
    "response500deleteplayer": {
      "type": "object",
      "properties": {
        "result": {
          "type": "string",
          "example": "FAILED"
        },
        "message": {
          "type": "string",
          "example": "Could not delete Player with id="
        }
      }
    },
    "response500expplayer": {
      "type": "object",
      "properties": {
        "result": {
          "type": "string",
          "example": "FAILED"
        },
        "message": {
          "type": "string",
          "example": "Error updating Player exp with id="
        }
      }
    }
  },
  "externalDocs": {
    "description": "Find out more about Swagger",
    "url": "http://swagger.io"
  }
}