"id","name","salary","start_date","dept"
1,"John",45000,2023-01-15,"IT"
2,"Alice",55000,2022-11-05,"HR"
3,"Bob",60000,2023-02-20,"IT"
4,"Mary",70000,2021-08-10,"Finance"
5,"David",75000,2022-05-15,"IT"
6,"Sara",62000,2022-03-30,"Sales"
7,"Michael",80000,2022-12-12,"IT"
8,"Olivia",52000,2022-09-18,"HR"
9,"Lucas",58000,2022-06-23,"Finance"
10,"Emma",67000,2023-03-10,"IT"
11,"James",71000,2021-12-05,"Sales"
12,"Sophia",59000,2022-10-02,"HR"
13,"Ethan",68000,2022-04-25,"IT"
14,"Ava",73000,2022-07-29,"Finance"
15,"William",54000,2022-11-28,"Sales"
16,"Mia",61000,2022-05-11,"IT"
17,"Benjamin",69000,2022-12-31,"Finance"
18,"Charlotte",72000,2023-01-05,"IT"
19,"Henry",63000,2022-08-22,"Finance"
20,"Ella",59000,2022-02-15,"Sales"
