$date
	Mon Jan  1 12:51:08 2024
$end
$version
	Icarus Verilog
$end
$timescale
	1ps
$end
$scope module tb_demux1to4 $end
$var wire 1 ! out3 $end
$var wire 1 " out2 $end
$var wire 1 # out1 $end
$var wire 1 $ out0 $end
$var reg 1 % in $end
$var reg 2 & sel [1:0] $end
$scope module demux_inst $end
$var wire 1 % in $end
$var wire 2 ' sel [1:0] $end
$var wire 1 ! out3 $end
$var wire 1 " out2 $end
$var wire 1 # out1 $end
$var wire 1 $ out0 $end
$upscope $end
$upscope $end
$enddefinitions $end
#0
$dumpvars
b0 '
b0 &
1%
1$
0#
0"
0!
$end
#10000
0$
0%
b1 &
b1 '
#20000
1"
1%
b10 &
b10 '
#30000
0"
0%
b11 &
b11 '
#40000
