$date
	Mon Jan  1 12:12:06 2024
$end
$version
	Icarus Verilog
$end
$timescale
	1ps
$end
$scope module tb_decimal_adder $end
$var wire 5 ! sum [4:0] $end
$var reg 4 " a [3:0] $end
$var reg 4 # b [3:0] $end
$scope module da_inst $end
$var wire 4 $ a [3:0] $end
$var wire 4 % b [3:0] $end
$var wire 5 & sum [4:0] $end
$upscope $end
$upscope $end
$enddefinitions $end
#0
$dumpvars
b1000 &
b11 %
b101 $
b11 #
b101 "
b1000 !
$end
#10000
b10 #
b10 %
b1011 !
b1011 &
b1001 "
b1001 $
#20000
b111 #
b111 %
b1111 !
b1111 &
b1000 "
b1000 $
#30000
b1 #
b1 %
b10 !
b10 &
b1 "
b1 $
#40000
