[
  {
    "id": "287e3da1-c4b2-4ec3-ae18-39bdd5903f3a",
    "name": "Coffee",
    "breed": "Siamese"
  },
  {
    "id": "2823c2e1-9cbf-470a-88dc-bc8691f4d65f",
    "name": "Chester",
    "breed": "Tabby"
  },
  {
    "id": "2f6a0a8b-1fd4-4294-b7e5-21857903fa99",
    "name": "Blue",
    "breed": "Naked"
  },
  {
    "id": "8b06bbfb-027a-4f0e-87a4-ad1955342b22",
    "name": "Marla",
    "breed": "Siamese"
  }
]