,bbox/AP,bbox/AP-Human,bbox/AP-Humans,bbox/AP50,bbox/AP75,bbox/APl,bbox/APm,bbox/APs,data_time,eta_seconds,fast_rcnn/cls_accuracy,fast_rcnn/false_negative,fast_rcnn/fg_cls_accuracy,iteration,loss_box_reg,loss_cls,loss_rpn_cls,loss_rpn_loc,lr,roi_head/num_bg_samples,roi_head/num_fg_samples,rpn/num_neg_anchors,rpn/num_pos_anchors,time,timetest,total_loss,validation_loss
0,0.07105450739626201,0.07105450739626201,,0.266823989692129,0.007067950965247,,,0.09342543420878201,0.0023852360000660004,2491.390443819996,0.828125,1.0,0.0,19,0.586988925933837,1.094061613082885,0.18244554847478803,0.36466966569423603,9.581e-05,53.0,11.0,152.5,103.5,1.683371921499997,12.0,2.208000874379649,1.428749271155316
1,10.595476026191326,10.595476026191326,,35.87029896434428,2.806476621779564,,,10.602008804200194,0.002422677499907,2461.994323720146,0.828125,1.0,0.0,39,0.746191889047622,0.5676365494728081,0.10871832072734801,0.23405422270298,0.00019561,53.0,11.0,152.5,103.5,1.68705070750002,12.0,1.603317771106958,1.176295312736848
2,13.528963730664756,13.528963730664756,,48.22723494183079,2.762515549019785,,,13.528983530202154,0.002460522999854,2429.3530188000295,0.953125,0.25,0.75,59,0.747494101524353,0.310169741511344,0.05961706675589001,0.23159544169902802,0.00029541,48.0,16.0,152.5,103.5,1.844712802999993,12.0,1.362206112593412,0.9238413543183811
3,12.509224948474365,12.509224948474365,,44.40608211666067,2.7819267593523893,,,12.509257598448443,0.0023821294998920004,2392.442306920102,0.9687500000000001,0.1875,0.8125,79,0.709836512804031,0.22682389616966203,0.03249267488718,0.211759515106678,0.00039521,48.0,16.0,152.5,103.5,1.5528824584998802,12.0,1.1636386779136951,0.860660994686756
4,13.838421225829348,13.838421225829348,,49.016119858240806,1.9533174197085281,,,13.83842640161368,0.002405568500307,2359.526750699979,0.9296875,0.09375000000000001,0.9062500000000001,99,0.7407661378383631,0.17935355752706503,0.027290224097669003,0.218240842223167,0.00049501,55.5,8.5,152.5,103.5,1.686777842999617,12.0,1.16156418249011,0.9238413543183811
5,12.686180564856036,12.686180564856036,,47.55388950352175,2.366852330394606,,,12.686180564856036,0.0024050644997250003,2326.236954449978,0.9687500000000001,0.125,0.875,119,0.6860049366950981,0.23519039899110702,0.079915564507246,0.22818493843078602,0.0005,49.5,14.5,152.5,103.5,1.6868368320001532,12.0,1.185503356158733,0.8658438880466951
6,17.34587359096615,17.34587359096615,,57.685528568096444,2.968927271434546,,,17.345880655248724,0.002413833500213,2294.3393181199644,0.9375,0.064583333333333,0.9354166666666661,139,0.732267171144485,0.18804465234279602,0.032639155164361,0.223556034266948,0.0005,51.0,13.0,152.5,103.5,1.7693323080002301,12.0,1.17749741859734,0.8078464217750091
7,15.817658180978764,15.817658180978764,,56.85972315339707,3.249270693495901,,,15.817658180978764,0.002345602500099,2260.6712673999027,0.9609375,0.1875,0.8125,159,0.6170151531696321,0.18594717234373,0.036068828776478004,0.224146500229835,0.0005,49.5,14.5,152.5,103.5,1.690783456499048,12.0,1.073088834993541,0.80266352841507
8,18.67363985857125,18.67363985857125,,61.375582234769276,3.9422270049774193,,,18.67363985857125,0.002294690999406,2226.8587499399655,0.9609375,0.21875000000000003,0.7812500000000001,179,0.7026751935482021,0.173963479697704,0.020573589019477003,0.24442274123430202,0.0005,48.0,16.0,152.5,103.5,1.685361252501024,12.0,1.146997504867613,0.7974806350551311
9,21.11778825300302,21.11778825300302,,68.12066237371155,4.599755440191814,,,21.11780830213536,0.0023962104996820004,2193.2810327995867,0.9609375,0.125,0.875,199,0.7211475968360901,0.21661982685327502,0.020939949899911003,0.23937587440013802,0.0005,48.0,16.0,152.5,103.5,1.7681842759993742,12.0,1.210878957528621,0.7890626038856771
10,21.303442330839356,21.303442330839356,,70.60896427898176,5.574563452351471,,,21.303442330839356,0.002403263501037,2161.7941766395234,0.9609375,0.21875000000000003,0.7812500000000001,219,0.670157432556152,0.160603933036327,0.014498081523925002,0.182717695832252,0.00025,48.0,16.0,152.5,103.5,1.848434695501055,12.0,1.052968017756939,0.780644572716222
11,22.500960838392764,22.500960838392764,,72.72362897876494,4.5329815125280195,,,22.500960838392764,0.0023888380001150004,2128.6041398995076,0.984375,0.03125,0.9687500000000001,239,0.647018790245056,0.185369618237018,0.015399126801639,0.19371478259563402,0.00025,48.0,16.0,152.5,103.5,1.769105102999674,12.0,1.099415891105309,0.7677990588938931
12,21.775401426673646,21.775401426673646,,70.51164867513634,4.8289161465037616,,,21.775401426673646,0.0024765469988770003,2095.506862979919,0.9609375,0.125,0.875,259,0.651827156543731,0.183833338320255,0.017578037455677,0.197195440530776,0.00025,48.0,16.0,152.5,103.5,1.773107139000785,12.0,1.072583841159939,0.7549535450715641
13,22.19380301850501,22.19380301850501,,71.22181039135475,5.342288143555394,,,22.19380301850501,0.002403688000413,2061.560416400025,0.9609375,0.21875000000000003,0.7812500000000001,279,0.657094031572341,0.13763818889856302,0.014775321353226002,0.190905958414077,0.00025,48.0,16.0,152.5,103.5,1.627610015000755,12.0,1.060056549031287,0.750916120598605
14,24.14802217903574,24.14802217903574,,74.0865752327227,5.7161204565588974,,,24.14802217903574,0.0024448764997940004,2027.7643440000247,0.9687500000000001,0.21875000000000003,0.7812500000000001,299,0.6080181896686551,0.159681037068367,0.013205156195908,0.18060331046581202,0.00025,48.0,16.0,152.5,103.5,1.766124332001709,12.0,0.9810497174039481,0.7468786961256471
15,22.436821082432587,22.436821082432587,,70.89499640223674,5.255604338174413,,,22.436821082432587,0.0022986629992370004,1994.3154323200906,0.984375,0.15625,0.8437500000000001,319,0.608044803142547,0.14843915402889202,0.011640915647149001,0.19771049916744202,0.00025,48.0,16.0,152.5,103.5,1.87415020050139,12.0,0.965313658583909,0.7349597448150491
16,23.688595281336372,23.688595281336372,,76.24366601559053,6.715940935076134,,,23.688595281336372,0.0022828050005040002,1960.312871819924,0.9609375,0.125,0.875,339,0.6244621276855461,0.174225755035877,0.01579816872254,0.197718396782875,0.00025,48.0,16.0,152.5,103.5,1.6848500754986162,12.0,1.019151957472786,0.723040793504451
17,20.209035312042534,20.209035312042534,,66.53521579518883,3.935017514777514,,,20.209035312042534,0.0023738175004830004,1926.6289987487335,0.953125,0.0625,0.9375,359,0.6347178518772121,0.142829060554504,0.009929856285452001,0.192252933979034,0.00025,48.0,16.0,152.5,103.5,1.690158246499777,12.0,0.996791558689437,0.705867315573636
18,22.317149387111172,22.317149387111172,,70.21299399014127,6.170715217051923,,,22.317149387111172,0.00238331050059,1892.8508468781365,0.9453125,0.125,0.875,379,0.579132467508316,0.152691945433616,0.014177244156599001,0.179116457700729,0.00025,48.0,16.0,152.5,103.5,1.769961898999099,12.0,0.93870416842401,0.6886938376428211
19,25.493666246311392,25.493666246311392,,75.99082377171001,7.211153902886756,,,25.493666246311392,0.002393476499491,1858.0307487494792,0.9765625,0.09375000000000001,0.9062500000000001,399,0.6580490469932551,0.17808224260807,0.007758372696116,0.18419314920902202,0.00025,48.0,16.0,152.5,103.5,1.558691613998235,12.0,1.029244741192087,0.686010222299955
20,22.880125078379905,22.880125078379905,,74.58679573386753,5.61042438508899,,,22.880125078379905,0.002379325000219,1824.023206078491,0.9609375,0.125,0.875,419,0.6051898002624511,0.180165186524391,0.012562867719680001,0.18875628709793002,0.00025,48.0,16.0,152.5,103.5,1.6880872575002281,12.0,0.998941545491106,0.681727865376457
21,21.252718548937903,21.252718548937903,,72.14151834536858,3.854153655895646,,,21.252718548937903,0.0024795084973440002,1790.8945299901097,0.9687500000000001,0.0625,0.9375,439,0.638488054275512,0.17732383310794803,0.010369448922574001,0.194680847227573,0.00025,48.0,16.0,152.5,103.5,1.6972896895022132,12.0,1.013944057747721,0.676131813636059
22,26.00720178229801,26.00720178229801,,75.28811521409389,8.536192888971755,,,26.00720178229801,0.002310736999788,1757.6640457997564,0.9609375,0.09375000000000001,0.9062500000000001,459,0.593804538249969,0.158712148666381,0.010484866332262002,0.179477520287036,0.00025,48.0,16.0,152.5,103.5,1.84793718000219,12.0,0.9482240681536491,0.671892360679874
23,24.355384359383773,24.355384359383773,,74.96069648491566,7.613147694796407,,,24.355384359383773,0.002394175997324,1724.2279664975285,0.9453125,0.0,1.0,479,0.575968235731124,0.17480876296758602,0.009055205620825001,0.178181022405624,0.00025,48.0,16.0,152.5,103.5,1.77050445650093,12.0,0.9859339572722091,0.670061707708388
24,24.47761712798787,24.47761712798787,,73.88673499400578,4.999343731293832,,,24.47761712798787,0.002380899499257,1690.7522039982723,0.9765625,0.09375000000000001,0.9062500000000001,499,0.6410057544708251,0.17068701982498102,0.011386746075004001,0.169235967099666,0.00025,48.0,16.0,152.5,103.5,1.7697149385021471,12.0,0.977565539535135,0.6632486240877721
25,24.860739261109455,24.860739261109455,,73.50000752637524,6.48913810396961,,,24.860739261109455,0.002514306001103,1657.167247750749,0.953125,0.09375000000000001,0.9062500000000001,519,0.6436720490455621,0.13783524185419002,0.004800065653398001,0.184713721275329,0.00025,48.0,16.0,152.5,103.5,1.8495923939990462,12.0,0.9508914970792831,0.6571971267712421
26,25.634464665988933,25.634464665988933,,76.19891362672173,7.475595069242866,,,25.634464665988933,0.002440115498757,1624.0001361587201,0.9609375,0.0625,0.9375,539,0.6685641109943391,0.176327496767044,0.009769387077540001,0.20419329404830902,0.00025,48.0,16.0,152.5,103.5,1.8489051699980332,12.0,1.060592897469177,0.6520935183911281
27,22.602264650334174,22.602264650334174,,74.109262325824,5.93825647898821,,,22.602264650334174,0.002379325000219,1590.1667999887468,0.9609375,0.125,0.875,559,0.61360490322113,0.17000742256641302,0.008127968292683,0.182807378470897,0.00025,48.0,16.0,152.5,103.5,1.7688270559992811,12.0,1.006626281247008,0.647491158591464
28,24.754176160295444,24.754176160295444,,77.43264607856524,5.065361668890275,,,24.754176160295444,0.0023581144960180002,1556.2701494181238,0.953125,0.125,0.875,579,0.5716910064220421,0.15885206311941102,0.007833881303668001,0.19287823140621102,0.00025,48.0,16.0,152.5,103.5,1.689762834503199,12.0,0.93781793769449,0.643152753897492
29,26.051471057558732,26.051471057558732,,78.05772510404582,7.440675103334435,,,26.051471057558732,0.00236330250118,1521.888288750688,0.953125,0.0625,0.9375,599,0.561344176530838,0.130623139441013,0.009791064076125,0.170544259250164,0.00025,48.0,16.0,152.5,103.5,1.6234961449990801,12.0,0.8950434774160381,0.639036865717385
30,23.490703276773733,23.490703276773733,,74.89733766809348,6.291308223898397,,,23.490703276773733,0.002373334998992,1488.3938053598831,0.9765625,0.125,0.875,619,0.573745459318161,0.13934774696826902,0.008074852870777001,0.17376535385847,0.00025,48.0,16.0,152.5,103.5,1.77184180650147,12.0,0.914069427875801,0.637401109966105
31,25.63441743379024,25.63441743379024,,79.88599956978042,7.03465582955491,,,25.63441743379024,0.0024315805021610003,1454.7742701082461,0.9687500000000001,0.09375000000000001,0.9062500000000001,639,0.568517208099365,0.138723485171794,0.005886860657483,0.175239123404026,0.00025,48.0,16.0,152.5,103.5,1.7716303729976062,12.0,0.920527218258939,0.635608000720005
32,24.846440390080836,24.846440390080836,,77.51467714849142,5.474037375738386,,,24.846440390080836,0.002318828501302,1421.00011913888,0.9921875,0.0625,0.9375,659,0.604700416326522,0.154562473297119,0.004214642336592,0.20850583165884,0.00025,48.0,16.0,152.5,103.5,1.769788064499152,12.0,0.9797659367322921,0.633071296636017
33,26.630871775794162,26.630871775794162,,78.3002023950076,7.537138826346604,,,26.630871775794162,0.0023165819948180004,1387.1103505683277,0.9453125,0.125,0.875,679,0.680596470832824,0.180475130677223,0.009723591618239,0.20436659455299303,0.00025,48.0,16.0,152.5,103.5,1.6904404740016612,12.0,1.054962334223091,0.630711118610485
34,24.516876452650525,24.516876452650525,,76.73136472974417,4.925039918323339,,,24.516876452650525,0.00238115999673,1353.2783907983685,0.9687500000000001,0.125,0.875,699,0.594779193401336,0.166493982076644,0.007215341553092,0.187753312289714,0.00025,48.0,16.0,152.5,103.5,1.769154844503646,12.0,0.9845313075929881,0.6280550378758151
35,26.69169812870536,26.69169812870536,,78.40905391907188,8.866214055992677,,,26.69169812870536,0.002449862000503,1319.6810168087177,0.9609375,0.0625,0.9375,719,0.5700994133949281,0.14617692679166702,0.011186905205249,0.18081948161125103,0.00025,48.0,16.0,152.5,103.5,1.849212001001433,12.0,0.9200033748056741,0.624854902331616
36,22.139006512383595,22.139006512383595,,73.1531413268729,4.8930883588059455,,,22.139006512383595,0.0024024345002540003,1285.7602001195846,0.953125,0.0625,0.9375,739,0.6071269214153291,0.163188867270946,0.004931222880259,0.176596730947494,0.00025,48.0,16.0,152.5,103.5,1.68929860299977,12.0,0.9765488504199311,0.6227506848608381
37,27.583396019761157,27.583396019761157,,78.60937944415738,9.083885809283672,,,27.583396019761157,0.002455746500345,1252.3432320601933,0.9609375,0.125,0.875,759,0.548537522554397,0.14220455288887002,0.006668281275779,0.17444561421871102,0.00025,48.0,16.0,152.5,103.5,1.849290440000913,12.0,0.9213446495123201,0.617140486389407
38,23.229208927430307,23.229208927430307,,72.19620597049789,4.953213379598035,,,23.229208927430307,0.0023195395006040003,1218.00010211904,0.9453125,0.1875,0.8125,779,0.61111170053482,0.14885219186544402,0.011023002676665,0.21499592065811102,0.00025,48.0,16.0,152.5,103.5,1.6883533834989062,12.0,1.0035037699854,0.617140486389407
39,24.736387455175585,24.736387455175585,,76.70814593671238,5.820709236273409,,,24.736387455175585,0.002455269997881,1184.3291176488492,0.9687500000000001,0.125,0.875,799,0.628486514091491,0.156026326119899,0.0065703028813,0.183349855244159,0.00025,48.0,16.0,152.5,103.5,1.850635917002364,12.0,0.9799481369554991,0.6213765574450041
40,26.583251827093125,26.583251827093125,,79.63517511806965,7.076067450729849,,,26.583251827093125,0.002289512500283,1150.4170211596283,0.9687500000000001,0.09375000000000001,0.9062500000000001,819,0.5758111178874971,0.14186480641365,0.003843827638775,0.179370664060115,0.00025,48.0,16.0,152.5,103.5,1.688120843999058,12.0,0.9408848294988271,0.617140486389407
41,25.61944256636415,25.61944256636415,,77.63880105628121,7.148543090347544,,,25.61944256636415,0.00231731650274,1116.4237725282874,0.9453125,0.0625,0.9375,839,0.5840771198272701,0.13411466777324602,0.006778246257454001,0.19225351512432,0.00025,48.0,16.0,152.5,103.5,1.6246811499986502,12.0,0.9582208814099431,0.612921823206065
42,25.034449537473414,25.034449537473414,,77.91726873523278,7.711178989202276,,,25.034449537473414,0.002342573003261,1082.6227126386948,0.9765625,0.1875,0.8125,859,0.588295042514801,0.14948339015245402,0.005545539781451001,0.165847435593605,0.00025,48.0,16.0,152.5,103.5,1.772003491001669,12.0,0.9167340369895101,0.6110219399532221
43,22.359654413037823,22.359654413037823,,70.86432542217939,5.264016388523114,,,22.359654413037823,0.002375874501012,1048.7790695893636,0.984375,0.25,0.75,879,0.598215073347091,0.17764327675104102,0.012576751876622001,0.178680911660194,0.00025,50.0,14.0,152.5,103.5,1.689818266997463,12.0,0.9729628354543821,0.6110219399532221
44,21.045032597073558,21.045032597073558,,70.35514462777451,4.522058096905285,,,21.045032597073558,0.0024158265005090004,1015.0738421996721,0.9687500000000001,0.0625,0.9375,899,0.605674088001251,0.161647669970989,0.01426132582128,0.18878895044326702,0.00025,49.5,14.5,152.5,103.5,1.847365536501456,12.0,0.9844794743694361,0.6110219399532221
45,24.139531160131487,24.139531160131487,,75.73385546065535,5.535657045807944,,,24.139531160131487,0.0024033629961190003,981.3012689090465,0.9765625,0.21875000000000003,0.7812500000000001,919,0.564175307750701,0.151470623910427,0.007682485505938001,0.15607916563749302,0.00025,48.0,16.0,152.5,103.5,1.873632203991292,12.0,0.896256493870168,0.6110219399532221
46,23.685884336758477,23.685884336758477,,73.46636523711005,4.922868686941061,,,23.685884336758477,0.0025293745056840003,947.4632941190794,0.953125,0.125,0.875,939,0.582976639270782,0.14028616249561301,0.014467751607298001,0.17708786576986302,0.00025,48.0,16.0,152.5,103.5,1.694074617997103,12.0,0.932578408159315,0.6110219399532221
47,21.449357386978818,21.449357386978818,,69.96307803479964,3.332063436083765,,,21.449357386978818,0.002410783505183,913.7416593606395,0.9375,0.0,1.0,959,0.5631120502948761,0.16851897537708202,0.009810673072934002,0.18470554798841402,0.00025,48.0,16.0,152.5,103.5,1.857591596497513,12.0,0.9436522851465271,0.617055845229274
48,25.605495887467317,25.605495887467317,,76.42451284545798,6.702060775727025,,,25.605495887467317,0.0023837694971,879.963057219793,0.9765625,0.1875,0.8125,979,0.538272649049758,0.15074069052934602,0.007861957885324001,0.18490708619356103,0.00025,48.0,16.0,152.5,103.5,1.770635243003198,12.0,0.9245859798975281,0.6213765574450041
49,26.14603922314298,26.14603922314298,,77.28424597384459,7.923239322904922,,,26.14603922314298,0.002287791503476,846.0194534982293,0.984375,0.09375000000000001,0.9062500000000001,999,0.6185413300991051,0.155768685042858,0.007008081302046,0.187963843345642,0.00025,48.0,16.0,152.5,103.5,1.689732027007266,12.0,0.934488402388524,0.617055845229274
50,25.429594970333387,25.429594970333387,,76.76000749722942,6.676233595915704,,,25.429594970333387,0.0024078240021480003,812.2148083205684,0.953125,0.21875000000000003,0.7812500000000001,1019,0.5489376783370971,0.15632762759923902,0.008455842966213,0.20121686905622402,0.00025,48.0,16.0,152.5,103.5,1.768848623498343,12.0,0.92958214553073,0.617055845229274
51,25.339038638716755,25.339038638716755,,78.20570340997675,6.762526757525345,,,25.339038638716755,0.0023111995033100003,778.3171841072544,0.953125,0.09375000000000001,0.9062500000000001,1039,0.6085218787193291,0.17074704170227,0.009011063724756001,0.214131206274032,0.00025,48.0,16.0,152.5,103.5,1.687381567004195,12.0,0.9535408510128031,0.6110219399532221
52,25.622583285481966,25.622583285481966,,78.13355959382612,6.587263922057223,,,25.622583285481966,0.002487270001438,744.4971190784418,0.9609375,0.0625,0.9375,1059,0.5765518844127651,0.14975640922784803,0.0054594872053710004,0.18054474890232,0.00025,48.0,16.0,152.5,103.5,1.848986760996922,12.0,0.954418612411245,0.607275577693552
53,24.492015260969264,24.492015260969264,,76.85090872047618,6.941170772179812,,,24.492015260969264,0.002442001496092,710.9167149002315,0.9453125,0.0625,0.9375,1079,0.607165187597274,0.141471989452838,0.00860843155533,0.176202043890953,0.00025,48.0,16.0,152.5,103.5,1.851951012002246,12.0,0.9384698590729381,0.615342652168952
54,26.93996087746947,26.93996087746947,,79.25843784962987,8.267750133564494,,,26.93996087746947,0.0023539145040550003,677.0416320003278,0.9687500000000001,0.0625,0.9375,1099,0.600615233182907,0.129183709621429,0.009579928126186,0.16714731603860802,0.00025,48.0,16.0,152.5,103.5,1.687316168492543,12.0,0.893051988445222,0.615342652168952
55,26.494138241809218,26.494138241809218,,79.23994727762476,8.924072611105798,,,26.494138241809218,0.0023290575045390003,643.347321080073,0.9687500000000001,0.125,0.875,1119,0.573379814624786,0.12983771413564602,0.0037004188634450004,0.160015851259231,0.00025,48.0,16.0,152.5,103.5,1.77049631299451,12.0,0.884957758244127,0.613411532001993
56,23.665465900128673,23.665465900128673,,76.56576689244453,4.843285174932542,,,23.665465900128673,0.002386912499787,609.562892880931,0.9921875,0.125,0.875,1139,0.6028150320053101,0.15605092048645,0.003218881553038,0.17524325847625702,0.00025,48.0,16.0,152.5,103.5,1.8484196959980181,12.0,0.9529635358485391,0.613411532001993
57,24.724691567329167,24.724691567329167,,77.89986455692295,5.728862814302546,,,24.724691567329167,0.002403587001026,575.6982877208793,0.9609375,0.125,0.875,1159,0.592851966619491,0.133093908429145,0.004676550626754,0.168537057936191,0.00025,48.0,16.0,152.5,103.5,1.688843428994005,12.0,0.912330478895455,0.613411532001993
58,25.93541266025706,25.93541266025706,,77.72560401199601,7.822348415596631,,,25.93541266025706,0.002367826506088,541.8634758406552,0.9609375,0.1875,0.8125,1179,0.53613257408142,0.139555975794792,0.01245698146522,0.17115057259798,0.00025,48.0,16.0,152.5,103.5,1.7717282739977231,12.0,0.8734368343139061,0.6021715282802651
59,27.51078832325214,27.51078832325214,,81.22123417069999,7.894034093607814,,,27.51078832325214,0.002363408500968,507.9970086006142,0.9687500000000001,0.0625,0.9375,1199,0.5965458452701561,0.12722510099411,0.0022097958717490003,0.16924614459276202,0.00025,48.0,16.0,152.5,103.5,1.69494105749618,12.0,0.9340147378388791,0.598728462899608
60,25.879327872145325,25.879327872145325,,79.0275121553065,6.720414530742421,,,25.879327872145325,0.002311256495886,474.0298914400046,0.984375,0.1875,0.8125,1219,0.56505337357521,0.13900258392095502,0.004345121094956,0.165910474956035,0.00025,48.0,16.0,152.5,103.5,1.6923508489999222,12.0,0.844293037662282,0.598728462899608
61,26.414592606003335,26.414592606003335,,78.82658195914397,7.080845378390775,,,26.414592606003335,0.002346712499274,440.14452378054557,0.9609375,0.1875,0.8125,1239,0.5759012699127191,0.173323221504688,0.003967126714996,0.196925781667232,0.00025,48.0,16.0,152.5,103.5,1.6252682374979481,12.0,0.9863358332077041,0.594278602838297
62,27.315124777421946,27.315124777421946,,80.44990127631849,9.835890913569074,,,27.315124777421946,0.002378095501626,406.3752619206207,0.9609375,0.125,0.875,1259,0.588883638381958,0.13287489861249902,0.003151718410663,0.180196598172187,0.00025,48.0,16.0,152.5,103.5,1.874085284995089,12.0,0.9156269454979331,0.594278602838297
63,26.172216414770805,26.172216414770805,,79.22618171147323,4.091181752227004,,,26.172216414770805,0.002285688999108,372.76866164982494,0.9687500000000001,0.0625,0.9375,1279,0.5912308394908901,0.138538874685764,0.003527311957441,0.17490167915821,0.00025,48.0,16.0,152.5,103.5,1.849171134497737,12.0,0.9171210285276171,0.5884883922550881
64,25.591129861070122,25.591129861070122,,81.19753357099991,5.862077864828354,,,25.591129861070122,0.002376481999817,339.098622900201,0.953125,0.0625,0.9375,1299,0.568534880876541,0.14604270458221402,0.0028378647984930003,0.18166629225015601,0.00025,48.0,16.0,152.5,103.5,1.848897377996763,12.0,0.901225307956337,0.585093001118143
65,27.916823625000553,27.916823625000553,,82.62868885086819,8.501902384539695,,,27.916823625000553,0.002442173994495,305.0530590600829,0.9609375,0.125,0.875,1319,0.6120124161243431,0.15371485799551002,0.005382365314289,0.171290569007396,0.00025,48.0,16.0,152.5,103.5,1.8506628524992261,12.0,0.9417117428965861,0.583176074487895
66,26.877731153160937,26.877731153160937,,78.80914719889924,7.257549731390131,,,26.877731153160937,0.002373492498009,271.98772623960394,0.953125,0.125,0.875,1339,0.574041217565536,0.13584055751562102,0.008737770374864,0.144521854817867,0.00025,48.0,16.0,152.5,103.5,1.850374902001931,12.0,0.896491716615855,0.581692165822682
67,27.46759337257116,27.46759337257116,,82.6183075793436,7.380222940677545,,,27.46759337257116,0.002386309002758,237.7195075495547,0.953125,0.1875,0.8125,1359,0.5596556365489961,0.11705850809812501,0.0074643632397050005,0.174994312226772,0.00025,48.0,16.0,152.5,103.5,1.691511220997199,12.0,0.8746964974561701,0.581692165822682
68,26.42538478663004,26.42538478663004,,81.59446050941045,6.047824717435765,,,26.42538478663004,0.002420080505544,203.54398889947333,0.9296875,0.0625,0.9375,1379,0.60484579205513,0.13541032373905101,0.006482869153842,0.17943304777145302,0.00025,48.0,16.0,152.5,103.5,1.694267292499716,12.0,0.893495930824428,0.581692165822682
69,28.231981560400133,28.231981560400133,,83.26311627643544,8.823449162566458,,,28.231981560400133,0.0023554325016440004,184.44093030011572,0.9687500000000001,0.125,0.875,1399,0.553928822278976,0.16117814183235102,0.007931777043268001,0.164182424545288,0.00025,48.0,16.0,152.5,103.5,1.69041596250463,12.0,0.880905848462134,0.577153388142505
70,28.161354084333006,28.161354084333006,,82.5711460864931,9.290999433470049,,,28.161354084333006,0.002320204497664,147.60205256025074,0.9687500000000001,0.1875,0.8125,1419,0.547677189111709,0.11318830028176301,0.006706393323838,0.162079527974128,0.00025,48.0,16.0,152.5,103.5,1.847802008502185,12.0,0.8508362441789351,0.5736466602079691
71,26.08519325863644,26.08519325863644,,79.4908193357185,6.234452583147565,,,26.08519325863644,0.002339574006327,110.70153942018806,0.9687500000000001,0.125,0.875,1439,0.5734468400478361,0.17017071694135602,0.004092698683962,0.16582438349723802,0.00025,48.0,16.0,152.5,103.5,1.691821972497564,12.0,0.9534395290538661,0.5736466602079691
72,28.094663105837398,28.094663105837398,,80.90354279889931,8.24321377422799,,,28.094663105837398,0.002339175502129,67.83232678004424,0.9765625,0.09375000000000001,0.9062500000000001,1459,0.5514668822288511,0.134573154151439,0.005202710628509,0.18385882675647702,0.00025,48.0,16.0,152.5,103.5,1.686709310997685,12.0,0.8669668058864771,0.573233560297792
73,25.80629325622224,25.80629325622224,,80.72778113989094,6.6609849814218975,,,25.80629325622224,0.0024612014967710003,33.92399814991222,0.9687500000000001,0.125,0.875,1479,0.557275474071502,0.12238499522209101,0.0048223091289400005,0.15190393477678302,0.00025,48.0,16.0,152.5,103.5,1.847114304502611,12.0,0.8567019676556811,0.573233560297792
74,27.264357495841026,27.264357495841026,,81.33638205316004,6.759145647538846,,,27.264357495841026,0.002429503001621,0.0,0.9687500000000001,0.125,0.875,1499,0.5579980611801141,0.160190686583518,0.005493190372362001,0.16413391381502102,0.00025,48.0,16.0,152.5,103.5,1.556698173495533,12.0,0.904422733350656,0.5730936695933391
75,27.264357495841026,27.264357495841026,,81.33638205316004,6.759145647538846,,,27.264357495841026,,,,,,1500,,,,,,,,,,,,,
