<svg width="61" height="61" viewBox="0 0 61 61" fill="none" xmlns="http://www.w3.org/2000/svg">
<rect opacity="0.6" width="61" height="61" rx="30.5" fill="white"/>
<path d="M15 32L15 29L46 29V32H15Z" fill="#104EFF"/>
<path d="M32 46H29V15H32V46Z" fill="#104EFF"/>
</svg>
