<svg width="24" height="24" viewBox="0 0 24 24" fill="none" xmlns="http://www.w3.org/2000/svg">
<g opacity="0.1">
<path d="M24 11.0465H3.56739L13.0449 1.34847L11.7271 0L1.3178 10.6515L0 12L1.3178 13.3485L11.7271 24L13.0449 22.6515L3.56739 12.9535H24V11.0465Z" fill="black"/>
</g>
</svg>
