<svg width="20" height="20" viewBox="0 0 20 21" fill="none" xmlns="http://www.w3.org/2000/svg">
<g>
<path d="M0.128854 2.37114L1.87075 0.629241L19.8704 18.6289L18.1285 20.3708L0.128854 2.37114Z" fill="#fff"/>
<path d="M1.87075 20.3708L0.128854 18.6289L18.1285 0.629241L19.8704 2.37114L1.87075 20.3708Z" fill="#fff"/>
</g>
</svg>
