* This file contains the variable parameters needed by the 1D climate model 
* Created March 2005 and modified November 2010 for Gliese581d using variable surface partial pressures for N2 and CO2. 
* Write the value AFTER the 11th space
*2345678901HERE

NSTEPS=    200           !step number (200 recommended for coupling)
IMW=       2         
RSURF=     0.8                
ZY=	   60.     
DTAU0=     0.5
ZCON=      20
P0=        7.e-6
PGO=       1.
G=	   980.         !Gravity (Mars=373., Earth=980., Gliese581d=1744.0, assuming 5.6 earth masses) 
FAC=       4.0
IO3=       1   			!Ozone?
IUP=       1                    !1 means that it starts a new run and doesn't read TempIn.dat
TG0=       288.			!Surface temperature for IUP=1   
TSTRAT=    200.             	!Stratospheric temperature for IUP=1
STARR=     "Sun"		!What star?
ICONSERV=  0          	        !Type of energy conservation
ICOUPLE=   1            	!Coupled(1) or not(0)
SRFALB=    0.316                !fixed planetary albedo (0.2)
SOLCON=    1.0	  	        !SOLCON=S/So (0.3225 = 0.75*0.43)  use 0.43 for present day mars, .2844 for GJ581d,22.49 unscaled --> when coupled it reads this in from photo
dtmax=     1.e4
CO2MAX=    3.55e-2
IMET=      0                    ! Methane flag. If "1" then methane is turned on. (does not turn on ethane)
IMETETH=   0                    ! ethane flag.  If 1 then both methane and ethane turned on
nga=       6
IHAZE=     0
monsize=   0
icealbedo= 0
INVERSE=   0    
FRAK=      1    

*******************************************************
**   VARIABLE INPUT PARAMETERS
*******************************************************
C      NSTEPS - NUMBER OF ITERATIONS
C         IMW - 0 FOR SATURATED TROPOSPHERE, 1 FOR MANABE/WETHERALD
C               FIXED RELATIVE HUMIDITY, 2 FOR M/W WITH CONSTANT
C               STRATOSPHERIC H2O CONTENT AND EMPIRICAL TROPOSPHERIC
C               H2O, 3 for DRY ADIABAT
C        RSURF - SURFACE RELATIVE HUMIDITY
C           ZY - SOLAR ZENITH ANGLE (DEGREES)
C        DTAU0 - OPTICAL DEPTH STEP IN SUBLEVEL INTEGRATION
C         ZCON - ARBITRARY CONSTANT ADDED TO Z TO KEEP IT POSITIVE
C           P0 - PRESSURE AT TOP OF GRID
C          PG0 - DRY PRESSURE AT BOTTOM OF GRID. 
c            G - Gravity aceleration (cm/s^2)
C          FAC - RATIO OF GRID SPACING AT TOP TO SPACING AT
C                BOTTOM
C          IO3 - 1 TO INCLUDE O3, 0 TO LEAVE IT OUT
C          IUP - SPECIFIES TYPE OF INITIALIZATION (0 IF YOU WISH TO
C                START FROM AN EXISTING SOLUTION, 1 IF YOU WISH TO
C                SPECIFY A NEW SURFACE TEMPERATURE)
C               IF OPTION 1 IS SELECTED YOU MUST MAKE SURE THAT
C               THE STARTING TEMPERATURES ABOVE GROUND LEVEL ARE LESS
C               THAN TG0, SINCE THE TROPOSPHERIC LAPSE RATE IS INTEGRA-
C               TED UPWARDS IN THIS CASE.       
C         TG0 - INITIAL SURFACE TEMPERATURE (FOR IUP = 1 CASE)
C      TSTRAT - Stratospheric temperature for IUP=1. Suggestion for 
c               present Earth 220.        
C       STARR - Character variable to choose a star, it can be:
c               Sun, F2V, K2V, G2V 
c               NOTES: G2V is NOT the Sun. 
c               Write it exactly as it is listed.
c               DO NOT FORGET quotation marks.
c    ICONSERV - O = Non strict time-stepping method (faster)
c               1 = Each time step conservs energy (better for high CO2)  
c     ICOUPLE - 1 = Coupled to the photochemical model              
c               0 = Not coupled
c      SRFALB - Planetary albedo (0.2 for Present Earth)
c      SOLCON - Solar constant (S/So)
c       dtmax - Maximum time step in seconds    
c      CO2MAX - Maximum CO2 mixing ratio that RRTM can manage with accuracy, 
c               for greater values of CO2 the former IR subroutine is used.
c     ICH4AMT - for particle subroutine: which CH4 amount was used (ppm)?
c     ICO2AMT - for particle subroutine: which CO2 amount was used (ppm)?




