﻿Substance,Epresent,Biomass
C00234,1,-0.000223
C05811,1,-0.000223
C00041,1,-0.5137
C00019,1,-0.000223
C00062,1,-0.2958
C00152,1,-0.2411
C00049,1,-0.2411
C00002,1,-59.984
C00076,1,-0.004737
C00115,1,-0.004737
C00010,1,-0.000576
C00175,1,-0.003158
C00063,1,-0.1335
cu2,1,-0.003158
C00097,1,-0.09158
C00131,1,-0.02617
C00458,1,-0.02702
C00286,1,-0.02702
C00459,1,-0.02617
C00016,1,-0.000223
C00023,1,-0.007106
fe3,1,-0.007106
C00064,1,-0.2632
C00025,1,-0.2632
C00037,1,-0.6126
C00044,1,-0.2151
C00001,1,-54.462
C00135,1,-0.09474
C00407,1,-0.2905
C00238,1,-0.1776
C06025[e],0,-0.01945
C00123,1,-0.4505
C00047,1,-0.3432
C00073,1,-0.1537
C00305,1,-0.007895
C00143,1,-0.000223
C00034,1,-0.003158
C06232,1,-0.003158
murein5px4p[p],1,-0.01389
C00003,1,-0.001831
C00006,1,-0.000447
C01342,1,-0.011843
pe160,1,-0.02233
pe160[p],1,-0.04148
pe161,1,-0.02632
pe161[p],1,-0.04889
C00079,1,-0.1759
C00032,1,-0.000223
C00148,1,-0.2211
C00018,1,-0.000223
C00255,1,-0.000223
C00065,1,-0.2158
C00748,1,-0.000223
C00059,1,-0.003948
C00101,1,-0.000223
C00068,1,-0.000223
C00188,1,-0.2537
C00078,1,-0.05684
C00082,1,-0.1379
C03543,1,-5.50E-05
C00075,1,-0.1441
C00183,1,-0.4232
C00038,1,-0.003158
C00008,1,59.81
C00080,1,59.81
C00009,1,59.806
C00013,1,0.7739
4hba,1,0
4hba[e],0,0
5drib,1,0
5drib[e],0,0
C06735,1,0
C06735[e],0,0
hmfurn,1,0
hmfurn[e],0,0
C01444,1,0
C01444[e],0,0
C00115[p],1,0
C00080[p],1,0
C00007,1,0
C00390,1,0
C00399,1,0
C00282,1,0
C00828,1,0
C05819,1,0
C00305[p],1,0
C00244,1,0
C00088,1,0
C00088[p],1,0
C00001[p],1,0
C01342[p],1,0
C00497[p],1,0
C00497,1,0
C00149[p],1,0
C00149,1,0
C01330,1,0
C01330[p],1,0
C00004,1,0
C00005,1,0
C00295[p],1,0
C00295,1,0
C00042[p],1,0
C00042,1,0
C05898,1,0
murein5p5p[p],1,0
12dgr120[p],1,0
12dgr120,1,0
12dgr140[p],1,0
12dgr140,1,0
12dgr141[p],1,0
12dgr141,1,0
12dgr160[p],1,0
12dgr160,1,0
12dgr161[p],1,0
12dgr161,1,0
12dgr180[p],1,0
12dgr180,1,0
12dgr181[p],1,0
12dgr181,1,0
C02912[e],0,0
C02912[p],1,0
C02912,1,0
C02917[e],0,0
C02917[p],1,0
C02917,1,0
14glucan[e],0,0
14glucan[p],1,0
14glucan,1,0
C01672,1,0
C00047[p],1,0
C01672[p],1,0
C01672[e],0,0
C02353[e],0,0
C02353[p],1,0
C02354[e],0,0
C02354[p],1,0
C06194[e],0,0
C06194[p],1,0
C02355[e],0,0
C02355[p],1,0
C06393[e],0,0
C06393[p],1,0
C06393,1,0
C00680[e],0,0
C00680[p],1,0
C00680,1,0
2agpe120[p],1,0
2agpe120,1,0
2agpe140[p],1,0
2agpe140,1,0
2agpe141[p],1,0
2agpe141,1,0
2agpe160[p],1,0
2agpe160,1,0
2agpe161[p],1,0
2agpe161,1,0
2agpe180[p],1,0
2agpe180,1,0
2agpe181[p],1,0
2agpe181,1,0
2agpg120[p],1,0
2agpg120,1,0
2agpg140[p],1,0
2agpg140,1,0
2agpg141[p],1,0
2agpg141,1,0
2agpg160[p],1,0
2agpg160,1,0
2agpg161[p],1,0
2agpg161,1,0
2agpg180[p],1,0
2agpg180,1,0
2agpg181[p],1,0
2agpg181,1,0
2ddecg3p[p],1,0
2ddecg3p,1,0
C00204[e],0,0
C00204[p],1,0
C00204,1,0
2hdec9eg3p[p],1,0
2hdec9eg3p,1,0
2hdecg3p[p],1,0
2hdecg3p,1,0
2odec11eg3p[p],1,0
2odec11eg3p,1,0
2odecg3p[p],1,0
2odecg3p,1,0
2tdec7eg3p[p],1,0
2tdec7eg3p,1,0
2tdecg3p[p],1,0
2tdecg3p,1,0
C04043[e],0,0
C04043[p],1,0
C01367[e],0,0
C01367[p],1,0
C05822[e],0,0
C05822[p],1,0
C06193[e],0,0
C06193[p],1,0
3hcinnm[e],0,0
3hcinnm[p],1,0
3hcinnm,1,0
3hpppn[e],0,0
3hpppn[p],1,0
3hpppn,1,0
C01368[e],0,0
C01368[p],1,0
C00334,1,0
C00025[p],1,0
C00334[p],1,0
C00334[e],0,0
C03765[e],0,0
C03765[p],1,0
C01062[e],0,0
C01062[p],1,0
C01062,1,0
C00033[e],0,0
C00033[p],1,0
C00033,1,0
C00164[e],0,0
C00164[p],1,0
C00164,1,0
C00084[e],0,0
C00084[p],1,0
C00084,1,0
C01132[e],0,0
C01132[p],1,0
acgal1p[e],0,0
acgal1p[p],1,0
C00140[e],0,0
C00140[p],1,0
C00074,1,0
C00357,1,0
C00022,1,0
C04256[e],0,0
C04256[p],1,0
C00645[e],0,0
C00645[p],1,0
C04257,1,0
C02713[e],0,0
C02713[p],1,0
acmum6p,1,0
C00270[e],0,0
C00270[p],1,0
C00270,1,0
C00979,1,0
C00979[p],1,0
C00979[e],0,0
C00147[e],0,0
C00147[p],1,0
C00147,1,0
C00212[e],0,0
C00212[p],1,0
C00212,1,0
C00194[e],0,0
C00194[p],1,0
C00194,1,0
C06710,1,0
C00080[e],0,0
C06710[e],0,0
C00179,1,0
C00062[p],1,0
C00179[p],1,0
C00179[e],0,0
C00026[e],0,0
C00026[p],1,0
C00026,1,0
C00099[e],0,0
C00099[p],1,0
C00099,1,0
C00133[e],0,0
C00133[p],1,0
C00133,1,0
C00041[e],0,0
C00041[p],1,0
C00993[e],0,0
C00993[p],1,0
C00993,1,0
C01487[e],0,0
C01487[p],1,0
C01487,1,0
C01551[e],0,0
C01551[p],1,0
C01551,1,0
C00020[e],0,0
C00020[p],1,0
anhgm[e],0,0
anhgm[p],1,0
C00259,1,0
C00259[p],1,0
C00259[e],0,0
C05554[e],0,0
C05554[p],1,0
C05554,1,0
arbtn,1,0
arbtn[p],1,0
arbtn[e],0,0
C00062[e],0,0
C01602,1,0
C01602[p],1,0
C00072[e],0,0
C00072[p],1,0
ascb6p,1,0
C00152[e],0,0
C00152[p],1,0
C06697,1,0
C06697[p],1,0
C06697[e],0,0
C00049[e],0,0
C00049[p],1,0
butso3[p],1,0
butso3,1,0
C05774[p],1,0
C05774,1,0
C00853[p],1,0
C00853,1,0
C01413,1,0
C01413[p],1,0
C01419[p],1,0
C01419,1,0
C00114[p],1,0
C00114,1,0
C00175[p],1,0
cpgn[p],1,0
cpgn,1,0
C00487[p],1,0
C00487,1,0
C00318[p],1,0
C00318,1,0
C04114[p],1,0
C04114,1,0
cu,1,0
cu[p],1,0
cu2[p],1,0
C00793[p],1,0
C00793,1,0
C00097[p],1,0
ethso3[p],1,0
ethso3,1,0
C00023[p],1,0
fe3[p],1,0
C06229[p],1,0
C00158,1,0
fe3dhbzs[p],1,0
fe3dhbzs,1,0
C06227[p],1,0
C06227,1,0
C06228[p],1,0
C06228,1,0
C06230[p],1,0
C06230,1,0
feoxam[p],1,0
feoxam,1,0
C00670[p],1,0
C00670,1,0
C01233[p],1,0
C01233,1,0
C03274[p],1,0
C03274,1,0
C01225[p],1,0
C01225,1,0
g3ps[p],1,0
g3ps,1,0
C00124[p],1,0
C00124,1,0
C00031[p],1,0
C00031,1,0
C00064[p],1,0
C00719[p],1,0
C00719,1,0
C00093[p],1,0
C00093,1,0
C00051,1,0
C00051[p],1,0
C00703,1,0
C00703[p],1,0
C00135[p],1,0
C00407[p],1,0
C05123[p],1,0
C05123,1,0
C00238[p],1,0
C06025,1,0
C06025[p],1,0
C00123[p],1,0
C00208[p],1,0
C00208,1,0
C01936[p],1,0
C01936,1,0
maltpt[p],1,0
maltpt,1,0
C01835[p],1,0
C01835,1,0
C02052[p],1,0
C02052,1,0
C00855[p],1,0
C00855,1,0
C00073[p],1,0
metsox-R-L[p],1,0
metsox-R-L,1,0
C02989[p],1,0
C02989,1,0
C06232[p],1,0
mso3[p],1,0
mso3,1,0
C00291,1,0
C00291[p],1,0
pa120,1,0
pa120[p],1,0
pa140,1,0
pa140[p],1,0
pa141,1,0
pa141[p],1,0
pa160,1,0
pa160[p],1,0
pa161,1,0
pa161[p],1,0
pa180,1,0
pa180[p],1,0
pa181,1,0
pa181[p],1,0
pe120,1,0
pe120[p],1,0
pe140,1,0
pe140[p],1,0
pe141,1,0
pe141[p],1,0
pe180,1,0
pe180[p],1,0
pe181,1,0
pe181[p],1,0
pg120,1,0
pg120[p],1,0
pg140,1,0
pg140[p],1,0
pg141,1,0
pg141[p],1,0
pg160,1,0
pg160[p],1,0
pg161,1,0
pg161[p],1,0
pg180,1,0
pg180[p],1,0
pg181,1,0
pg181[p],1,0
pgp120,1,0
pgp120[p],1,0
pgp140,1,0
pgp140[p],1,0
pgp141,1,0
pgp141[p],1,0
pgp160,1,0
pgp160[p],1,0
pgp161,1,0
pgp161[p],1,0
pgp180,1,0
pgp180[p],1,0
pgp181,1,0
pgp181[p],1,0
C00032[p],1,0
C00009[p],1,0
C00148[p],1,0
progly[p],1,0
progly,1,0
C00134[p],1,0
C00134,1,0
C00121[p],1,0
C00121,1,0
C00059[p],1,0
C00315[p],1,0
C00315,1,0
sulfac[p],1,0
sulfac,1,0
C00245[p],1,0
C00245,1,0
C00378[p],1,0
C00378,1,0
C00188[p],1,0
C00320[p],1,0
C00320,1,0
tungs[p],1,0
tungs,1,0
C00183[p],1,0
C00181[p],1,0
C00181,1,0
C00038[p],1,0
C00246[e],0,0
C00246[p],1,0
C00246,1,0
butso3[e],0,0
C00076[p],1,0
C00076[e],0,0
C05774[e],0,0
C00853[e],0,0
C01413[e],0,0
C01419[e],0,0
C00114[e],0,0
C00158[e],0,0
C00158[p],1,0
C00115[e],0,0
C00055[e],0,0
C00055[p],1,0
C00011[e],0,0
C00011[p],1,0
C00011,1,0
C00175[e],0,0
cpgn-un,1,0
cpgn-un[p],1,0
cpgn-un[e],0,0
cpgn[e],0,0
C00318[e],0,0
gbbtn,1,0
gbbtn[p],1,0
C00380[e],0,0
C00380[p],1,0
C00380,1,0
cu[e],0,0
cu2[e],0,0
C01326[e],0,0
C01326[p],1,0
C01417[e],0,0
C01417[p],1,0
C01417,1,0
C00793[e],0,0
C00097[e],0,0
C00475[e],0,0
C00475[p],1,0
C00475,1,0
C00559[e],0,0
C00559[p],1,0
C00559,1,0
C00360[e],0,0
C00360[p],1,0
C01571[e],0,0
C01571[p],1,0
C00239[e],0,0
C00239[p],1,0
C00881[e],0,0
C00881[p],1,0
C00881,1,0
C02679[e],0,0
C02679[p],1,0
C00362[e],0,0
C00362[p],1,0
C00330[e],0,0
C00330[p],1,0
C00330,1,0
C00184[e],0,0
C00184[p],1,0
C00184,1,0
C06196[e],0,0
C06196[p],1,0
C05512[e],0,0
C05512[p],1,0
C05512,1,0
C00580[e],0,0
C00580[p],1,0
C11143[e],0,0
C11143[p],1,0
C03758[e],0,0
C03758[p],1,0
dsbard[p],1,0
dsbaox[p],1,0
dsbcox[p],1,0
dsbdrd,1,0
dsbcrd[p],1,0
dsbdox,1,0
dsbgox[p],1,0
dsbgrd[p],1,0
C00364[e],0,0
C00364[p],1,0
C00365[e],0,0
C00365[p],1,0
C00526[e],0,0
C00526[p],1,0
C00526,1,0
enter,1,0
enter[p],1,0
enter[e],0,0
C00189[e],0,0
C00189[p],1,0
C00189,1,0
ethso3[e],0,0
C00469[e],0,0
C00469[p],1,0
C00469,1,0
C00085[e],0,0
C00085[p],1,0
C00085,1,0
C00067[e],0,0
C00067[p],1,0
C00067,1,0
C00023[e],0,0
fe3[e],0,0
C06229[e],0,0
fe3dhbzs[e],0,0
fe3hox-un,1,0
fe3hox-un[p],1,0
fe3hox-un[e],0,0
C06227[e],0,0
fecrm-un,1,0
fecrm-un[p],1,0
fecrm-un[e],0,0
C06228[e],0,0
C06230[e],0,0
feoxam-un,1,0
feoxam-un[p],1,0
feoxam-un[e],0,0
feoxam[e],0,0
C00058,1,0
C00058[p],1,0
C00058[e],0,0
C00095[e],0,0
C00095[p],1,0
C02976,1,0
frulys[e],0,0
frulys[p],1,0
frulys,1,0
C00905[e],0,0
C00905[p],1,0
C00905,1,0
C01019[e],0,0
C01019[p],1,0
C01019,1,0
C00122[e],0,0
C00122[p],1,0
C00122,1,0
C00103[e],0,0
C00103[p],1,0
C00670[e],0,0
C01233[e],0,0
C03274[e],0,0
C01225[e],0,0
g3ps[e],0,0
C00092[e],0,0
C00092[p],1,0
C00092,1,0
C01582[e],0,0
C01582[p],1,0
C00124[e],0,0
C00446[e],0,0
C00446[p],1,0
C00879[e],0,0
C00879[p],1,0
C00879,1,0
C00880[e],0,0
C00880[p],1,0
C00880,1,0
galctn-L[e],0,0
galctn-L[p],1,0
galctn-L,1,0
C01697[e],0,0
C01697[p],1,0
C06311,1,0
C00333[e],0,0
C00333[p],1,0
C00333,1,0
C00329[e],0,0
C00329[p],1,0
C00352,1,0
C00352[e],0,0
C00352[p],1,0
gbbtn[e],0,0
C00035[e],0,0
C00035[p],1,0
C00031[e],0,0
C00257[e],0,0
C00257[p],1,0
C00257,1,0
C00818[e],0,0
C00818[p],1,0
C00818,1,0
C00191[e],0,0
C00191[p],1,0
C00191,1,0
C05385[e],0,0
C05385[p],1,0
C00064[e],0,0
C00025[e],0,0
C00037[e],0,0
C00037[p],1,0
C00577[e],0,0
C00577[p],1,0
C00577,1,0
C00719[e],0,0
C00258[e],0,0
C00258[p],1,0
C00258,1,0
C00116,1,0
C00116[p],1,0
C00116[e],0,0
C02979[e],0,0
C02979[p],1,0
C00093[e],0,0
C00160[e],0,0
C00160[p],1,0
C00160,1,0
C00144[e],0,0
C00144[p],1,0
C00387[e],0,0
C00387[p],1,0
C00387,1,0
C00127[e],0,0
C00127[p],1,0
C00051[e],0,0
C00044[e],0,0
C00044[p],1,0
C00242[e],0,0
C00242[p],1,0
C00242,1,0
C00463,1,0
C00463[p],1,0
C00263,1,0
C00263[p],1,0
C01585[p],1,0
C01585,1,0
C00770[p],1,0
C00770,1,0
C00294[p],1,0
C00294,1,0
C00256[p],1,0
C00256,1,0
C00186[p],1,0
C00186,1,0
C00243,1,0
C00243[p],1,0
C01508[p],1,0
C01508,1,0
C05402,1,0
C05402[p],1,0
C03172[p],1,0
C03172,1,0
C00034[p],1,0
C00601[p],1,0
C00601,1,0
C00079[p],1,0
C05629[p],1,0
C05629,1,0
psclys[p],1,0
psclys,1,0
C00022[p],1,0
C00507[p],1,0
C00507,1,0
C00740[p],1,0
C00740,1,0
C00065[p],1,0
C00493[p],1,0
C00493,1,0
C00178,1,0
C00178[p],1,0
C00214[p],1,0
C00214,1,0
C00078[p],1,0
C00082[p],1,0
C00106[p],1,0
C00106,1,0
C00299[p],1,0
C00299,1,0
C00385[p],1,0
C00385,1,0
C01762[p],1,0
C01762,1,0
C00312[p],1,0
C00312,1,0
C00282[e],0,0
C00282[p],1,0
C00455[p],1,0
C00153,1,0
C00117,1,0
C00001[e],0,0
C00027[e],0,0
C00027[p],1,0
C00283,1,0
C00283[p],1,0
C00283[e],0,0
C00249[e],0,0
C00249[p],1,0
hdcea[e],0,0
hdcea[p],1,0
C00703[e],0,0
C00135[e],0,0
C00263[e],0,0
C01585[e],0,0
C00262[e],0,0
C00262[p],1,0
C00262,1,0
C00770[e],0,0
C00407[e],0,0
C00130[e],0,0
C00130[p],1,0
C00463[e],0,0
C00137[e],0,0
C00137[p],1,0
C00137,1,0
C00294[e],0,0
C05123[e],0,0
C00238[e],0,0
C00256[e],0,0
C00186[e],0,0
LalaDgluMdap[e],0,0
LalaDgluMdap[p],1,0
LalaDgluMdapDala[e],0,0
LalaDgluMdapDala[p],1,0
C00243[e],0,0
C00123[e],0,0
C00047[e],0,0
C01508[e],0,0
C00497[e],0,0
C00149[e],0,0
C00208[e],0,0
C02995,1,0
C01936[e],0,0
maltpt[e],0,0
C01835[e],0,0
C02052[e],0,0
C00159[e],0,0
C00159[p],1,0
C00275,1,0
C00275[e],0,0
C00275[p],1,0
C11544[e],0,0
C11544[p],1,0
man6pglyc,1,0
C05402[e],0,0
C00855[e],0,0
C00073[e],0,0
metsox-R-L[e],0,0
C02989[e],0,0
C00305[e],0,0
C01204[e],0,0
C01204[p],1,0
C03172[e],0,0
C00034[e],0,0
C00392[e],0,0
C00392[p],1,0
C00644,1,0
C06232[e],0,0
mso3[e],0,0
C00887[e],0,0
C00887[p],1,0
C00887,1,0
C01330[e],0,0
C00864[p],1,0
C00864,1,0
C00163[p],1,0
C00163,1,0
C00253[e],0,0
C00253[p],1,0
C00253,1,0
C01342[e],0,0
C00291[e],0,0
C00455[e],0,0
C00455,1,0
C00533[e],0,0
C00533[p],1,0
C00533,1,0
C00244[p],1,0
C00088[e],0,0
C00244[e],0,0
C00007[e],0,0
C00007[p],1,0
C00704[e],0,0
C00704[p],1,0
C01530[e],0,0
C01530[p],1,0
ocdcea[e],0,0
ocdcea[p],1,0
C06423[e],0,0
C06423[p],1,0
C01602[e],0,0
C00295[e],0,0
C00601[e],0,0
C05332[e],0,0
C05332[p],1,0
C00794[p],1,0
C01096,1,0
C00089[p],1,0
C02591,1,0
C01083[p],1,0
C00689,1,0
C00079[e],0,0
C00032[e],0,0
C00009[e],0,0
C00864[e],0,0
C00163[e],0,0
C00479,1,0
C00479[p],1,0
C00479[e],0,0
C05629[e],0,0
C06701[e],0,0
C06701[p],1,0
C00148[e],0,0
progly[e],0,0
psclys[e],0,0
C01005[e],0,0
C01005[p],1,0
C00134[e],0,0
C00022[e],0,0
C00117[e],0,0
C00117[p],1,0
C00121[e],0,0
C00507[e],0,0
C00794[e],0,0
C00740[e],0,0
C00065[e],0,0
C00493[e],0,0
C09306[e],0,0
C09306[p],1,0
C09306,1,0
C00094[e],0,0
C00094[p],1,0
C00059[e],0,0
C00315[e],0,0
C00898[p],1,0
C00898,1,0
C00042[e],0,0
C00089[e],0,0
sulfac[e],0,0
C00898[e],0,0
C00245[e],0,0
C01755[e],0,0
C01755[p],1,0
C00378[e],0,0
C00188[e],0,0
C12147[e],0,0
C12147[p],1,0
C00178[e],0,0
C00214[e],0,0
C00565[e],0,0
C00565[p],1,0
C01104[e],0,0
C01104[p],1,0
C01083[e],0,0
C00078[e],0,0
C00320[e],0,0
C06424[e],0,0
C06424[p],1,0
ttdcea[e],0,0
ttdcea[p],1,0
tungs[e],0,0
C00483[e],0,0
C00483[p],1,0
C00082[e],0,0
C06501[e],0,0
C06501[p],1,0
C00043[e],0,0
C00043[p],1,0
C00203[e],0,0
C00203[p],1,0
C00029[e],0,0
C00029[p],1,0
C00052[e],0,0
C00052[p],1,0
C00167[e],0,0
C00167[p],1,0
C00105[e],0,0
C00105[p],1,0
C00106[e],0,0
C00086[e],0,0
C00086[p],1,0
C00086,1,0
C00299[e],0,0
C00183[e],0,0
C00385[e],0,0
C00655[e],0,0
C00655[p],1,0
C01762[e],0,0
C00181[e],0,0
C00312[e],0,0
C00038[e],0,0
C01079,1,0
C02191,1,0
C00430,1,0
C00931,1,0
C00024,1,0
C00332,1,0
C03263,1,0
C05198,1,0
C00021,1,0
cpe160,1,0
cpe180,1,0
cpg160,1,0
cpg180,1,0
C01051,1,0
C02463,1,0
C01352,1,0
fmnh2,1,0
C00061,1,0
C01007,1,0
C00288,1,0
C00169,1,0
C04332,1,0
C04732,1,0
C00048,1,0
C01146,1,0
C03296,1,0
C03415,1,0
C00603,1,0
C00440,1,0
C00119,1,0
C03722,1,0
C01185,1,0
C00366,1,0
C00027,1,0
C00704,1,0
C04030,1,0
seramp,1,0
C00020,1,0
C00094,1,0
C04677,1,0
C04734,1,0
C03838,1,0
C04376,1,0
C02430,1,0
C03294,1,0
udpLa4n,1,0
udpLa4fn,1,0
1ddecg3p,1,0
C05223,1,0
C00229,1,0
1hdec9eg3p,1,0
hdeACP,1,0
1hdecg3p,1,0
C05764,1,0
1odec11eg3p,1,0
octeACP,1,0
1odecg3p,1,0
ocdcaACP,1,0
C03912,1,0
1tdec7eg3p,1,0
tdeACP,1,0
1tdecg3p,1,0
C05761,1,0
C04171,1,0
C00196,1,0
23dhbzs,1,0
C03340,1,0
C03972,1,0
C04272,1,0
C00141,1,0
C06010,1,0
C06007,1,0
C00671,1,0
C05409,1,0
C00618,1,0
C04823,1,0
C02780,1,0
2dhguln,1,0
25drapp,1,0
C01268,1,0
C00666,1,0
C00692,1,0
C04877,1,0
C02679,1,0
apg120,1,0
C06424,1,0
apg140,1,0
ttdcea,1,0
apg141,1,0
C00249,1,0
apg160,1,0
hdcea,1,0
apg161,1,0
C01530,1,0
apg180,1,0
ocdcea,1,0
apg181,1,0
C06006,1,0
C03508,1,0
C01888,1,0
C01302,1,0
C03506,1,0
C04691,1,0
C00944,1,0
C04442,1,0
C00661,1,0
C01216,1,0
C01286,1,0
C00629,1,0
C00966,1,0
C00522,1,0
C05818,1,0
2dmmql8,1,0
C00111,1,0
C11143,1,0
C00580,1,0
C01104,1,0
C00565,1,0
C00672,1,0
C00673,1,0
C02631,1,0
C02504,1,0
2kmb,1,0
C04752,1,0
C04327,1,0
C01081,1,0
C04556,1,0
C04225,1,0
C04593,1,0
C02225,1,0
C11434,1,0
C11435,1,0
C11453,1,0
C11811,1,0
C00109,1,0
C00100,1,0
C05812,1,0
2ombzl,1,0
2ommbl,1,0
2omhmbl,1,0
C05810,1,0
2p4c2me,1,0
C00055,1,0
C00631,1,0
C00197,1,0
C00988,1,0
C05817,1,0
C02730,1,0
C04411,1,0
C04236,1,0
C00233,1,0
3dhgulnp,1,0
C03291,1,0
C02637,1,0
C01271,1,0
C04246,1,0
C01144,1,0
C00877,1,0
3hcddec5eACP,1,0
t3c5ddeceACP,1,0
dhcinnm,1,0
3hcmrs7eACP,1,0
t3c7mrseACP,1,0
3hcpalm9eACP,1,0
t3c9palmeACP,1,0
3hcvac11eACP,1,0
t3c11vaceACP,1,0
C05264,1,0
C05265,1,0
C05275,1,0
C05262,1,0
C05263,1,0
C03221,1,0
C05757,1,0
C05758,1,0
C04619,1,0
C05754,1,0
C05268,1,0
C05269,1,0
C05271,1,0
C05258,1,0
C05259,1,0
C05272,1,0
C05747,1,0
C05748,1,0
C04688,1,0
C05760,1,0
C06022,1,0
C04652,1,0
C00043,1,0
C04738,1,0
C05266,1,0
C05267,1,0
C05276,1,0
3hoctaACP,1,0
toctd2eACP,1,0
C04620,1,0
C05751,1,0
3hodcoa,1,0
3oodcoa,1,0
od2coa,1,0
C04633,1,0
C05763,1,0
C04044,1,0
C05260,1,0
C05261,1,0
C05273,1,0
3ocddec5eACP,1,0
3ocmrs7eACP,1,0
3ocpalm9eACP,1,0
3ocvac11eACP,1,0
C01944,1,0
C05274,1,0
C05756,1,0
C05753,1,0
C00136,1,0
C02593,1,0
C05746,1,0
C05759,1,0
C05270,1,0
C05750,1,0
3ooctdACP,1,0
C00154,1,0
C05762,1,0
C05809,1,0
C01832,1,0
C00236,1,0
C03232,1,0
C01005,1,0
C01269,1,0
C00251,1,0
C00606,1,0
C00232,1,0
C00555,1,0
C00568,1,0
6hmhptpp,1,0
C00921,1,0
C11355,1,0
C01279,1,0
C03589,1,0
C00156,1,0
C04146,1,0
C04294,1,0
C03393,1,0
C06054,1,0
C03492,1,0
C04352,1,0
C01134,1,0
db4p,1,0
C04751,1,0
5caiz,1,0
C04454,1,0
C00679,1,0
C04188,1,0
C04582,1,0
dkmpp,1,0
C00170,1,0
C03089,1,0
C00155,1,0
C04778,1,0
C05775,1,0
6hmhpt,1,0
C00345,1,0
C00199,1,0
C01236,1,0
C01092,1,0
C04425,1,0
C01037,1,0
C00546,1,0
C00227,1,0
acACP,1,0
C01209,1,0
C05744,1,0
C00108,1,0
C06332,1,0
C00083,1,0
C04268,1,0
dtdp4aaddg,1,0
C06156,1,0
C04256,1,0
C02655,1,0
C00624,1,0
C00036,1,0
C02130,1,0
ragund,1,0
aragund,1,0
C01029,1,0
C00612,1,0
C05235,1,0
C01250,1,0
C01165,1,0
C04133,1,0
C00140,1,0
C00645,1,0
C00417,1,0
C00311,1,0
C02341,1,0
aconm,1,0
C00437,1,0
C01571,1,0
C05755,1,0
C06423,1,0
C05752,1,0
C00442,1,0
C06508,1,0
C06509,1,0
C06510,1,0
grxrd,1,0
C00206,1,0
grxox,1,0
C02876,1,0
C00342,1,0
C00343,1,0
C00498,1,0
C00182,1,0
C06397,1,0
C06398,1,0
gggagicolipa,1,0
colipa,1,0
hlipa,1,0
hhlipa,1,0
C06026,1,0
phhlipa,1,0
hphhlipa,1,0
C00301,1,0
C00144,1,0
C03539,1,0
C04895,1,0
C05925,1,0
dhmptp,1,0
C03373,1,0
C00091,1,0
C05816,1,0
C00166,1,0
C04421,1,0
C04462,1,0
C05932,1,0
C01179,1,0
C00647,1,0
C01635,1,0
C00886,1,0
C01050,1,0
C01212,1,0
C01063,1,0
C04882,1,0
C02962,1,0
allul6p,1,0
C00499,1,0
C00817,1,0
C00558,1,0
C01909,1,0
C00087,1,0
C00120,1,0
C01137,1,0
C00035,1,0
C00081,1,0
C00104,1,0
anhgm,1,0
anhm,1,0
anhgm3p,1,0
anhm3p,1,0
LalaDgluMdap,1,0
anhgm4p,1,0
anhm4p,1,0
LalaDgluMdapDala,1,0
C04302,1,0
C01260,1,0
C04058,1,0
apoACP,1,0
C00054,1,0
C00224,1,0
C00053,1,0
C01112,1,0
C04478,1,0
C00508,1,0
C00029,1,0
garagund,1,0
C00015,1,0
C06187,1,0
C00530,1,0
C01636,1,0
C02163,1,0
C03406,1,0
C01637,1,0
C03402,1,0
C01478,1,0
C00127,1,0
C00327,1,0
C01638,1,0
C02984,1,0
C03082,1,0
C00438,1,0
C05840,1,0
C00130,1,0
C03794,1,0
C00441,1,0
C05519,1,0
C00575,1,0
C03279,1,0
C00112,1,0
crncoa,1,0
crnDcoa,1,0
ctbtcoa,1,0
C07086,1,0
C00582,1,0
C03160,1,0
C11437,1,0
C00669,1,0
C01639,1,0
C03125,1,0
C00360,1,0
C00705,1,0
C00239,1,0
C00361,1,0
C00362,1,0
C00415,1,0
C00857,1,0
C00882,1,0
2tpr3dpcoa,1,0
C00363,1,0
C00364,1,0
C01346,1,0
C00460,1,0
C00365,1,0
C06257,1,0
C00354,1,0
C01721,1,0
C01099,1,0
C04640,1,0
C02745,1,0
C02869,1,0
C00095,1,0
frulysp,1,0
C00103,1,0
C00446,1,0
C01228,1,0
C00655,1,0
C01640,1,0
C02282,1,0
C00217,1,0
C03287,1,0
ggptrc,1,0
C01641,1,0
C02987,1,0
C03090,1,0
C01642,1,0
C02412,1,0
C07838,1,0
C07836,1,0
C11472,1,0
C05730,1,0
C04494,1,0
C01528,1,0
C05172,1,0
C01643,1,0
C02988,1,0
C01102,1,0
phphhlipa,1,0
C01644,1,0
C03127,1,0
C01645,1,0
C02047,1,0
C04932,1,0
lipidA,1,0
C01646,1,0
C01931,1,0
C00159,1,0
C01647,1,0
C01648,1,0
C03511,1,0
C01649,1,0
C02702,1,0
C02739,1,0
C00534,1,0
C00250,1,0
C00314,1,0
C00627,1,0
C01151,1,0
C01101,1,0
C00861,1,0
C01131,1,0
trnasecys,1,0
sertrna(sec),1,0
C01650,1,0
C02553,1,0
C03175,1,0
C01097,1,0
C03785,1,0
C01651,1,0
C02992,1,0
C01652,1,0
C03512,1,0
C00787,1,0
C02839,1,0
C01653,1,0
C02554,1,0
C00105,1,0
C00310,1,0
C00231,1,0
bbtcoa,1,0
C00576,1,0
bglycogen,1,0
C01412,1,0
btnso,1,0
C05745,1,0
cddec5eACP,1,0
cdec3eACP,1,0
cdpdddecg,1,0
ps120,1,0
cdpdhdec9eg,1,0
ps161,1,0
cdpdhdecg,1,0
ps160,1,0
cdpdodec11eg,1,0
ps181,1,0
cdpdodecg,1,0
ps180,1,0
cdpdtdec7eg,1,0
ps141,1,0
cdpdtdecg,1,0
ps140,1,0
cechddd,1,0
cenchddd,1,0
C00885,1,0
C00254,1,0
C00423,1,0
ckdo,1,0
C06024,1,0
kphphhlipa,1,0
C01187,1,0
C01326,1,0
C00957,1,0
C01755,1,0
C01118,1,0
C02291,1,0
C01345,1,0
C06251,1,0
hkntd,1,0
C03657,1,0
C04874,1,0
C00266,1,0
C00337,1,0
C04479,1,0
C11838,1,0
C06196,1,0
C01344,1,0
C03114,1,0
C00235,1,0
C00129,1,0
C00341,1,0
C05778,1,0
unagamu,1,0
unagamuf,1,0
C00687,1,0
C00688,1,0
C03319,1,0
C00842,1,0
icolipa,1,0
C06055,1,0
C00279,1,0
C04666,1,0
C01267,1,0
C00412,1,0
hmgth,1,0
C00424,1,0
C00448,1,0
hemeO,1,0
C00281,1,0
gagicolipa,1,0
ggagicolipa,1,0
C00052,1,0
C03733,1,0
gfgaragund,1,0
C03812,1,0
C00096,1,0
C01222,1,0
gdpofuc,1,0
C00325,1,0
o16aund,1,0
gg4abut,1,0
ggbutal,1,0
gicolipa,1,0
C04916,1,0
C01100,1,0
udpLa4o,1,0
C03741,1,0
C01261,1,0
C03451,1,0
C00700,1,0
C05749,1,0
C00168,1,0
C00937,1,0
C00683,1,0
C04631,1,0
C01103,1,0
C01170,1,0
C06240,1,0
C00167,1,0
C01024,1,0
hdcoa,1,0
C00860,1,0
C00596,1,0
malthp,1,0
C00445,1,0
C01177,1,0
C05931,1,0
C00213,1,0
odecoa,1,0
C06056,1,0
C02741,1,0
C04896,1,0
tdecoa,1,0
C01083,1,0
C04824,1,0
C00348,1,0
uLa4fn,1,0
uLa4n,1,0
um4p,1,0
C01337,1,0
kdo2lipid4p,1,0
C01031,1,0
lipa_cold,1,0
LalaDglu,1,0
LalaLglu,1,0
C00514,1,0
C01213,1,0
C00802,1,0
C11822,1,0
C02983,1,0
C05173,1,0
C05897,1,0
unaga,1,0
o16aund[p],1,0
o16a2und[p],1,0
C03543[p],1,0
clpn120[p],1,0
clpn140[p],1,0
clpn141[p],1,0
clpn160[p],1,0
clpn161[p],1,0
clpn180[p],1,0
clpn181[p],1,0
unagamuf[p],1,0
eca2und[p],1,0
1agpe120[p],1,0
1agpe140[p],1,0
1agpe141[p],1,0
1agpe160[p],1,0
1agpe161[p],1,0
1agpe180[p],1,0
1agpe181[p],1,0
1agpg120[p],1,0
1agpg140[p],1,0
1agpg141[p],1,0
1agpg160[p],1,0
1agpg161[p],1,0
1agpg180[p],1,0
1agpg181[p],1,0
1ddecg3p[p],1,0
1hdec9eg3p[p],1,0
1hdecg3p[p],1,0
1odec11eg3p[p],1,0
1odecg3p[p],1,0
1tdec7eg3p[p],1,0
1tdecg3p[p],1,0
alpp[p],1,0
lpp[p],1,0
anhgm3p[p],1,0
anhgm4p[p],1,0
colipa[p],1,0
eca4und[p],1,0
eca4colipa[p],1,0
o16a4und[p],1,0
o16a4colipa[p],1,0
uLa4n[p],1,0
acolipa[p],1,0
C00348[p],1,0
eca3und[p],1,0
murein3px3p[p],1,0
murein3p3p[p],1,0
murein3px4p[p],1,0
murein4p3p[p],1,0
murein4p4p[p],1,0
murein4px4p[p],1,0
murein4px4px4p[p],1,0
murein4px4p4p[p],1,0
murein5p3p[p],1,0
murein5p4p[p],1,0
murein5px3p[p],1,0
murein5px4px4p[p],1,0
C06026[p],1,0
enlipa[p],1,0
murein5p5p5p[p],1,0
o16a3und[p],1,0
acolipa[e],0,0
lipa_cold[p],1,0
colipa[e],0,0
eca4colipa[e],0,0
enlipa[e],0,0
lipa_cold[e],0,0
C06026[e],0,0
o16a4colipa[e],0,0
hacolipa[e],0,0
halipa[e],0,0
C06033,1,0
C19610,1,0
C19611,1,0
C00660,1,0
C00192,1,0
C01818,1,0
C01408,1,0
C00261,1,0
C02948,1,0
C04547,1,0
C00755,1,0
C04546,1,0
C01089,1,0
C01158,1,0
C04101,1,0
C01572,1,0
C01424,1,0
C02868,1,0
C01839,1,0
C01993,1,0
C00090,1,0
C02351,1,0
C01255,1,0
C02378,1,0
C00495,1,0
C03036,1,0
C03040,1,0
C03374,1,0
C00486,1,0
C05787,1,0
C01175,1,0
C04275,1,0
C04733,1,0
C04053,1,0
C05324,1,0
C03861,1,0
C00014,1,0
C02015,1,0
C14818,1,0
C14819,1,0
C01353,1,0
C00536,1,0
C02926,1,0
C03431,1,0
C03015,1,0
C00716,1,0
C05993,1,0
C01011,1,0
C03618,1,0
C00433,1,0
C05379,1,0
C00237,1,0
C00198,1,0
C03107,1,0
C02779,1,0
C06244,1,0
C02132,1,0
C00209,1,0
C02107,1,0
C03961,1,0
C00566,1,0
C03981,1,0
C03790,1,0
C03210,1,0
C03341,1,0
C04348,1,0
C04092,1,0
C04076,1,0
C04020,1,0
C02727,1,0
C00739,1,0
C02837,1,0
C00313,1,0
C01127,1,0
C01990,1,0
C03174,1,0
C02703,1,0
C02827,1,0
C04137,1,0
C01682,1,0
C00792,1,0
C00941,1,0
C00819,1,0
C02271,1,0
C01327,1,0
C00132,1,0
C02728,1,0
C01077,1,0
C00409,1,0
C01180,1,0
C03354,1,0
C02798,1,0
C00512,1,0
C00077,1,0
C03712,1,0
C04210,1,0
C04322,1,0
C00515,1,0
C00331,1,0
C00977,1,0
C02265,1,0
C03709,1,0
C00146,1,0
C02993,1,0
C00222,1,0
C00383,1,0
C05989,1,0
C00346,1,0
C00665,1,0
C00581,1,0
C03139,1,0
C00089,1,0
C04221,1,0
C00230,1,0
C01502,1,0
C01988,1,0
C04534,1,0
C00118,1,0
C00392,1,0
C10906,1,0
C00273,1,0
C00794,1,0
C00267,1,0
C00491,1,0
C00302,1,0
C05526,1,0
C02207,1,0
C05341,1,0
C03065,1,0
C05670,1,0
C00894,1,0
C00349,1,0
C05983,1,0
C00185,1,0
C02048,1,0
C00501,1,0
C00668,1,0
C03030,1,0
C00429,1,0
C03293,1,0
C03147,1,0
C00292,1,0
C01234,1,0
C03394,1,0
C00113,1,0
C01359,1,0
C00919,1,0
C02634,1,0
C00698,1,0
C02635,1,0
C00623,1,0
C01168,1,0
C05378,1,0
C01894,1,0
C01893,1,0
C01685,1,0
C00309,1,0
C02710,1,0
C02486,1,0
C01697,1,0
C02669,1,0
C03269,1,0
C05401,1,0
C01420,1,0
C00736,1,0
C01817,1,0
C05330,1,0
C00920,1,0
C01438,1,0
C03716,1,0
C02704,1,0
C03738,1,0
C02997,1,0
C03277,1,0
C02527,1,0
C00630,1,0
C06352,1,0
C01235,1,0
C00329,1,0
C01133,1,0
C01088,1,0
C02115,1,0
C01403,1,0
C00548,1,0
C00850,1,0
C15584,1,0
C04540,1,0
C00517,1,0
C00542,1,0
C00633,1,0
C02370,1,0
C05400,1,0
C05406,1,0
C03600,1,0
C05607,1,0
C00940,1,0
C02763,1,0
C02427,1,0
C00436,1,0
C02376,1,0
C03088,1,0
C00906,1,0
C03047,1,0
C02253,1,0
C00180,1,0
C02266,1,0
C00379,1,0
C02787,1,0
C17205,1,0
C00827,1,0
C00187,1,0
C15992,1,0
C05418,1,0
C01802,1,0
C03855,1,0
C00820,1,0
C00800,1,0
C02670,1,0
C03387,1,0
C03124,1,0
C00193,1,0
C00539,1,0
C03485,1,0
C03666,1,0
C01159,1,0
C00221,1,0
C01068,1,0
C00202,1,0
C03113,1,0
C16487,1,0
C17556,1,0
C04507,1,0
C04349,1,0
C04471,1,0
C00207,1,0
C01845,1,0
C00620,1,0
C01026,1,0
C00216,1,0
C00652,1,0
C02721,1,0
C00218,1,0
C03623,1,0
C02294,1,0
C00219,1,0
C02249,1,0
C01013,1,0
C03071,1,0
C00223,1,0
C04498,1,0
C03851,1,0
C03223,1,0
C00989,1,0
C00177,1,0
C05715,1,0
C02939,1,0
C04290,1,0
C02569,1,0
C03495,1,0
C01616,1,0
C00593,1,0
C01959,1,0
C01771,1,0
C00247,1,0
C00579,1,0
C00248,1,0
C01948,1,0
C00971,1,0
C01004,1,0
C05380,1,0
C06473,1,0
C01114,1,0
C00532,1,0
C03290,1,0
C00561,1,0
C01380,1,0
C03826,1,0
C00684,1,0
C06441,1,0
C00268,1,0
C00272,1,0
C04015,1,0
C04016,1,0
C04017,1,0
C06313,1,0
C00636,1,0
C05345,1,0
C05382,1,0
C00535,1,0
C00280,1,0
C01857,1,0
C00296,1,0
C02305,1,0
C00300,1,0
C00791,1,0
C01201,1,0
C00825,1,0
C03154,1,0
C00474,1,0
C00476,1,0
C06051,1,0
C06366,1,0
C00986,1,0
C15025,1,0
C02636,1,0
C02290,1,0
C02990,1,0
C00322,1,0
C02360,1,0
C05662,1,0
C05533,1,0
C00956,1,0
C00323,1,0
C03002,1,0
C00852,1,0
C02927,1,0
C00328,1,0
C01252,1,0
C03752,1,0
C01075,1,0
C03914,1,0
C03561,1,0
C06430,1,0
C01035,1,0
C00884,1,0
C06075,1,0
C01188,1,0
C01205,1,0
C00353,1,0
C03427,1,0
C00355,1,0
C04045,1,0
C00822,1,0
C00418,1,0
C00356,1,0
C03761,1,0
C03231,1,0
C00473,1,0
C00376,1,0
C05918,1,0
C02892,1,0
C00389,1,0
C04524,1,0
C03536,1,0
C00396,1,0
C03169,1,0
C00400,1,0
C02904,1,0
C00406,1,0
C02572,1,0
C00410,1,0
C03027,1,0
C01953,1,0
C02041,1,0
C00413,1,0
C03462,1,0
C00414,1,0
C00854,1,0
C01880,1,0
C04316,1,0
C00504,1,0
C00772,1,0
C00583,1,0
C03979,1,0
C02800,1,0
C00431,1,0
C03273,1,0
C03087,1,0
C03703,1,0
C00664,1,0
C00439,1,0
C03283,1,0
C03150,1,0
C05841,1,0
C00449,1,0
C00450,1,0
C00451,1,0
C04617,1,0
C02097,1,0
C15586,1,0
C15587,1,0
C00466,1,0
C00741,1,0
C03046,1,0
C04359,1,0
C00951,1,0
C00468,1,0
C01537,1,0
C00477,1,0
C02681,1,0
C00481,1,0
C01162,1,0
C00483,1,0
C02717,1,0
C07565,1,0
C02571,1,0
C02224,1,0
C00489,1,0
C00490,1,0
C00531,1,0
C01448,1,0
C15504,1,0
C01384,1,0
C02350,1,0
C00502,1,0
C02753,1,0
C00506,1,0
C05528,1,0
C01750,1,0
C02431,1,0
C06356,1,0
C05195,1,0
C03141,1,0
C02024,1,0
C03943,1,0
C00823,1,0
C06123,1,0
C01053,1,0
C00525,1,0
C03137,1,0
C03414,1,0
C02674,1,0
C00628,1,0
C00904,1,0
C02466,1,0
C03626,1,0
C00543,1,0
C05593,1,0
C00544,1,0
C00545,1,0
C00552,1,0
C00975,1,0
C03459,1,0
C03548,1,0
C03710,1,0
C00556,1,0
C04335,1,0
C02020,1,0
C00557,1,0
C02240,1,0
C01094,1,0
C01008,1,0
C04022,1,0
C00511,1,0
C00584,1,0
C04707,1,0
C06369,1,0
C00586,1,0
C00588,1,0
C04075,1,0
C03091,1,0
C00599,1,0
C03238,1,0
C05853,1,0
C05332,1,0
C00617,1,0
C04037,1,0
C04575,1,0
C01034,1,0
C00619,1,0
C05513,1,0
C03947,1,0
C03189,1,0
C06440,1,0
C00632,1,0
C04584,1,0
C03986,1,0
C01987,1,0
C03198,1,0
C00639,1,0
C00696,1,0
C03765,1,0
C00642,1,0
C03766,1,0
C00650,1,0
C00651,1,0
C01109,1,0
C00878,1,0
C06316,1,0
C00663,1,0
C01172,1,0
C04390,1,0
C03871,1,0
C06018,1,0
C11907,1,0
C03187,1,0
C00691,1,0
C04287,1,0
C00695,1,0
C04643,1,0
C01292,1,0
C01794,1,0
C11637,1,0
C04758,1,0
C01319,1,0
C00708,1,0
C01382,1,0
C03195,1,0
C00712,1,0
C00715,1,0
C03212,1,0
C00727,1,0
C03338,1,0
C00735,1,0
C02821,1,0
C02822,1,0
C00738,1,0
C02965,1,0
C02532,1,0
C00810,1,0
C06108,1,0
C00747,1,0
C02724,1,0
C00756,1,0
C01545,1,0
C00758,1,0
C01557,1,0
C03588,1,0
C00762,1,0
C01489,1,0
C00764,1,0
C00766,1,0
C09321,1,0
C00774,1,0
C01744,1,0
C02183,1,0
C00779,1,0
C04033,1,0
C01173,1,0
C00789,1,0
C05399,1,0
C01047,1,0
C00797,1,0
C01040,1,0
C01842,1,0
C00803,1,0
C01405,1,0
C00805,1,0
C00806,1,0
C06067,1,0
C01765,1,0
C00808,1,0
C01766,1,0
C00809,1,0
C01769,1,0
C00811,1,0
C16828,1,0
C00815,1,0
C02287,1,0
C00830,1,0
C00872,1,0
C00835,1,0
C02333,1,0
C02953,1,0
C00836,1,0
C00319,1,0
C00841,1,0
C01864,1,0
C06017,1,0
C01546,1,0
C00845,1,0
C01197,1,0
C00767,1,0
C03062,1,0
C03042,1,0
C00869,1,0
C03045,1,0
C00876,1,0
C01080,1,0
C05231,1,0
C03383,1,0
C00892,1,0
C00891,1,0
C05668,1,0
C00899,1,0
C02110,1,0
C00900,1,0
C04181,1,0
C01933,1,0
C00902,1,0
C00903,1,0
C02394,1,0
C05100,1,0
C00908,1,0
C03524,1,0
C00918,1,0
C03601,1,0
C01739,1,0
C00927,1,0
C01941,1,0
C06159,1,0
C00961,1,0
C03686,1,0
C03683,1,0
C03584,1,0
C00982,1,0
C02555,1,0
C02306,1,0
C01171,1,0
C02614,1,0
C01012,1,0
C01125,1,0
C01033,1,0
C03345,1,0
C15980,1,0
C03836,1,0
C01041,1,0
C05422,1,0
C00072,1,0
C01060,1,0
C01244,1,0
C01066,1,0
C02129,1,0
C03789,1,0
C03197,1,0
C01087,1,0
C01090,1,0
C01986,1,0
C03050,1,0
C04318,1,0
C01091,1,0
C02888,1,0
C01108,1,0
C03453,1,0
C01110,1,0
C03771,1,0
C03079,1,0
C03375,1,0
C03921,1,0
C06105,1,0
C01147,1,0
C03241,1,0
C01157,1,0
C03440,1,0
C04043,1,0
C01161,1,0
C04642,1,0
C03077,1,0
C01278,1,0
C01163,1,0
C04553,1,0
C01581,1,0
C03735,1,0
C01624,1,0
C05138,1,0
C01176,1,0
C04299,1,0
C03964,1,0
C03672,1,0
C05350,1,0
C02846,1,0
C01183,1,0
C02299,1,0
C01186,1,0
C03656,1,0
C04047,1,0
C04036,1,0
C01192,1,0
C04227,1,0
C04548,1,0
C01210,1,0
C03486,1,0
C02170,1,0
C01217,1,0
C05927,1,0
C01001,1,0
C00862,1,0
C01274,1,0
C01239,1,0
C04367,1,0
C01251,1,0
C04002,1,0
C01717,1,0
C04277,1,0
C03750,1,0
C01273,1,0
C04330,1,0
C01275,1,0
C03057,1,0
C03203,1,0
C03586,1,0
C04661,1,0
C03365,1,0
C01295,1,0
C03844,1,0
C01301,1,0
C04722,1,0
C05446,1,0
C02059,1,0
C01119,1,0
C05849,1,0
C00265,1,0
C02785,1,0
C04864,1,0
C01310,1,0
C04865,1,0
C01312,1,0
C04835,1,0
C02661,1,0
C01324,1,0
C02512,1,0
C06142,1,0
C01563,1,0
C05616,1,0
C01479,1,0
C00729,1,0
C01456,1,0
C02657,1,0
C01467,1,0
C01468,1,0
C06730,1,0
C02001,1,0
C01471,1,0
C01569,1,0
C01488,1,0
C02564,1,0
C01494,1,0
C01710,1,0
C01504,1,0
C01510,1,0
C02994,1,0
C01526,1,0
C04447,1,0
C03256,1,0
C01564,1,0
C01575,1,0
C04351,1,0
C01582,1,0
C02722,1,0
C01589,1,0
C02560,1,0
C02549,1,0
C01590,1,0
C01592,1,0
C02922,1,0
C16717,1,0
C01593,1,0
C01607,1,0
C02060,1,0
C02864,1,0
C01610,1,0
C01617,1,0
C03052,1,0
C04676,1,0
C01618,1,0
C01625,1,0
C01870,1,0
C01677,1,0
C02243,1,0
C01678,1,0
C03537,1,0
C01680,1,0
C04416,1,0
C01694,1,0
C01720,1,0
C03827,1,0
C01724,1,0
C05109,1,0
C01732,1,0
C06029,1,0
C05325,1,0
C01747,1,0
C02744,1,0
C01756,1,0
C16614,1,0
C02752,1,0
C01757,1,0
C01770,1,0
C01991,1,0
C01779,1,0
C02809,1,0
C02817,1,0
C01792,1,0
C03910,1,0
C15781,1,0
C01807,1,0
C03156,1,0
C01838,1,0
C01816,1,0
C01821,1,0
C05990,1,0
C06326,1,0
C01826,1,0
C01620,1,0
C03064,1,0
C04655,1,0
C01848,1,0
C01849,1,0
C02080,1,0
C01853,1,0
C02879,1,0
C01863,1,0
C02213,1,0
C01868,1,0
C01874,1,0
C03575,1,0
C02367,1,0
C01875,1,0
C02956,1,0
C01881,1,0
C01892,1,0
C04371,1,0
C02991,1,0
C01934,1,0
C02838,1,0
C02445,1,0
C01949,1,0
C02289,1,0
C01951,1,0
C03476,1,0
C01969,1,0
C01983,1,0
C02137,1,0
C01984,1,0
C02193,1,0
C01995,1,0
C02006,1,0
C02008,1,0
C02010,1,0
C03860,1,0
C02027,1,0
C04251,1,0
C02777,1,0
C02037,1,0
C02094,1,0
C05432,1,0
C03034,1,0
C02345,1,0
C02099,1,0
C04529,1,0
C02151,1,0
C03677,1,0
C02165,1,0
C05949,1,0
C05281,1,0
C02199,1,0
C04089,1,0
C02200,1,0
C02467,1,0
C02771,1,0
C02206,1,0
C02214,1,0
C02411,1,0
C02494,1,0
C02216,1,0
C02774,1,0
C02217,1,0
C02223,1,0
C02226,1,0
C06031,1,0
C02567,1,0
C05665,1,0
C05669,1,0
C02231,1,0
C16688,1,0
C02336,1,0
C02348,1,0
C02366,1,0
C02796,1,0
C02379,1,0
C02381,1,0
C03058,1,0
C02453,1,0
C02590,1,0
C02469,1,0
C02465,1,0
C03832,1,0
C02470,1,0
C05645,1,0
C04105,1,0
C02480,1,0
C03467,1,0
C02497,1,0
C02648,1,0
C02499,1,0
C02526,1,0
C00411,1,0
C02750,1,0
C03673,1,0
C02509,1,0
C02528,1,0
C05337,1,0
C03990,1,0
C02587,1,0
C03684,1,0
C02592,1,0
C03642,1,0
C02611,1,0
C01746,1,0
C03882,1,0
C02630,1,0
C02086,1,0
C03727,1,0
C02660,1,0
C03098,1,0
C02720,1,0
C02709,1,0
C03846,1,0
C03682,1,0
C05548,1,0
C02735,1,0
C03711,1,0
C02778,1,0
C03954,1,0
C02782,1,0
C03926,1,0
C02791,1,0
C04205,1,0
C03357,1,0
C02801,1,0
C02804,1,0
C03237,1,0
C04167,1,0
C02807,1,0
C02932,1,0
C04446,1,0
C02934,1,0
C06121,1,0
C03930,1,0
C02943,1,0
C02944,1,0
C05551,1,0
C02954,1,0
C03864,1,0
C02975,1,0
C03865,1,0
C02999,1,0
C02713,1,0
C04303,1,0
C03001,1,0
C02126,1,0
C03634,1,0
C03019,1,0
C04052,1,0
C03063,1,0
C05600,1,0
C03066,1,0
C03678,1,0
C05998,1,0
C03069,1,0
C03070,1,0
C03679,1,0
C03837,1,0
C03081,1,0
C03557,1,0
C03167,1,0
C03392,1,0
C03173,1,0
C03178,1,0
C03314,1,0
C04590,1,0
C03205,1,0
C04108,1,0
C03748,1,0
C03207,1,0
C04234,1,0
C03215,1,0
C03219,1,0
C03982,1,0
C03239,1,0
C03248,1,0
C03817,1,0
C06002,1,0
C03284,1,0
C03690,1,0
C03343,1,0
C02498,1,0
C04405,1,0
C03344,1,0
C02621,1,0
C04170,1,0
C03356,1,0
C04309,1,0
C03401,1,0
C04209,1,0
C03404,1,0
C04201,1,0
C03410,1,0
C03691,1,0
C05421,1,0
C03474,1,0
C04050,1,0
C03493,1,0
C03590,1,0
C03894,1,0
C03505,1,0
C05672,1,0
C03594,1,0
C05455,1,0
C03598,1,0
C03599,1,0
C04698,1,0
C03619,1,0
C04081,1,0
C03621,1,0
C04409,1,0
C03764,1,0
C04291,1,0
C04404,1,0
C03767,1,0
C04399,1,0
C03804,1,0
C16672,1,0
C01189,1,0
C05111,1,0
C03852,1,0
C03917,1,0
C04197,1,0
C03868,1,0
C03900,1,0
C04264,1,0
C03901,1,0
C04445,1,0
C12525,1,0
C04625,1,0
C03918,1,0
C04639,1,0
C04771,1,0
C03927,1,0
C03946,1,0
C04385,1,0
C03995,1,0
C04815,1,0
C04561,1,0
C04000,1,0
C05147,1,0
C03564,1,0
C04051,1,0
C04054,1,0
C04665,1,0
C04586,1,0
C04067,1,0
C04109,1,0
C04527,1,0
C04164,1,0
C06358,1,0
C06359,1,0
C01760,1,0
C02533,1,0
C04186,1,0
C04207,1,0
C04208,1,0
C06241,1,0
C04259,1,0
C05575,1,0
C04346,1,0
C04281,1,0
C05938,1,0
C04377,1,0
C04597,1,0
C02201,1,0
C16644,1,0
C04488,1,0
C04426,1,0
C04589,1,0
C05364,1,0
C04451,1,0
C04840,1,0
C04453,1,0
C05464,1,0
C04483,1,0
C05463,1,0
C04485,1,0
C04486,1,0
C04516,1,0
C04576,1,0
C04530,1,0
C04814,1,0
C04581,1,0
C04552,1,0
C05445,1,0
C04554,1,0
C04644,1,0
C04559,1,0
C04558,1,0
C04674,1,0
C04638,1,0
C04785,1,0
C04594,1,0
C04599,1,0
C04731,1,0
C04606,1,0
C04711,1,0
C04630,1,0
C04613,1,0
C04621,1,0
C04622,1,0
C05447,1,0
C04741,1,0
C04654,1,0
C04671,1,0
C04685,1,0
C04686,1,0
C04760,1,0
C01788,1,0
C04724,1,0
C04808,1,0
C05460,1,0
C04793,1,0
C04844,1,0
C04798,1,0
C05155,1,0
C04867,1,0
C04834,1,0
C04849,1,0
C04843,1,0
C04702,1,0
C06432,1,0
C04875,1,0
C04883,1,0
C04905,1,0
C04908,1,0
C05110,1,0
C05141,1,0
C05300,1,0
C05161,1,0
C05825,1,0
C06355,1,0
C05201,1,0
C05314,1,0
C05203,1,0
C05317,1,0
C06350,1,0
C05204,1,0
C05318,1,0
C05229,1,0
C05230,1,0
C15522,1,0
C05328,1,0
C05280,1,0
C05279,1,0
C05440,1,0
C04115,1,0
C05403,1,0
C05394,1,0
C05416,1,0
C05417,1,0
C05423,1,0
C05424,1,0
C05425,1,0
C05444,1,0
C05557,1,0
C05576,1,0
C05577,1,0
C05580,1,0
C05584,1,0
C05652,1,0
C05663,1,0
C06330,1,0
C05653,1,0
C05654,1,0
C05656,1,0
C05697,1,0
C05686,1,0
C05688,1,0
C05704,1,0
C05696,1,0
C05684,1,0
C05698,1,0
C05707,1,0
C05773,1,0
C05771,1,0
C05800,1,0
C05801,1,0
C05802,1,0
C05903,1,0
C05902,1,0
C05919,1,0
C05979,1,0
C06360,1,0
C06001,1,0
C14463,1,0
C06034,1,0
C06035,1,0
C06234,1,0
C06057,1,0
C06068,1,0
C06102,1,0
C06104,1,0
C06312,1,0
C06328,1,0
C06329,1,0
C06343,1,0
C06331,1,0
C06338,1,0
C06339,1,0
C06342,1,0
C06346,1,0
C06348,1,0
C06367,1,0
C06368,1,0
C06381,1,0
C06384,1,0
C06382,1,0
C06383,1,0
C06390,1,0
C06392,1,0
C06452,1,0
C06454,1,0
C00992,1,0
C06453,1,0
C01751,1,0
C06639,1,0
C06640,1,0
C04596,1,0
C06637,1,0
C06672,1,0
C06760,1,0
C06761,1,0
C06762,1,0
C06721,1,0
C06722,1,0
C06726,1,0
C06725,1,0
C04687,1,0
C04670,1,0
C06732,1,0
C06733,1,0
C06734,1,0
C11480,1,0
C06736,1,0
C06737,1,0
C06372,1,0
C07296,1,0
C07297,1,0
C07350,1,0
C02723,1,0
C10974,1,0
C06178,1,0
C11062,1,0
C02331,1,0
C06019,1,0
C02557,1,0
C03585,1,0
C04431,1,0
C06594,1,0
C06597,1,0
C06598,1,0
C06602,1,0
C07111,1,0
C07112,1,0
C06620,1,0
C01912,1,0
C06634,1,0
C11922,1,0
C06622,1,0
C06555,1,0
C05116,1,0
C01904,1,0
C06322,1,0
C09809,1,0
C09810,1,0
C06891,1,0
C07288,1,0
C07287,1,0
C07326,1,0
C06485,1,0
C07328,1,0
C07329,1,0
C11496,1,0
C11497,1,0
C11498,1,0
C08825,1,0
C11499,1,0
C11501,1,0
C11500,1,0
C05439,1,0
C01847,1,0
C04203,1,0
C03576,1,0
C11503,1,0
C11504,1,0
C01486,1,0
C07343,1,0
C06526,1,0
C07344,1,0
C11505,1,0
C11506,1,0
C11507,1,0
C11509,1,0
C06701,1,0
C07294,1,0
C07295,1,0
C07098,1,0
C11510,1,0
C07308,1,0
C07349,1,0
C02079,1,0
C11511,1,0
C01902,1,0
C11513,1,0
C11514,1,0
C11515,1,0
C07303,1,0
C11527,1,0
C11526,1,0
C01204,1,0
C07331,1,0
C01328,1,0
C07272,1,0
C01596,1,0
C07301,1,0
C11536,1,0
C11537,1,0
C10517,1,0
C11546,1,0
C11541,1,0
C11542,1,0
C11543,1,0
C11545,1,0
C11631,1,0
C11633,1,0
C11634,1,0
C02793,1,0
C11638,1,0
C11680,1,0
C11691,1,0
C09107,1,0
C11735,1,0
C11681,1,0
C11821,1,0
C11825,1,0
C05479,1,0
C00751,1,0
C11832,1,0
C02139,1,0
C11850,1,0
C05306,1,0
C11398,1,0
C11401,1,0
C11412,1,0
C11415,1,0
C11931,1,0
C11932,1,0
C11991,1,0
C11992,1,0
C01054,1,0
C08628,1,0
C08616,1,0
C08615,1,0
C08980,1,0
C06428,1,0
C12083,1,0
C09756,1,0
C05631,1,0
C00509,1,0
C06563,1,0
C09762,1,0
C10208,1,0
C12135,1,0
C10419,1,0
C03004,1,0
C04353,1,0
C10858,1,0
C12449,1,0
C12635,1,0
C12636,1,0
C04608,1,0
C10020,1,0
C12628,1,0
C12629,1,0
C02814,1,0
C07103,1,0
C13378,1,0
C00203,1,0
C13952,1,0
C11249,1,0
C05431,1,0
C14146,1,0
C08586,1,0
C14180,1,0
C14602,1,0
C14604,1,0
C14610,1,0
C12044,1,0
C14540,1,0
C01595,1,0
C14827,1,0
C14830,1,0
C14866,1,0
C06899,1,0
C15484,1,0
C03681,1,0
C05999,1,0
C15485,1,0
C15486,1,0
C01507,1,0
C01015,1,0
C01877,1,0
C02143,1,0
C16581,1,0
C02982,1,0
C02117,1,0
C01394,1,0
C15488,1,0
C05361,1,0
C15494,1,0
C02084,1,0
C15495,1,0
C15499,1,0
C12308,1,0
C02034,1,0
C15500,1,0
C15501,1,0
C15502,1,0
C04634,1,0
C15505,1,0
C03434,1,0
C15508,1,0
C15512,1,0
C15513,1,0
C15515,1,0
C05452,1,0
C05454,1,0
C05465,1,0
C15516,1,0
C15517,1,0
C00643,1,0
C06561,1,0
C08576,1,0
C15525,1,0
C15527,1,0
C10469,1,0
C10478,1,0
C08650,1,0
C15531,1,0
C15532,1,0
C15533,1,0
C15536,1,0
C15538,1,0
C15537,1,0
C15547,1,0
C15548,1,0
C04509,1,0
C04574,1,0
C05413,1,0
C00826,1,0
C15557,1,0
C11301,1,0
C05466,1,0
C15559,1,0
C00798,1,0
C15560,1,0
C06746,1,0
C15561,1,0
C15562,1,0
C06554,1,0
C15563,1,0
C06742,1,0
C15566,1,0
C05578,1,0
C15568,1,0
C15569,1,0
C00897,1,0
C01971,1,0
C06310,1,0
C06309,1,0
C15570,1,0
C15571,1,0
C15572,1,0
C15583,1,0
C10101,1,0
C15591,1,0
C15599,1,0
C05650,1,0
C05649,1,0
C06751,1,0
C15604,1,0
C15605,1,0
C11481,1,0
C05906,1,0
C12316,1,0
C15608,1,0
C01495,1,0
C15204,1,0
C15609,1,0
C00799,1,0
C02921,1,0
C06176,1,0
C15612,1,0
C15615,1,0
C15616,1,0
C15667,1,0
C15668,1,0
C15791,1,0
C15792,1,0
C15799,1,0
C15800,1,0
C15793,1,0
C15801,1,0
C15853,1,0
C05437,1,0
C03845,1,0
C05108,1,0
C15915,1,0
C05107,1,0
C01164,1,0
C15857,1,0
C15858,1,0
C15985,1,0
C06542,1,0
C15867,1,0
C05435,1,0
C15907,1,0
C15910,1,0
C15928,1,0
C15932,1,0
C15943,1,0
C15514,1,0
C09707,1,0
C15989,1,0
C15988,1,0
C15990,1,0
C15991,1,0
C16675,1,0
C15996,1,0
C16014,1,0
C16015,1,0
C11389,1,0
C16071,1,0
C16156,1,0
C16157,1,0
C15925,1,0
C02280,1,0
C15930,1,0
C15797,1,0
C16251,1,0
C16256,1,0
C16257,1,0
C16258,1,0
C16259,1,0
C16260,1,0
C16261,1,0
C06337,1,0
C04434,1,0
C16319,1,0
C15523,1,0
C08577,1,0
C16423,1,0
C09789,1,0
C16463,1,0
C16424,1,0
C16426,1,0
C04713,1,0
C16428,1,0
C16429,1,0
C16430,1,0
C16427,1,0
C16431,1,0
C16445,1,0
C16447,1,0
C04083,1,0
C00371,1,0
C02029,1,0
C16489,1,0
C16440,1,0
C04501,1,0
C16538,1,0
C12317,1,0
C16540,1,0
C16541,1,0
C09276,1,0
C09305,1,0
C16579,1,0
C16597,1,0
C16588,1,0
C16600,1,0
C16589,1,0
C08353,1,0
C16639,1,0
C07643,1,0
C07645,1,0
C16587,1,0
C16592,1,0
C16595,1,0
C16590,1,0
C16583,1,0
C16598,1,0
C08624,1,0
C16682,1,0
C16681,1,0
C09839,1,0
C07130,1,0
C00408,1,0
C10157,1,0
C07475,1,0
C06184,1,0
C10865,1,0
C12448,1,0
C01416,1,0
C10860,1,0
C02046,1,0
C16704,1,0
C16705,1,0
C02105,1,0
C09541,1,0
C03514,1,0
C16718,1,0
C08301,1,0
C08300,1,0
C02765,1,0
C16719,1,0
C10733,1,0
C06536,1,0
C06538,1,0
C09243,1,0
C16735,1,0
C16726,1,0
C06528,1,0
C16728,1,0
C06527,1,0
C16727,1,0
C16737,1,0
C10138,1,0
C06523,1,0
C01227,1,0
C00909,1,0
C03190,1,0
C09870,1,0
C00553,1,0
C16825,1,0
C11338,1,0
C01722,1,0
C01719,1,0
C06212,1,0
C08299,1,0
C02951,1,0
C02162,1,0
C16831,1,0
C16698,1,0
C16846,1,0
C11379,1,0
C16884,1,0
C02022,1,0
C17087,1,0
C17093,1,0
C11910,1,0
C16069,1,0
C17139,1,0
C02937,1,0
C17204,1,0
C16518,1,0
C17206,1,0
C17209,1,0
C17234,1,0
C03240,1,0
C12115,1,0
C17267,1,0
C02218,1,0
C17401,1,0
C11539,1,0
C16826,1,0
C11356,1,0
C17435,1,0
C17434,1,0
C17436,1,0
C17437,1,0
C17438,1,0
C17439,1,0
C17440,1,0
C05427,1,0
C17500,1,0
C02161,1,0
C01020,1,0
C01059,1,0
C17746,1,0
C17733,1,0
C17735,1,0
C10447,1,0
C17935,1,0
C04804,1,0
C01289,1,0
C17959,1,0
C01010,1,0
C05125,1,0
C01674,1,0
C01182,1,0
C02116,1,0
C05856,1,0
C01795,1,0
C00757,1,0
C03680,1,0
C05565,1,0
C05791,1,0
C05795,1,0
C00541,1,0
C05933,1,0
C03246,1,0
C03483,1,0
C05829,1,0
C05572,1,0
C05682,1,0
C02362,1,0
C00402,1,0
C04573,1,0
C01304,1,0
C05922,1,0
C00942,1,0
C01028,1,0
C00990,1,0
C01142,1,0
C05946,1,0
C03217,1,0
C01042,1,0
C00488,1,0
C01045,1,0
C01044,1,0
C08357,1,0
C05299,1,0
C08358,1,0
C05302,1,0
C08359,1,0
C03078,1,0
C03028,1,0
C05381,1,0
C01115,1,0
C03289,1,0
C03145,1,0
C02700,1,0
C02693,1,0
C03230,1,0
C00398,1,0
C02505,1,0
C03519,1,0
C03428,1,0
C03614,1,0
C04368,1,0
C01566,1,0
C01358,1,0
C01837,1,0
C04091,1,0
C06321,1,0
C00682,1,0
C02232,1,0
C00513,1,0
C03267,1,0
C00976,1,0
C02642,1,0
C01073,1,0
C05340,1,0
C06027,1,0
C01231,1,0
C06198,1,0
C02247,1,0
C02775,1,0
C03005,1,0
C06032,1,0
C06030,1,0
C02488,1,0
C05984,1,0
C01996,1,0
C02357,1,0
C00969,1,0
C05921,1,0
C05552,1,0
C02514,1,0
C02714,1,0
C01152,1,0
C01929,1,0
C00386,1,0
C00388,1,0
C00785,1,0
C01989,1,0
C03546,1,0
C04006,1,0
C03659,1,0
C03660,1,0
C04039,1,0
C00394,1,0
C00763,1,0
C02918,1,0
C02949,1,0
C13635,1,0
C03652,1,0
C01061,1,0
C06144,1,0
C05852,1,0
C01623,1,0
C02330,1,0
C05714,1,0
C06206,1,0
C06433,1,0
C01586,1,0
C04480,1,0
C02659,1,0
C01043,1,0
C02237,1,0
C01046,1,0
C05956,1,0
C05966,1,0
C04822,1,0
C05356,1,0
C05965,1,0
C00804,1,0
C03582,1,0
C05608,1,0
C00587,1,0
C04484,1,0
C06318,1,0
C03233,1,0
C02236,1,0
C05601,1,0
C06201,1,0
C01215,1,0
C03997,1,0
C00519,1,0
C06435,1,0
C00847,1,0
C00252,1,0
C01727,1,0
C04244,1,0
C00447,1,0
C03772,1,0
C06011,1,0
C00307,1,0
C01861,1,0
C00527,1,0
C02220,1,0
C10945,1,0
C03227,1,0
C02043,1,0
C05644,1,0
C00637,1,0
C02946,1,0
C02344,1,0
C02462,1,0
C17622,1,0
C06069,1,0
C06074,1,0
C06076,1,0
C00521,1,0
C01218,1,0
C00570,1,0
C01414,1,0
C06089,1,0
C04796,1,0
C04797,1,0
C03758,1,0
C00777,1,0
C00813,1,0
C15607,1,0
C05515,1,0
C01262,1,0
C05130,1,0
C05135,1,0
C05127,1,0
C04443,1,0
C00616,1,0
C06213,1,0
C05805,1,0
C17568,1,0
C00843,1,0
C02666,1,0
C04042,1,0
C05610,1,0
C00482,1,0
C01138,1,0
C00571,1,0
C01772,1,0
C00540,1,0
C00427,1,0
C02198,1,0
C04282,1,0
C03479,1,0
C01841,1,0
C01860,1,0
C02004,1,0
C06111,1,0
C06394,1,0
C03574,1,0
C05658,1,0
C02537,1,0
C02538,1,0
C05298,1,0
C00472,1,0
C02588,1,0
C02513,1,0
C05619,1,0
C00933,1,0
C02442,1,0
C00500,1,0
C01181,1,0
C01962,1,0
C02947,1,0
C02091,1,0
C01219,1,0
C05911,1,0
C00974,1,0
C01477,1,0
C01120,1,0
C00964,1,0
C01123,1,0
C02452,1,0
C00674,1,0
C00523,1,0
C05293,1,0
C04295,1,0
C01745,1,0
C03134,1,0
C05585,1,0
C01036,1,0
C00547,1,0
C00788,1,0
C05589,1,0
C00844,1,0
C02372,1,0
C02824,1,0
C04148,1,0
C05953,1,0
C06459,1,0
C05674,1,0
C00590,1,0
C00761,1,0
C02083,1,0
C05527,1,0
C01155,1,0
C01156,1,0
C02167,1,0
C05640,1,0
C03742,1,0
C06192,1,0
C00954,1,0
C00955,1,0
C05960,1,0
C05338,1,0
C05646,1,0
C00780,1,0
C05648,1,0
C02718,1,0
C03646,1,0
C01879,1,0
C02501,1,0
C01214,1,0
C05122,1,0
C05959,1,0
C05957,1,0
C04392,1,0
C03872,1,0
C02147,1,0
C00725,1,0
C00783,1,0
C05489,1,0
C05471,1,0
C00744,1,0
C01457,1,0
C02400,1,0
C00745,1,0
C02691,1,0
C00750,1,0
C06083,1,0
C06317,1,0
C03329,1,0
C05469,1,0
C05939,1,0
C05634,1,0
C05647,1,0
C00978,1,0
C05659,1,0
C00786,1,0
C10503,1,0
C05588,1,0
C02565,1,0
C00795,1,0
C00814,1,0
C05985,1,0
C06202,1,0
C03044,1,0
C05627,1,0
C02675,1,0
C05604,1,0
C00829,1,0
C04314,1,0
C04079,1,0
C00831,1,0
C01982,1,0
C02222,1,0
C00846,1,0
C06050,1,0
C03092,1,0
C00848,1,0
C04718,1,0
C02823,1,0
C00858,1,0
C01562,1,0
C00859,1,0
C03579,1,0
C02035,1,0
C00870,1,0
C02235,1,0
C03360,1,0
C00888,1,0
C02123,1,0
C02335,1,0
C03455,1,0
C02166,1,0
C00916,1,0
C03112,1,0
C04712,1,0
C01300,1,0
C04807,1,0
C00922,1,0
C02295,1,0
C05301,1,0
C05834,1,0
C02938,1,0
C05835,1,0
C05560,1,0
C05823,1,0
C01767,1,0
C02457,1,0
C03648,1,0
C02906,1,0
C01598,1,0
C05824,1,0
C01513,1,0
C05766,1,0
C03955,1,0
C02647,1,0
C03409,1,0
C01056,1,0
C01297,1,0
C01829,1,0
C02656,1,0
C01069,1,0
C02153,1,0
C01626,1,0
C01113,1,0
C01249,1,0
C01111,1,0
C05641,1,0
C05396,1,0
C02485,1,0
C01126,1,0
C03461,1,0
C03220,1,0
C03739,1,0
C01149,1,0
C01259,1,0
C03897,1,0
C05582,1,0
C02887,1,0
C04518,1,0
C04062,1,0
C04121,1,0
C04366,1,0
C06224,1,0
C01198,1,0
C04563,1,0
C04579,1,0
C01207,1,0
C01850,1,0
C01270,1,0
C04297,1,0
C01220,1,0
C01245,1,0
C02977,1,0
C03117,1,0
C01226,1,0
C04780,1,0
C04672,1,0
C04555,1,0
C05139,1,0
C01243,1,0
C04063,1,0
C01272,1,0
C03793,1,0
C04271,1,0
C01263,1,0
C01265,1,0
C04444,1,0
C04604,1,0
C01283,1,0
C01294,1,0
C01291,1,0
C04675,1,0
C04280,1,0
C04673,1,0
C01298,1,0
C05961,1,0
C05590,1,0
C02515,1,0
C01401,1,0
C01407,1,0
C03671,1,0
C01512,1,0
C01433,1,0
C01852,1,0
C06071,1,0
C01455,1,0
C04592,1,0
C01542,1,0
C02923,1,0
C01470,1,0
C01752,1,0
C01500,1,0
C01499,1,0
C01514,1,0
C04293,1,0
C01516,1,0
C01735,1,0
C01533,1,0
C02325,1,0
C01561,1,0
C01673,1,0
C04717,1,0
C04056,1,0
C05642,1,0
C01606,1,0
C04783,1,0
C01693,1,0
C04185,1,0
C02274,1,0
C06028,1,0
C02074,1,0
C01761,1,0
C01780,1,0
C05473,1,0
C01921,1,0
C05467,1,0
C05315,1,0
C04118,1,0
C01804,1,0
C03325,1,0
C01851,1,0
C03470,1,0
C06103,1,0
C03194,1,0
C02141,1,0
C01943,1,0
C06095,1,0
C06096,1,0
C03309,1,0
C03170,1,0
C02090,1,0
C02106,1,0
C05202,1,0
C05174,1,0
C02915,1,0
C02134,1,0
C02880,1,0
C02140,1,0
C05490,1,0
C05475,1,0
C04853,1,0
C02298,1,0
C02172,1,0
C05963,1,0
C03824,1,0
C03676,1,0
C02612,1,0
C05620,1,0
C02930,1,0
C06387,1,0
C02385,1,0
C06199,1,0
C02576,1,0
C05772,1,0
C02495,1,0
C03567,1,0
C05711,1,0
C06114,1,0
C02575,1,0
C02625,1,0
C02933,1,0
C05165,1,0
C05855,1,0
C02646,1,0
C04578,1,0
C02673,1,0
C05936,1,0
C06195,1,0
C02759,1,0
C04435,1,0
C02811,1,0
C03206,1,0
C02835,1,0
C05133,1,0
C02890,1,0
C02916,1,0
C05843,1,0
C06210,1,0
C05837,1,0
C03012,1,0
C06204,1,0
C03056,1,0
C03458,1,0
C03351,1,0
C03067,1,0
C06564,1,0
C04468,1,0
C03164,1,0
C05343,1,0
C05485,1,0
C05636,1,0
C03442,1,0
C01121,1,0
C04767,1,0
C03460,1,0
C06000,1,0
C03516,1,0
C04536,1,0
C05673,1,0
C05952,1,0
C03577,1,0
C02375,1,0
C04522,1,0
C05904,1,0
C05375,1,0
C16674,1,0
C05587,1,0
C06044,1,0
C06160,1,0
C04373,1,0
C12208,1,0
C03920,1,0
C04178,1,0
C03925,1,0
C05539,1,0
C06118,1,0
C04690,1,0
C04106,1,0
C04324,1,0
C04489,1,0
C04144,1,0
C04525,1,0
C05947,1,0
C05941,1,0
C05942,1,0
C15556,1,0
C15503,1,0
C04437,1,0
C05131,1,0
C05411,1,0
C04742,1,0
C04577,1,0
C04623,1,0
C04832,1,0
C11904,1,0
C04628,1,0
C11903,1,0
C04773,1,0
C04729,1,0
C04706,1,0
C06066,1,0
C06052,1,0
C06047,1,0
C06048,1,0
C04858,1,0
C05622,1,0
C06148,1,0
C05145,1,0
C05827,1,0
C05487,1,0
C05140,1,0
C05158,1,0
C05839,1,0
C05175,1,0
C06163,1,0
C06161,1,0
C05176,1,0
C05243,1,0
C05177,1,0
C06167,1,0
C05178,1,0
C05179,1,0
C05220,1,0
C05189,1,0
C05190,1,0
C05191,1,0
C05247,1,0
C06162,1,0
C05193,1,0
C05316,1,0
C05194,1,0
C06327,1,0
C05200,1,0
C05313,1,0
C05322,1,0
C05239,1,0
C05516,1,0
C05284,1,0
C05285,1,0
C06165,1,0
C06173,1,0
C05335,1,0
C05703,1,0
C05691,1,0
C05690,1,0
C05595,1,0
C05596,1,0
C05412,1,0
C05434,1,0
C05448,1,0
C05449,1,0
C05450,1,0
C05451,1,0
C17339,1,0
C05453,1,0
C05470,1,0
C05481,1,0
C05472,1,0
C05482,1,0
C05474,1,0
C05476,1,0
C05478,1,0
C05477,1,0
C05483,1,0
C05480,1,0
C05484,1,0
C05488,1,0
C05500,1,0
C05499,1,0
C05556,1,0
C05568,1,0
C05570,1,0
C05571,1,0
C05594,1,0
C05579,1,0
C05581,1,0
C05583,1,0
C05907,1,0
C05635,1,0
C05660,1,0
C05637,1,0
C05638,1,0
C05639,1,0
C05651,1,0
C05655,1,0
C05699,1,0
C05689,1,0
C05692,1,0
C05702,1,0
C05700,1,0
C05701,1,0
C05768,1,0
C05912,1,0
C05786,1,0
C05803,1,0
C05804,1,0
C05813,1,0
C05814,1,0
C05828,1,0
C05838,1,0
C05851,1,0
C05905,1,0
C05909,1,0
C05908,1,0
C05923,1,0
C05951,1,0
C05955,1,0
C05954,1,0
C05958,1,0
C05986,1,0
C06255,1,0
C05994,1,0
C00950,1,0
C06484,1,0
C06090,1,0
C06094,1,0
C06145,1,0
C06146,1,0
C06149,1,0
C06171,1,0
C06174,1,0
C06172,1,0
C06181,1,0
C06180,1,0
C06182,1,0
C06183,1,0
C06188,1,0
C02323,1,0
C06203,1,0
C06319,1,0
C06408,1,0
C06320,1,0
C06333,1,0
C06336,1,0
C06376,1,0
C06377,1,0
C06399,1,0
C06406,1,0
C06407,1,0
C06416,1,0
C06462,1,0
C06512,1,0
C06520,1,0
C06519,1,0
C06517,1,0
C06518,1,0
C06511,1,0
C06516,1,0
C06504,1,0
C06505,1,0
C06506,1,0
C06507,1,0
C06565,1,0
C06568,1,0
C06576,1,0
C06577,1,0
C06611,1,0
C06613,1,0
C06612,1,0
C16348,1,0
C06578,1,0
C06603,1,0
C06614,1,0
C06615,1,0
C06589,1,0
C06579,1,0
C06580,1,0
C06585,1,0
C06586,1,0
C06599,1,0
C06600,1,0
C06587,1,0
C06581,1,0
C06648,1,0
C06644,1,0
C06645,1,0
C06650,1,0
C06651,1,0
C06584,1,0
C06588,1,0
C06575,1,0
C06601,1,0
C06678,1,0
C06679,1,0
C06671,1,0
C06673,1,0
C06335,1,0
C06674,1,0
C06675,1,0
C06677,1,0
C06757,1,0
C06758,1,0
C06752,1,0
C06753,1,0
C06754,1,0
C06755,1,0
C06756,1,0
C01454,1,0
C06729,1,0
C04112,1,0
C06569,1,0
C06566,1,0
C06714,1,0
C06715,1,0
C06719,1,0
C06720,1,0
C06723,1,0
C06727,1,0
C06728,1,0
C06731,1,0
C07216,1,0
C07209,1,0
C07213,1,0
C07214,1,0
C06711,1,0
C06712,1,0
C06548,1,0
C07478,1,0
C07084,1,0
C07085,1,0
C06593,1,0
C06657,1,0
C06658,1,0
C01998,1,0
C07731,1,0
C07734,1,0
C07087,1,0
C06646,1,0
C11353,1,0
C06582,1,0
C02632,1,0
C08062,1,0
C07123,1,0
C06609,1,0
C06610,1,0
C07479,1,0
C11354,1,0
C06680,1,0
C06641,1,0
C06893,1,0
C01659,1,0
C01548,1,0
C06772,1,0
C06771,1,0
C06636,1,0
C06638,1,0
C06642,1,0
C07075,1,0
C06596,1,0
C07102,1,0
C07090,1,0
C07095,1,0
C06676,1,0
C06649,1,0
C07093,1,0
C07094,1,0
C06876,1,0
C06813,1,0
C07099,1,0
C07097,1,0
C07089,1,0
C07717,1,0
C07718,1,0
C03569,1,0
C07724,1,0
C07725,1,0
C07733,1,0
C08060,1,0
C08061,1,0
C07083,1,0
C07100,1,0
C07101,1,0
C03664,1,0
C06604,1,0
C06607,1,0
C07715,1,0
C07721,1,0
C11348,1,0
C07113,1,0
C07189,1,0
C07215,1,0
C07092,1,0
C07720,1,0
C07729,1,0
C07722,1,0
C07727,1,0
C07728,1,0
C07732,1,0
C02124,1,0
C07212,1,0
C07208,1,0
C06547,1,0
C07096,1,0
C06670,1,0
C07114,1,0
C07118,1,0
C06986,1,0
C06627,1,0
C06626,1,0
C06625,1,0
C06570,1,0
C06624,1,0
C06628,1,0
C06655,1,0
C06656,1,0
C06659,1,0
C06660,1,0
C06661,1,0
C06662,1,0
C06605,1,0
C06608,1,0
C07088,1,0
C06793,1,0
C06789,1,0
C06790,1,0
C06791,1,0
C06792,1,0
C07091,1,0
C01221,1,0
C06616,1,0
C06635,1,0
C11916,1,0
C06630,1,0
C11911,1,0
C06633,1,0
C06653,1,0
C06988,1,0
C06989,1,0
C11352,1,0
C06990,1,0
C07719,1,0
C07723,1,0
C07726,1,0
C05359,1,0
C08063,1,0
C11351,1,0
C06606,1,0
C06551,1,0
C06552,1,0
C06553,1,0
C06748,1,0
C06556,1,0
C06559,1,0
C06560,1,0
C08735,1,0
C06557,1,0
C06558,1,0
C09819,1,0
C09820,1,0
C06749,1,0
C09821,1,0
C09812,1,0
C09813,1,0
C09816,1,0
C09817,1,0
C09815,1,0
C09814,1,0
C09825,1,0
C09818,1,0
C09811,1,0
C09824,1,0
C02734,1,0
C04216,1,0
C01230,1,0
C04217,1,0
C05815,1,0
C17569,1,0
C13425,1,0
C01389,1,0
C09822,1,0
C09823,1,0
C11455,1,0
C11425,1,0
C11426,1,0
C11427,1,0
C11422,1,0
C11429,1,0
C11431,1,0
C11432,1,0
C11428,1,0
C07211,1,0
C07024,1,0
C07025,1,0
C07026,1,0
C07027,1,0
C07028,1,0
C07029,1,0
C07030,1,0
C07031,1,0
C07032,1,0
C07335,1,0
C07277,1,0
C07338,1,0
C11508,1,0
C07307,1,0
C07304,1,0
C08491,1,0
C11512,1,0
C06308,1,0
C06307,1,0
C11520,1,0
C11519,1,0
C11521,1,0
C11522,1,0
C11523,1,0
C07271,1,0
C07276,1,0
C11516,1,0
C11544,1,0
C11538,1,0
C11540,1,0
C16242,1,0
C11679,1,0
C11632,1,0
C11635,1,0
C09239,1,0
C11636,1,0
C01957,1,0
C05598,1,0
C11678,1,0
C09024,1,0
C11682,1,0
C09241,1,0
C09244,1,0
C11643,1,0
C11675,1,0
C11641,1,0
C07201,1,0
C11676,1,0
C11783,1,0
C11784,1,0
C11683,1,0
C11807,1,0
C11808,1,0
C11809,1,0
C11810,1,0
C11816,1,0
C11817,1,0
C09337,1,0
C11672,1,0
C11409,1,0
C11383,1,0
C06099,1,0
C05790,1,0
C05794,1,0
C05789,1,0
C05793,1,0
C11829,1,0
C11830,1,0
C11831,1,0
C11872,1,0
C11873,1,0
C11874,1,0
C11875,1,0
C06093,1,0
C11876,1,0
C11857,1,0
C11901,1,0
C06086,1,0
C11877,1,0
C11878,1,0
C11879,1,0
C11880,1,0
C11881,1,0
C11894,1,0
C11895,1,0
C11896,1,0
C11897,1,0
C11898,1,0
C11899,1,0
C11700,1,0
C11900,1,0
C11902,1,0
C11860,1,0
C11861,1,0
C11859,1,0
C11862,1,0
C11863,1,0
C11864,1,0
C11865,1,0
C11868,1,0
C11869,1,0
C11854,1,0
C11855,1,0
C11870,1,0
C11871,1,0
C11866,1,0
C11882,1,0
C11887,1,0
C11883,1,0
C11886,1,0
C11884,1,0
C11885,1,0
C11924,1,0
C11929,1,0
C11934,1,0
C11935,1,0
C11936,1,0
C11395,1,0
C11408,1,0
C11396,1,0
C11411,1,0
C11397,1,0
C11410,1,0
C11399,1,0
C11413,1,0
C11400,1,0
C11416,1,0
C11402,1,0
C11404,1,0
C11403,1,0
C11406,1,0
C11414,1,0
C11417,1,0
C11418,1,0
C11420,1,0
C11405,1,0
C11419,1,0
C11937,1,0
C11941,1,0
C09884,1,0
C09880,1,0
C11944,1,0
C11942,1,0
C11943,1,0
C11946,1,0
C11945,1,0
C11947,1,0
C11948,1,0
C11949,1,0
C11950,1,0
C11951,1,0
C09893,1,0
C11952,1,0
C11393,1,0
C09844,1,0
C11908,1,0
C11925,1,0
C11909,1,0
C11930,1,0
C11928,1,0
C11920,1,0
C11921,1,0
C11927,1,0
C11915,1,0
C11926,1,0
C11912,1,0
C11933,1,0
C11923,1,0
C12001,1,0
C12002,1,0
C12000,1,0
C12003,1,0
C11989,1,0
C11990,1,0
C01946,1,0
C11993,1,0
C11994,1,0
C11997,1,0
C11998,1,0
C11995,1,0
C11996,1,0
C11999,1,0
C11969,1,0
C11970,1,0
C11977,1,0
C11978,1,0
C11953,1,0
C11954,1,0
C11961,1,0
C11962,1,0
C11971,1,0
C11979,1,0
C11955,1,0
C11963,1,0
C11972,1,0
C11980,1,0
C11956,1,0
C11964,1,0
C11973,1,0
C11975,1,0
C11974,1,0
C11976,1,0
C11981,1,0
C11983,1,0
C11982,1,0
C11984,1,0
C11957,1,0
C11959,1,0
C11958,1,0
C11960,1,0
C11965,1,0
C11967,1,0
C11966,1,0
C11968,1,0
C11919,1,0
C11985,1,0
C11407,1,0
C06124,1,0
C12142,1,0
C12144,1,0
C12147,1,0
C04122,1,0
C06562,1,0
C12127,1,0
C10107,1,0
C12128,1,0
C09727,1,0
C12136,1,0
C08604,1,0
C12095,1,0
C08639,1,0
C12096,1,0
C10192,1,0
C02920,1,0
C12203,1,0
C12204,1,0
C12205,1,0
C12206,1,0
C10434,1,0
C12213,1,0
C12214,1,0
C12215,1,0
C12106,1,0
C12109,1,0
C12108,1,0
C12210,1,0
C12107,1,0
C12176,1,0
C12246,1,0
C14721,1,0
C12248,1,0
C12134,1,0
C12124,1,0
C09320,1,0
C11867,1,0
C12313,1,0
C12314,1,0
C12324,1,0
C12325,1,0
C12323,1,0
C12318,1,0
C12319,1,0
C12320,1,0
C12321,1,0
C12322,1,0
C12026,1,0
C12438,1,0
C12396,1,0
C12397,1,0
C12404,1,0
C12447,1,0
C12405,1,0
C12406,1,0
C12407,1,0
C12409,1,0
C12410,1,0
C12411,1,0
C12412,1,0
C12408,1,0
C12414,1,0
C12413,1,0
C12416,1,0
C12415,1,0
C12417,1,0
C12419,1,0
C12418,1,0
C12421,1,0
C12422,1,0
C12423,1,0
C12424,1,0
C12425,1,0
C12443,1,0
C12426,1,0
C12427,1,0
C12428,1,0
C12430,1,0
C01907,1,0
C12431,1,0
C12432,1,0
C12433,1,0
C12434,1,0
C12435,1,0
C12366,1,0
C12367,1,0
C12374,1,0
C12368,1,0
C12376,1,0
C12369,1,0
C12377,1,0
C12382,1,0
C12383,1,0
C12384,1,0
C12446,1,0
C12385,1,0
C12444,1,0
C12386,1,0
C12387,1,0
C12388,1,0
C06179,1,0
C02066,1,0
C12452,1,0
C12453,1,0
C12455,1,0
C12481,1,0
C12456,1,0
C12457,1,0
C12458,1,0
C12479,1,0
C12480,1,0
C12466,1,0
C12474,1,0
C12475,1,0
C12476,1,0
C05080,1,0
C12471,1,0
C12472,1,0
C12473,1,0
C12469,1,0
C12477,1,0
C12478,1,0
C16933,1,0
C10126,1,0
C11588,1,0
C12622,1,0
C12623,1,0
C11457,1,0
C12621,1,0
C12624,1,0
C12631,1,0
C10521,1,0
C05376,1,0
C12625,1,0
C05623,1,0
C12638,1,0
C12640,1,0
C12641,1,0
C12647,1,0
C12137,1,0
C12642,1,0
C10098,1,0
C03898,1,0
C12633,1,0
C11620,1,0
C12643,1,0
C12832,1,0
C12831,1,0
C12833,1,0
C12834,1,0
C12835,1,0
C12838,1,0
C05618,1,0
C03572,1,0
C12987,1,0
C12988,1,0
C12989,1,0
C12836,1,0
C12837,1,0
C13309,1,0
C13482,1,0
C13620,1,0
C13621,1,0
C13645,1,0
C13622,1,0
C13623,1,0
C13624,1,0
C13626,1,0
C13628,1,0
C13629,1,0
C13631,1,0
C13632,1,0
C10700,1,0
C13633,1,0
C13634,1,0
C13637,1,0
C13638,1,0
C13636,1,0
C14101,1,0
C14111,1,0
C14113,1,0
C14114,1,0
C14098,1,0
C14115,1,0
C14116,1,0
C14117,1,0
C14118,1,0
C14119,1,0
C14120,1,0
C14082,1,0
C14083,1,0
C14084,1,0
C14085,1,0
C14086,1,0
C14087,1,0
C14088,1,0
C14089,1,0
C14090,1,0
C14091,1,0
C14092,1,0
C14093,1,0
C14094,1,0
C14095,1,0
C14096,1,0
C14097,1,0
C02909,1,0
C14099,1,0
C14104,1,0
C14105,1,0
C14106,1,0
C14107,1,0
C14108,1,0
C14109,1,0
C14110,1,0
C14102,1,0
C14103,1,0
C14145,1,0
C14144,1,0
C14143,1,0
C06098,1,0
C08579,1,0
C08614,1,0
C08606,1,0
C13431,1,0
C13433,1,0
C13453,1,0
C14044,1,0
C14045,1,0
C13455,1,0
C13454,1,0
C06082,1,0
C13456,1,0
C05433,1,0
C08734,1,0
C08737,1,0
C08733,1,0
C14147,1,0
C14148,1,0
C14149,1,0
C14150,1,0
C06442,1,0
C06231,1,0
C14179,1,0
C12247,1,0
C14722,1,0
C14723,1,0
C14724,1,0
C14725,1,0
C14786,1,0
C14787,1,0
C14791,1,0
C14793,1,0
C14792,1,0
C11714,1,0
C11713,1,0
C06205,1,0
C14784,1,0
C14783,1,0
C14785,1,0
C02617,1,0
C14040,1,0
C14802,1,0
C14800,1,0
C14803,1,0
C14804,1,0
C14805,1,0
C14806,1,0
C14801,1,0
C14788,1,0
C14789,1,0
C14815,1,0
C06314,1,0
C06315,1,0
C04805,1,0
C14808,1,0
C14809,1,0
C14810,1,0
C14811,1,0
C14812,1,0
C14748,1,0
C14781,1,0
C14813,1,0
C14782,1,0
C14814,1,0
C14749,1,0
C14820,1,0
C14771,1,0
C14821,1,0
C14770,1,0
C14769,1,0
C14768,1,0
C14823,1,0
C14778,1,0
C14825,1,0
C14826,1,0
C14762,1,0
C14765,1,0
C14831,1,0
C07354,1,0
C11036,1,0
C14839,1,0
C14717,1,0
C14840,1,0
C14847,1,0
C14848,1,0
C14844,1,0
C14842,1,0
C14453,1,0
C14841,1,0
C14845,1,0
C14843,1,0
C14846,1,0
C07535,1,0
C14849,1,0
C14850,1,0
C14851,1,0
C14852,1,0
C14855,1,0
C14856,1,0
C14853,1,0
C14556,1,0
C14854,1,0
C14039,1,0
C14858,1,0
C14857,1,0
C14859,1,0
C14861,1,0
C14865,1,0
C14864,1,0
C14863,1,0
C14860,1,0
C11148,1,0
C14868,1,0
C14867,1,0
C11150,1,0
C07490,1,0
C14775,1,0
C14774,1,0
C14773,1,0
C14772,1,0
C11088,1,0
C14870,1,0
C14874,1,0
C14871,1,0
C14875,1,0
C14829,1,0
C14828,1,0
C14862,1,0
C14899,1,0
C11818,1,0
C03043,1,0
C15509,1,0
C10422,1,0
C15511,1,0
C15510,1,0
C01701,1,0
C13550,1,0
C15518,1,0
C15519,1,0
C15520,1,0
C15524,1,0
C03226,1,0
C01967,1,0
C02483,1,0
C02477,1,0
C15530,1,0
C12092,1,0
C12093,1,0
C04145,1,0
C03885,1,0
C15567,1,0
C08585,1,0
C08584,1,0
C15606,1,0
C08276,1,0
C15610,1,0
C06341,1,0
C15650,1,0
C15651,1,0
C15666,1,0
C07756,1,0
C12312,1,0
C02273,1,0
C15699,1,0
C15700,1,0
C15767,1,0
C11130,1,0
C15769,1,0
C15770,1,0
C01789,1,0
C15784,1,0
C15785,1,0
C15786,1,0
C15789,1,0
C15790,1,0
C15795,1,0
C15796,1,0
C15798,1,0
C15802,1,0
C15803,1,0
C15794,1,0
C15787,1,0
C15809,1,0
C15788,1,0
C08830,1,0
C15776,1,0
C15782,1,0
C15783,1,0
C08821,1,0
C01753,1,0
C05442,1,0
C15777,1,0
C15780,1,0
C15808,1,0
C15816,1,0
C05103,1,0
C15882,1,0
C15883,1,0
C14151,1,0
C14152,1,0
C15778,1,0
C15986,1,0
C15987,1,0
C15859,1,0
C15860,1,0
C15870,1,0
C15874,1,0
C15877,1,0
C15878,1,0
C15879,1,0
C15881,1,0
C15884,1,0
C15885,1,0
C15886,1,0
C15887,1,0
C15888,1,0
C15892,1,0
C15898,1,0
C15900,1,0
C15902,1,0
C15903,1,0
C15905,1,0
C15908,1,0
C15911,1,0
C15971,1,0
C15976,1,0
C15974,1,0
C15978,1,0
C16028,1,0
C11388,1,0
C16075,1,0
C16074,1,0
C16143,1,0
C16142,1,0
C16141,1,0
C16144,1,0
C16145,1,0
C16149,1,0
C16155,1,0
C16153,1,0
C16154,1,0
C16181,1,0
C16182,1,0
C15926,1,0
C01825,1,0
C16186,1,0
C16193,1,0
C16196,1,0
C16194,1,0
C16198,1,0
C16199,1,0
C16205,1,0
C16206,1,0
C16207,1,0
C16212,1,0
C16214,1,0
C16210,1,0
C16201,1,0
C16202,1,0
C16204,1,0
C16209,1,0
C16215,1,0
C14315,1,0
C16203,1,0
C11430,1,0
C16232,1,0
C12123,1,0
C16233,1,0
C14314,1,0
C16195,1,0
C16197,1,0
C10216,1,0
C16191,1,0
C16190,1,0
C12125,1,0
C10200,1,0
C16234,1,0
C16235,1,0
C10509,1,0
C16222,1,0
C16188,1,0
C16189,1,0
C16187,1,0
C16225,1,0
C16223,1,0
C16224,1,0
C10522,1,0
C16226,1,0
C16227,1,0
C16229,1,0
C16228,1,0
C10502,1,0
C10538,1,0
C16231,1,0
C09126,1,0
C16192,1,0
C16216,1,0
C16217,1,0
C16218,1,0
C16238,1,0
C16243,1,0
C16244,1,0
C10520,1,0
C16248,1,0
C16246,1,0
C16249,1,0
C16247,1,0
C16253,1,0
C16252,1,0
C14450,1,0
C14419,1,0
C16262,1,0
C16263,1,0
C16264,1,0
C16266,1,0
C16268,1,0
C16269,1,0
C16272,1,0
C16273,1,0
C16281,1,0
C16283,1,0
C16285,1,0
C16276,1,0
C16277,1,0
C16279,1,0
C16280,1,0
C16291,1,0
C16340,1,0
C06427,1,0
C16321,1,0
C16324,1,0
C16325,1,0
C16320,1,0
C16322,1,0
C16323,1,0
C16311,1,0
C16310,1,0
C16309,1,0
C16297,1,0
C08725,1,0
C16349,1,0
C16350,1,0
C16312,1,0
C16351,1,0
C16288,1,0
C16289,1,0
C16301,1,0
C16290,1,0
C16327,1,0
C16328,1,0
C16329,1,0
C16330,1,0
C16331,1,0
C16332,1,0
C16333,1,0
C16334,1,0
C16335,1,0
C16336,1,0
C16337,1,0
C16338,1,0
C16339,1,0
C16317,1,0
C16299,1,0
C16352,1,0
C16353,1,0
C07480,1,0
C07481,1,0
C13747,1,0
C12138,1,0
C16367,1,0
C16368,1,0
C16369,1,0
C16370,1,0
C16371,1,0
C16372,1,0
C16168,1,0
C16374,1,0
C16375,1,0
C16376,1,0
C16169,1,0
C16358,1,0
C16359,1,0
C16313,1,0
C16151,1,0
C16152,1,0
C16172,1,0
C16387,1,0
C16388,1,0
C16389,1,0
C16173,1,0
C16357,1,0
C16356,1,0
C16360,1,0
C16355,1,0
C16361,1,0
C16362,1,0
C16364,1,0
C16363,1,0
C04226,1,0
C16159,1,0
C16390,1,0
C16404,1,0
C16405,1,0
C09827,1,0
C09826,1,0
C08578,1,0
C09614,1,0
C09751,1,0
C01378,1,0
C16415,1,0
C09736,1,0
C16416,1,0
C16407,1,0
C16409,1,0
C16408,1,0
C16410,1,0
C16391,1,0
C16392,1,0
C16402,1,0
C16403,1,0
C16394,1,0
C16413,1,0
C16396,1,0
C16420,1,0
C16393,1,0
C16412,1,0
C16411,1,0
C16395,1,0
C16397,1,0
C16414,1,0
C16432,1,0
C16441,1,0
C16449,1,0
C15545,1,0
C10028,1,0
C10044,1,0
C09871,1,0
C09847,1,0
C09849,1,0
C09848,1,0
C11386,1,0
C11384,1,0
C16461,1,0
C16462,1,0
C16464,1,0
C16466,1,0
C16470,1,0
C16468,1,0
C16469,1,0
C16471,1,0
C16465,1,0
C01920,1,0
C02359,1,0
C16482,1,0
C16481,1,0
C11272,1,0
C16483,1,0
C16484,1,0
C16473,1,0
C02364,1,0
C16478,1,0
C16479,1,0
C02371,1,0
C16480,1,0
C16472,1,0
C16475,1,0
C16474,1,0
C16476,1,0
C02802,1,0
C16477,1,0
C04900,1,0
C12632,1,0
C16492,1,0
C01460,1,0
C16509,1,0
C16493,1,0
C16496,1,0
C16503,1,0
C09694,1,0
C16504,1,0
C16505,1,0
C16506,1,0
C16519,1,0
C16517,1,0
C16516,1,0
C16524,1,0
C07394,1,0
C16833,1,0
C16523,1,0
C06425,1,0
C00510,1,0
C02050,1,0
C16162,1,0
C16165,1,0
C06429,1,0
C03035,1,0
C06426,1,0
C03595,1,0
C03242,1,0
C16528,1,0
C08281,1,0
C16529,1,0
C08320,1,0
C16530,1,0
C16526,1,0
C16531,1,0
C08316,1,0
C16532,1,0
C08323,1,0
C16166,1,0
C16513,1,0
C16180,1,0
C16525,1,0
C16170,1,0
C16527,1,0
C16179,1,0
C16522,1,0
C16521,1,0
C12650,1,0
C16635,1,0
C16834,1,0
C12739,1,0
C07649,1,0
C16637,1,0
C16630,1,0
C16631,1,0
C16632,1,0
C16633,1,0
C11736,1,0
C16634,1,0
C06837,1,0
C02380,1,0
C16621,1,0
C16613,1,0
C04646,1,0
C16615,1,0
C16618,1,0
C16617,1,0
C16619,1,0
C07648,1,0
C16620,1,0
C07054,1,0
C07585,1,0
C07447,1,0
C07446,1,0
C16622,1,0
C16623,1,0
C16624,1,0
C16625,1,0
C16641,1,0
C11173,1,0
C16836,1,0
C16543,1,0
C16837,1,0
C11376,1,0
C07108,1,0
C16545,1,0
C05011,1,0
C16546,1,0
C16547,1,0
C16544,1,0
C16645,1,0
C16533,1,0
C16549,1,0
C07888,1,0
C07644,1,0
C07647,1,0
C11583,1,0
C16551,1,0
C07646,1,0
C07047,1,0
C16553,1,0
C16556,1,0
C16559,1,0
C16558,1,0
C16554,1,0
C07073,1,0
C16560,1,0
C16561,1,0
C11004,1,0
C16647,1,0
C07501,1,0
C16584,1,0
C16582,1,0
C16586,1,0
C16591,1,0
C16596,1,0
C06868,1,0
C07496,1,0
C16602,1,0
C07495,1,0
C16603,1,0
C16606,1,0
C16604,1,0
C16605,1,0
C07492,1,0
C07493,1,0
C07185,1,0
C16648,1,0
C16649,1,0
C16650,1,0
C16651,1,0
C16656,1,0
C16655,1,0
C16652,1,0
C16653,1,0
C16654,1,0
C07572,1,0
C16612,1,0
C16608,1,0
C16609,1,0
C16610,1,0
C16567,1,0
C16566,1,0
C16564,1,0
C16563,1,0
C16568,1,0
C16565,1,0
C09621,1,0
C09684,1,0
C09704,1,0
C15493,1,0
C16679,1,0
C16680,1,0
C16677,1,0
C05842,1,0
C16671,1,0
C16702,1,0
C12162,1,0
C16703,1,0
C12173,1,0
C08526,1,0
C16707,1,0
C16708,1,0
C16709,1,0
C16710,1,0
C11250,1,0
C16713,1,0
C16714,1,0
C17621,1,0
C06892,1,0
C16829,1,0
C09629,1,0
C09699,1,0
C16286,1,0
C09672,1,0
C09723,1,0
C16848,1,0
C16850,1,0
C16849,1,0
C05797,1,0
C16999,1,0
C17010,1,0
C17017,1,0
C17138,1,0
C17203,1,0
C17210,1,0
C17212,1,0
C17211,1,0
C17214,1,0
C17215,1,0
C17216,1,0
C17218,1,0
C17219,1,0
C17220,1,0
C17222,1,0
C17223,1,0
C17224,1,0
C17226,1,0
C17227,1,0
C17228,1,0
C17230,1,0
C17231,1,0
C17232,1,0
C17237,1,0
C03719,1,0
C17235,1,0
C17236,1,0
C17238,1,0
C17239,1,0
C17240,1,0
C08426,1,0
C17255,1,0
C17213,1,0
C17241,1,0
C17242,1,0
C17243,1,0
C17244,1,0
C08412,1,0
C17217,1,0
C17245,1,0
C17248,1,0
C08409,1,0
C17221,1,0
C17246,1,0
C17225,1,0
C17249,1,0
C17229,1,0
C17251,1,0
C17233,1,0
C17253,1,0
C17277,1,0
C09666,1,0
C09665,1,0
C17328,1,0
C17326,1,0
C17327,1,0
C17331,1,0
C17332,1,0
C17336,1,0
C17337,1,0
C17333,1,0
C17335,1,0
C15613,1,0
C17343,1,0
C17345,1,0
C17346,1,0
C17432,1,0
C17570,1,0
C10385,1,0
C17592,1,0
C17591,1,0
C09581,1,0
C17744,1,0
C17747,1,0
C17745,1,0
C17748,1,0
C10462,1,0
C17740,1,0
C17741,1,0
C17743,1,0
C17742,1,0
C10443,1,0
C17752,1,0
C08538,1,0
C08537,1,0
C17759,1,0
C08542,1,0
C17751,1,0
C08540,1,0
C08539,1,0
C08552,1,0
C08565,1,0
C17753,1,0
C08543,1,0
C17754,1,0
C17755,1,0
C17756,1,0
C17757,1,0
C08557,1,0
C17758,1,0