<svg width="145" height="22" viewBox="0 0 145 22" fill="none" xmlns="http://www.w3.org/2000/svg">
<path d="M0.000358656 3.91147L3.95082 3.27437V7.39149H8.69918V10.6852H3.95082V15.5997C3.91808 16.291 4.06921 16.9786 4.38876 17.5921C4.58914 17.8632 4.85859 18.0754 5.16889 18.2063C5.47919 18.3372 5.81893 18.3822 6.15252 18.3364C6.59276 18.3351 7.03204 18.2952 7.46534 18.2172C7.88634 18.144 8.29946 18.031 8.69918 17.8796L9.2561 20.961C8.73895 21.1672 8.20722 21.3346 7.66532 21.4618C6.96011 21.6162 6.23932 21.6874 5.51761 21.6742C4.60516 21.7025 3.69587 21.5535 2.83997 21.2354C2.17955 20.9783 1.59481 20.5578 1.1402 20.0133C0.700062 19.457 0.395993 18.8052 0.252324 18.11C0.0782602 17.3028 -0.00624106 16.4787 0.000358656 15.6528V3.91147ZM11.9057 21.3647V1.3871L15.8562 0.75V7.44458C16.1907 7.33861 16.5317 7.2543 16.8771 7.19215C17.2747 7.1143 17.6788 7.07438 18.0839 7.07294C19.0462 7.0438 20.0051 7.20164 20.9075 7.53775C21.6105 7.81362 22.2304 8.26667 22.7073 8.85302C23.171 9.44661 23.4972 10.1361 23.6621 10.8715C23.8559 11.7258 23.9492 12.6 23.9401 13.476V21.3657H19.9976V13.9528C20.067 13.0241 19.898 12.093 19.5067 11.2482C19.3025 10.9647 19.0264 10.741 18.707 10.6001C18.3877 10.4592 18.0366 10.4063 17.69 10.4468C17.3564 10.445 17.0235 10.4762 16.6961 10.5399C16.3868 10.602 16.1085 10.6688 15.8612 10.7403V21.3647H11.9057ZM32.8529 18.6019C33.2415 18.6019 33.6128 18.5929 33.9667 18.5748C34.251 18.5638 34.5343 18.537 34.8156 18.4947V15.4895C34.6563 15.4541 34.4177 15.4187 34.0997 15.3833C33.8093 15.3496 33.5172 15.3318 33.2248 15.3302C32.8745 15.3288 32.5244 15.3508 32.177 15.3963C31.8778 15.4324 31.5866 15.5177 31.3151 15.6488C31.0802 15.7614 30.8791 15.9342 30.7322 16.1496C30.5825 16.3893 30.5086 16.6686 30.5202 16.951C30.4939 17.2026 30.5383 17.4565 30.6484 17.6841C30.7585 17.9117 30.9298 18.104 31.1431 18.2393C31.6724 18.5054 32.2613 18.6303 32.8529 18.6019ZM32.5349 7.01885C33.5224 6.9938 34.5073 7.12911 35.4515 7.41954C36.1586 7.64126 36.8006 8.03338 37.3213 8.56152C37.7969 9.07055 38.1385 9.69024 38.3151 10.3646C38.5176 11.136 38.6158 11.9312 38.6071 12.7287V20.964C38.0412 21.0882 37.2546 21.2344 36.2474 21.4027C35.0364 21.5858 33.8126 21.6702 32.5879 21.6552C31.7642 21.6629 30.942 21.5826 30.1353 21.4158C29.4573 21.2807 28.812 21.0146 28.2355 20.6324C27.7103 20.2753 27.2893 19.7847 27.0157 19.2109C26.7142 18.5349 26.5693 17.7993 26.5917 17.0592C26.5693 16.3373 26.7388 15.6224 27.0827 14.9876C27.3994 14.4325 27.8514 13.9669 28.3965 13.6343C28.9778 13.2849 29.6146 13.0379 30.2792 12.904C31.0026 12.752 31.7399 12.6764 32.4789 12.6786C32.9351 12.6757 33.391 12.6978 33.8448 12.7448C34.1715 12.7759 34.4952 12.8335 34.8126 12.9171V12.5454C34.8263 12.2479 34.7792 11.9507 34.6743 11.6721C34.5695 11.3934 34.409 11.139 34.2027 10.9246C33.6009 10.4537 32.8405 10.2347 32.081 10.3135C31.4154 10.3131 30.7507 10.362 30.0923 10.4598C29.5131 10.5383 28.9435 10.6763 28.3925 10.8715L27.8926 7.684C28.1225 7.61321 28.4098 7.53808 28.7544 7.45861C29.0991 7.37914 29.4747 7.30835 29.8813 7.24624C30.2879 7.18413 30.7165 7.13104 31.1671 7.08697C31.6177 7.04289 32.0737 7.02018 32.5349 7.01885ZM42.1866 7.86932C43.0414 7.63543 43.9096 7.45345 44.7863 7.32438C45.8915 7.15271 47.0084 7.06831 48.1268 7.07194C49.1326 7.04242 50.135 7.20002 51.0834 7.53674C51.8105 7.80428 52.4551 8.25772 52.9532 8.85202C53.4243 9.44315 53.7589 10.1314 53.933 10.8675C54.1361 11.7205 54.2341 12.5952 54.225 13.472V21.3617H50.2735V13.9488C50.3457 13.019 50.1733 12.0864 49.7736 11.2442C49.557 10.9575 49.2692 10.7326 48.9388 10.592C48.6085 10.4514 48.2472 10.4 47.8908 10.4428C47.6082 10.4428 47.3083 10.4561 46.991 10.4828C46.6737 10.5096 46.3907 10.5406 46.1421 10.576V21.3647H42.1866V7.86932ZM61.755 12.4382C62.1436 12.0135 62.5459 11.5707 62.9618 11.1099C63.3777 10.6491 63.78 10.193 64.1686 9.74156C64.5573 9.29011 64.9239 8.8607 65.2685 8.45333C65.6131 8.04596 65.9091 7.69168 66.1564 7.39049H70.8497C69.9125 8.47103 68.9976 9.50248 68.1051 10.4848C67.2125 11.4672 66.236 12.481 65.1755 13.5261C65.7601 14.0606 66.3092 14.6328 66.8193 15.2391C67.3852 15.9029 67.9331 16.5891 68.4631 17.2976C68.993 18.0062 69.4792 18.7148 69.9219 19.4233C70.3638 20.1319 70.7351 20.7783 71.0357 21.3627H66.5013C66.2187 20.9019 65.8961 20.3927 65.5334 19.835C65.1708 19.2774 64.7862 18.7194 64.3796 18.1611C63.973 17.6035 63.5444 17.0692 63.0938 16.5584C62.6861 16.0862 62.2381 15.6504 61.755 15.2561V21.3667H57.8035V1.3871L61.755 0.75V12.4382ZM90.617 14.3736C90.6109 13.4 90.7771 12.4331 91.108 11.5176C91.416 10.6453 91.9015 9.8466 92.5337 9.17204C93.1658 8.49748 93.9309 7.96178 94.7805 7.59885C95.7363 7.19509 96.7659 6.99616 97.8031 7.01484C98.4888 7.00955 99.1731 7.0767 99.8448 7.21519C100.461 7.34787 101.064 7.53906 101.645 7.78618L100.823 10.9476C100.424 10.7978 100.017 10.6736 99.6028 10.576C99.1158 10.4648 98.6175 10.4114 98.118 10.4167C97.6279 10.38 97.1361 10.4595 96.6824 10.6487C96.2287 10.8378 95.8258 11.1314 95.5064 11.5056C94.9005 12.3348 94.5973 13.3472 94.6475 14.3736C94.5833 15.4108 94.8681 16.4397 95.4564 17.2956C95.8157 17.6744 96.2574 17.9649 96.7472 18.1446C97.237 18.3243 97.7615 18.3882 98.28 18.3314C98.7953 18.3281 99.3095 18.2835 99.8178 18.1982C100.336 18.1198 100.844 17.9792 101.329 17.7795L101.886 21.0201C101.328 21.2425 100.751 21.4103 100.162 21.5209C99.4106 21.6685 98.6465 21.7396 97.881 21.7333C96.7585 21.7603 95.6415 21.5663 94.5935 21.1623C93.7315 20.8207 92.9569 20.2898 92.3268 19.6086C91.7269 18.9401 91.2829 18.1463 91.027 17.2846C90.746 16.3402 90.6079 15.359 90.617 14.3736ZM109.867 18.5979C110.256 18.5979 110.627 18.5889 110.981 18.5708C111.265 18.5598 111.549 18.533 111.83 18.4907V15.4855C111.671 15.4501 111.432 15.4147 111.114 15.3793C110.824 15.3456 110.532 15.3278 110.239 15.3262C109.889 15.3248 109.539 15.3468 109.192 15.3923C108.892 15.4284 108.601 15.5137 108.33 15.6448C108.095 15.7574 107.894 15.9302 107.747 16.1456C107.597 16.3853 107.523 16.6646 107.535 16.947C107.508 17.1986 107.553 17.4525 107.663 17.6801C107.773 17.9077 107.944 18.1 108.158 18.2353C108.687 18.5028 109.276 18.6291 109.867 18.6019V18.5979ZM109.549 7.01584C110.537 6.99079 111.522 7.12611 112.466 7.41654C113.173 7.63825 113.815 8.03037 114.336 8.55851C114.811 9.06754 115.153 9.68723 115.33 10.3616C115.532 11.133 115.63 11.9282 115.622 12.7257V20.961C115.056 21.0852 114.269 21.2314 113.262 21.3997C112.051 21.5828 110.827 21.6672 109.602 21.6522C108.779 21.6599 107.957 21.5796 107.15 21.4128C106.472 21.2777 105.827 21.0116 105.25 20.6294C104.725 20.2723 104.304 19.7817 104.03 19.2079C103.729 18.5319 103.584 17.7963 103.606 17.0562C103.584 16.3343 103.753 15.6194 104.097 14.9846C104.414 14.4293 104.865 13.9633 105.41 13.6303C105.991 13.2809 106.628 13.0339 107.293 12.9C108.016 12.748 108.753 12.6724 109.492 12.6746C109.949 12.6717 110.405 12.6938 110.858 12.7407C111.185 12.7719 111.509 12.8295 111.826 12.913V12.5414C111.84 12.2439 111.793 11.9467 111.688 11.668C111.583 11.3894 111.423 11.135 111.216 10.9206C110.614 10.4497 109.854 10.2307 109.095 10.3095C108.429 10.3091 107.764 10.358 107.106 10.4558C106.527 10.5343 105.957 10.6723 105.406 10.8675L104.906 7.67999C105.136 7.6092 105.423 7.53407 105.768 7.4546C106.113 7.37513 106.488 7.30434 106.895 7.24223C107.301 7.18013 107.73 7.12704 108.181 7.08296C108.631 7.03888 109.087 7.01751 109.548 7.01885L109.549 7.01584ZM123.205 18.5187C123.726 18.5507 124.249 18.4785 124.742 18.3064C124.893 18.2318 125.016 18.1128 125.097 17.9656C125.178 17.8184 125.211 17.6499 125.193 17.483C125.179 17.3042 125.118 17.1325 125.015 16.9855C124.913 16.8384 124.773 16.7214 124.61 16.6465C124.043 16.3246 123.449 16.0534 122.834 15.8361C122.261 15.6254 121.699 15.3861 121.15 15.1189C120.677 14.8924 120.243 14.5922 119.864 14.2293C119.507 13.8793 119.227 13.4586 119.042 12.9942C118.835 12.4427 118.736 11.8563 118.75 11.2672C118.728 10.6704 118.849 10.077 119.102 9.53667C119.356 8.99634 119.736 8.52487 120.209 8.16183C121.376 7.3417 122.785 6.93941 124.208 7.01985C125.027 7.01689 125.844 7.09237 126.648 7.24524C127.279 7.35639 127.9 7.52093 128.504 7.73709L127.815 10.8184C127.323 10.65 126.822 10.5082 126.315 10.3937C125.718 10.2635 125.109 10.201 124.498 10.2074C123.261 10.2074 122.643 10.5526 122.643 11.2432C122.64 11.3887 122.667 11.5332 122.723 11.6679C122.795 11.8139 122.904 11.9377 123.041 12.0265C123.246 12.1685 123.464 12.2928 123.691 12.3982C123.965 12.5317 124.313 12.678 124.737 12.8369C125.475 13.0987 126.193 13.4137 126.885 13.7795C127.384 14.039 127.837 14.3803 128.224 14.7893C128.541 15.1355 128.777 15.5487 128.913 15.9984C129.054 16.4995 129.121 17.0185 129.113 17.5391C129.146 18.1512 129.021 18.7615 128.749 19.3108C128.478 19.8601 128.068 20.3295 127.562 20.6735C126.238 21.4578 124.709 21.8279 123.174 21.7363C122.135 21.758 121.098 21.651 120.085 21.4178C119.503 21.2819 118.932 21.1045 118.375 20.8868L119.038 17.6723C119.709 17.9376 120.401 18.1463 121.106 18.2964C121.796 18.445 122.499 18.5206 123.205 18.5218V18.5187ZM132.06 21.3617V1.3871L136.011 0.75V7.44458C136.345 7.33861 136.686 7.25429 137.032 7.19215C137.429 7.1143 137.833 7.07438 138.239 7.07294C139.201 7.0438 140.16 7.20164 141.062 7.53775C141.765 7.81362 142.385 8.26667 142.862 8.85302C143.326 9.44661 143.652 10.1361 143.817 10.8715C144.011 11.7259 144.104 12.6 144.095 13.476V21.3657H140.144V13.9528C140.214 13.0241 140.045 12.093 139.653 11.2482C139.449 10.9647 139.173 10.741 138.854 10.6001C138.534 10.4592 138.183 10.4063 137.837 10.4468C137.503 10.445 137.17 10.4762 136.843 10.5399C136.533 10.602 136.255 10.6688 136.008 10.7403V21.3647L132.06 21.3617Z" fill="#B11A83"/>
<path d="M80.6116 21.7485C79.3524 21.7773 78.1195 21.3878 77.1085 20.6418C76.0606 19.8182 75.2735 18.7125 74.8413 17.4566C74.2831 15.8781 74.0158 14.2127 74.0521 12.54C74.04 10.4223 74.3125 8.31236 74.8625 6.26622L79.2186 7.31151C79.0755 7.99276 78.9673 8.68079 78.8945 9.37294C78.8134 10.1168 78.7256 11.0584 78.6311 12.198L78.5703 12.7815C78.5703 16.0793 79.2521 17.7283 80.6156 17.7283C81.9522 17.7283 82.6205 16.1129 82.6205 12.8821C82.5916 12.0386 82.5036 11.1982 82.3571 10.3669C82.1904 9.28303 81.9673 8.20845 81.6885 7.14753L85.9807 5.94025C86.7367 8.17595 87.0996 10.5242 87.0536 12.8821C87.0877 14.4824 86.8201 16.0749 86.2644 17.5774C85.8242 18.7938 85.0492 19.8631 84.0276 20.664C83.0429 21.3943 81.8403 21.7761 80.6116 21.7485ZM80.567 6.38996C80.105 6.38996 79.6533 6.2539 79.2691 5.99897C78.885 5.74405 78.5856 5.38172 78.4087 4.9578C78.2319 4.53388 78.1857 4.06741 78.2758 3.61738C78.3659 3.16734 78.5884 2.75396 78.9151 2.42951C79.2418 2.10505 79.6581 1.8841 80.1113 1.79458C80.5644 1.70506 81.0341 1.75101 81.461 1.9266C81.8879 2.10219 82.2527 2.39955 82.5094 2.78107C82.7661 3.16259 82.9031 3.61113 82.9031 4.06998C82.9031 4.68528 82.657 5.27537 82.2189 5.71045C81.7808 6.14554 81.1866 6.38996 80.567 6.38996ZM80.567 5.1525C80.7826 5.1525 80.9933 5.08902 81.1726 4.97007C81.3519 4.85112 81.4916 4.68205 81.5741 4.48424C81.6566 4.28644 81.6782 4.06878 81.6361 3.85879C81.594 3.6488 81.4902 3.45592 81.3378 3.30452C81.1853 3.15313 80.9911 3.05003 80.7797 3.00826C80.5682 2.96649 80.349 2.98793 80.1499 3.06986C79.9507 3.15179 79.7804 3.29054 79.6607 3.46856C79.5409 3.64658 79.477 3.85588 79.477 4.06998C79.477 4.35708 79.5918 4.63243 79.7962 4.83544C80.0006 5.03845 80.2779 5.1525 80.567 5.1525Z" fill="#B11A83"/>
</svg>
