<svg width="18" height="18" viewBox="0 0 18 18" fill="none" xmlns="http://www.w3.org/2000/svg">
<path d="M15.4019 9V17.0004H2.59961V9" stroke="white" stroke-width="1.4" stroke-linecap="round" stroke-linejoin="round"/>
<path d="M16.9984 5H1V8.99942H16.9984V5Z" stroke="white" stroke-width="1.4" stroke-linecap="round" stroke-linejoin="round"/>
<path d="M8.99902 16.999V5" stroke="white" stroke-width="1.4" stroke-linecap="round" stroke-linejoin="round"/>
<path d="M8.99885 4.99942H5.39914C4.87561 4.98909 4.37701 4.77387 4.01042 4.39998C3.64382 4.02608 3.43848 3.52334 3.43848 2.99971C3.43848 2.47608 3.64382 1.97333 4.01042 1.59944C4.37701 1.22554 4.87561 1.01032 5.39914 1C8.19943 1 8.99885 4.99942 8.99885 4.99942Z" stroke="white" stroke-width="1.4" stroke-linecap="round" stroke-linejoin="round"/>
<path d="M8.99951 4.99942H12.5992C13.1227 4.98909 13.6213 4.77387 13.9879 4.39998C14.3545 4.02608 14.5599 3.52334 14.5599 2.99971C14.5599 2.47608 14.3545 1.97333 13.9879 1.59944C13.6213 1.22554 13.1227 1.01032 12.5992 1C9.79893 1 8.99951 4.99942 8.99951 4.99942Z" stroke="white" stroke-width="1.4" stroke-linecap="round" stroke-linejoin="round"/>
</svg>