<svg width="148" height="22" viewBox="0 0 148 22" fill="none" xmlns="http://www.w3.org/2000/svg">
<path d="M82.8606 21.989C81.4986 21.989 80.3205 21.6149 79.3262 20.8666C78.3319 20.1184 77.5692 19.0402 77.038 17.6321C76.5068 16.2241 76.2412 14.5609 76.2412 12.6427C76.2412 10.3979 76.5136 8.27561 77.0584 6.27573L81.4509 7.33688C81.3147 7.9763 81.2058 8.67353 81.1241 9.42859C81.0423 10.1836 80.9538 11.1394 80.8585 12.2958L80.7972 12.8876C80.7972 16.2343 81.485 17.9076 82.8606 17.9076C84.209 17.9076 84.8832 16.2683 84.8832 12.9896C84.8832 12.4318 84.7947 11.5815 84.6176 10.4387C84.4406 9.29594 84.2158 8.20758 83.9434 7.17363L88.2747 5.94922C88.9965 7.96271 89.3575 10.3095 89.3575 12.9896C89.3575 14.8126 89.0919 16.4009 88.5607 17.7546C88.0295 19.1082 87.277 20.1524 86.3031 20.887C85.3293 21.6217 84.1818 21.989 82.8606 21.989Z" fill="#A42F80"/>
<path d="M82.8153 6.40141C81.5134 6.40141 80.458 5.34721 80.458 4.04678C80.458 2.74635 81.5134 1.69214 82.8153 1.69214C84.1173 1.69214 85.1727 2.74635 85.1727 4.04678C85.1727 5.34721 84.1173 6.40141 82.8153 6.40141ZM82.8153 5.14561C83.4229 5.14561 83.9154 4.65364 83.9154 4.04678C83.9154 3.43991 83.4229 2.94795 82.8153 2.94795C82.2078 2.94795 81.7153 3.43991 81.7153 4.04678C81.7153 4.65364 82.2078 5.14561 82.8153 5.14561Z" fill="#A42F80"/>
<path d="M0.0673828 3.36424L4.10648 2.7144V6.91132H8.95882V10.2689H4.10648V15.2781C4.10648 16.1265 4.25558 16.8034 4.55376 17.3089C4.85195 17.8143 5.45284 18.067 6.35645 18.067C6.79018 18.067 7.23746 18.0264 7.6983 17.9452C8.15914 17.8639 8.57931 17.7511 8.95882 17.6067L9.52809 20.7476C9.04014 20.9462 8.49799 21.1177 7.90161 21.2621C7.30523 21.4065 6.57332 21.4787 5.70586 21.4787C4.60346 21.4787 3.69083 21.3298 2.96794 21.0319C2.24506 20.7341 1.66676 20.3189 1.23303 19.7864C0.799298 19.2539 0.496594 18.6086 0.324909 17.8504C0.153224 17.0922 0.0673828 16.2529 0.0673828 15.3322V3.36424ZM12.2389 21.1538V0.791936L16.278 0.14209V6.96548C16.5491 6.87522 16.897 6.78947 17.3217 6.70824C17.7464 6.62701 18.1575 6.5864 18.5551 6.5864C19.7117 6.5864 20.674 6.74434 21.4421 7.06024C22.2101 7.37614 22.8246 7.82291 23.2854 8.40055C23.7463 8.9782 24.0716 9.66414 24.2613 10.4584C24.4511 11.2527 24.546 12.1372 24.546 13.1119V21.1538H20.5069V13.5993C20.5069 12.2996 20.3397 11.379 20.0054 10.8375C19.671 10.2959 19.0521 10.0252 18.1485 10.0252C17.787 10.0252 17.4482 10.0568 17.1319 10.1199C16.8156 10.1831 16.531 10.2508 16.278 10.323V21.1538H12.2389ZM33.6543 18.3378C34.0518 18.3378 34.4314 18.3288 34.7928 18.3107C35.1542 18.2927 35.4434 18.2656 35.6603 18.2295V15.1698C35.4976 15.1337 35.2536 15.0976 34.9283 15.0615C34.603 15.0254 34.3048 15.0073 34.0338 15.0073C33.6543 15.0073 33.2973 15.0299 32.963 15.075C32.6287 15.1201 32.335 15.2059 32.082 15.3322C31.829 15.4586 31.6302 15.6301 31.4856 15.8467C31.341 16.0633 31.2687 16.3341 31.2687 16.659C31.2687 17.2908 31.4811 17.7286 31.9058 17.9722C32.3305 18.2159 32.9133 18.3378 33.6543 18.3378ZM33.329 6.53224C34.5217 6.53224 35.5157 6.66763 36.3108 6.9384C37.106 7.20917 37.743 7.59727 38.222 8.10271C38.7009 8.60814 39.0397 9.22188 39.2385 9.94394C39.4373 10.666 39.5367 11.4693 39.5367 12.3538V20.7476C38.9584 20.874 38.1542 21.0229 37.1241 21.1944C36.094 21.3659 34.847 21.4516 33.3832 21.4516C32.4615 21.4516 31.6257 21.3704 30.8757 21.2079C30.1257 21.0455 29.4796 20.7792 28.9375 20.4092C28.3953 20.0391 27.9796 19.5562 27.6905 18.9606C27.4013 18.3649 27.2568 17.6338 27.2568 16.7673C27.2568 15.937 27.4239 15.233 27.7583 14.6553C28.0926 14.0777 28.5399 13.6174 29.1001 13.2744C29.6603 12.9314 30.3019 12.6832 31.0248 12.5298C31.7477 12.3763 32.4976 12.2996 33.2747 12.2996C33.7988 12.2996 34.2642 12.3222 34.6708 12.3673C35.0774 12.4124 35.4072 12.4711 35.6603 12.5433V12.1642C35.6603 11.4783 35.4524 10.9277 35.0368 10.5126C34.6211 10.0974 33.8982 9.88978 32.8681 9.88978C32.1814 9.88978 31.5037 9.93942 30.835 10.0387C30.1663 10.138 29.5881 10.2779 29.1001 10.4584L28.585 7.20917C28.82 7.13696 29.1137 7.06024 29.4661 6.97901C29.8185 6.89778 30.2025 6.82558 30.6182 6.7624C31.0338 6.69922 31.4721 6.64506 31.9329 6.59994C32.3937 6.55481 32.8591 6.53224 33.329 6.53224ZM43.1963 7.39871C43.883 7.20014 44.7685 7.01512 45.8529 6.84363C46.9372 6.67214 48.0757 6.5864 49.2685 6.5864C50.4793 6.5864 51.4868 6.74434 52.291 7.06024C53.0952 7.37614 53.7323 7.82291 54.2022 8.40055C54.672 8.9782 55.0064 9.66414 55.2052 10.4584C55.4039 11.2527 55.5033 12.1372 55.5033 13.1119V21.1538H51.4642V13.5993C51.4642 12.2996 51.2926 11.379 50.9492 10.8375C50.6058 10.2959 49.9643 10.0252 49.0245 10.0252C48.7354 10.0252 48.4281 10.0387 48.1028 10.0658C47.7775 10.0929 47.4884 10.1244 47.2354 10.1606V21.1538H43.1963V7.39871ZM63.202 12.0559C63.5996 11.6227 64.0108 11.1714 64.4354 10.7021C64.8601 10.2328 65.2713 9.76794 65.6689 9.30763C66.0664 8.84732 66.4414 8.40958 66.7938 7.9944C67.1462 7.57922 67.449 7.21819 67.702 6.91132H72.5001C71.5423 8.01245 70.607 9.06393 69.6944 10.0658C68.7818 11.0676 67.7833 12.1011 66.699 13.1661C67.2411 13.6535 67.8014 14.2356 68.3797 14.9126C68.958 15.5895 69.5182 16.289 70.0604 17.011C70.6025 17.7331 71.0995 18.4551 71.5513 19.1772C72.0031 19.8992 72.3826 20.5581 72.6898 21.1538H68.0544C67.7652 20.6844 67.4354 20.1655 67.0649 19.5969C66.6944 19.0282 66.3014 18.4596 65.8857 17.891C65.4701 17.3224 65.0318 16.7764 64.571 16.2529C64.1101 15.7294 63.6538 15.2871 63.202 14.9261V21.1538H59.1629V0.791936L63.202 0.14209V12.0559Z" fill="#3F2960"/>
<path d="M92.709 14.0326C92.709 13.0036 92.8761 12.0334 93.2105 11.1218C93.5448 10.2102 94.0282 9.41594 94.6608 8.73901C95.2933 8.06209 96.0613 7.52507 96.9649 7.12794C97.8685 6.73081 98.8986 6.53224 100.055 6.53224C100.814 6.53224 101.51 6.59994 102.143 6.73532C102.775 6.87071 103.39 7.06475 103.986 7.31747L103.146 10.5396C102.766 10.3952 102.35 10.2689 101.899 10.1606C101.447 10.0522 100.941 9.99809 100.381 9.99809C99.1878 9.99809 98.2978 10.3681 97.7104 11.1082C97.1231 11.8484 96.8294 12.8231 96.8294 14.0326C96.8294 15.3142 97.105 16.307 97.6562 17.011C98.2074 17.715 99.1697 18.067 100.543 18.067C101.031 18.067 101.555 18.0219 102.115 17.9316C102.676 17.8414 103.191 17.697 103.661 17.4984L104.23 20.8018C103.76 21.0003 103.173 21.1718 102.468 21.3162C101.763 21.4607 100.986 21.5329 100.137 21.5329C98.8354 21.5329 97.7149 21.3388 96.7752 20.9507C95.8354 20.5626 95.0629 20.0346 94.4574 19.3667C93.852 18.6988 93.4093 17.9091 93.1292 16.9975C92.849 16.0859 92.709 15.0976 92.709 14.0326ZM112.389 18.3378C112.787 18.3378 113.167 18.3288 113.528 18.3107C113.889 18.2927 114.179 18.2656 114.395 18.2295V15.1698C114.233 15.1337 113.989 15.0976 113.663 15.0615C113.338 15.0254 113.04 15.0073 112.769 15.0073C112.389 15.0073 112.033 15.0299 111.698 15.075C111.364 15.1201 111.07 15.2059 110.817 15.3322C110.564 15.4586 110.365 15.6301 110.221 15.8467C110.076 16.0633 110.004 16.3341 110.004 16.659C110.004 17.2908 110.216 17.7285 110.641 17.9722C111.066 18.2159 111.648 18.3378 112.389 18.3378ZM112.064 6.53224C113.257 6.53224 114.251 6.66763 115.046 6.9384C115.841 7.20917 116.478 7.59727 116.957 8.10271C117.436 8.60814 117.775 9.22188 117.974 9.94394C118.172 10.666 118.272 11.4693 118.272 12.3538V20.7476C117.694 20.874 116.889 21.0229 115.859 21.1944C114.829 21.3659 113.582 21.4516 112.118 21.4516C111.197 21.4516 110.361 21.3704 109.611 21.2079C108.861 21.0455 108.215 20.7792 107.673 20.4092C107.13 20.0391 106.715 19.5562 106.426 18.9606C106.137 18.3649 105.992 17.6338 105.992 16.7673C105.992 15.937 106.159 15.233 106.493 14.6553C106.828 14.0777 107.275 13.6174 107.835 13.2744C108.396 12.9314 109.037 12.6832 109.76 12.5298C110.483 12.3763 111.233 12.2996 112.01 12.2996C112.534 12.2996 112.999 12.3222 113.406 12.3673C113.813 12.4124 114.142 12.4711 114.395 12.5433V12.1642C114.395 11.4783 114.188 10.9277 113.772 10.5126C113.356 10.0974 112.633 9.88978 111.603 9.88978C110.917 9.88978 110.239 9.93942 109.57 10.0387C108.902 10.138 108.323 10.2779 107.835 10.4584L107.32 7.20917C107.555 7.13696 107.849 7.06024 108.201 6.97901C108.554 6.89778 108.938 6.82558 109.353 6.7624C109.769 6.69922 110.207 6.64506 110.668 6.59994C111.129 6.55481 111.594 6.53224 112.064 6.53224ZM126.025 18.2566C126.766 18.2566 127.29 18.1843 127.597 18.0399C127.904 17.8955 128.058 17.6157 128.058 17.2006C128.058 16.8756 127.859 16.5913 127.461 16.3476C127.064 16.1039 126.459 15.8287 125.645 15.5218C125.013 15.2871 124.439 15.0434 123.924 14.7907C123.409 14.538 122.971 14.2356 122.609 13.8836C122.248 13.5316 121.968 13.1119 121.769 12.6246C121.57 12.1372 121.471 11.5505 121.471 10.8646C121.471 9.52875 121.968 8.47276 122.962 7.69655C123.956 6.92034 125.32 6.53224 127.055 6.53224C127.922 6.53224 128.754 6.60896 129.549 6.7624C130.344 6.91583 130.977 7.08281 131.446 7.26332L130.742 10.4042C130.272 10.2418 129.761 10.0974 129.21 9.97101C128.659 9.84465 128.04 9.78148 127.353 9.78148C126.088 9.78148 125.455 10.1335 125.455 10.8375C125.455 10.9999 125.483 11.1443 125.537 11.2707C125.591 11.3971 125.699 11.5189 125.862 11.6362C126.025 11.7536 126.246 11.8799 126.526 12.0153C126.806 12.1507 127.163 12.2996 127.597 12.4621C128.483 12.787 129.214 13.1074 129.793 13.4233C130.371 13.7392 130.827 14.0822 131.162 14.4522C131.496 14.8223 131.731 15.233 131.867 15.6842C132.002 16.1355 132.07 16.659 132.07 17.2547C132.07 18.6627 131.541 19.7277 130.484 20.4498C129.427 21.1718 127.931 21.5329 125.998 21.5329C124.733 21.5329 123.68 21.4246 122.84 21.2079C121.999 20.9913 121.416 20.8108 121.091 20.6664L121.769 17.3901C122.456 17.6609 123.16 17.873 123.883 18.0264C124.606 18.1798 125.32 18.2566 126.025 18.2566ZM135.079 21.1538V0.791936L139.118 0.14209V6.96547C139.389 6.87522 139.737 6.78947 140.162 6.70824C140.586 6.62701 140.997 6.5864 141.395 6.5864C142.552 6.5864 143.514 6.74434 144.282 7.06024C145.05 7.37614 145.665 7.82291 146.125 8.40055C146.586 8.9782 146.912 9.66414 147.101 10.4584C147.291 11.2527 147.386 12.1372 147.386 13.1119V21.1538H143.347V13.5993C143.347 12.2996 143.18 11.379 142.845 10.8375C142.511 10.2959 141.892 10.0252 140.988 10.0252C140.627 10.0252 140.288 10.0568 139.972 10.1199C139.656 10.1831 139.371 10.2508 139.118 10.323V21.1538H135.079Z" fill="#3F2960"/>
</svg>
