{
  "products": [
    {
      "id": 1,
      "name": "Computers",
      "price": 4300,
      "quantity": 600,
      "selected": true,
      "available": true
    },
    {
      "id": 2,
      "name": "Printer",
      "price": 300,
      "quantity": 100,
      "selected": true,
      "available": true
    },
    {
      "id": 3,
      "name": "Smartphone",
      "price": 1300,
      "quantity": 100,
      "selected": true,
      "available": true
    },
    {
      "name": "Samsung",
      "price": "10000",
      "quantity": "100",
      "selected": true,
      "available": true,
      "id": 5
    },
    {
      "id": 6,
      "name": "Samsung Galaxy S21",
      "price": "100000",
      "quantity": "100",
      "selected": true,
      "available": true
    }
  ]
}