<svg width="17" height="17" viewBox="0 0 17 17" fill="none" xmlns="http://www.w3.org/2000/svg">
<path d="M15.6903 10.6148C15.4565 10.6148 15.2669 10.8044 15.2669 11.0382V14.7974C15.2661 15.4987 14.698 16.0669 13.9968 16.0676H2.11694C1.4157 16.0669 0.847603 15.4987 0.846776 14.7974V3.76437C0.847603 3.0633 1.4157 2.49503 2.11694 2.49421H5.87616C6.11002 2.49421 6.29955 2.30467 6.29955 2.07082C6.29955 1.83713 6.11002 1.64743 5.87616 1.64743H2.11694C0.948323 1.64875 0.00132309 2.59575 0 3.76437V14.7976C0.00132309 15.9662 0.948323 16.9132 2.11694 16.9145H13.9968C15.1654 16.9132 16.1124 15.9662 16.1137 14.7976V11.0382C16.1137 10.8044 15.9242 10.6148 15.6903 10.6148Z" fill="#67BFFF"/>
<path d="M15.946 0.558054C15.2019 -0.186018 13.9956 -0.186018 13.2515 0.558054L5.69798 8.11156C5.64622 8.16333 5.60884 8.2275 5.58933 8.29795L4.59602 11.884C4.55517 12.031 4.59668 12.1885 4.70451 12.2965C4.81251 12.4043 4.96995 12.4458 5.11698 12.4051L8.70305 11.4117C8.7735 11.3922 8.83767 11.3548 8.88944 11.303L16.4428 3.74934C17.1857 3.00477 17.1857 1.79944 16.4428 1.05487L15.946 0.558054ZM6.62051 8.38676L12.8025 2.20464L14.7962 4.19836L8.61407 10.3805L6.62051 8.38676ZM6.22226 9.18591L7.81509 10.7789L5.61182 11.3893L6.22226 9.18591ZM15.8441 3.15064L15.3951 3.59967L13.4012 1.60577L13.8504 1.15675C14.2637 0.743451 14.9338 0.743451 15.3471 1.15675L15.8441 1.65357C16.2567 2.06737 16.2567 2.73701 15.8441 3.15064Z" fill="#67BFFF"/>
</svg>
