<?xml version="1.0" encoding="UTF-8"?>
<svg width="132px" height="127px" viewBox="0 0 132 127" version="1.1" xmlns="http://www.w3.org/2000/svg" xmlns:xlink="http://www.w3.org/1999/xlink">
    <!-- Generator: Sketch 58 (84663) - https://sketch.com -->
    <title>ic-user_subscriptions</title>
    <desc>Created with Sketch.</desc>
    <defs>
        <linearGradient x1="0%" y1="3.71613866%" x2="100%" y2="96.2838613%" id="linearGradient-1">
            <stop stop-color="#38B8F2" offset="0%"></stop>
            <stop stop-color="#843CF6" offset="100%"></stop>
        </linearGradient>
    </defs>
    <g id="Pages" stroke="none" stroke-width="1" fill="none" fill-rule="evenodd">
        <g id="D_01-Home" transform="translate(-274.000000, -1626.000000)" fill="url(#linearGradient-1)">
            <path d="M356.778589,1661.23686 C362.320724,1661.23686 366.831415,1665.67435 366.980232,1671.20444 L366.984023,1671.48656 L366.984,1703.956 L393.61895,1703.95662 C400.354543,1703.95662 405.834237,1709.35911 405.996309,1716.08476 L406,1716.39137 L406,1751.49652 C406,1752.27803 405.406308,1752.92026 404.647186,1752.99312 L404.503017,1753 L386.898492,1753 C383.552506,1753 380.826564,1750.33691 380.707063,1747.00669 L380.702977,1746.77862 L380.702977,1746.41077 C380.702977,1740.52373 376.026726,1735.73251 370.201135,1735.57949 L369.913719,1735.57572 L310.086281,1735.57572 C304.223954,1735.57572 299.453149,1740.27199 299.300777,1746.12214 L299.297023,1746.41077 L299.297023,1746.77862 C299.297023,1750.13813 296.645435,1752.87588 293.328659,1752.9959 L293.101508,1753 L275.496983,1753 C274.718855,1753 274.079391,1752.40373 274.006853,1751.64132 L274,1751.49652 L274,1716.39137 C274,1709.62624 279.378508,1704.12309 286.075737,1703.96033 L286.38105,1703.95662 L313.015,1703.956 L313.015777,1671.48656 C313.015777,1665.92021 317.434274,1661.39013 322.941271,1661.24067 L323.22221,1661.23686 L356.778589,1661.23686 Z M393.61895,1706.96357 L286.38105,1706.96357 C281.287253,1706.96357 277.141719,1711.03759 276.99783,1716.11824 L276.993967,1716.39137 L276.993967,1749.99305 L293.101508,1749.99305 C294.809034,1749.99305 296.203827,1748.65134 296.297989,1746.96101 L296.303056,1746.77862 L296.303056,1746.41077 C296.303056,1738.87121 302.306447,1732.73884 309.774285,1732.57224 L310.086281,1732.56877 L369.913719,1732.56877 C377.421361,1732.56877 383.527597,1738.59786 383.693482,1746.09745 L383.696944,1746.41077 L383.696944,1746.77862 C383.696944,1748.49258 385.032857,1749.89339 386.716785,1749.98796 L386.898492,1749.99305 L403.006033,1749.99305 L403.006033,1716.39137 C403.006033,1711.18476 398.803076,1706.96357 393.61895,1706.96357 Z M393.619149,1711.4742 C396.318709,1711.4742 398.515283,1713.6803 398.515283,1716.39257 L398.515283,1716.39257 L398.515283,1720.22744 L281.484118,1720.22744 L281.484118,1716.39257 C281.484118,1713.6803 283.68169,1711.4742 286.38125,1711.4742 L286.38125,1711.4742 Z M338.502,1664.243 L323.22221,1664.24381 C319.320086,1664.24381 316.141856,1667.3556 316.013758,1671.24263 L316.009744,1671.48656 L316.009,1703.956 L323.886,1703.956 L323.886371,1681.80772 C323.886371,1681.02621 324.480063,1680.38398 325.239185,1680.31112 L325.383355,1680.30424 C326.161483,1680.30424 326.800947,1680.90051 326.873485,1681.66292 L326.880338,1681.80772 L326.88,1703.956 L352.73,1703.956 L352.730646,1681.80772 C352.730646,1681.07506 353.252445,1680.4648 353.943167,1680.33135 L354.08346,1680.31112 L354.227629,1680.30424 C355.005757,1680.30424 355.645221,1680.90051 355.71776,1681.66292 L355.724613,1681.80772 L355.724,1703.956 L363.99,1703.956 L363.990056,1671.48656 C363.990056,1667.56837 360.891584,1664.37649 357.021455,1664.24784 L356.778589,1664.24381 L341.496,1664.243 L341.496484,1678.32527 C341.496484,1679.10677 340.902793,1679.74901 340.14367,1679.82186 L339.999501,1679.82874 C339.221373,1679.82874 338.581909,1679.23248 338.50937,1678.47006 L338.502518,1678.32527 L338.502,1664.243 Z M389.722801,1657.42034 C394.181078,1657.42034 397.812484,1660.98384 397.945451,1665.42891 L397.949224,1665.68144 L397.949224,1691.93112 C397.949224,1692.76147 397.279001,1693.4346 396.45224,1693.4346 C395.674112,1693.4346 395.034648,1692.83833 394.96211,1692.07592 L394.955257,1691.93112 L394.955257,1665.68144 C394.955257,1662.85294 392.727519,1660.54529 389.938426,1660.43167 L389.722801,1660.42729 L378.256,1660.427 L378.256308,1670.96665 C378.256308,1671.797 377.586085,1672.47013 376.759324,1672.47013 C375.981196,1672.47013 375.341732,1671.87386 375.269194,1671.11145 L375.262341,1670.96665 L375.262,1660.427 L365.466681,1660.42729 C364.63992,1660.42729 363.969697,1659.75416 363.969697,1658.92381 C363.969697,1658.14231 364.563389,1657.50007 365.322511,1657.42722 L365.466681,1657.42034 L389.722801,1657.42034 Z M315.517835,1657.41994 C316.344596,1657.41994 317.014819,1658.09307 317.014819,1658.92341 C317.014819,1659.70492 316.421127,1660.34715 315.662005,1660.42001 L315.517835,1660.42689 L304.759,1660.426 L304.759914,1670.96665 C304.759914,1671.74816 304.166222,1672.39039 303.4071,1672.46325 L303.262931,1672.47013 C302.484803,1672.47013 301.845339,1671.87386 301.7728,1671.11145 L301.765947,1670.96665 L301.765,1660.426 L290.299654,1660.42689 C287.483004,1660.42689 285.185667,1662.6637 285.07256,1665.46543 L285.068196,1665.68204 L285.068196,1691.93072 C285.068196,1692.76107 284.397974,1693.4342 283.571213,1693.4342 C282.793084,1693.4342 282.153621,1692.83793 282.081082,1692.07551 L282.074229,1691.93072 L282.074229,1665.68204 C282.074229,1661.20375 285.622048,1657.55724 290.048197,1657.42372 L290.299654,1657.41994 L315.517835,1657.41994 Z M387.751873,1672.1536 C388.530001,1672.1536 389.169465,1672.74986 389.242003,1673.51228 L389.248856,1673.65707 L389.248856,1691.93032 C389.248856,1692.76067 388.578634,1693.43379 387.751873,1693.43379 C386.973745,1693.43379 386.334281,1692.83753 386.261742,1692.07511 L386.254889,1691.93032 L386.254889,1673.65707 C386.254889,1672.82673 386.925112,1672.1536 387.751873,1672.1536 Z M291.970287,1672.1536 C292.748415,1672.1536 293.387879,1672.74986 293.460418,1673.51228 L293.467271,1673.65707 L293.467271,1691.93032 C293.467271,1692.76067 292.797048,1693.43379 291.970287,1693.43379 C291.192159,1693.43379 290.552695,1692.83753 290.480157,1692.07511 L290.473304,1691.93032 L290.473304,1673.65707 C290.473304,1672.82673 291.143526,1672.1536 291.970287,1672.1536 Z M339.999401,1626 C348.221088,1626 354.886402,1632.69388 354.886402,1640.95056 C354.886402,1649.20792 348.221416,1655.90113 339.999401,1655.90113 C331.778213,1655.90113 325.113399,1649.20775 325.113399,1640.95056 C325.113399,1632.69405 331.77854,1626 339.999401,1626 Z M376.759624,1630.1945 C383.299196,1630.1945 388.60176,1635.5197 388.60176,1642.08799 C388.60176,1648.65696 383.299518,1653.98149 376.759624,1653.98149 C370.218378,1653.98149 364.917487,1648.65761 364.917487,1642.08799 C364.917487,1635.51906 370.218701,1630.1945 376.759624,1630.1945 Z M303.264128,1630.1945 C309.803555,1630.1945 315.105267,1635.51956 315.105267,1642.08799 C315.105267,1648.65711 309.803877,1653.98149 303.264128,1653.98149 C296.722883,1653.98149 291.421992,1648.65761 291.421992,1642.08799 C291.421992,1635.51906 296.723205,1630.1945 303.264128,1630.1945 Z M339.999401,1629.00695 C333.432063,1629.00695 328.107365,1634.35474 328.107365,1640.95056 C328.107365,1647.54702 333.431701,1652.89417 339.999401,1652.89417 C346.567963,1652.89417 351.892435,1647.54716 351.892435,1640.95056 C351.892435,1634.3546 346.567601,1629.00695 339.999401,1629.00695 Z M376.759624,1633.20145 C371.872267,1633.20145 367.911454,1637.1797 367.911454,1642.08799 C367.911454,1646.99691 371.8719,1650.97454 376.759624,1650.97454 C381.646085,1650.97454 385.607793,1646.99618 385.607793,1642.08799 C385.607793,1637.18044 381.645718,1633.20145 376.759624,1633.20145 Z M303.264128,1633.20145 C298.376772,1633.20145 294.415959,1637.1797 294.415959,1642.08799 C294.415959,1646.99691 298.376405,1650.97454 303.264128,1650.97454 C308.150355,1650.97454 312.1113,1646.99641 312.1113,1642.08799 C312.1113,1637.18021 308.149988,1633.20145 303.264128,1633.20145 Z" id="ic-user_subscriptions"></path>
        </g>
    </g>
</svg>