{
    "title": "friendos.club TTT Map Rearms",
    "type": "map",
    "tags": ["fun"],
    "ignore":
    [
        ".git/",
        ".gitignore",
        "LICENSE",
        "*.bat",
        "*.code-workspace",
        "*.md"
    ]
}
