# Trouble in Terrorist Town weapon/ammo placement overrides
# For map: ttt_concrete_b3
# Exported by: state funeral
setting:	replacespawns 0
weapon_ttt_smokegrenade	-1894.091797 967.677429 512.145874	-0.841 -1.649 -1.283
weapon_ttt_smokegrenade	-1896.571899 954.864868 512.140625	-0.892 -1.606 -1.362
weapon_ttt_smokegrenade	-1912.364014 968.602112 512.154236	-0.767 -1.690 -1.149
weapon_ttt_smokegrenade	-1913.575806 957.853882 512.112854	-1.168 -1.481 -1.787
weapon_ttt_smokegrenade	-1632.980103 1359.031860 304.161621	-1.458 -1.457 -1.484
weapon_ttt_smokegrenade	-1614.897583 1358.058716 304.200439	-0.632 -1.566 -0.640
weapon_ttt_smokegrenade	-1595.017456 1359.688354 304.157379	-1.548 -1.444 -1.576
weapon_ttt_smokegrenade	-936.322937 1617.862549 128.144348	-1.827 -1.288 -1.861
weapon_ttt_smokegrenade	-882.233398 1615.842651 128.167496	-1.333 -1.499 -1.356
weapon_ttt_smokegrenade	-901.492371 1614.554565 128.185730	-0.944 -1.548 -0.959
weapon_ttt_smokegrenade	-529.544739 1616.073486 128.158463	-1.525 -1.456 -1.553
weapon_ttt_smokegrenade	-496.610504 1620.501831 128.168427	-1.313 -1.505 -1.336
weapon_ttt_smokegrenade	-467.370758 1624.549805 128.180084	-1.064 -1.539 -1.082
weapon_ttt_smokegrenade	-1342.655640 945.125793 64.165596	-1.373 -1.484 -1.398
weapon_ttt_smokegrenade	-1371.907837 948.824829 64.150536	-1.698 -1.375 -1.724
weapon_ttt_smokegrenade	-1459.921265 294.553101 304.140411	-1.911 -1.293 -1.947
weapon_ttt_smokegrenade	-1474.160889 304.008728 304.194092	-0.766 -1.561 -0.778
weapon_ttt_smokegrenade	-1489.984741 322.967560 304.139038	-1.940 -1.274 -1.977
weapon_ttt_smokegrenade	-1886.389038 1369.521118 368.126129	-1.036 -1.489 -1.584
weapon_ttt_smokegrenade	-1889.790039 1358.072021 368.166748	-0.633 -1.723 -0.964
weapon_ttt_smokegrenade	-1908.588623 1370.272705 368.126129	-1.036 -1.489 -1.584
weapon_ttt_smokegrenade	-1902.589844 1355.592896 368.198242	-0.321 -1.756 -0.484
weapon_ttt_smokegrenade	-1982.477661 260.528168 360.766693	-0.288 -1.031 -1.301
weapon_ttt_smokegrenade	-1997.919922 260.062561 360.716278	-0.895 -1.704 -0.278
weapon_ttt_smokegrenade	-2331.782959 1051.080688 359.873352	-0.825 -1.625 -0.612
weapon_ttt_smokegrenade	-2304.376709 1053.011597 359.883820	-0.754 -1.648 -0.559
weapon_ttt_smokegrenade	-2276.951172 1061.128418 359.902100	-0.631 -1.717 -0.467
weapon_ttt_smokegrenade	-324.719055 374.987244 304.185059	-0.958 -1.548 -0.974
weapon_ttt_smokegrenade	-325.396545 402.662872 304.159546	-1.502 -1.457 -1.530
weapon_ttt_smokegrenade	-319.756744 439.118835 304.167480	-1.337 -1.499 -1.353
weapon_ttt_smokegrenade	-323.214203 460.593933 304.154053	-1.620 -1.419 -1.649
ttt_random_weapon	-2420.963135 1130.866089 481.192291	1.962 4.928 -92.398
ttt_random_weapon	-2363.465332 1133.407715 481.211578	1.745 4.927 -92.896
ttt_random_weapon	-2419.655518 1166.894287 481.222687	1.619 4.921 -93.184
ttt_random_weapon	-1904.793213 784.626282 481.242950	1.236 4.986 -94.298
ttt_random_weapon	-1907.757202 763.989197 481.200958	1.834 5.712 -92.809
ttt_random_weapon	-1907.478149 748.032715 481.170380	2.159 5.699 -92.141
ttt_random_weapon	-1909.813721 730.869507 481.225952	1.568 5.722 -93.356
ttt_random_weapon	-2200.579590 359.281372 511.231689	1.766 4.772 -92.847
ttt_random_weapon	-2202.288574 401.604218 511.229889	1.786 4.774 -92.801
ttt_random_weapon	-2189.709717 430.051941 511.240845	1.663 4.765 -93.084
ttt_random_weapon	-2193.034424 450.456787 511.230499	1.779 4.773 -92.816
ttt_random_weapon	-2186.520508 472.868744 511.240845	1.663 4.765 -93.084
ttt_random_weapon	-2030.763794 577.910278 337.227325	2.154 5.780 -89.551
ttt_random_weapon	-2006.566406 576.823547 338.208923	6.390 6.352 -93.697
ttt_random_weapon	-1971.280884 569.959106 337.206970	1.770 5.715 -92.940
ttt_random_weapon	-2067.832031 296.328400 337.240814	2.100 5.900 -89.219
ttt_random_weapon	-2039.240356 294.812317 337.773529	4.741 7.096 -93.744
ttt_random_weapon	-2019.020386 287.862885 337.653259	-1.296 26.824 83.377
ttt_random_weapon	-2320.074707 231.215469 337.220947	1.639 4.988 -93.138
ttt_random_weapon	-2352.798340 225.661621 337.236938	1.458 4.970 -93.553
ttt_random_weapon	-2384.662354 231.095490 337.144073	2.015 4.169 -91.716
ttt_random_weapon	-2336.232178 200.672333 337.239441	1.429 4.965 -93.618
ttt_random_weapon	-2361.820313 206.657898 337.201508	1.858 4.763 -92.636
ttt_random_weapon	-2393.796875 215.826401 337.226440	1.577 4.985 -93.280
ttt_random_weapon	-2419.577881 1129.754272 625.216248	1.692 4.925 -93.016
ttt_random_weapon	-2375.717285 1130.791016 625.212158	1.738 4.926 -92.910
ttt_random_weapon	-2412.672852 1187.276123 625.213196	1.726 4.926 -92.938
ttt_random_weapon	-2424.091064 1124.321533 337.219452	1.656 4.923 -93.099
ttt_random_weapon	-2380.763428 1125.723267 337.218109	1.671 4.924 -93.065
ttt_random_weapon	-2424.249756 1177.993774 337.199432	1.882 4.926 -92.582
ttt_random_weapon	-2422.573975 1135.985107 193.206253	1.805 4.927 -92.758
ttt_random_weapon	-2369.354248 1128.676025 193.229034	1.547 4.915 -93.348
ttt_random_weapon	-2416.954834 1170.169189 193.191437	1.972 4.920 -92.376
ttt_random_weapon	-2835.518311 1650.030884 122.848106	-1.034 -10.539 88.090
ttt_random_weapon	-2791.800293 1657.302734 123.291313	-0.905 -10.509 87.793
ttt_random_weapon	-2759.586670 1653.044922 123.030487	-0.965 -10.525 87.932
ttt_random_weapon	-2075.936768 2665.554199 184.927933	1.470 3.857 -91.311
ttt_random_weapon	-2076.175537 2646.868652 184.235001	1.421 3.839 -91.425
ttt_random_weapon	-2073.070801 2616.113037 183.065933	1.582 3.892 -91.051
ttt_random_weapon	-1787.298584 2513.131836 145.221527	1.632 4.921 -93.153
ttt_random_weapon	-1785.894897 2551.160889 145.206253	1.805 4.927 -92.758
ttt_random_weapon	-1786.919189 2580.934814 145.221115	1.637 4.922 -93.143
ttt_random_weapon	-1394.940552 2755.611328 245.313904	1.580 4.759 -93.273
ttt_random_weapon	-1199.506714 2573.338623 225.215530	1.700 4.986 -92.998
ttt_random_weapon	-1194.389160 2557.583496 225.225098	1.592 4.986 -93.245
ttt_random_weapon	-1194.630371 2596.060303 225.232086	1.513 4.978 -93.427
ttt_random_weapon	-224.922409 2839.510254 369.223511	1.610 3.348 -93.205
ttt_random_weapon	-265.675812 2839.514648 369.229736	1.539 4.982 -93.366
ttt_random_weapon	-242.052963 2802.919922 369.216492	1.689 4.985 -93.023
ttt_random_weapon	-474.520844 2824.883057 513.219238	1.658 4.987 -93.094
ttt_random_weapon	-476.472168 2785.498291 513.233459	1.497 4.977 -93.462
ttt_random_weapon	-419.460846 2831.073486 513.221741	1.630 4.989 -93.159
ttt_random_weapon	-267.367096 2279.614502 537.188843	2.001 4.922 -92.308
ttt_random_weapon	-317.644287 2278.569092 537.232422	1.509 4.912 -93.436
ttt_random_weapon	-1178.850098 2274.804443 537.227234	1.568 4.917 -93.301
ttt_random_weapon	-1123.013062 2271.346924 537.193115	1.952 4.926 -92.420
ttt_random_weapon	-678.220581 2274.238281 537.195557	1.925 4.924 -92.483
ttt_random_weapon	-717.367249 2278.542969 537.237793	1.448 4.906 -93.575
ttt_random_weapon	-1444.149902 943.981750 65.728821	-1.814 8.426 84.864
ttt_random_weapon	-1426.276855 2158.154785 873.232422	1.509 4.912 -93.436
ttt_random_weapon	-1303.626709 2344.437744 -62.777687	1.623 4.921 -93.174
ttt_random_weapon	-1345.449707 2347.966064 -62.796356	1.834 4.930 -92.691
ttt_random_weapon	-1310.444458 2309.132324 -62.773739	1.579 4.918 -93.276
ttt_random_weapon	-1436.328125 2443.885742 513.238892	1.435 4.965 -93.604
ttt_random_weapon	-1433.719727 2414.832520 513.217896	1.673 4.988 -93.059
ttt_random_weapon	-1395.226440 2445.104736 513.214050	1.717 4.981 -92.959
ttt_random_weapon	-1433.733887 2446.915283 369.226746	1.573 4.985 -93.289
ttt_random_weapon	-1432.052368 2412.735840 369.222900	1.617 4.988 -93.189
ttt_random_weapon	-1385.086426 2442.571289 369.219666	1.653 4.989 -93.105
ttt_random_weapon	-1437.683594 2445.730713 225.230560	1.530 4.980 -93.387
ttt_random_weapon	-1432.210327 2419.705322 225.219681	1.653 4.989 -93.105
ttt_random_weapon	-1386.564453 2451.083740 225.226761	1.573 4.985 -93.289
ttt_random_weapon	-1442.346558 975.992981 65.225929	1.583 4.918 -93.267
ttt_random_weapon	-1000.302673 548.569824 65.197914	1.899 4.927 -92.543
ttt_random_weapon	-964.545776 557.672546 65.207504	1.791 4.928 -92.791
ttt_random_weapon	-994.717041 583.998718 65.197144	1.907 4.928 -92.523
ttt_random_weapon	510.833099 804.263000 45.173935	2.168 1.971 -91.926
ttt_random_weapon	504.691925 787.500122 45.209709	1.766 4.708 -92.848
ttt_random_weapon	507.917999 827.422058 45.213570	1.722 4.703 -92.947
ttt_random_weapon	-940.900269 1141.200806 65.215752	1.698 4.925 -93.004
ttt_random_weapon	-903.705566 1146.838135 65.218559	1.666 4.923 -93.076
ttt_random_weapon	-868.157104 1142.429321 65.233780	1.494 4.910 -93.471
ttt_random_weapon	488.215759 1136.917236 65.220703	1.642 4.915 -93.132
ttt_random_weapon	488.065430 1108.878662 65.200867	1.865 4.929 -92.619
ttt_random_weapon	490.367065 1088.532471 65.220703	1.642 4.922 -93.132
ttt_random_weapon	295.967010 387.990143 193.229034	1.547 4.915 -93.348
ttt_random_weapon	307.816925 349.011414 193.221527	1.632 4.921 -93.153
ttt_random_weapon	352.555389 371.030975 193.206253	1.805 4.927 -92.758
ttt_random_weapon	-688.523438 575.994019 401.686951	1.928 4.718 -92.477
ttt_random_weapon	-686.327454 603.802673 401.722992	1.521 4.679 -93.408
ttt_random_weapon	84.269875 811.062195 513.179260	2.065 5.700 -92.335
ttt_random_weapon	73.618202 760.625732 513.184265	2.012 5.703 -92.444
ttt_random_weapon	457.574249 840.882629 513.162964	2.237 5.677 -91.980
ttt_random_weapon	359.860596 841.337769 513.198059	1.866 5.710 -92.745
ttt_random_weapon	-1925.844727 841.501404 625.204956	1.819 4.928 -92.725
ttt_random_weapon	-1916.316162 810.236145 625.212708	1.732 4.927 -92.924
ttt_random_weapon	-1918.719727 782.036926 625.223083	1.615 4.920 -93.193
ttt_random_weapon	-1920.613281 743.850525 625.218994	1.661 4.923 -93.088
ttt_random_weapon	-1927.187500 712.455811 625.209900	1.764 4.928 -92.852
ttt_random_weapon	-1927.087280 670.208496 625.226257	1.579 4.918 -93.276
ttt_random_weapon	-1293.187500 170.676178 433.309967	1.884 4.717 -92.576
ttt_random_weapon	-1291.806763 202.427216 433.321075	1.759 4.707 -92.863
ttt_random_weapon	-1293.874878 241.193253 433.327362	1.688 4.700 -93.025
ttt_random_ammo	-2205.581299 1124.230469 480.377808	0.151 0.001 0.122
ttt_random_ammo	-2261.561035 1123.916504 480.359528	0.063 0.000 0.006
ttt_random_ammo	-2301.218262 1124.405884 480.335205	0.047 0.000 -0.027
ttt_random_ammo	-2322.000488 1127.111084 480.411835	-1.104 -0.015 1.289
ttt_random_ammo	-2234.397461 1124.034668 480.351166	0.052 0.000 -0.011
ttt_random_ammo	-1938.205200 781.848572 480.377808	0.144 0.001 0.116
ttt_random_ammo	-1935.684814 764.027283 480.322632	0.045 0.000 -0.032
ttt_random_ammo	-1933.689819 752.660767 480.395416	1.356 0.022 1.598
ttt_random_ammo	-1932.407349 734.909729 480.412506	1.601 0.035 1.922
ttt_random_ammo	-2234.538574 303.752136 510.370850	0.048 0.000 -0.018
ttt_random_ammo	-2236.517578 358.008392 510.373016	0.049 0.000 -0.016
ttt_random_ammo	-2227.495605 414.346863 510.403107	0.155 0.001 0.128
ttt_random_ammo	-2227.793213 435.036133 510.383392	0.060 0.000 0.003
ttt_random_ammo	-2224.013184 464.535614 510.361786	0.046 0.000 -0.026
ttt_random_ammo	-2214.208008 490.752350 510.381378	0.057 0.000 -0.002
ttt_random_ammo	-2204.318848 521.210938 510.410339	0.289 0.001 0.295
ttt_random_ammo	-1951.743530 524.765869 336.325256	0.045 0.000 -0.031
ttt_random_ammo	-1950.795898 501.763428 336.311920	0.047 0.000 -0.036
ttt_random_ammo	-1955.419067 477.010742 336.406494	1.697 0.029 2.034
ttt_random_ammo	-1974.280273 428.597412 336.395233	1.386 0.023 1.635
ttt_random_ammo	-1995.675415 431.413086 336.427246	1.243 0.030 1.483
ttt_random_ammo	-2034.641602 430.453613 336.355408	0.054 -0.000 0.004
ttt_random_ammo	-2391.561768 357.253967 336.410583	12.386 0.180 0.039
ttt_random_ammo	-2401.434570 316.034180 336.364502	-0.437 -0.138 0.478
ttt_random_ammo	-2351.390869 372.789063 336.464752	0.135 0.867 -0.902
ttt_random_ammo	-2350.093018 367.912872 336.467804	-0.357 2.213 -0.333
ttt_random_ammo	-2352.579102 339.844208 335.890350	-0.713 -0.004 0.631
ttt_random_ammo	-2309.188965 368.249939 336.372589	-0.013 -0.157 0.153
ttt_random_ammo	-2310.142334 338.291168 336.401184	-0.016 -0.091 -0.122
ttt_random_ammo	-2275.032471 366.657532 336.403290	0.209 -0.284 0.330
ttt_random_ammo	-2261.566162 336.319733 336.409210	-0.958 -0.011 1.111
ttt_random_ammo	-2223.453125 1115.936646 624.359558	0.063 -0.000 -0.006
ttt_random_ammo	-2216.908936 1143.924194 624.370972	0.099 0.000 0.056
ttt_random_ammo	-2297.206787 1125.546753 624.445923	1.040 -0.027 -1.260
ttt_random_ammo	-2219.992920 1121.665161 336.455933	-0.044 -0.034 0.127
ttt_random_ammo	-2225.831787 1124.773804 336.479492	-0.185 -3.465 -0.603
ttt_random_ammo	-2223.787109 1150.880737 336.342316	0.048 -0.000 0.021
ttt_random_ammo	-2263.522705 1118.165527 336.376099	0.133 -0.000 -0.100
ttt_random_ammo	-2208.398682 1106.658447 192.342178	0.130 0.298 -0.013
ttt_random_ammo	-2216.053711 1148.886597 192.417419	1.574 -0.041 -1.900
ttt_random_ammo	-2271.743652 1122.561768 192.346832	0.050 0.000 -0.017
ttt_random_ammo	-2811.974365 1688.477905 123.971672	0.071 -0.489 5.018
ttt_random_ammo	-2786.194336 1689.183472 124.026100	0.061 -0.458 4.743
ttt_random_ammo	-2769.638428 1688.074463 123.943947	0.074 -0.514 5.085
ttt_random_ammo	-2745.459229 1693.422852 124.294861	0.057 -0.438 4.642
ttt_random_ammo	-2071.454590 2590.686768 181.260864	0.006 0.105 2.674
ttt_random_ammo	-2069.982910 2568.544434 180.477386	0.042 0.154 2.474
ttt_random_ammo	-2061.159912 2589.649414 181.188171	-0.004 0.066 2.734
ttt_random_ammo	-2058.163818 2572.698730 180.600754	0.035 0.151 2.511
ttt_random_ammo	-2059.562500 2551.221924 179.800140	0.034 0.150 2.517
ttt_random_ammo	-2074.860840 2555.015137 179.923645	-0.003 0.075 2.725
ttt_random_ammo	-2084.133057 2595.145508 181.505203	0.048 0.156 2.445
ttt_random_ammo	-2086.376709 2576.267090 180.731369	-0.009 0.047 2.761
ttt_random_ammo	-2088.305664 2554.288086 179.986496	0.047 0.156 2.449
ttt_random_ammo	-1746.479736 2523.104492 144.325333	0.046 -0.000 0.032
ttt_random_ammo	-1743.093750 2564.852051 144.370941	0.097 -0.000 -0.054
ttt_random_ammo	-1749.014038 2589.354248 144.367310	0.083 0.000 0.035
ttt_random_ammo	-1688.441406 2381.007324 177.455353	-0.138 -1.876 13.035
ttt_random_ammo	-1710.238403 2390.090576 177.608856	-0.396 0.920 1.074
ttt_random_ammo	-1702.319824 2412.904541 144.509033	-0.346 -8.627 1.658
ttt_random_ammo	-1769.419189 2398.435303 184.560944	-0.377 1.100 -0.507
ttt_random_ammo	-1748.174683 2408.818604 184.516190	0.236 -0.061 -0.417
ttt_random_ammo	-1417.160645 2758.283936 244.456543	0.032 0.000 -0.033
ttt_random_ammo	-1416.057129 2746.633789 244.472656	0.020 0.000 -0.038
ttt_random_ammo	-1198.417358 2851.052002 224.389145	0.413 0.003 0.447
ttt_random_ammo	-1205.540039 2802.037109 224.346848	0.050 0.000 -0.017
ttt_random_ammo	-1159.797241 2851.901367 224.385391	0.274 0.001 0.276
ttt_random_ammo	-1176.186279 2809.709473 224.340012	0.048 0.000 -0.023
ttt_random_ammo	-1193.636841 2777.270264 224.372757	0.112 0.000 0.072
ttt_random_ammo	-1175.031006 2777.824707 224.357529	0.060 0.000 0.001
ttt_random_ammo	-1125.090210 2849.789307 224.363510	0.073 0.000 0.019
ttt_random_ammo	-1133.167358 2813.558105 224.394211	0.948 0.011 1.099
ttt_random_ammo	-1128.456665 2783.219971 224.340012	0.048 0.000 -0.023
ttt_random_ammo	-305.225372 2840.012451 368.386658	0.317 0.002 0.329
ttt_random_ammo	-300.313477 2807.893799 368.325287	0.047 0.000 -0.032
ttt_random_ammo	-267.368317 2799.442871 368.342285	0.048 0.000 -0.022
ttt_random_ammo	-649.873535 2858.087402 368.397797	-0.486 -0.003 0.536
ttt_random_ammo	-654.383667 2827.840088 368.384033	-0.196 -0.001 0.178
ttt_random_ammo	-671.371277 2853.443115 368.354187	-0.055 -0.000 -0.007
ttt_random_ammo	-673.350098 2819.571777 368.471069	-0.780 -0.023 0.944
ttt_random_ammo	-701.252808 2825.249756 368.331085	-0.047 -0.000 -0.029
ttt_random_ammo	-1430.914551 2749.623779 512.376404	-0.123 -0.000 0.086
ttt_random_ammo	-1442.774292 2736.540771 512.343079	-0.048 -0.000 -0.021
ttt_random_ammo	-1458.802124 2723.957031 512.391724	-0.323 -0.002 0.336
ttt_random_ammo	-1474.720093 2708.943848 512.390747	0.548 -0.004 -0.612
ttt_random_ammo	-1434.021240 2445.985840 675.920471	1.263 1.302 1.118
ttt_random_ammo	-662.255920 2438.568115 656.433289	-0.481 -4.962 0.618
ttt_random_ammo	-663.804443 2444.072510 656.504211	-1.103 -0.072 1.337
ttt_random_ammo	-659.449768 2482.093994 656.360535	-0.063 -0.000 0.006
ttt_random_ammo	-665.301086 2524.016113 656.463318	-1.040 -0.027 1.260
ttt_random_ammo	-737.606506 2447.574219 656.338318	-0.047 -0.000 -0.025
ttt_random_ammo	-730.069275 2488.012695 656.364624	-0.072 -0.000 0.018
ttt_random_ammo	-729.740540 2527.873291 656.455322	-1.351 -0.033 1.640
ttt_random_ammo	-1338.935547 2160.022705 -63.646660	0.054 0.000 -0.008
ttt_random_ammo	-1342.638916 2190.659912 -63.534634	-0.914 -0.025 1.103
ttt_random_ammo	-1338.865479 2222.772461 -63.623608	-0.121 -0.000 0.085
ttt_random_ammo	-1267.449097 2353.813477 152.349045	0.051 0.000 -0.014
ttt_random_ammo	-1264.715820 2329.665283 152.359558	0.063 -0.000 -0.006
ttt_random_ammo	-1290.008057 2352.518066 152.430069	1.355 0.033 1.637
ttt_random_ammo	-1299.063477 2328.342529 152.335266	0.047 0.000 -0.027
ttt_random_ammo	-1318.901733 2353.465576 152.443787	1.089 -0.028 -1.319
ttt_random_ammo	-1326.173950 2329.974121 152.365417	0.077 -0.000 -0.026
ttt_random_ammo	-1768.014282 1868.356079 121.705559	-0.039 -0.416 -4.054
ttt_random_ammo	-1762.482300 1851.033447 122.760735	-0.062 -0.457 -4.778
ttt_random_ammo	-1761.971802 1828.222290 124.179779	-0.069 -0.490 -4.954
ttt_random_ammo	-1508.437378 1874.764771 121.255554	-0.086 -0.590 -5.357
ttt_random_ammo	-1514.290527 1842.594360 123.265182	-0.087 -0.588 -5.385
ttt_random_ammo	-1514.869263 1817.096802 124.344582	0.049 0.000 -0.019
ttt_random_ammo	-1269.691406 942.411011 64.392189	0.621 0.005 0.701
ttt_random_ammo	-1267.619995 963.732971 64.420837	1.614 0.037 1.957
ttt_random_ammo	-1304.023926 947.418823 64.360527	-0.063 -0.000 0.006
ttt_random_ammo	-612.425598 542.106873 64.344582	0.048 0.000 -0.019
ttt_random_ammo	-611.021667 564.430542 64.357506	0.059 0.000 0.001
ttt_random_ammo	-613.445679 593.276489 64.344498	-0.134 -0.134 0.003
ttt_random_ammo	472.690125 825.906189 44.370934	0.100 -0.000 -0.056
ttt_random_ammo	472.325470 806.078125 44.344585	0.049 0.000 -0.019
ttt_random_ammo	472.554810 789.090027 44.387917	0.366 0.002 0.388
ttt_random_ammo	-759.368958 1138.201782 64.391586	-0.343 -0.064 0.380
ttt_random_ammo	-788.569702 1142.924805 64.340729	-0.047 -0.000 -0.023
ttt_random_ammo	-824.885559 1145.861694 64.320847	-0.047 -0.000 -0.034
ttt_random_ammo	505.898499 930.147095 64.344582	0.049 0.000 -0.019
ttt_random_ammo	496.603333 981.403442 64.380981	0.192 0.001 0.174
ttt_random_ammo	493.044342 1007.813965 64.365417	0.077 0.000 0.026
ttt_random_ammo	469.135132 362.013428 192.342331	0.048 -0.000 0.021
ttt_random_ammo	469.456360 393.075928 192.438858	1.192 -0.029 -1.444
ttt_random_ammo	441.686371 360.465698 192.351212	0.052 -0.000 0.011
ttt_random_ammo	-715.257935 871.463623 304.445953	-1.530 -0.036 1.849
ttt_random_ammo	-711.150208 839.863892 304.387848	-0.249 -0.001 0.245
ttt_random_ammo	-706.676758 796.950623 304.340729	-0.047 -0.000 -0.023
ttt_random_ammo	0.084216 877.392883 512.349060	0.051 0.000 -0.014
ttt_random_ammo	-51.006599 875.413574 512.385376	0.276 0.001 0.279
ttt_random_ammo	-95.856262 879.941101 512.383972	0.245 0.001 0.240
ttt_random_ammo	-145.562302 880.249756 512.376160	0.136 0.000 0.103
ttt_random_ammo	-194.392548 876.365601 512.351196	0.052 0.000 -0.011
ttt_random_ammo	-23.465557 552.118408 512.393616	0.830 0.009 0.957
ttt_random_ammo	-61.536194 544.215088 512.377808	0.150 0.001 0.122
ttt_random_ammo	-127.024231 538.426819 512.428162	1.424 0.033 1.723
ttt_random_ammo	-185.950989 543.852966 512.374512	0.120 0.000 0.083
ttt_random_ammo	-89.843933 541.959412 512.374451	0.122 0.000 0.085
ttt_random_ammo	-2402.365967 209.489609 624.359558	0.063 -0.000 -0.006
ttt_random_ammo	-2379.938232 207.748123 624.390747	0.546 -0.004 -0.610
ttt_random_ammo	-2354.455811 177.700226 624.363464	0.071 -0.000 -0.018
ttt_random_ammo	-2358.259521 206.071075 624.339966	0.047 0.000 -0.023
ttt_random_ammo	-1600.595947 163.974014 432.461914	0.051 -0.000 0.014
ttt_random_ammo	-1601.705933 199.780289 432.490173	0.153 -0.001 -0.125
ttt_random_ammo	-1544.493042 165.704269 432.483459	0.102 -0.000 -0.059
ttt_random_ammo	-1546.816772 188.428818 432.479889	0.084 -0.000 -0.036
ttt_random_ammo	-1494.186279 160.261154 432.490143	0.154 -0.001 -0.126
ttt_random_ammo	-1473.680664 200.646713 432.428162	0.048 -0.000 0.036
ttt_random_ammo	-1427.650269 163.700378 432.499817	0.375 -0.002 -0.400
ttt_random_ammo	-1421.699951 198.066757 432.555359	1.159 -0.029 -1.412
ttt_random_ammo	-1384.023438 163.769928 432.459717	0.050 0.000 -0.017
ttt_random_ammo	-1391.009888 209.373535 432.485199	0.112 -0.000 -0.072
ttt_random_ammo	-1354.527466 172.846466 432.468201	0.057 0.000 -0.004
ttt_random_ammo	-1350.561646 216.094879 432.445892	0.046 0.000 -0.028
ttt_random_ammo	-645.556213 286.260101 352.195038	0.041 0.000 -0.026
ttt_random_ammo	-623.106445 280.819672 352.208649	0.044 0.000 -0.014
ttt_random_ammo	-629.080078 264.254669 352.217468	0.053 0.000 0.002
ttt_random_ammo	-645.389587 266.657318 352.214020	0.049 0.000 -0.006
ttt_random_ammo	-20.712770 161.652481 352.280975	1.351 0.036 1.632
ttt_random_ammo	-28.469717 145.887207 352.192963	0.041 0.000 -0.027
ttt_random_ammo	-43.888969 150.489746 352.157867	0.047 0.000 -0.038
ttt_random_ammo	-43.327164 165.375031 352.210449	0.046 0.000 -0.012
ttt_random_ammo	378.424530 268.761627 352.163269	0.046 -0.000 0.035
ttt_random_ammo	396.321655 263.259766 352.259369	-0.252 4.502 0.558
weapon_zm_molotov	-771.708740 728.277588 304.134857	-2.031 -1.256 -2.067
weapon_zm_molotov	-808.163025 721.178650 304.148132	-1.746 -1.380 -1.778
weapon_zm_molotov	-1674.156250 1508.061157 304.180847	-1.048 -1.541 -1.066
weapon_zm_molotov	-1673.014282 1480.632813 304.137665	-1.975 -1.212 -2.003
weapon_zm_molotov	-1673.841431 1445.122559 304.148132	-1.746 -1.380 -1.778
weapon_zm_molotov	-791.585022 2824.105957 271.955231	-1.300 -1.407 -1.540
weapon_zm_molotov	-784.512329 2805.307617 271.980225	-1.008 -1.712 -1.192
weapon_zm_molotov	-815.345764 2819.324463 271.958527	-1.262 -1.490 -1.494
weapon_zm_molotov	-2102.941650 1487.627808 512.133667	-0.962 -1.567 -1.469
weapon_zm_molotov	-2093.842041 1487.652222 512.109253	-1.205 -1.347 -1.841
weapon_zm_molotov	-2106.600830 1470.385864 512.173218	-1.213 -1.331 -1.718
weapon_zm_molotov	-2089.914307 1474.268921 512.136536	-0.933 -1.616 -1.425
weapon_zm_molotov	-2283.297119 435.837311 359.867737	-0.863 -1.556 -0.640
weapon_zm_molotov	-2305.570557 434.401367 359.865814	-0.876 -1.548 -0.649
weapon_zm_molotov	-2330.474365 433.975800 359.873352	-0.825 -1.626 -0.612
weapon_ttt_confgrenade	-948.363892 1747.806763 126.116180	-36.059 -49.908 -90.485
weapon_ttt_confgrenade	-906.648621 1742.717529 126.140839	-36.436 -49.553 -91.068
weapon_ttt_confgrenade	-876.520508 1744.516602 126.110802	-35.977 -49.989 -90.359
weapon_ttt_confgrenade	-873.183777 754.883179 306.117401	-36.078 -49.900 -90.514
weapon_ttt_confgrenade	-866.813721 783.264343 306.106506	-35.911 -50.055 -90.258
weapon_ttt_confgrenade	-869.404785 815.442139 306.144318	-36.489 -49.511 -91.151
weapon_ttt_confgrenade	-785.180664 858.426086 306.155792	-36.665 -49.338 -91.427
weapon_ttt_confgrenade	-831.695374 859.073120 306.186096	-37.127 -48.859 -92.165
weapon_ttt_confgrenade	-451.281525 1752.964844 126.180969	-37.049 -48.932 -92.039
weapon_ttt_confgrenade	-490.124695 1749.145142 126.218208	-37.618 -48.317 -92.966
weapon_ttt_confgrenade	-525.508850 1751.941284 126.125443	-36.201 -49.781 -90.703
weapon_ttt_confgrenade	-1486.565308 2352.099365 -61.828358	-36.907 -49.085 -91.811
weapon_ttt_confgrenade	-1477.805176 2309.487549 -61.848377	-36.601 -49.396 -91.326
weapon_ttt_confgrenade	-1477.275391 2277.802002 -61.870281	-36.266 -49.720 -90.804
weapon_ttt_confgrenade	-2387.918213 730.437561 361.792847	-36.483 -50.579 -88.884
weapon_ttt_confgrenade	-2393.197998 753.048096 361.990234	-38.100 -47.962 -93.279
weapon_ttt_confgrenade	-2391.810791 778.268860 361.697205	-35.667 -51.618 -86.875
weapon_ttt_confgrenade	507.988190 887.789551 274.209625	-37.487 -48.470 -92.750
weapon_ttt_confgrenade	474.434753 886.036499 274.148193	-36.549 -49.452 -91.244
weapon_ttt_confgrenade	499.496582 860.476135 274.137970	-36.392 -49.606 -91.000
