# Trouble in Terrorist Town weapon/ammo placement overrides
# For map: ttt_glacier
# Exported by: my son beats up ur lame kids
setting:	replacespawns 0
weapon_ttt_smokegrenade	-1020.599976 616.056030 8.000000	0.000 0.000 0.000
weapon_ttt_smokegrenade	-1010.080017 609.481995 8.000000	0.000 0.000 0.000
weapon_ttt_smokegrenade	-1016.469971 604.255005 8.000000	0.000 0.000 0.000
weapon_ttt_smokegrenade	-1023.559998 608.697998 8.000000	0.000 0.000 0.000
weapon_ttt_smokegrenade	-1008.000000 599.872986 8.000000	0.000 0.000 0.000
weapon_ttt_smokegrenade	-1008.719971 592.000000 8.000000	0.000 0.000 0.000
weapon_ttt_smokegrenade	-1016.869995 596.495972 8.000000	0.000 0.000 0.000
weapon_ttt_smokegrenade	-1025.619995 601.486023 8.000000	0.000 0.000 0.000
weapon_ttt_smokegrenade	927.400024 -95.944000 16.000000	0.000 0.000 0.000
weapon_ttt_smokegrenade	937.919983 -102.517998 16.000000	0.000 0.000 0.000
weapon_ttt_smokegrenade	931.530029 -107.745003 16.000000	0.000 0.000 0.000
weapon_ttt_smokegrenade	924.440002 -103.302002 16.000000	0.000 0.000 0.000
weapon_ttt_smokegrenade	940.000000 -112.126999 16.000000	0.000 0.000 0.000
weapon_ttt_smokegrenade	939.280029 -120.000000 16.000000	0.000 0.000 0.000
weapon_ttt_smokegrenade	931.130005 -115.503998 16.000000	0.000 0.000 0.000
weapon_ttt_smokegrenade	922.380005 -110.514000 16.000000	0.000 0.000 0.000
ttt_random_weapon	0.000000 220.000000 -345.627014	0.000 0.000 0.000
ttt_random_weapon	-188.918854 274.840424 23.573853	-12.133 19.937 -105.090
ttt_random_weapon	-488.347839 -357.380676 -254.801559	1.893 4.717 -92.557
ttt_random_weapon	305.788452 388.335205 -338.489380	1.645 1.554 -93.061
ttt_random_weapon	199.132950 869.824524 -250.783905	1.694 4.700 -93.012
ttt_random_weapon	-250.719727 573.300293 -338.500092	1.822 4.712 -92.720
ttt_random_weapon	-200.175430 877.059204 -250.776276	1.608 4.691 -93.210
ttt_random_weapon	737.565063 1002.972290 1.204313	1.827 4.929 -92.708
ttt_random_weapon	286.508942 408.827667 177.088989	12.816 -30.819 -100.739
weapon_ttt_m16	-1116.170044 549.302002 26.000000	0.000 0.000 0.000
weapon_ttt_m16	-1121.989990 550.752991 26.000000	0.000 0.000 0.000
weapon_ttt_m16	-1127.810059 552.205017 26.000000	0.000 0.000 0.000
weapon_ttt_m16	-1133.640015 553.656006 26.000000	0.000 0.000 0.000
weapon_ttt_m16	734.552002 -204.041000 26.000000	0.000 0.000 0.000
weapon_ttt_m16	728.554993 -203.832001 26.000000	0.000 0.000 0.000
weapon_ttt_m16	722.559021 -203.621994 26.000000	0.000 0.000 0.000
weapon_ttt_m16	716.562012 -203.412994 26.000000	0.000 0.000 0.000
item_box_buckshot_ttt	-1029.859985 922.544983 10.000000	0.000 0.000 0.000
item_box_buckshot_ttt	-1021.119995 916.822021 10.000000	0.000 0.000 0.000
item_box_buckshot_ttt	-1007.929993 909.260010 10.000000	0.000 0.000 0.000
item_box_buckshot_ttt	-993.596008 908.228027 10.000000	0.000 0.000 0.000
item_box_buckshot_ttt	-1005.330017 921.705017 10.000000	0.000 0.000 0.000
item_box_buckshot_ttt	-1026.719971 920.653015 26.000000	0.000 0.000 0.000
item_box_buckshot_ttt	-1019.549988 916.747009 26.000000	0.000 0.000 0.000
item_box_buckshot_ttt	-1011.049988 910.794006 26.000000	0.000 0.000 0.000
item_box_buckshot_ttt	-995.723999 907.609985 26.000000	0.000 0.000 0.000
item_box_buckshot_ttt	-1005.270020 920.263977 26.000000	0.000 0.000 0.000
item_box_buckshot_ttt	898.760010 -223.423004 26.000000	0.000 0.000 0.000
item_box_buckshot_ttt	906.921997 -223.222000 26.000000	0.000 0.000 0.000
item_box_buckshot_ttt	917.257996 -224.128006 26.000000	0.000 0.000 0.000
item_box_buckshot_ttt	932.127014 -219.220001 26.000000	0.000 0.000 0.000
item_box_buckshot_ttt	917.534973 -213.033005 26.000000	0.000 0.000 0.000
ttt_random_ammo	-173.216934 266.199890 24.884739	78.764 125.036 60.035
ttt_random_ammo	-164.056229 259.052948 22.592054	88.407 177.420 -142.894
ttt_random_ammo	-497.009827 -342.118256 -255.664001	-0.047 -0.000 -0.027
ttt_random_ammo	-485.843140 -342.039612 -255.656937	-0.048 -0.000 -0.021
ttt_random_ammo	316.535675 375.271210 -339.382874	0.048 0.000 -0.038
ttt_random_ammo	301.868500 375.251282 -339.320160	-0.118 -0.000 0.082
ttt_random_ammo	195.242401 853.974060 -251.636490	0.072 0.000 0.019
ttt_random_ammo	207.943161 853.375732 -251.617493	0.217 0.001 0.205
ttt_random_ammo	-218.035019 578.357544 -339.329498	-0.059 0.000 -0.004
ttt_random_ammo	-217.508331 563.682251 -339.345032	-0.045 0.000 0.021
ttt_random_ammo	52.506191 -370.681458 -127.605545	1.111 0.015 1.298
ttt_random_ammo	36.841957 -372.842316 -127.660004	0.047 0.000 -0.023
ttt_random_ammo	45.134850 -347.521759 -127.620567	0.170 0.001 0.147
ttt_random_ammo	-190.547043 895.332703 -251.622238	0.149 -0.001 -0.120
ttt_random_ammo	-208.345520 894.921021 -251.644531	0.057 -0.000 0.004
ttt_random_ammo	697.869751 1005.653870 0.374486	0.121 0.000 0.084
ttt_random_ammo	668.811646 1005.776123 0.383953	0.244 0.001 0.239
ttt_random_ammo	207.480377 502.649628 139.628479	-89.135 -4.800 91.446
ttt_random_ammo	188.963394 482.055298 138.740295	89.444 46.895 92.910
item_ammo_pistol_ttt	-1041.000000 571.612976 26.000000	0.000 96.000 0.000
item_ammo_pistol_ttt	-1049.030029 570.137024 26.000000	0.000 96.000 0.000
item_ammo_pistol_ttt	-1059.380005 569.414978 26.000000	0.000 96.000 0.000
item_ammo_pistol_ttt	-1073.290039 562.242004 26.000000	0.000 96.000 0.000
item_ammo_pistol_ttt	-1057.910034 558.414001 26.000000	0.000 96.000 0.000
item_ammo_pistol_ttt	933.293030 -35.006199 26.000000	0.000 96.000 0.000
item_ammo_pistol_ttt	931.794006 -43.031399 26.000000	0.000 96.000 0.000
item_ammo_pistol_ttt	928.757996 -52.953300 26.000000	0.000 96.000 0.000
item_ammo_pistol_ttt	930.468018 -68.517403 26.000000	0.000 96.000 0.000
item_ammo_pistol_ttt	939.552979 -55.530602 26.000000	0.000 96.000 0.000
item_ammo_pistol_ttt	-1042.420044 574.289978 37.794800	0.000 96.000 0.000
item_ammo_pistol_ttt	-1052.810059 573.239014 37.794800	0.000 96.000 0.000
item_ammo_pistol_ttt	-1067.819946 570.815979 37.794800	0.000 96.000 0.000
item_ammo_pistol_ttt	-1079.609985 562.596008 37.794800	0.000 96.000 0.000
item_ammo_pistol_ttt	-1062.000000 559.508972 37.794800	0.000 96.000 0.000
item_ammo_pistol_ttt	-1046.050049 573.786011 53.794800	0.000 96.000 0.000
item_ammo_pistol_ttt	-1054.079956 572.309998 53.794800	0.000 96.000 0.000
item_ammo_pistol_ttt	-1064.430054 571.588013 53.794800	0.000 96.000 0.000
item_ammo_pistol_ttt	-1078.339966 564.414978 53.794800	0.000 96.000 0.000
item_ammo_pistol_ttt	-1062.959961 560.586975 53.794800	0.000 96.000 0.000
item_ammo_pistol_ttt	930.138000 -30.989401 37.794800	0.000 96.000 0.000
item_ammo_pistol_ttt	927.393982 -41.068699 37.794800	0.000 96.000 0.000
item_ammo_pistol_ttt	924.278015 -55.946999 37.794800	0.000 96.000 0.000
item_ammo_pistol_ttt	927.726990 -69.901901 37.794800	0.000 96.000 0.000
item_ammo_pistol_ttt	936.918030 -54.573299 37.794800	0.000 96.000 0.000
item_ammo_pistol_ttt	929.307007 -34.558300 53.794800	0.000 96.000 0.000
item_ammo_pistol_ttt	927.807983 -42.583500 53.794800	0.000 96.000 0.000
item_ammo_pistol_ttt	924.771973 -52.505402 53.794800	0.000 96.000 0.000
item_ammo_pistol_ttt	926.481995 -68.069504 53.794800	0.000 96.000 0.000
item_ammo_pistol_ttt	935.567017 -55.082699 53.794800	0.000 96.000 0.000
weapon_zm_molotov	-1069.979980 918.088989 8.000000	0.000 316.500 0.000
weapon_zm_molotov	-1073.050049 924.953003 8.000000	0.000 316.500 0.000
weapon_zm_molotov	-1081.859985 928.400024 8.000000	0.000 316.500 0.000
weapon_zm_molotov	-1077.520020 920.716003 8.000000	0.000 316.500 0.000
weapon_zm_molotov	-1060.780029 914.088013 8.000000	0.000 316.500 0.000
weapon_zm_molotov	858.994019 -227.705002 8.000000	0.000 316.500 0.000
weapon_zm_molotov	853.101013 -223.033997 8.000000	0.000 316.500 0.000
weapon_zm_molotov	843.695007 -224.044006 8.000000	0.000 316.500 0.000
weapon_zm_molotov	851.093018 -228.856003 8.000000	0.000 316.500 0.000
weapon_zm_molotov	869.002014 -227.005005 8.000000	0.000 316.500 0.000
weapon_zm_shotgun	-1023.950012 879.505005 8.000000	0.000 331.000 0.000
weapon_zm_shotgun	-1027.930054 884.000000 8.000000	0.000 331.000 0.000
weapon_zm_shotgun	-1019.969971 875.010010 8.000000	0.000 331.000 0.000
weapon_zm_shotgun	-1016.000000 870.515991 8.000000	0.000 331.000 0.000
weapon_ttt_glock	-956.538025 626.969971 26.000000	0.000 320.500 0.000
weapon_ttt_glock	-960.354004 622.340027 26.000000	0.000 320.500 0.000
weapon_ttt_glock	-964.171021 617.710022 26.000000	0.000 320.500 0.000
weapon_ttt_glock	-969.258972 611.536987 26.000000	0.000 320.500 0.000
weapon_ttt_glock	-973.075989 606.906982 26.000000	0.000 320.500 0.000
weapon_ttt_glock	-978.164978 600.734009 26.000000	0.000 320.500 0.000
weapon_ttt_glock	772.409973 -188.809006 26.000000	0.000 0.000 0.000
weapon_ttt_glock	774.705994 -194.352005 26.000000	0.000 0.000 0.000
weapon_ttt_glock	777.002991 -199.895996 26.000000	0.000 0.000 0.000
weapon_ttt_glock	780.064026 -207.287003 26.000000	0.000 0.000 0.000
weapon_ttt_glock	782.359985 -212.830002 26.000000	0.000 0.000 0.000
weapon_ttt_glock	785.421997 -220.220993 26.000000	0.000 0.000 0.000
