# Trouble in Terrorist Town weapon/ammo placement overrides
# For map: gm_csgohalocrater
# Exported by: state funeral
setting:	replacespawns 0
weapon_ttt_smokegrenade	-963.434204 2947.624756 160.134857	-2.029 -1.256 -2.068
weapon_ttt_smokegrenade	-952.120911 2975.629639 160.161621	-1.458 -1.457 -1.484
weapon_ttt_smokegrenade	-934.210999 3003.414063 160.157394	-1.548 -1.444 -1.577
weapon_ttt_smokegrenade	-378.135315 3244.203369 160.157394	-1.548 -1.444 -1.577
weapon_ttt_smokegrenade	-391.787964 3207.653076 160.171143	-1.255 -1.505 -1.277
weapon_ttt_smokegrenade	-405.915680 3192.813232 160.190735	-0.838 -1.557 -0.851
weapon_ttt_smokegrenade	-1042.387085 1782.976685 -287.843719	-1.572 -1.414 -1.600
weapon_ttt_smokegrenade	-1039.687744 1801.411377 -287.840454	-1.503 -1.457 -1.530
weapon_ttt_smokegrenade	-1041.057983 1495.838135 -287.822205	-1.113 -1.532 -1.132
weapon_ttt_smokegrenade	-1041.364624 1516.199951 -287.843750	-1.576 -1.414 -1.599
weapon_ttt_smokegrenade	-108.463783 1240.022705 -287.847107	-1.650 -1.424 -1.671
weapon_ttt_smokegrenade	-90.835541 1215.926636 -287.820160	-1.795 0.181 -0.557
weapon_ttt_smokegrenade	-59.963600 1193.250977 -287.862335	-1.969 -1.212 -2.007
weapon_ttt_smokegrenade	-66.269203 905.899658 -287.827118	-1.218 -1.521 -1.239
weapon_ttt_smokegrenade	-85.441933 937.760986 -287.839417	-1.480 -1.456 -1.507
weapon_ttt_smokegrenade	-101.488342 957.495117 -287.871033	-2.155 -1.095 -2.197
weapon_ttt_smokegrenade	-655.388794 1245.865356 -287.833435	-1.353 -1.483 -1.377
weapon_ttt_smokegrenade	-638.171631 1258.851685 -287.854370	-1.799 -1.352 -1.833
weapon_ttt_smokegrenade	-612.639832 1278.838135 -287.812958	-0.916 -1.552 -0.931
weapon_ttt_smokegrenade	-453.792419 464.373779 0.157383	-1.548 -1.444 -1.576
weapon_ttt_smokegrenade	-435.713257 474.875854 0.195669	-0.733 -1.562 -0.743
weapon_ttt_smokegrenade	-416.480621 486.204590 0.164624	-1.394 -1.486 -1.419
ttt_random_weapon	-638.126587 702.412354 1.223082	1.615 4.920 -93.193
ttt_random_weapon	-673.658752 712.379700 1.200867	1.865 4.929 -92.619
ttt_random_weapon	-718.941345 716.493896 1.211589	1.745 4.927 -92.896
ttt_random_weapon	-764.608215 702.153687 1.222701	1.619 4.920 -93.184
ttt_random_weapon	-124.229141 720.043396 1.225929	1.583 4.918 -93.267
ttt_random_weapon	-77.221268 730.618042 1.228450	1.554 4.916 -93.332
ttt_random_weapon	-45.277859 724.622009 1.191443	1.972 4.920 -92.376
ttt_random_weapon	24.358181 714.259521 1.196370	1.916 4.929 -92.503
ttt_random_weapon	638.310059 1664.487915 -142.750092	1.395 4.592 -94.054
ttt_random_weapon	641.408020 1647.635742 -142.803192	1.911 4.622 -92.515
ttt_random_weapon	646.473022 1683.944580 -142.781464	1.666 4.679 -93.076
ttt_random_weapon	-1411.404419 1658.808838 -142.769882	1.513 4.512 -93.515
ttt_random_weapon	-1413.073120 1631.656372 -142.756012	1.378 4.804 -93.736
ttt_random_weapon	-1412.004150 1620.377197 -142.770264	1.530 4.576 -93.422
ttt_random_weapon	-330.628815 1909.615845 -270.808563	1.971 4.920 -92.376
ttt_random_weapon	-330.344635 1883.230713 -270.769318	1.529 4.914 -93.390
ttt_random_weapon	-338.387085 1851.155029 -270.786255	1.720 4.926 -92.952
ttt_random_weapon	-410.734375 1913.514648 -270.766022	1.491 4.910 -93.476
ttt_random_weapon	-403.437958 1883.877808 -270.778076	1.628 4.921 -93.163
ttt_random_weapon	-407.041687 1858.345703 -270.809418	1.981 4.921 -92.354
ttt_random_weapon	-490.356323 1930.141724 -270.805237	1.934 4.925 -92.462
ttt_random_weapon	-490.346802 1904.320923 -270.793732	1.805 4.928 -92.759
ttt_random_weapon	-491.219757 1873.732544 -270.783752	1.692 4.925 -93.016
ttt_random_weapon	-357.280518 1802.981079 -270.781891	1.671 4.924 -93.065
ttt_random_weapon	-431.509216 1794.456543 -270.798431	1.857 4.928 -92.638
ttt_random_weapon	-478.560547 1812.708130 -270.800598	1.882 4.926 -92.582
ttt_random_weapon	-165.685410 489.043152 -286.774750	1.590 4.919 -93.250
ttt_random_weapon	-593.504150 498.083191 -286.790100	1.764 4.928 -92.852
ttt_random_weapon	-465.133148 3142.816162 -310.791870	1.784 4.928 -92.806
ttt_random_weapon	-406.764404 3158.308838 -310.769592	1.532 4.914 -93.383
ttt_random_weapon	-359.942444 2451.582764 1.208117	1.784 4.928 -92.806
ttt_random_weapon	-407.376373 2460.631836 1.230150	1.535 4.914 -93.376
ttt_random_weapon	-263.689514 2834.742188 161.219009	1.661 4.923 -93.088
ttt_random_weapon	-501.614746 2831.634277 161.224548	1.598 4.919 -93.231
ttt_random_weapon	-854.674683 2846.446045 161.215256	1.703 4.925 -92.991
ttt_random_weapon	-1518.555176 2879.863525 153.227127	1.569 4.686 -93.298
ttt_random_weapon	-1538.450806 2857.165771 153.191177	1.975 4.719 -92.369
ttt_random_weapon	-1553.792114 2839.865479 153.206055	1.807 4.711 -92.753
ttt_random_weapon	-579.400452 3601.223389 154.784393	-1.838 -0.293 99.910
ttt_random_weapon	-605.313721 3594.083740 153.119705	1.917 -10.818 -91.829
ttt_random_weapon	-449.590363 3593.498535 153.200638	1.868 4.716 -92.613
ttt_random_weapon	-486.126343 3601.084229 153.970993	-1.062 5.723 -67.855
ttt_random_weapon	583.788574 3101.822754 161.197144	1.907 4.928 -92.523
ttt_random_weapon	541.871216 3102.923828 161.206268	1.805 4.927 -92.758
ttt_random_weapon	598.004395 3197.571289 161.232162	1.512 4.625 -93.429
ttt_random_weapon	526.646545 3207.465332 161.204971	1.819 4.928 -92.725
ttt_random_weapon	510.950226 4285.443848 161.206268	1.805 4.927 -92.758
ttt_random_weapon	504.929504 4324.971680 161.212677	1.732 4.927 -92.924
ttt_random_weapon	499.205780 4366.741699 161.221527	1.632 4.921 -93.153
ttt_random_weapon	369.961578 4142.862793 161.226913	1.571 4.917 -93.293
ttt_random_weapon	390.795532 4133.228027 161.202286	1.850 4.928 -92.656
ttt_random_weapon	429.814941 4117.477539 161.200867	1.865 4.929 -92.619
ttt_random_ammo	-765.718872 671.440186 0.346824	0.050 0.000 -0.017
ttt_random_ammo	-728.210999 686.863403 0.314748	0.047 0.000 -0.036
ttt_random_ammo	-696.026184 685.744080 0.370972	0.100 0.000 0.057
ttt_random_ammo	-654.957642 676.546326 0.377823	0.152 0.001 0.123
ttt_random_ammo	-114.755661 692.775696 0.335244	0.047 0.000 -0.027
ttt_random_ammo	-82.456894 697.325195 0.353339	0.055 0.000 -0.007
ttt_random_ammo	-50.443447 697.511230 0.353339	0.055 0.000 -0.007
ttt_random_ammo	1.710722 681.421143 0.394796	1.453 0.025 1.715
ttt_random_ammo	597.621887 1717.768066 -143.558121	1.157 0.029 1.403
ttt_random_ammo	597.900574 1745.475952 -143.667175	0.046 0.000 -0.028
ttt_random_ammo	600.530457 1762.331055 -143.655411	0.049 0.000 -0.019
ttt_random_ammo	601.686890 1560.387085 -143.646652	0.054 -0.000 0.008
ttt_random_ammo	602.369263 1589.248901 -143.632706	0.081 -0.000 -0.032
ttt_random_ammo	595.904053 1604.887329 -143.637421	-0.067 0.000 -0.012
ttt_random_ammo	-1364.619873 1574.886353 -143.650970	0.051 0.000 -0.014
ttt_random_ammo	-1366.442871 1551.781738 -143.564941	1.282 0.031 1.551
ttt_random_ammo	-1366.546753 1524.846802 -143.667175	0.046 0.000 -0.028
ttt_random_ammo	-1374.500366 1751.997925 -143.631805	-0.050 0.068 0.192
ttt_random_ammo	-1370.671631 1710.591187 -143.613602	0.319 -0.002 -0.331
ttt_random_ammo	-1368.656128 1687.789551 -143.538406	0.714 -0.022 -0.865
ttt_random_ammo	542.978271 1705.726440 -287.576508	1.482 0.033 1.789
ttt_random_ammo	523.638367 1653.548218 -287.540619	0.726 0.022 0.874
ttt_random_ammo	532.781982 1616.336182 -287.657684	0.048 0.000 -0.021
ttt_random_ammo	527.776733 1676.182617 -287.577667	1.591 0.042 1.931
ttt_random_ammo	-1313.908569 1580.950073 -287.607788	0.618 0.005 0.697
ttt_random_ammo	-1287.270264 1601.728760 -287.653168	0.050 0.000 -0.017
ttt_random_ammo	-1288.441895 1642.617065 -287.605011	1.233 0.018 1.447
ttt_random_ammo	-1314.396606 1665.302490 -287.588043	1.279 0.027 1.445
ttt_random_ammo	-392.921906 679.789734 -287.635376	-0.071 -0.000 0.018
ttt_random_ammo	-373.036774 660.740417 -287.554504	1.072 0.028 1.298
ttt_random_ammo	-309.629028 3147.805420 -311.642487	0.060 0.000 0.001
ttt_random_ammo	-343.194611 3147.601074 -311.660004	0.047 0.000 -0.023
ttt_random_ammo	-367.530792 2419.721924 0.312006	0.048 0.000 -0.037
ttt_random_ammo	-396.484070 2418.865234 0.417106	1.594 0.036 1.922
ttt_random_ammo	-359.563446 2834.140137 160.376175	0.136 0.000 0.103
ttt_random_ammo	-425.960144 2833.702881 160.330368	0.046 0.000 -0.029
ttt_random_ammo	-815.236023 2863.220215 160.380859	0.190 -0.001 -0.172
ttt_random_ammo	-876.225098 2815.328125 160.351395	-0.191 0.087 0.373
ttt_random_ammo	-1531.167847 2128.404297 160.353348	0.055 0.000 -0.007
ttt_random_ammo	-1563.505249 2130.171875 160.337646	0.047 0.000 -0.025
ttt_random_ammo	-1650.702393 2132.131592 160.376205	0.133 0.000 0.100
ttt_random_ammo	-1702.264038 2144.068359 160.367325	0.084 0.000 0.036
ttt_random_ammo	658.956055 3634.383301 160.365433	0.076 0.000 0.025
ttt_random_ammo	658.990417 3589.748779 160.393707	1.071 -0.014 -1.250
ttt_random_ammo	657.571228 3533.597412 160.367294	0.083 -0.000 -0.034
ttt_random_ammo	657.907043 3472.442627 160.363495	0.070 -0.000 -0.017
ttt_random_ammo	654.731201 3413.202637 160.382324	0.217 -0.001 -0.205
ttt_random_ammo	370.065552 4405.904297 160.383942	0.247 0.001 0.242
ttt_random_ammo	433.750122 4411.447266 160.339996	0.047 0.000 -0.023
ttt_random_ammo	400.705139 4444.099121 160.363510	0.071 0.000 0.018
ttt_random_ammo	366.634857 4449.688477 160.357513	0.060 0.000 0.001
ttt_random_ammo	429.453613 4450.169922 160.414688	1.674 0.035 2.022
ttt_random_ammo	410.439270 4471.228516 160.372757	0.109 0.000 0.069
ttt_random_ammo	388.572693 4479.575684 160.349045	0.051 0.000 -0.014
ttt_random_ammo	403.237030 4493.648438 160.376190	0.133 0.000 0.100
ttt_random_ammo	325.141083 4238.771973 160.365417	0.076 -0.000 -0.025
ttt_random_ammo	344.250732 4201.366699 160.325317	0.046 0.000 -0.032
ttt_random_ammo	356.582397 4172.695801 160.394943	1.239 0.018 1.454
weapon_zm_molotov	-311.638611 3209.647949 160.169357	-1.293 -1.505 -1.316
weapon_zm_molotov	-333.275238 3168.006836 160.193008	-0.789 -1.560 -0.801
weapon_zm_molotov	-350.088562 3135.545166 160.157394	-1.548 -1.444 -1.577
weapon_zm_molotov	-135.342926 3948.723877 160.141739	-1.886 -1.286 -1.916
weapon_zm_molotov	-118.863831 3905.020996 160.159531	-1.503 -1.457 -1.530
weapon_zm_molotov	-103.306152 3875.845703 160.171143	-1.255 -1.505 -1.277
weapon_zm_molotov	108.490410 2306.430176 -311.834412	-1.373 -1.484 -1.397
weapon_zm_molotov	62.512600 2269.968262 -311.833435	-1.353 -1.483 -1.377
weapon_zm_molotov	44.492775 2243.208984 -311.844818	-1.596 -1.414 -1.625
weapon_zm_molotov	-641.209534 965.588806 -287.794006	-0.513 -1.569 -0.519
weapon_zm_molotov	-629.761658 978.036560 -287.854370	-1.799 -1.352 -1.833
weapon_zm_molotov	-609.498352 998.290894 -287.858276	-1.882 -1.286 -1.918
weapon_zm_molotov	272.013519 1802.379517 -287.843719	-1.572 -1.414 -1.600
weapon_zm_molotov	271.061371 1778.862183 -287.839417	-1.480 -1.456 -1.507
weapon_zm_molotov	267.069366 1500.962524 -287.827118	-1.218 -1.521 -1.239
weapon_zm_molotov	266.148621 1520.382935 -287.835358	-1.394 -1.486 -1.419
weapon_ttt_confgrenade	-719.331116 1189.073853 -285.863983	-36.363 -49.635 -90.953
weapon_ttt_confgrenade	-692.307739 1206.935791 -285.828583	-36.903 -49.093 -91.806
weapon_ttt_confgrenade	-677.494019 1221.799927 -285.889893	-35.967 -50.008 -90.343
weapon_ttt_confgrenade	-711.947754 906.331177 -285.840424	-36.723 -49.278 -91.518
weapon_ttt_confgrenade	-696.344543 919.837952 -285.853607	-36.521 -49.479 -91.201
weapon_ttt_confgrenade	-674.300720 936.989502 -285.754883	-38.028 -47.858 -93.652
weapon_ttt_confgrenade	-158.700348 1012.711975 -285.869110	-36.284 -49.708 -90.832
weapon_ttt_confgrenade	-141.682465 998.721619 -285.898376	-35.837 -50.120 -90.145
weapon_ttt_confgrenade	-124.564919 977.841492 -285.820892	-37.021 -48.970 -91.994
weapon_ttt_confgrenade	-161.179535 1304.657471 -285.842163	-36.696 -49.304 -91.476
weapon_ttt_confgrenade	-147.210800 1286.604980 -285.787872	-37.525 -48.427 -92.813
weapon_ttt_confgrenade	-128.079575 1267.874023 -285.868286	-36.297 -49.695 -90.851
weapon_ttt_confgrenade	-424.153625 3479.850586 154.115097	-36.043 -56.444 -90.459
weapon_ttt_confgrenade	-416.493591 3501.122070 154.117554	-36.080 -56.408 -90.517
weapon_ttt_confgrenade	-404.242645 3528.576904 154.172729	-36.923 -55.551 -91.838
weapon_ttt_confgrenade	-1028.924316 2981.245361 162.136414	-36.368 -49.623 -90.962
weapon_ttt_confgrenade	-1013.857361 3004.086426 162.120483	-36.125 -49.851 -90.586
weapon_ttt_confgrenade	-995.339478 3038.735352 162.107986	-35.934 -50.027 -90.293
weapon_ttt_confgrenade	-195.612747 3907.577148 162.170090	-36.883 -49.108 -91.773
weapon_ttt_confgrenade	-184.869934 3872.002197 162.253082	-38.150 -47.711 -93.857
weapon_ttt_confgrenade	-171.909561 3846.127930 162.183685	-37.091 -48.892 -92.106
weapon_ttt_confgrenade	59.226719 2365.854248 -309.818024	-37.065 -48.925 -92.064
weapon_ttt_confgrenade	34.327122 2336.892578 -309.853638	-36.520 -49.481 -91.200
weapon_ttt_confgrenade	7.862839 2311.040283 -309.903351	-35.761 -50.186 -90.030
weapon_ttt_confgrenade	-544.673645 517.637146 2.113828	-36.023 -50.206 -90.430
weapon_ttt_confgrenade	-538.835083 500.150177 2.217488	-37.607 -48.331 -92.948
weapon_ttt_confgrenade	-521.598877 472.192902 2.163550	-36.783 -49.209 -91.614
