<?xml version="1.0" encoding="UTF-8" standalone="no"?>
<svg
   xmlns:dc="http://purl.org/dc/elements/1.1/"
   xmlns:cc="http://creativecommons.org/ns#"
   xmlns:rdf="http://www.w3.org/1999/02/22-rdf-syntax-ns#"
   xmlns:svg="http://www.w3.org/2000/svg"
   xmlns="http://www.w3.org/2000/svg"
   xmlns:sodipodi="http://sodipodi.sourceforge.net/DTD/sodipodi-0.dtd"
   xmlns:inkscape="http://www.inkscape.org/namespaces/inkscape"
   inkscape:version="1.0 (4035a4fb49, 2020-05-01)"
   sodipodi:docname="cat.svg"
   id="svg5871"
   version="1.1"
   width="512pt"
   viewBox="0 0 512 512.0007"
   height="512pt">
  <metadata
     id="metadata5877">
    <rdf:RDF>
      <cc:Work
         rdf:about="">
        <dc:format>image/svg+xml</dc:format>
        <dc:type
           rdf:resource="http://purl.org/dc/dcmitype/StillImage" />
      </cc:Work>
    </rdf:RDF>
  </metadata>
  <defs
     id="defs5875" />
  <sodipodi:namedview
     inkscape:current-layer="svg5871"
     inkscape:window-maximized="1"
     inkscape:window-y="-8"
     inkscape:window-x="-8"
     inkscape:cy="604.07456"
     inkscape:cx="304.6902"
     inkscape:zoom="0.99609375"
     showgrid="false"
     id="namedview5873"
     inkscape:window-height="847"
     inkscape:window-width="1440"
     inkscape:pageshadow="2"
     inkscape:pageopacity="0"
     guidetolerance="10"
     gridtolerance="10"
     objecttolerance="10"
     borderopacity="1"
     bordercolor="#666666"
     pagecolor="#ffffff" />
  <path
     style="fill:#006633;fill-opacity:1"
     id="path5869"
     d="m334.957031 242.929688c-12.117187-.957032-21.933593-10.773438-22.886719-22.890626-1.214843-15.402343 11.542969-28.164062 26.945313-26.949218 12.117187.957031 21.9375 10.773437 22.890625 22.894531 1.214844 15.402344-11.542969 28.160156-26.949219 26.945313zm-156.933593 0c12.117187-.957032 21.933593-10.773438 22.886718-22.890626 1.214844-15.402343-11.542968-28.164062-26.945312-26.949218-12.117188.957031-21.933594 10.773437-22.890625 22.894531-1.214844 15.402344 11.542969 28.160156 26.949219 26.945313zm308.210937-236.550782c-16.117187-8.945312-35.078125-8.457031-50.71875 1.300782-.171875.105468-.335937.214843-.503906.324218l-84.078125 56.011719h-195.65625l-77.394532-53.960937c-.160156-.105469-.316406-.214844-.476562-.320313-15.382812-10.082031-34.988281-10.914063-51.171875-2.171875s-26.234375 25.597656-26.234375 43.988281v204.460938c0 68.375 26.628906 132.660156 74.980469 181.011719 48.347656 48.351562 112.632812 74.976562 181.011719 74.976562 45.410156 0 90.023437-12.050781 129.019531-34.847656 9.535156-5.574219 12.746093-17.824219 7.171875-27.359375-5.574219-9.535157-17.820313-12.746094-27.359375-7.171875-32.875 19.222656-70.511719 29.382812-108.832031 29.382812-58.863282 0-112.292969-23.679687-151.289063-62h4.292969c11.046875 0 20-8.953125 20-20 0-11.042968-8.953125-19.996094-20-19.996094h-36.382813c-7.824219-12.539062-14.40625-25.925781-19.554687-40h67.9375c11.042968 0 19.996094-8.953124 19.996094-20 0-11.046874-8.953126-20-19.996094-20h-78.3125c-1.757813-11.078124-2.683594-22.433593-2.683594-33.996093 0-44.769531 12.796875-79.796875 44.175781-120.910157 6.699219-8.78125 5.015625-21.332031-3.765625-28.03125-8.78125-6.699218-21.332031-5.015624-28.03125 3.765626-4.433594 5.808593-8.550781 11.546874-12.382812 17.242187v-76.527344c0-5.382812 3.671875-7.945312 5.25-8.796875 1.554687-.839844 5.621094-2.472656 10.050781.316406l82.257813 57.351563c3.355468 2.339844 7.347656 3.59375 11.4375 3.59375h207.992187c3.945313 0 7.804687-1.167969 11.089844-3.355469l88.808593-59.160156c4.429688-2.648438 8.425782-.988281 9.949219-.144531 1.546875.859375 5.148438 3.429687 5.148438 8.742187v77.980469c-3.828125-5.699219-7.945313-11.4375-12.378907-17.242187-6.699218-8.78125-19.25-10.46875-28.03125-3.765626-8.78125 6.699219-10.464843 19.25-3.765624 28.03125 31.375 41.113282 44.175781 76.140626 44.175781 120.90625 0 11.476563-.894531 22.835938-2.65625 34h-78.339844c-11.042969 0-19.996094 8.953126-19.996094 20 0 11.046876 8.953125 20 19.996094 20h68.003906c-5.070312 13.902344-11.585937 27.296876-19.5 39.996094h-36.503906c-11.042969 0-20 8.953125-20 20s8.957031 20 20 20h47.292969c6.570312 0 12.71875-3.226562 16.453125-8.632812 29.601562-42.839844 45.25-93.105469 45.25-145.363282v-205.910156c0-18.433594-9.625-34.777344-25.746094-43.71875zm-270.242187 408.625c15.355468 0 29.375-5.804687 40-15.324218 10.621093 9.519531 24.644531 15.324218 39.996093 15.324218 33.082031 0 60-26.914062 60-59.996094 0-11.046874-8.953125-20-20-20s-20 8.953126-20 20c0 11.027344-8.972656 19.996094-20 19.996094-11.027343 0-20-8.96875-20-19.996094 0-1.628906-.214843-3.199218-.578125-4.714843 13.773438-8.632813 31.390625-22.867188 38.683594-42.070313 3.335938-8.78125-3.078125-18.214844-12.410156-18.214844h-89.382813c-9.332031 0-15.75 9.433594-12.414062 18.214844 6.96875 18.34375 23.351562 32.691406 36.8125 41.585938-.449219 1.660156-.707031 3.398437-.707031 5.199218 0 11.027344-8.972657 19.996094-20 19.996094-11.027344 0-20-8.96875-20-19.996094 0-11.046874-8.953126-20-20-20-11.042969 0-19.996094 8.953126-19.996094 20 0 33.082032 26.914062 59.996094 59.996094 59.996094zm0 0" />
</svg>
