<?xml version="1.0" encoding="UTF-8" standalone="no"?>
<svg
   height="36"
   viewBox="0 0 9.5249997 9.5250005"
   width="36"
   version="1.1"
   id="svg499"
   sodipodi:docname="Arrow_30_36.svg"
   inkscape:export-filename="Arrow_30_36.png"
   inkscape:export-xdpi="96"
   inkscape:export-ydpi="96"
   inkscape:version="1.2 (dc2aedaf03, 2022-05-15)"
   xmlns:inkscape="http://www.inkscape.org/namespaces/inkscape"
   xmlns:sodipodi="http://sodipodi.sourceforge.net/DTD/sodipodi-0.dtd"
   xmlns="http://www.w3.org/2000/svg"
   xmlns:svg="http://www.w3.org/2000/svg">
  <defs
     id="defs503" />
  <sodipodi:namedview
     id="namedview501"
     pagecolor="#ffffff"
     bordercolor="#666666"
     borderopacity="1.0"
     inkscape:showpageshadow="2"
     inkscape:pageopacity="0.0"
     inkscape:pagecheckerboard="0"
     inkscape:deskcolor="#d1d1d1"
     showgrid="true"
     inkscape:zoom="25.5"
     inkscape:cx="17.980392"
     inkscape:cy="18"
     inkscape:current-layer="svg499">
    <inkscape:grid
       type="xygrid"
       id="grid970" />
  </sodipodi:namedview>
  <g
     fill="none"
     stroke-linecap="round"
     id="g497">
    <g
       stroke="#fff"
       stroke-width="1.785938"
       id="g483">
      <path
         d="m3.6049482 2.4143102 1.190625-1.190625 1.1906252 1.1906252"
         stroke-linejoin="round"
         id="path471" />
      <path
         d="m4.795573 1.223698v7.1437505"
         id="path473" />
      <path
         d="m7.1768231 3.6049482 1.1906252 1.190625-1.1906252 1.1906252"
         stroke-linejoin="round"
         id="path475" />
      <path
         d="m2.4143102 5.9861984-1.190625-1.1906252 1.190625-1.190625"
         stroke-linejoin="round"
         id="path477" />
      <path
         d="m3.604948 7.1768231 1.1906252 1.1906259 1.1906252-1.1906259"
         stroke-linejoin="round"
         id="path479" />
      <path
         d="m1.223698 4.7955732h7.1437505"
         id="path481" />
    </g>
    <path
       d="m3.6049482 2.4143102 1.190625-1.190625 1.1906252 1.1906252"
       stroke="#a00"
       stroke-linejoin="round"
       stroke-width=".595312"
       id="path485" />
    <path
       d="m4.795573 1.223698v7.1437505"
       stroke="#a00"
       stroke-width=".595312"
       id="path487" />
    <path
       d="m7.1768231 3.6049482 1.1906252 1.190625-1.1906252 1.1906252"
       stroke="#a00"
       stroke-linejoin="round"
       stroke-width=".595312"
       id="path489" />
    <path
       d="m2.4143102 5.9861984-1.190625-1.1906252 1.190625-1.190625"
       stroke="#a00"
       stroke-linejoin="round"
       stroke-width=".595312"
       id="path491" />
    <path
       d="m3.604948 7.1768231 1.1906252 1.1906259 1.1906252-1.1906259"
       stroke="#a00"
       stroke-linejoin="round"
       stroke-width=".595312"
       id="path493" />
    <path
       d="m1.223698 4.7955732h7.1437505"
       stroke="#a00"
       stroke-width=".595312"
       id="path495" />
  </g>
</svg>
