<?xml version="1.0" encoding="UTF-8" standalone="no"?>
<svg
   height="24"
   width="24"
   version="1.1"
   id="svg967"
   sodipodi:docname="menu_toggle_bookmark8_150.svg"
   inkscape:export-filename="menu_toggle_bookmark8_150.png"
   inkscape:export-xdpi="96"
   inkscape:export-ydpi="96"
   inkscape:version="1.2.2 (732a01da63, 2022-12-09)"
   xmlns:inkscape="http://www.inkscape.org/namespaces/inkscape"
   xmlns:sodipodi="http://sodipodi.sourceforge.net/DTD/sodipodi-0.dtd"
   xmlns="http://www.w3.org/2000/svg"
   xmlns:svg="http://www.w3.org/2000/svg">
  <defs
     id="defs971" />
  <sodipodi:namedview
     id="namedview969"
     pagecolor="#ffffff"
     bordercolor="#666666"
     borderopacity="1.0"
     inkscape:showpageshadow="2"
     inkscape:pageopacity="0.0"
     inkscape:pagecheckerboard="0"
     inkscape:deskcolor="#d1d1d1"
     showgrid="true"
     inkscape:zoom="38.25"
     inkscape:cx="11.594771"
     inkscape:cy="12"
     inkscape:current-layer="svg967">
    <inkscape:grid
       type="xygrid"
       id="grid1444" />
  </sodipodi:namedview>
  <radialGradient
     id="a"
     cx="10.5"
     cy="12"
     gradientUnits="userSpaceOnUse"
     r="6">
    <stop
       offset="0"
       stop-color="#2a7fff"
       id="stop954" />
    <stop
       offset=".69999999"
       stop-color="#4d94ff"
       id="stop956" />
    <stop
       offset="1"
       stop-color="#96bdff"
       id="stop958" />
  </radialGradient>
  <g
     stroke-width=".666667"
     transform="matrix(1.5 0 0 1.5 -3.75 -6.5)"
     id="g965">
    <circle
       cx="10.5"
       cy="12"
       fill="url(#a)"
       r="6"
       id="circle961" />
    <path
       d="m10.563013 15.573188c-.7733976.017503-1.611454-.325988-1.9631554-1.053417-.2479925-.522617-.2616132-1.144284-.0994702-1.693297.1494748-.448268.4576427-.851753.8788071-1.074908-.5690517-.300949-.88476-.959557-.8350586-1.591523-.0259785-.7150812.3993664-1.4314261 1.0743705-1.6959059.7100646-.2853864 1.5759966-.247506 2.2210416.182976.537388.3567763.780868 1.0223327.742342 1.6489999.01508.59106-.324751 1.180827-.849795 1.455453.676428.364502 1.05409 1.155704.996103 1.910868.000119.724586-.43829 1.435711-1.11906 1.70904-.32806.144772-.689183.202062-1.046125.201714zm0-.962774c.496127.02299 1.020167-.284508 1.132241-.789621.110448-.458606-.000487-1.015965-.423074-1.281773-.505366-.31205-1.264995-.261211-1.6547482.21431-.2632753.338289-.278148.82081-.1433722 1.213596.1671374.434616.6432964.657298 1.0889534.643488zm0-3.227256c.458251.02396.899416-.305485.984878-.760148.09946-.453941-.0023-1.0210198-.45437-1.2489046-.505119-.2773767-1.2698082-.1044968-1.4754752.4737115-.1555196.4684211-.0850098 1.0816481.3583537 1.3728551.1719065.115266.3815945.162968.5866135.162486z"
       fill="#fff"
       transform="scale(.99403409 1.0060017)"
       id="path963" />
  </g>
  <g
     id="g1579">
    <path
       d="M 5.7499999,0.74999998 H 0.74999998 V 5.7499999"
       stroke="#00cc00"
       id="path155"
       style="fill:none;stroke-width:1.5;stroke-linecap:round" />
    <path
       d="M 18.250001,22.249999 H 23.25 V 17.25"
       stroke="#ff0000"
       id="path157"
       style="fill:none;stroke-width:1.5;stroke-linecap:round" />
  </g>
</svg>
