<svg width="32" height="32" version="1.1" xmlns="http://www.w3.org/2000/svg">
 <rect x=".49999997" y="2.5" width="22.999998" height="27" ry="2.2500002" fill="#ebfcff" stroke="#00aad4" stroke-linejoin="round"/>
 <rect x="14.5" y="10.5" width="17" height="21" ry="2.2647061" fill="#c2f3ff" stroke="#00aad4" stroke-linejoin="round"/>
 <rect x="6.5" y=".5" width="11" height="6" ry="2.0625" fill="#c2f3ff" stroke="#00aad4" stroke-linejoin="round"/>
</svg>
