<?xml version="1.0" encoding="UTF-8" standalone="no"?>
<svg
   width="24"
   height="24"
   version="1.1"
   viewBox="0 0 24 24"
   id="svg6"
   sodipodi:docname="quick_table_150.svg"
   inkscape:export-filename="quick_table_150.png"
   inkscape:export-xdpi="96"
   inkscape:export-ydpi="96"
   inkscape:version="1.3.2 (091e20e, 2023-11-25, custom)"
   xmlns:inkscape="http://www.inkscape.org/namespaces/inkscape"
   xmlns:sodipodi="http://sodipodi.sourceforge.net/DTD/sodipodi-0.dtd"
   xmlns="http://www.w3.org/2000/svg"
   xmlns:svg="http://www.w3.org/2000/svg">
  <defs
     id="defs6" />
  <sodipodi:namedview
     id="namedview6"
     pagecolor="#ffffff"
     bordercolor="#000000"
     borderopacity="0.25"
     inkscape:showpageshadow="2"
     inkscape:pageopacity="0.0"
     inkscape:pagecheckerboard="0"
     inkscape:deskcolor="#d1d1d1"
     showgrid="true"
     inkscape:current-layer="svg6">
    <inkscape:grid
       id="grid6"
       units="px"
       originx="0"
       originy="0"
       spacingx="0.5"
       spacingy="0.5"
       empcolor="#0099e5"
       empopacity="0.30196078"
       color="#0099e5"
       opacity="0.14901961"
       empspacing="2"
       dotted="false"
       gridanglex="30"
       gridanglez="30"
       visible="true" />
  </sodipodi:namedview>
  <rect
     x=".5"
     y="1.5"
     width="23"
     height="21"
     fill="#ffffff"
     fill-opacity=".917647"
     stroke="#b3b3b3"
     stroke-linecap="round"
     stroke-linejoin="round"
     stroke-width="1"
     id="rect1" />
  <path
     d="m1 8.5h22"
     fill="#008dd2"
     stroke="#cccccc"
     stroke-linejoin="round"
     id="path1" />
  <path
     d="m1 13.5h22"
     fill="#008dd2"
     stroke="#cccccc"
     stroke-linejoin="round"
     id="path2" />
  <path
     d="m5.5 22v-17"
     fill="#008dd2"
     stroke="#cccccc"
     stroke-linejoin="round"
     id="path3" />
  <path
     d="m11.5 22v-17"
     fill="#008dd2"
     stroke="#cccccc"
     stroke-linejoin="round"
     id="path4" />
  <path
     d="m17.5 22v-17"
     fill="#008dd2"
     stroke="#cccccc"
     stroke-linejoin="round"
     id="path5" />
  <rect
     x=".5"
     y="1.5"
     width="23"
     height="3"
     fill="#008dd2"
     stroke="#008dd2"
     stroke-linecap="round"
     stroke-linejoin="round"
     stroke-width="1"
     id="rect5" />
  <path
     d="m1 18.5h22"
     fill="#008dd2"
     stroke="#cccccc"
     stroke-linejoin="round"
     id="path6" />
</svg>
