<?xml version="1.0" encoding="UTF-8" standalone="no"?>
<svg
   width="36"
   height="36"
   version="1.1"
   viewBox="0 0 36 36"
   id="svg3"
   sodipodi:docname="tiphtmlpanel_150.svg"
   inkscape:version="1.3.2 (091e20e, 2023-11-25, custom)"
   xmlns:inkscape="http://www.inkscape.org/namespaces/inkscape"
   xmlns:sodipodi="http://sodipodi.sourceforge.net/DTD/sodipodi-0.dtd"
   xmlns="http://www.w3.org/2000/svg"
   xmlns:svg="http://www.w3.org/2000/svg">
  <sodipodi:namedview
     id="namedview3"
     pagecolor="#ffffff"
     bordercolor="#000000"
     borderopacity="0.25"
     inkscape:showpageshadow="2"
     inkscape:pageopacity="0.0"
     inkscape:pagecheckerboard="0"
     inkscape:deskcolor="#d1d1d1"
     showgrid="true"
     inkscape:current-layer="svg3">
    <inkscape:grid
       id="grid3"
       units="px"
       originx="0"
       originy="0"
       spacingx="0.5"
       spacingy="0.5"
       empcolor="#0099e5"
       empopacity="0.30196078"
       color="#0099e5"
       opacity="0.14901961"
       empspacing="2"
       dotted="false"
       gridanglex="30"
       gridanglez="30"
       visible="true" />
  </sodipodi:namedview>
  <defs
     id="defs2">
    <radialGradient
       id="a"
       cx="-4.3552999"
       cy="-7.9933"
       r="6.1504998"
       gradientTransform="matrix(.33198254 2.035557 -1.9186722 .31292376 .176048 26.219262)"
       gradientUnits="userSpaceOnUse">
      <stop
         stop-color="#fff"
         offset="0"
         id="stop1" />
      <stop
         stop-color="#99c1ff"
         offset="1"
         id="stop2" />
    </radialGradient>
  </defs>
  <path
     d="m3.5 32.5v-29h29v29z"
     fill="#f9f9f9"
     fill-rule="evenodd"
     stroke="#2a7efe"
     stroke-linejoin="round"
     stroke-width=".999999"
     id="path2" />
  <circle
     cx="18"
     cy="18"
     r="10.0625"
     fill="url(#a)"
     stroke-width=".929906"
     id="circle2" />
  <path
     d="m14.914902 8.62841c0.869356-0.40789-0.89354-0.01455-0.656991 0.563242-0.690246 0.13743 0.28006-0.657102-0.420341-0.29943-0.152302 0.280832-0.767203 0.460182-0.0266 0.401066 0.738089 0.466494 1.34702-0.710909 2.151183-0.697361 0.560232-0.02952-0.51769 0.470277 0.159933 0.454631-0.337965 0.853104-0.5389 2.434185 0.887223 2.236008 0.06463-0.764258 0.642285-1.32143 1.253429-1.827669 0.616462-0.536147-0.593491-0.0013-0.247887-0.764454-0.243344-0.820308-1.393178 0.142049-1.777167-0.174248-0.38399-0.316291-1.17318 0.463371-1.322783 0.10821zm5.27797-0.239901c-0.989368 0.05158-0.07784 0.279036 0.272303 0.582714 0.154729-0.211778 0.05867-0.644346-0.272303-0.582714zm1.656488 1.04108c-0.584322 0.173675-1.328673 1.637255-0.50497 1.779681 0.468752-0.207195 0.585285 1.062707 0.790765 0.07475-0.08933-0.301167-0.274948-1.681084 0.11397-0.798221 0.110745 0.428023 1.020782 0.858313 0.359469 0.934447 0.137955 0.699633-1.113373 0.490592-1.144209-0.0492 0.189486 0.587484-0.540967 1.140577-1.117996 1.289337 0.557467 0.209259 0.60414 1.014468-0.184158 0.721318-0.850979 0.644666 0.727287 1.549316 0.941789 0.486494 0.360557-0.831878 1.595694-0.445578 1.780615 0.287736-0.719084 0.325762 0.555732 0.160146 0.0995-0.377584-0.447647-0.151558-0.949043-0.983623-0.144045-0.411737 0.455224 0.14076 0.921361 1.635624 0.88467 0.516566 0.603463-0.02745 0.193569-1.337283 0.728982-0.781886 0.303091-0.651349 1.394509 1.090589 0.413847 0.633314-0.814559-0.43739-1.096799 0.86161-0.138735 0.697564 0.979849-0.02201-0.128025 1.342616-0.641981 0.618615-0.692947 0.30374-1.800393-0.0347-1.775059-1.006938-0.41795-0.83535 0.09559 0.844206-0.733632 0.412199-1.214247-0.06322-1.884401 0.91279-2.314002 1.89103-0.343325 0.836204-0.29952 1.699488 0.460195 2.25285 0.456266 0.944229 1.62189 0.0055 2.207889 0.2759 0.995961 0.160366 0.476777 1.331106 0.897152 2.052633-0.42417 0.809842-0.404928 1.629642-0.184973 2.496344-0.0785 1.253108 1.53835 0.241039 1.703388-0.403202 0.418638-0.737562 1.243644-1.319084 1.229333-2.282678 0.15757-0.980105 1.050085-1.644726 1.212801-2.629848-0.99708-0.13212-1.056212-1.471398-1.52411-2.188988-0.368263-0.944827 0.568455 0.50385 0.59639 0.829425 0.495843 0.121755 0.349002 1.469288 0.773188 0.892826 0.493106-0.390706 1.078364-1.179171 0.278997-1.603356-0.584782 0.0068-0.68964-1.24306-0.130725-0.369378 1.173146 0.08488 1.727886 2.988328 0.828452-0.479268-0.642471-2.192838-2.145881-4.438521-4.09839-5.45362-0.14217 0.365247-0.497499 0.784575-0.819786 0.253182 1.041705 0.19411-0.702314-0.641513-0.844616-0.560313zm-9.940602 1.053503c-0.703178-0.18811-3.378408 2.251975-3.363298 5.613106-0.112021 0.313064 0.161629 1.610284 0.387997 1.243517-0.210396-0.359967-0.13167-1.850017 0.04033-0.749082 0.231713 0.787499 0.404429 2.051952 1.376277 1.848948 0.631096 0.276902 1.009893 1.460597 1.663681 1.032695-0.391747 0.701452-0.540082 1.581811-0.430408 2.294867 0.295204 0.972525 1.379196 1.35747 1.766308 2.248784 0.438008 0.987453 0.619113 2.183744 1.469334 2.91627 0.414489 0.282114 1.259571 0.435173 0.413982-0.0018-0.726745-0.750845-0.08036-1.457643 0.428328-2.03969 0.1125-0.494237 0.179982-0.966539 0.82224-1.051021 0.10941-0.666992 0.624804-1.428193 0.563048-2.016869-0.552542-0.497524-1.751171-0.279352-2.043192-0.712366 0.0243-0.944537-1.215254-0.468139-1.538784-1.191153-0.467286-0.07665-1.243551-0.504993-1.244493 0.0114 0.193755-0.617335-0.330027-0.76561-0.775731-0.778282-0.07521-0.463749-0.01782-0.879473-0.615812-0.772695 0.02706-0.381873-3e-3 -1.444304-0.262657-0.497327-0.807965 0.56492-1.048058-1.889061 0.09037-1.393981 0.508906-0.62708 0.942927 0.291276 1.048906 0.596449-0.245593-1.045198 0.761412-1.693869 1.264377-2.482278 0.216509-0.986229 1.39188-0.08694 1.596024-0.821629-0.349122 0.690264-1.098328-0.860077-0.256545-0.507387 0.740198 0.116115 1.177139-0.510242 0.466181-0.952311 0.02577-0.67194-0.433517-0.386463-0.778365-0.477392-0.04434-1.011099-1.122525-0.10971-0.958667 0.50891-0.314848 0.150961-0.586951 1.235428-0.685108 0.301878-0.206748-0.384495-1.017374-0.616356-0.323196-1.152698 0.279966-0.416572 0.712798-0.748872 1.024626-0.302898 0.545586-0.04899-0.405189-0.630235 0.359574-0.603379 0.05906-0.269915 0.452131-0.730665 0.640992-0.352842-0.4095 0.401859 0.676182 0.03993 6.09e-4 0.470607-0.918842 0.273582 0.08916 0.528214 0.406246 0.742705 0.461885-0.18738-0.151602-1.120509 0.534908-0.605352 0.301407-0.34402-0.707174-1.300449-1.05621-1.202548-0.200625 0.318916 0.18511-0.167999-0.407937-0.231717-0.593048-0.06372-0.60629 1.182234-1.623945 1.066561zm1.628245-0.834809c0.369617 0.06602-0.771624 1.473141-0.450234 0.338981 0.04378-0.201988 0.243683-0.353652 0.450234-0.338981zm-1.134315 0.04658-0.636714 0.474881c-0.265757 0.68479 1.481025-0.534917 0.636714-0.474881zm5.677998 0.423826c-0.797571 0.277968 0.990461 0.808096 0.780786 0.11841-0.248416-0.09338-0.518895-0.102915-0.780786-0.11841zm2.033309 1.086931c-0.358974 0.300147 0.338935 0.840189 0.31259 1.208081 1.05088 0.012-0.108285-0.930312-0.31259-1.208081zm-0.1694 0.436594c-0.656586 0.165481-0.180622 0.965841 0.0846 0.217856 0.01546-0.05562 0.01807-0.218217-0.0846-0.217856zm5.794689 1.236217c0.198428 0.388108 0.896168 1.177617 0.711011 1.548188-0.325111-0.270253-1.023498-1.180705-0.711011-1.548188zm-10.70646 0.572022c-0.339454 0.378589 0.722789 0.624018 0.361308 0.04419 0.02109 0.07356-0.375571-0.165989-0.361308-0.04419zm-3.672751 3.931701c-0.599547 0.43082 0.99289 0.13212 0.421771 0.906964 0.386711 0.02567 0.522996-0.786051 0.650931-0.162976 0.422847 0.06186 1.461552 0.07291 0.50396-0.28926-0.500927-0.213228-1.0316-0.410933-1.576662-0.454728zm15.042647 3.786294c-0.428758 0.411525-1.449522 1.314495-0.827144 1.882474 0.474108-0.429163 0.684043-1.250937 1.037162-1.787874-0.03548-0.0789-0.134775-0.09475-0.210018-0.09461z"
     fill="#2ba12b"
     stroke-width="1.44828"
     id="path3" />
  <circle
     cx="18"
     cy="18"
     r="10.150001"
     fill="none"
     stroke="#2a7efe"
     stroke-width=".700001"
     id="circle3" />
</svg>
