<?xml version="1.0" encoding="UTF-8" standalone="no"?>
<svg
   height="16"
   viewBox="0 0 4.2333332 4.2333335"
   width="16"
   version="1.1"
   id="svg665"
   sodipodi:docname="Health_01_16.svg"
   inkscape:export-filename="Health_01_16.png"
   inkscape:export-xdpi="96"
   inkscape:export-ydpi="96"
   inkscape:version="1.2.1 (9c6d41e410, 2022-07-14)"
   xmlns:inkscape="http://www.inkscape.org/namespaces/inkscape"
   xmlns:sodipodi="http://sodipodi.sourceforge.net/DTD/sodipodi-0.dtd"
   xmlns="http://www.w3.org/2000/svg"
   xmlns:svg="http://www.w3.org/2000/svg">
  <defs
     id="defs669" />
  <sodipodi:namedview
     id="namedview667"
     pagecolor="#ffffff"
     bordercolor="#666666"
     borderopacity="1.0"
     inkscape:showpageshadow="2"
     inkscape:pageopacity="0.0"
     inkscape:pagecheckerboard="0"
     inkscape:deskcolor="#d1d1d1"
     showgrid="true"
     inkscape:zoom="57.375"
     inkscape:cx="7.7298475"
     inkscape:cy="8"
     inkscape:current-layer="svg665">
    <inkscape:grid
       type="xygrid"
       id="grid892" />
  </sodipodi:namedview>
  <radialGradient
     id="a"
     cx="1.925345"
     cy="1.585938"
     gradientTransform="matrix(0.25308069,1.0629388,-1.5000071,0.35714457,3.4791413,-0.893141)"
     gradientUnits="userSpaceOnUse"
     r="1.852075">
    <stop
       offset="0"
       stop-color="#faa"
       id="stop658" />
    <stop
       offset="1"
       stop-color="#f00"
       id="stop660" />
  </radialGradient>
  <path
     d="m 1.2420385,0.39690051 c -0.931054,0.002291 -1.6115119,1.70202259 0.8743709,3.41127989 3.28034,-2.2555149 1.0468171,-4.49400631 0,-2.83811398 C 1.8628834,0.56903004 1.5395919,0.39616837 1.2420385,0.39690051 Z"
     fill="url(#a)"
     stroke="#d40000"
     stroke-width="0.264583"
     id="path663"
     style="fill:url(#a)" />
</svg>
