<?xml version="1.0" encoding="UTF-8" standalone="no"?>
<svg
   height="64"
   viewBox="0 0 64 64"
   width="64"
   version="1.1"
   id="svg4"
   sodipodi:docname="Chart_12_64.svg"
   inkscape:export-filename="Chart_12_64.png"
   inkscape:export-xdpi="96"
   inkscape:export-ydpi="96"
   inkscape:version="1.3-beta (cedbd6c6ff, 2023-05-28)"
   xmlns:inkscape="http://www.inkscape.org/namespaces/inkscape"
   xmlns:sodipodi="http://sodipodi.sourceforge.net/DTD/sodipodi-0.dtd"
   xmlns="http://www.w3.org/2000/svg"
   xmlns:svg="http://www.w3.org/2000/svg">
  <defs
     id="defs4" />
  <sodipodi:namedview
     id="namedview4"
     pagecolor="#ffffff"
     bordercolor="#000000"
     borderopacity="0.25"
     inkscape:showpageshadow="2"
     inkscape:pageopacity="0.0"
     inkscape:pagecheckerboard="0"
     inkscape:deskcolor="#d1d1d1"
     showgrid="true"
     inkscape:current-layer="svg4">
    <inkscape:grid
       id="grid4"
       units="px"
       originx="0"
       originy="0"
       spacingx="0.5"
       spacingy="0.5"
       empcolor="#0099e5"
       empopacity="0.30196078"
       color="#0099e5"
       opacity="0.14901961"
       empspacing="2"
       dotted="false"
       gridanglex="30"
       gridanglez="30"
       visible="true" />
  </sodipodi:namedview>
  <g
     stroke-linecap="round"
     stroke-linejoin="round"
     id="g4">
    <path
       d="m13.499998 3.5h37v14h-37z"
       fill="#fff"
       stroke="#912d2d"
       stroke-width="2.99999"
       id="path1" />
    <path
       d="m20.5 10.25h23"
       fill="none"
       stroke="#912d2d"
       stroke-width="2.5"
       id="path2" />
    <path
       d="m9.499998 23.5h45.000004v35h-45.000004z"
       fill="#fff"
       stroke="#999"
       stroke-width="3"
       id="path3" />
    <path
       d="m13.999998 54 8-16 4 8 8-12 4 4 8-10"
       fill="none"
       stroke="#4d4d4d"
       stroke-width="2.8"
       id="path4" />
  </g>
</svg>
