<?xml version="1.0" encoding="UTF-8" standalone="no"?>
<svg
   height="24"
   viewBox="0 0 6.3499998 6.3500003"
   width="24"
   version="1.1"
   id="svg131"
   sodipodi:docname="Arrow_16_24.svg"
   inkscape:version="1.2 (dc2aedaf03, 2022-05-15)"
   xmlns:inkscape="http://www.inkscape.org/namespaces/inkscape"
   xmlns:sodipodi="http://sodipodi.sourceforge.net/DTD/sodipodi-0.dtd"
   xmlns="http://www.w3.org/2000/svg"
   xmlns:svg="http://www.w3.org/2000/svg">
  <defs
     id="defs135">
    <radialGradient
       id="a"
       cx="12.1"
       cy="10.900001"
       gradientTransform="matrix(0,0.7483166,-0.74831654,0,10.321424,-6.8898592)"
       gradientUnits="userSpaceOnUse"
       r="4.5">
      <stop
         offset="0"
         stop-color="#ff7f2a"
         id="stop962" />
      <stop
         offset="1"
         stop-color="#d45500"
         id="stop964" />
    </radialGradient>
  </defs>
  <sodipodi:namedview
     id="namedview133"
     pagecolor="#ffffff"
     bordercolor="#666666"
     borderopacity="1.0"
     inkscape:showpageshadow="2"
     inkscape:pageopacity="0.0"
     inkscape:pagecheckerboard="0"
     inkscape:deskcolor="#d1d1d1"
     showgrid="true"
     inkscape:zoom="38.25"
     inkscape:cx="10.810458"
     inkscape:cy="12"
     inkscape:current-layer="svg131">
    <inkscape:grid
       type="xygrid"
       id="grid1286" />
  </sodipodi:namedview>
  <g
     id="g1089">
    <circle
       cx="3.1750007"
       cy="3.175"
       fill="url(#a)"
       r="2.7781253"
       stroke-dashoffset="1.49998"
       stroke-linejoin="round"
       stroke-width="0.286632"
       transform="matrix(0,1,1,0,0,0)"
       id="circle967"
       style="fill:url(#a);stroke:#ffccaa;stroke-width:0.396875;stroke-linecap:round;stroke-dasharray:none" />
    <g
       fill="none"
       stroke-width="1.07062"
       transform="matrix(0,0.66923176,-0.66939588,0,10.5652,-4.8305501)"
       id="g973"
       style="stroke:#ffffff;stroke-width:1.18592;stroke-linecap:round;stroke-dasharray:none">
      <path
         d="m 11.369269,8.9650052 2.075608,2.0750988 -2.075608,2.075099"
         id="path969"
         style="stroke-width:1.18592;stroke-linecap:round;stroke-linejoin:round;stroke-dasharray:none"
         sodipodi:nodetypes="ccc" />
    </g>
  </g>
</svg>
