<?xml version="1.0" encoding="UTF-8" standalone="no"?>
<svg
   height="48"
   viewBox="0 0 12.7 12.700001"
   width="48"
   version="1.1"
   id="svg746"
   sodipodi:docname="Font_18_48.svg"
   inkscape:version="1.2 (dc2aedaf03, 2022-05-15)"
   inkscape:export-filename="Font_18_48.png"
   inkscape:export-xdpi="96"
   inkscape:export-ydpi="96"
   xmlns:inkscape="http://www.inkscape.org/namespaces/inkscape"
   xmlns:sodipodi="http://sodipodi.sourceforge.net/DTD/sodipodi-0.dtd"
   xmlns="http://www.w3.org/2000/svg"
   xmlns:svg="http://www.w3.org/2000/svg">
  <defs
     id="defs750" />
  <sodipodi:namedview
     id="namedview748"
     pagecolor="#ffffff"
     bordercolor="#666666"
     borderopacity="1.0"
     inkscape:showpageshadow="2"
     inkscape:pageopacity="0.0"
     inkscape:pagecheckerboard="0"
     inkscape:deskcolor="#d1d1d1"
     showgrid="true"
     inkscape:zoom="19.125"
     inkscape:cx="24"
     inkscape:cy="24"
     inkscape:current-layer="svg746">
    <inkscape:grid
       type="xygrid"
       id="grid1256" />
  </sodipodi:namedview>
  <path
     d="M 2.3812495,0.79375025 V 11.90625 h 4.5919682 c 2.1549073,0 3.3455323,-1.125512 3.3455333,-2.7781248 10e-7,-1.5875 -1.29269,-2.6024332 -2.381251,-2.7781246 1.190625,-0.3968752 1.984375,-1.1906251 1.984375,-2.7781252 0,-1.1906251 -1.190625,-2.77812515 -3.0788822,-2.77812515 z m 1.984375,1.58750005 h 1.984375 c 0.7937502,0 1.5875005,0.7937499 1.5875005,1.5875002 0,0.7937499 -0.7828984,1.5874998 -1.5875005,1.5874998 h -1.984375 z m 0.038757,4.7624999 h 2.3424931 c 0.7937496,0 1.5874994,0.79375 1.5874994,1.5875 0,0.79375 -0.396874,1.5874998 -1.5874994,1.5874998 H 4.4043818 Z"
     id="path2"
     style="fill:#00aad4;fill-opacity:1;stroke:none;stroke-width:0.264583;stroke-dasharray:none"
     sodipodi:nodetypes="ccsscssccssscccssscc" />
</svg>
