<svg width="16" height="16" version="1.1" xmlns="http://www.w3.org/2000/svg">
 <rect x="1.25" y="1.25" width="13.499999" height="13.499999" rx="1.1423076" fill="#ebfcff" stroke="#00aad4" stroke-linejoin="round" stroke-width=".5"/>
 <path d="m1.5 1.5h13v2h-13z" fill="#00aad4" fill-rule="evenodd" stroke-width=".999991"/>
 <circle cx="11.5" cy="11.5" r="4.25" fill="#fff6ec" stroke="#ff7f00" stroke-dashoffset="1.49998" stroke-linecap="round" stroke-linejoin="round" stroke-width=".5"/>
 <path d="m13 11.5h-3" fill="none" stroke="#ff7f00" stroke-linecap="round"/>
 <path d="m11.5 13v-3" fill="none" stroke="#ff7f00" stroke-linecap="round"/>
</svg>
