<svg width="24" height="24" version="1.1" viewBox="0 0 24 24" xmlns="http://www.w3.org/2000/svg" xmlns:xlink="http://www.w3.org/1999/xlink">
 <defs>
  <linearGradient id="b" x1="8.000001" x2="12.000001" y1="9" y2="12.5" gradientTransform="matrix(1.8214284 0 0 1.7307764 -.18749382 -1.4423964)" gradientUnits="userSpaceOnUse">
   <stop stop-color="#aaccff" offset="0"/>
   <stop stop-color="#0057dc" offset="1"/>
  </linearGradient>
  <linearGradient id="c" x1="2" x2="8.75" y1="5" y2="11.75" gradientTransform="matrix(1.4230771 0 0 1.4230771 .17307669 1.9038444)" gradientUnits="userSpaceOnUse">
   <stop stop-color="#ffd5d5" offset="0"/>
   <stop stop-color="#dc0000" offset="1"/>
  </linearGradient>
  <radialGradient id="a" cx="7.9705882" cy="5.2647057" r="3.4999995" gradientTransform="matrix(0,1.9615395,-1.9615395,0,23.076932,-8.8846258)" gradientUnits="userSpaceOnUse">
   <stop stop-color="#fff6d5" offset="0"/>
   <stop stop-color="#ffcc00" offset="1"/>
  </radialGradient>
 </defs>
 <circle cx="14.250004" cy="9.749999" r="6.3750033" fill="url(#a)" stroke="#f5c400" stroke-linecap="round" stroke-linejoin="round" stroke-width=".749999"/>
 <rect x="3.3749993" y="9.374999" width="9.250001" height="9.250001" fill="url(#c)" stroke="#ff5555" stroke-linecap="round" stroke-linejoin="round" stroke-width=".749999"/>
 <path d="m9.3749749 20.625003h12.750052l-6.375025-11.250048z" fill="url(#b)" stroke="#5599ff" stroke-linecap="round" stroke-linejoin="round" stroke-width=".75"/>
</svg>
