<?xml version="1.0" encoding="UTF-8" standalone="no"?>
<svg
   height="16"
   viewBox="0 0 4.2333332 4.2333335"
   width="16"
   version="1.1"
   id="svg4"
   sodipodi:docname="Font_17_16.svg"
   inkscape:export-filename="Font_17_16.png"
   inkscape:export-xdpi="96"
   inkscape:export-ydpi="96"
   inkscape:version="1.2 (dc2aedaf03, 2022-05-15)"
   xmlns:inkscape="http://www.inkscape.org/namespaces/inkscape"
   xmlns:sodipodi="http://sodipodi.sourceforge.net/DTD/sodipodi-0.dtd"
   xmlns="http://www.w3.org/2000/svg"
   xmlns:svg="http://www.w3.org/2000/svg">
  <defs
     id="defs8">
    <filter
       inkscape:collect="always"
       style="color-interpolation-filters:sRGB"
       id="filter3494"
       x="-0.097535915"
       y="-0.060923482"
       width="1.1950718"
       height="1.121847">
      <feGaussianBlur
         inkscape:collect="always"
         stdDeviation="0.10446549"
         id="feGaussianBlur3496" />
    </filter>
  </defs>
  <sodipodi:namedview
     id="namedview6"
     pagecolor="#ffffff"
     bordercolor="#666666"
     borderopacity="1.0"
     inkscape:showpageshadow="2"
     inkscape:pageopacity="0.0"
     inkscape:pagecheckerboard="0"
     inkscape:deskcolor="#d1d1d1"
     showgrid="true"
     inkscape:zoom="57.375"
     inkscape:cx="7.372549"
     inkscape:cy="8"
     inkscape:current-layer="svg4">
    <inkscape:grid
       type="xygrid"
       id="grid133" />
  </sodipodi:namedview>
  <g
     id="g3500">
    <path
       id="path3126"
       style="fill:#ffffff;fill-opacity:1;stroke:none;stroke-width:1.02831;filter:url(#filter3494)"
       d="M 2.1680609 0.16212988 A 0.25636703 0.25636703 0 0 0 1.9177972 0.3631449 L 1.8318633 0.7500988 A 0.25636703 0.25636703 0 0 0 2.082127 1.060667 L 2.2891724 1.060667 L 1.8670409 3.3788727 L 1.6504472 3.3788727 A 0.25636703 0.25636703 0 0 0 1.4001835 3.5798877 L 1.3162598 3.9668416 A 0.25636703 0.25636703 0 0 0 1.5665235 4.2774098 L 3.0253899 4.2774098 A 0.25636703 0.25636703 0 0 0 3.2751511 4.0763948 L 3.361085 3.6894409 A 0.25636703 0.25636703 0 0 0 3.1113238 3.3788727 L 2.9022682 3.3788727 L 3.3243998 1.060667 L 3.5389833 1.060667 A 0.25636703 0.25636703 0 0 0 3.789247 0.85914945 L 3.8751809 0.47269808 A 0.25636703 0.25636703 0 0 0 3.6249172 0.16212988 L 2.1680609 0.16212988 z "
       transform="matrix(1.0283099,0,0,1.0283099,-0.553055,-0.166203)" />
    <path
       d="m2.5962227.80487504h-.5145984l.085438-.38594885 1.458357.00000003-.085438.38594885-.4291602-.00000003-.5145984 2.83029146h.5145984l-.085438.3859488h-1.458357l.082682-.3859489.4319162.0000001z"
       transform="matrix(1.0283099 0 0 1.0283099 -.553055 -.166203)"
       id="path2"
       style="fill:#000000;fill-opacity:1;stroke:none" />
  </g>
</svg>
