<?xml version="1.0" encoding="UTF-8" standalone="no"?>
<svg
   height="64"
   width="64"
   version="1.1"
   id="svg723"
   sodipodi:docname="Font_04_64.svg"
   inkscape:export-filename="Font_04_64.png"
   inkscape:export-xdpi="96"
   inkscape:export-ydpi="96"
   inkscape:version="1.2 (dc2aedaf03, 2022-05-15)"
   xml:space="preserve"
   xmlns:inkscape="http://www.inkscape.org/namespaces/inkscape"
   xmlns:sodipodi="http://sodipodi.sourceforge.net/DTD/sodipodi-0.dtd"
   xmlns="http://www.w3.org/2000/svg"
   xmlns:svg="http://www.w3.org/2000/svg"><defs
     id="defs727" /><sodipodi:namedview
     id="namedview725"
     pagecolor="#ffffff"
     bordercolor="#666666"
     borderopacity="1.0"
     inkscape:pageshadow="2"
     inkscape:pageopacity="0.0"
     inkscape:pagecheckerboard="0"
     inkscape:deskcolor="#d1d1d1"
     showgrid="true"
     inkscape:zoom="14.34375"
     inkscape:cx="32"
     inkscape:cy="32"
     inkscape:current-layer="g709"
     inkscape:showpageshadow="2"><inkscape:grid
       type="xygrid"
       id="grid846" /></sodipodi:namedview><g
     fill="none"
     stroke="#00aad4"
     stroke-linecap="round"
     id="g721"><g
       stroke-linejoin="round"
       stroke-width="2"
       transform="scale(2)"
       id="g709"><path
         id="path2-6"
         style="fill:#00aad4;stroke:none;stroke-width:7.54028"
         d="M 11.964844,1.5 1.5,30.5 h 2.67578 l 2.910156,-8.027344 c 0.09216,-0.2628 0.34088,-0.439572 0.621096,-0.441404 h 5.834824 l -2.733336,-1.6772 8.56e-4,-0.787648 H 9.066412 C 8.609524,19.564604 8.291644,19.114792 8.445312,18.6875 L 12.878904,6.30078 c 0.09216,-0.2628 0.34088,-0.439576 0.6211,-0.441404 0.2802,0.0018 0.528944,0.1786 0.621088,0.441404 l 2.153716,5.959428 2.298976,-0.952432 L 15.035156,1.5 Z"
         sodipodi:nodetypes="ccccccccccccccccc" /></g><g
       fill="none"
       stroke="#00aad4"
       stroke-width="0.8"
       transform="matrix(4.0000003,0,0,4.0000003,-1.5955048e-6,-5.4788067e-6)"
       id="g2560"><path
         d="M 8.7193521,6.9209069 9.0700559,8.2970855 8.2979416,9.0694142 6.9199483,8.7190195 6.5020704,9.7278658 l 1.222155,0.7266222 -1.517e-4,1.092086 -1.2210901,0.72512 0.4179224,1.008955 1.3761786,-0.350704 0.7723287,0.772114 -0.3503946,1.377994 1.0088462,0.417877 0.7266221,-1.222154 1.092086,1.51e-4 0.72512,1.22109 1.008955,-0.417922 -0.350704,-1.376179 0.772114,-0.772329 1.377994,0.350395 0.417877,-1.008846 -1.222154,-0.726622 1.51e-4,-1.092086 1.22109,-0.7251208 L 15.079093,8.719353 13.702915,9.0700568 12.930586,8.2979425 13.280981,6.9199491 12.272135,6.5020713 11.545512,7.7242262 10.453427,7.7240745 9.7283063,6.5029844 Z"
         id="path2556" /><circle
         cx="11"
         cy="11"
         r="1.4"
         stroke-dashoffset="1.49998"
         id="circle2558" /></g></g></svg>
