<?xml version="1.0" encoding="UTF-8" standalone="no"?>
<svg
   height="24"
   width="24"
   version="1.1"
   id="svg302"
   sodipodi:docname="Window_05_24.svg"
   inkscape:export-filename="Window_05_24.png"
   inkscape:export-xdpi="96"
   inkscape:export-ydpi="96"
   inkscape:version="1.2.1 (9c6d41e410, 2022-07-14)"
   xml:space="preserve"
   xmlns:inkscape="http://www.inkscape.org/namespaces/inkscape"
   xmlns:sodipodi="http://sodipodi.sourceforge.net/DTD/sodipodi-0.dtd"
   xmlns="http://www.w3.org/2000/svg"
   xmlns:svg="http://www.w3.org/2000/svg"><g
     id="g2220"
     transform="translate(-1,-1)"><g
       id="path294"><path
         id="path377"
         style="color:#000000;fill:#00aad4;stroke-linecap:round;stroke-dashoffset:1.49998"
         d="M 2,3 V 24 H 24 V 3 Z m 1.5,4 h 19 v 15.5 h -19 z"
         sodipodi:nodetypes="cccccccccc" /></g><g
       id="g718"
       transform="matrix(0.83270078,0,0,0.83270078,4.1671697,3.929634)"
       style="stroke-width:1.20091"><path
         id="path1865"
         style="fill:#71c837;fill-opacity:1;fill-rule:evenodd;stroke:none;stroke-width:1.82736px;stroke-linecap:butt;stroke-linejoin:miter;stroke-opacity:1"
         d="m 7.1739837,13.349609 c -1.9769685,0 -4.0102585,0.404477 -5.1347656,1.490235 a 0.50005,0.50005 0 0 0 -0.00586,0.0078 C 1.4885559,15.39485 1.2238738,16.100787 1.1075775,16.931641 0.9912812,17.762492 1.0001556,18.744535 1.0001556,20 a 0.50005,0.50005 0 0 0 0.5,0.5 H 12.498203 a 0.50005,0.50005 0 0 0 0.5,-0.5 c 0,-0.469554 0.0026,-0.872746 0,-1.25 l -1.015625,0.08398 c 3.65e-4,0.213309 -10e-6,0.436704 0,0.666016 H 7.7228118 L 8.767734,15.251949 9.332187,14.574215 c 0.128088,0.02893 0.253489,0.05942 0.373047,0.09375 0.149727,0.04299 0.289177,0.09133 0.421875,0.142578 L 10.695468,13.95898 C 10.469334,13.86336 10.231464,13.779049 9.980625,13.707027 9.137315,13.464894 8.162468,13.349605 7.1739837,13.349605 Z M 4.7306244,14.642578 5.2657806,15.251953 6.3107025,19.5 H 2.0177337 c 0.00187,-0.960437 -0.00255,-1.839343 0.080078,-2.429688 0.099266,-0.709178 0.2799168,-1.145557 0.6425782,-1.511718 0.3991744,-0.383274 1.1246472,-0.701755 1.9902345,-0.916016 z" /><g
         id="g3920"
         transform="matrix(1.3668317,0,0,1.3421768,-3.933887,-2.0757648)"
         style="stroke-width:1.77328"><ellipse
           style="fill:none;fill-opacity:1;fill-rule:evenodd;stroke:#00aad4;stroke-width:0.70931416;stroke-linecap:square;stroke-linejoin:round;stroke-miterlimit:4;stroke-dasharray:none;stroke-dashoffset:0;stroke-opacity:1;paint-order:normal"
           id="ellipse1869"
           cx="7.9996805"
           cy="8.6028032"
           ry="2.6287367"
           rx="2.1916399" /><path
           style="fill:#00aad4;fill-opacity:1;fill-rule:evenodd;stroke:none;stroke-width:1.48477px;stroke-linecap:butt;stroke-linejoin:miter;stroke-opacity:1"
           d="m 5.6252385,8.4695855 c 0,0 0.6219607,-1.1440237 1.1367442,-0.685928 C 8.2567635,9.113673 8.7442247,6.3799688 10.374822,8.4695855 10.96852,6.3917278 9.446372,5.0968943 8.041915,5.6137908 6.543256,5.1202455 5.0315405,6.6885648 5.6252385,8.4695855 Z"
           id="path1871"
           inkscape:connector-curvature="0"
           sodipodi:nodetypes="csccc" /></g><path
         id="path920"
         style="color:#000000;fill:#ff7f2a;fill-opacity:1;stroke:none;stroke-width:1.20091"
         d="m 18.717495,7.2899728 -7.436481,7.4364802 -0.673566,3.371724 3.371724,-0.673566 7.43648,-7.4364807 z m 0,1.4094271 1.28873,1.2887304 -1.28873,1.2887307 -1.288731,-1.2887307 z m -1.993444,1.9934441 1.28873,1.28873 -4.415167,4.415168 -1.288731,-1.288731 z"
         sodipodi:nodetypes="cccccccccccccccc" /></g></g><defs
     id="defs306" /><sodipodi:namedview
     id="namedview304"
     pagecolor="#ffffff"
     bordercolor="#666666"
     borderopacity="1.0"
     inkscape:pageshadow="2"
     inkscape:pageopacity="0.0"
     inkscape:pagecheckerboard="0"
     inkscape:deskcolor="#d1d1d1"
     showgrid="true"
     inkscape:zoom="38.25"
     inkscape:cx="12"
     inkscape:cy="12"
     inkscape:current-layer="g718"
     inkscape:showpageshadow="2"><inkscape:grid
       type="xygrid"
       id="grid889" /></sodipodi:namedview></svg>
