<?xml version="1.0" encoding="UTF-8" standalone="no"?>
<svg
   height="24"
   viewBox="0 0 6.35 6.35"
   width="24"
   version="1.1"
   id="svg20"
   sodipodi:docname="menu_edit_select_line_150.svg"
   inkscape:export-filename="menu_edit_select_line_150.png"
   inkscape:export-xdpi="96"
   inkscape:export-ydpi="96"
   inkscape:version="1.2.1 (9c6d41e410, 2022-07-14)"
   xmlns:inkscape="http://www.inkscape.org/namespaces/inkscape"
   xmlns:sodipodi="http://sodipodi.sourceforge.net/DTD/sodipodi-0.dtd"
   xmlns="http://www.w3.org/2000/svg"
   xmlns:svg="http://www.w3.org/2000/svg">
  <defs
     id="defs24" />
  <sodipodi:namedview
     id="namedview22"
     pagecolor="#ffffff"
     bordercolor="#666666"
     borderopacity="1.0"
     inkscape:showpageshadow="2"
     inkscape:pageopacity="0.0"
     inkscape:pagecheckerboard="0"
     inkscape:deskcolor="#d1d1d1"
     showgrid="true"
     inkscape:zoom="38.25"
     inkscape:cx="10.810458"
     inkscape:cy="12"
     inkscape:current-layer="svg20">
    <inkscape:grid
       type="xygrid"
       id="grid565" />
  </sodipodi:namedview>
  <path
     d="M 1.0583334,0.19843701 H 5.5562499"
     stroke="#d4aa00"
     id="path4"
     style="fill:none;stroke-width:0.396874"
     sodipodi:nodetypes="cc" />
  <path
     d="M 1.0583333,4.1671868 H 5.5562498"
     stroke="#d4aa00"
     id="path6"
     style="fill:none;stroke-width:0.396874"
     sodipodi:nodetypes="cc" />
  <path
     d="M 1.0583333,0.9921869 H 5.5562498"
     stroke="#d4aa00"
     id="path8"
     style="fill:none;stroke-width:0.396874"
     sodipodi:nodetypes="cc" />
  <path
     d="M 1.0583334,3.3734368 H 5.5562499"
     stroke="#2a7fff"
     id="path10"
     style="fill:none;stroke:#d4aa00;stroke-width:0.396874;stroke-opacity:1"
     sodipodi:nodetypes="cc" />
  <path
     d="M 1.0583333,2.5796869 H 5.5562499"
     stroke="#2a7fff"
     id="path12"
     style="fill:none;stroke:#d4aa00;stroke-width:0.396874;stroke-opacity:1"
     sodipodi:nodetypes="cc" />
  <path
     d="M 1.0583334,1.7859369 H 5.5562499"
     stroke="#2a7fff"
     id="path14"
     style="fill:none;stroke-width:0.396874"
     sodipodi:nodetypes="cc" />
  <path
     d="M 1.0583334,4.9609368 H 5.5562499"
     stroke="#d4aa00"
     id="path16"
     style="fill:none;stroke-width:0.396874"
     sodipodi:nodetypes="cc" />
  <path
     d="M 1.0583334,5.754687 H 5.5562499"
     stroke="#d4aa00"
     id="path660"
     style="fill:none;stroke-width:0.396874"
     sodipodi:nodetypes="cc" />
</svg>
