<svg width="64" height="64" version="1.1" viewBox="0 0 64 64" xmlns="http://www.w3.org/2000/svg">
 <path d="m47.599067 39.028872c1.45511 1.454821 2.646369 1.313553 4.101314-0.141444 1.454953-1.454973 1.949572-2.999528 0.494775-4.454661l-22.627731-22.628135c-1.451889-1.452225-3.002873-0.957354-4.454874 0.494987-1.454797 1.455133-1.596224 2.64618-0.141443 4.101313" fill="none" stroke="#1a8cff" stroke-linecap="round" stroke-width="3.00007"/>
 <path d="m24.971124 16.400932-4.242736 4.242737" fill="none" stroke="#1a8cff" stroke-linecap="round" stroke-width="3.00007"/>
 <path d="m47.599067 39.028872-4.242736 4.24274" fill="none" stroke="#1a8cff" stroke-linecap="round" stroke-width="3.00007"/>
 <path d="M 19.314143,44.685848 0,64" fill="none" stroke="#1a8cff" stroke-width="7.20016"/>
 <path d="m20.728388 20.643669c-14.142458 8.485473-9.899714 15.55671-1.414241 24.042183 8.485474 8.485474 15.556707 12.728214 24.042184-1.41424" fill="none" stroke="#1a8cff" stroke-linecap="round" stroke-width="3.00007"/>
 <path d="m43.356323 9.329703-7.071229 7.071229" fill="none" stroke="#1a8cff" stroke-linecap="round" stroke-width="6.00014"/>
 <path d="m54.670288 20.643669-7.071229 7.071229" fill="none" stroke="#1a8cff" stroke-linecap="round" stroke-width="6.00014"/>
</svg>
