<?xml version="1.0" encoding="UTF-8" standalone="no"?>
<svg
   height="32"
   width="32"
   version="1.1"
   id="svg18"
   sodipodi:docname="Time_07_32.svg"
   inkscape:export-filename="Time_07_32.png"
   inkscape:export-xdpi="96"
   inkscape:export-ydpi="96"
   inkscape:version="1.2.1 (9c6d41e410, 2022-07-14)"
   xmlns:inkscape="http://www.inkscape.org/namespaces/inkscape"
   xmlns:sodipodi="http://sodipodi.sourceforge.net/DTD/sodipodi-0.dtd"
   xmlns="http://www.w3.org/2000/svg"
   xmlns:svg="http://www.w3.org/2000/svg">
  <defs
     id="defs22" />
  <sodipodi:namedview
     id="namedview20"
     pagecolor="#ffffff"
     bordercolor="#666666"
     borderopacity="1.0"
     inkscape:pageshadow="2"
     inkscape:pageopacity="0.0"
     inkscape:pagecheckerboard="0"
     inkscape:deskcolor="#d1d1d1"
     showgrid="true"
     inkscape:zoom="28.6875"
     inkscape:cx="16"
     inkscape:cy="16"
     inkscape:current-layer="svg18"
     inkscape:showpageshadow="2">
    <inkscape:grid
       type="xygrid"
       id="grid1577" />
  </sodipodi:namedview>
  <path
     id="path377"
     style="color:#000000;fill:#00aad4;stroke-width:1.27273;stroke-linecap:round;stroke-dashoffset:1.49998"
     d="M 18.216797 3 A 11 11 0 0 1 19.953125 8 L 29 8 L 29 28 L 5 28 L 5 19.21875 A 11 11 0 0 1 3 18.214844 L 3 30 L 31 30 L 31 3 L 18.216797 3 z " />
  <path
     style="fill:none;stroke:#00aad4;stroke-width:1.25;stroke-linecap:butt;stroke-linejoin:round;stroke-dasharray:none;stroke-opacity:1"
     d="M 15,18.5 14,19 h 1.409182 z"
     id="path488"
     sodipodi:nodetypes="cccc" />
  <path
     style="fill:none;stroke:#00aad4;stroke-width:1.25;stroke-linecap:butt;stroke-linejoin:round;stroke-dasharray:none;stroke-opacity:1"
     d="M 19.5,13 19,14 h 1.409183 z"
     id="path2184"
     sodipodi:nodetypes="cccc" />
  <path
     style="fill:none;stroke:#00aad4;stroke-width:1.25;stroke-linecap:butt;stroke-linejoin:round;stroke-dasharray:none;stroke-opacity:1"
     d="M 18.5,17.090818 V 19 h 1.909183 z"
     id="path2186" />
  <path
     style="fill:none;stroke:#00aad4;stroke-width:1.25;stroke-linecap:butt;stroke-linejoin:round;stroke-dasharray:none;stroke-opacity:1"
     d="M 23.5,12.090817 V 14 h 1.909183 z"
     id="path2188" />
  <path
     style="fill:none;stroke:#00aad4;stroke-width:1.25;stroke-linecap:butt;stroke-linejoin:round;stroke-dasharray:none;stroke-opacity:1"
     d="M 23.5,17.090818 V 19 h 1.909183 z"
     id="path2190" />
  <path
     style="fill:none;stroke:#00aad4;stroke-width:1.25;stroke-linecap:butt;stroke-linejoin:round;stroke-dasharray:none;stroke-opacity:1"
     d="M 8.5,22.090818 V 24 h 1.909183 z"
     id="path2194" />
  <path
     style="fill:none;stroke:#00aad4;stroke-width:1.25;stroke-linecap:butt;stroke-linejoin:round;stroke-dasharray:none;stroke-opacity:1"
     d="M 13.5,22.090818 V 24 h 1.909183 z"
     id="path2196" />
  <path
     style="fill:none;stroke:#00aad4;stroke-width:1.25;stroke-linecap:butt;stroke-linejoin:round;stroke-dasharray:none;stroke-opacity:1"
     d="M 18.5,22.090818 V 24 h 1.909183 z"
     id="path2198" />
  <path
     style="fill:none;stroke:#00aad4;stroke-width:1.25;stroke-linecap:butt;stroke-linejoin:round;stroke-dasharray:none;stroke-opacity:1"
     d="M 23.5,22.090818 V 24 h 1.909183 z"
     id="path2200" />
  <g
     fill="none"
     stroke="#00aad4"
     id="g270"
     transform="matrix(1.122078,0,0,1.122078,0.02337647,0.023376)"
     style="stroke-width:1.78241">
    <circle
       cx="8"
       cy="8"
       r="7.1296282"
       stroke-width="2.5463"
       id="circle266"
       style="stroke-width:1.78241;stroke-dasharray:none" />
    <path
       d="M 8,2.6527779 8.0000016,8 h 4.4560164"
       id="path268"
       style="stroke-width:1.78241"
       sodipodi:nodetypes="ccc" />
  </g>
</svg>
