<?xml version="1.0" encoding="UTF-8" standalone="no"?>
<svg
   width="24"
   height="24"
   version="1.0"
   id="svg350"
   inkscape:export-xdpi="96"
   inkscape:export-ydpi="96"
   inkscape:version="1.2.1 (9c6d41e410, 2022-07-14)"
   sodipodi:docname="pkg_properties_150.svg"
   inkscape:export-filename="pkg_properties_150.png"
   xmlns:inkscape="http://www.inkscape.org/namespaces/inkscape"
   xmlns:sodipodi="http://sodipodi.sourceforge.net/DTD/sodipodi-0.dtd"
   xmlns:xlink="http://www.w3.org/1999/xlink"
   xmlns="http://www.w3.org/2000/svg"
   xmlns:svg="http://www.w3.org/2000/svg">
  <sodipodi:namedview
     id="namedview352"
     pagecolor="#ffffff"
     bordercolor="#666666"
     borderopacity="1.0"
     inkscape:showpageshadow="2"
     inkscape:pageopacity="0.0"
     inkscape:pagecheckerboard="0"
     inkscape:deskcolor="#d1d1d1"
     showgrid="true"
     inkscape:zoom="38.25"
     inkscape:cx="11.986928"
     inkscape:cy="12"
     inkscape:current-layer="svg350">
    <inkscape:grid
       type="xygrid"
       id="grid1112" />
  </sodipodi:namedview>
  <defs
     id="defs328">
    <linearGradient
       id="linearGradient933-3">
      <stop
         stop-color="#ffe991"
         offset="0"
         id="stop316" />
      <stop
         stop-color="#f5c400"
         offset="1"
         id="stop318" />
    </linearGradient>
    <linearGradient
       id="linearGradient1347"
       x1="8.837"
       x2="15.576"
       y1="7.8054"
       y2="10.838"
       gradientTransform="matrix(1.4839 0 0 1.4839 -.1129 24.918)"
       gradientUnits="userSpaceOnUse"
       xlink:href="#linearGradient933-3" />
    <linearGradient
       id="linearGradient1351"
       x1="8.837"
       x2="15.576"
       y1="7.8013"
       y2="10.834"
       gradientTransform="matrix(-1.4839 0 0 1.4839 25.113 24.924)"
       gradientUnits="userSpaceOnUse"
       xlink:href="#linearGradient933-3" />
    <linearGradient
       id="linearGradient1355"
       x1="1.4239"
       x2="15.576"
       y1="4.4317"
       y2="4.4317"
       gradientTransform="matrix(-1.4839 0 0 1.4839 25.113 24.924)"
       gradientUnits="userSpaceOnUse">
      <stop
         stop-color="#ffe478"
         offset="0"
         id="stop323" />
      <stop
         stop-color="#fff2c0"
         offset="1"
         id="stop325" />
    </linearGradient>
    <linearGradient
       id="a"
       gradientTransform="matrix(-0.76149966,0.76149966,0.76149966,0.76149966,32.366672,-20.938305)"
       gradientUnits="userSpaceOnUse"
       x1="33.5"
       x2="36.5"
       y1="11"
       y2="11">
      <stop
         offset="0"
         stop-color="#e60000"
         id="stop292" />
      <stop
         offset=".28920922"
         stop-color="#ff8989"
         id="stop294" />
      <stop
         offset="1"
         stop-color="#e60000"
         id="stop296" />
    </linearGradient>
    <radialGradient
       id="b"
       cx="14.847369"
       cy="1032.7991"
       gradientTransform="matrix(-1.624661,-0.09695224,-5.9e-7,1.2994126,36.23039,-1329.9958)"
       gradientUnits="userSpaceOnUse"
       r="3.4872861">
      <stop
         offset="0"
         stop-color="#fff"
         id="stop299" />
      <stop
         offset="1"
         stop-color="#ccc"
         id="stop301" />
    </radialGradient>
  </defs>
  <g
     transform="translate(0,-24)"
     id="g348">
    <g
       stroke="#ccaa00"
       stroke-linejoin="round"
       id="g336">
      <path
         d="m12.5 36.789 11-5.2887v9.5l-11 6z"
         fill="url(#linearGradient1347)"
         id="path330" />
      <path
         d="m12.5 36.5-11-5v9.5l11 6z"
         fill="url(#linearGradient1351)"
         id="path332" />
      <path
         d="m12.5 26.5-11 5 11 5 11-5z"
         fill="url(#linearGradient1355)"
         id="path334" />
    </g>
    <g
       fill="none"
       stroke="#5f8dd3"
       stroke-linecap="round"
       id="g346">
      <path
         d="m7.4 28.9 11.1 5.1"
         id="path338" />
      <path
         d="m6.5 34 11.1-5.1"
         id="path340" />
      <path
         d="m6.5 34v9.7"
         id="path342" />
      <path
         d="m18.5 34v9.7"
         id="path344" />
    </g>
  </g>
  <g
     transform="matrix(1.2307693,0,0,1.2307693,-0.615385,-0.615385)"
     id="g312">
    <path
       d="m 11.838595,6.999998 c -0.963734,0 -1.8795104,0.4160823 -2.482751,1.0221732 C 9.2658858,8.1542237 9.2215261,8.3894904 9.2215261,8.3894904 L 10.799423,9.9673874 10.59,10.589 9.9684232,10.798388 8.3905261,9.2204903 c 0,0 -0.2272859,0.039853 -0.368353,0.1353546 -0.6369947,0.6339345 -1.0221729,1.5602841 -1.0221729,2.4850591 0,0.95663 0.4808773,1.830845 1.2067641,2.556586 1.0115461,1.011343 2.3254787,1.358799 3.4495467,1.243683 0.06275,-0.0064 0.116231,-0.02799 0.177669,-0.03692 l 3.622601,3.6226 c 1.031083,1.030862 2.739188,1.030862 3.770272,0 1.030862,-1.031084 1.030862,-2.739191 0,-3.770274 l -3.622599,-3.622601 c 0.009,-0.06152 0.0305,-0.114795 0.03692,-0.177669 C 15.756003,10.531452 15.408423,9.2174926 14.39749,8.2067623 13.680887,7.4903064 12.800389,6.999998 11.838595,6.999998 Z"
       fill="#ffffff"
       stroke-linecap="round"
       stroke-width="1.18153"
       id="path304" />
    <g
       transform="matrix(0.96029092,0,0,0.96029092,1.016066,1.016066)"
       id="g310">
      <path
         d="m 12.363636,12.363636 4.773043,4.773043"
         fill="none"
         stroke="url(#a)"
         stroke-linecap="round"
         stroke-width="3.18182"
         id="path306"
         style="stroke:url(#a)" />
      <path
         d="M 9.8221381,8.0228403 C 10.601305,7.4061185 11.700473,7.2014007 12.882194,8.3828802 14.410067,9.9104458 13.762692,11.96324 12.862645,12.863104 11.9626,13.762967 9.9127325,14.412662 8.3819594,12.882195 7.2031457,11.703613 7.4050693,10.601478 8.0220387,9.8225572 l 1.440099,1.4399458 1.3499313,-0.449977 0.449977,-1.3499316 z"
         fill="url(#b)"
         fill-rule="evenodd"
         stroke="#666666"
         stroke-width="0.509091"
         id="path308"
         style="fill:url(#b)" />
    </g>
  </g>
</svg>
