<svg width="48" height="48" version="1.1" xmlns="http://www.w3.org/2000/svg">
 <linearGradient id="a" x1="42.187498" x2="26.812498" y1="42.187501" y2="26.812501" gradientTransform="matrix(.85365852 0 0 .85365852 8.04878 8.04878)" gradientUnits="userSpaceOnUse">
  <stop stop-color="#d40000" offset="0"/>
  <stop stop-color="#ff2a2a" offset="1"/>
 </linearGradient>
 <g>
  <circle transform="matrix(0,1,1,0,0,0)" cx="37.5" cy="37.5" r="10.5" fill="url(#a)" stroke-dashoffset="1.49998" stroke-linejoin="round"/>
  <path d="m33.610913 33.610913 7.778174 7.778174" fill="none" stroke="#ffffff" stroke-linecap="round" stroke-width="2.4"/>
  <path d="m41.389087 33.610913-7.778174 7.778174" fill="none" stroke="#ffffff" stroke-linecap="round" stroke-width="2.4"/>
 </g>
</svg>
