<?xml version="1.0" encoding="UTF-8" standalone="no"?>
<svg
   width="36"
   height="36"
   version="1.1"
   viewBox="0 0 36 36"
   id="svg9"
   sodipodi:docname="tfilenameedit_150.svg"
   inkscape:export-filename="tfilenameedit_150.png"
   inkscape:export-xdpi="96"
   inkscape:export-ydpi="96"
   inkscape:version="1.3.2 (091e20e, 2023-11-25, custom)"
   xmlns:inkscape="http://www.inkscape.org/namespaces/inkscape"
   xmlns:sodipodi="http://sodipodi.sourceforge.net/DTD/sodipodi-0.dtd"
   xmlns="http://www.w3.org/2000/svg"
   xmlns:svg="http://www.w3.org/2000/svg">
  <sodipodi:namedview
     id="namedview9"
     pagecolor="#ffffff"
     bordercolor="#000000"
     borderopacity="0.25"
     inkscape:showpageshadow="2"
     inkscape:pageopacity="0.0"
     inkscape:pagecheckerboard="0"
     inkscape:deskcolor="#d1d1d1"
     showgrid="true"
     inkscape:current-layer="svg9">
    <inkscape:grid
       id="grid9"
       units="px"
       originx="0"
       originy="0"
       spacingx="0.5"
       spacingy="0.5"
       empcolor="#0099e5"
       empopacity="0.30196078"
       color="#0099e5"
       opacity="0.14901961"
       empspacing="2"
       dotted="false"
       gridanglex="30"
       gridanglez="30"
       visible="true" />
  </sodipodi:namedview>
  <defs
     id="defs2">
    <linearGradient
       id="a"
       x1="-10"
       x2="-11.5"
       y1="1047.3622"
       y2="1040.3622"
       gradientTransform="matrix(2.6477051,0,0,2.3562409,45.24402,-2434.6658)"
       gradientUnits="userSpaceOnUse">
      <stop
         stop-color="#d5f6ff"
         offset="0"
         id="stop1" />
      <stop
         stop-color="#ffffff"
         offset="1"
         id="stop2" />
    </linearGradient>
  </defs>
  <rect
     x="24.499998"
     y="2.4999826"
     width="10.000003"
     height="10"
     fill="#ffffff"
     stroke="#2a7efe"
     stroke-linecap="round"
     stroke-linejoin="round"
     stroke-width="0.999998"
     style="paint-order:normal"
     id="rect2" />
  <rect
     x="2.4999981"
     y="2.4999826"
     width="22"
     height="10.000001"
     fill="#ffffff"
     fill-rule="evenodd"
     stroke="#2a7efe"
     stroke-linecap="round"
     stroke-linejoin="round"
     stroke-width="0.999996"
     style="paint-order:normal"
     id="rect3" />
  <circle
     cx="29.5"
     cy="7.4999828"
     r="2.75"
     fill="#c8ab37"
     id="circle3" />
  <path
     d="M 9.5,15.500001 21,15.5 25.5,20 v 14.500004 h -16 z"
     fill="url(#a)"
     fill-rule="evenodd"
     stroke="#2a7efe"
     stroke-width="1px"
     id="path3"
     style="fill:url(#a)"
     sodipodi:nodetypes="cccccc" />
  <path
     d="m 20.5,15.5 v 5 h 5"
     fill="none"
     stroke="#2a7efe"
     stroke-width="1px"
     id="path4" />
  <path
     d="M 12,25.25 H 23"
     fill="none"
     stroke="#b3b3b3"
     stroke-linejoin="round"
     stroke-width="1.5"
     id="path5"
     sodipodi:nodetypes="cc" />
  <path
     d="m 12,19.25 h 5.5"
     fill="none"
     stroke="#b3b3b3"
     stroke-linejoin="round"
     stroke-width="1.5"
     id="path6"
     sodipodi:nodetypes="cc" />
  <path
     d="m 12,22.25 h 6.5"
     fill="none"
     stroke="#b3b3b3"
     stroke-linejoin="round"
     stroke-width="1.5"
     id="path7"
     sodipodi:nodetypes="cc" />
  <path
     d="M 12,31.25 H 23"
     fill="none"
     stroke="#b3b3b3"
     stroke-linejoin="round"
     stroke-width="1.5"
     id="path8"
     sodipodi:nodetypes="cc" />
  <path
     d="M 12,28.25 H 23"
     fill="none"
     stroke="#b3b3b3"
     stroke-linejoin="round"
     stroke-width="1.5"
     id="path9"
     sodipodi:nodetypes="cc" />
</svg>
