<?xml version="1.0" encoding="UTF-8" standalone="no"?>
<svg
   height="24"
   viewBox="0 0 6.35 6.35"
   width="24"
   version="1.1"
   id="svg317"
   sodipodi:docname="Secure_08_24.svg"
   inkscape:version="1.2.2 (732a01da63, 2022-12-09)"
   xmlns:inkscape="http://www.inkscape.org/namespaces/inkscape"
   xmlns:sodipodi="http://sodipodi.sourceforge.net/DTD/sodipodi-0.dtd"
   xmlns="http://www.w3.org/2000/svg"
   xmlns:svg="http://www.w3.org/2000/svg">
  <defs
     id="defs321" />
  <sodipodi:namedview
     id="namedview319"
     pagecolor="#ffffff"
     bordercolor="#000000"
     borderopacity="0.25"
     inkscape:showpageshadow="2"
     inkscape:pageopacity="0.0"
     inkscape:pagecheckerboard="0"
     inkscape:deskcolor="#d1d1d1"
     showgrid="true"
     inkscape:zoom="37.916667"
     inkscape:cx="11.986813"
     inkscape:cy="12"
     inkscape:current-layer="svg317">
    <inkscape:grid
       type="xygrid"
       id="grid1030" />
  </sodipodi:namedview>
  <linearGradient
     id="a"
     gradientTransform="matrix(.50395439 -.13503417 .13440193 .50159483 -1.973538 -.132271)"
     gradientUnits="userSpaceOnUse"
     x1="5.726027"
     x2="10"
     y1="7.730607"
     y2="10">
    <stop
       offset="0"
       stop-color="#f2f2f2"
       id="stop296" />
    <stop
       offset="1"
       stop-color="#d4d4d4"
       id="stop298" />
  </linearGradient>
  <linearGradient
     id="b"
     gradientTransform="matrix(1.4853381 0 0 1.519817 .031034 -.109016)"
     gradientUnits="userSpaceOnUse"
     x1="1.499774"
     x2="3.614834"
     y1="1.322335"
     y2="2.204926">
    <stop
       offset="0"
       stop-color="#80b5fe"
       id="stop301" />
    <stop
       offset="1"
       stop-color="#2a7efe"
       id="stop303" />
  </linearGradient>
  <linearGradient
     id="c"
     gradientTransform="matrix(1.4853381 0 0 1.519817 .031034 -.109016)"
     gradientUnits="userSpaceOnUse"
     x1=".530372"
     x2="3.879216"
     y1="1.145817"
     y2="2.557962">
    <stop
       offset="0"
       stop-color="#e7c962"
       id="stop306" />
    <stop
       offset="1"
       stop-color="#d4a41c"
       id="stop308" />
  </linearGradient>
  <g
     stroke-linecap="round"
     stroke-linejoin="round"
     id="g315">
    <path
       d="m.68791726 3.5103428-.0000001-2.4144776c.78539444 0 1.83258724-.40241293 2.48708294-.80482586.6544954.40241295 1.7016882.80482586 2.4870827.80482586v2.4144776c0 .9416569-1.3089909 2.4144775-2.4870827 2.5486152-1.1780919-.1341377-2.48708284-1.6069583-2.48708284-2.5486152z"
       fill="url(#b)"
       stroke="url(#c)"
       stroke-width=".317501"
       id="path311" />
    <path
       d="m2.1675538 3.5629969.797809.6262392 1.2170834-2.2313196"
       fill="none"
       stroke="url(#a)"
       stroke-width=".527402"
       id="path313" />
  </g>
</svg>
