<?xml version="1.0" encoding="UTF-8" standalone="no"?>
<svg
   height="32"
   width="32"
   version="1.1"
   id="svg17"
   sodipodi:docname="dialog_error.svg"
   inkscape:export-filename="dialog_error.png"
   inkscape:export-xdpi="96"
   inkscape:export-ydpi="96"
   inkscape:version="1.2.1 (9c6d41e410, 2022-07-14)"
   xmlns:inkscape="http://www.inkscape.org/namespaces/inkscape"
   xmlns:sodipodi="http://sodipodi.sourceforge.net/DTD/sodipodi-0.dtd"
   xmlns="http://www.w3.org/2000/svg"
   xmlns:svg="http://www.w3.org/2000/svg">
  <defs
     id="defs21" />
  <sodipodi:namedview
     id="namedview19"
     pagecolor="#ffffff"
     bordercolor="#666666"
     borderopacity="1.0"
     inkscape:showpageshadow="2"
     inkscape:pageopacity="0.0"
     inkscape:pagecheckerboard="0"
     inkscape:deskcolor="#d1d1d1"
     showgrid="true"
     inkscape:zoom="28.6875"
     inkscape:cx="15.982571"
     inkscape:cy="16"
     inkscape:current-layer="svg17">
    <inkscape:grid
       type="xygrid"
       id="grid554" />
  </sodipodi:namedview>
  <linearGradient
     id="a"
     gradientUnits="userSpaceOnUse"
     x1="16.0000008"
     x2="23.53846317692"
     y1="9.53846247692"
     y2="26.76923133846">
    <stop
       offset="0"
       stop-color="#faa"
       id="stop2" />
    <stop
       offset="1"
       stop-color="#f00"
       id="stop4" />
  </linearGradient>
  <g
     stroke-linecap="round"
     id="g15">
    <circle
       cx="16"
       cy="16"
       r="14"
       style="fill-rule:evenodd;stroke:#d40000;stroke-width:2;stroke-linejoin:round;stroke-opacity:.954902;fill:url(#a)"
       id="circle7" />
    <g
       fill="none"
       stroke="#fff"
       stroke-width="3"
       id="g13">
      <path
         d="m11 11 10 10"
         id="path9" />
      <path
         d="m21 11-10 10"
         id="path11" />
    </g>
  </g>
</svg>
