<?xml version="1.0" encoding="UTF-8" standalone="no"?>
<svg
   width="16"
   height="16"
   version="1.1"
   viewBox="0 0 4.2333 4.2333"
   id="svg7"
   sodipodi:docname="div_justify.svg"
   inkscape:export-filename="div_justify.png"
   inkscape:export-xdpi="96"
   inkscape:export-ydpi="96"
   inkscape:version="1.3.2 (091e20e, 2023-11-25, custom)"
   xmlns:inkscape="http://www.inkscape.org/namespaces/inkscape"
   xmlns:sodipodi="http://sodipodi.sourceforge.net/DTD/sodipodi-0.dtd"
   xmlns="http://www.w3.org/2000/svg"
   xmlns:svg="http://www.w3.org/2000/svg">
  <defs
     id="defs7" />
  <sodipodi:namedview
     id="namedview7"
     pagecolor="#ffffff"
     bordercolor="#000000"
     borderopacity="0.25"
     inkscape:showpageshadow="2"
     inkscape:pageopacity="0.0"
     inkscape:pagecheckerboard="0"
     inkscape:deskcolor="#d1d1d1"
     showgrid="true"
     inkscape:current-layer="svg7">
    <inkscape:grid
       id="grid7"
       units="px"
       originx="0"
       originy="0"
       spacingx="0.13229062"
       spacingy="0.13229062"
       empcolor="#0099e5"
       empopacity="0.30196078"
       color="#0099e5"
       opacity="0.14901961"
       empspacing="2"
       dotted="false"
       gridanglex="30"
       gridanglez="30"
       visible="true" />
  </sodipodi:namedview>
  <path
     d="m0.52916247 2.7781029 3.174919 3.71e-5"
     fill="none"
     stroke="#008dd2"
     stroke-width=".26458"
     id="path1" />
  <path
     d="m0.52916247 0.66140298 3.174919 3.705e-5"
     fill="none"
     stroke="#008dd2"
     stroke-width=".26458"
     id="path2" />
  <path
     d="m0.52919686 1.190581 3.1749396 5.9e-5"
     fill="none"
     stroke="#008dd2"
     stroke-width=".26458"
     id="path3" />
  <g
     transform="translate(5.6e-5,2.5625e-5)"
     id="g4">
    <path
       d="m0.52910647 3.3072398 3.174975 2e-7"
       fill="none"
       stroke="#008dd2"
       stroke-width=".26458"
       id="path4" />
  </g>
  <path
     d="m0.52916247 2.2489029 3.174919 3.71e-5"
     fill="none"
     stroke="#008dd2"
     stroke-width=".26458"
     id="path5" />
  <path
     d="m0.52916247 1.7197029 3.174919 3.71e-5"
     fill="none"
     stroke="#008dd2"
     stroke-width=".26458"
     id="path6" />
  <g
     transform="translate(5.6e-5 .52918812)"
     id="g7">
    <path
       d="m0.52910647 3.3072398 3.174975 2e-7"
       fill="none"
       stroke="#008dd2"
       stroke-width=".26458"
       id="path7" />
  </g>
</svg>
