<?xml version="1.0" encoding="UTF-8" standalone="no"?>
<svg
   width="36"
   height="36"
   version="1.1"
   viewBox="0 0 36 36"
   id="svg9"
   sodipodi:docname="tdbdateedit_150.svg"
   inkscape:export-filename="tdbdateedit_150.png"
   inkscape:export-xdpi="96"
   inkscape:export-ydpi="96"
   inkscape:version="1.3.2 (091e20e, 2023-11-25, custom)"
   xmlns:inkscape="http://www.inkscape.org/namespaces/inkscape"
   xmlns:sodipodi="http://sodipodi.sourceforge.net/DTD/sodipodi-0.dtd"
   xmlns="http://www.w3.org/2000/svg"
   xmlns:svg="http://www.w3.org/2000/svg">
  <sodipodi:namedview
     id="namedview9"
     pagecolor="#ffffff"
     bordercolor="#000000"
     borderopacity="0.25"
     inkscape:showpageshadow="2"
     inkscape:pageopacity="0.0"
     inkscape:pagecheckerboard="0"
     inkscape:deskcolor="#d1d1d1"
     showgrid="true"
     inkscape:current-layer="svg9">
    <inkscape:grid
       id="grid9"
       units="px"
       originx="0"
       originy="0"
       spacingx="0.5"
       spacingy="0.5"
       empcolor="#0099e5"
       empopacity="0.30196078"
       color="#0099e5"
       opacity="0.14901961"
       empspacing="2"
       dotted="false"
       gridanglex="30"
       gridanglez="30"
       visible="true" />
  </sodipodi:namedview>
  <defs
     id="defs3">
    <linearGradient
       id="a"
       x1="3"
       x2="21"
       y1="3"
       y2="3"
       gradientUnits="userSpaceOnUse">
      <stop
         stop-color="#4276c4"
         offset="0"
         id="stop1" />
      <stop
         stop-color="#80b3ff"
         offset=".3333333"
         id="stop2" />
      <stop
         stop-color="#04a"
         offset="1"
         id="stop3" />
    </linearGradient>
  </defs>
  <ellipse
     cx="12"
     cy="20.25"
     rx="7.65"
     ry="2.4"
     fill="none"
     fill-rule="evenodd"
     stroke="url(#a)"
     stroke-linecap="round"
     stroke-linejoin="round"
     stroke-width="2.7"
     id="ellipse3" />
  <ellipse
     cx="12"
     cy="18.3"
     rx="7.35"
     ry="2.1"
     fill="none"
     fill-rule="evenodd"
     stroke="#ffffff"
     stroke-linecap="round"
     stroke-linejoin="round"
     stroke-width="1.8"
     id="ellipse4" />
  <ellipse
     cx="12"
     cy="15.75"
     rx="7.65"
     ry="2.4"
     fill="none"
     fill-rule="evenodd"
     stroke="url(#a)"
     stroke-linecap="round"
     stroke-linejoin="round"
     stroke-width="2.7"
     id="ellipse5" />
  <ellipse
     cx="12"
     cy="13.8"
     rx="7.35"
     ry="2.1"
     fill="none"
     fill-rule="evenodd"
     stroke="#ffffff"
     stroke-linecap="round"
     stroke-linejoin="round"
     stroke-width="1.8"
     id="ellipse6" />
  <ellipse
     cx="12"
     cy="11.25"
     rx="7.65"
     ry="2.4"
     fill="none"
     fill-rule="evenodd"
     stroke="url(#a)"
     stroke-linecap="round"
     stroke-linejoin="round"
     stroke-width="2.7"
     id="ellipse7" />
  <ellipse
     cx="12"
     cy="9.3"
     rx="7.35"
     ry="2.1"
     fill="none"
     fill-rule="evenodd"
     stroke="#ffffff"
     stroke-linecap="round"
     stroke-linejoin="round"
     stroke-width="1.8"
     id="ellipse8" />
  <ellipse
     cx="12"
     cy="6.75"
     rx="8.1"
     ry="2.85"
     fill="#80b3ff"
     fill-rule="evenodd"
     stroke="url(#a)"
     stroke-linecap="round"
     stroke-linejoin="round"
     stroke-width="1.8"
     id="ellipse9" />
  <rect
     x="9.5"
     y="21.5"
     width="26"
     height="14"
     fill="#ffffff"
     stroke="#2a7efe"
     stroke-linecap="round"
     stroke-linejoin="round"
     style="paint-order:normal"
     id="rect9" />
  <path
     d="m 32.7694,29.194893 c 0,1.299118 -0.58263,2.255149 -2.1097,2.255149 H 28.55 V 24.55 h 2.1097 c 1.52707,0 2.1097,0.95603 2.1097,2.255148 z"
     fill="none"
     stroke="#2a7fff"
     stroke-linecap="round"
     stroke-linejoin="round"
     stroke-width="1.1"
     id="path7"
     style="stroke:#4d4d4d;stroke-opacity:1" />
  <path
     d="m 19.55,31.449894 v -6.900042 l 2.950083,5.61148 2.949917,-5.61148 v 6.900042"
     fill="none"
     stroke="#2a7fff"
     stroke-linecap="round"
     stroke-linejoin="round"
     stroke-width="1.1"
     id="path18"
     style="stroke:#4d4d4d;stroke-opacity:1"
     sodipodi:nodetypes="ccccc" />
  <path
     d="M 14.5,31.450042 V 28.670139 M 12.3903,24.55 14.5,28.670144 16.6097,24.55"
     fill="none"
     stroke="#2a7fff"
     stroke-linecap="round"
     stroke-linejoin="round"
     stroke-width="1.1"
     id="path28"
     style="stroke:#4d4d4d;stroke-opacity:1" />
</svg>
