<?xml version="1.0" encoding="UTF-8" standalone="no"?>
<svg
   height="24"
   viewBox="0 0 6.3499998 6.3500003"
   width="24"
   version="1.1"
   id="svg131"
   sodipodi:docname="Picture_08_24.svg"
   inkscape:version="1.2 (dc2aedaf03, 2022-05-15)"
   inkscape:export-filename="Picture_08_24.png"
   inkscape:export-xdpi="96"
   inkscape:export-ydpi="96"
   xmlns:inkscape="http://www.inkscape.org/namespaces/inkscape"
   xmlns:sodipodi="http://sodipodi.sourceforge.net/DTD/sodipodi-0.dtd"
   xmlns="http://www.w3.org/2000/svg"
   xmlns:svg="http://www.w3.org/2000/svg">
  <defs
     id="defs135" />
  <sodipodi:namedview
     id="namedview133"
     pagecolor="#ffffff"
     bordercolor="#666666"
     borderopacity="1.0"
     inkscape:showpageshadow="2"
     inkscape:pageopacity="0.0"
     inkscape:pagecheckerboard="0"
     inkscape:deskcolor="#d1d1d1"
     showgrid="true"
     inkscape:zoom="38.25"
     inkscape:cx="9.4117647"
     inkscape:cy="12"
     inkscape:current-layer="svg131">
    <inkscape:grid
       type="xygrid"
       id="grid1286" />
  </sodipodi:namedview>
  <g
     id="g1114"
     transform="scale(0.39687505)">
    <g
       stroke-width="0.5"
       id="g2657"
       style="fill:none;stroke:#00aad4;stroke-linecap:round"
       transform="translate(1,1)">
      <circle
         cx="4.5"
         cy="5.5"
         r="1"
         stroke-linejoin="round"
         id="circle2639" />
      <path
         d="m 4.5,3.5 v 1"
         id="path2641" />
      <path
         d="M 3.0857864,4.0857864 3.7928932,4.7928932"
         id="path2643" />
      <path
         d="m 2.5,5.5 h 1"
         id="path2645" />
      <path
         d="M 3.0857864,6.9142136 3.7928932,6.2071068"
         id="path2647" />
      <path
         d="m 4.5,7.5 v -1"
         id="path2649" />
      <path
         d="M 5.9142136,6.9142136 5.2071068,6.2071068"
         id="path2651" />
      <path
         d="m 6.5,5.5 h -1"
         id="path2653" />
      <path
         d="M 5.9142136,4.0857864 5.2071068,4.7928932"
         id="path2655" />
    </g>
    <path
       d="M 0.5,12.5 3,9 5.5,11.5 11,6 l 4.5,4.5"
       stroke-linejoin="round"
       stroke-width="0.75"
       id="path2659"
       style="fill:none;stroke:#00aad4;stroke-linecap:round"
       sodipodi:nodetypes="ccccc" />
    <path
       d="M 15.500002,2.5 H 0.5 v 11 h 15.000001 z"
       stroke-width="0.999996"
       id="path2661"
       style="fill:none;stroke:#00aad4;stroke-linecap:round"
       sodipodi:nodetypes="ccccc" />
  </g>
</svg>
