<?xml version="1.0" encoding="UTF-8" standalone="no"?>
<svg
   height="32"
   width="32"
   version="1.1"
   id="svg456"
   sodipodi:docname="Barcode_01_32.svg"
   inkscape:export-filename="Barcode_01_32.png"
   inkscape:export-xdpi="96"
   inkscape:export-ydpi="96"
   inkscape:version="1.2-beta (1b65182ce9, 2022-04-05)"
   xmlns:inkscape="http://www.inkscape.org/namespaces/inkscape"
   xmlns:sodipodi="http://sodipodi.sourceforge.net/DTD/sodipodi-0.dtd"
   xmlns="http://www.w3.org/2000/svg"
   xmlns:svg="http://www.w3.org/2000/svg">
  <defs
     id="defs460" />
  <sodipodi:namedview
     id="namedview458"
     pagecolor="#ffffff"
     bordercolor="#666666"
     borderopacity="1.0"
     inkscape:pageshadow="2"
     inkscape:pageopacity="0.0"
     inkscape:pagecheckerboard="0"
     inkscape:deskcolor="#d1d1d1"
     showgrid="true"
     inkscape:zoom="28.6875"
     inkscape:cx="15.982571"
     inkscape:cy="16"
     inkscape:current-layer="svg456">
    <inkscape:grid
       type="xygrid"
       id="grid997" />
  </sodipodi:namedview>
  <g
     id="g3390">
    <path
       d="M 0,5 H 31.999999 V 27 H 0 Z"
       fill="#ffffff"
       id="path2"
       style="stroke:none;stroke-width:0;stroke-dasharray:none" />
    <path
       d="M 2,6 V 25.999999"
       id="path8"
       style="fill:none;stroke:#000000;stroke-width:2;stroke-dasharray:none"
       sodipodi:nodetypes="cc" />
    <path
       d="M 20,6 V 25.999999"
       id="path12"
       style="fill:none;stroke:#000000;stroke-width:2;stroke-dasharray:none"
       sodipodi:nodetypes="cc" />
    <path
       d="M 15,6 V 25.999999"
       stroke-width="2.0081"
       id="path14"
       style="fill:none;stroke:#000000;stroke-width:4;stroke-dasharray:none"
       sodipodi:nodetypes="cc" />
    <path
       d="M 10,6 V 25.999999"
       id="path20"
       style="fill:none;stroke:#000000;stroke-width:2;stroke-dasharray:none"
       sodipodi:nodetypes="cc" />
    <path
       d="M 6,6 V 25.999999"
       id="path2225"
       style="fill:none;stroke:#000000;stroke-width:2;stroke-dasharray:none"
       sodipodi:nodetypes="cc" />
    <path
       d="M 25,6 V 25.999999"
       stroke-width="2.0081"
       id="path2229"
       style="fill:none;stroke:#000000;stroke-width:4;stroke-dasharray:none"
       sodipodi:nodetypes="cc" />
    <path
       d="M 30,6 V 25.999999"
       id="path2231"
       style="fill:none;stroke:#000000;stroke-width:2;stroke-dasharray:none"
       sodipodi:nodetypes="cc" />
  </g>
</svg>
