<?xml version="1.0" encoding="UTF-8" standalone="no"?>
<svg
   height="16"
   width="16"
   version="1.1"
   id="svg2"
   sodipodi:docname="Connection_03_16.svg"
   inkscape:export-filename="Connection_03_16.png"
   inkscape:export-xdpi="96"
   inkscape:export-ydpi="96"
   inkscape:version="1.3 (0e150ed6c4, 2023-07-21)"
   xmlns:inkscape="http://www.inkscape.org/namespaces/inkscape"
   xmlns:sodipodi="http://sodipodi.sourceforge.net/DTD/sodipodi-0.dtd"
   xmlns="http://www.w3.org/2000/svg"
   xmlns:svg="http://www.w3.org/2000/svg">
  <defs
     id="defs2" />
  <sodipodi:namedview
     id="namedview2"
     pagecolor="#ffffff"
     bordercolor="#000000"
     borderopacity="0.25"
     inkscape:showpageshadow="2"
     inkscape:pageopacity="0.0"
     inkscape:pagecheckerboard="0"
     inkscape:deskcolor="#d1d1d1"
     showgrid="true"
     inkscape:current-layer="svg2">
    <inkscape:grid
       id="grid2"
       units="px"
       originx="0"
       originy="0"
       spacingx="0.5"
       spacingy="0.5"
       empcolor="#0099e5"
       empopacity="0.30196078"
       color="#0099e5"
       opacity="0.14901961"
       empspacing="2"
       dotted="false"
       gridanglex="30"
       gridanglez="30"
       visible="true" />
  </sodipodi:namedview>
  <g
     fill="none"
     stroke-linecap="round"
     stroke-linejoin="round"
     stroke-width="1.2"
     id="g2">
    <path
       d="m8.7778176 7.2221827-1.4142136-1.4142135-3.2526912 3.2526911 1.4142136 1.4142137-3.0251266 3.025126"
       stroke="#00aad4"
       id="path1" />
    <path
       d="m7.2221826 8.7778176 1.4142136 1.4142134 3.2526908-3.252691-1.414213-1.4142136 3.025126-3.0251262"
       stroke="#00c1f0"
       id="path2" />
  </g>
  <path
     d="M 14,14 V 8.9999999 L 8.9999999,14 Z"
     fill="#00c1f0"
     id="path1-3"
     style="stroke-width:1;fill:#ccaa00;fill-opacity:1" />
</svg>
