<?xml version="1.0" encoding="UTF-8" standalone="no"?>
<svg
   width="32"
   height="32"
   version="1.1"
   id="svg333"
   sodipodi:docname="menu_goto_line_200.svg"
   inkscape:export-filename="menu_goto_line_200.png"
   inkscape:export-xdpi="96"
   inkscape:export-ydpi="96"
   inkscape:version="1.2.2 (732a01da63, 2022-12-09)"
   xmlns:inkscape="http://www.inkscape.org/namespaces/inkscape"
   xmlns:sodipodi="http://sodipodi.sourceforge.net/DTD/sodipodi-0.dtd"
   xmlns="http://www.w3.org/2000/svg"
   xmlns:svg="http://www.w3.org/2000/svg">
  <sodipodi:namedview
     id="namedview335"
     pagecolor="#ffffff"
     bordercolor="#666666"
     borderopacity="1.0"
     inkscape:showpageshadow="2"
     inkscape:pageopacity="0.0"
     inkscape:pagecheckerboard="0"
     inkscape:deskcolor="#d1d1d1"
     showgrid="true"
     inkscape:zoom="28.6875"
     inkscape:cx="16"
     inkscape:cy="16"
     inkscape:current-layer="svg333">
    <inkscape:grid
       type="xygrid"
       id="grid558" />
  </sodipodi:namedview>
  <defs
     id="defs311" />
  <path
     d="m 4.735655,1.735655 h 22.528691 v 27.52869 H 4.735655 Z"
     style="fill:#ffffff;stroke:#d4aa00;stroke-width:1.47131;stroke-linecap:round;stroke-linejoin:round;stroke-miterlimit:5.6"
     id="path321" />
  <g
     transform="matrix(-2,0,0,2,16.4,-12)"
     fill="none"
     stroke="#00d400"
     stroke-linecap="round"
     id="g552"
     style="stroke:#44aa00;stroke-opacity:1">
    <path
       d="M 1.2,12 2.7,13.5 4.2,12"
       stroke-linejoin="round"
       id="path548"
       sodipodi:nodetypes="ccc"
       style="stroke:#44aa00;stroke-opacity:1" />
    <path
       d="m 2.7,13.5 v -5"
       id="path550"
       sodipodi:nodetypes="cc"
       style="stroke:#44aa00;stroke-opacity:1" />
  </g>
  <path
     style="fill:none;stroke:#ff0000;stroke-width:1.5;stroke-linecap:butt;stroke-linejoin:miter;stroke-dasharray:none;stroke-opacity:1"
     d="M 9,19.25 H 23"
     id="path608" />
  <path
     style="fill:none;stroke:#2a7fff;stroke-width:1.5;stroke-linecap:butt;stroke-linejoin:miter;stroke-dasharray:none;stroke-opacity:1"
     d="m 17,15.25 h 6"
     id="path1440" />
  <path
     style="fill:none;stroke:#2a7fff;stroke-width:1.5;stroke-linecap:butt;stroke-linejoin:miter;stroke-dasharray:none;stroke-opacity:1"
     d="m 14,7.25 h 8.999996"
     id="path1442"
     sodipodi:nodetypes="cc" />
  <path
     style="fill:none;stroke:#2a7fff;stroke-width:1.5;stroke-linecap:butt;stroke-linejoin:miter;stroke-dasharray:none;stroke-opacity:1"
     d="m 17,11.25 h 5.999998"
     id="path1444"
     sodipodi:nodetypes="cc" />
  <path
     style="fill:none;stroke:#2a7fff;stroke-width:1.5;stroke-linecap:butt;stroke-linejoin:miter;stroke-dasharray:none;stroke-opacity:1"
     d="M 9,23.25 H 23"
     id="path2162"
     sodipodi:nodetypes="cc" />
</svg>
