<?xml version="1.0" encoding="UTF-8" standalone="no"?>
<svg
   height="16"
   width="16"
   version="1.1"
   id="svg16"
   sodipodi:docname="previous_word.svg"
   inkscape:export-filename="previous_word.png"
   inkscape:export-xdpi="96"
   inkscape:export-ydpi="96"
   inkscape:version="1.2.2 (732a01da63, 2022-12-09)"
   xmlns:inkscape="http://www.inkscape.org/namespaces/inkscape"
   xmlns:sodipodi="http://sodipodi.sourceforge.net/DTD/sodipodi-0.dtd"
   xmlns="http://www.w3.org/2000/svg"
   xmlns:svg="http://www.w3.org/2000/svg">
  <defs
     id="defs20" />
  <sodipodi:namedview
     id="namedview18"
     pagecolor="#ffffff"
     bordercolor="#666666"
     borderopacity="1.0"
     inkscape:showpageshadow="2"
     inkscape:pageopacity="0.0"
     inkscape:pagecheckerboard="0"
     inkscape:deskcolor="#d1d1d1"
     showgrid="true"
     inkscape:zoom="57.375"
     inkscape:cx="7.7298475"
     inkscape:cy="8"
     inkscape:current-layer="svg16">
    <inkscape:grid
       type="xygrid"
       id="grid546" />
  </sodipodi:namedview>
  <g
     fill="none"
     stroke="#00d400"
     stroke-width="1.5"
     transform="matrix(1,0,0,-1,10.5,20)"
     id="g6"
     style="stroke:#ff0000;stroke-linecap:round">
    <path
       d="m 0.75,14.750045 2,2.5 2,-2.5"
       stroke-linejoin="round"
       id="path2"
       style="stroke:#ff0000" />
    <path
       d="M 2.75,16.850045 V 6.75"
       id="path4"
       style="stroke:#ff0000" />
  </g>
  <g
     fill="#ffffff"
     stroke-miterlimit="5.6"
     id="g12"
     style="stroke-linecap:round"
     transform="matrix(1,0,0,-1,0,15)">
    <path
       d="m 1.5,9.5 h 6 v 2 h -6 z"
       stroke="#ff0000"
       id="path8" />
    <path
       d="m 1.5,3.5 h 6 v 2 h -6 z"
       stroke="#2a7fff"
       id="path10" />
  </g>
</svg>
