<?xml version="1.0" encoding="UTF-8" standalone="no"?>
<svg
   height="16"
   width="16"
   version="1.1"
   id="svg2"
   sodipodi:docname="ddtable.svg"
   inkscape:export-filename="ddtable.png"
   inkscape:export-xdpi="96"
   inkscape:export-ydpi="96"
   inkscape:version="1.3-beta (cedbd6c6ff, 2023-05-28)"
   xmlns:inkscape="http://www.inkscape.org/namespaces/inkscape"
   xmlns:sodipodi="http://sodipodi.sourceforge.net/DTD/sodipodi-0.dtd"
   xmlns="http://www.w3.org/2000/svg"
   xmlns:svg="http://www.w3.org/2000/svg">
  <defs
     id="defs2" />
  <sodipodi:namedview
     id="namedview2"
     pagecolor="#ffffff"
     bordercolor="#000000"
     borderopacity="0.25"
     inkscape:showpageshadow="2"
     inkscape:pageopacity="0.0"
     inkscape:pagecheckerboard="0"
     inkscape:deskcolor="#d1d1d1"
     showgrid="true"
     inkscape:current-layer="svg2">
    <inkscape:grid
       id="grid2"
       units="px"
       originx="0"
       originy="0"
       spacingx="0.5"
       spacingy="0.5"
       empcolor="#0099e5"
       empopacity="0.30196078"
       color="#0099e5"
       opacity="0.14901961"
       empspacing="2"
       dotted="false"
       gridanglex="30"
       gridanglez="30"
       visible="true" />
  </sodipodi:namedview>
  <rect
     fill="#ebfcff"
     height="12.000003"
     ry="1.6000004"
     width="12.000002"
     x="2.4999986"
     y="2.4999986"
     id="rect2"
     style="stroke:#00aad4;stroke-width:0.999997;stroke-linejoin:round" />
  <path
     style="fill:none;stroke-linejoin:round;stroke:#00aad4;stroke-opacity:1"
     d="M 3,3.5 H 14"
     id="path1" />
  <path
     style="fill:none;stroke:#00aad4;stroke-width:0.8;stroke-linejoin:round;stroke-dasharray:none;stroke-opacity:1"
     d="M 4.5,5.6 H 7"
     id="path2"
     sodipodi:nodetypes="cc" />
  <path
     style="fill:none;stroke:#00aad4;stroke-width:0.8;stroke-linejoin:round;stroke-dasharray:none;stroke-opacity:1"
     d="m 8,5.6 h 4.5"
     id="path3"
     sodipodi:nodetypes="cc" />
  <path
     style="fill:none;stroke:#00aad4;stroke-width:0.8;stroke-linejoin:round;stroke-dasharray:none;stroke-opacity:1"
     d="M 4.5,9.6 H 7"
     id="path4"
     sodipodi:nodetypes="cc" />
  <path
     style="fill:none;stroke:#00aad4;stroke-width:0.8;stroke-linejoin:round;stroke-dasharray:none;stroke-opacity:1"
     d="m 8,9.6 h 4.5"
     id="path5"
     sodipodi:nodetypes="cc" />
  <path
     style="fill:none;stroke:#00aad4;stroke-width:0.8;stroke-linejoin:round;stroke-dasharray:none;stroke-opacity:1"
     d="M 4.5,7.6 H 7"
     id="path6"
     sodipodi:nodetypes="cc" />
  <path
     style="fill:none;stroke:#00aad4;stroke-width:0.8;stroke-linejoin:round;stroke-dasharray:none;stroke-opacity:1"
     d="m 8,7.6 h 4.5"
     id="path7"
     sodipodi:nodetypes="cc" />
  <path
     style="fill:none;stroke:#00aad4;stroke-width:0.8;stroke-linejoin:round;stroke-dasharray:none;stroke-opacity:1"
     d="M 4.5,11.6 H 7"
     id="path8"
     sodipodi:nodetypes="cc" />
  <path
     style="fill:none;stroke:#00aad4;stroke-width:0.8;stroke-linejoin:round;stroke-dasharray:none;stroke-opacity:1"
     d="m 8,11.6 h 4.5"
     id="path9"
     sodipodi:nodetypes="cc" />
</svg>
