<?xml version="1.0" encoding="UTF-8" standalone="no"?>
<svg
   height="64"
   width="64"
   version="1.1"
   id="svg559"
   sodipodi:docname="Remove_02_64.svg"
   inkscape:export-filename="Remove_02_64.png"
   inkscape:export-xdpi="96"
   inkscape:export-ydpi="96"
   inkscape:version="1.2-beta (1b65182ce9, 2022-04-05)"
   xmlns:inkscape="http://www.inkscape.org/namespaces/inkscape"
   xmlns:sodipodi="http://sodipodi.sourceforge.net/DTD/sodipodi-0.dtd"
   xmlns="http://www.w3.org/2000/svg"
   xmlns:svg="http://www.w3.org/2000/svg">
  <defs
     id="defs561" />
  <sodipodi:namedview
     id="namedview12"
     pagecolor="#ffffff"
     bordercolor="#666666"
     borderopacity="1.0"
     inkscape:pageshadow="2"
     inkscape:pageopacity="0.0"
     inkscape:pagecheckerboard="0"
     inkscape:deskcolor="#d1d1d1"
     showgrid="true"
     inkscape:zoom="14.34375"
     inkscape:cx="32"
     inkscape:cy="32"
     inkscape:current-layer="svg559">
    <inkscape:grid
       type="xygrid"
       id="grid139" />
  </sodipodi:namedview>
  <g
     fill="none"
     stroke="#00aad4"
     transform="matrix(4,0,0,4,94,-42)"
     id="g557">
    <path
       d="m -17,26 h -4 V 11 h 7 l 4,4 v 2"
       stroke-linecap="round"
       id="path545" />
    <path
       d="m -11,26 h -2"
       stroke-linecap="round"
       id="path547" />
    <path
       d="m -14,11 v 4 h 4"
       id="path549" />
    <g
       stroke-linecap="round"
       stroke-linejoin="round"
       stroke-width="2"
       transform="rotate(45,-12.571068,-10.763456)"
       id="g555">
      <path
         d="M 15.242641,12 H 6.7573592"
         id="path551" />
      <path
         d="M 11,16.242641 V 7.7573594"
         id="path553" />
    </g>
  </g>
</svg>
