<?xml version="1.0" encoding="UTF-8" standalone="no"?>
<svg
   width="24"
   height="24"
   version="1.1"
   viewBox="0 0 24 24"
   id="svg20"
   sodipodi:docname="tcalculatordialog.svg"
   inkscape:export-filename="tcalculatordialog.png"
   inkscape:export-xdpi="96"
   inkscape:export-ydpi="96"
   inkscape:version="1.3.2 (091e20e, 2023-11-25, custom)"
   xmlns:inkscape="http://www.inkscape.org/namespaces/inkscape"
   xmlns:sodipodi="http://sodipodi.sourceforge.net/DTD/sodipodi-0.dtd"
   xmlns="http://www.w3.org/2000/svg"
   xmlns:svg="http://www.w3.org/2000/svg">
  <sodipodi:namedview
     id="namedview20"
     pagecolor="#ffffff"
     bordercolor="#000000"
     borderopacity="0.25"
     inkscape:showpageshadow="2"
     inkscape:pageopacity="0.0"
     inkscape:pagecheckerboard="0"
     inkscape:deskcolor="#d1d1d1"
     showgrid="true"
     inkscape:current-layer="svg20">
    <inkscape:grid
       id="grid20"
       units="px"
       originx="0"
       originy="0"
       spacingx="0.5"
       spacingy="0.5"
       empcolor="#0099e5"
       empopacity="0.30196078"
       color="#0099e5"
       opacity="0.14901961"
       empspacing="2"
       dotted="false"
       gridanglex="30"
       gridanglez="30"
       visible="true" />
  </sodipodi:namedview>
  <defs
     id="defs2">
    <linearGradient
       id="a"
       x1="13"
       x2="13"
       y1="1038.8622"
       y2="1037.3622"
       gradientUnits="userSpaceOnUse"
       gradientTransform="translate(0,-1028.3622)">
      <stop
         stop-color="#ffffff"
         offset="0"
         id="stop1" />
      <stop
         stop-color="#aaeeff"
         offset="1"
         id="stop2" />
    </linearGradient>
  </defs>
  <rect
     x="1.25"
     y="4.2499828"
     width="21.5"
     height="18.5"
     fill="#f9f9f9"
     stroke="#2a7efe"
     stroke-width="0.5"
     style="paint-order:normal"
     id="rect2" />
  <path
     d="m 2.5,1 h 19 C 22.35,1 23,1.6 23,2.5 V 4 H 1 V 2.5 C 1,1.6 1.6,1 2.5,1 Z"
     fill="#2a7efe"
     id="path2" />
  <rect
     x="4.4999986"
     y="7.4999828"
     width="15"
     height="12.000001"
     fill="#e3dedb"
     fill-rule="evenodd"
     stroke="#b3b3b3"
     stroke-linecap="round"
     stroke-linejoin="round"
     stroke-width="0.999997"
     style="paint-order:normal"
     id="rect3" />
  <rect
     x="6"
     y="8.9999828"
     width="12"
     height="2.0000174"
     fill="url(#a)"
     fill-rule="evenodd"
     style="fill:url(#a);paint-order:normal"
     id="rect4" />
  <rect
     x="6"
     y="11.999983"
     width="2"
     height="2.0000174"
     fill="#483737"
     fill-rule="evenodd"
     style="paint-order:normal"
     id="rect5" />
  <rect
     x="9"
     y="11.999983"
     width="2"
     height="2.0000174"
     fill="#483737"
     fill-rule="evenodd"
     style="paint-order:normal"
     id="rect6" />
  <rect
     x="12"
     y="11.999983"
     width="2"
     height="2.0000174"
     fill="#483737"
     fill-rule="evenodd"
     style="paint-order:normal"
     id="rect7" />
  <rect
     x="6"
     y="14.999983"
     width="2"
     height="2.0000174"
     fill="#483737"
     fill-rule="evenodd"
     style="paint-order:normal"
     id="rect8" />
  <rect
     x="9"
     y="14.999983"
     width="2"
     height="2.0000174"
     fill="#483737"
     fill-rule="evenodd"
     style="paint-order:normal"
     id="rect9" />
  <rect
     x="12"
     y="14.999983"
     width="2"
     height="2.0000174"
     fill="#483737"
     fill-rule="evenodd"
     style="paint-order:normal"
     id="rect10" />
  <rect
     x="15.999999"
     y="11.999983"
     width="2"
     height="2.0000174"
     fill="#d45500"
     fill-rule="evenodd"
     style="paint-order:normal"
     id="rect11" />
  <rect
     x="15.999999"
     y="14.999983"
     width="2"
     height="2.0000174"
     fill="#ff0000"
     fill-rule="evenodd"
     style="paint-order:normal"
     id="rect12" />
  <rect
     x="6"
     y="11.999983"
     width="1"
     height="1"
     fill="#ffffff"
     fill-rule="evenodd"
     style="paint-order:normal"
     id="rect13" />
  <rect
     x="9"
     y="11.999983"
     width="1"
     height="1"
     fill="#ffffff"
     fill-rule="evenodd"
     style="paint-order:normal"
     id="rect14" />
  <rect
     x="12"
     y="11.999983"
     width="1"
     height="1"
     fill="#ffffff"
     fill-rule="evenodd"
     style="paint-order:normal"
     id="rect15" />
  <rect
     x="15.999999"
     y="11.999983"
     width="1"
     height="1"
     fill="#ffffff"
     fill-rule="evenodd"
     style="paint-order:normal"
     id="rect16" />
  <rect
     x="6"
     y="14.999983"
     width="1"
     height="1"
     fill="#ffffff"
     fill-rule="evenodd"
     style="paint-order:normal"
     id="rect17" />
  <rect
     x="9"
     y="14.999983"
     width="1"
     height="1"
     fill="#ffffff"
     fill-rule="evenodd"
     style="paint-order:normal"
     id="rect18" />
  <rect
     x="12"
     y="14.999983"
     width="1"
     height="1"
     fill="#ffffff"
     fill-rule="evenodd"
     style="paint-order:normal"
     id="rect19" />
  <rect
     x="15.999999"
     y="14.999983"
     width="1"
     height="1"
     fill="#ffffff"
     fill-rule="evenodd"
     style="paint-order:normal"
     id="rect20" />
</svg>
