<?xml version="1.0" encoding="UTF-8" standalone="no"?>
<svg
   height="16"
   viewBox="0 0 4.2333332 4.2333335"
   width="16"
   version="1.1"
   id="svg4"
   sodipodi:docname="Font_26_16.svg"
   inkscape:export-filename="Font_26_16.png"
   inkscape:export-xdpi="96"
   inkscape:export-ydpi="96"
   inkscape:version="1.3-beta (cedbd6c6ff, 2023-05-28)"
   xmlns:inkscape="http://www.inkscape.org/namespaces/inkscape"
   xmlns:sodipodi="http://sodipodi.sourceforge.net/DTD/sodipodi-0.dtd"
   xmlns="http://www.w3.org/2000/svg"
   xmlns:svg="http://www.w3.org/2000/svg">
  <defs
     id="defs4" />
  <sodipodi:namedview
     id="namedview4"
     pagecolor="#ffffff"
     bordercolor="#000000"
     borderopacity="0.25"
     inkscape:showpageshadow="2"
     inkscape:pageopacity="0.0"
     inkscape:pagecheckerboard="0"
     inkscape:deskcolor="#d1d1d1"
     showgrid="true"
     inkscape:current-layer="svg4">
    <inkscape:grid
       id="grid4"
       units="px"
       originx="0"
       originy="0"
       spacingx="0.13229166"
       spacingy="0.13229167"
       empcolor="#0099e5"
       empopacity="0.30196078"
       color="#0099e5"
       opacity="0.14901961"
       empspacing="2"
       dotted="false"
       gridanglex="30"
       gridanglez="30"
       visible="true" />
  </sodipodi:namedview>
  <g
     stroke-width=".264583"
     id="g4">
    <g
       fill="#00aad4"
       id="g3">
      <path
         d="m.70610441 1.6086693c-.1061528 0-.20272292.022208-.29104284.059141-.093037.038904-.16848506.09352-.22572352.1639042l.21662844.151231c.0446266-.033704.0956793-.05988.15296283-.078573.0581639-.018978.11761869-.028725.17776769-.028725.097015 0 .1711865.029311.2240699.085332.052866.056002.079375.1337589.079375.234873v.043888h-.415893c-.17074525 0-.29841804.038571-.3828205.1149028-.0844026.076331-.12650433.1903542-.12650433.3430161 0 .1605913.0456771.2808993.13807989.3599133.0919252.078605.23127963.1174357.41754724.1174357.063059-.0000003.1197587-.00686.1703261-.020277.050331-.01336.094335-.0334.1322922-.059986.024776-.017355.047267-.037538.066973-.060831v.1410942h.28277409v-.9926744c0-.1209396-.023918-.2238512-.07028-.3092215-.0467725-.0861277-.1152193-.1492239-.2033993-.1960091-.11943089-.0633656-.23236719-.0684343-.34313289-.0684343zm-.095085.8752374h.42912259v.3007725c-.0033.047629-.031659.083043-.084336.1064532-.055373.024608-.1395021.037175-.2530088.037175-.1038054 0-.18191369-.018701-.23316497-.056605-.0506149-.037435-.0752411-.09573-.0752411-.1740428 0-.072367.0192388-.1258021.0570509-.1605244.036404-.033429.0890608-.053226.15957738-.053228z"
         id="path1" />
      <path
         d="m1.5875 1.0583338v2.1166748h.2968306v-.2058797c.032485.062119.076507.10185.1339461.1389061.069651.044935.1522902.066973.2463942.066973.1096261.0000001.2035811-.023216.2819477-.071108.078797-.048155.1386757-.1080708.1794213-.1992649.040746-.091194.061184-.2010179.061184-.3290768v-.3517303c0-.1299989-.020582-.2410475-.060359-.3332111-.039774-.092163-.098172-.1610827-.1744588-.2091868-.07603-.047943-.1669637-.072761-.2736794-.072761-.090224 0-.1716407.024554-.2455674.07276-.058175.037935-.1080916.087312-.1488293.1504822v-.773578zm.5936612.8174004c.097984 0 .1737454.030899.2273772.091778.054056.06136.081856.1473734.081856.2579698v.3500781c0 .1086564-.027554.1928366-.081856.2530087-.053384.059155-.1293925.088471-.2273772.088471-.06306 0-.1167173-.01192-.1612312-.036381-.0437698-.0240484-.0767619-.0585829-.1000452-.1041799-.0232839-.0455972-.0355542-.1011929-.0355542-.1661925v-.4344144c0-.06306.012272-.1166053.035554-.1612311.023283-.045597.056284-.080271.1000452-.103354.044522-.023483.098172-.035554.1612314-.035553z"
         id="path2" />
      <path
         d="m3.6861715 3.1750086c-.1674227 0-.2556329-.025709-.3536175-.077127-.0970144-.0514172-.1712304-.1261183-.222648-.2241028-.0514176-.0979846-.0771265-.2163421-.0771265-.3550727v-.26101c0-.1367909.025709-.2536928.077127-.3507071.051418-.097015.125634-.1707458.222648-.221193.097984-.051418.2158568-.077127.3536175-.077127.078581 0 .1523126.0097.221193.029104.069852.018434.1324245.045597.187723.081491.055298.035896.1013796.079552.1382453.1309701l-.2139171.19209c-.0426866-.0485074-.0926484-.0858579-.149887-.1120516s-.1169028-.0392914-.1789916-.0392914c-.1144772 0-.2032452.032014-.2663047.096044-.063059.064029-.094589.1542518-.094589.2706703v.2610099c0 .1193285.031045.2114914.093133.2764912.063059.065.1523126.097499.2677599.097499.06306 0 .1232085-.014064.1804468-.042202.057239-.028135.1067156-.067911.1484326-.1193285l.2139168.2066407c-.037836.050447-.084403.093618-.1397013.129514-.055298.034925-.1183573.059857-.187723.080037-.075794.02205-.1549273.027651-.2197372.027652z"
         id="path3" />
    </g>
    <path
       d="m0 2.3812585h4.2333333"
       fill="none"
       stroke="#00aad4"
       stroke-linejoin="round"
       id="path4" />
  </g>
</svg>
