<?xml version="1.0" encoding="UTF-8" standalone="no"?>
<svg
   height="32"
   viewBox="0 0 8.4666664 8.4666671"
   width="32"
   version="1.1"
   id="svg1826"
   sodipodi:docname="Picture_06_32.svg"
   inkscape:export-filename="Picture_06_32.png"
   inkscape:export-xdpi="96"
   inkscape:export-ydpi="96"
   inkscape:version="1.2 (dc2aedaf03, 2022-05-15)"
   xmlns:inkscape="http://www.inkscape.org/namespaces/inkscape"
   xmlns:sodipodi="http://sodipodi.sourceforge.net/DTD/sodipodi-0.dtd"
   xmlns="http://www.w3.org/2000/svg"
   xmlns:svg="http://www.w3.org/2000/svg">
  <defs
     id="defs1830" />
  <sodipodi:namedview
     id="namedview1828"
     pagecolor="#ffffff"
     bordercolor="#666666"
     borderopacity="1.0"
     inkscape:showpageshadow="2"
     inkscape:pageopacity="0.0"
     inkscape:pagecheckerboard="0"
     inkscape:deskcolor="#d1d1d1"
     showgrid="true"
     inkscape:zoom="28.6875"
     inkscape:cx="14.971678"
     inkscape:cy="16"
     inkscape:current-layer="svg1826">
    <inkscape:grid
       type="xygrid"
       id="grid4042" />
  </sodipodi:namedview>
  <linearGradient
     id="a"
     gradientTransform="matrix(1.0666667,0,0,1.0909091,-0.533333,-0.727273)"
     gradientUnits="userSpaceOnUse"
     x1="11.75"
     x2="12.21875"
     y1="3.416667"
     y2="7.541667">
    <stop
       offset="0"
       stop-color="#99c2ff"
       id="stop1788" />
    <stop
       offset="1"
       stop-color="#e5eeff"
       id="stop1790" />
  </linearGradient>
  <linearGradient
     id="b"
     gradientTransform="matrix(1.0666667,0,0,1.0833381,-0.533333,-1.625064)"
     gradientUnits="userSpaceOnUse"
     x1="10.34375"
     x2="9.875"
     y1="13.5"
     y2="7.500026">
    <stop
       offset="0"
       stop-color="#aade87"
       id="stop1793" />
    <stop
       offset="1"
       stop-color="#0a0"
       id="stop1795" />
  </linearGradient>
  <g
     transform="matrix(0.52916667,0,0,0.52916667,0,-0.52916667)"
     id="g1824">
    <path
       d="M 16,14 H 0 V 2 h 16 z"
       fill="url(#a)"
       id="path1798"
       style="fill:url(#a)" />
    <path
       d="M 16,10 C 14.333333,8.3333333 12.5,5 11,5 9.5,5 7.5,10.5 6.5,10.5 c -1,0 -2,-2 -3,-2 -1.1042859,0 -2.3333333,2 -3.5,3 V 14 h 16 z"
       fill="url(#b)"
       id="path1800"
       style="fill:url(#b)" />
    <g
       fill="none"
       id="g1818">
      <path
         d="m 5.5,3.5 v 1"
         stroke="#ffd42a"
         stroke-linecap="round"
         stroke-width="0.5"
         id="path1802" />
      <path
         d="M 6.9142136,4.0857864 6.2071068,4.7928932"
         stroke="#ffd42a"
         stroke-linecap="round"
         stroke-width="0.5"
         id="path1804" />
      <path
         d="M 4.0857864,4.0857864 4.7928932,4.7928932"
         stroke="#ffd42a"
         stroke-linecap="round"
         stroke-width="0.5"
         id="path1806" />
      <path
         d="m 3.5,5.5 h 1"
         stroke="#ffd42a"
         stroke-linecap="round"
         stroke-width="0.5"
         id="path1808" />
      <path
         d="M 4.0857864,6.9142136 4.7928932,6.2071068"
         stroke="#ffd42a"
         stroke-linecap="round"
         stroke-width="0.5"
         id="path1810" />
      <path
         d="m 5.5,7.5 v -1"
         stroke="#ffd42a"
         stroke-linecap="round"
         stroke-width="0.5"
         id="path1812" />
      <path
         d="M 6.9142136,6.9142136 6.2071068,6.2071068"
         stroke="#ffd42a"
         stroke-linecap="round"
         stroke-width="0.5"
         id="path1814" />
      <path
         d="m 7.5,5.5 h -1"
         stroke="#ffd42a"
         stroke-linecap="round"
         stroke-width="0.5"
         id="path1816" />
    </g>
    <circle
       cx="5.5"
       cy="5.5"
       fill="#ffe680"
       r="1.25"
       id="circle1820" />
    <path
       d="M 0.259471,2.259471 H 15.740528 V 13.740528 H 0.259471 Z"
       fill="none"
       stroke="#ffffff"
       stroke-linecap="round"
       stroke-width="0.518942"
       id="path1822" />
  </g>
  <g
     id="g1173"
     transform="matrix(0.52916668,0,0,0.52916668,8.4008393e-7,-1.4435708e-6)"
     style="stroke-width:0.5">
    <path
       d="M 15.624781,5.4032217 C 15.137789,4.8919356 14.262794,4.8650236 13.737541,5.3331087 a 0.78976505,0.81490251 0.32849278 0 0 -0.01308,-1.356e-4 L 8.7881529,9.7824498 a 0.78976505,0.81490251 0.32849278 0 0 -0.033033,0.03117 L 8.4730469,10.098807 A 0.78976505,0.81490251 0.32849278 0 0 8.358136,10.246171 l -0.8172345,1.336402 -0.1608698,0.162644 c -0.2885893,-0.0056 -0.5660703,-0.0769 -0.8619885,0.03612 -0.396521,0.151506 -0.6760667,0.451571 -0.8644944,0.720327 -0.1884303,0.268755 -0.3236497,0.530256 -0.4967227,0.807402 -0.1194541,0.191238 -0.1930773,0.226905 -0.418404,0.284907 -0.225327,0.058 -0.5848457,0.07324 -1.0220231,0.115498 a 0.78976505,0.81490251 0.32849278 0 0 -0.1784082,1.583827 c 1.0286579,0.35481 1.9251584,0.60563 2.7437995,0.683281 0.8186411,0.07766 1.6032924,-0.0265 2.2428973,-0.483283 0.6041863,-0.43146 0.8144779,-1.100791 0.8268348,-1.749316 l 0.1201017,-0.12143 1.3211819,-0.798896 a 0.78976505,0.81490251 0.32849278 0 0 0.152818,-0.12109 l 0.282072,-0.285188 a 0.78976505,0.81490251 0.32849278 0 0 0.03305,-0.0357 l 4.352582,-4.9686446 c 3.43e-4,-3.538e-4 7.59e-4,-7.608e-4 0.0011,-0.00112 0.509392,-0.5244008 0.514925,-1.4773907 0.0114,-2.0075662 a 0.78976505,0.81490251 0.32849278 0 0 -0.0011,-0.00116 z"
       fill="#ffffff"
       id="path2"
       style="fill-rule:evenodd;stroke-width:0.401319" />
    <g
       transform="matrix(0.55608977,0.57763738,-0.56773047,0.5662004,0.04276614,-10.204729)"
       id="g14"
       style="fill-rule:evenodd;stroke-width:0.498901">
      <path
         d="m 26.75,13 v -1 h 1.5 v 1 z"
         fill="#ffffff"
         id="path4"
         style="stroke-width:0.500555" />
      <path
         d="m 25,18.033926 c 0.638374,-0.786181 1.363851,-1.441944 1.124082,-2.498542 -0.195641,-0.861732 -0.419915,-1.408422 -0.193996,-1.913359 0.85584,-1.912237 3.476972,-1.202846 3.134552,0.793331 C 28.836065,15.748014 27.382161,16.815391 25,18.033926 Z"
         fill="#ff0000"
         id="path6"
         style="stroke-width:0.500555" />
      <path
         d="m 26.75,12 h 1.5 l 0.5,-2 h -2.475 z"
         fill="#b3b3b3"
         id="path8"
         style="stroke-width:0.500555" />
      <path
         d="m 27.5,0.5 c -0.400108,6.0209e-4 -0.729292,0.31517483 -0.748047,0.7148438 L 26.275391,9.5 H 28.75 L 28.248391,1.0411084 C 28.246781,0.83221673 27.911936,0.49998743 27.5,0.5 Z"
         fill="#c87137"
         id="path10"
         style="stroke-width:0.500555"
         sodipodi:nodetypes="cccccc" />
      <path
         d="M 26.275,10 V 9.5 H 28.75 V 10 Z"
         fill="#ffffff"
         id="path12"
         style="stroke-width:0.500555" />
    </g>
  </g>
</svg>
