<svg width="36" height="36" version="1.1" xmlns="http://www.w3.org/2000/svg">
 <circle transform="matrix(0,1,1,0,0,0)" cx="26" cy="26" r="9.0999994" fill="#fffffe" stroke="#00aad4" stroke-dashoffset="1.49998" stroke-linecap="round" stroke-linejoin="round" stroke-width="1.8"/>
 <path d="m26 21.5v9" fill="none" stroke="#00aad4" stroke-linecap="round" stroke-width="1.8"/>
 <path d="m30.5 26h-9" fill="none" stroke="#00aad4" stroke-linecap="round" stroke-width="1.8"/>
</svg>
