<?xml version="1.0" encoding="UTF-8" standalone="no"?>
<svg
   height="32"
   width="32"
   version="1.1"
   id="svg885"
   sodipodi:docname="Setup_07_32.svg"
   inkscape:version="1.2.2 (732a01da63, 2022-12-09)"
   xmlns:inkscape="http://www.inkscape.org/namespaces/inkscape"
   xmlns:sodipodi="http://sodipodi.sourceforge.net/DTD/sodipodi-0.dtd"
   xmlns="http://www.w3.org/2000/svg"
   xmlns:svg="http://www.w3.org/2000/svg">
  <defs
     id="defs889" />
  <sodipodi:namedview
     id="namedview887"
     pagecolor="#ffffff"
     bordercolor="#000000"
     borderopacity="0.25"
     inkscape:showpageshadow="2"
     inkscape:pageopacity="0.0"
     inkscape:pagecheckerboard="0"
     inkscape:deskcolor="#d1d1d1"
     showgrid="true"
     inkscape:zoom="28.4375"
     inkscape:cx="15.982418"
     inkscape:cy="16"
     inkscape:current-layer="svg885">
    <inkscape:grid
       type="xygrid"
       id="grid1640" />
  </sodipodi:namedview>
  <path
     d="m20.055451 1.2516258-2.520345 4.4321031-3.070047.0011-2.521414-4.4348538-3.505211 1.4519044 1.3530102 4.9188269-2.1716313 2.1700723-4.916124-1.351817-1.4520609 3.5055853 4.4321037 2.520346.0011 3.070047-4.4348579 2.521412 1.4519062 3.505212 4.9188259-1.353009 2.1700716 2.171632-1.3518175 4.916124 3.505586 1.452061 2.520346-4.432104 3.070047-.0011 2.521416 4.434857 3.505211-1.451907-1.353012-4.918826 2.171632-2.170072 4.916126 1.351818 1.452061-3.505585-4.432106-2.520347-.0011-3.070048 4.434859-2.521413-1.451917-3.505222-4.918828 1.3530074-2.170071-2.1716309 1.351817-4.9161235zm-2.119368 10.0742582a5.0592245 5.0592245 0 0 1 2.738031 6.610196 5.0592245 5.0592245 0 0 1 -6.610194 2.738034 5.0592245 5.0592245 0 0 1 -2.738032-6.610196 5.0592245 5.0592245 0 0 1 6.610195-2.738034z"
     fill="#c2f3ff"
     stroke="#00aad4"
     stroke-linejoin="round"
     stroke-width="1.5"
     id="path883" />
</svg>
