<?xml version="1.0" encoding="UTF-8" standalone="no"?>
<svg
   height="64"
   width="64"
   version="1.1"
   id="svg635"
   sodipodi:docname="Add_10_64.svg"
   inkscape:export-filename="Add_10_64.png"
   inkscape:export-xdpi="96"
   inkscape:export-ydpi="96"
   inkscape:version="1.2.2 (732a01da63, 2022-12-09)"
   xmlns:inkscape="http://www.inkscape.org/namespaces/inkscape"
   xmlns:sodipodi="http://sodipodi.sourceforge.net/DTD/sodipodi-0.dtd"
   xmlns="http://www.w3.org/2000/svg"
   xmlns:svg="http://www.w3.org/2000/svg">
  <defs
     id="defs639" />
  <sodipodi:namedview
     id="namedview637"
     pagecolor="#ffffff"
     bordercolor="#666666"
     borderopacity="1.0"
     inkscape:showpageshadow="2"
     inkscape:pageopacity="0.0"
     inkscape:pagecheckerboard="0"
     inkscape:deskcolor="#d1d1d1"
     showgrid="true"
     inkscape:zoom="14.34375"
     inkscape:cx="32.20915"
     inkscape:cy="32"
     inkscape:current-layer="svg635">
    <inkscape:grid
       type="xygrid"
       id="grid862" />
  </sodipodi:namedview>
  <circle
     cx="32"
     cy="32"
     r="26.5"
     style="fill:#e0edff;fill-rule:evenodd;stroke:#2a7efe;stroke-width:5;stroke-linecap:round;stroke-linejoin:round;stroke-dasharray:none"
     id="circle633" />
  <path
     d="M 32,20 V 44"
     id="path705"
     style="fill:none;stroke:#2a7efe;stroke-width:6;stroke-linecap:round;stroke-dasharray:none;stroke-opacity:1"
     sodipodi:nodetypes="cc" />
  <path
     d="M 44,32 H 20"
     id="path707"
     style="fill:none;stroke:#2a7efe;stroke-width:6;stroke-linecap:round;stroke-dasharray:none;stroke-opacity:1"
     sodipodi:nodetypes="cc" />
</svg>
