<?xml version="1.0" encoding="UTF-8" standalone="no"?>
<svg
   height="64"
   width="64"
   version="1.1"
   id="svg6"
   sodipodi:docname="Align_03_64.svg"
   inkscape:export-filename="Align_03_64.png"
   inkscape:export-xdpi="96"
   inkscape:export-ydpi="96"
   inkscape:version="1.3-beta (cedbd6c6ff, 2023-05-28)"
   xmlns:inkscape="http://www.inkscape.org/namespaces/inkscape"
   xmlns:sodipodi="http://sodipodi.sourceforge.net/DTD/sodipodi-0.dtd"
   xmlns="http://www.w3.org/2000/svg"
   xmlns:svg="http://www.w3.org/2000/svg">
  <defs
     id="defs6" />
  <sodipodi:namedview
     id="namedview6"
     pagecolor="#ffffff"
     bordercolor="#000000"
     borderopacity="0.25"
     inkscape:showpageshadow="2"
     inkscape:pageopacity="0.0"
     inkscape:pagecheckerboard="0"
     inkscape:deskcolor="#d1d1d1"
     showgrid="true"
     inkscape:zoom="14.203125"
     inkscape:cx="32"
     inkscape:cy="32"
     inkscape:current-layer="g6">
    <inkscape:grid
       id="grid6"
       units="px"
       originx="0"
       originy="0"
       spacingx="0.5"
       spacingy="0.5"
       empcolor="#0099e5"
       empopacity="0.30196078"
       color="#0099e5"
       opacity="0.14901961"
       empspacing="2"
       dotted="false"
       gridanglex="30"
       gridanglez="30"
       visible="true" />
  </sodipodi:namedview>
  <g
     fill="none"
     stroke="#00aad4"
     stroke-width="3.2"
     transform="translate(0 -.1)"
     id="g6">
    <path
       d="M 52,55.5 H 12.000626"
       id="path1" />
    <path
       d="M 52,39.5 H 12.000626"
       id="path2" />
    <path
       d="M 52,23.5 H 12.000626"
       id="path3" />
    <path
       d="M 52,47.5 H 22"
       id="path4"
       sodipodi:nodetypes="cc" />
    <path
       d="M 52,31.5 H 22"
       id="path5"
       sodipodi:nodetypes="cc" />
    <path
       d="M 52,15.5 H 22"
       id="path6"
       sodipodi:nodetypes="cc" />
    <path
       d="M 52,7.5 H 12"
       id="path7" />
  </g>
</svg>
