<?xml version="1.0" encoding="UTF-8" standalone="no"?>
<svg
   width="24"
   height="24"
   version="1.1"
   viewBox="0 0 24 24"
   id="svg7"
   sodipodi:docname="tsavedialog.svg"
   inkscape:export-filename="tsavedialog.png"
   inkscape:export-xdpi="96"
   inkscape:export-ydpi="96"
   inkscape:version="1.3.2 (091e20e, 2023-11-25, custom)"
   xmlns:inkscape="http://www.inkscape.org/namespaces/inkscape"
   xmlns:sodipodi="http://sodipodi.sourceforge.net/DTD/sodipodi-0.dtd"
   xmlns="http://www.w3.org/2000/svg"
   xmlns:svg="http://www.w3.org/2000/svg">
  <sodipodi:namedview
     id="namedview7"
     pagecolor="#ffffff"
     bordercolor="#000000"
     borderopacity="0.25"
     inkscape:showpageshadow="2"
     inkscape:pageopacity="0.0"
     inkscape:pagecheckerboard="0"
     inkscape:deskcolor="#d1d1d1"
     showgrid="true"
     inkscape:current-layer="svg7">
    <inkscape:grid
       id="grid7"
       units="px"
       originx="0"
       originy="0"
       spacingx="0.5"
       spacingy="0.5"
       empcolor="#0099e5"
       empopacity="0.30196078"
       color="#0099e5"
       opacity="0.14901961"
       empspacing="2"
       dotted="false"
       gridanglex="30"
       gridanglez="30"
       visible="true" />
  </sodipodi:namedview>
  <defs
     id="defs2">
    <linearGradient
       id="a"
       x1="13.53"
       x2="13.53"
       y1="3.5"
       y2="8.75"
       gradientTransform="matrix(0.80919429,0,0,0.825396,1.0519714,4.1111)"
       gradientUnits="userSpaceOnUse">
      <stop
         stop-color="#ececec"
         offset="0"
         id="stop1" />
      <stop
         stop-color="#b7bec8"
         offset="1"
         id="stop2" />
    </linearGradient>
  </defs>
  <rect
     x="1.25"
     y="4.25"
     width="21.5"
     height="18.5"
     fill="#f9f9f9"
     stroke="#2a7efe"
     stroke-width="0.5"
     style="paint-order:normal"
     id="rect1" />
  <path
     d="m 2.5,1 h 19 C 22.35,1 23,1.6 23,2.5 V 4 H 1 V 2.5 C 1,1.6 1.6,1 2.5,1 Z"
     fill="#2a7efe"
     id="path1" />
  <path
     d="M 6.8571429,7 H 16.714286 L 18,8.3 V 19.1333 C 18,19.612 17.61624,20 17.142857,20 H 6.857143 C 6.3837601,20 6.0000001,19.612 6.0000001,19.1333 V 7.8667 C 6.0000001,7.388 6.3837601,7 6.8571429,7 Z"
     fill="#0078f0"
     fill-rule="evenodd"
     stroke-width="0.999998"
     id="path3" />
  <rect
     x="7.5"
     y="12.499983"
     width="9"
     height="7.5000172"
     rx="0.54285812"
     ry="0.5000174"
     fill="#ffffff"
     stroke-width="0.923186"
     id="rect3" />
  <path
     d="m 8.5,7 v 3.4667 c 3.64e-5,0.4786 0.3837817,0.8666 0.8571429,0.8666 h 5.2142861 c 0.473361,0 0.928535,-0.388 0.928571,-0.8666 V 7 Z M 13,8 h 1.5 v 2.5 H 13 Z"
     fill="url(#a)"
     fill-rule="evenodd"
     stroke-width="0.999998"
     id="path4"
     style="fill:url(#a)" />
  <path
     d="M 8.5000005,14.5 H 15.5"
     fill="none"
     stroke="#e6e6e6"
     stroke-width="0.999998"
     id="path5" />
  <path
     d="M 8.5000002,16.5 H 15.5"
     fill="none"
     stroke="#e6e6e6"
     stroke-width="0.999998"
     id="path6" />
  <path
     d="m 7.5,19.25 h 9"
     fill="none"
     stroke="#ff6600"
     stroke-width="1.5"
     id="path7" />
</svg>
