<?xml version="1.0" encoding="UTF-8" standalone="no"?>
<svg
   height="24"
   width="24"
   version="1.1"
   id="svg732"
   sodipodi:docname="Save_01_24.svg"
   inkscape:export-filename="Save_01_24.png"
   inkscape:export-xdpi="96"
   inkscape:export-ydpi="96"
   inkscape:version="1.2-beta (1b65182ce9, 2022-04-05)"
   xmlns:inkscape="http://www.inkscape.org/namespaces/inkscape"
   xmlns:sodipodi="http://sodipodi.sourceforge.net/DTD/sodipodi-0.dtd"
   xmlns="http://www.w3.org/2000/svg"
   xmlns:svg="http://www.w3.org/2000/svg">
  <defs
     id="defs736" />
  <sodipodi:namedview
     id="namedview734"
     pagecolor="#ffffff"
     bordercolor="#666666"
     borderopacity="1.0"
     inkscape:pageshadow="2"
     inkscape:pageopacity="0.0"
     inkscape:pagecheckerboard="0"
     inkscape:deskcolor="#d1d1d1"
     showgrid="true"
     inkscape:zoom="38.25"
     inkscape:cx="11.986928"
     inkscape:cy="12"
     inkscape:current-layer="svg732">
    <inkscape:grid
       type="xygrid"
       id="grid1467" />
  </sodipodi:namedview>
  <linearGradient
     id="a"
     gradientUnits="userSpaceOnUse"
     x1="9"
     x2="11.25"
     y1="1.5"
     y2="9">
    <stop
       offset="0"
       stop-color="#ccc"
       id="stop717" />
    <stop
       offset="1"
       stop-color="#f2f2f2"
       id="stop719" />
  </linearGradient>
  <g
     fill-rule="evenodd"
     id="g730">
    <path
       d="m22 24v-21.5l-2.5-2.5h-19.5v24z"
       fill="#0062f5"
       id="path722" />
    <path
       d="m-19.5-23h17v3h-17z"
       fill="#f00"
       transform="scale(-1)"
       id="path724" />
    <path
       d="m-19.5-20h17v9h-17z"
       fill="#fff"
       transform="scale(-1)"
       id="path726" />
    <path
       d="m18 9v-9h-12v9zm-1.5-1.5h-3v-6h3z"
       fill="url(#a)"
       id="path728" />
  </g>
</svg>
