<svg width="64" height="64" version="1.1" xmlns="http://www.w3.org/2000/svg">
 <defs>
  <radialGradient id="a" cx="12.1" cy="10.900001" r="4.5" gradientTransform="matrix(0,4.1481482,-4.1481478,8e-8,86.614815,-8.7925946)" gradientUnits="userSpaceOnUse">
   <stop stop-color="#ff7f2a" offset="0"/>
   <stop stop-color="#d45500" offset="1"/>
  </radialGradient>
 </defs>
 <g stroke="#ffffff" stroke-linecap="round">
  <circle transform="matrix(0,1,1,0,0,0)" cx="47" cy="47" r="15.4" fill="url(#a)" stroke-dashoffset="1.49998" stroke-linejoin="round" stroke-width="3.2"/>
  <path d="m46.000021 53.999831-6.999831-6.99954 6.999831-7.000121" fill="none" stroke-linejoin="round" stroke-width="3.99989"/>
  <path d="m39.000191 47.000251h15.999616" fill="none" stroke-width="3.99989px"/>
 </g>
</svg>
