<?xml version="1.0" encoding="UTF-8" standalone="no"?>
<svg
   width="32"
   height="32"
   version="1.1"
   viewBox="0 0 8.4667 8.4667"
   id="svg6"
   sodipodi:docname="HTMLList_200.svg"
   inkscape:export-filename="HTMLList_200.png"
   inkscape:export-xdpi="96"
   inkscape:export-ydpi="96"
   inkscape:version="1.3.2 (091e20e, 2023-11-25, custom)"
   xmlns:inkscape="http://www.inkscape.org/namespaces/inkscape"
   xmlns:sodipodi="http://sodipodi.sourceforge.net/DTD/sodipodi-0.dtd"
   xmlns="http://www.w3.org/2000/svg"
   xmlns:svg="http://www.w3.org/2000/svg">
  <defs
     id="defs6" />
  <sodipodi:namedview
     id="namedview6"
     pagecolor="#ffffff"
     bordercolor="#000000"
     borderopacity="0.25"
     inkscape:showpageshadow="2"
     inkscape:pageopacity="0.0"
     inkscape:pagecheckerboard="0"
     inkscape:deskcolor="#d1d1d1"
     showgrid="true"
     inkscape:current-layer="svg6">
    <inkscape:grid
       id="grid6"
       units="px"
       originx="0"
       originy="0"
       spacingx="0.13229219"
       spacingy="0.13229219"
       empcolor="#0099e5"
       empopacity="0.30196078"
       color="#0099e5"
       opacity="0.14901961"
       empspacing="2"
       dotted="false"
       gridanglex="30"
       gridanglez="30"
       visible="true" />
  </sodipodi:namedview>
  <path
     d="m3.5481178 5.0271031 0.1317754-0.3188448c0.0624972-0.1511432 0.229573-0.230096 0.3860245-0.1824185l0.5105652 0.1555466 0.1054203-0.1049035-0.0237713-0.0785485h-2.0117714v0.5291687z"
     fill="#008dd2"
     id="path1" />
  <path
     d="m2.646348 1.5875059 4.7611403 3e-7"
     fill="none"
     stroke="#008dd2"
     stroke-width=".529167"
     id="path2" />
  <g
     transform="matrix(1.788978,0,0,2.0000278,1.6997881,-3.4318886)"
     stroke-width="1.05734"
     id="g3">
    <path
       d="m0.52910647 3.3072398 2.6613744-0.0038352"
       fill="none"
       stroke="#008dd2"
       stroke-width=".279752"
       id="path3" />
  </g>
  <circle
     cx="1.5875062"
     cy="1.5875062"
     r=".52916873"
     fill="#008dd2"
     id="circle3" />
  <circle
     cx="1.5875063"
     cy="4.7625194"
     r=".52916873"
     fill="#008dd2"
     id="circle4" />
  <circle
     cx="1.5875062"
     cy="3.1750124"
     r=".52916873"
     fill="#008dd2"
     id="circle5" />
  <path
     d="m3.3987723 6.6151261c0.0212251-0.0839312 0.0750663-0.1589222 0.1565802-0.2025724l0.4702574-0.2526987v-0.0738976h-1.3792494v0.5291687z"
     fill="#008dd2"
     id="path5" />
  <circle
     cx="1.5875062"
     cy="6.3500257"
     r=".52916873"
     fill="#008dd2"
     id="circle6" />
  <path
     d="m3.7041812 5.480158 0.6388956 0.3407095v0.5291688l-0.6380918 0.3423174 0.2701401 0.6502409 0.6911909-0.2121887 0.3741784 0.3741784-0.2108382 0.6926649 0.6505108 0.2694506 0.3407021-0.6388834 0.5291687 6e-7 0.3387046 0.6388215 0.65081-0.2687723-0.2091542-0.6932872 0.3741787-0.3741795 0.6926734 0.2108823 0.2694495-0.6505125-0.6388813-0.3407383 6e-7 -0.5291693 0.6380769-0.3423134-0.2701417-0.6502431-0.6911859 0.2121945-0.3741792-0.3741794 0.2108518-0.6926808-0.6505111-0.2694509-0.3407048 0.6388964-0.5291687 1e-6 -0.3387029-0.6388096-0.6508077 0.268772 0.2091402 0.6932571-0.3741789 0.3741789-0.6926827-0.2108521zm1.6551083 0.3045064c0.1661167-0.4010432 0.6258897-0.5914873 1.0269329-0.4253701 0.4010438 0.1661182 0.59149 0.6258912 0.4253712 1.026936-0.1661177 0.4010425-0.6258907 0.5914887-1.026936 0.4253705-0.4010422-0.1661193-0.5914879-0.6258905-0.4253681-1.0269364z"
     fill="#ff7f00"
     stroke-width=".264584"
     id="path6" />
</svg>
