<?xml version="1.0" encoding="UTF-8" standalone="no"?>
<svg
   height="16"
   width="16"
   version="1.1"
   id="svg3352"
   sodipodi:docname="menu_source_useunit.svg"
   inkscape:export-filename="menu_source_useunit.png"
   inkscape:export-xdpi="96"
   inkscape:export-ydpi="96"
   inkscape:version="1.2.2 (732a01da63, 2022-12-09)"
   xmlns:inkscape="http://www.inkscape.org/namespaces/inkscape"
   xmlns:sodipodi="http://sodipodi.sourceforge.net/DTD/sodipodi-0.dtd"
   xmlns="http://www.w3.org/2000/svg"
   xmlns:svg="http://www.w3.org/2000/svg">
  <defs
     id="defs3356" />
  <sodipodi:namedview
     id="namedview3354"
     pagecolor="#ffffff"
     bordercolor="#666666"
     borderopacity="1.0"
     inkscape:showpageshadow="2"
     inkscape:pageopacity="0.0"
     inkscape:pagecheckerboard="0"
     inkscape:deskcolor="#d1d1d1"
     showgrid="true"
     inkscape:zoom="57.375"
     inkscape:cx="7.3551198"
     inkscape:cy="8"
     inkscape:current-layer="svg3352">
    <inkscape:grid
       type="xygrid"
       id="grid3827" />
  </sodipodi:namedview>
  <linearGradient
     id="a"
     gradientTransform="matrix(.96732065 0 0 .96732064 .375813 .375812)"
     gradientUnits="userSpaceOnUse"
     x1="14.084459"
     x2="8.915541"
     y1="14.084459"
     y2="8.915541">
    <stop
       offset="0"
       stop-color="#009600"
       id="stop3323" />
    <stop
       offset="1"
       stop-color="#6edb39"
       id="stop3325" />
  </linearGradient>
  <path
     d="m2.5.5h11v14h-11z"
     fill="#fff"
     stroke="#2a7fff"
     stroke-linecap="round"
     stroke-linejoin="round"
     stroke-miterlimit="5.6"
     id="path3328"
     style="stroke:#d4aa00;stroke-opacity:1" />
  <g
     fill="none"
     stroke="#d4aa00"
     id="g3340"
     style="stroke:#2a7fff;stroke-opacity:1">
    <path
       d="m5 5.5h6"
       id="path3330"
       style="stroke:#2a7fff;stroke-opacity:1" />
    <path
       d="m5 3.5h6"
       id="path3332"
       style="stroke:#2a7fff;stroke-opacity:1" />
    <path
       d="m5 7.5h6"
       id="path3334"
       style="stroke:#2a7fff;stroke-opacity:1" />
    <path
       d="m5 9.5h6"
       id="path3336"
       style="stroke:#2a7fff;stroke-opacity:1" />
    <path
       d="m5 11.5h6"
       id="path3338"
       style="stroke:#2a7fff;stroke-opacity:1" />
  </g>
  <g
     stroke="#fff"
     stroke-linecap="round"
     id="g3350">
    <circle
       cx="11.5"
       cy="11.5"
       fill="url(#a)"
       r="4.000001"
       stroke-dashoffset="1.49998"
       stroke-linejoin="round"
       stroke-width=".999997"
       transform="matrix(0 1 1 0 0 0)"
       id="circle3342" />
    <g
       fill="none"
       id="g3348">
      <path
         d="m11.5 9.5v4"
         id="path3344" />
      <path
         d="m13.5 11.5h-4"
         id="path3346" />
    </g>
  </g>
</svg>
