<svg width="32" height="32" version="1.1" xmlns="http://www.w3.org/2000/svg">
 <g stroke="#ff2828" stroke-linecap="round" stroke-width="1.6">
  <circle cx="23" cy="23" r="8.1999998" fill="#ffffff" stroke-dashoffset="1.49998" stroke-linejoin="round"/>
  <path d="m19.805195 19.805195 6.38961 6.38961" fill="none"/>
  <path d="m26.194805 19.805195-6.38961 6.38961" fill="none"/>
 </g>
</svg>
