<svg width="36" height="36" version="1.1" xmlns="http://www.w3.org/2000/svg">
 <rect x="2.55" y="2.55" width="30.9" height="30.9" rx="2.5" fill="#f0fcff" stroke="#00aad4" stroke-linejoin="round" stroke-width="1.1"/>
 <path d="m3 3h30v4h-30z" fill="#00aad4"/>
 <path d="m28.178646 24.999999c0 1.755517-1.423128 3.178645-3.178645 3.178645s-3.178646-1.423128-3.178646-3.178645 1.423129-3.178646 3.178646-3.178646 3.178645 1.423129 3.178645 3.178646zm-8.477261-9.476934 0.814789 3.197268-1.793848 1.794347-3.201485-0.814071-0.970854 2.343848 2.839427 1.688156-3.53e-4 2.537239-2.836953 1.684666 0.970958 2.3441 3.197268-0.81479 1.794347 1.793849-0.814071 3.201485 2.343848 0.970852 1.688156-2.839423 2.537238 3.51e-4 1.684667 2.836951 2.3441-0.970957-0.81479-3.197268 1.793849-1.794347 3.201485 0.814071 0.970851-2.343846-2.839423-1.688158 3.52e-4 -2.537237 2.836951-1.684669-0.970959-2.344098-3.197267 0.814789-1.794346-1.793848 0.81407-3.201486-2.343846-0.970853-1.688159 2.839427-2.537235-3.53e-4 -1.684669-2.836953-2.344098 0.970958" fill="#ffefb3" stroke="#c29c00" stroke-dashoffset="1.49998" stroke-linecap="round" stroke-linejoin="round" stroke-width="1.1"/>
</svg>
