<?xml version="1.0" encoding="UTF-8" standalone="no"?>
<svg
   width="36"
   height="36"
   version="1.1"
   viewBox="0 0 36 36"
   id="svg11"
   sodipodi:docname="ttilabel_150.svg"
   inkscape:version="1.3.2 (091e20e, 2023-11-25, custom)"
   xmlns:inkscape="http://www.inkscape.org/namespaces/inkscape"
   xmlns:sodipodi="http://sodipodi.sourceforge.net/DTD/sodipodi-0.dtd"
   xmlns="http://www.w3.org/2000/svg"
   xmlns:svg="http://www.w3.org/2000/svg">
  <sodipodi:namedview
     id="namedview11"
     pagecolor="#ffffff"
     bordercolor="#000000"
     borderopacity="0.25"
     inkscape:showpageshadow="2"
     inkscape:pageopacity="0.0"
     inkscape:pagecheckerboard="0"
     inkscape:deskcolor="#d1d1d1"
     showgrid="true"
     inkscape:current-layer="svg11">
    <inkscape:grid
       id="grid11"
       units="px"
       originx="0"
       originy="0"
       spacingx="0.5"
       spacingy="0.5"
       empcolor="#0099e5"
       empopacity="0.30196078"
       color="#0099e5"
       opacity="0.14901961"
       empspacing="2"
       dotted="false"
       gridanglex="30"
       gridanglez="30"
       visible="true" />
  </sodipodi:namedview>
  <defs
     id="defs6">
    <radialGradient
       id="a"
       cx="5.3999925"
       cy="1034.7039"
       r="4"
       gradientTransform="matrix(1.9642759,-1.9642982,1.1785882,1.1785751,-1221.5255,-1200.2975)"
       gradientUnits="userSpaceOnUse">
      <stop
         stop-color="#198d19"
         offset="0"
         id="stop1" />
      <stop
         stop-color="#ffffff"
         offset="1"
         id="stop2" />
    </radialGradient>
    <radialGradient
       id="b"
       cx="5.3999925"
       cy="1034.7039"
       r="4"
       gradientTransform="matrix(1.9642759,-1.9642983,1.1785882,1.1785751,-1209.5255,-1200.2975)"
       gradientUnits="userSpaceOnUse">
      <stop
         stop-color="#1a75ff"
         offset="0"
         id="stop3" />
      <stop
         stop-color="#ffffff"
         offset="1"
         id="stop4" />
    </radialGradient>
    <radialGradient
       id="c"
       cx="5.3999925"
       cy="1034.7039"
       r="4"
       gradientTransform="matrix(1.7857054,-1.7857257,1.0714438,1.0714319,-1109.8414,-1078.5431)"
       gradientUnits="userSpaceOnUse">
      <stop
         stop-color="#ff1919"
         offset="0"
         id="stop5" />
      <stop
         stop-color="#ffffff"
         offset="1"
         id="stop6" />
    </radialGradient>
  </defs>
  <path
     d="m 7,13 c -3.3077796,0 -6,2.6922 -6,6 0,3.1912 2.5055823,5.8076 5.6523437,5.9883 L 7.015625,24 H 7 C 6.6704028,24 6.3486684,23.967 6.0371094,23.906 a 5,5 0 0 1 -0.015625,0 C 4.0425739,23.5154 2.4897462,21.9626 2.0976563,19.9842 a 5,5 0 0 1 -0.00391,-0.02 C 2.033296,19.6494 2,19.3295 2,19 2,18.669 2.034735,18.346 2.095703,18.0332 a 5,5 0 0 1 0,-0.012 C 2.5489079,15.7248 4.5676265,14 7,14 a 5,5 0 0 1 0.4394531,0.022 c 0.053096,0 0.1056023,0.011 0.1582031,0.018 a 5,5 0 0 1 0.234375,0.033 c 0.1444902,0.024 0.2858187,0.056 0.4257813,0.092 a 5,5 0 0 1 0.1152344,0.029 c 0.092517,0.026 0.1832127,0.057 0.2734375,0.088 a 5,5 0 0 1 0.070312,0.025 c 0.299638,0.1093 0.5859646,0.2465 0.8554687,0.4082 a 5,5 0 0 1 0.044922,0.027 c 0.2711498,0.1667 0.5243449,0.3565 0.7578129,0.5703 a 5,5 0 0 1 0.05078,0.047 c 0.0712,0.067 0.139872,0.1359 0.207032,0.207 a 5,5 0 0 1 0.08594,0.094 c 0.05425,0.06 0.108871,0.1205 0.160156,0.1836 a 5,5 0 0 1 0.205078,0.2734 c 0.06101,0.086 0.118291,0.1753 0.173829,0.2656 a 5,5 0 0 1 0.02734,0.045 c 0.05358,0.089 0.106245,0.1787 0.154297,0.2715 a 5,5 0 0 1 0.146485,0.3086 c 0.03078,0.071 0.05644,0.1441 0.08398,0.2168 a 5,5 0 0 1 0.06055,0.1602 c 0.02436,0.072 0.0472,0.1437 0.06836,0.2168 a 5,5 0 0 1 0.01953,0.068 2.30023,2.30023 0 0 1 1.173829,1.0117 C 12.826251,15.521 10.201118,13 7,13 Z"
     fill="#ff1a1a"
     fill-rule="evenodd"
     stroke-linecap="square"
     id="path6"
     style="stroke-linejoin:round" />
  <path
     d="M 7.015625,23.998 8.8398438,19.0098 A 2.30023,2.30023 0 0 1 11,17.502 a 2.30023,2.30023 0 0 1 0.816406,0.166 c -0.006,-0.022 -0.01125,-0.045 -0.01758,-0.066 a 5,5 0 0 0 -0.06836,-0.2168 c -0.01844,-0.054 -0.04032,-0.1068 -0.06055,-0.1602 A 5,5 0 0 0 8.3730409,14.1938 c -0.038089,-0.011 -0.076777,-0.019 -0.1152344,-0.029 a 5,5 0 0 0 -0.4257813,-0.092 c -0.077553,-0.013 -0.1556408,-0.024 -0.234375,-0.033 A 5,5 0 0 0 7.4394471,14.0218 C 7.2942682,14.0089 7.1485279,14 7,14 a 5,5 0 0 0 -5,5 5,5 0 0 0 5,5 5,5 0 0 0 0.015625,0 z"
     fill="url(#c)"
     fill-rule="evenodd"
     stroke-linecap="square"
     id="path7"
     style="fill:url(#c);stroke-linejoin:round" />
  <circle
     cx="7"
     cy="6.9999828"
     r="5.5"
     fill="url(#a)"
     fill-rule="evenodd"
     stroke="#198d19"
     stroke-linecap="square"
     style="fill:url(#a);stroke-linejoin:round;paint-order:normal"
     id="circle7" />
  <circle
     cx="19"
     cy="6.9999828"
     r="5.5"
     fill="url(#b)"
     fill-rule="evenodd"
     stroke="#1a75ff"
     stroke-linecap="square"
     style="fill:url(#b);stroke-linejoin:round;paint-order:normal"
     id="circle8" />
  <path
     d="M 8.2727798,28.2467 H 13.72773 M 6.829,31.1997 11.000254,19.7998 15.17151,31.1997"
     fill="none"
     stroke="#2a7efe"
     stroke-linecap="round"
     stroke-width="1.6"
     id="path8"
     style="stroke-linejoin:round" />
  <path
     d="m 20.903986,23.057 h 2e-6 c 1.497866,0 2.703729,1.2106 2.703729,2.7144 v 2.7144 c 0,1.5037 -1.205863,2.7143 -2.703729,2.7143 h -2e-6 c -1.497867,0 -2.703731,-1.2106 -2.703731,-2.7143 v -2.7144 c 0,-1.5038 1.205864,-2.7144 2.703731,-2.7144 z m -2.703731,-3.2572 v 11.4003"
     fill="none"
     stroke="#2a7efe"
     stroke-linecap="round"
     stroke-width="1.6"
     id="path9"
     style="stroke-linejoin:round" />
  <path
     d="M 31.680689,24.1572 C 31.189106,23.4889 30.39863,23.057 29.503985,23.057 h -2e-6 c -1.497866,0 -2.703728,1.2106 -2.703728,2.7144 l 0.0012,2.7144 c 0,1.5037 1.205863,2.7143 2.703729,2.7143 h 3e-6 c 0.894643,0 1.68512,-0.4319 2.176704,-1.1001"
     fill="none"
     stroke="#2a7efe"
     stroke-linecap="round"
     stroke-width="1.6"
     id="path10"
     style="stroke-linejoin:round" />
  <path
     d="M 5,33.5 H 17"
     fill="none"
     stroke="#2a7efe"
     id="path11"
     style="stroke-linejoin:round" />
</svg>
