<?xml version="1.0" encoding="UTF-8" standalone="no"?>
<svg
   height="16"
   width="16"
   version="1.1"
   id="svg30"
   sodipodi:docname="Database_01_16.svg"
   inkscape:export-filename="Database_01_16.png"
   inkscape:export-xdpi="96"
   inkscape:export-ydpi="96"
   inkscape:version="1.2-beta (1b65182ce9, 2022-04-05)"
   xmlns:inkscape="http://www.inkscape.org/namespaces/inkscape"
   xmlns:sodipodi="http://sodipodi.sourceforge.net/DTD/sodipodi-0.dtd"
   xmlns:xlink="http://www.w3.org/1999/xlink"
   xmlns="http://www.w3.org/2000/svg"
   xmlns:svg="http://www.w3.org/2000/svg">
  <defs
     id="defs34">
    <linearGradient
       inkscape:collect="always"
       xlink:href="#a"
       id="linearGradient463"
       gradientUnits="userSpaceOnUse"
       x1="-24.5"
       y1="-.5"
       x2="-15.5"
       y2="-.5"
       gradientTransform="translate(27.5,7.500017)" />
  </defs>
  <sodipodi:namedview
     id="namedview32"
     pagecolor="#ffffff"
     bordercolor="#666666"
     borderopacity="1.0"
     inkscape:pageshadow="2"
     inkscape:pageopacity="0.0"
     inkscape:pagecheckerboard="0"
     inkscape:deskcolor="#d1d1d1"
     showgrid="true"
     inkscape:zoom="57.375"
     inkscape:cx="7.8779956"
     inkscape:cy="8"
     inkscape:current-layer="svg30">
    <inkscape:grid
       type="xygrid"
       id="grid461" />
  </sodipodi:namedview>
  <linearGradient
     id="a">
    <stop
       offset="0"
       stop-color="#4276c4"
       id="stop2" />
    <stop
       offset=".34375"
       stop-color="#80b3ff"
       id="stop4" />
    <stop
       offset="1"
       stop-color="#04a"
       id="stop6" />
  </linearGradient>
  <linearGradient
     id="b"
     gradientUnits="userSpaceOnUse"
     x1="-24.5"
     x2="-15.5"
     xlink:href="#a"
     y1="-.5"
     y2="-.5"
     gradientTransform="translate(27.5,7.500017)" />
  <linearGradient
     id="c"
     gradientUnits="userSpaceOnUse"
     x1="-24.5"
     x2="-15.5"
     xlink:href="#a"
     y1="-3.5"
     y2="-3.5"
     gradientTransform="translate(27.5,7.500017)" />
  <linearGradient
     id="d"
     gradientUnits="userSpaceOnUse"
     x1="-24.5"
     x2="-15.5"
     xlink:href="#a"
     y1="-6.5"
     y2="-6.5"
     gradientTransform="translate(27.5,7.500017)" />
  <g
     id="g1692">
    <ellipse
       cx="8"
       cy="12.5"
       rx="5"
       ry="1.5"
       stroke="url(#b)"
       stroke-width="2"
       id="ellipse12"
       style="fill:none;fill-rule:evenodd;stroke:url(#linearGradient463);stroke-linecap:round;stroke-linejoin:round" />
    <ellipse
       cx="8"
       cy="10.541504"
       rx="5.4943089"
       ry="1.958482"
       stroke="#ffffff"
       id="ellipse14"
       style="fill:none;fill-rule:evenodd;stroke-linecap:round;stroke-linejoin:round" />
    <ellipse
       cx="8"
       cy="9.5"
       rx="5"
       ry="1.5"
       stroke="url(#c)"
       stroke-width="2"
       id="ellipse16"
       style="fill:none;fill-rule:evenodd;stroke:url(#c);stroke-linecap:round;stroke-linejoin:round" />
    <ellipse
       cx="8"
       cy="7.5415039"
       rx="5.4943089"
       ry="1.958482"
       stroke="#ffffff"
       id="ellipse18"
       style="fill:none;fill-rule:evenodd;stroke-linecap:round;stroke-linejoin:round" />
    <ellipse
       cx="8"
       cy="6.5"
       rx="5"
       ry="1.5"
       stroke="url(#d)"
       stroke-width="2"
       id="ellipse20"
       style="fill:none;fill-rule:evenodd;stroke:url(#d);stroke-linecap:round;stroke-linejoin:round" />
    <ellipse
       cx="8"
       cy="4.541503"
       rx="5.4943089"
       ry="1.958482"
       stroke="#ffffff"
       id="ellipse22"
       style="fill:none;fill-rule:evenodd;stroke-linecap:round;stroke-linejoin:round" />
    <ellipse
       cx="8"
       cy="3.4999998"
       fill="#80b3ff"
       rx="5.5"
       ry="2"
       stroke="url(#b)"
       id="ellipse26"
       style="fill-rule:evenodd;stroke:url(#b);stroke-linecap:round;stroke-linejoin:round" />
  </g>
</svg>
