<?xml version="1.0" encoding="UTF-8" standalone="no"?>
<svg
   height="36"
   viewBox="0 0 9.5249997 9.5250005"
   width="36"
   version="1.1"
   id="svg22"
   sodipodi:docname="Font_11_36.svg"
   inkscape:export-filename="Font_11_36.png"
   inkscape:export-xdpi="96"
   inkscape:export-ydpi="96"
   inkscape:version="1.2 (dc2aedaf03, 2022-05-15)"
   xmlns:inkscape="http://www.inkscape.org/namespaces/inkscape"
   xmlns:sodipodi="http://sodipodi.sourceforge.net/DTD/sodipodi-0.dtd"
   xmlns="http://www.w3.org/2000/svg"
   xmlns:svg="http://www.w3.org/2000/svg">
  <defs
     id="defs26">
    <radialGradient
       id="a"
       cx="12.1"
       cy="10.900001"
       gradientTransform="matrix(0,2.3164984,-2.3164981,4e-8,48.622559,-4.656904)"
       gradientUnits="userSpaceOnUse"
       r="4.5">
      <stop
         offset="0"
         stop-color="#f55"
         id="stop918" />
      <stop
         offset="1"
         stop-color="#a00"
         id="stop920" />
    </radialGradient>
    <filter
       inkscape:collect="always"
       style="color-interpolation-filters:sRGB"
       id="filter3310"
       x="-0.077552752"
       y="-0.072609941"
       width="1.1551055"
       height="1.1452199">
      <feGaussianBlur
         inkscape:collect="always"
         stdDeviation="0.28818635"
         id="feGaussianBlur3312" />
    </filter>
  </defs>
  <sodipodi:namedview
     id="namedview24"
     pagecolor="#ffffff"
     bordercolor="#666666"
     borderopacity="1.0"
     inkscape:showpageshadow="2"
     inkscape:pageopacity="0.0"
     inkscape:pagecheckerboard="0"
     inkscape:deskcolor="#d1d1d1"
     showgrid="true"
     inkscape:zoom="25.5"
     inkscape:cx="15.509804"
     inkscape:cy="18"
     inkscape:current-layer="svg22">
    <inkscape:grid
       type="xygrid"
       id="grid1279" />
  </sodipodi:namedview>
  <g
     id="g922">
    <path
       id="path2943"
       style="fill:#ffffff;stroke:none;filter:url(#filter3310)"
       d="M 3.8555787,0 A 0.52969114,0.52969114 0 0 0 3.3574178,0.35139974 L 0.33382976,8.8185833 A 0.52969114,0.52969114 0 0 0 0.83199057,9.5255169 H 2.1698934 A 0.52969114,0.52969114 0 0 0 2.6680542,9.1736004 L 3.4080607,7.1055095 H 6.1169394 L 6.8553956,9.1736004 A 0.52969114,0.52969114 0 0 0 7.3535564,9.5255169 H 8.6935263 A 0.52969114,0.52969114 0 0 0 9.1911703,8.8185833 L 6.168099,0.35139974 A 0.52969114,0.52969114 0 0 0 5.6699382,0 Z m 0.9058878,3.3103923 0.5472534,1.5275553 h -1.091923 z" />
    <path
       d="M 3.855357,0.52916655 0.83154745,8.9958335 H 2.1706633 L 3.0346089,6.5767858 H 6.4903911 L 7.3543367,8.9958335 H 8.6934526 L 5.6696427,0.52916655 Z M 4.7624999,1.7386904 6.0584183,5.3672619 H 3.4665814 Z"
       stroke="#ffffff"
       stroke-width="0.198438"
       id="path723"
       sodipodi:nodetypes="ccccccccccccc"
       style="stroke:none" />
  </g>
  <g
     id="g1763"
     transform="scale(0.26458334)">
    <circle
       cx="26.5"
       cy="26.5"
       r="8.6000004"
       style="fill:url(#a);stroke:#ffffff;stroke-width:1.8;stroke-linecap:round;stroke-linejoin:round;stroke-dashoffset:1.49998"
       transform="matrix(0,1,1,0,0,0)"
       id="circle923" />
    <g
       id="g4083"
       transform="matrix(2.25,0,0,2.25,0.625,0.625)">
      <path
         d="m 13,10 -3,3"
         id="path3550"
         style="fill:none;stroke:#ffffff;stroke-width:1.2;stroke-linecap:round;stroke-dasharray:none"
         sodipodi:nodetypes="cc" />
      <path
         d="M 13,13 10,10"
         id="path3552"
         style="fill:none;stroke:#ffffff;stroke-width:1.2;stroke-linecap:round;stroke-dasharray:none"
         sodipodi:nodetypes="cc" />
    </g>
  </g>
</svg>
