<?xml version="1.0" encoding="UTF-8" standalone="no"?>
<svg
   width="16"
   height="16"
   version="1.1"
   id="svg29"
   sodipodi:docname="menu_search_jumpback.svg"
   inkscape:export-filename="menu_search_jumpback.png"
   inkscape:export-xdpi="96"
   inkscape:export-ydpi="96"
   inkscape:version="1.2.2 (732a01da63, 2022-12-09)"
   xmlns:inkscape="http://www.inkscape.org/namespaces/inkscape"
   xmlns:sodipodi="http://sodipodi.sourceforge.net/DTD/sodipodi-0.dtd"
   xmlns="http://www.w3.org/2000/svg"
   xmlns:svg="http://www.w3.org/2000/svg">
  <sodipodi:namedview
     id="namedview31"
     pagecolor="#ffffff"
     bordercolor="#666666"
     borderopacity="1.0"
     inkscape:showpageshadow="2"
     inkscape:pageopacity="0.0"
     inkscape:pagecheckerboard="0"
     inkscape:deskcolor="#d1d1d1"
     showgrid="true"
     inkscape:zoom="57.375"
     inkscape:cx="8"
     inkscape:cy="8"
     inkscape:current-layer="svg29">
    <inkscape:grid
       type="xygrid"
       id="grid597" />
  </sodipodi:namedview>
  <defs
     id="defs9" />
  <g
     transform="rotate(90,6.85,11.15)"
     fill="none"
     stroke="#ff0000"
     stroke-linecap="round"
     id="g27"
     style="stroke-width:2;stroke-dasharray:none">
    <path
       d="M -0.8,11.5 2.7,15 6.2,11.5"
       stroke-linejoin="round"
       id="path23"
       style="stroke-width:2;stroke-dasharray:none"
       sodipodi:nodetypes="ccc" />
    <path
       d="M 2.7,15 V 5"
       id="path25"
       style="stroke-width:2;stroke-dasharray:none"
       sodipodi:nodetypes="cc" />
  </g>
</svg>
