<?xml version="1.0" encoding="UTF-8" standalone="no"?>
<svg
   height="16"
   width="16"
   version="1.1"
   id="svg26"
   sodipodi:docname="menu_view_restriction_browser.svg"
   inkscape:export-filename="menu_view_restriction_browser.png"
   inkscape:export-xdpi="96"
   inkscape:export-ydpi="96"
   inkscape:version="1.2.2 (732a01da63, 2022-12-09)"
   xmlns:inkscape="http://www.inkscape.org/namespaces/inkscape"
   xmlns:sodipodi="http://sodipodi.sourceforge.net/DTD/sodipodi-0.dtd"
   xmlns="http://www.w3.org/2000/svg"
   xmlns:svg="http://www.w3.org/2000/svg">
  <defs
     id="defs30" />
  <sodipodi:namedview
     id="namedview28"
     pagecolor="#ffffff"
     bordercolor="#666666"
     borderopacity="1.0"
     inkscape:showpageshadow="2"
     inkscape:pageopacity="0.0"
     inkscape:pagecheckerboard="0"
     inkscape:deskcolor="#d1d1d1"
     showgrid="true"
     inkscape:zoom="57.375"
     inkscape:cx="7.9912854"
     inkscape:cy="8"
     inkscape:current-layer="svg26">
    <inkscape:grid
       type="xygrid"
       id="grid558" />
  </sodipodi:namedview>
  <path
     d="m1.5 1.5h13v13h-13z"
     style="fill:#2a7fff;stroke:#2a7fff;stroke-width:.999996;stroke-linecap:round;stroke-linejoin:round;stroke-miterlimit:5.6"
     id="path2" />
  <path
     d="m1.9999999 3.2h12.0000001v10.799999h-12.0000001z"
     fill="#fff"
     stroke-width=".999999"
     id="path4" />
  <circle
     cx="4"
     cy="5.5"
     fill="#ff7f00"
     r="1"
     id="circle6" />
  <circle
     cx="4"
     cy="11.5"
     fill="#fa0302"
     r="1"
     id="circle8" />
  <circle
     cx="4"
     cy="8.5"
     fill="#01a901"
     r="1"
     id="circle10" />
  <path
     d="m6 5.5h4"
     fill="none"
     stroke="#999"
     id="path12" />
  <path
     d="m6 11.5h4"
     fill="none"
     stroke="#999"
     id="path14" />
  <path
     d="m6 8.5h4"
     fill="none"
     stroke="#999"
     id="path16" />
  <path
     d="m11.5 5h-2l-5 10h10.5v-3z"
     fill="#fff"
     id="path18" />
  <path
     d="m10.500001 6.4999379-4.5000319 9.0000621h9.0000619z"
     fill="#ffd42a"
     stroke="#806600"
     stroke-linejoin="round"
     id="path20" />
  <path
     d="m10.500001 10.487182v1.5"
     fill="none"
     stroke="#000"
     stroke-linecap="round"
     id="path22" />
  <circle
     cx="10.5"
     cy="13.487182"
     r=".5"
     id="circle24" />
</svg>
