<?xml version="1.0" encoding="UTF-8" standalone="no"?>
<svg
   height="24"
   width="24"
   version="1.1"
   id="svg1180"
   sodipodi:docname="Undo_01_24.svg"
   inkscape:export-filename="Undo_01_24.png"
   inkscape:export-xdpi="96"
   inkscape:export-ydpi="96"
   inkscape:version="1.2-beta (1b65182ce9, 2022-04-05)"
   xmlns:inkscape="http://www.inkscape.org/namespaces/inkscape"
   xmlns:sodipodi="http://sodipodi.sourceforge.net/DTD/sodipodi-0.dtd"
   xmlns="http://www.w3.org/2000/svg"
   xmlns:svg="http://www.w3.org/2000/svg">
  <defs
     id="defs1184" />
  <sodipodi:namedview
     id="namedview1182"
     pagecolor="#ffffff"
     bordercolor="#666666"
     borderopacity="1.0"
     inkscape:pageshadow="2"
     inkscape:pageopacity="0.0"
     inkscape:pagecheckerboard="0"
     inkscape:deskcolor="#d1d1d1"
     showgrid="true"
     inkscape:zoom="38.25"
     inkscape:cx="11.986928"
     inkscape:cy="12"
     inkscape:current-layer="svg1180">
    <inkscape:grid
       type="xygrid"
       id="grid1407" />
  </sodipodi:namedview>
  <g
     fill="none"
     stroke="#d40000"
     stroke-linecap="round"
     transform="translate(-2.000039 -.700232)"
     id="g1178">
    <path
       d="m8.500039 4.9093475h9.528391c3.466158 0 6.276034 2.816525 6.276034 6.2908855 0 3.47436-2.809876 6.290884-6.276034 6.290884h-13.2940117"
       stroke-width="2.41823"
       id="path1174" />
    <path
       d="m8.5530295 12.673843-4.8424306 4.84243 4.8424306 4.842429"
       stroke-linejoin="round"
       stroke-width="2.42122"
       id="path1176" />
  </g>
</svg>
