<svg width="16" height="16" version="1.0" xmlns="http://www.w3.org/2000/svg" xmlns:xlink="http://www.w3.org/1999/xlink">
 <defs>
  <linearGradient id="b" x1="11" x2="21" y1="25.75" y2="25.75" gradientTransform="matrix(.3125 0 0 .3125 -19.1875 -2)" gradientUnits="userSpaceOnUse">
   <stop stop-color="#999999" offset="0"/>
   <stop stop-color="#ffffff" offset=".4"/>
   <stop stop-color="#999999" offset="1"/>
  </linearGradient>
  <radialGradient id="a" cx="8.25" cy="3.675" r="4.5" gradientTransform="matrix(-.69444438 .69444444 -.69444438 -.69444438 -6.21875 -2.6770836)" gradientUnits="userSpaceOnUse">
   <stop stop-color="#ffffff" offset="0"/>
   <stop stop-color="#ffffff" offset=".2"/>
   <stop stop-color="#9fc0df" offset="1"/>
  </radialGradient>
  <linearGradient id="g" x1="11" x2="21" y1="25.75" y2="25.75" gradientTransform="matrix(.3125 0 0 .3125 3.5 5.5)" gradientUnits="userSpaceOnUse" xlink:href="#b"/>
  <radialGradient id="d" cx="8.25" cy="3.675" r="4.5" gradientTransform="matrix(-.69444438 .69444444 -.69444438 -.69444438 16.46875 4.8229164)" gradientUnits="userSpaceOnUse" xlink:href="#a"/>
  <linearGradient id="f" x1="11" x2="21" y1="25.75" y2="25.75" gradientTransform="matrix(.3125 0 0 .3125 -1.4963175 2.5)" gradientUnits="userSpaceOnUse" xlink:href="#b"/>
  <radialGradient id="c" cx="8.25" cy="3.675" r="4.5" gradientTransform="matrix(-.69444438 .69444444 -.69444438 -.69444438 11.472432 1.822916)" gradientUnits="userSpaceOnUse" xlink:href="#a"/>
  <radialGradient id="e" cx="8.25" cy="3.675" r="4.5" gradientTransform="matrix(-.69444438 .69444444 -.69444438 -.69444438 20.46875 -.1770836)" gradientUnits="userSpaceOnUse" xlink:href="#a"/>
  <linearGradient id="h" x1="11" x2="21" y1="25.75" y2="25.75" gradientTransform="matrix(.3125 0 0 .3125 7.5 .5)" gradientUnits="userSpaceOnUse" xlink:href="#b"/>
 </defs>
 <path d="m12.5 0.65625c-1.467005 1e-7 -2.65625 1.189245-2.65625 2.65625 0 0.8813854 0.187488 1.2275042 0.540771 1.8150928 0.70657 1.1751819 0.709229 0.8410644 0.709229 2.0910647h2.8125c0-1.2500002 0.01121-0.9158843 0.717774-2.0910647 0.35328-0.5875901 0.532226-0.9337074 0.532226-1.8150928 0-1.467005-1.189245-2.6562499-2.65625-2.65625z" fill="url(#e)" fill-rule="evenodd" stroke="#9fc0df" stroke-width=".3125px"/>
 <path d="m11.5625 9.71875h1.875l-0.625 0.78125h-0.625z" fill="#333333" fill-rule="evenodd" stroke-width=".625" style="paint-order:normal"/>
 <path d="m11.09375 7.21875h2.8125v1.875c0 0.3451781-0.279822 0.625-0.625 0.625h-1.5625c-0.345178 0-0.625-0.2798219-0.625-0.625z" fill="url(#h)" stroke="#999999" stroke-width=".3125"/>
 <path d="m8.5 5.65625c-1.467005 1e-7 -2.65625 1.1892451-2.65625 2.65625 0 0.8813854 0.187488 1.2275042 0.540771 1.815093 0.70657 1.175182 0.709229 0.841064 0.709229 2.091064h2.8125c0-1.25 0.01121-0.915884 0.717774-2.091064 0.35328-0.5875903 0.532226-0.9337076 0.532226-1.815093 0-1.4670049-1.189245-2.6562499-2.65625-2.65625z" fill="url(#d)" fill-rule="evenodd" stroke="#9fc0df" stroke-width=".3125px"/>
 <path d="m7.5625 14.71875h1.875l-0.625 0.78125h-0.625z" fill="#333333" fill-rule="evenodd" stroke-width=".625" style="paint-order:normal"/>
 <path d="m7.09375 12.21875h2.8125v1.875c0 0.345178-0.279822 0.625-0.625 0.625h-1.5625c-0.345178 0-0.625-0.279822-0.625-0.625z" fill="url(#g)" stroke="#999999" stroke-width=".3125"/>
 <path d="m3.5036825 2.65625c-1.467005 0-2.65625 1.189245-2.65625 2.65625 0 0.881385 0.187488 1.227504 0.540771 1.815093 0.70657 1.175182 0.709229 0.841064 0.709229 2.091065h2.8125c0-1.250001 0.01121-0.915885 0.717774-2.091065 0.35328-0.58759 0.532226-0.933708 0.532226-1.815093 0-1.467005-1.189245-2.65625-2.65625-2.65625z" fill="url(#c)" fill-rule="evenodd" stroke="#9fc0df" stroke-width=".3125px"/>
 <path d="m2.5661825 11.71875h1.875l-0.625 0.78125h-0.625z" fill="#333333" fill-rule="evenodd" stroke-width=".625" style="paint-order:normal"/>
 <path d="m2.0974325 9.21875h2.8125v1.875c0 0.345178-0.279822 0.625-0.625 0.625h-1.5625c-0.345178 0-0.625-0.279822-0.625-0.625z" fill="url(#f)" stroke="#999999" stroke-width=".3125"/>
</svg>
