<?xml version="1.0" encoding="UTF-8" standalone="no"?>
<svg
   height="16"
   width="16"
   version="1.1"
   id="svg38"
   sodipodi:docname="Paste_02_16.svg"
   inkscape:export-filename="Paste_02_16.png"
   inkscape:export-xdpi="96"
   inkscape:export-ydpi="96"
   inkscape:version="1.2-beta (1b65182ce9, 2022-04-05)"
   xmlns:inkscape="http://www.inkscape.org/namespaces/inkscape"
   xmlns:sodipodi="http://sodipodi.sourceforge.net/DTD/sodipodi-0.dtd"
   xmlns="http://www.w3.org/2000/svg"
   xmlns:svg="http://www.w3.org/2000/svg">
  <defs
     id="defs42" />
  <sodipodi:namedview
     id="namedview40"
     pagecolor="#ffffff"
     bordercolor="#666666"
     borderopacity="1.0"
     inkscape:pageshadow="2"
     inkscape:pageopacity="0.0"
     inkscape:pagecheckerboard="0"
     inkscape:deskcolor="#d1d1d1"
     showgrid="true"
     inkscape:zoom="57.375"
     inkscape:cx="7.8779956"
     inkscape:cy="8"
     inkscape:current-layer="svg38">
    <inkscape:grid
       type="xygrid"
       id="grid7577" />
  </sodipodi:namedview>
  <linearGradient
     id="a"
     gradientTransform="matrix(.42307695 0 0 .3181818 2.615386 -4.545455)"
     gradientUnits="userSpaceOnUse"
     x1="5.399997"
     x2="5.399997"
     y1="4.333334"
     y2="11.666667">
    <stop
       offset="0"
       stop-color="#fc0"
       id="stop2" />
    <stop
       offset="1"
       stop-color="#fff6d5"
       id="stop4" />
  </linearGradient>
  <linearGradient
     id="b"
     gradientTransform="matrix(.42307695 0 0 .3181818 2.615386 -4.545455)"
     gradientUnits="userSpaceOnUse"
     x1="7.999997"
     x2="7.999997"
     y1="13.500001"
     y2="2.5">
    <stop
       offset="0"
       stop-color="#744b18"
       id="stop7" />
    <stop
       offset="1"
       stop-color="#ca7f26"
       id="stop9" />
  </linearGradient>
  <linearGradient
     id="c"
     gradientTransform="matrix(.61538462 0 0 .81818176 6.576923 4.454546)"
     gradientUnits="userSpaceOnUse"
     x1="3.666667"
     x2="3.666667"
     y1="3.722222"
     y2="12.277779">
    <stop
       offset="0"
       stop-color="#fff"
       id="stop12" />
    <stop
       offset="1"
       stop-color="#e0ebf4"
       id="stop14" />
  </linearGradient>
  <linearGradient
     id="d"
     gradientTransform="matrix(.61538462 0 0 .81818176 6.576923 4.454546)"
     gradientUnits="userSpaceOnUse"
     x1="7.277778"
     x2="7.277778"
     y1="13.500001"
     y2="2.5">
    <stop
       offset="0"
       stop-color="#3a7ab7"
       id="stop17" />
    <stop
       offset="1"
       stop-color="#75a5d3"
       id="stop19" />
  </linearGradient>
  <g
     id="g7212">
    <path
       d="m 9,8.5 h 4"
       id="path22"
       style="fill:none;stroke:#00aad4;stroke-opacity:1;fill-opacity:0" />
    <path
       d="m 9,12.5 h 5"
       id="path24"
       style="fill:none;stroke:#00aad4;stroke-opacity:1;fill-opacity:0" />
    <path
       d="m 9,10.5 h 5"
       id="path26"
       style="fill:none;stroke:#00aad4;stroke-opacity:1;fill-opacity:0" />
    <path
       d="M 6,14.5 H 1 C 0.76561535,14.5 0.5,14.327364 0.5,14 V 2 C 0.5,1.6726364 0.76561535,1.5 1,1.5 h 2.2069717"
       id="path28"
       style="fill:none;stroke:#00aad4" />
    <path
       d="M 8.7145969,1.5 H 11 c 0.234385,0 0.5,0.1726364 0.5,0.5 v 3"
       id="path30"
       style="fill:none;stroke:#00aad4;stroke-opacity:1;fill-opacity:0" />
    <rect
       fill="url(#a)"
       fill-rule="evenodd"
       height="3"
       rx=".192307"
       ry=".136364"
       stroke="url(#b)"
       stroke-linecap="square"
       transform="scale(1 -1)"
       width="5"
       x="3.5"
       y="-3.5"
       id="rect34"
       style="fill:none;stroke:#00aad4;stroke-opacity:1;fill-opacity:0" />
    <path
       d="m7.5 6.5h6l2 2v7h-8z"
       fill="url(#c)"
       fill-rule="evenodd"
       stroke="url(#d)"
       stroke-linecap="square"
       id="path36"
       style="fill:none;stroke:#00aad4;stroke-opacity:1;fill-opacity:0" />
  </g>
</svg>
