<?xml version="1.0" encoding="UTF-8" standalone="no"?>
<svg
   height="16"
   width="16"
   version="1.1"
   id="svg8"
   sodipodi:docname="Folder_01_16.svg"
   inkscape:export-filename="Folder_01_16.png"
   inkscape:export-xdpi="96"
   inkscape:export-ydpi="96"
   inkscape:version="1.2-beta (1b65182ce9, 2022-04-05)"
   xml:space="preserve"
   xmlns:inkscape="http://www.inkscape.org/namespaces/inkscape"
   xmlns:sodipodi="http://sodipodi.sourceforge.net/DTD/sodipodi-0.dtd"
   xmlns="http://www.w3.org/2000/svg"
   xmlns:svg="http://www.w3.org/2000/svg"><defs
     id="defs12" /><sodipodi:namedview
     id="namedview10"
     pagecolor="#ffffff"
     bordercolor="#666666"
     borderopacity="1.0"
     inkscape:pageshadow="2"
     inkscape:pageopacity="0.0"
     inkscape:pagecheckerboard="0"
     inkscape:deskcolor="#d1d1d1"
     showgrid="true"
     inkscape:zoom="57.375"
     inkscape:cx="7.7559913"
     inkscape:cy="8"
     inkscape:current-layer="svg8"><inkscape:grid
       type="xygrid"
       id="grid793" /></sodipodi:namedview><path
     d="m 15.5,6.5 h -15 l 1,7 h 13 z"
     id="path4"
     style="fill:none;stroke:#00aad4;stroke-linejoin:round" /><path
     d="m 1.5,6.5 v -3 c 0,-0.5 0.5,-1 1,-1 h 3 c 0.5,0 1,0.5 1,1 h 8 v 3"
     stroke-linejoin="round"
     id="path145-8"
     style="fill:none;stroke:#00aad4;stroke-linecap:round"
     sodipodi:nodetypes="ccccccc" /></svg>
