<?xml version="1.0" encoding="UTF-8" standalone="no"?>
<svg
   height="32"
   viewBox="0 0 8.4667 8.4667"
   width="32"
   version="1.1"
   id="svg336"
   sodipodi:docname="menu_stepinto_200.svg"
   inkscape:export-filename="menu_stepinto_200.png"
   inkscape:export-xdpi="96"
   inkscape:export-ydpi="96"
   inkscape:version="1.2.2 (732a01da63, 2022-12-09)"
   xmlns:inkscape="http://www.inkscape.org/namespaces/inkscape"
   xmlns:sodipodi="http://sodipodi.sourceforge.net/DTD/sodipodi-0.dtd"
   xmlns="http://www.w3.org/2000/svg"
   xmlns:svg="http://www.w3.org/2000/svg">
  <defs
     id="defs340" />
  <sodipodi:namedview
     id="namedview338"
     pagecolor="#ffffff"
     bordercolor="#666666"
     borderopacity="1.0"
     inkscape:showpageshadow="2"
     inkscape:pageopacity="0.0"
     inkscape:pagecheckerboard="0"
     inkscape:deskcolor="#d1d1d1"
     showgrid="true"
     inkscape:zoom="28.6875"
     inkscape:cx="15.982571"
     inkscape:cy="16"
     inkscape:current-layer="svg336">
    <inkscape:grid
       type="xygrid"
       id="grid563" />
  </sodipodi:namedview>
  <g
     fill="none"
     id="g334">
    <g
       stroke-width=".529166"
       id="g326">
      <g
         stroke="#2a7fff"
         id="g316">
        <path
           d="m4.2333503 1.8521078 4.2332938-.0000368"
           id="path308" />
        <path
           d="m4.2333505.79377046h4.2333496"
           id="path310" />
        <path
           d="m4.2333503 7.1437949h4.2333498"
           id="path312" />
        <path
           d="m4.2333503 6.0854576 4.2332938-.000037"
           id="path314" />
      </g>
      <g
         stroke="#f00"
         id="g324">
        <path
           d="m5.2917436 5.0271571 3.1749005-.0000738"
           id="path318" />
        <path
           d="m5.2917436 3.9688195 3.1749005-.0000738"
           id="path320" />
        <path
           d="m5.2917436 2.9104822 3.1749005-.0000738"
           id="path322" />
      </g>
    </g>
    <g
       stroke="#0c0"
       stroke-linecap="round"
       stroke-width=".396872"
       transform="matrix(0 -2.0000307 2.0000307 0 -3.571917 5.423994)"
       id="g332">
      <path
         d="m.19843594 3.3072657.59530788.5953078.59530778-.5953078"
         stroke-linejoin="round"
         id="path328" />
      <path
         d="m1.8520687 1.9843595c-.6614531 0-1.05832512.3968719-1.05832495 1.058325l.00000017.6614533"
         id="path330" />
    </g>
  </g>
</svg>
