<?xml version="1.0" encoding="UTF-8" standalone="no"?>
<svg
   width="48"
   height="48"
   version="1.1"
   viewBox="0 0 12.7 12.7"
   id="svg3"
   sodipodi:docname="Mail_08_48.svg"
   inkscape:export-filename="Mail_08_48.png"
   inkscape:export-xdpi="96"
   inkscape:export-ydpi="96"
   inkscape:version="1.3.2 (091e20e, 2023-11-25, custom)"
   xmlns:inkscape="http://www.inkscape.org/namespaces/inkscape"
   xmlns:sodipodi="http://sodipodi.sourceforge.net/DTD/sodipodi-0.dtd"
   xmlns="http://www.w3.org/2000/svg"
   xmlns:svg="http://www.w3.org/2000/svg">
  <defs
     id="defs3" />
  <sodipodi:namedview
     id="namedview3"
     pagecolor="#ffffff"
     bordercolor="#000000"
     borderopacity="0.25"
     inkscape:showpageshadow="2"
     inkscape:pageopacity="0.0"
     inkscape:pagecheckerboard="0"
     inkscape:deskcolor="#d1d1d1"
     showgrid="true"
     inkscape:current-layer="svg3">
    <inkscape:grid
       id="grid3"
       units="px"
       originx="0"
       originy="0"
       spacingx="0.13229167"
       spacingy="0.13229167"
       empcolor="#0099e5"
       empopacity="0.30196078"
       color="#0099e5"
       opacity="0.14901961"
       empspacing="2"
       dotted="false"
       gridanglex="30"
       gridanglez="30"
       visible="true" />
  </sodipodi:namedview>
  <path
     d="M 7.1437502,8.334375 4.7625,11.1125 6.3500002,7.9375 Z"
     fill="#84a8dc"
     id="path1" />
  <path
     d="m11.90625 1.5875-7.14375 5.953125-3.9687502-0.396875 11.1125-5.55625-5.5562498 6.35 3.175 2.38125 2.3812498-8.7312499"
     fill="#bbcfec"
     id="path2" />
  <path
     d="m4.7625 7.540625v3.571875l1.5875002-3.175 5.5562498-6.35-7.1437501 5.953125"
     fill="#8fb0e0"
     id="path3" />
</svg>
