<?xml version="1.0" encoding="UTF-8" standalone="no"?>
<svg
   height="64"
   width="64"
   version="1.1"
   id="svg832"
   sodipodi:docname="Exit_02_64.svg"
   inkscape:export-filename="Exit_02_64.png"
   inkscape:export-xdpi="96"
   inkscape:export-ydpi="96"
   inkscape:version="1.2-beta (1b65182ce9, 2022-04-05)"
   xmlns:inkscape="http://www.inkscape.org/namespaces/inkscape"
   xmlns:sodipodi="http://sodipodi.sourceforge.net/DTD/sodipodi-0.dtd"
   xmlns="http://www.w3.org/2000/svg"
   xmlns:svg="http://www.w3.org/2000/svg">
  <defs
     id="defs836" />
  <sodipodi:namedview
     id="namedview834"
     pagecolor="#ffffff"
     bordercolor="#666666"
     borderopacity="1.0"
     inkscape:pageshadow="2"
     inkscape:pageopacity="0.0"
     inkscape:pagecheckerboard="0"
     inkscape:deskcolor="#d1d1d1"
     showgrid="true"
     inkscape:zoom="14.34375"
     inkscape:cx="32"
     inkscape:cy="32"
     inkscape:current-layer="svg832">
    <inkscape:grid
       type="xygrid"
       id="grid1540" />
  </sodipodi:namedview>
  <g
     fill="none"
     stroke="#00aad4"
     stroke-linecap="round"
     stroke-width="3"
     transform="matrix(1.9999922,0,0,2.0000009,3.0001129,-1.629125)"
     id="g830">
    <path
       d="m 14.5,2.594562 v 12"
       id="path826" />
    <path
       d="M 21.00003,5.564562 A 13.000057,12.996474 0 0 1 27.05709,20.183574 13.000057,12.996474 0 0 1 14.500002,29.816314 13.000057,12.996474 0 0 1 1.9429101,20.183574 13.000057,12.996474 0 0 1 7.9999719,5.564562"
       id="path828" />
  </g>
</svg>
