<?xml version="1.0" encoding="UTF-8" standalone="no"?>
<svg
   height="24"
   width="24"
   version="1.1"
   id="svg193"
   sodipodi:docname="Paste_01_24.svg"
   inkscape:export-filename="Paste_01_24.png"
   inkscape:export-xdpi="96"
   inkscape:export-ydpi="96"
   inkscape:version="1.2-beta (1b65182ce9, 2022-04-05)"
   xmlns:inkscape="http://www.inkscape.org/namespaces/inkscape"
   xmlns:sodipodi="http://sodipodi.sourceforge.net/DTD/sodipodi-0.dtd"
   xmlns="http://www.w3.org/2000/svg"
   xmlns:svg="http://www.w3.org/2000/svg">
  <defs
     id="defs197" />
  <sodipodi:namedview
     id="namedview195"
     pagecolor="#ffffff"
     bordercolor="#666666"
     borderopacity="1.0"
     inkscape:pageshadow="2"
     inkscape:pageopacity="0.0"
     inkscape:pagecheckerboard="0"
     inkscape:deskcolor="#d1d1d1"
     showgrid="true"
     inkscape:zoom="38.25"
     inkscape:cx="11.986928"
     inkscape:cy="12"
     inkscape:current-layer="svg193">
    <inkscape:grid
       type="xygrid"
       id="grid1518" />
  </sodipodi:namedview>
  <linearGradient
     id="a"
     gradientTransform="matrix(1.2974359 0 0 1.8017883 -1.446154 21.651623)"
     gradientUnits="userSpaceOnUse"
     x1="6.227273"
     x2="3.863637"
     y1="13.076924"
     y2="5.461539">
    <stop
       offset="0"
       stop-color="#e3ce49"
       id="stop147" />
    <stop
       offset="1"
       stop-color="#fceb84"
       id="stop149" />
  </linearGradient>
  <linearGradient
     id="b"
     gradientTransform="matrix(1.2974359 0 0 1.8017883 -1.446154 21.651623)"
     gradientUnits="userSpaceOnUse"
     x1="7.5"
     x2="7.5"
     y1="13.5"
     y2="2.5">
    <stop
       offset="0"
       stop-color="#aa8e1e"
       id="stop152" />
    <stop
       offset="1"
       stop-color="#ccaa24"
       id="stop154" />
  </linearGradient>
  <linearGradient
     id="c"
     gradientTransform="matrix(.63461541 0 0 .38636361 3.923079 -29.59091)"
     gradientUnits="userSpaceOnUse"
     x1="5.399997"
     x2="5.399997"
     y1="4.333334"
     y2="11.666667">
    <stop
       offset="0"
       stop-color="#fc0"
       id="stop157" />
    <stop
       offset="1"
       stop-color="#fff6d5"
       id="stop159" />
  </linearGradient>
  <linearGradient
     id="d"
     gradientTransform="matrix(.63461541 0 0 .38636361 3.923079 -29.59091)"
     gradientUnits="userSpaceOnUse"
     x1="7.999997"
     x2="7.999997"
     y1="13.500001"
     y2="2.5">
    <stop
       offset="0"
       stop-color="#744b18"
       id="stop162" />
    <stop
       offset="1"
       stop-color="#ca7f26"
       id="stop164" />
  </linearGradient>
  <linearGradient
     id="e"
     gradientTransform="matrix(.94358973 0 0 1.2473919 9.817948 30.660566)"
     gradientUnits="userSpaceOnUse"
     x1="3.666667"
     x2="3.666667"
     y1="3.722222"
     y2="12.277779">
    <stop
       offset="0"
       stop-color="#fff"
       id="stop167" />
    <stop
       offset="1"
       stop-color="#e0ebf4"
       id="stop169" />
  </linearGradient>
  <linearGradient
     id="f"
     gradientTransform="matrix(.94358973 0 0 1.2473919 9.817948 30.660566)"
     gradientUnits="userSpaceOnUse"
     x1="7.277778"
     x2="7.277778"
     y1="13.500001"
     y2="2.5">
    <stop
       offset="0"
       stop-color="#3a7ab7"
       id="stop172" />
    <stop
       offset="1"
       stop-color="#75a5d3"
       id="stop174" />
  </linearGradient>
  <g
     fill-rule="evenodd"
     transform="translate(0 -24)"
     id="g191">
    <g
       stroke-linecap="square"
       id="g183">
      <rect
         fill="url(#a)"
         height="19"
         rx="1"
         stroke="url(#b)"
         width="17"
         x=".5"
         y="26.5"
         id="rect177" />
      <rect
         fill="url(#c)"
         height="4.25"
         rx="1"
         stroke="url(#d)"
         stroke-width=".75"
         transform="scale(1 -1)"
         width="8.25"
         x="4.875"
         y="-28.625"
         id="rect179" />
      <path
         d="m11.5 33.5h9l3 3v11.000357l-12-.000357z"
         fill="url(#e)"
         stroke="url(#f)"
         id="path181" />
    </g>
    <path
       d="m14 39.5v1.500001h7v-1.500001z"
       fill="#95cbfb"
       id="path185" />
    <path
       d="m14 36.5v1.499999h6v-1.499999z"
       fill="#80c1fb"
       id="path187" />
    <path
       d="m14 42.5v1.5h7v-1.5z"
       fill="#a7d4fb"
       id="path189" />
  </g>
</svg>
