<?xml version="1.0" encoding="UTF-8" standalone="no"?>
<svg
   height="24"
   viewBox="0 0 6.3499998 6.3500003"
   width="24"
   version="1.1"
   id="svg131"
   sodipodi:docname="Secure_01_24.svg"
   inkscape:version="1.2 (dc2aedaf03, 2022-05-15)"
   inkscape:export-filename="Secure_01_24.png"
   inkscape:export-xdpi="96"
   inkscape:export-ydpi="96"
   xmlns:inkscape="http://www.inkscape.org/namespaces/inkscape"
   xmlns:sodipodi="http://sodipodi.sourceforge.net/DTD/sodipodi-0.dtd"
   xmlns="http://www.w3.org/2000/svg"
   xmlns:svg="http://www.w3.org/2000/svg">
  <defs
     id="defs135" />
  <sodipodi:namedview
     id="namedview133"
     pagecolor="#ffffff"
     bordercolor="#666666"
     borderopacity="1.0"
     inkscape:showpageshadow="2"
     inkscape:pageopacity="0.0"
     inkscape:pagecheckerboard="0"
     inkscape:deskcolor="#d1d1d1"
     showgrid="true"
     inkscape:zoom="38.25"
     inkscape:cx="10.117647"
     inkscape:cy="12"
     inkscape:current-layer="g4546">
    <inkscape:grid
       type="xygrid"
       id="grid1286" />
  </sodipodi:namedview>
  <g
     id="g4546"
     transform="matrix(1.5011399,0,0,1.4989016,-0.00241274,0.00232495)">
    <path
       style="fill:#00aad4;fill-opacity:1;stroke:#00aad4;stroke-width:0.264583;stroke-linecap:round;stroke-linejoin:bevel;stroke-dasharray:none;stroke-opacity:1"
       d="M 2.1166666,3.8378158 C 2.9097578,3.4406276 3.7028488,3.0434392 3.7028487,1.057498 c -0.660909,0 -1.1896365,-0.26479218 -1.5861821,-0.66198044"
       id="path1107" />
    <path
       style="fill:none;fill-opacity:1;stroke:#00aad4;stroke-width:0.264583;stroke-linecap:round;stroke-linejoin:bevel;stroke-dasharray:none;stroke-opacity:1"
       d="M 2.1166666,0.39551756 C 1.7201211,0.79270582 1.1913937,1.057498 0.5304846,1.057498 c 2e-8,1.9859412 0.7930911,2.3831296 1.586182,2.7803178"
       id="path2905" />
  </g>
</svg>
