<?xml version="1.0" encoding="UTF-8" standalone="no"?>
<svg
   height="32"
   width="32"
   version="1.1"
   id="svg291"
   sodipodi:docname="menu_goto_bookmark6_200.svg"
   inkscape:export-filename="menu_goto_bookmark6_200.png"
   inkscape:export-xdpi="96"
   inkscape:export-ydpi="96"
   inkscape:version="1.2.2 (732a01da63, 2022-12-09)"
   xmlns:inkscape="http://www.inkscape.org/namespaces/inkscape"
   xmlns:sodipodi="http://sodipodi.sourceforge.net/DTD/sodipodi-0.dtd"
   xmlns="http://www.w3.org/2000/svg"
   xmlns:svg="http://www.w3.org/2000/svg">
  <defs
     id="defs295" />
  <sodipodi:namedview
     id="namedview293"
     pagecolor="#ffffff"
     bordercolor="#666666"
     borderopacity="1.0"
     inkscape:showpageshadow="2"
     inkscape:pageopacity="0.0"
     inkscape:pagecheckerboard="0"
     inkscape:deskcolor="#d1d1d1"
     showgrid="true"
     inkscape:zoom="28.6875"
     inkscape:cx="15.982571"
     inkscape:cy="16"
     inkscape:current-layer="svg291">
    <inkscape:grid
       type="xygrid"
       id="grid1507" />
  </sodipodi:namedview>
  <radialGradient
     id="a"
     cx="17"
     cy="17.5"
     gradientUnits="userSpaceOnUse"
     r="12">
    <stop
       offset="0"
       stop-color="#2a7fff"
       id="stop278" />
    <stop
       offset=".69999999"
       stop-color="#4d94ff"
       id="stop280" />
    <stop
       offset="1"
       stop-color="#96bdff"
       id="stop282" />
  </radialGradient>
  <g
     transform="translate(-1 -2.5)"
     id="g289">
    <circle
       cx="17"
       cy="17.5"
       fill="url(#a)"
       r="12"
       id="circle285" />
    <path
       d="m16.802875 24.496929c-1.399333.05526-2.911892-.640003-3.469036-1.986387-.691907-1.549253-.483654-3.33951.02087-4.911278.489342-1.36096 1.241035-2.60477 1.863673-3.905811.566753-1.122746 1.133507-2.245491 1.70026-3.368237h2.122388c-1.193039 2.331411-2.386079 4.662821-3.579118 6.994232-.06231-.675744.651319-1.104256 1.226408-1.23718 1.281447-.264134 2.77074.264459 3.41408 1.450329.682373 1.214554.73878 2.69191.479647 4.03517-.230727 1.183501-1.030673 2.290812-2.205171 2.675601-.503106.181285-1.040554.256151-1.574001.253561zm0-1.890855c.90496.07346 1.794055-.637194 1.878987-1.550793.18653-.993482.04823-2.229628-.849487-2.845809-.885433-.593504-2.341304-.3291-2.711234.750078-.356169.886614-.365245 1.943364.0476 2.810924.327867.561696.99579.867012 1.634134.8356z"
       fill="#fff"
       stroke-width=".999999"
       transform="scale(1.0122713 .98787746)"
       id="path287" />
  </g>
</svg>
