<?xml version="1.0" encoding="UTF-8" standalone="no"?>
<svg
   width="16"
   height="16"
   version="1.1"
   viewBox="0 0 16 16"
   id="svg4"
   sodipodi:docname="dbnavedit.svg"
   inkscape:version="1.3.2 (091e20e, 2023-11-25, custom)"
   xmlns:inkscape="http://www.inkscape.org/namespaces/inkscape"
   xmlns:sodipodi="http://sodipodi.sourceforge.net/DTD/sodipodi-0.dtd"
   xmlns="http://www.w3.org/2000/svg"
   xmlns:svg="http://www.w3.org/2000/svg">
  <defs
     id="defs4" />
  <sodipodi:namedview
     id="namedview4"
     pagecolor="#ffffff"
     bordercolor="#000000"
     borderopacity="0.25"
     inkscape:showpageshadow="2"
     inkscape:pageopacity="0.0"
     inkscape:pagecheckerboard="0"
     inkscape:deskcolor="#d1d1d1"
     showgrid="true"
     inkscape:current-layer="svg4">
    <inkscape:grid
       id="grid4"
       units="px"
       originx="0"
       originy="0"
       spacingx="0.5"
       spacingy="0.5"
       empcolor="#0099e5"
       empopacity="0.30196078"
       color="#0099e5"
       opacity="0.14901961"
       empspacing="2"
       dotted="false"
       gridanglex="30"
       gridanglez="30"
       visible="true" />
  </sodipodi:namedview>
  <path
     d="M 10.692389,2.4791846 13.520815,5.3076118 6.0961941,12.732233 1.5,14.5 3.267767,9.9038056 Z"
     fill="#ffefb3"
     stroke="#c29c00"
     stroke-linejoin="round"
     id="path1" />
  <path
     d="M 6.0961941,12.732233 C 5.3890873,11.31802 4.6819805,10.610913 3.267767,9.9038056 L 1.5,14.5 Z"
     fill="#c29c00"
     id="path2" />
  <path
     d="m1.5 14.5 0.5892557-1.532064 0.942809 0.942809z"
     fill="#2a7fff"
     stroke="#2a7fff"
     stroke-linejoin="round"
     id="path3" />
  <path
     d="m13.520815 1.0649711 1.414214 1.4142135c0.390523 0.3905243 0.390523 1.0236893 0 1.4142136l-1.414214 1.4142136-2.828426-2.8284272 1.414213-1.4142135c0.390523-0.39052429 1.023689-0.39052429 1.414213 0z"
     fill="#ff9999"
     stroke="#fa0302"
     id="path4" />
</svg>
