<?xml version="1.0" encoding="UTF-8" standalone="no"?>
<svg
   width="48"
   height="48"
   version="1.1"
   viewBox="0 0 48 48"
   id="svg37"
   sodipodi:docname="Grid_18_48.svg"
   inkscape:export-filename="Grid_18_48.png"
   inkscape:export-xdpi="96"
   inkscape:export-ydpi="96"
   inkscape:version="1.3.2 (091e20e, 2023-11-25, custom)"
   xmlns:inkscape="http://www.inkscape.org/namespaces/inkscape"
   xmlns:sodipodi="http://sodipodi.sourceforge.net/DTD/sodipodi-0.dtd"
   xmlns="http://www.w3.org/2000/svg"
   xmlns:svg="http://www.w3.org/2000/svg">
  <sodipodi:namedview
     id="namedview37"
     pagecolor="#ffffff"
     bordercolor="#000000"
     borderopacity="0.25"
     inkscape:showpageshadow="2"
     inkscape:pageopacity="0.0"
     inkscape:pagecheckerboard="0"
     inkscape:deskcolor="#d1d1d1"
     showgrid="true"
     inkscape:current-layer="svg37">
    <inkscape:grid
       id="grid37"
       units="px"
       originx="0"
       originy="0"
       spacingx="0.5"
       spacingy="0.5"
       empcolor="#0099e5"
       empopacity="0.30196078"
       color="#0099e5"
       opacity="0.14901961"
       empspacing="2"
       dotted="false"
       gridanglex="30"
       gridanglez="30"
       visible="true" />
  </sodipodi:namedview>
  <defs
     id="defs24">
    <linearGradient
       id="d"
       x1="1.5"
       x2="3.5"
       y1="15.5"
       y2="13.5"
       gradientTransform="matrix(2.9999999,0,0,2.9999999,23.999999,-12)"
       gradientUnits="userSpaceOnUse">
      <stop
         stop-color="#55ffdd"
         offset="0"
         id="stop1" />
      <stop
         stop-color="#8787de"
         offset="1"
         id="stop2" />
    </linearGradient>
    <linearGradient
       id="e"
       x1="1.5"
       x2="3.5"
       y1="15.5"
       y2="13.5"
       gradientTransform="matrix(2.9999999,0,0,2.9999999,23.999999,-23.999996)"
       gradientUnits="userSpaceOnUse">
      <stop
         stop-color="#d42aff"
         offset="0"
         id="stop3" />
      <stop
         stop-color="#00aad4"
         offset="1"
         id="stop4" />
    </linearGradient>
    <linearGradient
       id="j"
       x1="5.5"
       x2="7.5"
       y1="11.5"
       y2="9.5"
       gradientTransform="matrix(2.9999999,0,0,2.9999999,2.6e-5,-5e-7)"
       gradientUnits="userSpaceOnUse">
      <stop
         stop-color="#ffcc00"
         offset="0"
         id="stop5" />
      <stop
         stop-color="#aaaaff"
         offset="1"
         id="stop6" />
    </linearGradient>
    <linearGradient
       id="c"
       x1="5.5"
       x2="7.5"
       y1="3.5"
       y2="1.5"
       gradientTransform="matrix(2.9999999,0,0,2.9999999,2.6e-5,-5e-7)"
       gradientUnits="userSpaceOnUse">
      <stop
         stop-color="#aaccff"
         offset="0"
         id="stop7" />
      <stop
         stop-color="#ffc9c9"
         offset="1"
         id="stop8" />
    </linearGradient>
    <linearGradient
       id="l"
       x1="5.5"
       x2="7.5"
       y1="5.5"
       y2="7.5"
       gradientTransform="matrix(2.9999999,0,0,2.9999999,2.6e-5,-5e-7)"
       gradientUnits="userSpaceOnUse">
      <stop
         stop-color="#d45500"
         offset="0"
         id="stop9" />
      <stop
         stop-color="#aaffaa"
         offset="1"
         id="stop10" />
    </linearGradient>
    <linearGradient
       id="k"
       x1="1.5"
       x2="3.5"
       y1="11.5"
       y2="9.5"
       gradientTransform="matrix(2.9999999,0,0,2.9999999,2.6e-5,-5e-7)"
       gradientUnits="userSpaceOnUse">
      <stop
         stop-color="#6868ff"
         offset="0"
         id="stop11" />
      <stop
         stop-color="#aaccff"
         offset="1"
         id="stop12" />
    </linearGradient>
    <linearGradient
       id="h"
       x1="5.5"
       x2="7.5"
       y1="15.5"
       y2="13.5"
       gradientTransform="matrix(2.9999999,0,0,2.9999999,2.6e-5,-5e-7)"
       gradientUnits="userSpaceOnUse">
      <stop
         stop-color="#00d400"
         offset="0"
         id="stop13" />
      <stop
         stop-color="#ffc9c9"
         offset="1"
         id="stop14" />
    </linearGradient>
    <linearGradient
       id="b"
       x1="11.5"
       x2="9.5"
       y1="3.5"
       y2="1.5"
       gradientTransform="matrix(2.9999999,0,0,2.9999999,2.6e-5,-5e-7)"
       gradientUnits="userSpaceOnUse">
      <stop
         stop-color="#ff0000"
         offset="0"
         id="stop15" />
      <stop
         stop-color="#ffff51"
         offset="1"
         id="stop16" />
    </linearGradient>
    <linearGradient
       id="a"
       x1="2.5"
       x2="3"
       y1="7"
       y2="5.5"
       gradientTransform="matrix(2.9999999,0,0,2.9999999,2.6e-5,-5e-7)"
       gradientUnits="userSpaceOnUse">
      <stop
         stop-color="#efef00"
         offset="0"
         id="stop17" />
      <stop
         stop-color="#00ff00"
         offset="1"
         id="stop18" />
    </linearGradient>
    <linearGradient
       id="g"
       x1="3"
       x2="1.5"
       y1="3.5"
       y2="1.5"
       gradientTransform="matrix(2.9999999,0,0,2.9999999,2.6e-5,-5e-7)"
       gradientUnits="userSpaceOnUse">
      <stop
         stop-color="#0000ff"
         offset="0"
         id="stop19" />
      <stop
         stop-color="#ff7171"
         offset="1"
         id="stop20" />
    </linearGradient>
    <linearGradient
       id="i"
       x1="1.5"
       x2="3.5"
       y1="15.5"
       y2="13.5"
       gradientTransform="matrix(2.9999999,0,0,2.9999999,2.6e-5,-5e-7)"
       gradientUnits="userSpaceOnUse">
      <stop
         stop-color="#008000"
         offset="0"
         id="stop21" />
      <stop
         stop-color="#6868ff"
         offset="1"
         id="stop22" />
    </linearGradient>
    <linearGradient
       id="f"
       x1="42.468754"
       x2="26.531254"
       y1="42.46875"
       y2="26.53125"
       gradientUnits="userSpaceOnUse">
      <stop
         stop-color="#009600"
         offset="0"
         id="stop23" />
      <stop
         stop-color="#6edb39"
         offset="1"
         id="stop24" />
    </linearGradient>
  </defs>
  <path
     d="m3.000026 47.999995v-8.999999h9.000049v8.999999z"
     fill="url(#i)"
     fill-rule="evenodd"
     stroke-width=".999999"
     id="path24" />
  <path
     d="m3.000026 11.999997v-8.999997h9.000049v8.999997z"
     fill="url(#g)"
     fill-rule="evenodd"
     stroke-width=".999999"
     id="path25" />
  <path
     d="m3.000026 23.999997v-9.000001h9.000049v9.000001z"
     fill="url(#a)"
     fill-rule="evenodd"
     stroke-width=".999999"
     id="path26" />
  <path
     d="m27.000025 3v8.999999l8.999998-2e-6v-8.999997z"
     fill="url(#b)"
     fill-rule="evenodd"
     stroke-width=".999999"
     id="path27" />
  <path
     d="M 24,44.771484 A 14.7,14.7 0 0 1 20.509766,39 H 15 v 9 h 9 z"
     fill="url(#h)"
     fill-rule="evenodd"
     stroke-width=".999999"
     id="path28" />
  <path
     d="m3 35.999999v-8.999997h9.000051v8.999997z"
     fill="url(#k)"
     fill-rule="evenodd"
     stroke-width=".999999"
     id="path29" />
  <path
     d="m15 15v9h9v-9z"
     fill="url(#l)"
     fill-rule="evenodd"
     stroke-width=".999999"
     id="path30" />
  <path
     d="m15 11.999999v-8.999999h9.000047v8.999999z"
     fill="url(#c)"
     fill-rule="evenodd"
     stroke-width=".999999"
     id="path31" />
  <path
     d="m19.917969 36a14.7 14.7 0 0 1-0.117188-1.5 14.7 14.7 0 0 1 2.107422-7.5h-6.908203v9z"
     fill="url(#j)"
     fill-rule="evenodd"
     stroke-width=".999999"
     id="path32" />
  <path
     d="m27 15v6.908203a14.7 14.7 0 0 1 7.5-2.107422 14.7 14.7 0 0 1 1.5 0.07813v-4.878911z"
     fill="url(#e)"
     fill-rule="evenodd"
     stroke-width=".999999"
     id="path33" />
  <g
     stroke-linecap="round"
     id="g37">
    <circle
       transform="matrix(0,1,1,0,0,0)"
       cx="34.5"
       cy="34.5"
       r="12.75"
       fill="url(#f)"
       stroke="#90e467"
       stroke-dashoffset="1.49998"
       stroke-linejoin="round"
       stroke-width="1.5"
       id="circle34" />
    <g
       fill="none"
       stroke="#ffffff"
       stroke-width="2.4"
       id="g36">
      <path
         d="m34.3 27.8v13"
         id="path35" />
      <path
         d="m40.8 34.3h-13"
         id="path36" />
    </g>
  </g>
</svg>
