<?xml version="1.0" encoding="UTF-8" standalone="no"?>
<svg
   height="32"
   viewBox="0 0 8.4666664 8.4666671"
   width="32"
   version="1.1"
   id="svg314"
   sodipodi:docname="Font_12_32.svg"
   inkscape:export-filename="Font_12_32.png"
   inkscape:export-xdpi="96"
   inkscape:export-ydpi="96"
   inkscape:version="1.2 (dc2aedaf03, 2022-05-15)"
   xmlns:inkscape="http://www.inkscape.org/namespaces/inkscape"
   xmlns:sodipodi="http://sodipodi.sourceforge.net/DTD/sodipodi-0.dtd"
   xmlns="http://www.w3.org/2000/svg"
   xmlns:svg="http://www.w3.org/2000/svg">
  <defs
     id="defs318">
    <filter
       inkscape:collect="always"
       style="color-interpolation-filters:sRGB"
       id="filter3702"
       x="-0.077495504"
       y="-0.072660197"
       width="1.154991"
       height="1.1453204">
      <feGaussianBlur
         inkscape:collect="always"
         stdDeviation="0.25632904"
         id="feGaussianBlur3704" />
    </filter>
  </defs>
  <sodipodi:namedview
     id="namedview316"
     pagecolor="#ffffff"
     bordercolor="#666666"
     borderopacity="1.0"
     inkscape:showpageshadow="2"
     inkscape:pageopacity="0.0"
     inkscape:pagecheckerboard="0"
     inkscape:deskcolor="#d1d1d1"
     showgrid="true"
     inkscape:zoom="28.6875"
     inkscape:cx="13.786492"
     inkscape:cy="16"
     inkscape:current-layer="svg314">
    <inkscape:grid
       type="xygrid"
       id="grid1239" />
  </sodipodi:namedview>
  <g
     id="g3708">
    <path
       id="path3335"
       style="fill:#ffffff;stroke:none;filter:url(#filter3702)"
       d="M 3.4395834,0 A 0.5293498,0.5293498 0 0 0 2.9414226,0.35139974 L 0.29507243,7.7597331 A 0.5293498,0.5293498 0 0 0 0.79271648,8.4666667 H 1.964738 A 0.5293498,0.5293498 0 0 0 2.4628988,8.115267 L 3.093868,6.3494833 H 5.3727987 L 6.003768,8.115267 A 0.5293498,0.5293498 0 0 0 6.5019288,8.4666667 H 7.6739503 A 0.5293498,0.5293498 0 0 0 8.1721111,7.7597331 L 5.5252442,0.35139974 A 0.5293498,0.5293498 0 0 0 5.0276001,0 Z M 4.2322998,3.1600139 4.6172893,4.2322998 H 3.8493775 Z" />
    <path
       d="M 3.4395835,0.52916667 0.79375007,7.9375001 H 1.9654765 L 2.7214289,5.8208335 h 3.0238094 l 0.7559524,2.1166666 h 1.171726 L 5.0270835,0.52916667 Z m 0.79375,1.05833343 1.1339286,3.175 H 3.0994049 Z"
       stroke="#ffffff"
       stroke-width="0.198438"
       id="path723"
       sodipodi:nodetypes="ccccccccccccc"
       style="stroke:none" />
  </g>
  <g
     id="g3715"
     transform="scale(0.26458334)">
    <path
       d="m 24.438473,12.000716 c -0.546627,-0.0167 -1.078431,0.259453 -1.371641,0.754029 l -0.918438,1.548167 -0.300799,-0.004 -0.914427,-1.540145 C 20.542009,12.100983 19.727163,11.828309 19.020089,12.12104 l -1.897035,0.786115 c -0.706961,0.293004 -1.090903,1.059131 -0.902396,1.800848 l 0.441171,1.740685 -0.212564,0.212572 -1.740621,-0.445198 c -0.742714,-0.18984 -1.511938,0.193955 -1.804791,0.902429 l -0.786087,1.897106 c -0.293869,0.708053 -0.02172,1.5262 0.637693,1.917161 l 1.54811,0.918472 -0.004,0.30081 -1.544099,0.914461 c -0.657748,0.391174 -0.926402,1.206049 -0.633682,1.91315 l 0.786087,1.897106 c 0.292992,0.706987 1.059091,1.090943 1.80078,0.902429 l 1.740621,-0.441188 0.212564,0.212573 -0.445182,1.740685 c -0.189833,0.742741 0.193949,1.511994 0.902396,1.804858 l 1.897036,0.786116 c 0.708026,0.293879 1.526143,0.02172 1.917089,-0.637717 l 0.918438,-1.548167 0.300799,0.004 0.914427,1.544157 c 0.39116,0.657763 1.206005,0.926427 1.913079,0.633696 l 1.897036,-0.786116 c 0.706961,-0.293003 1.090902,-1.05913 0.902395,-1.800847 l -0.441171,-1.740685 0.212564,-0.212573 1.740621,0.445199 c 0.742714,0.18984 1.511938,-0.193956 1.804791,-0.90243 l 0.786087,-1.897106 c 0.29387,-0.708052 0.02172,-1.526199 -0.637693,-1.91716 l -1.548109,-0.918472 0.004,-0.296799 1.544099,-0.918472 c 0.657748,-0.391175 0.926403,-1.20605 0.633682,-1.91315 l -0.786086,-1.897106 c -0.292993,-0.706987 -1.059091,-1.090943 -1.800781,-0.902429 l -1.740621,0.441187 -0.212564,-0.212572 0.445182,-1.740685 c 0.189833,-0.742742 -0.193948,-1.511995 -0.902396,-1.804858 l -1.897036,-0.786116 c -0.177006,-0.07347 -0.363238,-0.110748 -0.545448,-0.116313 z M 22,20.459484 A 1.5400884,1.5401455 0 0 1 23.540089,21.999629 1.5400884,1.5401455 0 0 1 22,23.539775 1.5400884,1.5401455 0 0 1 20.459912,21.999629 1.5400884,1.5401455 0 0 1 22,20.459484 Z"
       fill="#ffffff"
       id="path403"
       style="stroke:none;stroke-width:0.499999" />
    <path
       d="m 17.711687,14.329404 0.65943,2.587732 -1.451811,1.452267 -2.591047,-0.658873 -0.785738,1.897009 2.298024,1.366322 -2.85e-4,2.053531 -2.296022,1.363498 0.785821,1.897212 2.587636,-0.659455 1.452214,1.451864 -0.658849,2.591144 1.896938,0.785767 1.366271,-2.298109 2.053456,2.85e-4 1.363447,2.296107 1.897141,-0.78585 -0.659429,-2.587732 1.45181,-1.452268 2.591048,0.658874 0.785737,-1.897009 -2.298024,-1.366322 2.86e-4,-2.053531 2.296021,-1.363498 -0.785821,-1.897212 -2.587636,0.659454 -1.452213,-1.451864 0.658849,-2.591144 -1.896939,-0.785767 -1.366271,2.298109 -2.053455,-2.85e-4 -1.363448,-2.296107 z m 3.109581,4.824407 a 3.0801768,3.0802911 0 0 1 4.024444,1.667042 3.0801768,3.0802911 0 0 1 -1.666979,4.024594 3.0801768,3.0802911 0 0 1 -4.024445,-1.667041 3.0801768,3.0802911 0 0 1 1.66698,-4.024595 z"
       fill="#2c5aa0"
       id="path405"
       style="fill:#3771c8;fill-opacity:0.996078;stroke:none;stroke-width:0.499999" />
  </g>
</svg>
