<?xml version="1.0" encoding="UTF-8" standalone="no"?>
<svg
   width="24"
   height="24"
   version="1.1"
   viewBox="0 0 24 24"
   id="svg7"
   sodipodi:docname="ttaskdialog.svg"
   inkscape:export-filename="ttaskdialog.png"
   inkscape:export-xdpi="96"
   inkscape:export-ydpi="96"
   inkscape:version="1.3.2 (091e20e, 2023-11-25, custom)"
   xmlns:inkscape="http://www.inkscape.org/namespaces/inkscape"
   xmlns:sodipodi="http://sodipodi.sourceforge.net/DTD/sodipodi-0.dtd"
   xmlns="http://www.w3.org/2000/svg"
   xmlns:svg="http://www.w3.org/2000/svg">
  <defs
     id="defs7" />
  <sodipodi:namedview
     id="namedview7"
     pagecolor="#ffffff"
     bordercolor="#000000"
     borderopacity="0.25"
     inkscape:showpageshadow="2"
     inkscape:pageopacity="0.0"
     inkscape:pagecheckerboard="0"
     inkscape:deskcolor="#d1d1d1"
     showgrid="true"
     inkscape:current-layer="svg7">
    <inkscape:grid
       id="grid7"
       units="px"
       originx="0"
       originy="0"
       spacingx="0.5"
       spacingy="0.5"
       empcolor="#0099e5"
       empopacity="0.30196078"
       color="#0099e5"
       opacity="0.14901961"
       empspacing="2"
       dotted="false"
       gridanglex="30"
       gridanglez="30"
       visible="true" />
  </sodipodi:namedview>
  <rect
     x="1.25"
     y="4.2499828"
     width="21.5"
     height="18.5"
     fill="#f9f9f9"
     stroke="#2a7efe"
     stroke-width="0.5"
     style="paint-order:normal"
     id="rect1" />
  <path
     d="m 2.5,1 h 19 C 22.35,1 23,1.6 23,2.5 V 4 H 1 V 2.5 C 1,1.6 1.6,1 2.5,1 Z"
     fill="#2a7efe"
     id="path1" />
  <rect
     x="1.5"
     y="15.499983"
     width="21"
     height="7"
     fill="#e6e6e6"
     fill-rule="evenodd"
     style="paint-order:normal"
     id="rect2" />
  <rect
     x="9.25"
     y="18.249983"
     width="4.5"
     height="2.5000174"
     fill="#cccccc"
     fill-rule="evenodd"
     stroke="#999999"
     stroke-linecap="round"
     stroke-linejoin="round"
     stroke-width="0.5"
     style="paint-order:normal"
     id="rect3" />
  <rect
     x="15.25"
     y="18.249983"
     width="5.5"
     height="2.5000174"
     fill="#cccccc"
     fill-rule="evenodd"
     stroke="#999999"
     stroke-linecap="round"
     stroke-linejoin="round"
     stroke-width="0.5"
     style="paint-order:normal"
     id="rect4" />
  <path
     d="M 6.5,8 4,12.5 h 5 z"
     fill="#ffdd55"
     fill-rule="evenodd"
     stroke="#ff0000"
     stroke-linejoin="round"
     stroke-width="1px"
     id="path4" />
  <ellipse
     cx="5"
     cy="19.499983"
     rx="1.25"
     ry="1.2500054"
     fill="#808080"
     fill-rule="evenodd"
     style="paint-order:normal"
     id="ellipse4" />
  <path
     d="m 11,8.5 h 7"
     fill="none"
     stroke="#b3b3b3"
     id="path5" />
  <path
     d="m 11,12.5 h 7.5"
     fill="none"
     stroke="#b3b3b3"
     id="path6" />
  <path
     d="m 11,10.5 h 8.5"
     fill="none"
     stroke="#b3b3b3"
     id="path7" />
</svg>
