<?xml version="1.0" encoding="UTF-8" standalone="no"?>
<svg
   height="36"
   width="36"
   version="1.1"
   id="svg405"
   sodipodi:docname="Cloud_10_36.svg"
   inkscape:export-filename="Cloud_10_36.png"
   inkscape:export-xdpi="96"
   inkscape:export-ydpi="96"
   inkscape:version="1.2.1 (9c6d41e410, 2022-07-14)"
   xmlns:inkscape="http://www.inkscape.org/namespaces/inkscape"
   xmlns:sodipodi="http://sodipodi.sourceforge.net/DTD/sodipodi-0.dtd"
   xmlns="http://www.w3.org/2000/svg"
   xmlns:svg="http://www.w3.org/2000/svg">
  <defs
     id="defs409" />
  <sodipodi:namedview
     id="namedview407"
     pagecolor="#ffffff"
     bordercolor="#666666"
     borderopacity="1.0"
     inkscape:showpageshadow="2"
     inkscape:pageopacity="0.0"
     inkscape:pagecheckerboard="0"
     inkscape:deskcolor="#d1d1d1"
     showgrid="true"
     inkscape:zoom="25.5"
     inkscape:cx="17.392157"
     inkscape:cy="18"
     inkscape:current-layer="svg405">
    <inkscape:grid
       type="xygrid"
       id="grid808" />
  </sodipodi:namedview>
  <linearGradient
     id="a"
     gradientTransform="matrix(1.0000001 0 0 .96627924 -.000186 -.239407)"
     gradientUnits="userSpaceOnUse"
     x1="7.5"
     x2="9"
     y1="2"
     y2="13">
    <stop
       offset="0"
       stop-color="#5ab4f2"
       id="stop398" />
    <stop
       offset="1"
       stop-color="#0090ff"
       id="stop400" />
  </linearGradient>
  <path
     d="m3.291641 12.322221c-4.3402418 0-4.3402418-5.8903505-.2858607-5.8903505-.5693968-6.06642815 9.1223567-5.70499845 9.1223567-1.4725879 4.918074-.3594727 5.574822 7.3629384-.506797 7.3629384z"
     fill="url(#a)"
     transform="matrix(2.2499999 0 0 2.2499999 .000418 .5)"
     id="path403" />
  <g
     id="g4890"
     transform="matrix(9.0634555,0,0,8.9093282,-18.266765,-17.930655)"
     style="stroke-width:0.420599">
    <path
       style="fill:#ff5555;fill-opacity:1;stroke:#ffffff;stroke-width:0.200309;stroke-linecap:round;stroke-linejoin:bevel;stroke-dasharray:none;stroke-opacity:1"
       d="M 4.4979167,5.9531251 C 5.159375,5.8208334 5.55625,5.2916668 5.55625,3.9687501 c -0.396875,0 -0.8120771,-0.149785 -1.0583333,-0.3968753"
       id="path1107"
       sodipodi:nodetypes="ccc" />
    <path
       style="fill:#ffdd55;fill-opacity:1;stroke:#ffffff;stroke-width:0.200309;stroke-linecap:round;stroke-linejoin:bevel;stroke-dasharray:none;stroke-opacity:1"
       d="m 4.4979167,3.5718751 c -0.2645833,0.2645837 -0.6614583,0.396875 -1.0583333,0.396875 0,1.3229167 0.3905853,1.8571829 1.0583333,1.984375"
       id="path2905"
       sodipodi:nodetypes="ccc" />
  </g>
</svg>
