<?xml version="1.0" encoding="UTF-8" standalone="no"?>
<svg
   width="16"
   height="16"
   version="1.1"
   id="svg143"
   sodipodi:docname="menu_jumpto_section.svg"
   inkscape:export-filename="menu_jumpto_section.png"
   inkscape:export-xdpi="96"
   inkscape:export-ydpi="96"
   inkscape:version="1.2.2 (732a01da63, 2022-12-09)"
   xmlns:inkscape="http://www.inkscape.org/namespaces/inkscape"
   xmlns:sodipodi="http://sodipodi.sourceforge.net/DTD/sodipodi-0.dtd"
   xmlns="http://www.w3.org/2000/svg"
   xmlns:svg="http://www.w3.org/2000/svg">
  <defs
     id="defs147" />
  <sodipodi:namedview
     id="namedview145"
     pagecolor="#ffffff"
     bordercolor="#666666"
     borderopacity="1.0"
     inkscape:showpageshadow="2"
     inkscape:pageopacity="0.0"
     inkscape:pagecheckerboard="0"
     inkscape:deskcolor="#d1d1d1"
     showgrid="true"
     inkscape:zoom="57.375"
     inkscape:cx="7.9912854"
     inkscape:cy="8"
     inkscape:current-layer="svg143">
    <inkscape:grid
       type="xygrid"
       id="grid508" />
  </sodipodi:namedview>
  <path
     d="m14.5 0.5v14h-10v-14z"
     fill="#fff"
     stroke="#d4aa00"
     stroke-linecap="round"
     stroke-linejoin="round"
     stroke-miterlimit="5.6"
     id="path137" />
  <path
     d="m1 1.5 3 2-3 2z"
     fill="#f00"
     id="path139" />
  <path
     d="m1 6.5 3 2-3 2z"
     fill="#2a7fff"
     id="path141" />
</svg>
