<?xml version="1.0" encoding="UTF-8" standalone="no"?>
<svg
   height="32"
   width="32"
   version="1.1"
   id="svg1103"
   sodipodi:docname="menu_goto_bookmark5_200.svg"
   inkscape:export-filename="menu_goto_bookmark5_200.png"
   inkscape:export-xdpi="96"
   inkscape:export-ydpi="96"
   inkscape:version="1.2.2 (732a01da63, 2022-12-09)"
   xmlns:inkscape="http://www.inkscape.org/namespaces/inkscape"
   xmlns:sodipodi="http://sodipodi.sourceforge.net/DTD/sodipodi-0.dtd"
   xmlns="http://www.w3.org/2000/svg"
   xmlns:svg="http://www.w3.org/2000/svg">
  <defs
     id="defs1107" />
  <sodipodi:namedview
     id="namedview1105"
     pagecolor="#ffffff"
     bordercolor="#666666"
     borderopacity="1.0"
     inkscape:showpageshadow="2"
     inkscape:pageopacity="0.0"
     inkscape:pagecheckerboard="0"
     inkscape:deskcolor="#d1d1d1"
     showgrid="true"
     inkscape:zoom="28.6875"
     inkscape:cx="15.982571"
     inkscape:cy="16"
     inkscape:current-layer="svg1103">
    <inkscape:grid
       type="xygrid"
       id="grid1226" />
  </sodipodi:namedview>
  <radialGradient
     id="a"
     cx="17"
     cy="17.5"
     gradientUnits="userSpaceOnUse"
     r="12">
    <stop
       offset="0"
       stop-color="#2a7fff"
       id="stop1090" />
    <stop
       offset=".69999999"
       stop-color="#4d94ff"
       id="stop1092" />
    <stop
       offset="1"
       stop-color="#96bdff"
       id="stop1094" />
  </radialGradient>
  <g
     transform="translate(-1 -2.5)"
     id="g1101">
    <circle
       cx="17"
       cy="17.5"
       fill="url(#a)"
       r="12"
       id="circle1097" />
    <path
       d="m16.805603 24.800609c-1.377416.04444-2.792226-.665933-3.411686-1.928576-.261469-.498725-.422651-1.046613-.505084-1.602258.652762.0064 1.331287-.01287 1.968032.0096.06579.81783.732608 1.530908 1.558026 1.60385.800734.145196 1.724862-.170954 2.075357-.950854.421283-.858403.262681-1.830464.290999-2.75168.01146-.919694-.449111-1.983728-1.427147-2.199679-.922913-.268309-1.870917.266653-2.362174 1.037604-.598127 0-1.196255 0-1.794382 0 0-2.463256 0-4.926512 0-7.389768h7.148587v1.87156c-1.726852 0-3.453703 0-5.180555 0v3.15464c1.001499-.835908 2.47013-.756403 3.60007-.242989 1.301758.594616 1.905468 2.057082 1.969728 3.41274.01111.953114.07092 1.916777-.08581 2.861483-.200489 1.270382-1.039461 2.481924-2.301502 2.877217-.4947.170834-1.020653.237154-1.542462.23711z"
       fill="#fff"
       stroke-width=".999999"
       transform="scale(1.0122713 .98787748)"
       id="path1099" />
  </g>
</svg>
