<svg width="32" height="32" version="1.1" viewBox="0 0 32 32" xmlns="http://www.w3.org/2000/svg">
 <defs>
  <linearGradient id="c" x1="22.825163" x2="22.822721" y1="6.2446866" y2="15.028725" gradientTransform="matrix(1.8209021 .00050572277 .00050579348 1.8214858 -24.065544 .61384909)" gradientUnits="userSpaceOnUse">
   <stop stop-color="#89a02c" offset="0"/>
   <stop stop-color="#445016" offset="1"/>
  </linearGradient>
  <linearGradient id="b" x1="-3" x2="-3" y1="28" y2="4" gradientTransform="translate(19,1)" gradientUnits="userSpaceOnUse">
   <stop stop-color="#668000" offset="0"/>
   <stop stop-color="#aad400" offset="1"/>
  </linearGradient>
  <radialGradient id="a" cx="-9" cy="10.699678" r="5.9492188" gradientTransform="matrix(1 0 0 .7143795 25 3.3563691)" gradientUnits="userSpaceOnUse">
   <stop stop-color="#803300" offset="0"/>
   <stop stop-color="#d45500" offset="1"/>
  </radialGradient>
 </defs>
 <path d="m18 7.5 2.5-5" fill="none" stroke="#d4aa00" stroke-linecap="round" stroke-linejoin="round" stroke-width="2"/>
 <path d="m14 7.5-2.5-5" fill="none" stroke="#d4aa00" stroke-linecap="round" stroke-linejoin="round" stroke-width="2"/>
 <path d="m6 8v3l3 3" fill="none" stroke="#aca793" stroke-linecap="round" stroke-linejoin="round" stroke-width="2"/>
 <path d="m6 28v-3l3-3" fill="none" stroke="#aca793" stroke-linecap="round" stroke-linejoin="round" stroke-width="2"/>
 <path d="m2.5 20 2-2 5.5-1" fill="none" stroke="#aca793" stroke-linecap="round" stroke-linejoin="round" stroke-width="2"/>
 <path d="m26 8v3l-3 3" fill="none" stroke="#aca793" stroke-linecap="round" stroke-linejoin="round" stroke-width="2"/>
 <path d="m26 28v-3l-3-3" fill="none" stroke="#aca793" stroke-linecap="round" stroke-linejoin="round" stroke-width="2"/>
 <path d="m29.5 20-2.5-2-5-1" fill="none" stroke="#aca793" stroke-linecap="round" stroke-linejoin="round" stroke-width="2"/>
 <ellipse cx="16" cy="17" rx="9" ry="12" fill="url(#b)"/>
 <path d="M 21.949219,8 A 9,12 0 0 0 16,5 9,12 0 0 0 10.050781,8.0039062 L 16,13.5 21.945313,8 Z" fill="url(#a)" stroke-linecap="round" stroke-linejoin="round" stroke-width="2.40001"/>
 <path d="m16 13v15" fill="#c83737" stroke="url(#c)" stroke-linecap="round" stroke-linejoin="round" stroke-width="2"/>
</svg>
