<?xml version="1.0" encoding="UTF-8" standalone="no"?>
<svg
   width="32"
   height="32"
   version="1.1"
   viewBox="0 0 32 32"
   id="svg6"
   sodipodi:docname="tag_td_200.svg"
   inkscape:export-filename="tag_td_200.png"
   inkscape:export-xdpi="96"
   inkscape:export-ydpi="96"
   inkscape:version="1.3.2 (091e20e, 2023-11-25, custom)"
   xml:space="preserve"
   xmlns:inkscape="http://www.inkscape.org/namespaces/inkscape"
   xmlns:sodipodi="http://sodipodi.sourceforge.net/DTD/sodipodi-0.dtd"
   xmlns="http://www.w3.org/2000/svg"
   xmlns:svg="http://www.w3.org/2000/svg"><defs
     id="defs6" /><sodipodi:namedview
     id="namedview6"
     pagecolor="#ffffff"
     bordercolor="#000000"
     borderopacity="0.25"
     inkscape:showpageshadow="2"
     inkscape:pageopacity="0.0"
     inkscape:pagecheckerboard="0"
     inkscape:deskcolor="#d1d1d1"
     showgrid="true"
     inkscape:current-layer="svg6"><inkscape:grid
       id="grid6"
       units="px"
       originx="0"
       originy="0"
       spacingx="0.5"
       spacingy="0.5"
       empcolor="#0099e5"
       empopacity="0.30196078"
       color="#0099e5"
       opacity="0.14901961"
       empspacing="2"
       dotted="false"
       gridanglex="30"
       gridanglez="30"
       visible="true" /></sodipodi:namedview><rect
     x=".5"
     y="1.5"
     width="31"
     height="28"
     fill="#ffffff"
     fill-opacity=".917647"
     stroke="#b3b3b3"
     stroke-linecap="round"
     stroke-linejoin="round"
     stroke-width="1"
     id="rect1" /><rect
     style="fill:#00d400;fill-opacity:1;stroke:none;stroke-width:1;stroke-linecap:round;stroke-linejoin:round"
     id="rect2"
     width="7"
     height="5"
     x="16"
     y="18" /><path
     d="m1 11.5h30"
     fill="#008dd2"
     stroke="#cccccc"
     stroke-linejoin="round"
     stroke-width="1"
     id="path1" /><path
     d="m1 17.5h30"
     fill="#008dd2"
     stroke="#cccccc"
     stroke-linejoin="round"
     stroke-width="1"
     id="path2" /><path
     d="m7.5 29v-23"
     fill="#008dd2"
     stroke="#cccccc"
     stroke-linejoin="round"
     stroke-width="1"
     id="path3" /><path
     d="m15.5 29v-23"
     fill="#008dd2"
     stroke="#cccccc"
     stroke-linejoin="round"
     stroke-width="1"
     id="path4" /><path
     d="m23.5 29v-23"
     fill="#008dd2"
     stroke="#cccccc"
     stroke-linejoin="round"
     stroke-width="1"
     id="path5" /><rect
     x=".5"
     y="1.5"
     width="31"
     height="4"
     fill="#008dd2"
     stroke="#008dd2"
     stroke-linecap="round"
     stroke-linejoin="round"
     stroke-width="1"
     id="rect5" /><path
     d="m1 23.5h30"
     fill="#008dd2"
     stroke="#cccccc"
     stroke-linejoin="round"
     stroke-width="1"
     id="path6" /></svg>
