<?xml version="1.0" encoding="UTF-8" standalone="no"?>
<svg
   height="64"
   width="64"
   version="1.1"
   id="svg161"
   sodipodi:docname="dialog_error_200.svg"
   inkscape:export-filename="dialog_error_200.png"
   inkscape:export-xdpi="96"
   inkscape:export-ydpi="96"
   inkscape:version="1.2.1 (9c6d41e410, 2022-07-14)"
   xmlns:inkscape="http://www.inkscape.org/namespaces/inkscape"
   xmlns:sodipodi="http://sodipodi.sourceforge.net/DTD/sodipodi-0.dtd"
   xmlns="http://www.w3.org/2000/svg"
   xmlns:svg="http://www.w3.org/2000/svg">
  <defs
     id="defs165" />
  <sodipodi:namedview
     id="namedview163"
     pagecolor="#ffffff"
     bordercolor="#666666"
     borderopacity="1.0"
     inkscape:showpageshadow="2"
     inkscape:pageopacity="0.0"
     inkscape:pagecheckerboard="0"
     inkscape:deskcolor="#d1d1d1"
     showgrid="true"
     inkscape:zoom="14.34375"
     inkscape:cx="31.965142"
     inkscape:cy="32"
     inkscape:current-layer="svg161">
    <inkscape:grid
       type="xygrid"
       id="grid540" />
  </sodipodi:namedview>
  <linearGradient
     id="a"
     gradientUnits="userSpaceOnUse"
     x1="32.0000018"
     x2="47.57949093846"
     y1="183.64615273846"
     y2="219.25640890256">
    <stop
       offset="0"
       stop-color="#faa"
       id="stop146" />
    <stop
       offset="1"
       stop-color="#f00"
       id="stop148" />
  </linearGradient>
  <g
     stroke-linecap="round"
     transform="translate(0 -165)"
     id="g159">
    <circle
       cx="32"
       cy="197"
       r="28.933334"
       style="fill-rule:evenodd;stroke:#d40000;stroke-width:4.13333;stroke-linejoin:round;stroke-opacity:.954902;fill:url(#a)"
       id="circle151" />
    <g
       fill="none"
       stroke="#fff"
       stroke-width="3"
       transform="matrix(2 0 0 2 0 165)"
       id="g157">
      <path
         d="m11 11 10 10"
         id="path153" />
      <path
         d="m21 11-10 10"
         id="path155" />
    </g>
  </g>
</svg>
