<?xml version="1.0" encoding="UTF-8" standalone="no"?>
<svg
   width="24"
   height="24"
   version="1.1"
   viewBox="0 0 24 24"
   id="svg9"
   sodipodi:docname="tcomboboxex.svg"
   inkscape:export-filename="tcomboboxex.png"
   inkscape:export-xdpi="96"
   inkscape:export-ydpi="96"
   inkscape:version="1.3.2 (091e20e, 2023-11-25, custom)"
   xmlns:inkscape="http://www.inkscape.org/namespaces/inkscape"
   xmlns:sodipodi="http://sodipodi.sourceforge.net/DTD/sodipodi-0.dtd"
   xmlns="http://www.w3.org/2000/svg"
   xmlns:svg="http://www.w3.org/2000/svg">
  <defs
     id="defs9" />
  <sodipodi:namedview
     id="namedview9"
     pagecolor="#ffffff"
     bordercolor="#000000"
     borderopacity="0.25"
     inkscape:showpageshadow="2"
     inkscape:pageopacity="0.0"
     inkscape:pagecheckerboard="0"
     inkscape:deskcolor="#d1d1d1"
     showgrid="true"
     inkscape:current-layer="svg9">
    <inkscape:grid
       id="grid9"
       units="px"
       originx="0"
       originy="0"
       spacingx="0.5"
       spacingy="0.5"
       empcolor="#0099e5"
       empopacity="0.30196078"
       color="#0099e5"
       opacity="0.14901961"
       empspacing="2"
       dotted="false"
       gridanglex="30"
       gridanglez="30"
       visible="true" />
  </sodipodi:namedview>
  <rect
     x="2.25"
     y="3.2499826"
     width="18.5"
     height="18.500017"
     fill="#f9f9f9"
     stroke="#2a7efe"
     stroke-width="0.5"
     style="paint-order:normal"
     id="rect1" />
  <path
     d="M 7.5,10.5 H 17"
     fill="none"
     stroke="#b3b3b3"
     stroke-width="1px"
     id="path1" />
  <path
     d="M 7.4999999,14.5 H 15.999999"
     fill="none"
     stroke="#b3b3b3"
     stroke-width="1px"
     id="path2" />
  <path
     d="M 7.5,18.5 H 18"
     fill="none"
     stroke="#b3b3b3"
     stroke-width="1px"
     id="path3" />
  <rect
     transform="rotate(90)"
     x="3.2499826"
     y="-16.25"
     width="4.5000172"
     height="14"
     fill="#f9f9f9"
     stroke="#2a7efe"
     stroke-width="0.5"
     style="paint-order:normal"
     id="rect3" />
  <path
     d="m 8,5.5 h 6"
     fill="none"
     stroke="#b3b3b3"
     stroke-width="0.999998px"
     id="path4" />
  <rect
     x="16.25"
     y="3.2499826"
     width="4.5"
     height="4.5"
     fill="#ffffff"
     stroke="#2a7efe"
     stroke-width="0.499999"
     style="paint-order:normal"
     id="rect4" />
  <path
     d="M 17.43935,4.8475 18.5,5.9081 19.56065,4.8475"
     fill="none"
     stroke="#808080"
     stroke-width="0.7"
     id="path5" />
  <path
     d="M 4,5.5 H 6"
     fill="none"
     stroke="#ff0000"
     stroke-width="2"
     id="path6" />
  <path
     d="M 4,18.5 H 6"
     fill="none"
     stroke="#0000ff"
     stroke-width="2"
     id="path7" />
  <path
     d="M 4,14.5 H 6"
     fill="none"
     stroke="#ff6600"
     stroke-width="2"
     id="path8" />
  <path
     d="M 4,10.5 H 6"
     fill="none"
     stroke="#008000"
     stroke-width="2"
     id="path9" />
</svg>
