<?xml version="1.0" encoding="UTF-8" standalone="no"?>
<svg
   height="36"
   viewBox="0 0 36 36"
   width="36"
   version="1.1"
   id="svg40"
   sodipodi:docname="Zoom_07_36.svg"
   inkscape:export-filename="Zoom_07_36.png"
   inkscape:export-xdpi="96"
   inkscape:export-ydpi="96"
   inkscape:version="1.3.2 (091e20e, 2023-11-25, custom)"
   xmlns:inkscape="http://www.inkscape.org/namespaces/inkscape"
   xmlns:sodipodi="http://sodipodi.sourceforge.net/DTD/sodipodi-0.dtd"
   xmlns="http://www.w3.org/2000/svg"
   xmlns:svg="http://www.w3.org/2000/svg">
  <defs
     id="defs40" />
  <sodipodi:namedview
     id="namedview40"
     pagecolor="#ffffff"
     bordercolor="#000000"
     borderopacity="0.25"
     inkscape:showpageshadow="2"
     inkscape:pageopacity="0.0"
     inkscape:pagecheckerboard="0"
     inkscape:deskcolor="#d1d1d1"
     showgrid="true"
     inkscape:current-layer="svg40">
    <inkscape:grid
       id="grid40"
       units="px"
       originx="0"
       originy="0"
       spacingx="0.5"
       spacingy="0.5"
       empcolor="#0099e5"
       empopacity="0.30196078"
       color="#0099e5"
       opacity="0.14901961"
       empspacing="2"
       dotted="false"
       gridanglex="30"
       gridanglez="30"
       visible="true" />
  </sodipodi:namedview>
  <g
     stroke-linecap="round"
     id="g40">
    <path
       d="m3.25 3.25h16.5v16.5h-16.5z"
       fill="#fff"
       stroke="#ccc"
       stroke-width="1.5"
       id="path1" />
    <g
       fill="#2a7fff"
       stroke-linejoin="round"
       stroke-width="10"
       id="g5">
      <path
         d="m1 1h4v4h-4z"
         id="path2" />
      <path
         d="m1 31h4v4h-4z"
         id="path3" />
      <path
         d="m31 31h4v4h-4z"
         id="path4" />
      <path
         d="m31 1h4v4h-4z"
         id="path5" />
    </g>
    <path
       d="m10.125 10.125 16.5 16.5"
       fill="none"
       stroke="#2a7fff"
       stroke-width="2.25"
       id="path6" />
    <g
       fill="#3f7cd7"
       stroke-linejoin="round"
       stroke-width="7.5"
       id="g14">
      <path
         d="m32 7h1.5v1.5h-1.5z"
         id="path7" />
      <path
         d="m32 19h1.5v1.5h-1.5z"
         id="path8" />
      <path
         d="m32 16h1.5v1.5h-1.5z"
         id="path9" />
      <path
         d="m32 13h1.5v1.5h-1.5z"
         id="path10" />
      <path
         d="m32 10h1.5v1.5h-1.5z"
         id="path11" />
      <path
         d="m32 22h1.5v1.5h-1.5z"
         id="path12" />
      <path
         d="m32 28h1.5v1.5h-1.5z"
         id="path13" />
      <path
         d="m32 25h1.5v1.5h-1.5z"
         id="path14" />
    </g>
    <path
       d="m26.875 20.125v6.75h-6.75"
       fill="none"
       stroke="#2a7fff"
       stroke-width="2.25"
       id="path15" />
    <g
       fill="#3f7cd7"
       stroke-linejoin="round"
       stroke-width="7.5"
       id="g39">
      <g
         transform="matrix(0 1 -1 0 36.5 -29.5)"
         id="g23">
        <path
           d="m32 7h1.5v1.5h-1.5z"
           id="path16" />
        <path
           d="m32 19h1.5v1.5h-1.5z"
           id="path17" />
        <path
           d="m32 16h1.5v1.5h-1.5z"
           id="path18" />
        <path
           d="m32 13h1.5v1.5h-1.5z"
           id="path19" />
        <path
           d="m32 10h1.5v1.5h-1.5z"
           id="path20" />
        <path
           d="m32 22h1.5v1.5h-1.5z"
           id="path21" />
        <path
           d="m32 28h1.5v1.5h-1.5z"
           id="path22" />
        <path
           d="m32 25h1.5v1.5h-1.5z"
           id="path23" />
      </g>
      <g
         transform="matrix(0 1 -1 0 36.5 0)"
         id="g31">
        <path
           d="m32 7h1.5v1.5h-1.5z"
           id="path24" />
        <path
           d="m32 19h1.5v1.5h-1.5z"
           id="path25" />
        <path
           d="m32 16h1.5v1.5h-1.5z"
           id="path26" />
        <path
           d="m32 13h1.5v1.5h-1.5z"
           id="path27" />
        <path
           d="m32 10h1.5v1.5h-1.5z"
           id="path28" />
        <path
           d="m32 22h1.5v1.5h-1.5z"
           id="path29" />
        <path
           d="m32 28h1.5v1.5h-1.5z"
           id="path30" />
        <path
           d="m32 25h1.5v1.5h-1.5z"
           id="path31" />
      </g>
      <path
         d="m2.5 7h1.5v1.5h-1.5z"
         id="path32" />
      <path
         d="m2.5 19h1.5v1.5h-1.5z"
         id="path33" />
      <path
         d="m2.5 16h1.5v1.5h-1.5z"
         id="path34" />
      <path
         d="m2.5 13h1.5v1.5h-1.5z"
         id="path35" />
      <path
         d="m2.5 10h1.5v1.5h-1.5z"
         id="path36" />
      <path
         d="m2.5 22h1.5v1.5h-1.5z"
         id="path37" />
      <path
         d="m2.5 28h1.5v1.5h-1.5z"
         id="path38" />
      <path
         d="m2.5 25h1.5v1.5h-1.5z"
         id="path39" />
    </g>
  </g>
</svg>
