<?xml version="1.0" encoding="UTF-8" standalone="no"?>
<svg
   width="24"
   height="24"
   version="1.1"
   viewBox="0 0 24 24"
   id="svg13"
   sodipodi:docname="tsavepicturedialog.svg"
   inkscape:export-filename="tsavepicturedialog.png"
   inkscape:export-xdpi="96"
   inkscape:export-ydpi="96"
   inkscape:version="1.3.2 (091e20e, 2023-11-25, custom)"
   xmlns:inkscape="http://www.inkscape.org/namespaces/inkscape"
   xmlns:sodipodi="http://sodipodi.sourceforge.net/DTD/sodipodi-0.dtd"
   xmlns="http://www.w3.org/2000/svg"
   xmlns:svg="http://www.w3.org/2000/svg">
  <sodipodi:namedview
     id="namedview13"
     pagecolor="#ffffff"
     bordercolor="#000000"
     borderopacity="0.25"
     inkscape:showpageshadow="2"
     inkscape:pageopacity="0.0"
     inkscape:pagecheckerboard="0"
     inkscape:deskcolor="#d1d1d1"
     showgrid="true"
     inkscape:current-layer="svg13">
    <inkscape:grid
       id="grid13"
       units="px"
       originx="0"
       originy="0"
       spacingx="0.5"
       spacingy="0.5"
       empcolor="#0099e5"
       empopacity="0.30196078"
       color="#0099e5"
       opacity="0.14901961"
       empspacing="2"
       dotted="false"
       gridanglex="30"
       gridanglez="30"
       visible="true" />
  </sodipodi:namedview>
  <defs
     id="defs7">
    <linearGradient
       id="a"
       x1="13.53"
       x2="13.53"
       y1="3.5"
       y2="8.75"
       gradientTransform="matrix(0.80919429,0,0,0.825396,0.0519713,3.1111)"
       gradientUnits="userSpaceOnUse">
      <stop
         stop-color="#ececec"
         offset="0"
         id="stop1" />
      <stop
         stop-color="#b7bec8"
         offset="1"
         id="stop2" />
    </linearGradient>
    <linearGradient
       id="c"
       x1="7.9999995"
       x2="7.9999995"
       y1="1.4999998"
       y2="11.238683"
       gradientTransform="matrix(0.80000002,0,0,0.61538215,8.6000003,12.077)"
       gradientUnits="userSpaceOnUse">
      <stop
         stop-color="#80b4fe"
         offset="0"
         id="stop3" />
      <stop
         stop-color="#e7f6fe"
         offset="1"
         id="stop4" />
    </linearGradient>
    <radialGradient
       id="d"
       cx="16"
       cy="10"
       r="2.5999999"
       gradientTransform="matrix(0.59999974,0,0,0.59597023,7.9000041,9.5303)"
       gradientUnits="userSpaceOnUse">
      <stop
         stop-color="#ffffff"
         offset="0"
         id="stop5" />
      <stop
         stop-color="#ffe680"
         offset=".57692301"
         id="stop6" />
      <stop
         stop-color="#ffcc00"
         offset="1"
         id="stop7" />
    </radialGradient>
  </defs>
  <rect
     x="1.25"
     y="4.2499828"
     width="21.5"
     height="18.5"
     fill="#f9f9f9"
     stroke="#2a7efe"
     stroke-width="0.5"
     style="paint-order:normal"
     id="rect7" />
  <path
     d="m 2.5,1 h 19 C 22.35,1 23,1.6 23,2.5 V 4 H 1 V 2.5 C 1,1.6 1.6,1 2.5,1 Z"
     fill="#2a7efe"
     id="path7" />
  <path
     d="M 5.8571428,6 H 15.714286 L 17,7.3 V 18.1333 C 17,18.612 16.61624,19 16.142857,19 H 5.857143 C 5.3837601,19 5.0000001,18.612 5.0000001,18.1333 V 6.8667 C 5.0000001,6.388 5.3837601,6 5.8571428,6 Z"
     fill="#0078f0"
     fill-rule="evenodd"
     stroke-width="0.999998"
     id="path8" />
  <rect
     x="6.5"
     y="11.499983"
     width="9"
     height="7.5000172"
     rx="0.54285812"
     ry="0.5000174"
     fill="#ffffff"
     stroke-width="0.923186"
     id="rect8" />
  <path
     d="m 7.4999999,6 v 3.4667 c 3.64e-5,0.4786 0.3837817,0.8666 0.8571429,0.8666 h 5.2142862 c 0.473361,0 0.928535,-0.388 0.928571,-0.8666 V 6 Z M 12,7 h 1.5 V 9.5 H 12 Z"
     fill="url(#a)"
     fill-rule="evenodd"
     stroke-width="0.999998"
     id="path9"
     style="fill:url(#a)" />
  <path
     d="M 7.5000004,13.5 H 14.5"
     fill="none"
     stroke="#e6e6e6"
     stroke-width="0.999998"
     id="path10" />
  <path
     d="M 7.5000001,15.5 H 14.5"
     fill="none"
     stroke="#e6e6e6"
     stroke-width="0.999998"
     id="path11" />
  <path
     d="M 6.4999999,18.25 H 15.5"
     fill="none"
     stroke="#ff6600"
     stroke-width="1.5"
     id="path12" />
  <rect
     x="9"
     y="12.999983"
     width="12"
     height="7.9999685"
     fill="url(#c)"
     stroke-width="0.774592"
     id="rect12"
     style="fill:url(#c)" />
  <path
     d="m 9,21 2.809727,-3.5416 c 0.818939,-1.0322 2.193272,-0.8935 3.025158,0 l 2.307972,2.4791 1.510035,-1.0625 c 0.460191,-0.3238 0.767295,-0.283 1.218278,0 L 21,19.5834 V 21 Z"
     fill="#01a901"
     stroke-width="0.798432"
     id="path13" />
  <ellipse
     cx="17.5"
     cy="15.489851"
     rx="1.4999994"
     ry="1.4899255"
     fill="url(#d)"
     stroke-width="0.69479"
     id="ellipse13"
     style="fill:url(#d)" />
  <rect
     style="fill:none;stroke:#ffffff"
     id="rect1"
     width="13"
     height="9"
     x="8.5"
     y="12.5" />
</svg>
