<?xml version="1.0" encoding="UTF-8" standalone="no"?>
<svg
   width="16"
   height="16"
   version="1.0"
   id="svg34"
   inkscape:export-xdpi="96"
   inkscape:export-ydpi="96"
   inkscape:version="1.2.1 (9c6d41e410, 2022-07-14)"
   sodipodi:docname="pkg_package_uninstall.svg"
   inkscape:export-filename="pkg_package_uninstall.png"
   xmlns:inkscape="http://www.inkscape.org/namespaces/inkscape"
   xmlns:sodipodi="http://sodipodi.sourceforge.net/DTD/sodipodi-0.dtd"
   xmlns:xlink="http://www.w3.org/1999/xlink"
   xmlns="http://www.w3.org/2000/svg"
   xmlns:svg="http://www.w3.org/2000/svg">
  <sodipodi:namedview
     id="namedview36"
     pagecolor="#ffffff"
     bordercolor="#666666"
     borderopacity="1.0"
     inkscape:showpageshadow="2"
     inkscape:pageopacity="0.0"
     inkscape:pagecheckerboard="0"
     inkscape:deskcolor="#d1d1d1"
     showgrid="true"
     inkscape:zoom="57.375"
     inkscape:cx="7.9912854"
     inkscape:cy="8"
     inkscape:current-layer="svg34">
    <inkscape:grid
       type="xygrid"
       id="grid1160" />
  </sodipodi:namedview>
  <defs
     id="defs14">
    <linearGradient
       id="linearGradient933">
      <stop
         stop-color="#ffe991"
         offset="0"
         id="stop2" />
      <stop
         stop-color="#f5c400"
         offset="1"
         id="stop4" />
    </linearGradient>
    <linearGradient
       id="linearGradient1347"
       x1="8.5"
       x2="16"
       y1="8"
       y2="11"
       gradientTransform="translate(-.5)"
       gradientUnits="userSpaceOnUse"
       xlink:href="#linearGradient933" />
    <linearGradient
       id="linearGradient1351"
       x1="8.5002"
       x2="16"
       y1="7.9959"
       y2="10.996"
       gradientTransform="matrix(-1 0 0 1 16.5 .004112)"
       gradientUnits="userSpaceOnUse"
       xlink:href="#linearGradient933" />
    <linearGradient
       id="linearGradient1355"
       x1="1.0002"
       x2="16"
       y1="4.4959"
       y2="4.4959"
       gradientTransform="matrix(-1 0 0 1 16.5 .004112)"
       gradientUnits="userSpaceOnUse">
      <stop
         stop-color="#ffe478"
         offset="0"
         id="stop9" />
      <stop
         stop-color="#fff2c0"
         offset="1"
         id="stop11" />
    </linearGradient>
    <radialGradient
       id="a-4"
       cx="12.1"
       cy="10.900001"
       gradientTransform="matrix(0,1.077458,-1.0774249,1.9992701e-8,21.789407,-2.9918109)"
       gradientUnits="userSpaceOnUse"
       r="4.5">
      <stop
         offset="0"
         stop-color="#ff5555"
         id="stop2-5" />
      <stop
         offset="1"
         stop-color="#aa0000"
         id="stop4-0" />
    </radialGradient>
  </defs>
  <g
     id="g259">
    <g
       stroke="#ccaa00"
       stroke-linejoin="round"
       stroke-width=".5"
       id="g22">
      <path
         d="m8 8 7.5-3.5v6.5l-7.5 4z"
         fill="url(#linearGradient1347)"
         id="path16" />
      <path
         d="m8.0002 8.0041-7.5002-3.5041v6.5l7.5002 4.0041z"
         fill="url(#linearGradient1351)"
         id="path18" />
      <path
         d="m8 1-7.5 3.5 7.5002 3.5041 7.4998-3.5041z"
         fill="url(#linearGradient1355)"
         id="path20" />
    </g>
    <g
       fill="none"
       stroke="#5f8dd3"
       stroke-linecap="round"
       stroke-width=".75"
       id="g32">
      <path
         d="m5 2.5 6.7 3.6"
         id="path24" />
      <path
         d="m4.3 6.1 6.7-3.6"
         id="path26" />
      <path
         d="m4.3 6.3v6.5"
         id="path28" />
      <path
         d="m11.7 6.3v6.5"
         id="path30" />
    </g>
  </g>
  <g
     id="g1924">
    <ellipse
       cx="11.5"
       cy="11.5"
       rx="3.9999402"
       ry="4.0000625"
       style="fill:url(#a-4);stroke:#ffffff;stroke-width:0.999998;stroke-linecap:round;stroke-linejoin:round;stroke-dashoffset:1.49998"
       transform="matrix(0,1,1,0,0,0)"
       id="ellipse7" />
    <path
       d="m 13,10 -3,3"
       id="path3550"
       style="fill:none;stroke:#ffffff;stroke-width:1;stroke-linecap:round;stroke-dasharray:none"
       sodipodi:nodetypes="cc" />
    <path
       d="M 13,13 10,10"
       id="path3552"
       style="fill:none;stroke:#ffffff;stroke-width:1;stroke-linecap:round;stroke-dasharray:none"
       sodipodi:nodetypes="cc" />
  </g>
</svg>
