<svg width="16" height="16" version="1.1" xmlns="http://www.w3.org/2000/svg">
 <g fill="none" stroke-linecap="round" stroke-linejoin="round">
  <g stroke="#ffffff" stroke-width="4">
   <path d="m7 8h7"/>
   <path d="m11 5 3 3-3 3"/>
  </g>
  <g stroke="#ff0000" stroke-opacity=".996078" stroke-width="2">
   <path d="m7 8h7"/>
   <path d="m11 5 3 3-3 3"/>
  </g>
 </g>
</svg>
