<?xml version="1.0" encoding="UTF-8" standalone="no"?>
<svg
   width="36"
   height="36"
   version="1.1"
   viewBox="0 0 36 36"
   id="svg4"
   sodipodi:docname="textendedtabcontrol_150.svg"
   inkscape:export-filename="textendedtabcontrol_150.png"
   inkscape:export-xdpi="96"
   inkscape:export-ydpi="96"
   inkscape:version="1.3.2 (091e20e, 2023-11-25, custom)"
   xmlns:inkscape="http://www.inkscape.org/namespaces/inkscape"
   xmlns:sodipodi="http://sodipodi.sourceforge.net/DTD/sodipodi-0.dtd"
   xmlns="http://www.w3.org/2000/svg"
   xmlns:svg="http://www.w3.org/2000/svg">
  <defs
     id="defs4" />
  <sodipodi:namedview
     id="namedview4"
     pagecolor="#ffffff"
     bordercolor="#000000"
     borderopacity="0.25"
     inkscape:showpageshadow="2"
     inkscape:pageopacity="0.0"
     inkscape:pagecheckerboard="0"
     inkscape:deskcolor="#d1d1d1"
     showgrid="true"
     inkscape:current-layer="svg4">
    <inkscape:grid
       id="grid4"
       units="px"
       originx="0"
       originy="0"
       spacingx="0.5"
       spacingy="0.5"
       empcolor="#0099e5"
       empopacity="0.30196078"
       color="#0099e5"
       opacity="0.14901961"
       empspacing="2"
       dotted="false"
       gridanglex="30"
       gridanglez="30"
       visible="true" />
  </sodipodi:namedview>
  <path
     d="m 33.5,11.5 v 20 h -31 v -20"
     fill="#ececec"
     stroke-dasharray="1, 3"
     style="stroke:#2a7efe;stroke-linecap:round;stroke-linejoin:round;paint-order:normal;fill:#e6e6e6"
     id="path1" />
  <path
     d="M 2.5,11.5 V 9 C 2.5,8.1716 3.1715729,7.5 4,7.5 h 6 c 0.800813,0 1.5,0.6992 1.5,1.5 v 2.5 h 22"
     fill="#ffffff"
     style="stroke:#2a7efe;stroke-linecap:round;stroke-linejoin:round;paint-order:normal"
     id="path2" />
  <path
     d="m 11.5,8.5 h 7 v 3 h -7 z"
     fill="#e6e6e6"
     id="path3"
     style="stroke:#2a7efe;stroke-linecap:round;stroke-linejoin:round" />
  <path
     d="M 18.5,8.5 H 25 a 1.5,1.5 0 0 1 1.5,1.5 v 1.5 h -8 z"
     fill="#e6e6e6"
     id="path4"
     style="stroke:#2a7efe;stroke-linecap:round;stroke-linejoin:round" />
  <rect
     y="25"
     x="0"
     height="11"
     width="11"
     id="rect857-1"
     style="fill:#ffffff;fill-opacity:1;fill-rule:evenodd;stroke:none;stroke-width:1.83333;stroke-linecap:round;stroke-linejoin:bevel;stroke-miterlimit:4;stroke-dasharray:none;stroke-dashoffset:0;stroke-opacity:1;paint-order:normal" />
  <path
     style="fill:none;fill-rule:evenodd;stroke:#0044aa;stroke-width:1.5;stroke-linecap:round;stroke-linejoin:miter;stroke-miterlimit:4;stroke-dasharray:none;stroke-opacity:1"
     d="M 3.5,32.5 7.9893182,28.015"
     id="path825-7"
     inkscape:connector-curvature="0"
     sodipodi:nodetypes="cc" />
  <path
     style="fill:none;fill-rule:evenodd;stroke:#0044aa;stroke-width:1.25;stroke-linecap:round;stroke-linejoin:round;stroke-dasharray:none;stroke-opacity:1"
     d="m 4.375,27.625 h 4 l -2.162e-4,4"
     id="path827-0"
     inkscape:connector-curvature="0"
     sodipodi:nodetypes="ccc" />
  <path
     sodipodi:nodetypes="ccc"
     inkscape:connector-curvature="0"
     id="path851"
     d="M 8.5000001,35.5 0.51074,35.4849 0.5,27.5"
     style="fill:none;fill-rule:evenodd;stroke:#0044aa;stroke-width:1px;stroke-linecap:round;stroke-linejoin:round;stroke-opacity:1" />
</svg>
