<svg width="24" height="24" version="1.1" xmlns="http://www.w3.org/2000/svg">
 <defs>
  <radialGradient id="a" cx="-11.5" cy="8.5" r="3.5" gradientTransform="matrix(0,1.3784615,-1.3784615,0,24.836919,28.972304)" gradientUnits="userSpaceOnUse">
   <stop stop-color="#fff" offset="0"/>
   <stop stop-color="#d5e5ff" offset="1"/>
  </radialGradient>
 </defs>
 <g stroke-linecap="round">
  <circle cx="14.153847" cy="14.153847" r="4.9230766" fill="none" stroke="#ffffff" stroke-linejoin="round" stroke-width="2.46154"/>
  <path d="m16.509557 16.509557 5.151982 5.151982" fill="none" stroke="#ffffff" stroke-width="4.67692"/>
  <path d="m16.509539 16.509539 5.151981 5.151981" fill="none" stroke="#a05a2c" stroke-width="2.21538"/>
  <circle cx="14.153847" cy="14.153847" r="4.3076921" fill="url(#a)" fill-rule="evenodd" stroke="#dd8703" stroke-linejoin="round" stroke-width="1.23077"/>
 </g>
</svg>
