<?xml version="1.0" encoding="UTF-8" standalone="no"?>
<svg
   height="64"
   viewBox="0 0 16.933 16.933"
   width="64"
   version="1.1"
   id="svg13"
   sodipodi:docname="Edit_03_64.svg"
   inkscape:version="1.3 (0e150ed6c4, 2023-07-21)"
   xmlns:inkscape="http://www.inkscape.org/namespaces/inkscape"
   xmlns:sodipodi="http://sodipodi.sourceforge.net/DTD/sodipodi-0.dtd"
   xmlns="http://www.w3.org/2000/svg"
   xmlns:svg="http://www.w3.org/2000/svg">
  <defs
     id="defs13" />
  <sodipodi:namedview
     id="namedview13"
     pagecolor="#ffffff"
     bordercolor="#000000"
     borderopacity="0.25"
     inkscape:showpageshadow="2"
     inkscape:pageopacity="0.0"
     inkscape:pagecheckerboard="0"
     inkscape:deskcolor="#d1d1d1"
     showgrid="true"
     inkscape:current-layer="svg13">
    <inkscape:grid
       id="grid13"
       units="px"
       originx="0"
       originy="0"
       spacingx="0.13228906"
       spacingy="0.13228906"
       empcolor="#0099e5"
       empopacity="0.30196078"
       color="#0099e5"
       opacity="0.14901961"
       empspacing="2"
       dotted="false"
       gridanglex="30"
       gridanglez="30"
       visible="true" />
  </sodipodi:namedview>
  <rect
     fill="#f5f7ff"
     height="12.964328"
     rx="1.074257"
     stroke="#00aad4"
     stroke-linejoin="round"
     stroke-width=".793735"
     width="12.964328"
     x="1.45518"
     y="2.513493"
     id="rect1" />
  <path
     d="m1.7197578 2.6457812h12.4351722v2.1166249h-12.4351722z"
     fill="#00aad4"
     fill-rule="evenodd"
     stroke-width="1.05228"
     id="path1" />
  <g
     fill="none"
     stroke="#00aad4"
     stroke-width=".75"
     transform="matrix(1.0583126 0 0 1.0583126 0 .820192)"
     id="g9">
    <path
       d="m3.4999999 5.6h2.5"
       id="path2" />
    <path
       d="m6.9999999 5.6h4.5000001"
       id="path3" />
    <path
       d="m3.4999999 9.6h2.5"
       id="path4" />
    <path
       d="m6.9999999 9.6h4.5000001"
       id="path5" />
    <path
       d="m3.4999999 7.6h2.5"
       id="path6" />
    <path
       d="m6.9999999 7.6h4.5000001"
       id="path7" />
    <path
       d="m3.4999999 11.6h2.5"
       id="path8" />
    <path
       d="m6.9999999 11.6h4.5000001"
       id="path9" />
  </g>
  <g
     transform="translate(.529129 -.529132)"
     id="g13">
    <path
       d="m5.8205773 11.112423 1.1430027-2.6670059 6.858016-6.858016 1.524004 1.5240035-6.8580165 6.8580161z"
       fill="none"
       stroke="#f5f7ff"
       stroke-linecap="round"
       stroke-linejoin="round"
       stroke-width="2.11663"
       id="path10" />
    <g
       stroke="#cca300"
       stroke-width=".740819"
       id="g12">
      <path
         d="m5.8205773 11.112423 1.1430027-2.6670059 6.858016-6.858016 1.524004 1.5240035-6.8580165 6.8580161z"
         fill="#fff4cc"
         stroke-linecap="round"
         stroke-linejoin="round"
         id="path11" />
      <path
         d="m12.297592 3.1114046 1.524004 1.5240036"
         fill="none"
         id="path12" />
    </g>
  </g>
</svg>
