<?xml version="1.0" encoding="UTF-8" standalone="no"?>
<svg
   height="64"
   viewBox="0 0 16.933333 16.933335"
   width="64"
   version="1.1"
   id="svg645"
   sodipodi:docname="Database_14_64.svg"
   inkscape:export-filename="Database_14_64.png"
   inkscape:export-xdpi="96"
   inkscape:export-ydpi="96"
   inkscape:version="1.2.1 (9c6d41e410, 2022-07-14)"
   xmlns:inkscape="http://www.inkscape.org/namespaces/inkscape"
   xmlns:sodipodi="http://sodipodi.sourceforge.net/DTD/sodipodi-0.dtd"
   xmlns="http://www.w3.org/2000/svg"
   xmlns:svg="http://www.w3.org/2000/svg">
  <defs
     id="defs649" />
  <sodipodi:namedview
     id="namedview647"
     pagecolor="#ffffff"
     bordercolor="#666666"
     borderopacity="1.0"
     inkscape:showpageshadow="2"
     inkscape:pageopacity="0.0"
     inkscape:pagecheckerboard="0"
     inkscape:deskcolor="#d1d1d1"
     showgrid="true"
     inkscape:zoom="14.34375"
     inkscape:cx="31.965142"
     inkscape:cy="32"
     inkscape:current-layer="svg645">
    <inkscape:grid
       type="xygrid"
       id="grid768" />
  </sodipodi:namedview>
  <path
     d="m7.4083336 1.0583334c-3.506891 0-6.3500002 1.1058372-6.3500002 2.4696168v1.9755901c0 1.3637793 2.8431092 2.4691 6.3500002 2.4691 3.5068914 0 6.3494834-1.1053207 6.3494834-2.4691v-1.9502687-.0253214c0-1.3637796-2.842592-2.4696168-6.3494834-2.4696168zm0 1.4820801c2.9341414 0 4.8501454.9485556 5.7505534 1.6955038-.898372.6127572-2.809126 1.3100091-5.7505534 1.267623-2.9123781-.0421376-4.8232633-.7280752-5.7319501-1.3125815.9036681-.7496654 2.8031693-1.6505453 5.7319501-1.6505453zm-6.3500002 4.4446901v2.4691001c0 1.3637813 2.8431057 2.4696163 6.3500002 2.4696163.7427508 0 1.4552446-.049921 2.1177003-.141076v-.223759c0-.9275.3610859-1.7719254.9487791-2.4117394-.9091426.1953725-1.9541675.3069581-3.0664794.3069581-3.5068945 0-6.3500002-1.1053192-6.3500002-2.4691001zm12.6994836 0c0 .3377774-.174754.6597132-.490409.9529135.16606.0018082.329711.0146343.490409.0377238zm-12.6994836 3.9506634v2.469617c0 1.36378 2.8431057 2.469617 6.3500002 2.469617.3608299 0 .713942-.012133 1.0583334-.034624v-2.292883c0-.060752.0036666-.119918.0103353-.177767-.3476651.022936-.7042083.035657-1.0686687.035657-3.5068945 0-6.3500002-1.105835-6.3500002-2.469617z"
     fill="#00aad4"
     stroke-linecap="round"
     stroke-linejoin="round"
     stroke-miterlimit="5.6"
     stroke-width=".529168"
     id="path641" />
  <path
     d="m13.229167 8.9958335c-1.455554 0-2.645833 1.1547235-2.645833 2.5673465v1.140126h-.210841c-.4690508 0-.8474928.378145-.8474928.846831v2.536366c0 .468685.378442.846831.8474928.846831h5.713348c.469052 0 .847493-.378146.847493-.846831v-2.536366c0-.468686-.378441-.846831-.847493-.846831h-.21084v-1.140126c0-1.412623-1.190279-2.5673465-2.645834-2.5673465zm0 .8550932c.935586 0 1.7632.8042613 1.7632 1.7122533v1.140126h-3.526399v-1.140126c0-.907992.827613-1.7122533 1.763199-1.7122533z"
     fill="#ff7f00"
     stroke-width=".8816"
     id="path643" />
</svg>
