<svg width="16" height="16" version="1.1" xmlns="http://www.w3.org/2000/svg">
 <path d="M 10,12 14.5,7.5 10,3" fill="none" stroke="#01a901" stroke-linecap="round" stroke-linejoin="round" stroke-width="3"/>
 <path d="m14.5 7.5h-13" fill="none" stroke="#01a901" stroke-linecap="round" stroke-width="3"/>
</svg>
