<?xml version="1.0" encoding="UTF-8" standalone="no"?>
<svg
   height="16"
   width="16"
   version="1.1"
   id="svg4"
   sodipodi:docname="menu_search_next_error.svg"
   inkscape:export-filename="menu_search_next_error.png"
   inkscape:export-xdpi="96"
   inkscape:export-ydpi="96"
   inkscape:version="1.3 (0e150ed6c4, 2023-07-21)"
   xmlns:inkscape="http://www.inkscape.org/namespaces/inkscape"
   xmlns:sodipodi="http://sodipodi.sourceforge.net/DTD/sodipodi-0.dtd"
   xmlns="http://www.w3.org/2000/svg"
   xmlns:svg="http://www.w3.org/2000/svg">
  <defs
     id="defs4" />
  <sodipodi:namedview
     id="namedview4"
     pagecolor="#ffffff"
     bordercolor="#000000"
     borderopacity="0.25"
     inkscape:showpageshadow="2"
     inkscape:pageopacity="0.0"
     inkscape:pagecheckerboard="0"
     inkscape:deskcolor="#d1d1d1"
     showgrid="true"
     inkscape:current-layer="svg4">
    <inkscape:grid
       id="grid4"
       units="px"
       originx="0"
       originy="0"
       spacingx="0.5"
       spacingy="0.5"
       empcolor="#0099e5"
       empopacity="0.30196078"
       color="#0099e5"
       opacity="0.14901961"
       empspacing="2"
       dotted="false"
       gridanglex="30"
       gridanglez="30"
       visible="true" />
  </sodipodi:namedview>
  <circle
     cx="11"
     cy="8"
     fill="#f00"
     fill-rule="evenodd"
     r="5"
     id="circle1" />
  <g
     fill="none"
     id="g4">
    <path
       d="m7.5 8h7"
       stroke="#fff"
       stroke-width="2"
       id="path1" />
    <g
       stroke="#01a901"
       stroke-linecap="round"
       transform="matrix(-1 0 0 1 5.2 0)"
       id="g3">
      <path
         d="m1 11.8 1.7 1.7 1.7-1.7"
         stroke-linejoin="round"
         id="path2" />
      <path
         d="m2.7 13.5v-10"
         id="path3" />
    </g>
  </g>
</svg>
