<?xml version="1.0" encoding="UTF-8" standalone="no"?>
<svg
   height="64"
   width="64"
   version="1.1"
   id="svg434"
   sodipodi:docname="Folder_08_64.svg"
   inkscape:export-filename="Folder_08_64.png"
   inkscape:export-xdpi="96"
   inkscape:export-ydpi="96"
   inkscape:version="1.2 (dc2aedaf03, 2022-05-15)"
   xml:space="preserve"
   xmlns:inkscape="http://www.inkscape.org/namespaces/inkscape"
   xmlns:sodipodi="http://sodipodi.sourceforge.net/DTD/sodipodi-0.dtd"
   xmlns="http://www.w3.org/2000/svg"
   xmlns:svg="http://www.w3.org/2000/svg"><defs
     id="defs436" /><sodipodi:namedview
     id="namedview12"
     pagecolor="#ffffff"
     bordercolor="#666666"
     borderopacity="1.0"
     inkscape:pageshadow="2"
     inkscape:pageopacity="0.0"
     inkscape:pagecheckerboard="0"
     inkscape:deskcolor="#d1d1d1"
     showgrid="true"
     inkscape:zoom="14.34375"
     inkscape:cx="28.479303"
     inkscape:cy="32"
     inkscape:current-layer="g1302"
     inkscape:showpageshadow="2"><inkscape:grid
       type="xygrid"
       id="grid139" /></sodipodi:namedview><g
     id="g1157"
     transform="translate(0,3)"><g
       id="g1302"><g
         id="g1229"
         transform="translate(0,-3.0000449)"><path
           d="M 2,22 V 10 C 2,8 4,6 6,6 h 12 c 2,0 4.000007,2 4,4 v 2 h 40 v 10"
           stroke-linejoin="round"
           id="path145"
           style="fill:#fff3cc;fill-opacity:1;stroke:#f4c025;stroke-width:3.99991;stroke-linecap:round"
           sodipodi:nodetypes="cccccccc" /><path
           d="M 62,22 H 2 v 32 h 60 z"
           id="path428"
           style="fill:#f4c025;fill-opacity:1;stroke:#f4c025;stroke-width:4;stroke-linecap:round;stroke-linejoin:round;stroke-opacity:1"
           sodipodi:nodetypes="ccccc" /></g></g></g></svg>
