<?xml version="1.0" encoding="UTF-8" standalone="no"?>
<svg
   height="24"
   width="24"
   version="1.1"
   id="svg20"
   sodipodi:docname="Help_01_24.svg"
   inkscape:export-filename="Help_01_24.png"
   inkscape:export-xdpi="96"
   inkscape:export-ydpi="96"
   inkscape:version="1.2-beta (1b65182ce9, 2022-04-05)"
   xmlns:inkscape="http://www.inkscape.org/namespaces/inkscape"
   xmlns:sodipodi="http://sodipodi.sourceforge.net/DTD/sodipodi-0.dtd"
   xmlns="http://www.w3.org/2000/svg"
   xmlns:svg="http://www.w3.org/2000/svg">
  <defs
     id="defs24" />
  <sodipodi:namedview
     id="namedview22"
     pagecolor="#ffffff"
     bordercolor="#666666"
     borderopacity="1.0"
     inkscape:pageshadow="2"
     inkscape:pageopacity="0.0"
     inkscape:pagecheckerboard="0"
     inkscape:deskcolor="#d1d1d1"
     showgrid="true"
     inkscape:zoom="38.25"
     inkscape:cx="12"
     inkscape:cy="12"
     inkscape:current-layer="svg20">
    <inkscape:grid
       type="xygrid"
       id="grid253"
       originx="0"
       originy="0" />
  </sodipodi:namedview>
  <linearGradient
     id="a"
     gradientUnits="userSpaceOnUse"
     x1="2.551724"
     x2="25.310347"
     y1="1.517242"
     y2="25.827587">
    <stop
       offset="0"
       stop-color="#d5e5ff"
       id="stop2" />
    <stop
       offset="1"
       stop-color="#59f"
       id="stop4" />
  </linearGradient>
  <filter
     id="b"
     color-interpolation-filters="sRGB"
     height="1.136"
     width="1.136"
     x="-0.068"
     y="-0.068">
    <feGaussianBlur
       stdDeviation=".5"
       id="feGaussianBlur7" />
  </filter>
  <g
     transform="scale(0.75)"
     id="g18">
    <circle
       cx="16"
       cy="16"
       r="14.482759"
       style="fill:url(#a);fill-rule:evenodd;stroke:#0044aa;stroke-width:1.03448;stroke-linecap:round;stroke-linejoin:round"
       id="circle10" />
    <path
       d="m 17.227854,19.500028 h -2.75374 q -0.01078,-0.598454 -0.01078,-0.729006 0,-1.348977 0.442757,-2.219399 0.442759,-0.870213 1.771033,-1.958293 1.328275,-1.087871 1.587451,-1.425219 0.399562,-0.533073 0.399562,-1.174976 0,-0.891936 -0.712733,-1.522977 -0.701933,-0.6419021 -1.90062,-0.6419021 -1.155492,0 -1.933018,0.6636261 -0.777527,0.663626 -1.0691,2.023464 l -2.786139,-0.348001 q 0.118785,-1.947431 1.641446,-3.3074778 1.533455,-1.3598384 4.017221,-1.3598384 2.613353,0 4.157608,1.3817712 1.544255,1.3707 1.544255,3.19844 0,1.011836 -0.572347,1.914845 -0.561546,0.903008 -2.418972,2.45878 -0.961108,0.805041 -1.198687,1.294458 -0.226779,0.489625 -0.205185,1.751705 z"
       fill="#ffffff"
       id="path12" />
    <path
       d="m 14.491372,24.5 v -3 h 3.017256 v 3 z"
       fill="#ffffff"
       id="path14" />
    <circle
       cx="16"
       cy="16"
       fill="none"
       filter="url(#b)"
       r="12.5"
       stroke="#ffffff"
       stroke-linecap="round"
       stroke-linejoin="round"
       id="circle16" />
  </g>
</svg>
