<?xml version="1.0" encoding="UTF-8" standalone="no"?>
<svg
   height="32"
   width="32"
   version="1.1"
   id="svg1064"
   sodipodi:docname="Interface_01_32.svg"
   inkscape:export-filename="Interface_01_32.png"
   inkscape:export-xdpi="96"
   inkscape:export-ydpi="96"
   inkscape:version="1.2-beta (1b65182ce9, 2022-04-05)"
   xmlns:inkscape="http://www.inkscape.org/namespaces/inkscape"
   xmlns:sodipodi="http://sodipodi.sourceforge.net/DTD/sodipodi-0.dtd"
   xmlns="http://www.w3.org/2000/svg"
   xmlns:svg="http://www.w3.org/2000/svg">
  <defs
     id="defs1068" />
  <sodipodi:namedview
     id="namedview1066"
     pagecolor="#ffffff"
     bordercolor="#666666"
     borderopacity="1.0"
     inkscape:pageshadow="2"
     inkscape:pageopacity="0.0"
     inkscape:pagecheckerboard="0"
     inkscape:deskcolor="#d1d1d1"
     showgrid="true"
     inkscape:zoom="28.6875"
     inkscape:cx="14.727669"
     inkscape:cy="16"
     inkscape:current-layer="svg1064">
    <inkscape:grid
       type="xygrid"
       id="grid1235" />
  </sodipodi:namedview>
  <g
     id="g1402"
     transform="matrix(2.0000122,0,0,2.0000122,-9.7706667e-5,-9.7694001e-5)">
    <path
       d="M 6.9393398,3.0502525 0.92893219,9.0606602 3.0502525,11.181981 0.3986021,13.833631 2.1663691,15.601398 6.5857864,11.181981 4.4644661,9.0606602 6.9393398,6.5857864 9.0606602,8.7071068 10.828427,6.9393398 Z"
       fill="#ff6600"
       id="path2"
       style="fill-rule:evenodd;stroke:#ffffff;stroke-width:0.5;stroke-dasharray:none"
       sodipodi:nodetypes="ccccccccccc" />
    <path
       d="M 9.0606602,12.949747 15.071068,6.9393398 12.949747,4.8180195 15.601398,2.1663691 13.833631,0.3986021 9.4142136,4.8180195 11.535534,6.9393398 9.0606602,9.4142136 6.9393398,7.2928932 5.1715729,9.0606602 Z"
       fill="#ff6600"
       id="path970"
       style="fill:#00ccff;fill-opacity:1;fill-rule:evenodd;stroke:#ffffff;stroke-width:0.5;stroke-dasharray:none"
       sodipodi:nodetypes="ccccccccccc" />
  </g>
</svg>
