<?xml version="1.0" encoding="UTF-8" standalone="no"?>
<svg
   height="24"
   width="24"
   version="1.1"
   id="svg135"
   sodipodi:docname="item_font_150.svg"
   inkscape:export-filename="item_font_150.png"
   inkscape:export-xdpi="96"
   inkscape:export-ydpi="96"
   inkscape:version="1.2.2 (732a01da63, 2022-12-09)"
   xmlns:inkscape="http://www.inkscape.org/namespaces/inkscape"
   xmlns:sodipodi="http://sodipodi.sourceforge.net/DTD/sodipodi-0.dtd"
   xmlns="http://www.w3.org/2000/svg"
   xmlns:svg="http://www.w3.org/2000/svg">
  <defs
     id="defs139" />
  <sodipodi:namedview
     id="namedview137"
     pagecolor="#ffffff"
     bordercolor="#666666"
     borderopacity="1.0"
     inkscape:showpageshadow="2"
     inkscape:pageopacity="0.0"
     inkscape:pagecheckerboard="0"
     inkscape:deskcolor="#d1d1d1"
     showgrid="true"
     inkscape:zoom="38.25"
     inkscape:cx="11.424837"
     inkscape:cy="12"
     inkscape:current-layer="svg135">
    <inkscape:grid
       type="xygrid"
       id="grid2334" />
  </sodipodi:namedview>
  <path
     d="m10.219229 9.9921876h-4.5390625l-.7018229 1.1393224h.4557292q.6289062 0 .8476562.191407.21875.191406.21875.546875 0 .565104-.5377604.938802-.2825521.191406-.9205729.191406h-2.5247395q-.6197916 0-.8385416-.191406-.2278646-.200521-.2278646-.546875 0-.473959.3736979-.811198.3828125-.33724 1.1393229-.319011l4.4934894-7.3098951h-1.2304687q-.6197917 0-.8476562-.1914062-.21875-.2005209-.21875-.5559896 0-.5559896.5286458-.9296875.2916666-.2005208.938802-.2005208h4.0377599l1.76823 9.1874992q.63802-.01823.874999.182292.23698.200521.23698.55599 0 .565104-.546875.938802-.273438.191406-.920573.191406h-2.5156251q-.6197917 0-.8476562-.191406-.21875-.200521-.21875-.546875 0-.55599.5286458-.929688.2916666-.200521.938802-.200521h.4557295zm-.3828126-1.8684895-.7200521-3.7005207-2.2968749 3.7005207z"
     fill="#3771c8"
     transform="matrix(1.5 0 0 1.536181 .0305 .029647)"
     id="path133"
     style="fill:#2a7fff;fill-opacity:1;stroke:none" />
</svg>
