<?xml version="1.0" encoding="UTF-8" standalone="no"?>
<svg
   height="24"
   viewBox="0 0 6.35 6.35"
   width="24"
   version="1.1"
   id="svg266"
   sodipodi:docname="Window_10_24.svg"
   inkscape:version="1.2.2 (732a01da63, 2022-12-09)"
   xmlns:inkscape="http://www.inkscape.org/namespaces/inkscape"
   xmlns:sodipodi="http://sodipodi.sourceforge.net/DTD/sodipodi-0.dtd"
   xmlns="http://www.w3.org/2000/svg"
   xmlns:svg="http://www.w3.org/2000/svg">
  <defs
     id="defs270">
    <radialGradient
       id="a"
       cx="7.4875011"
       cy="6.25"
       gradientTransform="matrix(-3e-8,0.45861107,-0.45861107,-8e-8,5.86934,-0.983516)"
       gradientUnits="userSpaceOnUse"
       r="2.25">
      <stop
         offset="0"
         stop-color="#f99"
         id="stop758" />
      <stop
         offset="1"
         stop-color="#d40000"
         id="stop760" />
    </radialGradient>
    <radialGradient
       id="b"
       cx="7.4875011"
       cy="6.25"
       gradientTransform="matrix(-3e-8,0.45861107,-0.45861107,-5e-8,5.104988,0.545188)"
       gradientUnits="userSpaceOnUse"
       r="2.25">
      <stop
         offset="0"
         stop-color="#a0c2f8"
         id="stop763" />
      <stop
         offset="1"
         stop-color="#2672e5"
         id="stop765" />
    </radialGradient>
    <radialGradient
       id="c"
       cx="7.4875011"
       cy="6.25"
       gradientTransform="matrix(-5e-8,0.45861107,-0.45861099,-1.3e-7,6.633692,0.545188)"
       gradientUnits="userSpaceOnUse"
       r="2.25">
      <stop
         offset="0"
         stop-color="#fce99c"
         id="stop768" />
      <stop
         offset="1"
         stop-color="#fc0"
         id="stop770" />
    </radialGradient>
  </defs>
  <sodipodi:namedview
     id="namedview268"
     pagecolor="#ffffff"
     bordercolor="#000000"
     borderopacity="0.25"
     inkscape:showpageshadow="2"
     inkscape:pageopacity="0.0"
     inkscape:pagecheckerboard="0"
     inkscape:deskcolor="#d1d1d1"
     showgrid="true"
     inkscape:zoom="37.916667"
     inkscape:cx="10.246154"
     inkscape:cy="12"
     inkscape:current-layer="svg266">
    <inkscape:grid
       type="xygrid"
       id="grid1708" />
  </sodipodi:namedview>
  <rect
     fill="#f5f7ff"
     height="5.503334"
     rx=".449792"
     stroke="#00aad4"
     stroke-linejoin="round"
     stroke-width=".3175"
     width="5.503333"
     x=".423333"
     y=".423333"
     id="rect262" />
  <path
     d="m.52916666.52916655h5.29166664v.74083335h-5.29166664z"
     fill="#00aad4"
     fill-rule="evenodd"
     stroke-width=".396872"
     id="path264" />
  <g
     stroke-width="0.191088"
     id="g783"
     transform="translate(0,0.13229174)">
    <circle
       cx="3.175"
       cy="2.6223149"
       fill="url(#a)"
       r="0.859896"
       stroke="#aa0000"
       id="circle777"
       style="fill:url(#a)" />
    <circle
       cx="2.4106481"
       cy="4.1510191"
       fill="url(#b)"
       r="0.859896"
       stroke="#0055d4"
       id="circle779"
       style="fill:url(#b)" />
    <circle
       cx="3.939352"
       cy="4.1510191"
       fill="url(#c)"
       r="0.859896"
       stroke="#d4aa00"
       id="circle781"
       style="fill:url(#c)" />
  </g>
</svg>
