<?xml version="1.0" encoding="UTF-8" standalone="no"?>
<svg
   height="24"
   viewBox="0 0 6.3499998 6.3500003"
   width="24"
   version="1.1"
   id="svg2"
   sodipodi:docname="Font_24_24.svg"
   inkscape:version="1.3-beta (cedbd6c6ff, 2023-05-28)"
   inkscape:export-filename="Font_24_24.png"
   inkscape:export-xdpi="96"
   inkscape:export-ydpi="96"
   xmlns:inkscape="http://www.inkscape.org/namespaces/inkscape"
   xmlns:sodipodi="http://sodipodi.sourceforge.net/DTD/sodipodi-0.dtd"
   xmlns="http://www.w3.org/2000/svg"
   xmlns:svg="http://www.w3.org/2000/svg">
  <defs
     id="defs2" />
  <sodipodi:namedview
     id="namedview2"
     pagecolor="#ffffff"
     bordercolor="#000000"
     borderopacity="0.25"
     inkscape:showpageshadow="2"
     inkscape:pageopacity="0.0"
     inkscape:pagecheckerboard="0"
     inkscape:deskcolor="#d1d1d1"
     showgrid="true"
     inkscape:zoom="37.875"
     inkscape:cx="11.986799"
     inkscape:cy="12"
     inkscape:current-layer="svg2">
    <inkscape:grid
       id="grid2"
       units="px"
       originx="0"
       originy="0"
       spacingx="0.13229166"
       spacingy="0.13229167"
       empcolor="#0099e5"
       empopacity="0.30196078"
       color="#0099e5"
       opacity="0.14901961"
       empspacing="2"
       dotted="false"
       gridanglex="30"
       gridanglez="30"
       visible="true" />
  </sodipodi:namedview>
  <g
     fill="#00aad4"
     id="g2">
    <path
       d="m5.0175585 1.6289691.6893709-.88900481c.0822374-.1060515.1314508-.26600786.0608143-.39195914-.0624583-.11137118-.2203716-.12519448-.3300161-.08198527-.093616.0368923-.1450502.13727034-.153642.2334932-.088415-.00084576-.1802177.001699-.2665272-.00126.02308-.18609955.1223085-.37638738.3024287-.4525583.1505642-.06367273.3263755-.05749757.4787187-.0019324.154059.05619067.249981.21012572.2643762.37025189.017559.19531879-.075774.37661301-.1904634.52742819l-.491269.64600894h.6947392v.264632h-1.05853z"
       stroke-width=".264583"
       id="path1" />
    <text
       stroke-linejoin="round"
       stroke-width=".396875"
       x="-4.675056"
       y="2.711978"
       id="text1"><tspan
         stroke-width=".396875"
         x="-4.675056"
         y="2.711978"
         id="tspan1" /></text>
    <path
       d="m1.0970051 1.1191828 1.3660432 2.0209344-1.4290566 2.0907h.8956935l.9744569-1.4245567.9339525 1.4245567h.8956891l-1.4110523-2.0591931 1.3480449-2.0524413h-.9001966l-.8686891 1.4110531-.9046935-1.4110531z"
       stroke-width=".264583"
       id="path2" />
  </g>
</svg>
