<?xml version="1.0" encoding="UTF-8" standalone="no"?>
<svg
   height="32"
   width="32"
   version="1.1"
   id="svg2"
   sodipodi:docname="Connection_02_32.svg"
   inkscape:export-filename="Connection_02_32.png"
   inkscape:export-xdpi="96"
   inkscape:export-ydpi="96"
   inkscape:version="1.3 (0e150ed6c4, 2023-07-21)"
   xmlns:inkscape="http://www.inkscape.org/namespaces/inkscape"
   xmlns:sodipodi="http://sodipodi.sourceforge.net/DTD/sodipodi-0.dtd"
   xmlns="http://www.w3.org/2000/svg"
   xmlns:svg="http://www.w3.org/2000/svg">
  <defs
     id="defs2" />
  <sodipodi:namedview
     id="namedview2"
     pagecolor="#ffffff"
     bordercolor="#000000"
     borderopacity="0.25"
     inkscape:showpageshadow="2"
     inkscape:pageopacity="0.0"
     inkscape:pagecheckerboard="0"
     inkscape:deskcolor="#d1d1d1"
     showgrid="true"
     inkscape:current-layer="svg2">
    <inkscape:grid
       id="grid2"
       units="px"
       originx="0"
       originy="0"
       spacingx="0.5"
       spacingy="0.5"
       empcolor="#0099e5"
       empopacity="0.30196078"
       color="#0099e5"
       opacity="0.14901961"
       empspacing="2"
       dotted="false"
       gridanglex="30"
       gridanglez="30"
       visible="true" />
  </sodipodi:namedview>
  <g
     fill="none"
     stroke-linecap="round"
     stroke-linejoin="round"
     stroke-width="2.39994"
     id="g2">
    <path
       d="m17.556085 14.444496-2.828359-2.828359-6.5052241 6.505224 2.8283571 2.828359-6.0501051 6.050106"
       stroke="#00aad4"
       id="path1" />
    <path
       d="m14.444891 17.555691 2.828357 2.828357 6.505224-6.505224-2.828357-2.828359 6.050105-6.0501049"
       stroke="#00c1f0"
       id="path2" />
  </g>
  <g
     fill="#ccaa00"
     id="g4">
    <path
       d="m 27.859573,9.0901041 -1.191377,1.1913779 c 2.025795,4.280498 1.098273,9.795996 -2.746028,13.640294 -3.843848,3.843849 -9.360006,4.774796 -13.640292,2.749934 l -1.1913771,1.191377 c 4.9693191,2.638712 11.5195201,1.628596 15.9605481,-2.812432 4.44151,-4.44151 5.448314,-10.991035 2.808526,-15.9605509 z"
       id="path3" />
    <path
       d="M 17.121554,2.6957286 C 13.512365,2.6657276 9.7968269,4.1026281 6.9499249,6.9495321 2.5100539,11.389403 1.5007229,17.940584 4.1374929,22.910081 l 1.191377,-1.191377 C 3.3049069,17.43808 4.2357329,11.921482 8.0788029,8.0784111 11.921876,4.2353386 17.438474,3.3045144 21.719098,5.3284771 L 22.910475,4.1370998 C 21.127484,3.1910614 19.141051,2.7125158 17.121554,2.6957286 Z"
       id="path4" />
  </g>
</svg>
