<?xml version="1.0" encoding="UTF-8" standalone="no"?>
<svg
   height="32"
   viewBox="0 0 8.4666664 8.4666671"
   width="32"
   version="1.1"
   id="svg290"
   sodipodi:docname="Health_08_32.svg"
   inkscape:export-filename="Health_08_32.png"
   inkscape:export-xdpi="96"
   inkscape:export-ydpi="96"
   inkscape:version="1.2.1 (9c6d41e410, 2022-07-14)"
   xmlns:inkscape="http://www.inkscape.org/namespaces/inkscape"
   xmlns:sodipodi="http://sodipodi.sourceforge.net/DTD/sodipodi-0.dtd"
   xmlns="http://www.w3.org/2000/svg"
   xmlns:svg="http://www.w3.org/2000/svg">
  <defs
     id="defs294" />
  <sodipodi:namedview
     id="namedview292"
     pagecolor="#ffffff"
     bordercolor="#666666"
     borderopacity="1.0"
     inkscape:showpageshadow="2"
     inkscape:pageopacity="0.0"
     inkscape:pagecheckerboard="0"
     inkscape:deskcolor="#d1d1d1"
     showgrid="true"
     inkscape:zoom="28.6875"
     inkscape:cx="15.982571"
     inkscape:cy="16"
     inkscape:current-layer="svg290">
    <inkscape:grid
       type="xygrid"
       id="grid958" />
  </sodipodi:namedview>
  <g
     fill="none"
     stroke="#00aad4"
     id="g288">
    <rect
       height="4.868334"
       ry="1.058333"
       stroke-linecap="round"
       stroke-linejoin="round"
       stroke-miterlimit="5.6"
       stroke-width=".423333"
       width="6.985"
       x=".740833"
       y="2.592917"
       id="rect278" />
    <path
       d="m2.3283332 2.6458334v-1.0955046c1.0885716-1.08708535 2.7214288-1.08708535 3.81 0v1.0955046"
       stroke-linejoin="round"
       stroke-width=".423334"
       id="path280" />
    <g
       stroke-width="1.05833"
       id="g286">
      <path
         d="m4.2333334 3.4395834v3.1750001"
         id="path282" />
      <path
         d="m2.6458334 5.0270834h3.175"
         id="path284" />
    </g>
  </g>
</svg>
