<?xml version="1.0" encoding="UTF-8" standalone="no"?>
<svg
   height="64"
   width="64"
   version="1.1"
   id="svg759"
   sodipodi:docname="Grid_13_64.svg"
   inkscape:export-filename="Grid_13_64.png"
   inkscape:export-xdpi="96"
   inkscape:export-ydpi="96"
   inkscape:version="1.2.1 (9c6d41e410, 2022-07-14)"
   xmlns:inkscape="http://www.inkscape.org/namespaces/inkscape"
   xmlns:sodipodi="http://sodipodi.sourceforge.net/DTD/sodipodi-0.dtd"
   xmlns="http://www.w3.org/2000/svg"
   xmlns:svg="http://www.w3.org/2000/svg">
  <defs
     id="defs763" />
  <sodipodi:namedview
     id="namedview761"
     pagecolor="#ffffff"
     bordercolor="#666666"
     borderopacity="1.0"
     inkscape:showpageshadow="2"
     inkscape:pageopacity="0.0"
     inkscape:pagecheckerboard="0"
     inkscape:deskcolor="#d1d1d1"
     showgrid="true"
     inkscape:zoom="14.34375"
     inkscape:cx="31.965142"
     inkscape:cy="32"
     inkscape:current-layer="svg759">
    <inkscape:grid
       type="xygrid"
       id="grid986" />
  </sodipodi:namedview>
  <g
     fill="none"
     stroke="#00aad4"
     id="g757">
    <path
       d="m13.6 1.6h36.799998v60.8h-36.799998z"
       stroke-dashoffset="1.5"
       stroke-linecap="round"
       stroke-linejoin="round"
       stroke-width="3.2"
       id="path735" />
    <path
       d="m13 13.6h38"
       stroke-width="3.2"
       id="path737" />
    <path
       d="m25.59999 1v62"
       stroke-width="3.19998"
       id="path739" />
    <path
       d="m51 49.6h-38"
       stroke-width="3.2"
       id="path741" />
    <path
       d="m37.59999 1v62"
       stroke-width="3.19998"
       id="path743" />
    <g
       stroke-width="3.2"
       id="g755">
      <path
         d="m13 37.6h38"
         id="path745" />
      <path
         d="m13 25.6h38"
         id="path747" />
      <g
         stroke-linecap="round"
         stroke-linejoin="round"
         id="g753">
        <path
           d="m62.4 40.8-8.800066-8.799336 8.800066-8.800664"
           id="path749" />
        <path
           d="m1.6 40.8 8.800066-8.799336-8.800066-8.800664"
           id="path751" />
      </g>
    </g>
  </g>
</svg>
