<?xml version="1.0" encoding="UTF-8" standalone="no"?>
<svg
   height="64"
   width="64"
   version="1.1"
   id="svg16"
   sodipodi:docname="File_22_64.svg"
   inkscape:export-filename="File_22_64.png"
   inkscape:export-xdpi="96"
   inkscape:export-ydpi="96"
   inkscape:version="1.2.2 (732a01da63, 2022-12-09)"
   xmlns:inkscape="http://www.inkscape.org/namespaces/inkscape"
   xmlns:sodipodi="http://sodipodi.sourceforge.net/DTD/sodipodi-0.dtd"
   xmlns="http://www.w3.org/2000/svg"
   xmlns:svg="http://www.w3.org/2000/svg">
  <defs
     id="defs20">
    <radialGradient
       id="a"
       cx="9.1740294"
       cy="7.8253603"
       gradientTransform="matrix(0.66909781,-2.2758851e-8,4.5190518e-8,0.58542853,1.8616763,4.291566)"
       gradientUnits="userSpaceOnUse"
       r="7.5"
       fx="9.1740294"
       fy="7.8253603">
      <stop
         offset="0"
         stop-color="#fff"
         id="stop2" />
      <stop
         offset="1"
         stop-color="#8fc1c7"
         id="stop4" />
    </radialGradient>
  </defs>
  <sodipodi:namedview
     id="namedview18"
     pagecolor="#ffffff"
     bordercolor="#666666"
     borderopacity="1.0"
     inkscape:pageshadow="2"
     inkscape:pageopacity="0.0"
     inkscape:pagecheckerboard="0"
     inkscape:deskcolor="#d1d1d1"
     showgrid="true"
     inkscape:zoom="14.21875"
     inkscape:cx="31.718681"
     inkscape:cy="32"
     inkscape:current-layer="svg16"
     inkscape:showpageshadow="2">
    <inkscape:grid
       type="xygrid"
       id="grid1649" />
  </sodipodi:namedview>
  <rect
     style="fill:#ebfcff;fill-opacity:1;stroke:#00aad4;stroke-width:2.9;stroke-linejoin:round;stroke-dasharray:none;stroke-opacity:1"
     id="rect979-8"
     width="43.099998"
     height="54.099998"
     x="8.4499998"
     y="4.4499998"
     ry="4.3000002" />
  <circle
     cx="45.999996"
     cy="46.000004"
     r="16.4"
     stroke-dashoffset="1.49998"
     stroke-linejoin="round"
     stroke-width="3.19999"
     transform="matrix(0,1,1,0,0,0)"
     id="circle806"
     style="fill:#ffffff;stroke:#00aad4;stroke-linecap:round" />
  <path
     d="M 46,38 V 54"
     id="path808"
     style="fill:none;stroke:#00aad4;stroke-width:3.2;stroke-linecap:round;stroke-dasharray:none" />
  <path
     d="M 54,46 H 38"
     id="path810"
     style="fill:none;stroke:#00aad4;stroke-width:3.2;stroke-linecap:round;stroke-dasharray:none" />
</svg>
