<?xml version="1.0" encoding="UTF-8" standalone="no"?>
<svg
   height="36"
   width="36"
   version="1.1"
   id="svg163"
   sodipodi:docname="Window_01_36.svg"
   inkscape:export-filename="Window_01_36.png"
   inkscape:export-xdpi="96"
   inkscape:export-ydpi="96"
   inkscape:version="1.2-beta (1b65182ce9, 2022-04-05)"
   xmlns:inkscape="http://www.inkscape.org/namespaces/inkscape"
   xmlns:sodipodi="http://sodipodi.sourceforge.net/DTD/sodipodi-0.dtd"
   xmlns="http://www.w3.org/2000/svg"
   xmlns:svg="http://www.w3.org/2000/svg">
  <defs
     id="defs167" />
  <sodipodi:namedview
     id="namedview165"
     pagecolor="#ffffff"
     bordercolor="#666666"
     borderopacity="1.0"
     inkscape:pageshadow="2"
     inkscape:pageopacity="0.0"
     inkscape:pagecheckerboard="0"
     inkscape:deskcolor="#d1d1d1"
     showgrid="true"
     inkscape:zoom="25.5"
     inkscape:cx="17.72549"
     inkscape:cy="18"
     inkscape:current-layer="svg163">
    <inkscape:grid
       type="xygrid"
       id="grid903" />
  </sodipodi:namedview>
  <path
     d="M 10,30 V 10 h 11 l 5,5 v 15 z"
     id="path147"
     style="fill:none;stroke:#00aad4;stroke-width:2;stroke-dasharray:none"
     sodipodi:nodetypes="cccccc" />
  <path
     d="m 13.5,17 h 9"
     id="path149"
     style="fill:none;stroke:#00aad4;stroke-width:2;stroke-dasharray:none" />
  <path
     d="m 1.125,1.125 h 33.75 v 33.75 H 1.125 Z"
     stroke-dashoffset="1.49998"
     stroke-linecap="round"
     id="path151"
     style="fill:none;stroke:#00aad4;stroke-width:2.25" />
  <path
     d="m 1.125,1.125 h 33.75 v 3.75 H 1.125 Z"
     fill="#00aad4"
     stroke-dashoffset="1.49998"
     stroke-linecap="round"
     stroke-width="2.24998"
     id="path155"
     style="stroke:#00aad4" />
  <path
     d="m 13.5,25 h 9"
     fill="none"
     stroke-width="2.25"
     id="path157"
     style="stroke:#00aad4;stroke-width:2;stroke-dasharray:none" />
  <path
     d="m 13.5,21 h 9"
     fill="none"
     stroke-width="2.25"
     id="path159"
     style="stroke:#00aad4;stroke-width:2;stroke-dasharray:none" />
</svg>
