<?xml version="1.0" encoding="UTF-8" standalone="no"?>
<svg
   width="24"
   height="24"
   version="1.1"
   viewBox="0 0 24 24"
   id="svg13"
   sodipodi:docname="tchecklistbox.svg"
   inkscape:export-filename="tchecklistbox.png"
   inkscape:export-xdpi="96"
   inkscape:export-ydpi="96"
   inkscape:version="1.3.2 (091e20e, 2023-11-25, custom)"
   xmlns:inkscape="http://www.inkscape.org/namespaces/inkscape"
   xmlns:sodipodi="http://sodipodi.sourceforge.net/DTD/sodipodi-0.dtd"
   xmlns="http://www.w3.org/2000/svg"
   xmlns:svg="http://www.w3.org/2000/svg">
  <defs
     id="defs13" />
  <sodipodi:namedview
     id="namedview13"
     pagecolor="#ffffff"
     bordercolor="#000000"
     borderopacity="0.25"
     inkscape:showpageshadow="2"
     inkscape:pageopacity="0.0"
     inkscape:pagecheckerboard="0"
     inkscape:deskcolor="#d1d1d1"
     showgrid="true"
     inkscape:current-layer="svg13">
    <inkscape:grid
       id="grid13"
       units="px"
       originx="0"
       originy="0"
       spacingx="0.5"
       spacingy="0.5"
       empcolor="#0099e5"
       empopacity="0.30196078"
       color="#0099e5"
       opacity="0.14901961"
       empspacing="2"
       dotted="false"
       gridanglex="30"
       gridanglez="30"
       visible="true" />
  </sodipodi:namedview>
  <rect
     x="2.25"
     y="3.25"
     width="18.5"
     height="18.5"
     fill="#f9f9f9"
     stroke="#2a7efe"
     stroke-width="0.5"
     style="paint-order:normal"
     id="rect1" />
  <rect
     x="17.25"
     y="3.25"
     width="3.5"
     height="18.5"
     fill="#e6e6e6"
     stroke="#2a7efe"
     stroke-width="0.5"
     style="fill:#e6e6e6;fill-opacity:1;paint-order:normal"
     id="rect8" />
  <path
     style="fill:#e6e6e6;fill-opacity:1;stroke:#2a7efe;stroke-width:1;stroke-linecap:round;stroke-linejoin:round;stroke-dasharray:none;stroke-opacity:1"
     d="m 19,6.5 v 6"
     id="path5" />
  <path
     d="M 9.5,10.5 H 15"
     fill="#b3b3b3"
     stroke="#b3b3b3"
     id="path6"
     sodipodi:nodetypes="cc" />
  <path
     d="M 9.5,18.5 H 15"
     fill="#b3b3b3"
     stroke="#b3b3b3"
     id="path7"
     sodipodi:nodetypes="cc" />
  <path
     d="M 9.5,14.5 H 15"
     fill="#b3b3b3"
     stroke="#b3b3b3"
     stroke-width="0.999997"
     id="path8"
     sodipodi:nodetypes="cc" />
  <path
     d="M 4.2,10.2 5.5,11.5 8,9"
     fill="none"
     stroke="#333333"
     stroke-width=".7"
     id="path9" />
  <path
     d="M 4.2,18.200513 5.5,19.5 8,17"
     fill="none"
     stroke="#333333"
     stroke-width=".7"
     id="path10" />
  <path
     d="M 4.2,14.200513 5.5,15.5 8,13"
     fill="none"
     stroke="#333333"
     stroke-width=".7"
     id="path11" />
  <path
     d="M 9.5,6.5 H 15"
     fill="#b3b3b3"
     stroke="#b3b3b3"
     id="path12"
     sodipodi:nodetypes="cc" />
  <path
     d="M 4.2,6.200513 5.5,7.5 8,5"
     fill="none"
     stroke="#333333"
     stroke-width=".7"
     id="path13" />
</svg>
