<?xml version="1.0" encoding="UTF-8" standalone="no"?>
<svg
   height="32"
   viewBox="0 0 8.4667 8.4667"
   width="32"
   version="1.1"
   id="svg497"
   sodipodi:docname="Setup_08_32.svg"
   inkscape:version="1.2.2 (732a01da63, 2022-12-09)"
   xmlns:inkscape="http://www.inkscape.org/namespaces/inkscape"
   xmlns:sodipodi="http://sodipodi.sourceforge.net/DTD/sodipodi-0.dtd"
   xmlns="http://www.w3.org/2000/svg"
   xmlns:svg="http://www.w3.org/2000/svg">
  <defs
     id="defs501" />
  <sodipodi:namedview
     id="namedview499"
     pagecolor="#ffffff"
     bordercolor="#000000"
     borderopacity="0.25"
     inkscape:showpageshadow="2"
     inkscape:pageopacity="0.0"
     inkscape:pagecheckerboard="0"
     inkscape:deskcolor="#d1d1d1"
     showgrid="true"
     inkscape:zoom="28.4375"
     inkscape:cx="15.982418"
     inkscape:cy="16"
     inkscape:current-layer="svg497">
    <inkscape:grid
       type="xygrid"
       id="grid1076" />
  </sodipodi:namedview>
  <radialGradient
     id="a"
     cx="7.487501"
     cy="6.25"
     gradientTransform="matrix(-.00000007 .63500238 -.63500228 -.00000018 9.022326 .034396)"
     gradientUnits="userSpaceOnUse"
     r="2.25">
    <stop
       offset="0"
       stop-color="#fce99c"
       id="stop467" />
    <stop
       offset="1"
       stop-color="#fc0"
       id="stop469" />
  </radialGradient>
  <radialGradient
     id="b"
     cx="7.487501"
     cy="6.25"
     gradientTransform="matrix(-.00000005 .63500238 -.63500238 -.00000007 6.905652 .034395)"
     gradientUnits="userSpaceOnUse"
     r="2.25">
    <stop
       offset="0"
       stop-color="#a0c2f8"
       id="stop472" />
    <stop
       offset="1"
       stop-color="#2672e5"
       id="stop474" />
  </radialGradient>
  <radialGradient
     id="c"
     cx="7.487501"
     cy="6.25"
     gradientTransform="matrix(-.00000004 .63500238 -.63500238 -.00000011 7.963989 -2.082279)"
     gradientUnits="userSpaceOnUse"
     r="2.25">
    <stop
       offset="0"
       stop-color="#f99"
       id="stop477" />
    <stop
       offset="1"
       stop-color="#d40000"
       id="stop479" />
  </radialGradient>
  <radialGradient
     id="d"
     cx="5"
     cy="11"
     gradientTransform="matrix(-.00000001 .72760681 -.72760681 -.00000002 10.64953 -.992196)"
     gradientUnits="userSpaceOnUse"
     r="8.000001">
    <stop
       offset="0"
       stop-color="#e5e5e5"
       id="stop482" />
    <stop
       offset="1"
       stop-color="#b3b3b3"
       id="stop484" />
  </radialGradient>
  <g
     stroke-width=".264584"
     id="g495">
    <path
       d="m8.3339618 5.3609117-.7931435-.7007512-.0003175-.8535881.7939092-.7010475-.4036837-.9745801-1.0570784.0656794-.6033619-.603795.0653164-1.05635841-.9746849-.40372782-.7007504.79314389-.8535889.0003175-.7010469-.7939096-.9745807.4036847.0656635 1.05709364-.6037948.6033617-1.05634361-.0653317-.40372712.9746843.79314366.7007734.00030692.8535881-.79390932.7010252.40368436.974581 1.05709441-.0656646.6033616.6037958-.0653322 1.0563431.9746846.4037269.7007507-.7931433.8535888-.0003175.7010473.7939095.9745801-.4036835-.065663-1.057095.6037948-.6033624 1.0563428.0653327z"
       fill="url(#d)"
       stroke="#b3b3b3"
       stroke-linejoin="round"
       id="path487" />
    <circle
       cx="4.233349"
       cy="2.910428"
       fill="url(#c)"
       r="1.19063"
       stroke="#a00"
       id="circle489" />
    <circle
       cx="3.175012"
       cy="5.027103"
       fill="url(#b)"
       r="1.19063"
       stroke="#0055d4"
       id="circle491" />
    <circle
       cx="5.291688"
       cy="5.027103"
       fill="url(#a)"
       r="1.19063"
       stroke="#d4aa00"
       id="circle493" />
  </g>
</svg>
