<svg width="64" height="64" version="1.1" viewBox="0 0 64 64" xmlns="http://www.w3.org/2000/svg">
 <g>
  <path d="m31.000001 26.999998v12.000001h-4v4h-2v18.000001h35.999999v-18.000001h-1.999999v-4h-4v-12.000001z" fill="none" stroke="#ffffff" stroke-linejoin="round" stroke-width="6"/>
  <path d="m32 40h-4v4h4z" fill="#cccccc" stroke="#b3b3b3" stroke-linejoin="round" stroke-width="2"/>
  <path d="m58 44v-4h-4v4z" fill="#cccccc" stroke="#b3b3b3" stroke-linejoin="round" stroke-width="2"/>
  <path d="m32.4 43v-14.6h21.2v14.6" fill="#ffffff" stroke="#6995db" stroke-width="2.8"/>
  <path d="m26.49999 44.49999h33.00002v15.00002h-33.00002z" fill="#e6e6e6" stroke="#999999" stroke-linecap="round" stroke-linejoin="round" stroke-width="2.99998"/>
  <path d="m37 34h12" fill="none" stroke="#b3b3b3" stroke-linecap="round" stroke-width="2"/>
  <path d="m52 54h2" fill="none" stroke="#ff0000" stroke-linecap="round" stroke-width="2"/>
  <path d="m37 38h12" fill="none" stroke="#b3b3b3" stroke-linecap="round" stroke-width="2"/>
 </g>
</svg>
