<?xml version="1.0" encoding="UTF-8" standalone="no"?>
<svg
   height="32"
   width="32"
   version="1.1"
   id="svg299"
   sodipodi:docname="btn_ignore_200.svg"
   inkscape:export-filename="btn_ignore_200.png"
   inkscape:export-xdpi="96"
   inkscape:export-ydpi="96"
   inkscape:version="1.2.2 (732a01da63, 2022-12-09)"
   xmlns:inkscape="http://www.inkscape.org/namespaces/inkscape"
   xmlns:sodipodi="http://sodipodi.sourceforge.net/DTD/sodipodi-0.dtd"
   xmlns="http://www.w3.org/2000/svg"
   xmlns:svg="http://www.w3.org/2000/svg">
  <defs
     id="defs303" />
  <sodipodi:namedview
     id="namedview301"
     pagecolor="#ffffff"
     bordercolor="#666666"
     borderopacity="1.0"
     inkscape:showpageshadow="2"
     inkscape:pageopacity="0.0"
     inkscape:pagecheckerboard="0"
     inkscape:deskcolor="#d1d1d1"
     showgrid="true"
     inkscape:zoom="28.6875"
     inkscape:cx="15.982571"
     inkscape:cy="16"
     inkscape:current-layer="svg299">
    <inkscape:grid
       type="xygrid"
       id="grid526" />
  </sodipodi:namedview>
  <radialGradient
     id="a"
     cx="15.999998"
     cy="16"
     gradientUnits="userSpaceOnUse"
     r="15">
    <stop
       offset="0"
       stop-color="#f60"
       id="stop284" />
    <stop
       offset=".69999999"
       stop-color="#ff8832"
       id="stop286" />
    <stop
       offset="1"
       stop-color="#fca"
       id="stop288" />
  </radialGradient>
  <circle
     cx="16"
     cy="16"
     fill="url(#a)"
     r="15"
     stroke-width="2.5"
     id="circle291" />
  <g
     transform="matrix(2 0 0 2 2 4.666666)"
     id="g297">
    <ellipse
       cx="7"
       cy="-2.166667"
       fill="#fff"
       fill-rule="evenodd"
       rx=".999904"
       ry="1"
       stroke-width=".499976"
       transform="scale(1 -1)"
       id="ellipse293" />
    <path
       d="m7 5.6666667v3.5"
       fill="none"
       stroke="#fff"
       stroke-linecap="round"
       stroke-width="2"
       id="path295" />
  </g>
</svg>
