<?xml version="1.0" encoding="UTF-8" standalone="no"?>
<svg
   height="16"
   viewBox="0 0 4.2333332 4.2333335"
   width="16"
   version="1.1"
   id="svg2"
   sodipodi:docname="Phone_02_16.svg"
   inkscape:version="1.2 (dc2aedaf03, 2022-05-15)"
   inkscape:export-filename="Phone_02_16.png"
   inkscape:export-xdpi="96"
   inkscape:export-ydpi="96"
   xmlns:inkscape="http://www.inkscape.org/namespaces/inkscape"
   xmlns:sodipodi="http://sodipodi.sourceforge.net/DTD/sodipodi-0.dtd"
   xmlns="http://www.w3.org/2000/svg"
   xmlns:svg="http://www.w3.org/2000/svg">
  <defs
     id="defs6">
    <radialGradient
       id="a"
       cx="12.1"
       cy="10.900001"
       gradientTransform="matrix(0,0.4988777,-0.49887766,0,6.8809486,-4.5932389)"
       gradientUnits="userSpaceOnUse"
       r="4.5">
      <stop
         offset="0"
         stop-color="#ff7f2a"
         id="stop962" />
      <stop
         offset="1"
         stop-color="#d45500"
         id="stop964" />
    </radialGradient>
  </defs>
  <sodipodi:namedview
     id="namedview4"
     pagecolor="#ffffff"
     bordercolor="#666666"
     borderopacity="1.0"
     inkscape:showpageshadow="2"
     inkscape:pageopacity="0.0"
     inkscape:pagecheckerboard="0"
     inkscape:deskcolor="#d1d1d1"
     showgrid="true"
     inkscape:zoom="57.375"
     inkscape:cx="6.8845316"
     inkscape:cy="8"
     inkscape:current-layer="svg2">
    <inkscape:grid
       type="xygrid"
       id="grid1292" />
  </sodipodi:namedview>
  <circle
     cx="2.1166668"
     cy="2.1166666"
     fill="url(#a)"
     r="1.8520834"
     stroke-dashoffset="1.49998"
     stroke-linejoin="round"
     stroke-width="0.286632"
     transform="matrix(0,1,1,0,0,0)"
     id="circle967"
     style="fill:url(#a);stroke:#ffccaa;stroke-width:0.264583;stroke-linecap:round;stroke-dasharray:none" />
  <path
     id="path363"
     style="fill:#ffffff;fill-opacity:1;stroke:#ffffff;stroke-width:0.264583px;stroke-linecap:round;stroke-linejoin:round;stroke-opacity:1"
     d="M 1.5587095,1.1906497 C 1.4398675,1.2331927 1.283299,1.3846338 1.2290148,1.5203433 1.0364665,2.0017126 1.6494333,2.5839308 1.6494333,2.5839308 c 0,0 0.5821612,0.6129061 1.0635325,0.4203585 0.1357096,-0.054284 0.287201,-0.2108022 0.329745,-0.3296434 L 2.7087974,2.3749318 C 2.6125232,2.4712057 2.2609124,2.7900777 1.8520833,2.38125 1.4432461,1.9724142 1.7621506,1.6208358 1.8584248,1.524562 Z"
     sodipodi:nodetypes="cscsccscc" />
</svg>
