<?xml version="1.0" encoding="UTF-8" standalone="no"?>
<svg
   height="16"
   width="16"
   version="1.1"
   id="svg441"
   sodipodi:docname="Window_01_16.svg"
   inkscape:export-filename="Window_01_16.png"
   inkscape:export-xdpi="96"
   inkscape:export-ydpi="96"
   inkscape:version="1.2-beta (1b65182ce9, 2022-04-05)"
   xmlns:inkscape="http://www.inkscape.org/namespaces/inkscape"
   xmlns:sodipodi="http://sodipodi.sourceforge.net/DTD/sodipodi-0.dtd"
   xmlns="http://www.w3.org/2000/svg"
   xmlns:svg="http://www.w3.org/2000/svg">
  <defs
     id="defs445" />
  <sodipodi:namedview
     id="namedview443"
     pagecolor="#ffffff"
     bordercolor="#666666"
     borderopacity="1.0"
     inkscape:pageshadow="2"
     inkscape:pageopacity="0.0"
     inkscape:pagecheckerboard="0"
     inkscape:deskcolor="#d1d1d1"
     showgrid="true"
     inkscape:zoom="57.375"
     inkscape:cx="8"
     inkscape:cy="8"
     inkscape:current-layer="svg441">
    <inkscape:grid
       type="xygrid"
       id="grid875" />
  </sodipodi:namedview>
  <g
     stroke="#00aad4"
     id="g439">
    <g
       fill="none"
       id="g431">
      <path
         d="m4.5 13.5v-9h5l2 2v7z"
         id="path425" />
      <path
         d="m6 7.5h4"
         id="path427" />
      <path
         d="m.5.5h15v15h-15z"
         stroke-dashoffset="1.49998"
         stroke-linecap="round"
         id="path429" />
    </g>
    <path
       d="m.5.5h15v1.5h-15z"
       fill="#00aad4"
       stroke-dashoffset="1.49998"
       stroke-linecap="round"
       id="path433" />
    <path
       d="m6 11.5h4"
       fill="none"
       id="path435" />
    <path
       d="m6 9.5h4"
       fill="none"
       id="path437" />
  </g>
</svg>
