<?xml version="1.0" encoding="UTF-8" standalone="no"?>
<svg
   height="36"
   width="36"
   version="1.1"
   id="svg441"
   sodipodi:docname="Font_03_36.svg"
   inkscape:export-filename="Font_03_36.png"
   inkscape:export-xdpi="96"
   inkscape:export-ydpi="96"
   inkscape:version="1.2 (dc2aedaf03, 2022-05-15)"
   xmlns:inkscape="http://www.inkscape.org/namespaces/inkscape"
   xmlns:sodipodi="http://sodipodi.sourceforge.net/DTD/sodipodi-0.dtd"
   xmlns="http://www.w3.org/2000/svg"
   xmlns:svg="http://www.w3.org/2000/svg">
  <defs
     id="defs445" />
  <sodipodi:namedview
     id="namedview443"
     pagecolor="#ffffff"
     bordercolor="#666666"
     borderopacity="1.0"
     inkscape:pageshadow="2"
     inkscape:pageopacity="0.0"
     inkscape:pagecheckerboard="0"
     inkscape:deskcolor="#d1d1d1"
     showgrid="true"
     inkscape:zoom="25.5"
     inkscape:cx="16.078431"
     inkscape:cy="18"
     inkscape:current-layer="svg441"
     inkscape:showpageshadow="2">
    <inkscape:grid
       type="xygrid"
       id="grid980" />
  </sodipodi:namedview>
  <g
     id="g1045">
    <circle
       cx="25.875"
       cy="25.875"
       r="9"
       stroke-dashoffset="3.37495"
       stroke-linejoin="round"
       stroke-width="2.25"
       id="circle429"
       style="fill:none;stroke:#00aad4;stroke-linecap:round" />
    <path
       d="m 25.875001,21.374999 v 9.000003"
       id="path431"
       style="fill:none;stroke:#00aad4;stroke-width:2.25;stroke-linecap:round" />
    <path
       d="M 30.375002,25.875 H 21.374999"
       id="path433"
       style="fill:none;stroke:#00aad4;stroke-width:2.25;stroke-linecap:round" />
  </g>
  <path
     id="path2-6"
     style="fill:#00aad4;stroke:none;stroke-width:8.48289"
     d="M 13.273056,1.6873528 1.5,34.312647 H 4.5102811 L 7.7842365,25.281805 C 7.8879062,24.986146 8.1677284,24.78728 8.4829732,24.785221 h 5.4269738 l 0.769103,-2.772979 -4.666761,2e-6 c -0.5140043,-0.002 -0.8716202,-0.508068 -0.698742,-0.98878 L 14.301385,7.0882806 c 0.103672,-0.2956617 0.383498,-0.4945297 0.698741,-0.4965867 0.315244,0.00206 0.595069,0.2009268 0.698733,0.4965867 L 18.952136,16.088188 21.4575,14.798045 16.727189,1.6873528 Z"
     sodipodi:nodetypes="cccccccccccccccc" />
</svg>
