<?xml version="1.0" encoding="UTF-8" standalone="no"?>
<svg
   height="36"
   width="36"
   version="1.1"
   id="svg23"
   sodipodi:docname="File_01_36.svg"
   inkscape:export-filename="File_01_36.png"
   inkscape:export-xdpi="96"
   inkscape:export-ydpi="96"
   inkscape:version="1.2-beta (1b65182ce9, 2022-04-05)"
   xmlns:inkscape="http://www.inkscape.org/namespaces/inkscape"
   xmlns:sodipodi="http://sodipodi.sourceforge.net/DTD/sodipodi-0.dtd"
   xmlns="http://www.w3.org/2000/svg"
   xmlns:svg="http://www.w3.org/2000/svg">
  <defs
     id="defs27" />
  <sodipodi:namedview
     id="namedview25"
     pagecolor="#ffffff"
     bordercolor="#666666"
     borderopacity="1.0"
     inkscape:pageshadow="2"
     inkscape:pageopacity="0.0"
     inkscape:pagecheckerboard="0"
     inkscape:deskcolor="#d1d1d1"
     showgrid="true"
     inkscape:zoom="25.5"
     inkscape:cx="18"
     inkscape:cy="18"
     inkscape:current-layer="svg23">
    <inkscape:grid
       type="xygrid"
       id="grid298" />
  </sodipodi:namedview>
  <linearGradient
     id="a"
     gradientTransform="matrix(2.3181818,0,0,2.3076922,-0.545454,-0.461538)"
     gradientUnits="userSpaceOnUse"
     x1="3.470588"
     x2="12.529412"
     y1="2.15"
     y2="13.85">
    <stop
       offset="0"
       stop-color="#fff"
       id="stop2" />
    <stop
       offset="1"
       stop-color="#dfeaf4"
       id="stop4" />
  </linearGradient>
  <path
     d="M 6.75,32.25 V 3.75 H 24 l 5.25,6 v 22.5 z"
     fill="url(#a)"
     fill-rule="evenodd"
     stroke="#75a4d3"
     stroke-linecap="square"
     id="path7"
     style="fill:url(#a);stroke-width:1.5" />
  <path
     d="M 10,11.5 H 26"
     fill="none"
     stroke="#0066ff"
     stroke-width="3"
     id="path9"
     sodipodi:nodetypes="cc" />
  <path
     d="M 10.749999,13 V 27.25 H 25.25 V 13"
     fill="#ffffff"
     fill-rule="evenodd"
     stroke="#87aade"
     id="path11"
     style="stroke-width:1.5"
     sodipodi:nodetypes="cccc" />
  <g
     fill="none"
     stroke="#b3b3b3"
     id="g19"
     transform="matrix(1.5,0,0,1.5,-0.500001,-36.5)">
    <path
       d="M 7.9999995,35.5 H 16.666667"
       id="path13"
       sodipodi:nodetypes="cc" />
    <path
       d="M 7.9999995,38.500001 H 16.666667"
       id="path15"
       sodipodi:nodetypes="cc" />
    <path
       d="m 11.5,33 v 8.999999"
       id="path17" />
  </g>
</svg>
