<svg width="48" height="48" version="1.1" xmlns="http://www.w3.org/2000/svg">
 <path d="m37.42182 33.499997a3.9218204 3.9218204 0 0 1 -3.92182 3.92182 3.9218204 3.9218204 0 0 1 -3.92182-3.92182 3.9218204 3.9218204 0 0 1 3.92182-3.921821 3.9218204 3.9218204 0 0 1 3.92182 3.921821zm-9.328173-7.571674-2.162922 2.163525-3.860173-.981561-1.170601 2.826081 3.423622 2.035487-.000425 3.05926-3.420639 2.031279 1.170726 2.826385 3.855088-.982426 2.163525 2.162922-.981561 3.860174 2.826082 1.170599 2.035486-3.423619 3.05926.000423 2.031279 3.420639 2.826385-1.170724-.982426-3.855091 2.162922-2.163525 3.860174.981562 1.170599-2.826081-3.423619-2.035486.000423-3.05926 3.420639-2.031281-1.170727-2.826383-3.855088.982425-2.163525-2.162922.981562-3.860174-2.826081-1.1706-2.035489 3.423621-3.059257-.000424-2.03128-3.42064-2.826384 1.170727z" fill="#3771c8" stroke="#fffffe" stroke-dashoffset="1.49998" stroke-linejoin="round" stroke-width="3.8" style="paint-order:stroke fill markers"/>
</svg>
