<svg width="24" height="24" version="1.1" viewBox="0 0 6.35 6.35" xmlns="http://www.w3.org/2000/svg">
 <rect x=".36380163" y="1.1575519" width="5.622396" height="4.2994795" rx=".45952311" fill="#ebfcff" stroke="#00aad4" stroke-linejoin="round" stroke-width=".198437"/>
 <path d="m4.0878121 2.8111971 0.7143874 0.4960931-0.7143874 0.4960929" fill="none" stroke="#0088aa" stroke-linecap="round" stroke-linejoin="round" stroke-width=".3175"/>
 <path d="m3.5300227 2.2754167-0.7100449 2.0637469" fill="none" stroke="#0088aa" stroke-linecap="round" stroke-linejoin="round" stroke-width=".3175"/>
 <path d="m2.2621879 2.8111971-0.7143873 0.4960931 0.7143873 0.4960929" fill="none" stroke="#0088aa" stroke-linecap="round" stroke-linejoin="round" stroke-width=".3175"/>
</svg>
