<?xml version="1.0" encoding="UTF-8" standalone="no"?>
<svg
   width="36"
   height="36"
   version="1.1"
   viewBox="0 0 36 36"
   id="svg257"
   sodipodi:docname="tidletimer_150.svg"
   inkscape:export-filename="tidletimer_150.png"
   inkscape:export-xdpi="96"
   inkscape:export-ydpi="96"
   inkscape:version="1.2.1 (9c6d41e410, 2022-07-14)"
   xmlns:inkscape="http://www.inkscape.org/namespaces/inkscape"
   xmlns:sodipodi="http://sodipodi.sourceforge.net/DTD/sodipodi-0.dtd"
   xmlns="http://www.w3.org/2000/svg"
   xmlns:svg="http://www.w3.org/2000/svg">
  <sodipodi:namedview
     id="namedview259"
     pagecolor="#ffffff"
     bordercolor="#666666"
     borderopacity="1.0"
     inkscape:showpageshadow="2"
     inkscape:pageopacity="0.0"
     inkscape:pagecheckerboard="0"
     inkscape:deskcolor="#d1d1d1"
     showgrid="true"
     inkscape:zoom="25.5"
     inkscape:cx="17.980392"
     inkscape:cy="18"
     inkscape:current-layer="svg257">
    <inkscape:grid
       type="xygrid"
       id="grid839" />
  </sodipodi:namedview>
  <defs
     id="defs207">
    <radialGradient
       id="radialGradient892"
       cx="8.8011"
       cy="1037"
       r="9"
       gradientTransform="matrix(0.33332,1.5,-1.5,0.33333,1530.8,-382.6)"
       gradientUnits="userSpaceOnUse">
      <stop
         stop-color="#ccc"
         offset="0"
         id="stop195" />
      <stop
         stop-color="#fff"
         offset="1"
         id="stop197" />
    </radialGradient>
    <linearGradient
       id="linearGradient851"
       x1="9"
       x2="14"
       y1="1030.4"
       y2="1030.4"
       gradientTransform="matrix(1.5 0 0 1.5 .75 -1543.1)"
       gradientUnits="userSpaceOnUse">
      <stop
         stop-color="#808080"
         offset="0"
         id="stop200" />
      <stop
         stop-color="#e6e6e6"
         offset=".40312"
         id="stop202" />
      <stop
         stop-color="#808080"
         offset="1"
         id="stop204" />
    </linearGradient>
  </defs>
  <path
     d="m14 4v-3h8v3z"
     fill="url(#linearGradient851)"
     fill-rule="evenodd"
     stroke-width="0"
     id="path209" />
  <circle
     cx="18"
     cy="20"
     r="15"
     fill="#808080"
     stroke-width="0"
     style="paint-order:normal"
     id="circle211" />
  <circle
     cx="-18"
     cy="-20"
     r="13.5"
     fill="url(#radialGradient892)"
     style="fill:url(#radialGradient892);paint-order:normal"
     id="circle213"
     transform="scale(-1)" />
  <path
     d="m14.25 1.5h7.5v3h-7.5z"
     fill-opacity="0"
     stroke-width="0"
     id="path215" />
  <path
     d="m16 4h4v2h-4z"
     fill="#808080"
     fill-rule="evenodd"
     id="path217" />
  <path
     d="m13 17.7h6.25l-4.5001 7.5h6.2501"
     fill="none"
     stroke="#fff"
     stroke-linejoin="round"
     stroke-width="3.5"
     id="path219" />
  <path
     d="m14 17.7h5.25l-4.5001 7.5h5.2501"
     fill="none"
     stroke="#f60"
     stroke-linejoin="round"
     stroke-width="1.5"
     id="path221" />
  <circle
     transform="scale(-1,1)"
     cx="-27"
     cy="15"
     r="1"
     fill="#2a7fff"
     style="paint-order:stroke fill markers"
     id="circle223" />
  <circle
     transform="scale(-1,1)"
     cx="-23"
     cy="11"
     r="1"
     fill="#2a7fff"
     style="paint-order:stroke fill markers"
     id="circle225" />
  <g
     fill="none"
     stroke-linejoin="round"
     id="g233">
    <path
       d="m22 9.6h5.3756l-3.7506 6.75h5.375"
       stroke="#fff"
       stroke-width="3.25"
       id="path227" />
    <path
       d="m23.022 9.6h4.375l-3.75 6.7052h4.375"
       stroke="#f60"
       stroke-width="1.2947"
       id="path229" />
    <path
       d="m31 2.5h3.5l-3 5h3.5"
       stroke="#f60"
       id="path231" />
  </g>
  <g
     fill="#2a7fff"
     id="g255">
    <circle
       cx="9"
       cy="15"
       r="1"
       style="paint-order:stroke fill markers"
       id="circle235" />
    <circle
       cx="13"
       cy="11"
       r="1"
       style="paint-order:stroke fill markers"
       id="circle237" />
    <circle
       cx="18"
       cy="30.5"
       r="1"
       style="paint-order:stroke fill markers"
       id="circle239" />
    <circle
       cx="7.5"
       cy="20"
       r="1"
       style="paint-order:stroke fill markers"
       id="circle241" />
    <circle
       cx="28.5"
       cy="20"
       r="1"
       style="paint-order:stroke fill markers"
       id="circle243" />
    <circle
       transform="scale(-1)"
       cx="-27.5"
       cy="-25"
       r="1"
       style="paint-order:stroke fill markers"
       id="circle245" />
    <circle
       transform="scale(-1)"
       cx="-23.5"
       cy="-29"
       r="1"
       style="paint-order:stroke fill markers"
       id="circle247" />
    <circle
       transform="scale(-1,1)"
       cx="-13"
       cy="29"
       r="1"
       style="paint-order:stroke fill markers"
       id="circle249" />
    <circle
       transform="scale(-1,1)"
       cx="-9"
       cy="25"
       r="1"
       style="paint-order:stroke fill markers"
       id="circle251" />
    <circle
       cx="18"
       cy="9.5"
       r="1"
       style="paint-order:stroke fill markers"
       id="circle253" />
  </g>
</svg>
