<?xml version="1.0" encoding="UTF-8" standalone="no"?>
<svg
   width="36"
   height="36"
   version="1.1"
   viewBox="0 0 36 36"
   id="svg7"
   sodipodi:docname="trandomchartsource_150.svg"
   inkscape:version="1.3.2 (091e20e, 2023-11-25, custom)"
   xmlns:inkscape="http://www.inkscape.org/namespaces/inkscape"
   xmlns:sodipodi="http://sodipodi.sourceforge.net/DTD/sodipodi-0.dtd"
   xmlns="http://www.w3.org/2000/svg"
   xmlns:svg="http://www.w3.org/2000/svg">
  <defs
     id="defs7" />
  <sodipodi:namedview
     id="namedview7"
     pagecolor="#ffffff"
     bordercolor="#000000"
     borderopacity="0.25"
     inkscape:showpageshadow="2"
     inkscape:pageopacity="0.0"
     inkscape:pagecheckerboard="0"
     inkscape:deskcolor="#d1d1d1"
     showgrid="true"
     inkscape:current-layer="svg7">
    <inkscape:grid
       id="grid7"
       units="px"
       originx="0"
       originy="0"
       spacingx="0.5"
       spacingy="0.5"
       empcolor="#0099e5"
       empopacity="0.30196078"
       color="#0099e5"
       opacity="0.14901961"
       empspacing="2"
       dotted="false"
       gridanglex="30"
       gridanglez="30"
       visible="true" />
  </sodipodi:namedview>
  <rect
     x="1.5"
     y="2.5"
     width="32"
     height="32"
     fill="#ffffff"
     fill-rule="evenodd"
     stroke="#2a7efe"
     stroke-linecap="square"
     stroke-linejoin="round"
     style="paint-order:normal"
     id="rect1" />
  <path
     d="m4.825 20.3 4.425-7.8 3 12.75 5.25-3.75 5.175 9.675"
     fill="none"
     stroke="#2a7efe"
     stroke-linecap="round"
     stroke-linejoin="round"
     stroke-width="1.65"
     id="path1" />
  <path
     d="m4.75 8v23.25h23.25"
     fill="none"
     stroke="#4d4d4d"
     stroke-linecap="round"
     stroke-linejoin="round"
     stroke-width="1.5"
     id="path2" />
  <path
     d="m26.750005 6.2499927 3.000015 1.5000076-3.000015 1.500007z"
     fill="#ff6600"
     stroke="#ff6600"
     stroke-linecap="round"
     stroke-linejoin="round"
     stroke-width="1.50001"
     id="path3" />
  <path
     d="m26.750005 12.749993 2.967198 1.500008-2.967198 1.500007z"
     fill="#225500"
     stroke="#225500"
     stroke-linecap="round"
     stroke-linejoin="round"
     stroke-width="1.50001"
     id="path4" />
  <path
     d="m26.25007 7.7500003h-2.250011l-7.500037 6.5000007h-4.500022"
     fill="none"
     stroke="#ff6600"
     stroke-linejoin="round"
     stroke-width="1.50001"
     id="path5" />
  <path
     d="M 19.096188,10 16.500022,7.7500003 H 12"
     fill="none"
     stroke="#225500"
     stroke-linejoin="round"
     stroke-width="1.50001"
     id="path6" />
  <path
     d="M 26.25007,14.250001 H 24.000059 L 21.403892,12"
     fill="none"
     stroke="#225500"
     stroke-linejoin="round"
     stroke-width="1.50001"
     id="path7" />
</svg>
