<?xml version="1.0" encoding="UTF-8" standalone="no"?>
<svg
   height="22"
   width="22"
   version="1.1"
   id="svg4736"
   sodipodi:docname="bookmark4_200.svg"
   inkscape:export-filename="bookmark4_200.png"
   inkscape:export-xdpi="96"
   inkscape:export-ydpi="96"
   inkscape:version="1.2.2 (732a01da63, 2022-12-09)"
   xmlns:inkscape="http://www.inkscape.org/namespaces/inkscape"
   xmlns:sodipodi="http://sodipodi.sourceforge.net/DTD/sodipodi-0.dtd"
   xmlns="http://www.w3.org/2000/svg"
   xmlns:svg="http://www.w3.org/2000/svg">
  <defs
     id="defs4740" />
  <sodipodi:namedview
     id="namedview4738"
     pagecolor="#ffffff"
     bordercolor="#666666"
     borderopacity="1.0"
     inkscape:showpageshadow="2"
     inkscape:pageopacity="0.0"
     inkscape:pagecheckerboard="0"
     inkscape:deskcolor="#d1d1d1"
     showgrid="true"
     inkscape:zoom="41.727273"
     inkscape:cx="8.2679738"
     inkscape:cy="11"
     inkscape:current-layer="svg4736">
    <inkscape:grid
       type="xygrid"
       id="grid5005" />
  </sodipodi:namedview>
  <radialGradient
     id="a"
     cx="10.999999"
     cy="11"
     gradientUnits="userSpaceOnUse"
     r="11">
    <stop
       offset="0"
       stop-color="#4881cc"
       id="stop4725" />
    <stop
       offset=".81818181"
       stop-color="#4781cc"
       id="stop4727" />
    <stop
       offset="1"
       stop-color="#569af2"
       id="stop4729" />
  </radialGradient>
  <circle
     cx="11"
     cy="11"
     fill="url(#a)"
     r="11"
     id="circle4732" />
  <path
     d="M 5.9999985,14.115541 11.219247,3.9999985 h 2.245992 L 8.3743279,13.999998 h 7.6256731 v 2 H 5.9999985 Z m 6.0000005,-3.115544 1.999998,10e-7 v 7.000003 h -1.999998 z"
     fill="#ffffff"
     id="path1982"
     style="fill:#ffffff;stroke-width:0.999995"
     sodipodi:nodetypes="ccccccccccccc" />
</svg>
