<?xml version="1.0" encoding="UTF-8" standalone="no"?>
<svg
   height="24"
   width="24"
   version="1.1"
   id="svg135"
   sodipodi:docname="Add_09_24.svg"
   inkscape:export-filename="Add_09_24.png"
   inkscape:export-xdpi="96"
   inkscape:export-ydpi="96"
   inkscape:version="1.2.2 (732a01da63, 2022-12-09)"
   xmlns:inkscape="http://www.inkscape.org/namespaces/inkscape"
   xmlns:sodipodi="http://sodipodi.sourceforge.net/DTD/sodipodi-0.dtd"
   xmlns="http://www.w3.org/2000/svg"
   xmlns:svg="http://www.w3.org/2000/svg">
  <defs
     id="defs139" />
  <sodipodi:namedview
     id="namedview137"
     pagecolor="#ffffff"
     bordercolor="#666666"
     borderopacity="1.0"
     inkscape:showpageshadow="2"
     inkscape:pageopacity="0.0"
     inkscape:pagecheckerboard="0"
     inkscape:deskcolor="#d1d1d1"
     showgrid="true"
     inkscape:zoom="38.25"
     inkscape:cx="12.052288"
     inkscape:cy="12"
     inkscape:current-layer="svg135">
    <inkscape:grid
       type="xygrid"
       id="grid890" />
  </sodipodi:namedview>
  <circle
     cx="12"
     cy="12"
     r="9.96"
     style="fill:#e5ffd5;fill-rule:evenodd;stroke:#01a901;stroke-width:1.88;stroke-linecap:round;stroke-linejoin:round;stroke-dasharray:none"
     id="circle133" />
  <path
     d="m 12,7.5 v 9"
     id="path705"
     style="fill:none;stroke:#01a901;stroke-width:2.5;stroke-linecap:round;stroke-dasharray:none;stroke-opacity:1"
     sodipodi:nodetypes="cc" />
  <path
     d="m 16.5,12 h -9"
     id="path707"
     style="fill:none;stroke:#01a901;stroke-width:2.5;stroke-linecap:round;stroke-dasharray:none;stroke-opacity:1"
     sodipodi:nodetypes="cc" />
</svg>
