<?xml version="1.0" encoding="UTF-8" standalone="no"?>
<svg
   width="36"
   height="36"
   version="1.1"
   viewBox="0 0 36 36"
   id="svg9"
   sodipodi:docname="tcontrolbar_150.svg"
   inkscape:export-filename="tcontrolbar_150.png"
   inkscape:export-xdpi="96"
   inkscape:export-ydpi="96"
   inkscape:version="1.3.2 (091e20e, 2023-11-25, custom)"
   xmlns:inkscape="http://www.inkscape.org/namespaces/inkscape"
   xmlns:sodipodi="http://sodipodi.sourceforge.net/DTD/sodipodi-0.dtd"
   xmlns="http://www.w3.org/2000/svg"
   xmlns:svg="http://www.w3.org/2000/svg">
  <sodipodi:namedview
     id="namedview9"
     pagecolor="#ffffff"
     bordercolor="#000000"
     borderopacity="0.25"
     inkscape:showpageshadow="2"
     inkscape:pageopacity="0.0"
     inkscape:pagecheckerboard="0"
     inkscape:deskcolor="#d1d1d1"
     showgrid="true"
     inkscape:current-layer="svg9">
    <inkscape:grid
       id="grid9"
       units="px"
       originx="0"
       originy="0"
       spacingx="0.5"
       spacingy="0.5"
       empcolor="#0099e5"
       empopacity="0.30196078"
       color="#0099e5"
       opacity="0.14901961"
       empspacing="2"
       dotted="false"
       gridanglex="30"
       gridanglez="30"
       visible="true" />
  </sodipodi:namedview>
  <defs
     id="defs2">
    <linearGradient
       id="a"
       x1="10"
       x2="10"
       y1="1033.3622"
       y2="1047.3622"
       gradientTransform="matrix(1.5,0,0,1.5,0,-1542.5432)"
       gradientUnits="userSpaceOnUse">
      <stop
         stop-color="#ffffff"
         offset="0"
         id="stop1" />
      <stop
         stop-color="#e6e6e6"
         offset="1"
         id="stop2" />
    </linearGradient>
  </defs>
  <rect
     y="5"
     width="36"
     height="26"
     fill="#2a7efe"
     style="paint-order:normal"
     id="rect2"
     x="0" />
  <rect
     y="6"
     width="36"
     height="24"
     fill="url(#a)"
     style="fill:url(#a);paint-order:normal"
     id="rect3"
     x="0" />
  <path
     d="M 8.5,6 V 30"
     fill="#ffffff"
     fill-rule="evenodd"
     stroke="#ffffff"
     stroke-width="1px"
     id="path3" />
  <path
     d="M 9.5,6 V 30"
     fill="#333333"
     fill-rule="evenodd"
     stroke="#999999"
     stroke-width="1px"
     id="path4" />
  <path
     d="M 4.5,9 V 27"
     fill="#ffffff"
     fill-rule="evenodd"
     stroke="#ffffff"
     stroke-width="1px"
     id="path5" />
  <path
     d="M 5.5,9 V 27"
     fill="#333333"
     fill-rule="evenodd"
     stroke="#999999"
     stroke-width="1px"
     id="path6" />
  <path
     d="M 13.5,9 V 27"
     fill="#b3b3b3"
     fill-rule="evenodd"
     stroke="#ffffff"
     stroke-width="1px"
     id="path7" />
  <path
     d="M 14.5,9 V 27"
     fill="#333333"
     fill-rule="evenodd"
     stroke="#999999"
     stroke-width="1px"
     id="path8" />
  <path
     d="m 21.5,10.5 v 15 L 32,18 Z"
     fill="none"
     stroke="#2a7efe"
     stroke-linejoin="round"
     stroke-width="1px"
     id="path9" />
</svg>
