<?xml version="1.0" encoding="UTF-8" standalone="no"?>
<svg
   height="32"
   width="32"
   version="1.1"
   id="svg1633"
   sodipodi:docname="Ok_02_32.svg"
   inkscape:export-filename="Ok_02_32.png"
   inkscape:export-xdpi="96"
   inkscape:export-ydpi="96"
   inkscape:version="1.2-beta (1b65182ce9, 2022-04-05)"
   xmlns:inkscape="http://www.inkscape.org/namespaces/inkscape"
   xmlns:sodipodi="http://sodipodi.sourceforge.net/DTD/sodipodi-0.dtd"
   xmlns="http://www.w3.org/2000/svg"
   xmlns:svg="http://www.w3.org/2000/svg">
  <defs
     id="defs1637" />
  <sodipodi:namedview
     id="namedview1635"
     pagecolor="#ffffff"
     bordercolor="#666666"
     borderopacity="1.0"
     inkscape:pageshadow="2"
     inkscape:pageopacity="0.0"
     inkscape:pagecheckerboard="0"
     inkscape:deskcolor="#d1d1d1"
     showgrid="true"
     inkscape:zoom="28.6875"
     inkscape:cx="15.982571"
     inkscape:cy="16"
     inkscape:current-layer="svg1633">
    <inkscape:grid
       type="xygrid"
       id="grid1894" />
  </sodipodi:namedview>
  <path
     d="m1.5 8.249999 1.75-1.75 3 3 6.5-6.5 1.75 1.75-8.25 8.250002z"
     fill="#71c837"
     fill-rule="evenodd"
     stroke="#008000"
     stroke-opacity=".964706"
     stroke-width=".5"
     transform="scale(2)"
     id="path1631" />
</svg>
