<svg width="24" height="24" version="1.1" xmlns="http://www.w3.org/2000/svg">
 <g transform="matrix(1.1538462 0 0 1.1538462 .923076 .461538)" fill="none" stroke-linecap="round" stroke-linejoin="round">
  <g stroke="#ffffff" stroke-width="4">
   <path d="m9 10h9"/>
   <path d="m14.5 6.5 3.5 3.5-3.5 3.5"/>
  </g>
  <g stroke="#ff0000" stroke-opacity=".996078" stroke-width="2.00002">
   <path d="m9 10h9"/>
   <path d="m14.5 6.5 3.5 3.5-3.5 3.5"/>
  </g>
 </g>
</svg>
