<?xml version="1.0" encoding="UTF-8" standalone="no"?>
<svg
   height="24"
   viewBox="0 0 6.3499998 6.3500003"
   width="24"
   version="1.1"
   id="svg131"
   sodipodi:docname="Phone_02_24.svg"
   inkscape:version="1.2 (dc2aedaf03, 2022-05-15)"
   inkscape:export-filename="Phone_02_24.png"
   inkscape:export-xdpi="96"
   inkscape:export-ydpi="96"
   xmlns:inkscape="http://www.inkscape.org/namespaces/inkscape"
   xmlns:sodipodi="http://sodipodi.sourceforge.net/DTD/sodipodi-0.dtd"
   xmlns="http://www.w3.org/2000/svg"
   xmlns:svg="http://www.w3.org/2000/svg">
  <defs
     id="defs135">
    <radialGradient
       id="a"
       cx="12.1"
       cy="10.900001"
       gradientTransform="matrix(0,0.4988777,-0.49887766,0,6.8809486,-4.5932389)"
       gradientUnits="userSpaceOnUse"
       r="4.5">
      <stop
         offset="0"
         stop-color="#ff7f2a"
         id="stop962" />
      <stop
         offset="1"
         stop-color="#d45500"
         id="stop964" />
    </radialGradient>
  </defs>
  <sodipodi:namedview
     id="namedview133"
     pagecolor="#ffffff"
     bordercolor="#666666"
     borderopacity="1.0"
     inkscape:showpageshadow="2"
     inkscape:pageopacity="0.0"
     inkscape:pagecheckerboard="0"
     inkscape:deskcolor="#d1d1d1"
     showgrid="true"
     inkscape:zoom="38.25"
     inkscape:cx="12"
     inkscape:cy="12"
     inkscape:current-layer="g1328">
    <inkscape:grid
       type="xygrid"
       id="grid1286" />
  </sodipodi:namedview>
  <g
     id="g1328"
     transform="scale(1.5000001)">
    <circle
       cx="2.1166668"
       cy="2.1166666"
       fill="url(#a)"
       r="1.8520834"
       stroke-dashoffset="1.49998"
       stroke-linejoin="round"
       stroke-width="0.286632"
       transform="matrix(0,1,1,0,0,0)"
       id="circle967"
       style="fill:url(#a);stroke:#ffccaa;stroke-width:0.264583;stroke-linecap:round;stroke-dasharray:none" />
    <path
       id="path363"
       style="fill:#ffffff;fill-opacity:1;stroke:#ffffff;stroke-width:0.264583px;stroke-linecap:round;stroke-linejoin:round;stroke-opacity:1"
       d="m 1.5587096,1.1906499 c -0.118842,0.042543 -0.2754104,0.193984 -0.3296947,0.3296934 -0.1925482,0.4813691 0.4204184,1.0635872 0.4204184,1.0635872 0,0 0.5821611,0.6129059 1.0635322,0.4203583 0.1357094,-0.054283 0.287201,-0.210802 0.3297449,-0.3296433 L 2.7087971,2.3749315 C 2.6125226,2.471206 2.2609122,2.7900773 1.8520833,2.3812465 1.4432462,1.972411 1.7621508,1.6208327 1.8584283,1.5245588 Z"
       sodipodi:nodetypes="cscsccscc" />
  </g>
</svg>
