<?xml version="1.0" encoding="UTF-8" standalone="no"?>
<svg
   height="24"
   width="24"
   version="1.1"
   id="svg49"
   sodipodi:docname="16_row_add_150.svg"
   inkscape:export-filename="16_row_add_150.png"
   inkscape:export-xdpi="96"
   inkscape:export-ydpi="96"
   inkscape:version="1.1.2 (0a00cf5339, 2022-02-04, custom)"
   xmlns:inkscape="http://www.inkscape.org/namespaces/inkscape"
   xmlns:sodipodi="http://sodipodi.sourceforge.net/DTD/sodipodi-0.dtd"
   xmlns:xlink="http://www.w3.org/1999/xlink"
   xmlns="http://www.w3.org/2000/svg"
   xmlns:svg="http://www.w3.org/2000/svg">
  <defs
     id="defs887">
    <linearGradient
       inkscape:collect="always"
       id="linearGradient1797">
      <stop
         style="stop-color:#009600;stop-opacity:1"
         offset="0"
         id="stop1793" />
      <stop
         style="stop-color:#6edb39;stop-opacity:1"
         offset="1"
         id="stop1795" />
    </linearGradient>
    <linearGradient
       inkscape:collect="always"
       xlink:href="#linearGradient1797"
       id="linearGradient1799-7"
       x1="8"
       y1="-20"
       x2="3"
       y2="-25"
       gradientUnits="userSpaceOnUse"
       gradientTransform="translate(-16.75,18.25)" />
    <linearGradient
       inkscape:collect="always"
       id="linearGradient28615">
      <stop
         style="stop-color:#72cef6;stop-opacity:1"
         offset="0"
         id="stop28611" />
      <stop
         style="stop-color:#d2f5f8;stop-opacity:1"
         offset="1"
         id="stop28613" />
    </linearGradient>
    <linearGradient
       inkscape:collect="always"
       id="linearGradient17975">
      <stop
         style="stop-color:#4674a8;stop-opacity:1"
         offset="0"
         id="stop17971" />
      <stop
         style="stop-color:#42a0ce;stop-opacity:1"
         offset="1"
         id="stop17973" />
    </linearGradient>
    <linearGradient
       inkscape:collect="always"
       xlink:href="#linearGradient28615"
       id="linearGradient28617-8"
       x1="9"
       y1="10"
       x2="6"
       y2="10.5"
       gradientUnits="userSpaceOnUse"
       gradientTransform="matrix(0,-1.5,-1.5,0,24,24)" />
    <linearGradient
       inkscape:collect="always"
       xlink:href="#linearGradient17975"
       id="linearGradient17977-2"
       x1="10"
       y1="12.5"
       x2="5"
       y2="12.5"
       gradientUnits="userSpaceOnUse"
       gradientTransform="matrix(0,-1.5,-1.5,0,24,24)" />
  </defs>
  <sodipodi:namedview
     id="namedview885"
     pagecolor="#ffffff"
     bordercolor="#666666"
     borderopacity="1.0"
     inkscape:pageshadow="2"
     inkscape:pageopacity="0.0"
     inkscape:pagecheckerboard="0"
     showgrid="true"
     inkscape:zoom="38"
     inkscape:cx="12"
     inkscape:cy="12"
     inkscape:current-layer="g862">
    <inkscape:grid
       type="xygrid"
       id="grid1354" />
  </sodipodi:namedview>
  <g
     id="g863"
     transform="matrix(1,0,0,-1,0,24)">
    <g
       id="g862"
       transform="matrix(0,-1,-1,0,24,24)">
      <g
         id="g869"
         transform="matrix(0,-1,-1,0,24.000001,23.999997)">
        <g
           id="g862-6">
          <rect
             style="fill:#ffffff;stroke:#999999;stroke-width:1.02128;stroke-linecap:round;stroke-linejoin:round;stroke-miterlimit:4;stroke-dasharray:none;stroke-dashoffset:1.49998;stroke-opacity:1"
             id="rect1279"
             width="22.978724"
             height="22.978724"
             x="-23.489361"
             y="-23.489361"
             transform="scale(-1)" />
          <g
             id="g847"
             transform="matrix(-1,0,0,1,24,0)">
            <path
               style="fill:none;stroke:#b3b3b3;stroke-width:1;stroke-linecap:butt;stroke-linejoin:miter;stroke-miterlimit:4;stroke-dasharray:none;stroke-opacity:1"
               d="M 1,18.5 H 23"
               id="path1586"
               sodipodi:nodetypes="cc" />
            <path
               style="fill:none;stroke:#b3b3b3;stroke-width:1;stroke-linecap:butt;stroke-linejoin:miter;stroke-miterlimit:4;stroke-dasharray:none;stroke-opacity:1"
               d="M 6.5,23 V 1"
               id="path1725"
               sodipodi:nodetypes="cc" />
            <path
               style="fill:none;stroke:#b3b3b3;stroke-width:1;stroke-linecap:butt;stroke-linejoin:miter;stroke-miterlimit:4;stroke-dasharray:none;stroke-opacity:1"
               d="M 23,5.5 H 1"
               id="path1729"
               sodipodi:nodetypes="cc" />
            <path
               style="fill:none;stroke:#b3b3b3;stroke-width:1;stroke-linecap:butt;stroke-linejoin:miter;stroke-miterlimit:4;stroke-dasharray:none;stroke-opacity:1"
               d="M 18.5,23 V 1"
               id="path1373"
               sodipodi:nodetypes="cc" />
            <path
               style="fill:none;stroke:#b3b3b3;stroke-width:1;stroke-linecap:butt;stroke-linejoin:miter;stroke-miterlimit:4;stroke-dasharray:none;stroke-opacity:1"
               d="M 12.5,23 V 1"
               id="path1375"
               sodipodi:nodetypes="cc" />
          </g>
          <g
             id="g840">
            <rect
               style="opacity:0.5;fill:none;stroke:#ffffff;stroke-linejoin:round;stroke-dashoffset:1.49998"
               id="rect1021"
               width="23"
               height="8"
               x="0.5"
               y="-16.5"
               transform="scale(1,-1)" />
            <path
               style="fill:url(#linearGradient28617-8);fill-opacity:1;stroke:url(#linearGradient17977-2);stroke-width:1;stroke-linecap:round;stroke-linejoin:round;stroke-miterlimit:4;stroke-dasharray:none;stroke-opacity:1"
               d="m 23.5,15.5 h -23 v -6 h 23 z"
               id="path17870-1"
               sodipodi:nodetypes="ccccc" />
          </g>
        </g>
        <g
           id="g1750"
           transform="matrix(0,-1.5,-1.5,0,31.625,0.875)">
          <circle
             style="fill:url(#linearGradient1799-7);fill-opacity:1;stroke:#008080;stroke-width:0.5;stroke-linecap:round;stroke-linejoin:round;stroke-miterlimit:4;stroke-dasharray:none;stroke-dashoffset:1.49998;stroke-opacity:1"
             id="path883-9"
             cx="-11.25"
             cy="-4.25"
             transform="rotate(-90)"
             r="4" />
          <g
             id="g1394">
            <path
               style="fill:none;stroke:#ffffff;stroke-width:1;stroke-linecap:round;stroke-linejoin:miter;stroke-miterlimit:4;stroke-dasharray:none;stroke-opacity:1"
               d="m -4.25,13.25 v -4"
               id="path1522-1"
               sodipodi:nodetypes="cc" />
            <path
               style="fill:none;stroke:#ffffff;stroke-width:1;stroke-linecap:round;stroke-linejoin:miter;stroke-miterlimit:4;stroke-dasharray:none;stroke-opacity:1"
               d="m -2.25,11.25 h -4"
               id="path1215"
               sodipodi:nodetypes="cc" />
          </g>
          <circle
             style="opacity:0.7;fill:none;stroke:#ffffff;stroke-width:0.5;stroke-linejoin:round;stroke-miterlimit:4;stroke-dasharray:none;stroke-dashoffset:1.49998"
             id="path1561"
             cx="-4.25"
             cy="-11.25"
             r="4.5"
             transform="scale(1,-1)" />
        </g>
      </g>
    </g>
  </g>
</svg>
