<?xml version="1.0" encoding="UTF-8" standalone="no"?>
<svg
   width="36"
   height="36"
   version="1.1"
   viewBox="0 0 36 36"
   id="svg6"
   sodipodi:docname="tsynmacrorecorder_150.svg"
   inkscape:version="1.3.2 (091e20e, 2023-11-25, custom)"
   xmlns:inkscape="http://www.inkscape.org/namespaces/inkscape"
   xmlns:sodipodi="http://sodipodi.sourceforge.net/DTD/sodipodi-0.dtd"
   xmlns="http://www.w3.org/2000/svg"
   xmlns:svg="http://www.w3.org/2000/svg">
  <defs
     id="defs6" />
  <sodipodi:namedview
     id="namedview6"
     pagecolor="#ffffff"
     bordercolor="#000000"
     borderopacity="0.25"
     inkscape:showpageshadow="2"
     inkscape:pageopacity="0.0"
     inkscape:pagecheckerboard="0"
     inkscape:deskcolor="#d1d1d1"
     showgrid="true"
     inkscape:current-layer="svg6">
    <inkscape:grid
       id="grid6"
       units="px"
       originx="0"
       originy="0"
       spacingx="0.5"
       spacingy="0.5"
       empcolor="#0099e5"
       empopacity="0.30196078"
       color="#0099e5"
       opacity="0.14901961"
       empspacing="2"
       dotted="false"
       gridanglex="30"
       gridanglez="30"
       visible="true" />
  </sodipodi:namedview>
  <rect
     x="2.4999981"
     y="2.4999826"
     width="30.000004"
     height="31.000017"
     fill="#ffffff"
     fill-rule="evenodd"
     stroke="#2a7efe"
     stroke-linecap="square"
     stroke-linejoin="round"
     style="paint-order:normal"
     id="rect1" />
  <rect
     x="3"
     y="2.9999826"
     width="4"
     height="30.000017"
     fill="#b3b3b3"
     fill-rule="evenodd"
     style="paint-order:normal"
     id="rect2" />
  <circle
     cx="13.5"
     cy="24.499983"
     r="4.5"
     fill="#e50000"
     fill-rule="evenodd"
     style="paint-order:normal"
     id="circle2" />
  <path
     d="m 24.5,20 v 9.0001 L 29.500021,24.5 Z"
     fill="#0055d4"
     fill-rule="evenodd"
     stroke="#0055d4"
     stroke-linejoin="round"
     stroke-width="1px"
     id="path2" />
  <path
     d="m 22,18.5 -3,12"
     fill="none"
     stroke="#333333"
     stroke-linecap="round"
     stroke-width="1.5"
     id="path3" />
  <path
     d="M 23.24002,14.3998 V 6.6 l 5.550185,7.7998 V 6.6"
     fill="none"
     stroke="#2c5aa0"
     stroke-linecap="round"
     stroke-linejoin="round"
     stroke-width="1.20004"
     id="path4" />
  <path
     d="M 14.116799,7.1091 C 13.618932,6.7659 12.879663,6.6 11.996478,6.6 c -1.248071,0 -2.3837892,0.6563 -2.3837892,2.0204 0,1.0688 0.9016652,1.5082 2.3837892,1.7653 2.063769,0.3581 2.383775,1.0539 2.383775,1.9937 0,1.6981 -1.413362,2.0204 -2.383775,2.0204 -0.75334,0 -1.526586,-0.091 -2.496458,-0.5938"
     fill="none"
     stroke="#2c5aa0"
     stroke-linecap="round"
     stroke-linejoin="round"
     stroke-width="1.20004"
     id="path5" />
  <path
     d="m 18.583809,14.4 v -3.1425 m -2.383789,-4.6573 2.383789,4.6573 2.38379,-4.6573"
     fill="none"
     stroke="#2c5aa0"
     stroke-linecap="round"
     stroke-linejoin="round"
     stroke-width="1.20004"
     id="path6" />
</svg>
