<?xml version="1.0" encoding="UTF-8" standalone="no"?>
<svg
   height="48"
   width="48"
   version="1.1"
   id="svg18"
   sodipodi:docname="File_23_48.svg"
   inkscape:export-filename="File_23_48.png"
   inkscape:export-xdpi="96"
   inkscape:export-ydpi="96"
   inkscape:version="1.2.2 (732a01da63, 2022-12-09)"
   xmlns:inkscape="http://www.inkscape.org/namespaces/inkscape"
   xmlns:sodipodi="http://sodipodi.sourceforge.net/DTD/sodipodi-0.dtd"
   xmlns="http://www.w3.org/2000/svg"
   xmlns:svg="http://www.w3.org/2000/svg">
  <defs
     id="defs22">
    <radialGradient
       id="a"
       cx="9.1740294"
       cy="7.8253603"
       gradientTransform="matrix(0.66909781,-2.2758851e-8,4.5190518e-8,0.58542853,1.8616763,4.291566)"
       gradientUnits="userSpaceOnUse"
       r="7.5"
       fx="9.1740294"
       fy="7.8253603">
      <stop
         offset="0"
         stop-color="#fff"
         id="stop2" />
      <stop
         offset="1"
         stop-color="#8fc1c7"
         id="stop4" />
    </radialGradient>
  </defs>
  <sodipodi:namedview
     id="namedview20"
     pagecolor="#ffffff"
     bordercolor="#666666"
     borderopacity="1.0"
     inkscape:pageshadow="2"
     inkscape:pageopacity="0.0"
     inkscape:pagecheckerboard="0"
     inkscape:deskcolor="#d1d1d1"
     showgrid="true"
     inkscape:zoom="18.958333"
     inkscape:cx="23.973626"
     inkscape:cy="24"
     inkscape:current-layer="svg18"
     inkscape:showpageshadow="2">
    <inkscape:grid
       type="xygrid"
       id="grid147"
       originx="0"
       originy="0" />
  </sodipodi:namedview>
  <rect
     style="fill:#ebfcff;fill-opacity:1;stroke:#00aad4;stroke-width:2.4;stroke-linejoin:round;stroke-dasharray:none;stroke-opacity:1"
     id="rect979"
     width="31.6"
     height="40.600002"
     x="7.1999998"
     y="3.2"
     ry="3.5999999" />
  <g
     id="g919"
     style="stroke-width:0.95935"
     transform="matrix(3.9396766,0,0,3.9396766,-1.9830482,-1.983048)">
    <circle
       cx="9.260417"
       cy="9.260417"
       r="3.1220837"
       stroke-dashoffset="1.49998"
       stroke-linejoin="round"
       id="circle1318-0"
       style="fill:#ffffff;stroke:#00aad4;stroke-width:0.609187;stroke-linecap:round;stroke-dasharray:none" />
    <path
       d="M 8.0697919,8.0697919 10.451042,10.451042"
       id="path1320"
       style="fill:none;stroke:#00aad4;stroke-width:0.609187;stroke-linecap:round;stroke-dasharray:none"
       sodipodi:nodetypes="cc" />
    <path
       d="M 10.451042,8.0697918 8.0697918,10.451042"
       id="path1322"
       style="fill:none;stroke:#00aad4;stroke-width:0.609187;stroke-linecap:round;stroke-dasharray:none"
       sodipodi:nodetypes="cc" />
  </g>
</svg>
