<?xml version="1.0" encoding="UTF-8" standalone="no"?>
<svg
   width="48"
   height="48"
   version="1.1"
   viewBox="0 0 48 48"
   id="svg3"
   sodipodi:docname="tpagecontrol_200.svg"
   inkscape:export-filename="tpagecontrol_200.png"
   inkscape:export-xdpi="96"
   inkscape:export-ydpi="96"
   inkscape:version="1.3.2 (091e20e, 2023-11-25, custom)"
   xmlns:inkscape="http://www.inkscape.org/namespaces/inkscape"
   xmlns:sodipodi="http://sodipodi.sourceforge.net/DTD/sodipodi-0.dtd"
   xmlns="http://www.w3.org/2000/svg"
   xmlns:svg="http://www.w3.org/2000/svg">
  <defs
     id="defs3" />
  <sodipodi:namedview
     id="namedview3"
     pagecolor="#ffffff"
     bordercolor="#000000"
     borderopacity="0.25"
     inkscape:showpageshadow="2"
     inkscape:pageopacity="0.0"
     inkscape:pagecheckerboard="0"
     inkscape:deskcolor="#d1d1d1"
     showgrid="true"
     inkscape:current-layer="svg3">
    <inkscape:grid
       id="grid3"
       units="px"
       originx="0"
       originy="0"
       spacingx="0.5"
       spacingy="0.5"
       empcolor="#0099e5"
       empopacity="0.30196078"
       color="#0099e5"
       opacity="0.14901961"
       empspacing="2"
       dotted="false"
       gridanglex="30"
       gridanglez="30"
       visible="true" />
  </sodipodi:namedview>
  <path
     d="m 4,8.5 h 10 a 1.5,1.5 0 0 1 1.5,1.5 v 4.5 h 30 v 27 h -43 l 2e-7,-31.5 A 1.4999998,1.4999998 0 0 1 4,8.5 Z"
     fill="#ffffff"
     stroke-width="1"
     style="stroke:#2a7efe;stroke-linecap:round;stroke-linejoin:round;paint-order:normal"
     id="path1" />
  <path
     d="m 15.5,10.5 h 10 v 4 h -10 z"
     fill="#e6e6e6"
     id="path2"
     style="stroke:#2a7efe;stroke-linecap:round;stroke-linejoin:round" />
  <path
     d="M 25.5,10.5 H 34 a 1.5,1.5 0 0 1 1.5,1.5 v 2.5 h -10 z"
     fill="#e6e6e6"
     stroke-width="1"
     id="path3"
     style="stroke:#2a7efe;stroke-linecap:round;stroke-linejoin:round" />
</svg>
