<?xml version="1.0" encoding="UTF-8" standalone="no"?>
<svg
   height="48"
   viewBox="0 0 12.7 12.700001"
   width="48"
   version="1.1"
   id="svg746"
   sodipodi:docname="Eye_02_48.svg"
   inkscape:version="1.2 (dc2aedaf03, 2022-05-15)"
   inkscape:export-filename="Eye_02_48.png"
   inkscape:export-xdpi="96"
   inkscape:export-ydpi="96"
   xmlns:inkscape="http://www.inkscape.org/namespaces/inkscape"
   xmlns:sodipodi="http://sodipodi.sourceforge.net/DTD/sodipodi-0.dtd"
   xmlns="http://www.w3.org/2000/svg"
   xmlns:svg="http://www.w3.org/2000/svg">
  <defs
     id="defs750" />
  <sodipodi:namedview
     id="namedview748"
     pagecolor="#ffffff"
     bordercolor="#666666"
     borderopacity="1.0"
     inkscape:showpageshadow="2"
     inkscape:pageopacity="0.0"
     inkscape:pagecheckerboard="0"
     inkscape:deskcolor="#d1d1d1"
     showgrid="true"
     inkscape:zoom="19.125"
     inkscape:cx="24"
     inkscape:cy="24"
     inkscape:current-layer="svg746">
    <inkscape:grid
       type="xygrid"
       id="grid1256" />
  </sodipodi:namedview>
  <g
     id="g1119"
     transform="matrix(3.0000019,0,0,3.0000019,-3.811676e-6,-3.8197609e-6)">
    <path
       style="fill:#ffffff;stroke:#808080;stroke-width:0.264583px;stroke-linecap:round;stroke-linejoin:round;stroke-opacity:1"
       d="m 0.13229166,2.1166667 c 0.66145932,1.5798924 3.30729264,1.5798924 3.96875004,0 -0.6614574,-1.57989245 -3.30729072,-1.57989245 -3.96875004,0 z"
       id="path365"
       sodipodi:nodetypes="ccc" />
    <circle
       style="fill:#4ca7ff;fill-opacity:1;stroke:none;stroke-width:4.23333;stroke-linecap:round;stroke-linejoin:round"
       id="circle1025"
       cx="2.1166666"
       cy="2.1166668"
       r="0.92604166" />
    <ellipse
       style="fill:#000000;fill-opacity:1;stroke:none;stroke-width:4.23333;stroke-linecap:round;stroke-linejoin:round"
       id="ellipse1027"
       cx="2.1166666"
       cy="2.1166668"
       rx="0.39687499"
       ry="0.39687496" />
    <ellipse
       style="fill:#ffffff;fill-opacity:1;stroke:none;stroke-width:4.23333;stroke-linecap:round;stroke-linejoin:round"
       id="ellipse1113"
       cx="1.8520833"
       cy="1.8520833"
       rx="0.1984375"
       ry="0.19843748" />
  </g>
</svg>
