<?xml version="1.0" encoding="UTF-8" standalone="no"?>
<svg
   height="36"
   width="36"
   version="1.1"
   id="svg459"
   sodipodi:docname="Flag_02_36.svg"
   inkscape:export-filename="Flag_02_36.png"
   inkscape:export-xdpi="96"
   inkscape:export-ydpi="96"
   inkscape:version="1.2.1 (9c6d41e410, 2022-07-14)"
   xmlns:inkscape="http://www.inkscape.org/namespaces/inkscape"
   xmlns:sodipodi="http://sodipodi.sourceforge.net/DTD/sodipodi-0.dtd"
   xmlns="http://www.w3.org/2000/svg"
   xmlns:svg="http://www.w3.org/2000/svg">
  <defs
     id="defs463" />
  <sodipodi:namedview
     id="namedview461"
     pagecolor="#ffffff"
     bordercolor="#666666"
     borderopacity="1.0"
     inkscape:pageshadow="2"
     inkscape:pageopacity="0.0"
     inkscape:pagecheckerboard="0"
     inkscape:deskcolor="#d1d1d1"
     showgrid="true"
     inkscape:zoom="25.5"
     inkscape:cx="16.588235"
     inkscape:cy="18"
     inkscape:current-layer="svg459"
     inkscape:showpageshadow="2">
    <inkscape:grid
       type="xygrid"
       id="grid1126" />
  </sodipodi:namedview>
  <path
     d="M 35.690402,9.8532137 C 34.413017,7.5750556 32.530092,6.2133443 29.64944,5.8708898 27.586725,5.625672 23.094954,6.3216906 20.617902,5.6521019 17.915731,4.9216603 16.699145,3.6546465 15.838253,1.8377098 L 9.604021,18.108495 c 0.860892,1.816937 2.077478,3.08395 4.779649,3.814392 2.477052,0.669589 6.968822,-0.02643 9.031537,0.218788 2.880655,0.342454 4.763577,1.704168 6.040965,3.982325 z"
     fill="#ffffff"
     fill-rule="evenodd"
     stroke="#808080"
     stroke-width="0.562496"
     id="path308"
     style="stroke:#00aad4;stroke-opacity:1;fill:none" />
  <path
     id="path310"
     style="fill-rule:evenodd;stroke-width:2.24998;stroke:none;fill:#00aad4;fill-opacity:1"
     d="M 19.162109 5.2695312 C 19.145155 5.2916609 17.681694 9.123461 17.683594 9.140625 C 17.684802 9.151302 17.890512 9.2360723 18.140625 9.328125 C 19.076903 9.6727206 19.866976 9.8306542 20.972656 9.8945312 C 21.273555 9.911923 21.562374 9.9225687 21.615234 9.9179688 C 21.703649 9.9103302 21.770786 9.7560769 22.449219 7.9882812 C 22.854857 6.9313082 23.182434 6.0618106 23.177734 6.0566406 C 23.172922 6.0514786 22.951775 6.0363435 22.685547 6.0234375 C 21.42491 5.9623334 20.57338 5.7956099 19.566406 5.4121094 C 19.348338 5.3290604 19.165809 5.2646813 19.162109 5.2695312 z M 28.525391 5.9140625 C 28.430251 5.9157093 28.340493 5.9192538 28.257812 5.9257812 L 27.996094 5.9472656 L 27.263672 7.8574219 C 26.861064 8.9081946 26.538422 9.7722038 26.544922 9.7773438 C 26.55137 9.7824877 26.82621 9.7927181 27.15625 9.7988281 C 28.213793 9.8184404 29.179807 9.9815624 30.029297 10.287109 C 30.293307 10.382076 30.525715 10.459734 30.546875 10.458984 C 30.58286 10.457718 32.053222 6.6793879 32.044922 6.609375 C 32.039055 6.5596644 31.272336 6.2906683 30.814453 6.1777344 C 30.12495 6.0076724 29.19137 5.9025348 28.525391 5.9140625 z M 14.285156 6.1875 C 14.275056 6.2000066 13.940436 7.0546596 13.542969 8.0878906 L 12.820312 9.9667969 L 12.917969 10.169922 C 13.100894 10.547447 13.532658 11.20564 13.826172 11.554688 C 14.301159 12.119541 15.059771 12.708043 15.734375 13.035156 C 15.883871 13.107646 15.943854 13.119651 15.958984 13.082031 C 16.042501 12.87446 17.424789 9.2565569 17.423828 9.2480469 C 17.423155 9.2420948 17.325668 9.1911084 17.207031 9.1328125 C 16.851794 8.9582578 16.214757 8.5422074 15.935547 8.3027344 C 15.386049 7.8314411 14.895124 7.2267174 14.53125 6.5742188 C 14.405498 6.3487195 14.295246 6.175 14.285156 6.1875 z M 26.228516 9.9921875 C 26.223495 9.9881855 25.628147 10.007286 24.90625 10.035156 C 24.184354 10.063026 23.288947 10.091156 22.916016 10.097656 C 22.543086 10.104136 22.146365 10.117786 22.033203 10.128906 L 21.826172 10.150391 L 21.09375 12.056641 C 20.690889 13.105624 20.371893 13.971769 20.382812 13.980469 C 20.417893 14.008469 21.781932 13.978542 23.212891 13.919922 C 23.978026 13.888592 24.631753 13.866641 24.664062 13.869141 C 24.696372 13.871641 24.733187 13.85945 24.748047 13.84375 C 24.778806 13.81118 26.242476 10.003333 26.228516 9.9921875 z M 30.691406 10.724609 L 29.957031 12.636719 C 29.553694 13.687883 29.222803 14.56827 29.220703 14.59375 C 29.2186 14.61923 29.388272 14.727769 29.597656 14.835938 C 30.63777 15.37325 31.685293 16.370069 32.361328 17.462891 C 32.457151 17.617776 32.544108 17.743887 32.554688 17.742188 C 32.56517 17.74048 32.901743 16.878025 33.302734 15.826172 L 34.033203 13.914062 L 33.75 13.470703 C 33.034637 12.351851 32.115878 11.483773 31.042969 10.912109 L 30.691406 10.724609 z M 16.046875 13.404297 C 16.029516 13.426881 14.564406 17.259724 14.566406 17.277344 C 14.567614 17.288021 14.773325 17.370841 15.023438 17.462891 C 15.959716 17.807485 16.749788 17.965417 17.855469 18.029297 C 18.156366 18.046697 18.445187 18.057334 18.498047 18.052734 C 18.586461 18.045095 18.653599 17.890842 19.332031 16.123047 C 19.73767 15.066073 20.063741 14.1944 20.056641 14.1875 C 20.049582 14.18055 19.791529 14.163717 19.484375 14.148438 C 18.332982 14.091207 17.504492 13.928496 16.519531 13.566406 C 16.26315 13.472159 16.050975 13.398997 16.046875 13.404297 z M 25.345703 14.044922 C 25.149975 14.04428 24.999237 14.049012 24.957031 14.060547 C 24.893569 14.077892 24.72789 14.472311 24.146484 15.992188 C 23.744556 17.042882 23.421234 17.907009 23.427734 17.912109 C 23.434182 17.917259 23.709022 17.927494 24.039062 17.933594 C 25.096605 17.953206 26.062617 18.11828 26.912109 18.423828 C 27.176119 18.518785 27.408528 18.594502 27.429688 18.59375 C 27.464413 18.59253 28.933987 14.821351 28.929688 14.744141 C 28.928736 14.726519 28.719886 14.634436 28.464844 14.541016 C 27.937974 14.348026 26.996309 14.139851 26.416016 14.087891 C 26.12434 14.061778 25.671916 14.045991 25.345703 14.044922 z M 11.167969 14.322266 C 11.157869 14.334772 10.823179 15.191385 10.425781 16.224609 L 9.703125 18.101562 L 9.7988281 18.285156 C 10.133418 18.931148 10.465718 19.426529 10.861328 19.867188 C 11.178387 20.220348 11.952849 20.814787 12.410156 21.054688 C 12.699624 21.206536 12.827277 21.25482 12.841797 21.21875 C 12.925337 21.011113 14.307602 17.393266 14.306641 17.384766 C 14.305968 17.378814 14.208481 17.325868 14.089844 17.267578 C 13.734607 17.093023 13.097569 16.676973 12.818359 16.4375 C 12.268862 15.966206 11.777936 15.361483 11.414062 14.708984 C 11.288311 14.483486 11.178059 14.309766 11.167969 14.322266 z M 23.111328 18.126953 C 23.106338 18.122973 22.512914 18.142052 21.791016 18.169922 C 21.069118 18.197792 20.17176 18.225922 19.798828 18.232422 C 19.425896 18.238902 19.029178 18.254505 18.916016 18.265625 L 18.708984 18.285156 L 17.976562 20.191406 C 17.573702 21.240388 17.251113 22.104075 17.257812 22.109375 C 17.287369 22.132955 17.968307 22.127696 18.878906 22.097656 C 19.421365 22.079766 20.150875 22.055842 20.501953 22.044922 C 20.853032 22.034012 21.254859 22.015153 21.394531 22.001953 L 21.648438 21.978516 L 22.384766 20.056641 C 22.789541 18.99963 23.116328 18.130953 23.111328 18.126953 z M 27.574219 18.861328 L 26.839844 20.771484 C 26.436504 21.822648 26.104762 22.703889 26.101562 22.730469 C 26.098501 22.757068 26.168613 22.809956 26.257812 22.847656 C 26.54346 22.968394 27.1845 23.378654 27.558594 23.679688 C 28.182857 24.182032 28.904246 25.003583 29.279297 25.640625 C 29.356003 25.770916 29.42692 25.878153 29.4375 25.876953 C 29.448041 25.875751 29.784555 25.012791 30.185547 23.960938 L 30.916016 22.048828 L 30.632812 21.607422 C 29.917448 20.48857 28.998688 19.620492 27.925781 19.048828 L 27.574219 18.861328 z " />
  <path
     d="M 14.184536,1.6893065 1.6856718,34.310218"
     fill="none"
     stroke="#c87137"
     stroke-linecap="round"
     stroke-width="3.37498"
     id="path332"
     style="stroke:#00aad4;stroke-opacity:1;fill:none" />
</svg>
