<?xml version="1.0" encoding="UTF-8" standalone="no"?>
<svg
   height="24"
   width="24"
   version="1.1"
   id="svg185"
   sodipodi:docname="Elements_01_24.svg"
   inkscape:export-filename="Elements_01_24.png"
   inkscape:export-xdpi="96"
   inkscape:export-ydpi="96"
   inkscape:version="1.2-beta (1b65182ce9, 2022-04-05)"
   xmlns:inkscape="http://www.inkscape.org/namespaces/inkscape"
   xmlns:sodipodi="http://sodipodi.sourceforge.net/DTD/sodipodi-0.dtd"
   xmlns="http://www.w3.org/2000/svg"
   xmlns:svg="http://www.w3.org/2000/svg">
  <defs
     id="defs189" />
  <sodipodi:namedview
     id="namedview187"
     pagecolor="#ffffff"
     bordercolor="#666666"
     borderopacity="1.0"
     inkscape:pageshadow="2"
     inkscape:pageopacity="0.0"
     inkscape:pagecheckerboard="0"
     inkscape:deskcolor="#d1d1d1"
     showgrid="true"
     inkscape:zoom="38.25"
     inkscape:cx="12"
     inkscape:cy="12"
     inkscape:current-layer="svg185">
    <inkscape:grid
       type="xygrid"
       id="grid1096" />
  </sodipodi:namedview>
  <radialGradient
     id="a"
     cx="5.399993"
     cy="1034.7039"
     gradientTransform="matrix(.994893 -.99490414 .5969473 .5969406 -614.24014 -598.48831)"
     gradientUnits="userSpaceOnUse"
     r="4">
    <stop
       offset="0"
       stop-color="#0057dc"
       id="stop158" />
    <stop
       offset="1"
       stop-color="#fff"
       id="stop160" />
  </radialGradient>
  <radialGradient
     id="b"
     cx="5.399993"
     cy="1034.7039"
     gradientTransform="matrix(.994893 -.99490414 .5969473 .5969406 -619.24014 -606.48828)"
     gradientUnits="userSpaceOnUse"
     r="4">
    <stop
       offset="0"
       stop-color="#dc0000"
       id="stop163" />
    <stop
       offset="1"
       stop-color="#fff"
       id="stop165" />
  </radialGradient>
  <radialGradient
     id="c"
     cx="5.399993"
     cy="1034.7039"
     gradientTransform="matrix(.994893 -.99490414 .5969473 .5969406 -609.24014 -606.48828)"
     gradientUnits="userSpaceOnUse"
     r="4">
    <stop
       offset="0"
       stop-color="#dcb000"
       id="stop168" />
    <stop
       offset="1"
       stop-color="#fff"
       id="stop170" />
  </radialGradient>
  <g
     stroke-linejoin="round"
     transform="scale(1.5)"
     id="g183">
    <circle
       cx="8"
       cy="7.6"
       fill="none"
       r="5.75"
       stroke="#00aad4"
       stroke-linecap="round"
       id="circle173" />
    <g
       fill-rule="evenodd"
       stroke-linecap="square"
       stroke-width=".428571"
       id="g181">
      <circle
         cx="13"
         cy="5"
         fill="url(#c)"
         r="2.785714"
         stroke="#dcb000"
         id="circle175" />
      <circle
         cx="8"
         cy="13"
         fill="url(#a)"
         r="2.785714"
         stroke="#0057dc"
         id="circle177" />
      <circle
         cx="3"
         cy="5"
         fill="url(#b)"
         r="2.785714"
         stroke="#dc0000"
         id="circle179" />
    </g>
  </g>
</svg>
