<svg width="16" height="16" version="1.1" xmlns="http://www.w3.org/2000/svg">
 <path d="m9.939655 7.25h4.310345v-4.3095045" fill="none" stroke="#fa0302" stroke-linecap="round" stroke-width="1.5"/>
 <path d="M 13.344828,7.0345224 C 11.017241,2.282777 5.8448276,-1.173038 1.75,5.306615" fill="none" stroke="#fa0302" stroke-linecap="round" stroke-width="1.5"/>
 <path d="M 6.0603449,8.75 H 1.75 v 4.309504" fill="none" stroke="#2a7efe" stroke-linecap="round" stroke-width="1.5"/>
 <path d="M 2.6551724,8.9654776 C 4.9827586,13.717256 10.155172,17.173097 14.25,10.693398" fill="none" stroke="#2a7efe" stroke-linecap="round" stroke-width="1.5"/>
</svg>
