<svg width="64" height="64" version="1.1" viewBox="0 0 64 64" xmlns="http://www.w3.org/2000/svg">
 <path d="m39.000004 56.999998 17.999994-17.999994m0 17.999994-17.999994-17.999994" fill="none" stroke="#ffffff" stroke-linecap="round" stroke-width="14"/>
 <path d="m39.000004 56.999998 17.999994-17.999994m0 17.999994-17.999994-17.999994" fill="none" stroke="#dc0000" stroke-linecap="round" stroke-width="6"/>
</svg>
