<?xml version="1.0" encoding="UTF-8" standalone="no"?>
<svg
   height="48"
   width="48"
   version="1.1"
   id="svg1762"
   sodipodi:docname="Ok_03_48.svg"
   inkscape:export-filename="Ok_03_48.png"
   inkscape:export-xdpi="96"
   inkscape:export-ydpi="96"
   inkscape:version="1.2-beta (1b65182ce9, 2022-04-05)"
   xmlns:inkscape="http://www.inkscape.org/namespaces/inkscape"
   xmlns:sodipodi="http://sodipodi.sourceforge.net/DTD/sodipodi-0.dtd"
   xmlns="http://www.w3.org/2000/svg"
   xmlns:svg="http://www.w3.org/2000/svg">
  <defs
     id="defs1766" />
  <sodipodi:namedview
     id="namedview1764"
     pagecolor="#ffffff"
     bordercolor="#666666"
     borderopacity="1.0"
     inkscape:pageshadow="2"
     inkscape:pageopacity="0.0"
     inkscape:pagecheckerboard="0"
     inkscape:deskcolor="#d1d1d1"
     showgrid="true"
     inkscape:zoom="19.125"
     inkscape:cx="24"
     inkscape:cy="24"
     inkscape:current-layer="svg1762">
    <inkscape:grid
       type="xygrid"
       id="grid1989" />
  </sodipodi:namedview>
  <g
     transform="matrix(2,0,0,2,0,-48)"
     id="g1760">
    <circle
       cx="12"
       cy="36"
       r="10.25"
       style="fill:#00c000;fill-rule:evenodd;stroke:#009600;stroke-width:1.5;stroke-linecap:round;stroke-linejoin:round"
       id="circle1756" />
    <path
       d="m 6.7496602,34.75 3.7499998,3.75 6.75,-6.75"
       fill="none"
       stroke="#ffffff"
       stroke-width="3"
       id="path1758" />
  </g>
</svg>
