<?xml version="1.0" encoding="UTF-8" standalone="no"?>
<svg
   height="48"
   viewBox="0 0 48 48"
   width="48"
   version="1.1"
   id="svg7"
   sodipodi:docname="Chart_14_48.svg"
   inkscape:export-filename="Chart_14_48.png"
   inkscape:export-xdpi="96"
   inkscape:export-ydpi="96"
   inkscape:version="1.3-beta (cedbd6c6ff, 2023-05-28)"
   xmlns:inkscape="http://www.inkscape.org/namespaces/inkscape"
   xmlns:sodipodi="http://sodipodi.sourceforge.net/DTD/sodipodi-0.dtd"
   xmlns="http://www.w3.org/2000/svg"
   xmlns:svg="http://www.w3.org/2000/svg">
  <defs
     id="defs7" />
  <sodipodi:namedview
     id="namedview7"
     pagecolor="#ffffff"
     bordercolor="#000000"
     borderopacity="0.25"
     inkscape:showpageshadow="2"
     inkscape:pageopacity="0.0"
     inkscape:pagecheckerboard="0"
     inkscape:deskcolor="#d1d1d1"
     showgrid="true"
     inkscape:current-layer="svg7">
    <inkscape:grid
       id="grid7"
       units="px"
       originx="0"
       originy="0"
       spacingx="0.5"
       spacingy="0.5"
       empcolor="#0099e5"
       empopacity="0.30196078"
       color="#0099e5"
       opacity="0.14901961"
       empspacing="2"
       dotted="false"
       gridanglex="30"
       gridanglez="30"
       visible="true" />
  </sodipodi:namedview>
  <g
     stroke-linecap="round"
     stroke-linejoin="round"
     id="g3">
    <path
       d="m7.1 4.100005h33.799999v25.79999h-33.799999z"
       fill="#fff"
       stroke="#999"
       stroke-width="2.20001"
       id="path1" />
    <path
       d="m10 27.011191 6.5-12.451731 3 5.976831 6-8.965246 3 2.988415 6-6.9729692"
       fill="none"
       stroke="#4d4d4d"
       stroke-width="1.7"
       id="path2" />
    <path
       d="m19.099998 23.099998h27.800001v23.800001h-27.800001z"
       fill="#fff"
       stroke="#912d2d"
       stroke-width="2.2"
       id="path3" />
  </g>
  <path
     d="m23 27h9v7h-9z"
     fill="#f00"
     id="path4" />
  <path
     d="m34 36h8.999998v7h-8.999998z"
     fill="#06f"
     id="path5" />
  <path
     d="m34 27h8.999998v7h-8.999998z"
     fill="#0c0"
     id="path6" />
  <path
     d="m23 36h9v7h-9z"
     fill="#e5b800"
     id="path7" />
</svg>
