<?xml version="1.0" encoding="UTF-8" standalone="no"?>
<svg
   height="32"
   width="32"
   version="1.1"
   id="svg526"
   sodipodi:docname="state_unknown_200.svg"
   inkscape:export-filename="state_unknown_200.png"
   inkscape:export-xdpi="96"
   inkscape:export-ydpi="96"
   inkscape:version="1.2.2 (732a01da63, 2022-12-09)"
   xmlns:inkscape="http://www.inkscape.org/namespaces/inkscape"
   xmlns:sodipodi="http://sodipodi.sourceforge.net/DTD/sodipodi-0.dtd"
   xmlns="http://www.w3.org/2000/svg"
   xmlns:svg="http://www.w3.org/2000/svg">
  <defs
     id="defs530" />
  <sodipodi:namedview
     id="namedview528"
     pagecolor="#ffffff"
     bordercolor="#666666"
     borderopacity="1.0"
     inkscape:showpageshadow="2"
     inkscape:pageopacity="0.0"
     inkscape:pagecheckerboard="0"
     inkscape:deskcolor="#d1d1d1"
     showgrid="true"
     inkscape:zoom="28.6875"
     inkscape:cx="14.745098"
     inkscape:cy="16"
     inkscape:current-layer="svg526">
    <inkscape:grid
       type="xygrid"
       id="grid753" />
  </sodipodi:namedview>
  <circle
     cx="16"
     cy="16"
     fill="#ff0000"
     fill-rule="evenodd"
     r="16"
     id="circle520"
     style="fill:#2a7fff;fill-opacity:1" />
  <path
     d="m 16.499956,6.0001323 c -3.351058,0 -5.951422,2.1067375 -6.249956,5.4328947 l 2.913951,0.394943 c 0.480318,-2.2508802 1.683843,-3.2381972 3.449546,-3.2381972 1.877169,0 3.036498,1.3146522 3.036498,2.5945912 0,1.627914 -0.565602,1.925525 -2.130656,3.39128 -2.136386,2.000834 -2.579972,2.977476 -2.519369,5.799394 h 2.999979 c 0,-2.461013 0.311998,-2.764799 1.293166,-3.747422 1.822915,-1.82558 3.456799,-2.969811 3.456799,-5.627651 0,-3.0148392 -2.804527,-4.9999627 -6.249958,-4.9999651 z M 14.99997,25.999999 v -3.124982 h 2.999979 v 3.12485 z"
     fill="#ffffff"
     stroke-width="0.897298"
     id="path522"
     style="fill-rule:evenodd" />
</svg>
