<svg width="16" height="16" version="1.1" xmlns="http://www.w3.org/2000/svg">
 <defs>
  <linearGradient id="a" x1="17.658785" x2="11.341217" y1="17.658785" y2="11.341217" gradientTransform="matrix(.98930497 0 0 .98930487 -3.844923 -3.844922)" gradientUnits="userSpaceOnUse">
   <stop stop-color="#009600" offset="0"/>
   <stop stop-color="#6edb39" offset="1"/>
  </linearGradient>
 </defs>
 <g stroke="#ffffff" stroke-linecap="round">
  <ellipse transform="matrix(0,1,1,0,0,0)" cx="10.5" cy="10.5" rx="5.0000005" ry="5" fill="url(#a)" stroke-dashoffset="1.49998" stroke-linejoin="round" stroke-width=".999999"/>
  <path d="m9.2819712 12.375377 3.0934528 6.5e-5 6.4e-5 -3.0935817" fill="none" stroke-linejoin="round" stroke-width="1.24997"/>
  <path d="m12.000001 12-3.5000008-3.5000001" fill="none" stroke-width="1.5"/>
 </g>
</svg>
