<?xml version="1.0" encoding="UTF-8" standalone="no"?>
<svg
   height="32"
   width="32"
   version="1.1"
   id="svg291"
   sodipodi:docname="menu_toggle_bookmark3_200.svg"
   inkscape:export-filename="menu_toggle_bookmark3_200.png"
   inkscape:export-xdpi="96"
   inkscape:export-ydpi="96"
   inkscape:version="1.2.2 (732a01da63, 2022-12-09)"
   xmlns:inkscape="http://www.inkscape.org/namespaces/inkscape"
   xmlns:sodipodi="http://sodipodi.sourceforge.net/DTD/sodipodi-0.dtd"
   xmlns="http://www.w3.org/2000/svg"
   xmlns:svg="http://www.w3.org/2000/svg">
  <defs
     id="defs295" />
  <sodipodi:namedview
     id="namedview293"
     pagecolor="#ffffff"
     bordercolor="#666666"
     borderopacity="1.0"
     inkscape:showpageshadow="2"
     inkscape:pageopacity="0.0"
     inkscape:pagecheckerboard="0"
     inkscape:deskcolor="#d1d1d1"
     showgrid="true"
     inkscape:zoom="28.6875"
     inkscape:cx="15.494553"
     inkscape:cy="16"
     inkscape:current-layer="svg291">
    <inkscape:grid
       type="xygrid"
       id="grid1406" />
  </sodipodi:namedview>
  <radialGradient
     id="a"
     cx="17"
     cy="17.5"
     gradientUnits="userSpaceOnUse"
     r="12">
    <stop
       offset="0"
       stop-color="#2a7fff"
       id="stop278" />
    <stop
       offset=".69999999"
       stop-color="#4d94ff"
       id="stop280" />
    <stop
       offset="1"
       stop-color="#96bdff"
       id="stop282" />
  </radialGradient>
  <g
     transform="translate(-1 -2.5)"
     id="g289">
    <circle
       cx="17"
       cy="17.5"
       fill="url(#a)"
       r="12"
       id="circle285" />
    <path
       d="m17.118813 24.760742c-1.443826.03489-2.976101-.592346-3.694917-1.90216-.311298-.545017-.485183-1.159202-.562896-1.77948h2.03125c.07683.863521.762088 1.631054 1.640625 1.721191.896076.161769 2.022078-.03534 2.452393-.93689.301007-.645206.222865-1.389102.163078-2.075729-.100689-.8522-.829216-1.58135-1.701775-1.599808-.411604-.01802-.823997-.0054-1.235962-.0092v-1.894531c.757536-.03004 1.637597.150228 2.236099-.437737.609225-.59796.544102-1.518821.48729-2.302131-.08445-.7919-.838628-1.35274-1.609192-1.354523-.883223-.115392-1.835008.403952-2.068824 1.278419-.09089.33992-.09115.481987-.09115.481987h-2.06946c.210212-1.427358 1.026056-2.865979 2.429237-3.397979 1.188499-.435095 2.575558-.38254 3.716507.173302 1.117764.551883 1.707215 1.808966 1.711655 3.017806.06683.963755-.158288 1.994529-.890236 2.675133-.268177.37392-1.093857.653013-1.240749.80018 1.175068.235381 2.080526 1.261805 2.278652 2.427664.202308 1.297088.134698 2.764013-.729866 3.825874-.779744.957964-2.061852 1.299337-3.251762 1.288567z"
       fill="#fff"
       id="path287" />
  </g>
  <g
     id="g1579">
    <path
       d="M 7.5,1 H 1 v 6.5"
       stroke="#00cc00"
       id="path293"
       style="fill:none;stroke-width:2;stroke-linecap:round" />
    <path
       d="M 24.5,29 H 31 v -6.5"
       stroke="#ff0000"
       id="path295"
       style="fill:none;stroke-width:2;stroke-linecap:round" />
  </g>
</svg>
