<?xml version="1.0" encoding="UTF-8" standalone="no"?>
<svg
   height="32"
   viewBox="0 0 8.4667 8.4667"
   width="32"
   version="1.1"
   id="svg457"
   sodipodi:docname="Window_14_32.svg"
   inkscape:version="1.2.2 (732a01da63, 2022-12-09)"
   xmlns:inkscape="http://www.inkscape.org/namespaces/inkscape"
   xmlns:sodipodi="http://sodipodi.sourceforge.net/DTD/sodipodi-0.dtd"
   xmlns="http://www.w3.org/2000/svg"
   xmlns:svg="http://www.w3.org/2000/svg">
  <defs
     id="defs461" />
  <sodipodi:namedview
     id="namedview459"
     pagecolor="#ffffff"
     bordercolor="#000000"
     borderopacity="0.25"
     inkscape:showpageshadow="2"
     inkscape:pageopacity="0.0"
     inkscape:pagecheckerboard="0"
     inkscape:deskcolor="#d1d1d1"
     showgrid="true"
     inkscape:zoom="28.4375"
     inkscape:cx="15.982418"
     inkscape:cy="16"
     inkscape:current-layer="svg457">
    <inkscape:grid
       type="xygrid"
       id="grid1002" />
  </sodipodi:namedview>
  <rect
     fill="#f5f7ff"
     height="7.011486"
     rx=".582086"
     stroke="#00aad4"
     stroke-linejoin="round"
     stroke-width=".396877"
     width="7.011486"
     x=".727607"
     y=".727607"
     id="rect437" />
  <g
     fill="#00aad4"
     id="g455">
    <path
       d="m.79375312.79375312h6.87919378v1.05833748h-6.87919378z"
       fill-rule="evenodd"
       stroke-width=".529161"
       id="path439" />
    <g
       stroke-width=".591629"
       id="g453">
      <path
         d="m1.8520906 2.6458437v1.0583375h1.0583375v-1.0583375z"
         id="path441" />
      <path
         d="m5.5562719 2.6458437v1.0583375h1.0583375v-1.0583375z"
         id="path443" />
      <path
         d="m3.7041813 2.6458437v1.0583375h1.0583375v-1.0583375z"
         id="path445" />
      <path
         d="m1.8520906 4.4979344v1.0583375h1.0583375v-1.0583375z"
         id="path447" />
      <path
         d="m5.5562719 4.4979344v1.0583375h1.0583375v-1.0583375z"
         id="path449" />
      <path
         d="m3.7041813 4.4979344v1.0583375h1.0583375v-1.0583375z"
         id="path451" />
    </g>
  </g>
</svg>
