<?xml version="1.0" encoding="UTF-8" standalone="no"?>
<svg
   height="32"
   viewBox="0 0 8.4666664 8.4666671"
   width="32"
   version="1.1"
   id="svg348"
   sodipodi:docname="Arrow_30_32.svg"
   inkscape:export-filename="Arrow_30_32.png"
   inkscape:export-xdpi="96"
   inkscape:export-ydpi="96"
   inkscape:version="1.2 (dc2aedaf03, 2022-05-15)"
   xmlns:inkscape="http://www.inkscape.org/namespaces/inkscape"
   xmlns:sodipodi="http://sodipodi.sourceforge.net/DTD/sodipodi-0.dtd"
   xmlns="http://www.w3.org/2000/svg"
   xmlns:svg="http://www.w3.org/2000/svg">
  <defs
     id="defs352" />
  <sodipodi:namedview
     id="namedview350"
     pagecolor="#ffffff"
     bordercolor="#666666"
     borderopacity="1.0"
     inkscape:showpageshadow="2"
     inkscape:pageopacity="0.0"
     inkscape:pagecheckerboard="0"
     inkscape:deskcolor="#d1d1d1"
     showgrid="true"
     inkscape:zoom="28.6875"
     inkscape:cx="15.982571"
     inkscape:cy="16"
     inkscape:current-layer="svg348">
    <inkscape:grid
       type="xygrid"
       id="grid990" />
  </sodipodi:namedview>
  <g
     fill="none"
     stroke-linecap="round"
     id="g346">
    <g
       stroke="#fff"
       stroke-width="1.5875"
       id="g332">
      <path
         d="m3.1750003 2.1166554 1.0583332-1.0583333 1.0583335 1.0583335"
         stroke-linejoin="round"
         id="path320" />
      <path
         d="m4.2333333 1.0583334v6.3500003"
         id="path322" />
      <path
         d="m6.35 3.1750003 1.0583335 1.0583332-1.0583335 1.0583335"
         stroke-linejoin="round"
         id="path324" />
      <path
         d="m2.1166554 5.291667-1.0583333-1.0583335 1.0583333-1.0583332"
         stroke-linejoin="round"
         id="path326" />
      <path
         d="m3.1750001 6.35 1.0583334 1.0583341 1.0583335-1.0583341"
         stroke-linejoin="round"
         id="path328" />
      <path
         d="m1.0583334 4.2333335h6.3500003"
         id="path330" />
    </g>
    <path
       d="m3.1750003 2.1166554 1.0583332-1.0583333 1.0583335 1.0583335"
       stroke="#a00"
       stroke-linejoin="round"
       stroke-width=".529166"
       id="path334" />
    <path
       d="m4.2333333 1.0583334v6.3500003"
       stroke="#a00"
       stroke-width=".529166"
       id="path336" />
    <path
       d="m6.35 3.1750003 1.0583335 1.0583332-1.0583335 1.0583335"
       stroke="#a00"
       stroke-linejoin="round"
       stroke-width=".529166"
       id="path338" />
    <path
       d="m2.1166554 5.291667-1.0583333-1.0583335 1.0583333-1.0583332"
       stroke="#a00"
       stroke-linejoin="round"
       stroke-width=".529166"
       id="path340" />
    <path
       d="m3.1750001 6.35 1.0583334 1.0583341 1.0583335-1.0583341"
       stroke="#a00"
       stroke-linejoin="round"
       stroke-width=".529166"
       id="path342" />
    <path
       d="m1.0583334 4.2333335h6.3500003"
       stroke="#a00"
       stroke-width=".529166"
       id="path344" />
  </g>
</svg>
