<?xml version="1.0" encoding="UTF-8" standalone="no"?>
<svg
   height="48"
   viewBox="0 0 48 48"
   width="48"
   version="1.1"
   id="svg4"
   sodipodi:docname="Chart_18_48.svg"
   inkscape:export-filename="Chart_18_48.png"
   inkscape:export-xdpi="96"
   inkscape:export-ydpi="96"
   inkscape:version="1.3-beta (cedbd6c6ff, 2023-05-28)"
   xmlns:inkscape="http://www.inkscape.org/namespaces/inkscape"
   xmlns:sodipodi="http://sodipodi.sourceforge.net/DTD/sodipodi-0.dtd"
   xmlns="http://www.w3.org/2000/svg"
   xmlns:svg="http://www.w3.org/2000/svg">
  <defs
     id="defs4" />
  <sodipodi:namedview
     id="namedview4"
     pagecolor="#ffffff"
     bordercolor="#000000"
     borderopacity="0.25"
     inkscape:showpageshadow="2"
     inkscape:pageopacity="0.0"
     inkscape:pagecheckerboard="0"
     inkscape:deskcolor="#d1d1d1"
     showgrid="true"
     inkscape:current-layer="svg4">
    <inkscape:grid
       id="grid4"
       units="px"
       originx="0"
       originy="0"
       spacingx="0.5"
       spacingy="0.5"
       empcolor="#0099e5"
       empopacity="0.30196078"
       color="#0099e5"
       opacity="0.14901961"
       empspacing="2"
       dotted="false"
       gridanglex="30"
       gridanglez="30"
       visible="true" />
  </sodipodi:namedview>
  <path
     d="m7.1 7.100004h33.799999v33.799992h-33.799999z"
     fill="#fff"
     stroke="#999"
     stroke-linecap="round"
     stroke-linejoin="round"
     stroke-width="2.20001"
     id="path1" />
  <path
     d="m10 35 6.5-12.451731 3 5.976831 6-8.965246 3 2.988415 6-6.972969"
     fill="none"
     stroke="#4d4d4d"
     stroke-linecap="round"
     stroke-linejoin="round"
     stroke-width="1.7"
     id="path2" />
  <path
     d="m46.5 41.5-13.5-6v12z"
     fill="#fa0302"
     id="path3" />
  <path
     d="m 7.5,41.3 h 27"
     fill="none"
     stroke="#fa0302"
     stroke-linecap="round"
     stroke-linejoin="round"
     stroke-width="3"
     id="path4"
     sodipodi:nodetypes="cc" />
</svg>
