<?xml version="1.0" encoding="UTF-8" standalone="no"?>
<svg
   height="22"
   width="22"
   version="1.1"
   id="svg447"
   sodipodi:docname="da_elseif.svg"
   inkscape:export-filename="da_elseif.png"
   inkscape:export-xdpi="96"
   inkscape:export-ydpi="96"
   inkscape:version="1.2.1 (9c6d41e410, 2022-07-14)"
   xmlns:inkscape="http://www.inkscape.org/namespaces/inkscape"
   xmlns:sodipodi="http://sodipodi.sourceforge.net/DTD/sodipodi-0.dtd"
   xmlns="http://www.w3.org/2000/svg"
   xmlns:svg="http://www.w3.org/2000/svg">
  <defs
     id="defs451" />
  <sodipodi:namedview
     id="namedview449"
     pagecolor="#ffffff"
     bordercolor="#666666"
     borderopacity="1.0"
     inkscape:showpageshadow="2"
     inkscape:pageopacity="0.0"
     inkscape:pagecheckerboard="0"
     inkscape:deskcolor="#d1d1d1"
     showgrid="true"
     inkscape:zoom="41.727273"
     inkscape:cx="10.988017"
     inkscape:cy="11"
     inkscape:current-layer="svg447">
    <inkscape:grid
       type="xygrid"
       id="grid1970" />
  </sodipodi:namedview>
  <path
     d="m13 17h-2c-.005-.274523-.0075-.17181-.0075-.231706 0-.618923.178244-1.128038.382888-1.527343.204645-.399306.613933-.848525 1.227865-1.347657.613932-.499131.980794-.826063 1.100586-.980794.184679-.244574.277018-.514106.277018-.808594 0-.409288-.164713-.75868-.49414-1.048177-.324436-.294487-.763672-.441731-1.317709-.441731-.534071 0-.980794.152235-1.340169.456705-.359375.304471-.606445.768664-.741211 1.392578l-1.9316285-.239583c.054905-.893446.4342448-1.652127 1.1380208-2.276041.7087677-.6239153 1.6371527-.9358728 2.7851567-.9358728 1.207899 0 2.168728.3169488 2.882486.9508458.713759.628907 1.070638 1.362631 1.070638 2.201172 0 .464193-.13227.903429-.396809 1.317709-.259549.414279-.818577.978298-1.677084 1.692057-.444227.369358-.721245.666341-.831054.89095-.104818.22461-.137337.356489-.127354.935482zm-2 3v-2h2v2z"
     fill="#f00000"
     id="path423" />
  <g
     fill="none"
     id="g445">
    <g
       stroke="#d38d5f"
       transform="translate(-10 4)"
       id="g431">
      <path
         d="m12 .5h7"
         id="path425" />
      <path
         d="m12 2.5h7"
         id="path427" />
      <path
         d="m13 5 5-7"
         id="path429" />
    </g>
    <g
       stroke="#d38d5f"
       transform="translate(0 6)"
       id="g437">
      <path
         d="m15 11.5h5"
         id="path433" />
      <path
         d="m15 13.5h5"
         id="path435" />
    </g>
    <g
       stroke="#00aad4"
       stroke-linecap="round"
       stroke-linejoin="round"
       transform="translate(-12 -1)"
       id="g443">
      <path
         d="m20.5 17.5h-3.5c-1.5 0-2.5-.5-2.5-2v-2"
         id="path439" />
      <path
         d="m18.5 15.5 2 2-2 2"
         id="path441" />
    </g>
  </g>
</svg>
