<?xml version="1.0" encoding="UTF-8" standalone="no"?>
<svg
   height="16"
   width="16"
   version="1.1"
   id="svg175"
   sodipodi:docname="pkg_design_overlay.svg"
   inkscape:export-filename="pkg_design_overlay.png"
   inkscape:export-xdpi="96"
   inkscape:export-ydpi="96"
   inkscape:version="1.2.1 (9c6d41e410, 2022-07-14)"
   xmlns:inkscape="http://www.inkscape.org/namespaces/inkscape"
   xmlns:sodipodi="http://sodipodi.sourceforge.net/DTD/sodipodi-0.dtd"
   xmlns="http://www.w3.org/2000/svg"
   xmlns:svg="http://www.w3.org/2000/svg">
  <defs
     id="defs179" />
  <sodipodi:namedview
     id="namedview177"
     pagecolor="#ffffff"
     bordercolor="#666666"
     borderopacity="1.0"
     inkscape:showpageshadow="2"
     inkscape:pageopacity="0.0"
     inkscape:pagecheckerboard="0"
     inkscape:deskcolor="#d1d1d1"
     showgrid="true"
     inkscape:zoom="57.375"
     inkscape:cx="7.9912854"
     inkscape:cy="8"
     inkscape:current-layer="svg175">
    <inkscape:grid
       type="xygrid"
       id="grid460" />
  </sodipodi:namedview>
  <path
     d="m0 0h9v9h-9z"
     fill="#fff"
     id="path153" />
  <path
     d="m2.5 2.5h4v4h-4z"
     fill="none"
     stroke="#86a7d2"
     stroke-linecap="square"
     id="path155" />
  <g
     fill="#86a7d2"
     id="g173">
    <path
       d="m1 6h2v2h-2z"
       id="path157" />
    <path
       d="m6 6h2v2h-2z"
       id="path159" />
    <path
       d="m6 1h2v2h-2z"
       id="path161" />
    <path
       d="m1 1h2v2h-2z"
       id="path163" />
    <path
       d="m4 1h1v1h-1z"
       id="path165" />
    <path
       d="m1 4h1v1h-1z"
       id="path167" />
    <path
       d="m4 7h1v1h-1z"
       id="path169" />
    <path
       d="m7 4h1v1h-1z"
       id="path171" />
  </g>
</svg>
