<svg width="40" height="40" version="1.1" viewBox="0 0 40 40" xmlns="http://www.w3.org/2000/svg" xmlns:xlink="http://www.w3.org/1999/xlink">
 <defs>
  <radialGradient id="b" cx="3.170809" cy="10.788798" r="2.6875" gradientTransform="matrix(-4.9062374e-7,4.1859774,-4.185978,-1.9530321e-7,53.911571,10.476718)" gradientUnits="userSpaceOnUse">
   <stop stop-color="#aaccff" offset="0"/>
   <stop stop-color="#0057dc" offset="1"/>
  </radialGradient>
  <radialGradient id="c" cx="9.59375" cy="4.4193316" r="3.25" gradientTransform="matrix(1.8524935e-7,3.461482,-3.4614814,3.559536e-7,39.047084,-24.458696)" gradientUnits="userSpaceOnUse">
   <stop stop-color="#ffd5d5" offset="0"/>
   <stop stop-color="#dc0000" offset="1"/>
  </radialGradient>
  <radialGradient id="a" cx="5.4017634" cy="1031.9264" r="4" gradientTransform="matrix(-5.8614675e-6,2.8124539,-2.8123993,9.9204963e-6,2910.9391,-6.4525501)" gradientUnits="userSpaceOnUse">
   <stop stop-color="#fff6d5" offset="0"/>
   <stop stop-color="#ffcc00" offset="1"/>
  </radialGradient>
  <radialGradient id="d" cx="-11.5" cy="8.5" r="3.5" gradientTransform="matrix(0,2.4999589,-2.4999589,0,43.124332,50.624209)" gradientUnits="userSpaceOnUse">
   <stop stop-color="#fff" offset="0"/>
   <stop stop-color="#d5e5ff" offset="1"/>
  </radialGradient>
 </defs>
 <path d="m27.327091 27.327091 8.422939 8.422939" fill="none" stroke="#a05a2c" stroke-linecap="round" stroke-width="3.49994"/>
 <circle cx="23.749645" cy="23.749645" r="7.8123717" fill="url(#d)" fill-rule="evenodd" stroke="#dd8703" stroke-linecap="round" stroke-linejoin="round" stroke-width="1.87497"/>
 <path d="m11.249857 3.12499a8.1248665 8.1248665 0 0 0-8.124867 8.124867 8.1248665 8.1248665 0 0 0 8.124867 8.124866 8.1248665 8.1248665 0 0 0 2.314414-0.37597c1.120562-2.38112 3.053362-4.31392 5.434482-5.434482a8.1248665 8.1248665 0 0 0 0.37597-2.314414 8.1248665 8.1248665 0 0 0-8.124866-8.124867z" fill="url(#a)" fill-rule="evenodd" stroke-linecap="square" stroke-linejoin="round" stroke-width="1.24998"/>
 <path d="m11.249857 2.5c-4.825003 0-8.749857 3.924856-8.749857 8.749857 0 4.824998 3.924854 8.749856 8.749857 8.749856 0.682552 0 1.344426-0.08586 1.982388-0.234372 0.201536-0.527284 0.44236-1.036976 0.717762-1.523412-0.838272 0.322966-1.746494 0.507804-2.70015 0.507804-4.149463 0-7.499877-3.350414-7.499877-7.499876 0-4.149463 3.350414-7.499877 7.499877-7.499877 4.149462 0 7.499876 3.350414 7.499876 7.499877 0 0.953656-0.18484 1.861878-0.507804 2.70015 0.486436-0.275402 0.996128-0.516226 1.523412-0.717762 0.14852-0.637962 0.234372-1.299836 0.234372-1.982388 0-4.825001-3.924856-8.749857-8.749856-8.749857z" fill="#f5c400" fill-rule="evenodd" stroke-linecap="square" stroke-linejoin="round" stroke-width="2.49996"/>
 <path d="m26.249609 3.12499a8.1248665 8.1248665 0 0 0-8.124866 8.124867 8.1248665 8.1248665 0 0 0 0.424798 2.534138c1.557814-0.819342 3.327824-1.28416 5.20011-1.28416 3.458438 0 6.569003 1.58369 8.637553 4.062434a8.1248665 8.1248665 0 0 0 1.987272-5.312412 8.1248665 8.1248665 0 0 0-8.124867-8.124867z" fill="url(#c)" fill-rule="evenodd" stroke-linecap="square" stroke-linejoin="round" stroke-width="1.24998"/>
 <path d="m16.562269 32.387204c-2.478744-2.06855-4.062434-5.179115-4.062434-8.637553 0-1.87845 0.469542-3.653216 1.293924-5.214758a8.1248665 8.1248665 0 0 0-2.543902-0.41015 8.1248665 8.1248665 0 0 0-8.124867 8.124866 8.1248665 8.1248665 0 0 0 8.124867 8.124869 8.1248665 8.1248665 0 0 0 5.312412-1.987274z" fill="url(#b)" fill-rule="evenodd" stroke-linecap="square" stroke-linejoin="round" stroke-width="1.24998"/>
 <path d="m26.249609 2.5c-4.824998 0-8.749856 3.924856-8.749856 8.749857 0 1.000002 0.17314 1.960654 0.483392 2.856398 0.35993-0.216726 0.733864-0.414698 1.118144-0.59081-0.225874-0.715326-0.351556-1.474498-0.351556-2.265588 0-4.149463 3.350414-7.499877 7.499876-7.499877 4.149463 0 7.499877 3.350414 7.499877 7.499877 0 1.851524-0.669834 3.54188-1.777312 4.848552 0.285982 0.307068 0.554876 0.629502 0.80565 0.966782 1.380116-1.547286 2.221642-3.583542 2.221642-5.815334 0-4.825001-3.924856-8.749857-8.749857-8.749857z" fill="#ff5555" fill-rule="evenodd" stroke-linecap="square" stroke-linejoin="round" stroke-width="2.49996"/>
 <path d="m17.065191 32.777824c-0.33728-0.250772-0.659714-0.519668-0.966782-0.80565-1.306672 1.107478-2.997028 1.777312-4.848552 1.777312-4.149463 0-7.499877-3.350414-7.499877-7.499877 0-4.149462 3.350414-7.499876 7.499877-7.499876 0.79109 0 1.550262 0.12568 2.265588 0.351556 0.17612-0.38428 0.374084-0.758214 0.59081-1.118144-0.895744-0.310252-1.856396-0.483392-2.856398-0.483392-4.825003 0-8.749857 3.924856-8.749857 8.749856 0 4.825001 3.924854 8.749857 8.749857 8.749857 2.231792 0 4.268048-0.841526 5.815334-2.221642z" fill="#5599ff" fill-rule="evenodd" stroke-linecap="square" stroke-linejoin="round" stroke-width="2.49996"/>
</svg>
