<?xml version="1.0" encoding="UTF-8" standalone="no"?>
<svg
   height="36"
   viewBox="0 0 9.5249997 9.5250005"
   width="36"
   version="1.1"
   id="svg437"
   sodipodi:docname="Help_04_36.svg"
   inkscape:export-filename="Help_04_36.png"
   inkscape:export-xdpi="96"
   inkscape:export-ydpi="96"
   inkscape:version="1.2 (dc2aedaf03, 2022-05-15)"
   xmlns:inkscape="http://www.inkscape.org/namespaces/inkscape"
   xmlns:sodipodi="http://sodipodi.sourceforge.net/DTD/sodipodi-0.dtd"
   xmlns="http://www.w3.org/2000/svg"
   xmlns:svg="http://www.w3.org/2000/svg">
  <defs
     id="defs441" />
  <sodipodi:namedview
     id="namedview439"
     pagecolor="#ffffff"
     bordercolor="#666666"
     borderopacity="1.0"
     inkscape:showpageshadow="2"
     inkscape:pageopacity="0.0"
     inkscape:pagecheckerboard="0"
     inkscape:deskcolor="#d1d1d1"
     showgrid="true"
     inkscape:zoom="25.5"
     inkscape:cx="18"
     inkscape:cy="18"
     inkscape:current-layer="g435">
    <inkscape:grid
       type="xygrid"
       id="grid968" />
  </sodipodi:namedview>
  <radialGradient
     id="a"
     cx="12.1"
     cy="10.900001"
     gradientTransform="matrix(0 .4988777 -.49887766 0 6.880948 -4.593239)"
     gradientUnits="userSpaceOnUse"
     r="4.5">
    <stop
       offset="0"
       stop-color="#59f"
       id="stop422" />
    <stop
       offset="1"
       stop-color="#0055d4"
       id="stop424" />
  </radialGradient>
  <g
     stroke-linecap="round"
     id="g435">
    <circle
       cx="2.116667"
       cy="2.116667"
       fill="url(#a)"
       r="1.852083"
       stroke="#d5e5ff"
       stroke-dashoffset="1.49998"
       stroke-linejoin="round"
       stroke-width=".264583"
       transform="matrix(0 2.2500001 2.2500001 0 0 0)"
       id="circle427" />
    <g
       fill="#ffffff"
       stroke-width="0.643065"
       transform="matrix(0.61716182,0,0,0.61716182,27.431947,-634.81863)"
       id="g1377">
      <path
         d="m -36.161167,1037.9195 h -1.328125 q -0.0052,-0.2865 -0.0052,-0.349 0,-0.6458 0.213541,-1.0625 0.213542,-0.4166 0.854167,-0.9375 0.640625,-0.5208 0.765625,-0.6823 0.192708,-0.2552 0.192708,-0.5625 0,-0.427 -0.34375,-0.7291 -0.338541,-0.3073 -0.916666,-0.3073 -0.557292,0 -0.932292,0.3177 -0.375,0.3177 -0.515625,0.9687 l -1.34375,-0.1666 q 0.05729,-0.9323 0.791667,-1.5834 0.739583,-0.651 1.9375,-0.651 1.260416,0 2.005208,0.6615 0.744792,0.6562 0.744792,1.5312 0,0.4844 -0.276042,0.9167 -0.270833,0.4323 -1.166667,1.1771 -0.463541,0.3854 -0.578125,0.6197 -0.109375,0.2344 -0.09896,0.8386 z"
         id="path1373" />
      <path
         d="m -37.463542,1040.3622 v -1.4635 H -36 v 1.4635 z"
         id="path1375" />
    </g>
  </g>
</svg>
