<?xml version="1.0" encoding="UTF-8" standalone="no"?>
<svg
   width="36"
   height="36"
   version="1.1"
   viewBox="0 0 36 36"
   id="svg16"
   sodipodi:docname="tsqlite3dataset_150.svg"
   inkscape:export-filename="tsqlite3dataset_150.png"
   inkscape:export-xdpi="96"
   inkscape:export-ydpi="96"
   inkscape:version="1.3.2 (091e20e, 2023-11-25, custom)"
   xmlns:inkscape="http://www.inkscape.org/namespaces/inkscape"
   xmlns:sodipodi="http://sodipodi.sourceforge.net/DTD/sodipodi-0.dtd"
   xmlns="http://www.w3.org/2000/svg"
   xmlns:svg="http://www.w3.org/2000/svg">
  <sodipodi:namedview
     id="namedview16"
     pagecolor="#ffffff"
     bordercolor="#000000"
     borderopacity="0.25"
     inkscape:showpageshadow="2"
     inkscape:pageopacity="0.0"
     inkscape:pagecheckerboard="0"
     inkscape:deskcolor="#d1d1d1"
     showgrid="true"
     inkscape:current-layer="svg16">
    <inkscape:grid
       id="grid16"
       units="px"
       originx="0"
       originy="0"
       spacingx="0.5"
       spacingy="0.5"
       empcolor="#0099e5"
       empopacity="0.30196078"
       color="#0099e5"
       opacity="0.14901961"
       empspacing="2"
       dotted="false"
       gridanglex="30"
       gridanglez="30"
       visible="true" />
  </sodipodi:namedview>
  <defs
     id="defs3">
    <linearGradient
       id="a"
       x1="4"
       x2="22"
       y1="1"
       y2="1"
       gradientUnits="userSpaceOnUse">
      <stop
         stop-color="#4276c4"
         offset="0"
         id="stop1" />
      <stop
         stop-color="#80b3ff"
         offset=".3333333"
         id="stop2" />
      <stop
         stop-color="#04a"
         offset="1"
         id="stop3" />
    </linearGradient>
  </defs>
  <ellipse
     cx="13"
     cy="18.25"
     rx="7.65"
     ry="2.4"
     fill="none"
     fill-rule="evenodd"
     stroke="url(#a)"
     stroke-linecap="round"
     stroke-linejoin="round"
     stroke-width="2.7"
     id="ellipse3" />
  <ellipse
     cx="13"
     cy="16.3"
     rx="7.35"
     ry="2.1"
     fill="none"
     fill-rule="evenodd"
     stroke="#ffffff"
     stroke-linecap="round"
     stroke-linejoin="round"
     stroke-width="1.8"
     id="ellipse4" />
  <ellipse
     cx="13"
     cy="13.75"
     rx="7.65"
     ry="2.4"
     fill="none"
     fill-rule="evenodd"
     stroke="url(#a)"
     stroke-linecap="round"
     stroke-linejoin="round"
     stroke-width="2.7"
     id="ellipse5" />
  <ellipse
     cx="13"
     cy="11.8"
     rx="7.35"
     ry="2.1"
     fill="none"
     fill-rule="evenodd"
     stroke="#ffffff"
     stroke-linecap="round"
     stroke-linejoin="round"
     stroke-width="1.8"
     id="ellipse6" />
  <ellipse
     cx="13"
     cy="9.25"
     rx="7.65"
     ry="2.4"
     fill="none"
     fill-rule="evenodd"
     stroke="url(#a)"
     stroke-linecap="round"
     stroke-linejoin="round"
     stroke-width="2.7"
     id="ellipse7" />
  <ellipse
     cx="13"
     cy="7.3"
     rx="7.35"
     ry="2.1"
     fill="none"
     fill-rule="evenodd"
     stroke="#ffffff"
     stroke-linecap="round"
     stroke-linejoin="round"
     stroke-width="1.8"
     id="ellipse8" />
  <ellipse
     cx="13"
     cy="4.75"
     rx="8.1"
     ry="2.85"
     fill="#80b3ff"
     fill-rule="evenodd"
     stroke="url(#a)"
     stroke-linecap="round"
     stroke-linejoin="round"
     stroke-width="1.8"
     id="ellipse9" />
  <path
     d="m24.5 8v8l8-4z"
     fill="#00d455"
     fill-rule="evenodd"
     stroke="#00b100"
     stroke-linejoin="round"
     id="path9" />
  <rect
     x="3"
     y="21"
     width="30"
     height="13"
     ry="2"
     fill="#d45500"
     fill-rule="evenodd"
     id="rect9" />
  <path
     d="m16.6 24.450185v6.099629h3.434356"
     fill="none"
     stroke="#ffffff"
     stroke-linecap="round"
     stroke-linejoin="round"
     stroke-width=".9"
     id="path10" />
  <path
     d="m30.6 2.5425696c0.159411-0.6280874 0.726432-1.0925696 1.40148-1.0925696 0.798712 0 1.446196 0.6502532 1.446196 1.452381v0.1452381c0 0.8021278-0.647484 1.452381-1.446196 1.452381 0.798712 0 1.446196 0.6502532 1.446196 1.452381v0.1452381c0 0.8021278-0.647484 1.452381-1.446196 1.452381-0.675048 0-1.242069-0.4644822-1.40148-1.0925696"
     fill="none"
     stroke="#ff6600"
     stroke-linecap="round"
     stroke-linejoin="round"
     stroke-width=".9"
     id="path11" />
  <path
     d="m13.2488 28.952326 2.17013 1.597535m-2.8935-6.099677c1.12211 0 2.02545 0.835796 2.02545 1.873983v2.351665c0 1.038187-0.90334 1.873982-2.02545 1.873982-1.12209 0-2.02543-0.835795-2.02543-1.873982v-2.351665c0-1.038186 0.90334-1.873983 2.02543-1.873983z"
     fill="none"
     stroke="#ffffff"
     stroke-linecap="round"
     stroke-linejoin="round"
     stroke-width=".9"
     id="path12" />
  <path
     d="m8.55778 24.937584c-0.38916-0.268336-0.96702-0.398084-1.65738-0.398084-0.97558 0-1.86333 0.51316-1.86333 1.580025 0 0.835745 0.7048 1.179396 1.86333 1.380475 1.61317 0.279991 1.86332 0.82421 1.86332 1.559105 1e-5 1.327913-1.10478 1.580025-1.86332 1.580025-0.58885 0-1.19328-0.07169-1.9514-0.464454"
     fill="none"
     stroke="#ffffff"
     stroke-linecap="round"
     stroke-linejoin="round"
     stroke-width=".9"
     id="path13" />
  <path
     d="m30.323952 30.146622c-0.276979 0.237203-0.657533 0.379862-1.323952 0.379862-0.88197 0-1.592003-0.720333-1.592003-1.615095v-1.126813c0-0.894762 0.710033-1.615094 1.592003-1.615094 0.881969 0 1.592002 0.720332 1.592002 1.615094v0.525848h-3.184005"
     fill="none"
     stroke="#ffffff"
     stroke-linecap="round"
     stroke-linejoin="round"
     stroke-width=".9"
     id="path14" />
  <path
     d="m21.5 24.4v0.108925m0 1.633877v4.357002"
     fill="none"
     stroke="#ffffff"
     stroke-linecap="round"
     stroke-linejoin="round"
     stroke-width=".9"
     id="path15" />
  <path
     d="m23.795 26.185094h1.73673m0.0724 4.357002h-0.35892c-0.49346 0-0.72654-0.192393-0.72654-0.689859v-4.829011"
     fill="none"
     stroke="#ffffff"
     stroke-linecap="round"
     stroke-linejoin="round"
     stroke-width=".9"
     id="path16" />
</svg>
