<?xml version="1.0" encoding="UTF-8" standalone="no"?>
<svg
   height="32"
   width="32"
   version="1.1"
   id="svg171"
   sodipodi:docname="menu_run_cursor_200.svg"
   inkscape:export-filename="menu_run_cursor_200.png"
   inkscape:export-xdpi="96"
   inkscape:export-ydpi="96"
   inkscape:version="1.2.2 (732a01da63, 2022-12-09)"
   xmlns:inkscape="http://www.inkscape.org/namespaces/inkscape"
   xmlns:sodipodi="http://sodipodi.sourceforge.net/DTD/sodipodi-0.dtd"
   xmlns="http://www.w3.org/2000/svg"
   xmlns:svg="http://www.w3.org/2000/svg">
  <defs
     id="defs175" />
  <sodipodi:namedview
     id="namedview173"
     pagecolor="#ffffff"
     bordercolor="#666666"
     borderopacity="1.0"
     inkscape:showpageshadow="2"
     inkscape:pageopacity="0.0"
     inkscape:pagecheckerboard="0"
     inkscape:deskcolor="#d1d1d1"
     showgrid="true"
     inkscape:zoom="28.6875"
     inkscape:cx="14.745098"
     inkscape:cy="16"
     inkscape:current-layer="svg171">
    <inkscape:grid
       type="xygrid"
       id="grid557" />
  </sodipodi:namedview>
  <path
     d="M 7.5,2.9999994 22.5,15 7.5,27 Z"
     fill="#00cc00"
     fill-rule="evenodd"
     id="path151"
     style="stroke:#008000;stroke-linejoin:round" />
  <g
     fill="none"
     transform="translate(-1)"
     id="g169">
    <g
       stroke="#fff"
       stroke-width="5"
       id="g159">
      <path
         d="m26 7 2 1.5 2-1.5"
         stroke-linecap="round"
         id="path153" />
      <path
         d="m30 23-2-1.5-2 1.5"
         stroke-linecap="round"
         id="path155" />
      <path
         d="m28 8.5v13"
         id="path157" />
    </g>
    <g
       stroke="#333"
       stroke-width="2"
       id="g167">
      <path
         d="m26 7 2 1.5 2-1.5"
         stroke-linecap="round"
         id="path161" />
      <path
         d="m30 23-2-1.5-2 1.5"
         stroke-linecap="round"
         id="path163" />
      <path
         d="m28 8.5v13"
         id="path165" />
    </g>
  </g>
</svg>
