<?xml version="1.0" encoding="UTF-8" standalone="no"?>
<svg
   width="24"
   height="24"
   version="1.1"
   viewBox="0 0 24 24"
   id="svg42"
   sodipodi:docname="win_objectinspector_ico_024.svg"
   inkscape:export-filename="win_objectinspector_ico_024.png"
   inkscape:export-xdpi="96"
   inkscape:export-ydpi="96"
   inkscape:version="1.1.1 (3bf5ae0d25, 2021-09-20)"
   xmlns:inkscape="http://www.inkscape.org/namespaces/inkscape"
   xmlns:sodipodi="http://sodipodi.sourceforge.net/DTD/sodipodi-0.dtd"
   xmlns="http://www.w3.org/2000/svg"
   xmlns:svg="http://www.w3.org/2000/svg">
  <defs
     id="defs46" />
  <sodipodi:namedview
     id="namedview44"
     pagecolor="#ffffff"
     bordercolor="#666666"
     borderopacity="1.0"
     inkscape:pageshadow="2"
     inkscape:pageopacity="0.0"
     inkscape:pagecheckerboard="0"
     showgrid="false"
     inkscape:zoom="31.041667"
     inkscape:cx="5.2510067"
     inkscape:cy="12"
     inkscape:current-layer="svg42" />
  <radialGradient
     id="a"
     cx="12"
     cy="12"
     r="13.5"
     gradientUnits="userSpaceOnUse">
    <stop
       stop-color="#9bb48d"
       offset="0"
       id="stop2" />
    <stop
       stop-color="#fff"
       offset="1"
       id="stop4" />
  </radialGradient>
  <radialGradient
     id="b"
     cx="11.999"
     cy="11.999"
     r="11.5"
     gradientUnits="userSpaceOnUse">
    <stop
       stop-color="#658155"
       offset="0"
       id="stop7" />
    <stop
       stop-color="#9bb48d"
       offset=".56522"
       id="stop9" />
    <stop
       stop-color="#fff"
       offset="1"
       id="stop11" />
  </radialGradient>
  <path
     d="m19.666 19.312c.34393.11129.98447.02608 1.3428-.26067.35833-.28678.7006-.8689.95059-1.3018.25002-.43298.58301-1.0204.65222-1.4741.06918-.45375-.17731-1.051-.44568-1.2932-1.0839-.9783-1.4484-1.2101-1.4481-2.9823-.000283-1.7722.36416-2.004 1.4481-2.9823.26837-.2422.51486-.8395.44568-1.2932-.06921-.4537-.40224-1.0411-.65222-1.4741-.24998-.43298-.59226-1.0151-.95059-1.3018-.35837-.28677-.9989-.37196-1.3428-.26068-1.3892.44949-1.7722.6492-3.307-.23716-1.535-.88585-1.5535-1.3173-1.8589-2.7451-.075562-.35348-.46961-.8656-.89719-1.0325-.42754-.16694-1.1028-.17227-1.6028-.17227s-1.1753.005329-1.6028.17227c-.42754.16693-.82163.67905-.89722 1.0325-.30532 1.4278-.32389 1.8593-1.8589 2.7451-1.5347.88635-1.9177.68665-3.3069.23716-.34393-.11128-.9845-.026117-1.3428.26068-.35837.28677-.70061.86885-.95059 1.3018-.25002.43298-.58301 1.0204-.65222 1.4741-.06921.45375.17731 1.051.44565 1.2932 1.0839.9783 1.4484 1.2101 1.4481 2.9823.0002823 1.7722-.36416 2.004-1.4481 2.9823-.26833.2422-.51482.8395-.44565 1.2932.06921.4537.4022 1.0411.65222 1.4741.24998.43298.59222 1.0151.95059 1.3018.35833.28677.9989.37195 1.3428.26067 1.3892-.44949 1.7722-.6492 3.3069.23716 1.535.88585 1.5536 1.3173 1.8589 2.7451.075598.35348.46965.8656.89722 1.0325.42754.16693 1.1028.17227 1.6028.17227s1.1753-.0053 1.6028-.17227c.42754-.16694.82159-.67905.89719-1.0325.30536-1.4278.32389-1.8593 1.8589-2.7451 1.5347-.88635 1.9177-.68665 3.307-.23716z"
     fill="url(#a)"
     stroke-width=".5"
     id="path14" />
  <path
     d="m20.012 9.0004c-1.1116.86785-5.512.99945-7.512 1.9994-1.5996.7998-1.7787 1.4956-3 4-.65469 1.3425-3.4268 1.9378-3.7721 2.1395-.36253.21174-1.6783 1.488-2.2929 2.238.47498-.006 3.415-.28492 4.2066.17229 1.535.88584 1.553 1.3173 1.8584 2.7451.075598.35349.46993.8653.89744 1.0322.42754.16693 1.1026.17187 1.6026.17187s1.175-.0049 1.6026-.17187c.42754-.16693.82184-.67875.89744-1.0322.30532-1.4278.32339-1.8593 1.8584-2.7451 1.5347-.88635 1.9184-.6868 3.3076-.2373.34393.11128.98443.02605 1.3427-.26074.35837-.28678.70022-.86875.9502-1.3017.25002-.43298.58315-1.0209.65236-1.4746.06917-.4537-.17696-1.0507-.44533-1.2929-1.0839-.9783-1.4485-1.2102-1.4482-2.9824-.000318-1.7722.3643-2.0041 1.4482-2.9824.26837-.2422.5145-.83925.44533-1.2929-.032823-.21589-.335-1.1208-.45002-1.3662-.4309.71155-1.3997 2.057-2.1492 2.6421z"
     fill="url(#b)"
     stroke-width=".5"
     id="path16" />
  <path
     d="m19.666 19.312c.34393.11129.98445.02608 1.3428-.26067.35831-.28677.70056-.86887.95058-1.3019.24998-.43299.58301-1.0204.65219-1.4741s-.17731-1.051-.44566-1.2932c-1.0838-.97832-1.4483-1.2101-1.4481-2.9823-.000281-1.7722.36418-2.004 1.448-2.9823.26835-.2422.51484-.83949.44562-1.2932-.069183-.45371-.40218-1.0412-.65219-1.4741-.24998-.43299-.59219-1.0151-.95058-1.3019-.35831-.28677-.99884-.37196-1.3428-.26068-1.3892.44949-1.7722.64919-3.3068-.23716-1.5349-.88585-1.5535-1.3174-1.8588-2.7452-.075575-.35348-.46961-.86561-.89714-1.0325-.4275-.16693-1.1027-.17227-1.6028-.17227-.5 0-1.1752.005343-1.6028.17227-.4275.16693-.82154.67903-.89714 1.0325-.3053 1.4278-.32388 1.8593-1.8588 2.7452-1.5346.88634-1.9176.68665-3.3068.23716-.34396-.11129-.98449-.026089-1.3428.26067-.35831.28677-.70056.86887-.95058 1.3019-.24998.43299-.58297 1.0204-.65219 1.4741-.069183.4537.17731 1.051.44566 1.2932 1.0838.97832 1.4483 1.2101 1.448 2.9823.0003142 1.7722-.36414 2.004-1.448 2.9823-.26835.2422-.51484.83949-.44566 1.2932.069218.4537.40221 1.0412.65219 1.4741.25002.43299.59223 1.0151.95058 1.3019.35835.28677.99888.37196 1.3428.26067 1.3892-.4495 1.7722-.64919 3.3068.23716 1.5349.88584 1.5535 1.3174 1.8588 2.7452.075609.35349.46965.86561.89714 1.0325.42753.16693 1.1028.17226 1.6028.17226.50003.000003 1.1753-.0054 1.6028-.17226.42753-.16693.82157-.67903.89714-1.0325.30533-1.4278.32388-1.8593 1.8588-2.7452 1.5346-.88634 1.9176-.68665 3.3068-.23717z"
     fill="none"
     stroke="#4c6241"
     stroke-linejoin="round"
     id="path18" />
  <g
     stroke-width=".48314"
     id="g30">
    <path
       d="m7.5655 6.8143c0.95635 0 1.6871 0.25174 1.7692 1.2095 0.13878 1.6201 0.23568 2.6642-0.03667 3.4678-0.13628 0.40216-0.52504 1.3282-1.2344 2.163-0.44468 0.52322-0.74782 1.0735-0.64417 1.8167 0.090395 0.64813 0.14671 1.5499 0.67203 1.7048-0.054749 0.29363-0.11385 0.32107-0.37188 0.53436-0.62884-0.24475-0.78557-1.3636-0.86405-2.2335-0.068471-0.75893 0.13339-1.5638 0.78929-2.2654 1.2681-1.3565 1.6026-2.5382 1.1957-3.7423-0.13442-0.39777-0.067601-0.36772-1.207-0.31231-1.1394 0.055416-1.7593-0.81842-2.022-1.5666-0.28345-0.15691-0.91036 0.046703-1.3443 0.15512 0.37063-0.63411 2.2668-0.93104 3.2984-0.93104z"
       fill="#333"
       id="path20" />
    <ellipse
       transform="matrix(.99248 .12237 -.12137 .99261 0 0)"
       cx="8.4931"
       cy="7.0365"
       rx="1.285"
       ry=".74756"
       fill="#fff"
       id="ellipse22" />
    <path
       d="m12 4.638-0.24155 2.1741 0.24155 1.691 0.24159-1.691z"
       fill="#333"
       id="path24" />
    <path
       d="m16.435 6.8143c-0.95635 0-1.6871 0.25174-1.7692 1.2095-0.13878 1.6201-0.23568 2.6642 0.03667 3.4678 0.13628 0.40216 0.52504 1.3282 1.2344 2.163 0.44468 0.52322 0.74782 1.0735 0.64417 1.8167-0.0904 0.64813-0.14671 1.5499-0.67203 1.7048 0.05475 0.29363 0.11385 0.32107 0.37188 0.53436 0.62884-0.24475 0.78557-1.3636 0.86405-2.2335 0.06847-0.75893-0.13339-1.5638-0.78929-2.2654-1.2682-1.3565-1.6026-2.5382-1.1957-3.7423 0.13442-0.39777 0.0676-0.36772 1.207-0.31231 1.1394 0.055416 1.7593-0.81842 2.022-1.5666 0.28345-0.15691 0.91037 0.046703 1.3443 0.15512-0.37063-0.63411-2.2668-0.93104-3.2984-0.93104z"
       fill="#333"
       id="path26" />
    <ellipse
       transform="matrix(-.99248 .12237 .12137 .99261 0 0)"
       cx="-15.329"
       cy="9.9727"
       rx="1.285"
       ry=".74756"
       fill="#fff"
       id="ellipse28" />
  </g>
  <ellipse
     cx="7.7365"
     cy="7.7043"
     rx=".68206"
     ry=".51154"
     fill="#500"
     fill-opacity=".97647"
     stroke-width=".48315"
     id="ellipse32" />
  <ellipse
     transform="scale(-1,1)"
     cx="-16.263"
     cy="7.7043"
     rx=".68206"
     ry=".51154"
     fill="#500"
     fill-opacity=".97647"
     stroke-width=".48314"
     id="ellipse34" />
  <ellipse
     cx="7.4302"
     cy="7.5679"
     rx=".20462"
     ry=".20462"
     fill="#fff"
     stroke-width=".96628"
     id="ellipse36" />
  <ellipse
     cx="15.956"
     cy="7.5679"
     rx=".20462"
     ry=".20462"
     fill="#fff"
     stroke-width=".96628"
     id="ellipse38" />
  <path
     d="m10.264 13.947c-0.76694-0.01306-0.89676 1.279-0.1521 1.6097 1.0831 0.48099 1.3791 1.0702 1.6587 1.4258l0.04598 0.68991c-0.33677 0.10982-2.1262 0.53465-1.9318 0.87384 0.81477-0.06761 1.2654-0.27586 2.1155-0.27589v0.0016c0.85013 2.9e-5 1.3008 0.20828 2.1155 0.27589 0.19441-0.3392-1.595-0.76403-1.9318-0.87384l0.04598-0.68991c0.2796-0.3556 0.57564-0.94482 1.6587-1.4258 0.74466-0.3307 0.61484-1.6228-0.1521-1.6097-0.76686 0.01306-1.1845 0.09195-1.7364 0.09197v-0.0016c-0.55184-1.7e-5 -0.96951-0.0789-1.7364-0.09197z"
     fill="#333"
     stroke-width=".48294"
     id="path40" />
  <g
     id="g863">
    <rect
       y="14.000007"
       x="10"
       height="9.9999933"
       width="13"
       id="rect949"
       style="opacity:1;fill:#749acc;fill-opacity:1;stroke:none;stroke-width:1.57355;stroke-linecap:butt;stroke-linejoin:round;stroke-miterlimit:4;stroke-dasharray:none;stroke-opacity:1;paint-order:normal" />
    <rect
       y="16"
       x="11"
       height="7"
       width="5"
       id="rect951"
       style="opacity:1;fill:#ffffff;fill-opacity:1;stroke:none;stroke-width:0.107121;stroke-linecap:butt;stroke-linejoin:round;stroke-miterlimit:4;stroke-dasharray:none;stroke-opacity:1;paint-order:normal" />
    <rect
       style="opacity:1;fill:#ffffff;fill-opacity:1;stroke:none;stroke-width:0.107121;stroke-linecap:butt;stroke-linejoin:round;stroke-miterlimit:4;stroke-dasharray:none;stroke-opacity:1;paint-order:normal"
       id="rect891"
       width="5"
       height="7"
       x="17"
       y="16" />
    <g
       id="g1017">
      <rect
         style="opacity:1;fill:#808080;fill-opacity:1;stroke:none;stroke-width:0.910046;stroke-linecap:butt;stroke-linejoin:round;stroke-miterlimit:4;stroke-dasharray:none;stroke-opacity:1;paint-order:normal"
         id="rect964"
         width="3"
         height="0.5"
         x="12"
         y="17" />
      <rect
         y="19"
         x="12"
         height="0.5"
         width="3"
         id="rect993"
         style="opacity:1;fill:#808080;fill-opacity:1;stroke:none;stroke-width:0.910046;stroke-linecap:butt;stroke-linejoin:round;stroke-miterlimit:4;stroke-dasharray:none;stroke-opacity:1;paint-order:normal" />
      <rect
         style="opacity:1;fill:#808080;fill-opacity:1;stroke:none;stroke-width:0.910046;stroke-linecap:butt;stroke-linejoin:round;stroke-miterlimit:4;stroke-dasharray:none;stroke-opacity:1;paint-order:normal"
         id="rect997"
         width="3"
         height="0.5"
         x="12"
         y="21" />
    </g>
    <g
       transform="translate(6)"
       id="g1025">
      <rect
         y="17"
         x="12"
         height="0.5"
         width="3"
         id="rect1019"
         style="opacity:1;fill:#808080;fill-opacity:1;stroke:none;stroke-width:0.910046;stroke-linecap:butt;stroke-linejoin:round;stroke-miterlimit:4;stroke-dasharray:none;stroke-opacity:1;paint-order:normal" />
      <rect
         style="opacity:1;fill:#808080;fill-opacity:1;stroke:none;stroke-width:0.910046;stroke-linecap:butt;stroke-linejoin:round;stroke-miterlimit:4;stroke-dasharray:none;stroke-opacity:1;paint-order:normal"
         id="rect1021"
         width="3"
         height="0.5"
         x="12"
         y="19" />
      <rect
         y="21"
         x="12"
         height="0.5"
         width="3"
         id="rect1023"
         style="opacity:1;fill:#808080;fill-opacity:1;stroke:none;stroke-width:0.910046;stroke-linecap:butt;stroke-linejoin:round;stroke-miterlimit:4;stroke-dasharray:none;stroke-opacity:1;paint-order:normal" />
    </g>
  </g>
</svg>
