<?xml version="1.0" encoding="UTF-8" standalone="no"?>
<svg
   height="24"
   width="24"
   version="1.1"
   id="svg278"
   sodipodi:docname="Time_10_24.svg"
   inkscape:export-filename="Time_10_24.png"
   inkscape:export-xdpi="96"
   inkscape:export-ydpi="96"
   inkscape:version="1.2.1 (9c6d41e410, 2022-07-14)"
   xmlns:inkscape="http://www.inkscape.org/namespaces/inkscape"
   xmlns:sodipodi="http://sodipodi.sourceforge.net/DTD/sodipodi-0.dtd"
   xmlns="http://www.w3.org/2000/svg"
   xmlns:svg="http://www.w3.org/2000/svg">
  <defs
     id="defs282" />
  <sodipodi:namedview
     id="namedview280"
     pagecolor="#ffffff"
     bordercolor="#666666"
     borderopacity="1.0"
     inkscape:pageshadow="2"
     inkscape:pageopacity="0.0"
     inkscape:pagecheckerboard="0"
     inkscape:deskcolor="#d1d1d1"
     showgrid="true"
     inkscape:zoom="38.25"
     inkscape:cx="12"
     inkscape:cy="12"
     inkscape:current-layer="svg278"
     inkscape:showpageshadow="2">
    <inkscape:grid
       type="xygrid"
       id="grid845" />
  </sodipodi:namedview>
  <path
     d="m 2.499996,0.5 h 19.000008 v 23 H 2.499996 Z"
     fill="#ffffff"
     stroke="#3771c8"
     stroke-linecap="round"
     id="path266"
     style="stroke-width:0.999992;stroke:#00aad4;stroke-opacity:1;fill:none" />
  <path
     d="M 2,0 H 22 V 6 H 2 Z"
     fill="#d40000"
     id="path268"
     style="stroke-width:0.999995;fill:#00aad4;fill-opacity:1;stroke:none" />
  <path
     d="M 6.1699219,16.966492 H 8.103515 V 10.220915 L 6,10.647289 V 9.5575769 l 2.0917968,-0.426374 h 1.1835936 v 7.8352891 h 1.9335926 v 1.006769 H 6.1699219 Z"
     id="path270"
     style="fill:#00aad4;fill-opacity:1;stroke:none" />
  <path
     d="m 12.91714,9.1312029 h 4.646484 v 1.0067691 h -3.5625 v 2.167561 q 0.257813,-0.08847 0.515626,-0.130295 0.257812,-0.04725 0.515625,-0.04725 1.464843,0 2.320312,0.811428 0.855468,0.811327 0.855468,2.197118 0,1.427312 -0.878906,2.220945 -0.878906,0.787701 -2.478515,0.787701 -0.550781,0 -1.125,-0.0945 -0.568359,-0.0945 -1.177734,-0.284316 v -1.202212 q 0.527343,0.290248 1.089843,0.432305 0.5625,0.142159 1.189453,0.142159 1.013672,0 1.605469,-0.538874 0.591797,-0.538975 0.591797,-1.462903 0,-0.923827 -0.591797,-1.462801 -0.591797,-0.538975 -1.605469,-0.538975 -0.474609,0 -0.949219,0.106669 -0.468749,0.106568 -0.960937,0.331669 z"
     id="path272"
     style="fill:#00aad4;fill-opacity:1;stroke:none" />
</svg>
