<?xml version="1.0" encoding="UTF-8" standalone="no"?>
<svg
   width="32"
   height="32"
   version="1.1"
   viewBox="0 0 32 32"
   id="svg16"
   sodipodi:docname="Bug_01_32.svg"
   inkscape:export-filename="Bug_01_32.png"
   inkscape:export-xdpi="96"
   inkscape:export-ydpi="96"
   inkscape:version="1.3.2 (091e20e, 2023-11-25, custom)"
   xmlns:inkscape="http://www.inkscape.org/namespaces/inkscape"
   xmlns:sodipodi="http://sodipodi.sourceforge.net/DTD/sodipodi-0.dtd"
   xmlns="http://www.w3.org/2000/svg"
   xmlns:svg="http://www.w3.org/2000/svg">
  <sodipodi:namedview
     id="namedview16"
     pagecolor="#ffffff"
     bordercolor="#000000"
     borderopacity="0.25"
     inkscape:showpageshadow="2"
     inkscape:pageopacity="0.0"
     inkscape:pagecheckerboard="0"
     inkscape:deskcolor="#d1d1d1"
     showgrid="true"
     inkscape:current-layer="svg16">
    <inkscape:grid
       id="grid16"
       units="px"
       originx="0"
       originy="0"
       spacingx="0.5"
       spacingy="0.5"
       empcolor="#0099e5"
       empopacity="0.30196078"
       color="#0099e5"
       opacity="0.14901961"
       empspacing="2"
       dotted="false"
       gridanglex="30"
       gridanglez="30"
       visible="true" />
  </sodipodi:namedview>
  <defs
     id="defs6">
    <linearGradient
       id="c"
       x1="23"
       x2="23"
       y1="6.5"
       y2="15"
       gradientTransform="matrix(1.2872146,1.2879298,-1.2876273,1.2883426,-1.0365287,-23.624749)"
       gradientUnits="userSpaceOnUse">
      <stop
         stop-color="#89a02c"
         offset="0"
         id="stop1" />
      <stop
         stop-color="#445016"
         offset="1"
         id="stop2" />
    </linearGradient>
    <linearGradient
       id="b"
       x1="25.714283"
       x2="25.714283"
       y1="15.5"
       y2="6.2142854"
       gradientTransform="matrix(1.2872146,1.2879298,-1.2876273,1.2883426,-1.0365287,-23.624749)"
       gradientUnits="userSpaceOnUse">
      <stop
         stop-color="#668000"
         offset="0"
         id="stop3" />
      <stop
         stop-color="#aad400"
         offset="1"
         id="stop4" />
    </linearGradient>
    <radialGradient
       id="a"
       cx="21.957434"
       cy="5.9936466"
       r="3.105469"
       gradientTransform="matrix(1.2876332 1.2884669 -.96603772 .9660378 -2.4830354 -22.081513)"
       gradientUnits="userSpaceOnUse">
      <stop
         stop-color="#803300"
         offset="0"
         id="stop5" />
      <stop
         stop-color="#d45500"
         offset="1"
         id="stop6" />
    </radialGradient>
  </defs>
  <path
     d="m23.999998 11.000001 4.999999-2.0000001"
     fill="none"
     stroke="#d4aa00"
     stroke-linecap="round"
     stroke-linejoin="round"
     stroke-width="2"
     id="path6" />
  <path
     d="m20.999998 8.0000009 2-4.9999985"
     fill="none"
     stroke="#d4aa00"
     stroke-linecap="round"
     stroke-linejoin="round"
     stroke-width="2"
     id="path7" />
  <path
     d="m24.063126 7.9305649a9.1200536 11.839661 44.937656 0 0-5.813164-2.172798l-0.0013 7.9904701 8.00615-0.0013a9.1200536 11.839661 44.937656 0 0-2.191706-5.8163901z"
     fill="url(#a)"
     stroke-linejoin="round"
     stroke-width="6.2462"
     id="path8" />
  <g
     transform="matrix(1.9052958 .51052264 -.51052248 1.9052964 4.1232235 -3.3353921)"
     fill="none"
     stroke="#aca793"
     stroke-linecap="round"
     stroke-linejoin="round"
     stroke-width="1.01394"
     id="g14">
    <path
       d="m6.1575832 1.6752295-0.7169623 1.2418149 0.5248526 1.9587769"
       id="path9" />
    <path
       d="m1.1457046 10.393524 0.7101043-1.2674054 1.9587775-0.5248528"
       id="path10" />
    <path
       d="m1.5582243 6.0567401 1.4690831-0.3936396 2.617826 0.9355797"
       id="path11" />
    <path
       d="m14.850289 6.6939636-0.716963 1.2418148-1.958777 0.5248529"
       id="path12" />
    <path
       d="m9.8059587 15.393524 0.7425553-1.248671-0.524852-1.958777"
       id="path13" />
    <path
       d="m13.355467 12.867879-0.393639-1.469082-2.121016-1.7984674"
       id="path14" />
  </g>
  <path
     d="m26.254842 13.706703-7.965922 0.0013 0.0013-7.9451841a9.1200536 11.839661 44.937656 0 0-9.0427775 4.092286 9.1200536 11.839661 44.937656 0 0-1.923448 14.823937 9.1200536 11.839661 44.937656 0 0 14.815706-1.92452 9.1200536 11.839661 44.937656 0 0 4.115168-9.047793z"
     fill="url(#b)"
     stroke-linejoin="round"
     stroke-width="6.2462"
     id="path15" />
  <path
     d="m18.912616 13.083935-10.944832 10.950913"
     fill="#c83737"
     stroke="url(#c)"
     stroke-linecap="round"
     stroke-linejoin="round"
     stroke-width="2.1538"
     id="path16" />
</svg>
