<svg width="24" height="24" version="1.1" xmlns="http://www.w3.org/2000/svg">
 <linearGradient id="a" x1="20.98311" x2="13.516894" y1="-3.0168898" y2="-10.483106" gradientTransform="matrix(.98778273 0 0 .98778273 .46074562 24.167532)" gradientUnits="userSpaceOnUse">
  <stop stop-color="#0055d4" offset="0"/>
  <stop stop-color="#5599ff" offset="1"/>
 </linearGradient>
 <g stroke="#ffffff" stroke-linecap="round" stroke-width="1.2">
  <circle transform="matrix(0,1,1,0,0,0)" cx="17.5" cy="17.5" r="5.8999996" fill="url(#a)" stroke-dashoffset="1.49998" stroke-linejoin="round"/>
  <path d="m17.5 15v5" fill="none"/>
  <path d="m20 17.5h-5" fill="none"/>
 </g>
</svg>
