<svg width="32" height="32" version="1.0" xmlns="http://www.w3.org/2000/svg">
 <defs>
  <radialGradient id="a" cx="7.6889405" cy="7.972857" r="4.5" gradientTransform="matrix(1.5555556,-8.7662443e-8,7.513925e-8,1.3333334,3.555554,5.8095228)" gradientUnits="userSpaceOnUse">
   <stop stop-color="#ffffff" offset="0"/>
   <stop stop-color="#aaccff" offset="1"/>
  </radialGradient>
 </defs>
 <rect x=".5" y="8.5" width="31" height="19" rx="2" ry="2" fill="#e6e6e6" fill-rule="evenodd" stroke="#2a7efe" stroke-linecap="round" stroke-linejoin="round" style="paint-order:normal"/>
 <path d="m11.866667 2.5000004h8.266666c1.144934 0 1.952742 0.9348946 2.066667 2.0833333l1.033333 10.416666h-14.466666l1.0333334-10.416666c0.113925-1.1484387 0.9217326-2.0833333 2.0666666-2.0833333z" fill="#e6e6e6" fill-rule="evenodd" stroke="#2a7efe" stroke-linecap="round" stroke-linejoin="round" style="paint-order:normal"/>
 <circle cx="16" cy="17" r="8" fill="url(#a)" fill-rule="evenodd" stroke="#2d68a3" stroke-linecap="round" stroke-linejoin="round" stroke-width=".999998" style="paint-order:normal"/>
 <path d="m2.25 9v18" fill="none" stroke="#488acc" stroke-linejoin="round" stroke-width="2.5"/>
 <path d="m19.5 5.5h-7" fill="none" stroke="#488acc" stroke-linejoin="round" stroke-width="2"/>
 <path d="m28 12h-2" fill="none" stroke="#488acc" stroke-linejoin="round" stroke-width="2"/>
</svg>
