<svg width="24" height="24" version="1.1" xmlns="http://www.w3.org/2000/svg">
 <path d="m18.822854 16.999999a1.8228533 1.8228533 0 0 1 -1.822853 1.822853 1.8228533 1.8228533 0 0 1 -1.822853-1.822853 1.8228533 1.8228533 0 0 1 1.822853-1.822854 1.8228533 1.8228533 0 0 1 1.822853 1.822854zm-4.86513-5.441319.467822 1.835758-1.029963 1.030251-1.838179-.467411-.557429 1.345755 1.630296.969279-.000202 1.456791-1.628876.967276.557488 1.345899 1.835758-.467822 1.030251 1.029964-.467411 1.838178 1.345754.557428.96928-1.630295 1.45679.000201.967276 1.628876 1.345899-.557487-.467822-1.835759 1.029964-1.03025 1.838179.46741.557427-1.345753-1.630295-.969281.000202-1.45679 1.628875-.967277-.557488-1.345898-1.835757.467823-1.03025-1.029964.46741-1.838178-1.345754-.55743-.969281 1.630296-1.456789-.000202-.967278-1.628876z" fill="#3771c8" stroke="#fffffe" stroke-dashoffset="1.49998" stroke-linejoin="round" stroke-width="2" style="paint-order:stroke fill markers"/>
</svg>
