<?xml version="1.0" encoding="UTF-8" standalone="no"?>
<svg
   height="16"
   width="16"
   version="1.1"
   id="svg10"
   sodipodi:docname="Align_06_16.svg"
   inkscape:export-filename="Align_06_16.png"
   inkscape:export-xdpi="96"
   inkscape:export-ydpi="96"
   inkscape:version="1.3-beta (cedbd6c6ff, 2023-05-28)"
   xmlns:inkscape="http://www.inkscape.org/namespaces/inkscape"
   xmlns:sodipodi="http://sodipodi.sourceforge.net/DTD/sodipodi-0.dtd"
   xmlns="http://www.w3.org/2000/svg"
   xmlns:svg="http://www.w3.org/2000/svg">
  <defs
     id="defs10" />
  <sodipodi:namedview
     id="namedview10"
     pagecolor="#ffffff"
     bordercolor="#000000"
     borderopacity="0.25"
     inkscape:showpageshadow="2"
     inkscape:pageopacity="0.0"
     inkscape:pagecheckerboard="0"
     inkscape:deskcolor="#d1d1d1"
     showgrid="true"
     inkscape:zoom="56.8125"
     inkscape:cx="1.7161716"
     inkscape:cy="8.0176018"
     inkscape:current-layer="svg10">
    <inkscape:grid
       id="grid10"
       units="px"
       originx="0"
       originy="0"
       spacingx="0.5"
       spacingy="0.5"
       empcolor="#0099e5"
       empopacity="0.30196078"
       color="#0099e5"
       opacity="0.14901961"
       empspacing="2"
       dotted="false"
       gridanglex="30"
       gridanglez="30"
       visible="true" />
  </sodipodi:namedview>
  <path
     d="M 4,13.5 H 14"
     id="path1"
     style="fill:none;stroke:#00aad4" />
  <path
     d="M 4,11.5 H 14"
     id="path2"
     style="fill:none;stroke:#00aad4" />
  <path
     d="m 7,9.5 h 7"
     id="path3"
     style="fill:none;stroke:#00aad4" />
  <path
     d="m 7,7.5 h 7"
     id="path4"
     style="fill:none;stroke:#00aad4" />
  <path
     d="m 7,5.5 h 7"
     id="path5"
     style="fill:none;stroke:#00aad4" />
  <path
     d="M 4,3.5 H 14"
     id="path6"
     style="fill:none;stroke:#00aad4" />
  <path
     d="M 4,1.5 H 14"
     id="path7"
     style="fill:none;stroke:#00aad4" />
  <g
     stroke-linecap="round"
     id="g9"
     style="fill:none;stroke:#00aad4"
     transform="matrix(-1,0,0,1,6,0)">
    <path
       d="m 0.5,7.5 h 5"
       id="path8" />
    <path
       d="m 3.5,5.5 2,2 -2,2"
       fill="none"
       stroke="#00aad4"
       stroke-linejoin="round"
       id="path9" />
  </g>
</svg>
