<svg width="48" height="48" version="1.1" xmlns="http://www.w3.org/2000/svg">
 <g fill="none" stroke-linecap="round">
  <path d="m4 37h14" stroke="#ffffff" stroke-width="7"/>
  <path d="m11 44v-14" stroke="#ffffff" stroke-width="7"/>
  <path d="m5.1666666 37h11.666666" stroke="#ff6600" stroke-width="2.33333"/>
  <path d="m11 42.833334v-11.666669" stroke="#ff6600" stroke-width="2.33333"/>
 </g>
</svg>
