<?xml version="1.0" encoding="UTF-8" standalone="no"?>
<svg
   width="256"
   height="256"
   version="1.1"
   viewBox="0 0 256 256"
   id="svg31"
   sodipodi:docname="lazarusprojecticon 256.svg"
   inkscape:export-filename="lazarusprojecticon 256.png"
   inkscape:export-xdpi="96"
   inkscape:export-ydpi="96"
   inkscape:version="1.1.1 (3bf5ae0d25, 2021-09-20)"
   xmlns:inkscape="http://www.inkscape.org/namespaces/inkscape"
   xmlns:sodipodi="http://sodipodi.sourceforge.net/DTD/sodipodi-0.dtd"
   xmlns="http://www.w3.org/2000/svg"
   xmlns:svg="http://www.w3.org/2000/svg">
  <sodipodi:namedview
     id="namedview33"
     pagecolor="#ffffff"
     bordercolor="#666666"
     borderopacity="1.0"
     inkscape:pageshadow="2"
     inkscape:pageopacity="0.0"
     inkscape:pagecheckerboard="0"
     showgrid="false"
     inkscape:zoom="2.9101562"
     inkscape:cx="127.82819"
     inkscape:cy="128"
     inkscape:current-layer="svg31" />
  <defs
     id="defs17">
    <linearGradient
       id="linearGradient882"
       x1="117.54"
       x2="138.46"
       y1="14"
       y2="243.05"
       gradientTransform="matrix(.95614 0 0 .95614 5.614 2.614)"
       gradientUnits="userSpaceOnUse">
      <stop
         stop-color="#ebecf5"
         offset="0"
         id="stop2" />
      <stop
         stop-color="#6e86ba"
         offset=".37973"
         id="stop4" />
      <stop
         stop-color="#5470ac"
         offset=".46364"
         id="stop6" />
      <stop
         stop-color="#57d6f9"
         offset="1"
         id="stop8" />
    </linearGradient>
    <filter
       id="filter965"
       x="-0.018"
       y="-0.018"
       width="1.036"
       height="1.036"
       color-interpolation-filters="sRGB">
      <feGaussianBlur
         stdDeviation="1.785"
         id="feGaussianBlur11" />
    </filter>
    <filter
       id="filter923"
       x="-0.036"
       y="-0.036"
       width="1.072"
       height="1.072"
       color-interpolation-filters="sRGB">
      <feGaussianBlur
         stdDeviation="3.27"
         id="feGaussianBlur14" />
    </filter>
  </defs>
  <circle
     transform="matrix(1.0018 0 0 1.0018 1.9557 -.44854)"
     cx="130.32"
     cy="132.72"
     r="119"
     filter="url(#filter965)"
     opacity=".45"
     id="circle19" />
  <g
     id="g27">
    <circle
       cx="128"
       cy="126"
       r="119"
       fill="#20345e"
       id="circle21" />
    <circle
       cx="128"
       cy="126"
       r="114"
       fill="#3371b4"
       id="circle23" />
    <circle
       cx="128"
       cy="125"
       r="109"
       fill="url(#linearGradient882)"
       filter="url(#filter923)"
       id="circle25" />
  </g>
  <path
     d="m117.58 204.73c-9.7065-1.3229-16.535-6.4395-20.632-15.459-3.4364-7.5658-2.0543-12.756 4.8808-18.328 5.3667-4.3123 7.2852-8.7193 7.2852-16.735 0-3.6103 0.48088-7.8368 1.0686-9.3924 1.2767-3.379 5.3127-7.7805 9.526-10.388 3.8578-2.3879 21.717-6.986 27.181-6.9981 8.4786-0.0189 16.358 4.5105 21.505 12.362 3.831 5.8436 7.6781 8.3336 15.038 9.7331 8.6673 1.6482 11.646 3.5808 14.018 9.094 3.4352 7.9853 2.1501 17.855-3.1376 24.098-7.7186 9.1135-40.457 19.814-68.623 22.429-1.6576 0.15379-5.3076-0.0323-8.111-0.41481zm-54.178-42.076c-4.2777-1.9112-11.422-9.0086-13.862-13.771-2.8233-5.51-7.861-25.376-7.5445-29.751 0.27502-3.8036 0.58386-4.2711 2.8206-4.2711 1.9052 0 2.956 0.90945 4.3522 3.7667 1.7452 3.5717 1.9519 3.6887 3.991 2.2605 4.7304-3.3133 9.5319-2.0267 22.36 5.9916 6.5973 4.1238 13.69 9.0895 15.763 11.035 3.2211 3.0242 3.765 4.1588 3.7509 7.8233-0.05309 13.771-17.63 23.171-31.63 16.916zm117.48-30.264c-2.7977-1.0764-6.3594-3.2856-7.9148-4.909-4.3268-4.5162-3.791-9.4902 2.5169-23.365 7.3421-16.15 8.388-17.651 13.199-18.947l4.0819-1.0992-0.55274-5.3555c-0.5011-4.8549-0.35263-5.4078 1.5883-5.9154 2.7517-0.71959 4.9841 1.3348 7.2562 6.6775 0.99185 2.332 3.7631 8.3181 6.1584 13.302 7.5662 15.744 7.0852 26.336-1.577 34.729-7.1775 6.9541-15.239 8.544-24.756 4.8822zm-92.335-20.576c-12.388-4.7262-17.472-19.754-11.714-34.627 1.4078-3.6367 2.1392-7.7925 2.1396-12.157 6.62e-4 -8.8298 1.4666-12.959 4.6006-12.959 1.7904 0 2.5521 0.69678 3.02 2.7628 2.118 9.3513 1.7105 8.8167 6.4784 8.4992 8.1677-0.54377 11.825 2.7356 13.572 12.168 0.39101 2.1118 2.2304 5.9546 4.0875 8.5396 7.4476 10.366 8.5269 15.495 4.4623 21.203-4.7324 6.6459-17.923 9.8987-26.646 6.5706zm41.085-11.415c-5.5459-2.5189-7.4586-6.7459-7.4586-16.483 0-5.9204-0.53601-8.6858-2.5019-12.909-1.3759-2.9558-2.5062-6.2908-2.5117-7.4111-0.0159-3.1602 2.8665-6.5258 7.1526-8.3539l3.9039-1.6651-2.5191-4.7261c-1.3856-2.5994-2.5192-5.3766-2.5192-6.1716 0-1.274 1.9918-2.6651 3.816-2.6651 0.35065 0 4.7648 4.1819 9.8091 9.2931 5.0443 5.1112 11.24 11.158 13.768 13.438 6.0864 5.489 9.7797 12.846 9.7797 19.481 0 6.1875-1.614 9.5361-6.8965 14.309-6.4872 5.8607-16.021 7.4072-23.822 3.8642z"
     stroke-width="1.0046"
     id="path29" />
</svg>
