<?xml version="1.0" encoding="UTF-8" standalone="no"?>
<svg
   height="48"
   width="48"
   version="1.1"
   id="svg535"
   sodipodi:docname="Cloud_06_48.svg"
   inkscape:export-filename="Cloud_06_48.png"
   inkscape:export-xdpi="96"
   inkscape:export-ydpi="96"
   inkscape:version="1.2.1 (9c6d41e410, 2022-07-14)"
   xmlns:inkscape="http://www.inkscape.org/namespaces/inkscape"
   xmlns:sodipodi="http://sodipodi.sourceforge.net/DTD/sodipodi-0.dtd"
   xmlns="http://www.w3.org/2000/svg"
   xmlns:svg="http://www.w3.org/2000/svg">
  <defs
     id="defs539">
    <radialGradient
       id="a-2"
       cx="-11.5"
       cy="8.5"
       gradientTransform="matrix(0,1.12,-1.12,0,20.679997,24.039997)"
       gradientUnits="userSpaceOnUse"
       r="3.5">
      <stop
         offset="0"
         stop-color="#fff"
         id="stop2-4" />
      <stop
         offset="1"
         stop-color="#d5e5ff"
         id="stop4-8" />
    </radialGradient>
  </defs>
  <sodipodi:namedview
     id="namedview537"
     pagecolor="#ffffff"
     bordercolor="#666666"
     borderopacity="1.0"
     inkscape:showpageshadow="2"
     inkscape:pageopacity="0.0"
     inkscape:pagecheckerboard="0"
     inkscape:deskcolor="#d1d1d1"
     showgrid="true"
     inkscape:zoom="19.125"
     inkscape:cx="23.189542"
     inkscape:cy="24"
     inkscape:current-layer="svg535">
    <inkscape:grid
       type="xygrid"
       id="grid798" />
  </sodipodi:namedview>
  <linearGradient
     id="a"
     gradientTransform="matrix(1.0000001 0 0 .96627921 -.000186 .205037)"
     gradientUnits="userSpaceOnUse"
     x1="7.5"
     x2="9"
     y1="2"
     y2="13">
    <stop
       offset="0"
       stop-color="#5ab4f2"
       id="stop528" />
    <stop
       offset="1"
       stop-color="#0090ff"
       id="stop530" />
  </linearGradient>
  <path
     d="m3.2916407 12.766668c-4.3402416 0-4.3402416-5.8903528-.285861-5.8903528-.5693964-6.06642825 9.1223573-5.7049988 9.1223573-1.4725883 4.918075-.3594726 5.574823 7.3629411-.506798 7.3629411z"
     fill="url(#a)"
     transform="matrix(2.9999998 0 0 2.9999998 .000558 .000001)"
     id="path533" />
  <g
     id="g2638"
     transform="matrix(2.4615385,0,0,2.4615385,-1.2307699,-1.2307699)">
    <g
       id="g2626">
      <circle
         cx="12"
         cy="12"
         r="4"
         stroke="#ffffff"
         stroke-linejoin="round"
         stroke-width="0.75"
         id="circle7"
         style="fill:none;stroke:#ffffff;stroke-width:2;stroke-linecap:round;stroke-dasharray:none" />
      <path
         d="M 13.914015,13.914015 18.1,18.1"
         stroke="#ffffff"
         stroke-width="3"
         id="path9"
         style="fill:none;stroke:#ffffff;stroke-width:3.8;stroke-linecap:round;stroke-dasharray:none" />
    </g>
    <g
       id="g2630">
      <path
         d="m 13.914,13.914 4.185985,4.185985"
         stroke="#a05a2c"
         stroke-width="1.4"
         id="path11"
         style="fill:none;stroke-width:1.8;stroke-linecap:round;stroke-dasharray:none" />
      <circle
         cx="12"
         cy="12"
         fill="url(#a)"
         fill-rule="evenodd"
         r="3.5"
         stroke="#dd8703"
         stroke-linejoin="round"
         id="circle15"
         style="fill:url(#a-2);stroke-width:1;stroke-linecap:round;stroke-dasharray:none" />
    </g>
  </g>
</svg>
