<?xml version="1.0" encoding="UTF-8" standalone="no"?>
<svg
   height="36"
   width="36"
   version="1.1"
   id="svg467"
   sodipodi:docname="Grid_14_36.svg"
   inkscape:export-filename="Grid_14_36.png"
   inkscape:export-xdpi="96"
   inkscape:export-ydpi="96"
   inkscape:version="1.2.1 (9c6d41e410, 2022-07-14)"
   xmlns:inkscape="http://www.inkscape.org/namespaces/inkscape"
   xmlns:sodipodi="http://sodipodi.sourceforge.net/DTD/sodipodi-0.dtd"
   xmlns="http://www.w3.org/2000/svg"
   xmlns:svg="http://www.w3.org/2000/svg">
  <defs
     id="defs471" />
  <sodipodi:namedview
     id="namedview469"
     pagecolor="#ffffff"
     bordercolor="#666666"
     borderopacity="1.0"
     inkscape:showpageshadow="2"
     inkscape:pageopacity="0.0"
     inkscape:pagecheckerboard="0"
     inkscape:deskcolor="#d1d1d1"
     showgrid="true"
     inkscape:zoom="25.5"
     inkscape:cx="17.392157"
     inkscape:cy="18"
     inkscape:current-layer="svg467">
    <inkscape:grid
       type="xygrid"
       id="grid1021" />
  </sodipodi:namedview>
  <g
     fill="none"
     stroke="#00aad4"
     stroke-width="1.8"
     id="g465"
     transform="rotate(90,18,18)">
    <path
       d="M 6.9,0.8999995 H 29.099998 V 35.1 H 6.9 Z"
       stroke-dashoffset="1.5"
       stroke-linecap="round"
       stroke-linejoin="round"
       id="path445" />
    <path
       d="M 6.75,7.9 H 29.250001"
       id="path447" />
    <path
       d="M 13.9,0.7499995 V 35.25"
       id="path449" />
    <path
       d="M 29.250001,28.9 H 6.75"
       id="path451" />
    <path
       d="M 21.9,0.7499995 V 34.950001"
       id="path453" />
    <path
       d="m 6.75,21.9 h 22.5"
       id="path455" />
    <path
       d="M 6.75,14.9 H 29.250001"
       id="path457" />
    <g
       stroke-linecap="round"
       stroke-linejoin="round"
       id="g463">
      <path
         d="M 0.9,22.199999 5.25,18 0.9,13.8"
         id="path459" />
      <path
         d="M 35.1,22.199999 30.75,18 35.1,13.8"
         id="path461" />
    </g>
  </g>
</svg>
