<svg width="64" height="64" version="1.1" xmlns="http://www.w3.org/2000/svg">
 <g fill="none" stroke-linecap="round" stroke-linejoin="round">
  <path d="m30 32h28" stroke="#ffffff" stroke-width="12"/>
  <path d="m47 21 11 11-11 11" stroke="#ffffff" stroke-width="12"/>
  <path d="m30 32h28" stroke="#3771c8" stroke-opacity=".996078" stroke-width="6"/>
  <path d="m47 21 11 11-11 11" stroke="#3771c8" stroke-opacity=".996078" stroke-width="6"/>
 </g>
</svg>
