<?xml version="1.0" encoding="UTF-8" standalone="no"?>
<svg
   width="32"
   height="32"
   version="1.1"
   id="svg13"
   sodipodi:docname="Manometer_01_32.svg"
   inkscape:export-filename="Manometer_01_32.png"
   inkscape:export-xdpi="96"
   inkscape:export-ydpi="96"
   inkscape:version="1.3.2 (091e20e, 2023-11-25, custom)"
   xmlns:inkscape="http://www.inkscape.org/namespaces/inkscape"
   xmlns:sodipodi="http://sodipodi.sourceforge.net/DTD/sodipodi-0.dtd"
   xmlns:xlink="http://www.w3.org/1999/xlink"
   xmlns="http://www.w3.org/2000/svg"
   xmlns:svg="http://www.w3.org/2000/svg">
  <sodipodi:namedview
     id="namedview13"
     pagecolor="#ffffff"
     bordercolor="#000000"
     borderopacity="0.25"
     inkscape:showpageshadow="2"
     inkscape:pageopacity="0.0"
     inkscape:pagecheckerboard="0"
     inkscape:deskcolor="#d1d1d1"
     showgrid="true"
     inkscape:current-layer="svg13">
    <inkscape:grid
       id="grid13"
       units="px"
       originx="0"
       originy="0"
       spacingx="0.5"
       spacingy="0.5"
       empcolor="#0099e5"
       empopacity="0.30196078"
       color="#0099e5"
       opacity="0.14901961"
       empspacing="2"
       dotted="false"
       gridanglex="30"
       gridanglez="30"
       visible="true" />
  </sodipodi:namedview>
  <defs
     id="defs2">
    <linearGradient
       id="a"
       x1="8"
       x2="8"
       y1="14.5"
       y2="9.5"
       gradientTransform="matrix(2.0364963 0 0 2.0364963 -.29196822 -.29196993)"
       gradientUnits="userSpaceOnUse"
       xlink:href="#b" />
    <linearGradient
       id="b">
      <stop
         stop-color="#808080"
         offset="0"
         id="stop1" />
      <stop
         stop-color="#cccccc"
         offset="1"
         id="stop2" />
    </linearGradient>
  </defs>
  <circle
     cx="16"
     cy="15.999999"
     r="13.949999"
     fill="#ffffff"
     fill-rule="evenodd"
     id="circle2" />
  <path
     d="m20.072995 19.054744c0 2.249452-1.823542 4.072994-4.072993 4.072994-2.249453 0-4.072993-1.823542-4.072993-4.072994h-9.2517386c1.7897947 5.861709 7.1958695 10.887705 13.324732 10.895256 6.128862-0.0074 11.534938-5.033547 13.324733-10.895256z"
     fill="url(#a)"
     fill-rule="evenodd"
     stroke-linecap="round"
     stroke-linejoin="round"
     stroke-width=".8"
     id="path2" />
  <path
     d="m16.000002 6.8357672-2.016608 12.219474a2.0364963 1.7819342 0 0 0-0.01988 0.254066 2.0364963 1.7819342 0 0 0 2.036496 1.781934 2.0364963 1.7819342 0 0 0 2.036497-1.781934 2.0364963 1.7819342 0 0 0-0.02388-0.254066h4e-3z"
     fill="#d40000"
     id="path3" />
  <path
     d="m29.571342 19.054744h-9.498347c0 2.24945-1.823544 4.072994-4.072993 4.072994s-4.072993-1.823544-4.072993-4.072994h-9.4983455a13.95 13.95 0 0 0 13.571338 10.894459 13.95 13.95 0 0 0 13.57134-10.894459z"
     fill="url(#a)"
     fill-rule="evenodd"
     stroke-linecap="round"
     stroke-linejoin="round"
     stroke-width=".8"
     id="path4" />
  <circle
     cx="12.945257"
     cy="6.8357663"
     r="1.0182481"
     fill="#4d4d4d"
     id="circle4" />
  <circle
     cx="19.054749"
     cy="6.8357663"
     r="1.0182481"
     fill="#4d4d4d"
     id="circle5" />
  <circle
     cx="6.8357677"
     cy="12.945255"
     r="1.0182481"
     fill="#4d4d4d"
     id="circle6" />
  <circle
     cx="8.8722639"
     cy="8.872262"
     r="1.0182481"
     fill="#4d4d4d"
     id="circle7" />
  <circle
     cx="25.164236"
     cy="12.945255"
     r="1.0182481"
     fill="#4d4d4d"
     id="circle8" />
  <circle
     cx="23.127739"
     cy="8.872262"
     r="1.0182481"
     fill="#4d4d4d"
     id="circle9" />
  <circle
     cx="6.8357677"
     cy="17.018251"
     r="1.0182481"
     fill="#4d4d4d"
     id="circle10" />
  <circle
     cx="25.164236"
     cy="17.018251"
     r="1.0182481"
     fill="#4d4d4d"
     id="circle11" />
  <circle
     cx="16"
     cy="19.054747"
     r="1.0182481"
     fill="#e6e6e6"
     id="circle12" />
  <circle
     cx="16"
     cy="16"
     r="13.700001"
     fill="none"
     stroke="#808080"
     stroke-linecap="round"
     stroke-linejoin="round"
     stroke-width="1.6"
     id="circle13" />
</svg>
