<?xml version="1.0" encoding="UTF-8" standalone="no"?>
<svg
   height="32"
   width="32"
   version="1.1"
   id="svg16"
   sodipodi:docname="File_20_32.svg"
   inkscape:export-filename="File_20_32.png"
   inkscape:export-xdpi="96"
   inkscape:export-ydpi="96"
   inkscape:version="1.2.1 (9c6d41e410, 2022-07-14)"
   xmlns:inkscape="http://www.inkscape.org/namespaces/inkscape"
   xmlns:sodipodi="http://sodipodi.sourceforge.net/DTD/sodipodi-0.dtd"
   xmlns="http://www.w3.org/2000/svg"
   xmlns:svg="http://www.w3.org/2000/svg">
  <defs
     id="defs20" />
  <sodipodi:namedview
     id="namedview18"
     pagecolor="#ffffff"
     bordercolor="#666666"
     borderopacity="1.0"
     inkscape:showpageshadow="2"
     inkscape:pageopacity="0.0"
     inkscape:pagecheckerboard="0"
     inkscape:deskcolor="#d1d1d1"
     showgrid="true"
     inkscape:zoom="28.6875"
     inkscape:cx="15.982571"
     inkscape:cy="16"
     inkscape:current-layer="svg16">
    <inkscape:grid
       type="xygrid"
       id="grid1002" />
  </sodipodi:namedview>
  <g
     fill="none"
     stroke="#00aad4"
     stroke-linecap="round"
     stroke-linejoin="round"
     id="g14">
    <path
       d="m5 31v-30h14.5l7.5 7.5v22.5z"
       stroke-width="2"
       id="path2" />
    <path
       d="m19 1v8h8"
       stroke-width="2"
       id="path4" />
    <g
       stroke-width="1.6"
       id="g12">
      <path
         d="m15.8 4.8v22.399999"
         id="path6" />
      <path
         d="m8.8 16.8h14.4"
         id="path8" />
      <path
         d="m15.8 4.8h-7v22.399999h14.4v-15.199999"
         id="path10" />
    </g>
  </g>
</svg>
