<?xml version="1.0" encoding="UTF-8" standalone="no"?>
<svg
   height="24"
   width="24"
   version="1.1"
   id="svg245"
   sodipodi:docname="pkg_oep_150.svg"
   inkscape:version="1.2.2 (732a01da63, 2022-12-09)"
   xmlns:inkscape="http://www.inkscape.org/namespaces/inkscape"
   xmlns:sodipodi="http://sodipodi.sourceforge.net/DTD/sodipodi-0.dtd"
   xmlns="http://www.w3.org/2000/svg"
   xmlns:svg="http://www.w3.org/2000/svg">
  <defs
     id="defs249" />
  <sodipodi:namedview
     id="namedview247"
     pagecolor="#ffffff"
     bordercolor="#000000"
     borderopacity="0.25"
     inkscape:showpageshadow="2"
     inkscape:pageopacity="0.0"
     inkscape:pagecheckerboard="0"
     inkscape:deskcolor="#d1d1d1"
     showgrid="true"
     inkscape:zoom="37.916667"
     inkscape:cx="11.986813"
     inkscape:cy="12"
     inkscape:current-layer="svg245">
    <inkscape:grid
       type="xygrid"
       id="grid689" />
  </sodipodi:namedview>
  <radialGradient
     id="a"
     cx="31.5"
     cy="6.602212"
     gradientTransform="matrix(1.1791232 0 0 1.367543 -29.731778 -2.260804)"
     gradientUnits="userSpaceOnUse"
     r="2.375222">
    <stop
       offset="0"
       stop-color="#fff"
       id="stop188" />
    <stop
       offset="1"
       stop-color="#fea"
       id="stop190" />
  </radialGradient>
  <linearGradient
     id="b"
     gradientTransform="matrix(.74364379 0 0 .70870215 2.051015 2.515791)"
     gradientUnits="userSpaceOnUse"
     x1="6.265307"
     x2="9.734487"
     y1="12.833333"
     y2="12.833333">
    <stop
       offset="0"
       stop-color="#999"
       id="stop193" />
    <stop
       offset=".39922822"
       stop-color="#fff"
       id="stop195" />
    <stop
       offset="1"
       stop-color="#999"
       id="stop197" />
  </linearGradient>
  <radialGradient
     id="c"
     cx="6.497474"
     cy="3.206305"
     gradientTransform="matrix(-.00000004 1.8461535 -1.8461538 -.00000013 13.419332 -8.495334)"
     gradientUnits="userSpaceOnUse"
     r="3.25">
    <stop
       offset="0"
       stop-color="#fff"
       id="stop200" />
    <stop
       offset=".16666666"
       stop-color="#fff"
       id="stop202" />
    <stop
       offset="1"
       stop-color="#ff0"
       id="stop204" />
  </radialGradient>
  <filter
     id="d"
     color-interpolation-filters="sRGB"
     height="1.44376"
     width="1.44376"
     x="-0.22188001"
     y="-0.22188001">
    <feGaussianBlur
       stdDeviation=".600925"
       id="feGaussianBlur207" />
  </filter>
  <radialGradient
     id="e"
     cx="5"
     cy="5"
     gradientTransform="matrix(-.00000004 2.1339479 -2.1339479 -.00000006 18.188449 -3.15103)"
     gradientUnits="userSpaceOnUse"
     r="7.7">
    <stop
       offset="0"
       stop-color="#14ccfc"
       id="stop210" />
    <stop
       offset="1"
       stop-color="#0068e0"
       id="stop212" />
  </radialGradient>
  <circle
     cx="12"
     cy="12"
     fill="url(#e)"
     r="11.203226"
     stroke="#0068e0"
     stroke-linecap="round"
     stroke-linejoin="round"
     stroke-width=".593548"
     id="circle215" />
  <g
     transform="matrix(1.8198168 0 0 1.8198417 -2.558647 -2.491531)"
     id="g243">
    <g
       fill="none"
       stroke="#fff"
       stroke-linecap="round"
       stroke-linejoin="round"
       stroke-width=".934154"
       id="g231">
      <path
         d="m5.5 7h-2"
         id="path217" />
      <path
         d="m6.2320508 8.5-1.9012701 1.0938411"
         id="path219" />
      <path
         d="m6.7071068 5.7071068-1.4142136-1.4142136"
         id="path221" />
      <path
         d="m8 5v-2"
         id="path223" />
      <path
         d="m10.707106 4.2928933-1.4142122 1.4142134"
         id="path225" />
      <path
         d="m12.5 7h-2"
         id="path227" />
      <path
         d="m11.669343 9.5938411-1.901393-1.0938411"
         id="path229" />
    </g>
    <g
       fill-rule="evenodd"
       stroke-width="1.00001"
       id="g241">
      <path
         d="m6.8698266 10.401942c0-1.2383076-.4160206-.9459924-.927042-1.7601591-.541638-.8629475-.4876243-1.6154019-.4876243-1.6154019 0-1.2078048.8725559-2.4585656 2.5450061-2.4585656 1.6724514 0 2.5450066 1.2507608 2.5450066 2.4585656 0 0 .0545.7524544-.487142 1.6154019-.5110187.8141667-.9275272.5218515-.9275272 1.7601591"
         fill="url(#a)"
         stroke="#fcaf36"
         stroke-width=".300001"
         id="path233" />
      <path
         d="m6.8103351 10.5h2.3796602l-.0001652 1.5c-.000018.163594-.3016626.4-.4664552.4h-1.4464206c-.1647914 0-.4668027-.236404-.4667844-.4z"
         fill="url(#b)"
         stroke="#999"
         stroke-width=".199999"
         id="path235" />
      <path
         d="m7.4000001 12.5h1.2088001l-.36264.6h-.4835201z"
         fill="#333"
         stroke-width=".437503"
         id="path237" />
      <circle
         cx="8.494"
         cy="4.75"
         fill="url(#c)"
         filter="url(#d)"
         r="3.25"
         stroke-width=".843538"
         transform="matrix(.52055067 0 0 .51676192 3.578608 4.903971)"
         id="circle239" />
    </g>
  </g>
</svg>
