<?xml version="1.0" encoding="UTF-8" standalone="no"?>
<svg
   height="16"
   width="16"
   version="1.1"
   id="svg45"
   sodipodi:docname="16_col_add.svg"
   inkscape:export-filename="16_col_add.png"
   inkscape:export-xdpi="96"
   inkscape:export-ydpi="96"
   inkscape:version="1.1.2 (0a00cf5339, 2022-02-04, custom)"
   xmlns:inkscape="http://www.inkscape.org/namespaces/inkscape"
   xmlns:sodipodi="http://sodipodi.sourceforge.net/DTD/sodipodi-0.dtd"
   xmlns:xlink="http://www.w3.org/1999/xlink"
   xmlns="http://www.w3.org/2000/svg"
   xmlns:svg="http://www.w3.org/2000/svg">
  <defs
     id="defs5">
    <linearGradient
       inkscape:collect="always"
       id="linearGradient1797">
      <stop
         style="stop-color:#009600;stop-opacity:1"
         offset="0"
         id="stop1793" />
      <stop
         style="stop-color:#6edb39;stop-opacity:1"
         offset="1"
         id="stop1795" />
    </linearGradient>
    <linearGradient
       inkscape:collect="always"
       id="linearGradient28615">
      <stop
         style="stop-color:#72cef6;stop-opacity:1"
         offset="0"
         id="stop28611" />
      <stop
         style="stop-color:#d2f5f8;stop-opacity:1"
         offset="1"
         id="stop28613" />
    </linearGradient>
    <linearGradient
       inkscape:collect="always"
       id="linearGradient17975">
      <stop
         style="stop-color:#4674a8;stop-opacity:1"
         offset="0"
         id="stop17971" />
      <stop
         style="stop-color:#42a0ce;stop-opacity:1"
         offset="1"
         id="stop17973" />
    </linearGradient>
    <linearGradient
       inkscape:collect="always"
       xlink:href="#linearGradient28615"
       id="linearGradient28617-5"
       x1="9"
       y1="10"
       x2="6"
       y2="10.5"
       gradientUnits="userSpaceOnUse"
       gradientTransform="matrix(0,-1,-1,0,16,16)" />
    <linearGradient
       inkscape:collect="always"
       xlink:href="#linearGradient17975"
       id="linearGradient17977-7"
       x1="10"
       y1="12.5"
       x2="5"
       y2="12.5"
       gradientUnits="userSpaceOnUse"
       gradientTransform="matrix(0,-1,-1,0,16,16)" />
    <linearGradient
       inkscape:collect="always"
       xlink:href="#linearGradient1797"
       id="linearGradient1799-8"
       x1="8"
       y1="-20"
       x2="3"
       y2="-25"
       gradientUnits="userSpaceOnUse"
       gradientTransform="translate(-16.75,18.25)" />
  </defs>
  <sodipodi:namedview
     id="namedview3"
     pagecolor="#ffffff"
     bordercolor="#666666"
     borderopacity="1.0"
     inkscape:pageshadow="2"
     inkscape:pageopacity="0.0"
     inkscape:pagecheckerboard="0"
     showgrid="true"
     inkscape:zoom="57"
     inkscape:cx="8"
     inkscape:cy="8"
     inkscape:current-layer="g34094">
    <inkscape:grid
       type="xygrid"
       id="grid1366" />
  </sodipodi:namedview>
  <g
     id="g863"
     transform="matrix(1,0,0,-1,0,16)">
    <g
       id="g34094"
       transform="translate(15.75,-5.75)">
      <g
         id="g34094-0">
        <rect
           style="fill:#ffffff;stroke:#999999;stroke-width:1;stroke-linecap:round;stroke-linejoin:round;stroke-miterlimit:4;stroke-dasharray:none;stroke-dashoffset:1.49998;stroke-opacity:1"
           id="rect1279"
           width="15"
           height="15"
           x="6.25"
           y="-15.25"
           transform="matrix(0,1,1,0,0,0)" />
        <g
           id="g981">
          <path
             style="fill:none;stroke:#b3b3b3;stroke-width:1px;stroke-linecap:butt;stroke-linejoin:miter;stroke-opacity:1"
             d="m -12.25,6.75 v 14"
             id="path1586"
             sodipodi:nodetypes="cc" />
          <path
             style="fill:none;stroke:#b3b3b3;stroke-width:1px;stroke-linecap:butt;stroke-linejoin:miter;stroke-opacity:1"
             d="m -14.75,10.25 h 14"
             id="path1725-6"
             sodipodi:nodetypes="cc" />
          <path
             style="fill:none;stroke:#b3b3b3;stroke-width:1px;stroke-linecap:butt;stroke-linejoin:miter;stroke-opacity:1"
             d="m -3.25,20.75 v -14"
             id="path1729"
             sodipodi:nodetypes="cc" />
          <path
             style="fill:none;stroke:#b3b3b3;stroke-width:1px;stroke-linecap:butt;stroke-linejoin:miter;stroke-opacity:1"
             d="m -14.75,18.25 h 14"
             id="path1373"
             sodipodi:nodetypes="cc" />
          <path
             style="fill:none;stroke:#b3b3b3;stroke-width:1px;stroke-linecap:butt;stroke-linejoin:miter;stroke-opacity:1"
             d="m -14.75,14.25 h 14"
             id="path1375"
             sodipodi:nodetypes="cc" />
        </g>
        <g
           id="g840"
           transform="matrix(0,-1,-1,0,0.25,21.75)">
          <rect
             style="opacity:0.5;fill:none;stroke:#ffffff;stroke-width:1;stroke-linejoin:round;stroke-miterlimit:4;stroke-dasharray:none;stroke-dashoffset:1.49998"
             id="rect861"
             width="15"
             height="6"
             x="0.5"
             y="-11.5"
             transform="scale(1,-1)" />
          <path
             style="fill:url(#linearGradient28617-5);fill-opacity:1;stroke:url(#linearGradient17977-7);stroke-width:1px;stroke-linecap:round;stroke-linejoin:round;stroke-opacity:1"
             d="m 15.5,10.5 h -15 v -4 h 15 z"
             id="path17870-9"
             sodipodi:nodetypes="ccccc" />
        </g>
      </g>
      <g
         id="g1750"
         transform="translate(0,1)">
        <circle
           style="fill:url(#linearGradient1799-8);fill-opacity:1;stroke:#008080;stroke-width:0.5;stroke-linecap:round;stroke-linejoin:round;stroke-miterlimit:4;stroke-dasharray:none;stroke-dashoffset:1.49998;stroke-opacity:1"
           id="path883-4"
           cx="-11.25"
           cy="-4.25"
           transform="rotate(-90)"
           r="4" />
        <g
           id="g1394">
          <path
             style="fill:none;stroke:#ffffff;stroke-width:1;stroke-linecap:round;stroke-linejoin:miter;stroke-miterlimit:4;stroke-dasharray:none;stroke-opacity:1"
             d="m -4.25,13.25 v -4"
             id="path1522-6"
             sodipodi:nodetypes="cc" />
          <path
             style="fill:none;stroke:#ffffff;stroke-width:1;stroke-linecap:round;stroke-linejoin:miter;stroke-miterlimit:4;stroke-dasharray:none;stroke-opacity:1"
             d="m -2.25,11.25 h -4"
             id="path1215"
             sodipodi:nodetypes="cc" />
        </g>
        <circle
           style="opacity:0.7;fill:none;stroke:#ffffff;stroke-width:0.5;stroke-linejoin:round;stroke-miterlimit:4;stroke-dasharray:none;stroke-dashoffset:1.49998"
           id="path1561"
           cx="-4.25"
           cy="-11.25"
           r="4.5"
           transform="scale(1,-1)" />
      </g>
    </g>
  </g>
</svg>
