<?xml version="1.0" encoding="UTF-8" standalone="no"?>
<svg
   height="24"
   viewBox="0 0 6.3499998 6.3500003"
   width="24"
   version="1.1"
   id="svg171"
   sodipodi:docname="Font_10_24.svg"
   inkscape:export-filename="Font_10_24.png"
   inkscape:export-xdpi="96"
   inkscape:export-ydpi="96"
   inkscape:version="1.2 (dc2aedaf03, 2022-05-15)"
   xmlns:inkscape="http://www.inkscape.org/namespaces/inkscape"
   xmlns:sodipodi="http://sodipodi.sourceforge.net/DTD/sodipodi-0.dtd"
   xmlns="http://www.w3.org/2000/svg"
   xmlns:svg="http://www.w3.org/2000/svg">
  <defs
     id="defs175">
    <radialGradient
       id="a-4"
       cx="12.1"
       cy="10.900001"
       gradientTransform="matrix(0,1.5892257,-1.5892254,2.9972888e-8,32.677103,-3.8750849)"
       gradientUnits="userSpaceOnUse"
       r="4.5">
      <stop
         offset="0"
         stop-color="#ff7f2a"
         id="stop138" />
      <stop
         offset="1"
         stop-color="#d45500"
         id="stop140" />
    </radialGradient>
    <filter
       inkscape:collect="always"
       style="color-interpolation-filters:sRGB"
       id="filter4100"
       x="-0.077519639"
       y="-0.072638999"
       width="1.1550393"
       height="1.145278">
      <feGaussianBlur
         inkscape:collect="always"
         stdDeviation="0.19217504"
         id="feGaussianBlur4102" />
    </filter>
  </defs>
  <sodipodi:namedview
     id="namedview173"
     pagecolor="#ffffff"
     bordercolor="#666666"
     borderopacity="1.0"
     inkscape:showpageshadow="2"
     inkscape:pageopacity="0.0"
     inkscape:pagecheckerboard="0"
     inkscape:deskcolor="#d1d1d1"
     showgrid="true"
     inkscape:zoom="38.25"
     inkscape:cx="10.313725"
     inkscape:cy="12"
     inkscape:current-layer="svg171">
    <inkscape:grid
       type="xygrid"
       id="grid1259" />
  </sodipodi:namedview>
  <g
     id="g4106">
    <path
       id="path3732"
       style="fill:#ffffff;stroke:none;filter:url(#filter4100)"
       d="M 2.5802043,0 A 0.39652402,0.39652402 0 0 0 2.2071004,0.26354981 L 0.22272542,5.8203166 A 0.39652402,0.39652402 0 0 0 0.59582927,6.3494833 H 1.4748454 A 0.39652402,0.39652402 0 0 0 1.8474325,6.0859335 l 0.4728393,-1.324467 h 1.7089397 l 0.4728393,1.324467 A 0.39652402,0.39652402 0 0 0 4.8751547,6.3494833 H 5.753654 A 0.39652402,0.39652402 0 0 0 6.1267579,5.8203166 L 4.1423828,0.26354981 A 0.39652402,0.39652402 0 0 0 3.769279,0 Z M 3.1760336,2.3693644 3.4628378,3.1760336 H 2.8866455 Z" />
    <path
       d="M 2.5796876,0.39687507 0.59531252,5.953125 H 1.4741074 l 0.5669643,-1.5875 h 2.267857 l 0.5669643,1.5875 H 5.7546875 L 3.7703126,0.39687507 Z M 3.1750001,1.190625 4.0254465,3.571875 H 2.3245537 Z"
       stroke="#ffffff"
       stroke-width="0.198438"
       id="path723"
       sodipodi:nodetypes="ccccccccccccc"
       style="stroke:none" />
  </g>
  <g
     fill="none"
     stroke-width="1.25031"
     transform="matrix(0.38203646,0,0,0.38213015,0.06017397,0.41145204)"
     id="g295">
    <g
       id="g6621">
      <circle
         cx="17.5"
         cy="17.5"
         style="fill:url(#a-4);stroke:#ffffff;stroke-width:1.2;stroke-linecap:round;stroke-linejoin:round;stroke-dasharray:none;stroke-dashoffset:1.49998"
         transform="matrix(0,0.69239063,0.69256046,0,-0.15750845,-1.0767327)"
         id="circle143"
         r="5.9000001" />
      <path
         d="M 11.28698,9.0599682 13.267602,11.040104 11.28698,13.02024"
         id="path291"
         sodipodi:nodetypes="ccc"
         style="fill:none;stroke:#ffffff;stroke-width:1.25061;stroke-linecap:round;stroke-linejoin:round;stroke-dasharray:none;stroke-opacity:1" />
    </g>
  </g>
</svg>
