<?xml version="1.0" encoding="UTF-8" standalone="no"?>
<svg
   width="24"
   height="24"
   version="1.1"
   viewBox="0 0 24 24"
   id="svg6"
   sodipodi:docname="tdividerbevel.svg"
   inkscape:export-filename="tdividerbevel.png"
   inkscape:export-xdpi="96"
   inkscape:export-ydpi="96"
   inkscape:version="1.3.2 (091e20e, 2023-11-25, custom)"
   xmlns:inkscape="http://www.inkscape.org/namespaces/inkscape"
   xmlns:sodipodi="http://sodipodi.sourceforge.net/DTD/sodipodi-0.dtd"
   xmlns="http://www.w3.org/2000/svg"
   xmlns:svg="http://www.w3.org/2000/svg">
  <defs
     id="defs6" />
  <sodipodi:namedview
     id="namedview6"
     pagecolor="#ffffff"
     bordercolor="#000000"
     borderopacity="0.25"
     inkscape:showpageshadow="2"
     inkscape:pageopacity="0.0"
     inkscape:pagecheckerboard="0"
     inkscape:deskcolor="#d1d1d1"
     showgrid="true"
     inkscape:current-layer="svg6">
    <inkscape:grid
       id="grid6"
       units="px"
       originx="0"
       originy="0"
       spacingx="0.5"
       spacingy="0.5"
       empcolor="#0099e5"
       empopacity="0.30196078"
       color="#0099e5"
       opacity="0.14901961"
       empspacing="2"
       dotted="false"
       gridanglex="30"
       gridanglez="30"
       visible="true" />
  </sodipodi:namedview>
  <rect
     y="0.9999826"
     width="24"
     height="22.000017"
     fill="#cccccc"
     fill-opacity="0.498039"
     fill-rule="evenodd"
     style="paint-order:normal"
     id="rect1"
     x="0" />
  <path
     d="M 0,11.5 H 4"
     fill="#b3b3b3"
     fill-rule="evenodd"
     stroke="#999999"
     stroke-width="1px"
     id="path1" />
  <path
     d="M 4,12.5 H 0"
     fill="none"
     stroke="#ffffff"
     stroke-width="1px"
     id="path2" />
  <path
     d="M 24,12.5 H 18.5"
     fill="#ffffff"
     fill-rule="evenodd"
     stroke="#ffffff"
     stroke-width="1px"
     id="path3" />
  <path
     d="M 18.5,11.5 H 24"
     fill="none"
     stroke="#999999"
     stroke-width="1px"
     id="path4" />
  <path
     d="m 12.500001,14.5498 h 2.457028 c 2.158074,0 1.781116,-3.1233 -0.146509,-3.1233 m -2.310519,3.1233 V 8.4502 h 2.310519 c 1.92961,0 1.781117,2.9763 0,2.9763 H 12.5"
     fill="none"
     stroke="#2a7fff"
     stroke-linecap="round"
     stroke-linejoin="round"
     stroke-width="0.9"
     id="path5" />
  <path
     d="m 10.226645,12.5562 c 0,1.1485 -0.514593,1.9937 -1.863322,1.9937 H 6.5 V 8.4502 h 1.863323 c 1.348728,0 1.863322,0.8452 1.863322,1.9936 z"
     fill="none"
     stroke="#2a7fff"
     stroke-linecap="round"
     stroke-linejoin="round"
     stroke-width="0.9"
     id="path6" />
</svg>
