<?xml version="1.0" encoding="UTF-8" standalone="no"?>
<svg
   height="24"
   viewBox="0 0 6.3499998 6.3500003"
   width="24"
   version="1.1"
   id="svg131"
   sodipodi:docname="Health_03_24.svg"
   inkscape:version="1.2.1 (9c6d41e410, 2022-07-14)"
   inkscape:export-filename="Health_03_24.png"
   inkscape:export-xdpi="96"
   inkscape:export-ydpi="96"
   xmlns:inkscape="http://www.inkscape.org/namespaces/inkscape"
   xmlns:sodipodi="http://sodipodi.sourceforge.net/DTD/sodipodi-0.dtd"
   xmlns:xlink="http://www.w3.org/1999/xlink"
   xmlns="http://www.w3.org/2000/svg"
   xmlns:svg="http://www.w3.org/2000/svg">
  <defs
     id="defs135">
    <radialGradient
       inkscape:collect="always"
       xlink:href="#linearGradient1041"
       id="radialGradient1043"
       cx="1.9253448"
       cy="1.5859377"
       fx="1.9253448"
       fy="1.5859377"
       r="1.8520745"
       gradientTransform="matrix(0.38937654,1.6400398,-2.3078314,0.55104896,5.1391094,-1.5935652)"
       gradientUnits="userSpaceOnUse" />
    <linearGradient
       inkscape:collect="always"
       id="linearGradient1041">
      <stop
         style="stop-color:#ffaaaa;stop-opacity:1"
         offset="0"
         id="stop1037" />
      <stop
         style="stop-color:#ff0000;stop-opacity:1"
         offset="1"
         id="stop1039" />
    </linearGradient>
    <linearGradient
       id="a"
       gradientUnits="userSpaceOnUse"
       x1="20.98311"
       x2="13.516894"
       y1="-3.0168898"
       y2="-10.483106"
       gradientTransform="matrix(0.9877828,0,0,0.9877828,0.46074497,24.167533)">
      <stop
         offset="0"
         stop-color="#009600"
         id="stop146" />
      <stop
         offset="1"
         stop-color="#6edb39"
         id="stop148" />
    </linearGradient>
    <linearGradient
       id="a-2"
       gradientUnits="userSpaceOnUse"
       x1="20.98311"
       x2="13.516894"
       y1="-3.0168898"
       y2="-10.483106"
       gradientTransform="matrix(0.97104063,0,0,0.97104063,0.84954747,24.154523)">
      <stop
         offset="0"
         stop-color="#009600"
         id="stop146-9" />
      <stop
         offset="1"
         stop-color="#6edb39"
         id="stop148-5" />
    </linearGradient>
  </defs>
  <sodipodi:namedview
     id="namedview133"
     pagecolor="#ffffff"
     bordercolor="#666666"
     borderopacity="1.0"
     inkscape:showpageshadow="2"
     inkscape:pageopacity="0.0"
     inkscape:pagecheckerboard="0"
     inkscape:deskcolor="#d1d1d1"
     showgrid="true"
     inkscape:zoom="38.25"
     inkscape:cx="11.620915"
     inkscape:cy="12"
     inkscape:current-layer="svg131">
    <inkscape:grid
       type="xygrid"
       id="grid1286" />
  </sodipodi:namedview>
  <path
     id="path353"
     style="fill:url(#radialGradient1043);fill-opacity:1;stroke:#d40000;stroke-width:0.264583px;stroke-linecap:butt;stroke-linejoin:miter;stroke-opacity:1"
     d="m 1.6972213,0.39687836 c -1.43247047,0.00353 -2.47938683,2.62610114 1.3452608,5.26336504 5.0469572,-3.4801009 1.6105773,-6.9339358 0,-4.3790104 C 2.6524204,0.66246206 2.1550212,0.39574876 1.6972213,0.39687836 Z" />
  <g
     id="g7759"
     transform="scale(0.26458334)">
    <circle
       cx="17.6"
       cy="17.6"
       fill="url(#a)"
       stroke-dashoffset="1.49998"
       stroke-linejoin="round"
       stroke-width="1.05405"
       transform="matrix(0,1,1,0,0,0)"
       id="circle151"
       style="fill:url(#a-2);stroke:#ffffff;stroke-width:1.2;stroke-linecap:round;stroke-dasharray:none"
       r="5.7999997" />
    <path
       d="m 17.6,14.95 v 5.300132"
       id="path276"
       style="fill:none;stroke:#ffffff;stroke-width:1.2;stroke-linecap:round;stroke-dasharray:none"
       sodipodi:nodetypes="cc" />
    <path
       d="M 20.250066,17.6 H 14.949934"
       id="path278"
       style="fill:none;stroke:#ffffff;stroke-width:1.2;stroke-linecap:round;stroke-dasharray:none"
       sodipodi:nodetypes="cc" />
    <rect
       style="fill:none;stroke:none;stroke-width:1.5;stroke-linecap:round;stroke-linejoin:round;stroke-miterlimit:5.6"
       id="rect7387"
       width="13"
       height="13"
       x="11"
       y="11" />
  </g>
</svg>
