<?xml version="1.0" encoding="UTF-8" standalone="no"?>
<svg
   width="36"
   height="36"
   version="1.1"
   viewBox="0 0 36 36"
   id="svg4"
   sodipodi:docname="Magnet_01_36.svg"
   inkscape:export-filename="Magnet_01_36.png"
   inkscape:export-xdpi="96"
   inkscape:export-ydpi="96"
   inkscape:version="1.3.2 (091e20e, 2023-11-25, custom)"
   xmlns:inkscape="http://www.inkscape.org/namespaces/inkscape"
   xmlns:sodipodi="http://sodipodi.sourceforge.net/DTD/sodipodi-0.dtd"
   xmlns="http://www.w3.org/2000/svg"
   xmlns:svg="http://www.w3.org/2000/svg">
  <sodipodi:namedview
     id="namedview4"
     pagecolor="#ffffff"
     bordercolor="#000000"
     borderopacity="0.25"
     inkscape:showpageshadow="2"
     inkscape:pageopacity="0.0"
     inkscape:pagecheckerboard="0"
     inkscape:deskcolor="#d1d1d1"
     showgrid="true"
     inkscape:current-layer="svg4">
    <inkscape:grid
       id="grid4"
       units="px"
       originx="0"
       originy="0"
       spacingx="0.5"
       spacingy="0.5"
       empcolor="#0099e5"
       empopacity="0.30196078"
       color="#0099e5"
       opacity="0.14901961"
       empspacing="2"
       dotted="false"
       gridanglex="30"
       gridanglez="30"
       visible="true" />
  </sodipodi:namedview>
  <defs
     id="defs1">
    <filter
       id="c"
       x="-0.19657702"
       y="-0.11749647"
       width="1.393154"
       height="1.2949109"
       color-interpolation-filters="sRGB">
      <feGaussianBlur
         stdDeviation="0.416 0.664"
         id="feGaussianBlur1" />
    </filter>
  </defs>
  <path
     d="m27.562601 9.5622213v-7.312578"
     fill="none"
     stroke="#b3b3b3"
     stroke-width="7.87508"
     id="path1" />
  <path
     d="m8.4373981 9.5622213v-7.312578"
     fill="none"
     stroke="#b3b3b3"
     stroke-width="7.87508"
     id="path2" />
  <path
     d="m27.562601 9.5622213v12.937636c0 5.281279-4.281323 9.562602-9.562601 9.562602-5.281279 0-9.5626019-4.281323-9.5626019-9.562602v-12.937636"
     fill="none"
     stroke="#ff0000"
     stroke-width="7.87508"
     id="path3" />
  <path
     transform="matrix(2.1036536 0 0 2.0497625 .11894564 2.1670383)"
     d="m3.8934971 0.53638592v9.0629606c0 5.9999995 9.2130049 5.9999995 9.2130049 0v-9.0629606"
     fill="none"
     filter="url(#c)"
     opacity=".7"
     stroke="#ffffff"
     stroke-width="1.62533"
     style="mix-blend-mode:normal"
     id="path4" />
</svg>
