<?xml version="1.0" encoding="UTF-8" standalone="no"?>
<svg
   height="48"
   viewBox="0 0 48 48"
   width="48"
   version="1.1"
   id="svg46"
   sodipodi:docname="win_main_ico_048.svg"
   inkscape:export-filename="win_main_ico_048.png"
   inkscape:export-xdpi="96"
   inkscape:export-ydpi="96"
   inkscape:version="1.1.1 (3bf5ae0d25, 2021-09-20)"
   xmlns:inkscape="http://www.inkscape.org/namespaces/inkscape"
   xmlns:sodipodi="http://sodipodi.sourceforge.net/DTD/sodipodi-0.dtd"
   xmlns="http://www.w3.org/2000/svg"
   xmlns:svg="http://www.w3.org/2000/svg">
  <defs
     id="defs50" />
  <sodipodi:namedview
     id="namedview48"
     pagecolor="#ffffff"
     bordercolor="#666666"
     borderopacity="1.0"
     inkscape:pageshadow="2"
     inkscape:pageopacity="0.0"
     inkscape:pagecheckerboard="0"
     showgrid="false"
     inkscape:zoom="19.020833"
     inkscape:cx="23.973713"
     inkscape:cy="24"
     inkscape:current-layer="svg46" />
  <radialGradient
     id="a"
     cx="127.998"
     cy="125.99904"
     gradientUnits="userSpaceOnUse"
     r="141.75525"
     gradientTransform="matrix(0.19047632,0,0,0.19047632,-0.35853,-1.6e-4)">
    <stop
       offset="0"
       stop-color="#b3c9ec"
       id="stop2" />
    <stop
       offset="1"
       stop-color="#fff"
       id="stop4" />
  </radialGradient>
  <radialGradient
     id="b"
     cx="127.99275"
     cy="125.99379"
     gradientUnits="userSpaceOnUse"
     r="120.74475"
     gradientTransform="matrix(0.19047632,0,0,0.19047632,-0.35853,-1.6e-4)">
    <stop
       offset="0"
       stop-color="#598bd4"
       id="stop7" />
    <stop
       offset=".56522"
       stop-color="#9ab8e5"
       id="stop9" />
    <stop
       offset="1"
       stop-color="#fff"
       id="stop11" />
  </radialGradient>
  <path
     d="m 39.353878,38.622723 c 0.687867,0.222572 1.968954,0.05216 2.685716,-0.521352 0.716667,-0.573544 1.40122,-1.737792 1.901182,-2.603621 0.500039,-0.865963 1.16602,-2.040763 1.304439,-2.948383 0.138349,-0.907505 -0.354629,-2.102097 -0.891372,-2.586478 -2.167811,-1.956573 -2.896764,-2.420383 -2.896192,-5.964576 -5.72e-4,-3.544383 0.728305,-4.008002 2.896192,-5.964575 0.536743,-0.4844 1.029715,-1.678992 0.891372,-2.586478 C 45.106794,14.53985 44.440739,13.364973 43.940776,12.498877 43.440814,11.632915 42.756261,10.46859 42.039594,9.8952563 41.32287,9.321713 40.041878,9.151351 39.353878,9.3739035 36.5754,10.272876 35.809304,10.672304 32.739969,8.8995794 29.670062,7.1278829 29.632919,6.2649109 29.022252,3.4092899 28.871126,2.702318 28.083032,1.6780888 27.22787,1.3443362 26.372783,1.0104693 25.022344,0.99980258 24.022344,0.99980258 c -1.000001,0 -2.350669,0.0106585 -3.205526,0.34453362 C 19.961731,1.678203 19.173559,2.7024323 19.022378,3.4092899 18.41173,6.2649109 18.374607,7.1279591 15.304662,8.8995794 12.235326,10.672266 11.46923,10.272876 8.6907523,9.3739035 8.0028852,9.1513319 6.7217986,9.3216692 6.0050362,9.8952563 5.2882929,10.468799 4.6038162,11.632953 4.103854,12.498877 3.6038156,13.36484 2.9378341,14.53964 2.799415,15.44726 c -0.1384191,0.907505 0.3546288,2.101906 0.8912958,2.586478 2.167811,1.956573 2.8967639,2.420383 2.8961925,5.964575 5.714e-4,3.544384 -0.7283053,4.008003 -2.8961925,5.964576 -0.536667,0.4844 -1.0296387,1.678992 -0.8912958,2.586478 0.1384191,0.90741 0.8044006,2.082287 1.304439,2.948383 0.4999622,0.865962 1.1844389,2.030287 1.9011822,2.603621 0.7166672,0.573543 1.9977157,0.743905 2.6857161,0.521352 2.7784777,-0.898972 3.5445737,-1.2984 6.6139097,0.474325 3.070097,1.771696 3.107049,2.634668 3.717716,5.490289 0.151197,0.706972 0.939296,1.731201 1.79444,2.064954 0.855086,0.333867 2.205525,0.344533 3.205526,0.344533 1,0 2.350668,-0.01067 3.205526,-0.344533 0.855086,-0.333867 1.643182,-1.358096 1.794382,-2.064954 0.610705,-2.855621 0.647772,-3.718669 3.717717,-5.490289 3.069526,-1.772687 3.835431,-1.373297 6.613909,-0.474325 z"
     fill="url(#a)"
     stroke-width="1"
     id="path14"
     style="fill:url(#a)" />
  <path
     d="m 40.045307,18.000614 c -2.22324,1.735697 -11.024007,1.998859 -15.02401,3.99886 -3.19905,1.599601 -3.557526,2.99124 -6.000004,8.000005 -1.309373,2.684955 -6.853529,3.875622 -7.544196,4.279051 -0.725067,0.423486 -3.3565736,2.976002 -4.5857173,4.476003 0.9499435,-0.01192 6.8299093,-0.569829 8.4131483,0.344572 3.070098,1.771696 3.106098,2.634668 3.716765,5.490099 0.151196,0.706972 0.939848,1.730591 1.794877,2.064572 0.855086,0.333867 2.205144,0.343753 3.205145,0.343753 1.000001,0 2.350097,-0.0099 3.205145,-0.343753 0.855086,-0.333866 1.643677,-1.357505 1.794878,-2.064572 0.610648,-2.855621 0.646781,-3.71867 3.716764,-5.490099 3.069335,-1.772706 3.836765,-1.373601 6.615243,-0.47461 0.687867,0.222571 1.968953,0.05209 2.685525,-0.521486 0.716725,-0.573543 1.400439,-1.737506 1.900402,-2.603431 0.500038,-0.865962 1.166305,-2.041715 1.304724,-2.949144 0.138351,-0.907411 -0.353924,-2.101526 -0.890667,-2.585907 -2.167811,-1.956573 -2.897145,-2.420573 -2.896383,-5.964766 -5.71e-4,-3.544383 0.728591,-4.008193 2.896383,-5.964766 0.536743,-0.4844 1.02901,-1.678496 0.890667,-2.585906 -0.06565,-0.431772 -0.67,-2.241526 -0.900038,-2.732383 -0.861792,1.423106 -2.799431,4.113907 -4.29848,5.284384 z"
     fill="url(#b)"
     stroke-width="1"
     id="path16"
     style="fill:url(#b)" />
  <path
     d="m 39.513878,38.777009 c 0.69501,0.224877 1.989335,0.05272 2.713526,-0.526762 0.724095,-0.579505 1.415734,-1.755792 1.920953,-2.630668 0.505182,-0.874973 1.178173,-2.062097 1.317982,-2.97886 0.139808,-0.916838 -0.358305,-2.123811 -0.90061,-2.613335 -2.190287,-1.976953 -2.926859,-2.445335 -2.926288,-6.02648 -5.71e-4,-3.581145 0.735944,-4.049717 2.926288,-6.02648 0.542286,-0.489448 1.04042,-1.696421 0.900534,-2.613335 C 45.326457,14.44425 44.65352,13.257087 44.148281,12.382229 43.6431,11.507257 42.951557,10.33099 42.227328,9.7515609 41.503232,9.1720558 40.20885,8.9999223 39.513802,9.2247987 36.706562,10.133123 35.932466,10.536666 32.831131,8.7455412 29.729224,6.9554447 29.6917,6.0834441 29.074747,3.1981088 28.922023,2.4838036 28.125737,1.4489077 27.261755,1.1116312 26.39785,0.77429767 25.033373,0.76351671 24.022896,0.76351671 c -1.01042,0 -2.375049,0.0107981 -3.238859,0.34811449 C 19.920131,1.4489648 19.123845,2.4838036 18.971045,3.1981088 18.354073,6.0832537 18.31653,6.9554447 15.214662,8.7455412 12.113326,10.536647 11.339421,10.133104 8.5319903,9.2247987 7.8369041,8.9999223 6.5424652,9.1720786 5.8184647,9.7515609 5.0943689,10.331066 4.4027304,11.507353 3.897511,12.382229 c -0.5051813,0.874972 -1.178096,2.062097 -1.3179819,2.97886 -0.1398077,0.916838 0.358305,2.123811 0.9006102,2.613335 2.1902872,1.976953 2.9268591,2.445335 2.9260972,6.02648 6.286e-4,3.581145 -0.7358862,4.049717 -2.9260972,6.02648 -0.5422861,0.489448 -1.0404007,1.69642 -0.9006102,2.613335 0.1398782,0.916839 0.8128006,2.104002 1.3179819,2.97886 0.5052384,0.874972 1.1968008,2.051239 1.9209537,2.630668 0.7241719,0.579505 2.0184775,0.751639 2.7135256,0.526762 2.8072397,-0.908324 3.5813357,-1.311867 6.6826717,0.479239 3.101906,1.790096 3.13943,2.662097 3.756383,5.547432 0.152793,0.714324 0.949086,1.749201 1.812992,2.086478 0.863962,0.337333 2.228573,0.348114 3.238859,0.348114 1.010477,6e-6 2.375049,-0.0108 3.238859,-0.348114 0.863982,-0.337334 1.660268,-1.372173 1.812992,-2.086478 0.617029,-2.885145 0.654515,-3.757336 3.756384,-5.547432 3.101335,-1.791087 3.87524,-1.387563 6.682671,-0.479258 z"
     fill="none"
     stroke="#2e4f72"
     stroke-linejoin="round"
     stroke-width="1.52381"
     id="path18" />
  <path
     d="m 14.843766,13.204765 c 1.97943,0 3.492002,0.521067 3.661907,2.50343 0.287239,3.353527 0.48781,5.51429 -0.07589,7.17791 -0.282076,0.832401 -1.086706,2.749335 -2.555049,4.476956 -0.920401,1.082953 -1.54783,2.221906 -1.333297,3.760193 0.187103,1.341486 0.303677,3.208002 1.390954,3.528573 -0.11332,0.607772 -0.235639,0.664572 -0.769715,1.10602 -1.301544,-0.506591 -1.625963,-2.822478 -1.78842,-4.623051 -0.141715,-1.570858 0.276076,-3.236764 1.633658,-4.688955 2.624954,-2.807812 3.316955,-5.253718 2.474859,-7.74591 -0.27821,-0.823334 -0.139915,-0.761124 -2.498288,-0.64642 -2.358373,0.114705 -3.641335,-1.693982 -4.185336,-3.242478 -0.586686,-0.324781 -1.8842678,0.09666 -2.7822874,0.321048 0.7671052,-1.312496 4.6918124,-1.927049 6.8270524,-1.927049 z"
     fill="#333333"
     id="path22"
     style="stroke-width:1" />
  <ellipse
     cx="16.659792"
     cy="13.77023"
     fill="#ffffff"
     rx="2.6596088"
     ry="1.5473003"
     transform="matrix(0.99248448,0.12237057,-0.12136967,0.99260738,0,0)"
     id="ellipse24"
     style="stroke-width:1" />
  <path
     d="m 24.022439,8.7 -0.499962,4.500003 0.499962,3.500003 0.500038,-3.500003 z"
     fill="#333333"
     id="path26"
     style="stroke-width:1" />
  <path
     d="m 33.201493,13.204765 c -1.97943,0 -3.492003,0.521067 -3.661907,2.50343 -0.287239,3.353527 -0.48781,5.51429 0.07589,7.17791 0.282076,0.832401 1.086705,2.749335 2.555049,4.476956 0.920401,1.082953 1.54783,2.221906 1.333296,3.760193 -0.187103,1.341486 -0.303676,3.208002 -1.390953,3.528573 0.11332,0.607772 0.235638,0.664572 0.769715,1.10602 1.301544,-0.506591 1.625963,-2.822478 1.78842,-4.623051 0.141715,-1.570858 -0.276076,-3.236764 -1.633658,-4.688955 -2.624954,-2.807812 -3.316955,-5.253718 -2.474859,-7.74591 0.27821,-0.823334 0.139915,-0.761124 2.498288,-0.64642 2.358373,0.114705 3.641335,-1.693982 4.185336,-3.242478 0.586686,-0.324781 1.884268,0.09666 2.782287,0.321048 -0.767105,-1.312496 -4.691812,-1.927049 -6.827052,-1.927049 z"
     fill="#333333"
     id="path28"
     style="stroke-width:1" />
  <ellipse
     cx="-31.028265"
     cy="19.648788"
     fill="#ffffff"
     rx="2.6596088"
     ry="1.5473003"
     transform="matrix(-0.99248448,0.12237057,0.12136967,0.99260738,0,0)"
     id="ellipse30"
     style="stroke-width:1" />
  <ellipse
     cx="15.198051"
     cy="15.04667"
     fill="#550000"
     fill-opacity="0.97647"
     rx="1.4117343"
     ry="1.0588007"
     stroke-width="1.00002"
     id="ellipse34" />
  <ellipse
     cx="-32.845303"
     cy="15.04667"
     fill="#550000"
     fill-opacity="0.97647"
     rx="1.4117343"
     ry="1.0588007"
     stroke-width="1"
     transform="scale(-1,1)"
     id="ellipse36" />
  <circle
     cx="14.562813"
     cy="14.764383"
     r="0.42352411"
     id="circle38"
     style="fill:#ffffff;stroke-width:0.190476" />
  <circle
     cx="32.20911"
     cy="14.764383"
     r="0.42352411"
     id="circle40"
     style="fill:#ffffff;stroke-width:0.190476" />
  <path
     id="path25"
     style="fill:#333333;fill-opacity:1;stroke-width:1.00267"
     d="m 20.416847,27.400291 c -1.592313,-0.02712 -1.861835,2.655538 -0.31578,3.342129 2.248697,0.99863 2.863339,2.221965 3.443841,2.960255 l 0.09547,1.432395 c -0.699194,0.227998 -4.4144,1.110032 -4.010774,1.814268 1.69162,-0.14038 2.627257,-0.572748 4.392283,-0.572811 v 0.0034 c 1.765025,6.4e-5 2.700662,0.432431 4.392282,0.572811 0.403626,-0.704237 -3.311581,-1.586268 -4.010775,-1.814267 l 0.09547,-1.432394 c 0.5805,-0.738289 1.195144,-1.961626 3.443841,-2.960256 1.546057,-0.686593 1.276531,-3.369253 -0.315782,-3.34213 -1.592139,0.02712 -2.459315,0.190901 -3.605035,0.190936 v -0.0034 c -1.145722,-3.6e-5 -2.012897,-0.163821 -3.605037,-0.190934 z" />
  <path
     d="m 37.643001,20.75137 -2.264048,3.981391 -2.757848,0.0011 -2.265002,-3.983864 -3.148766,1.304271 1.21542,4.418615 -1.950788,1.949386 -4.416199,-1.214339 -1.304396,3.149094 3.981391,2.264044 0.0011,2.757857 -3.983864,2.26499 1.304258,3.148763 4.418621,-1.21541 1.949393,1.950782 -1.214349,4.416201 3.149101,1.304396 2.264045,-3.981394 2.757848,-0.0011 2.265001,3.983867 3.148761,-1.304271 -1.215421,-4.418615 1.950793,-1.949384 4.416197,1.214335 1.3044,-3.149088 -3.9814,-2.264043 -0.0011,-2.757858 3.983871,-2.26501 -1.304258,-3.14875 -4.418622,1.215414 -1.949392,-1.950785 1.214349,-4.416203 z m -1.903847,9.049782 a 4.5447418,4.5447418 0 0 1 2.459595,5.937998 4.5447418,4.5447418 0 0 1 -5.937988,2.459595 4.5447418,4.5447418 0 0 1 -2.459602,-5.937994 4.5447418,4.5447418 0 0 1 5.937995,-2.459599 z"
     fill="none"
     stroke="#0088aa"
     stroke-linejoin="round"
     id="path2"
     style="fill:#ffb833;fill-opacity:1;stroke:#b27500;stroke-width:1.5;stroke-miterlimit:4;stroke-dasharray:none;stroke-opacity:1" />
</svg>
