<?xml version="1.0" encoding="UTF-8" standalone="no"?>
<svg
   height="64"
   width="64"
   version="1.1"
   id="svg665"
   sodipodi:docname="Cloud_09_64.svg"
   inkscape:export-filename="Cloud_09_64.png"
   inkscape:export-xdpi="96"
   inkscape:export-ydpi="96"
   inkscape:version="1.2.1 (9c6d41e410, 2022-07-14)"
   xmlns:inkscape="http://www.inkscape.org/namespaces/inkscape"
   xmlns:sodipodi="http://sodipodi.sourceforge.net/DTD/sodipodi-0.dtd"
   xmlns="http://www.w3.org/2000/svg"
   xmlns:svg="http://www.w3.org/2000/svg">
  <defs
     id="defs669">
    <radialGradient
       id="a-6"
       cx="12.1"
       cy="10.900001"
       gradientTransform="matrix(0,2.0740741,-2.0740739,4e-8,43.307408,-4.396297)"
       gradientUnits="userSpaceOnUse"
       r="4.5">
      <stop
         offset="0"
         stop-color="#f55"
         id="stop788" />
      <stop
         offset="1"
         stop-color="#a00"
         id="stop790" />
    </radialGradient>
  </defs>
  <sodipodi:namedview
     id="namedview667"
     pagecolor="#ffffff"
     bordercolor="#666666"
     borderopacity="1.0"
     inkscape:showpageshadow="2"
     inkscape:pageopacity="0.0"
     inkscape:pagecheckerboard="0"
     inkscape:deskcolor="#d1d1d1"
     showgrid="true"
     inkscape:zoom="14.34375"
     inkscape:cx="30.989107"
     inkscape:cy="32"
     inkscape:current-layer="svg665">
    <inkscape:grid
       type="xygrid"
       id="grid788" />
  </sodipodi:namedview>
  <linearGradient
     id="a"
     gradientTransform="matrix(1.0000001 0 0 .96627925 -.000186 -.011629)"
     gradientUnits="userSpaceOnUse"
     x1="7.5"
     x2="9"
     y1="2"
     y2="13">
    <stop
       offset="0"
       stop-color="#5ab4f2"
       id="stop658" />
    <stop
       offset="1"
       stop-color="#0090ff"
       id="stop660" />
  </linearGradient>
  <path
     d="m3.2916407 12.550001c-4.3402419 0-4.3402419-5.8903523-.28586-5.8903523-.5693973-6.0664286 9.1223563-5.70499896 9.1223563-1.4725883 4.918074-.359472 5.574823 7.3629406-.506798 7.3629406z"
     fill="url(#a)"
     transform="matrix(3.9999997 0 0 3.9999997 .000744 .000001)"
     id="path663" />
  <g
     id="g3486"
     transform="scale(2)">
    <circle
       cx="23.5"
       cy="23.5"
       style="fill:url(#a-6);stroke:#ffffff;stroke-width:1.6;stroke-linecap:round;stroke-linejoin:round;stroke-dashoffset:1.49998"
       transform="matrix(0,1,1,0,0,0)"
       id="ellipse793"
       r="7.6999998" />
    <g
       id="g3333"
       transform="matrix(0.89999925,0,0,0.89999925,2.3500176,2.3500176)"
       style="stroke-width:1.11111">
      <path
         d="m 26.5,20.5 -6,6"
         id="path3550"
         style="fill:none;stroke:#ffffff;stroke-width:1.77778;stroke-linecap:round;stroke-dasharray:none"
         sodipodi:nodetypes="cc" />
      <path
         d="m 26.5,26.5 -6,-6"
         id="path3552"
         style="fill:none;stroke:#ffffff;stroke-width:1.77778;stroke-linecap:round;stroke-dasharray:none"
         sodipodi:nodetypes="cc" />
    </g>
  </g>
</svg>
