<?xml version="1.0" encoding="UTF-8" standalone="no"?>
<svg
   height="16"
   viewBox="0 0 4.2333332 4.2333335"
   width="16"
   version="1.1"
   id="svg8"
   sodipodi:docname="Grid_15_16.svg"
   inkscape:export-filename="Grid_15_16.png"
   inkscape:export-xdpi="96"
   inkscape:export-ydpi="96"
   inkscape:version="1.2.1 (9c6d41e410, 2022-07-14)"
   xmlns:inkscape="http://www.inkscape.org/namespaces/inkscape"
   xmlns:sodipodi="http://sodipodi.sourceforge.net/DTD/sodipodi-0.dtd"
   xmlns="http://www.w3.org/2000/svg"
   xmlns:svg="http://www.w3.org/2000/svg">
  <defs
     id="defs12" />
  <sodipodi:namedview
     id="namedview10"
     pagecolor="#ffffff"
     bordercolor="#666666"
     borderopacity="1.0"
     inkscape:showpageshadow="2"
     inkscape:pageopacity="0.0"
     inkscape:pagecheckerboard="0"
     inkscape:deskcolor="#d1d1d1"
     showgrid="true"
     inkscape:zoom="57.375"
     inkscape:cx="7.9912854"
     inkscape:cy="8"
     inkscape:current-layer="svg8">
    <inkscape:grid
       type="xygrid"
       id="grid931" />
  </sodipodi:namedview>
  <g
     stroke-linecap="round"
     stroke-linejoin="round"
     id="g6">
    <path
       d="m.13229166 0c-.07305939.0000073-.13228372.05923227-.13229166.13229166v3.17499994c.0000073.0730594.05923227.1322838.13229166.1322917h1.12395004c-.0635609-.0855213-.1188456-.1740191-.1658806-.2645833h-.0320384v-.0645954c-.17243686-.3658394-.21230163-.7592483-.11368877-1.1110383.04077758-.1454706.10264247-.2836863.18035057-.4118504h-.0666618v-.5291667h.5291667v.031522c.2607839-.18458611.5780881-.29609475.9260417-.29609475.3490383 0 .6660091.11303793.9260416.29921725v-.0346233h.5291667v.5291666h-.072348c.079819.1314397.143166.2731823.184486.4221956.096867.3493294.057155.7398015-.1121383 1.1022542v.063045h-.030488c-.046582.090652-.1012348.1791732-.16433.2645833h.3271043c.073062 0 .1322917-.05923.1322917-.1322916v-3.17500009c-.0000071-.07305939-.059232-.13228372-.1322914-.13229166h-3.96874991zm.13229167.26458333h.52916666v.52916666h-.52916666zm.79374997 0h.5291667v.52916666h-.5291667zm.79375 0h.5291667v.52916666h-.5291667zm.79375 0h.5291667v.52916666h-.5291667zm.79375 0h.5291667v.52916666h-.5291667zm-3.17499997.79374997h.52916666v.5291667h-.52916666zm2.24895827.7276042c-.099092 0-.1917144.024397-.2743993.066146h.1421103v.5291665h-.5048779c-.01146.085381-.00722.1740297.022738.2645833h.48215v.5074708a.49614666.49614666 0 0 1 .1705319.1788001.49614666.49614666 0 0 1 .0940514-.1689814v-.5172869h.4847167c.027789-.089829.029763-.1783423.017052-.2645833h-.5017819v-.5291666h.1384935c-.0819653-.0418889-.1735111-.0661459-.2707746-.0661459zm-2.24895827.0661458h.52916666v.5291667h-.52916666zm0 .79375h.52916666v.5291667h-.52916666z"
       fill="#d4aa00"
       stroke-dashoffset="1.5"
       stroke-width=".264583"
       id="path2" />
    <path
       d="m3.7041666 4.0018229h-.79375v-.4299479c1.3168577-.7692496.6614584-2.2820313-.396875-2.2820313-1.0583333 0-1.71979161 1.4882813-.3954462 2.2820313l-.00143.4299479h-.79375"
       fill="none"
       stroke="#2a7fff"
       stroke-width=".463021"
       id="path4" />
  </g>
</svg>
