<svg width="16" height="16" version="1.1" xmlns="http://www.w3.org/2000/svg">
 <path d="m3 8 3 3 7-7" fill="none" stroke="#36cd36" stroke-linecap="round" stroke-linejoin="round" stroke-width="2"/>
</svg>
