<?xml version="1.0" encoding="UTF-8" standalone="no"?>
<svg
   height="32"
   width="32"
   version="1.1"
   id="svg339"
   sodipodi:docname="menu_clear_all_bookmarks_200.svg"
   inkscape:export-filename="menu_clear_all_bookmarks_200.png"
   inkscape:export-xdpi="96"
   inkscape:export-ydpi="96"
   inkscape:version="1.2.2 (732a01da63, 2022-12-09)"
   xmlns:inkscape="http://www.inkscape.org/namespaces/inkscape"
   xmlns:sodipodi="http://sodipodi.sourceforge.net/DTD/sodipodi-0.dtd"
   xmlns="http://www.w3.org/2000/svg"
   xmlns:svg="http://www.w3.org/2000/svg">
  <defs
     id="defs343" />
  <sodipodi:namedview
     id="namedview341"
     pagecolor="#ffffff"
     bordercolor="#666666"
     borderopacity="1.0"
     inkscape:showpageshadow="2"
     inkscape:pageopacity="0.0"
     inkscape:pagecheckerboard="0"
     inkscape:deskcolor="#d1d1d1"
     showgrid="true"
     inkscape:zoom="28.6875"
     inkscape:cx="16"
     inkscape:cy="16"
     inkscape:current-layer="svg339">
    <inkscape:grid
       type="xygrid"
       id="grid6030" />
  </sodipodi:namedview>
  <radialGradient
     id="a"
     cx="12.1"
     cy="10.900001"
     gradientTransform="matrix(0 2.2087543 -2.2087541 .00000004 44.093604 -6.707745)"
     gradientUnits="userSpaceOnUse"
     r="4.5">
    <stop
       offset="0"
       stop-color="#f55"
       id="stop310" />
    <stop
       offset="1"
       stop-color="#a00"
       id="stop312" />
  </radialGradient>
  <g
     stroke-linecap="round"
     id="g329">
    <g
       stroke-linejoin="round"
       id="g321">
      <path
         d="m.74999999.75000001h20.50000001v26.50000099h-20.50000001z"
         fill="#fff"
         stroke="#d4aa00"
         stroke-miterlimit="5.6"
         stroke-width="1.5"
         id="path315" />
      <path
         d="m4.75 4.75h20.5v26.500001h-20.5z"
         fill="#fff"
         stroke="#d4aa00"
         stroke-miterlimit="5.6"
         stroke-width="1.5"
         id="path317" />
      <circle
         cx="23"
         cy="23"
         fill="url(#a)"
         r="8.2"
         stroke="#fff"
         stroke-dashoffset="1.49998"
         stroke-width="1.6"
         transform="matrix(0 1 1 0 0 0)"
         id="circle319" />
    </g>
    <g
       fill="none"
       stroke="#fff"
       stroke-width="1.66938"
       transform="matrix(.95844079 0 0 .95844079 .476641 .476641)"
       id="g327">
      <path
         d="m26.5 20.5-6 6"
         id="path323" />
      <path
         d="m26.5 26.5-6-6"
         id="path325" />
    </g>
  </g>
  <g
     fill="none"
     id="g337"
     style="fill:#2a7fff;fill-opacity:1;stroke:none">
    <circle
       cx="9.5"
       cy="10"
       r="2.5"
       id="circle331"
       style="fill:#2a7fff;fill-opacity:1;stroke:none" />
    <circle
       cx="9.5"
       cy="26"
       r="2.5"
       id="circle333"
       style="fill:#2a7fff;fill-opacity:1;stroke:none" />
    <circle
       cx="9.5"
       cy="18"
       r="2.5"
       id="circle335"
       style="fill:#2a7fff;fill-opacity:1;stroke:none" />
  </g>
</svg>
