<?xml version="1.0" encoding="UTF-8" standalone="no"?>
<svg
   width="36"
   height="36"
   version="1.1"
   viewBox="0 0 36 36"
   id="svg8"
   sodipodi:docname="tchartliveview_150.svg"
   inkscape:version="1.3.2 (091e20e, 2023-11-25, custom)"
   xmlns:inkscape="http://www.inkscape.org/namespaces/inkscape"
   xmlns:sodipodi="http://sodipodi.sourceforge.net/DTD/sodipodi-0.dtd"
   xmlns="http://www.w3.org/2000/svg"
   xmlns:svg="http://www.w3.org/2000/svg">
  <defs
     id="defs8" />
  <sodipodi:namedview
     id="namedview8"
     pagecolor="#ffffff"
     bordercolor="#000000"
     borderopacity="0.25"
     inkscape:showpageshadow="2"
     inkscape:pageopacity="0.0"
     inkscape:pagecheckerboard="0"
     inkscape:deskcolor="#d1d1d1"
     showgrid="true"
     inkscape:current-layer="svg8">
    <inkscape:grid
       id="grid8"
       units="px"
       originx="0"
       originy="0"
       spacingx="0.5"
       spacingy="0.5"
       empcolor="#0099e5"
       empopacity="0.30196078"
       color="#0099e5"
       opacity="0.14901961"
       empspacing="2"
       dotted="false"
       gridanglex="30"
       gridanglez="30"
       visible="true" />
  </sodipodi:namedview>
  <rect
     x="1.5"
     y="2.5"
     width="32"
     height="32"
     fill="#ffffff"
     fill-rule="evenodd"
     stroke="#2a7efe"
     stroke-linecap="square"
     stroke-linejoin="round"
     style="paint-order:normal"
     id="rect1" />
  <path
     d="m19.5 6.5v24"
     fill="none"
     stroke="#cccccc"
     id="path1" />
  <path
     d="m24.5 6.5v24"
     fill="none"
     stroke="#cccccc"
     id="path2" />
  <path
     d="m28.5 11.5h-13.5"
     fill="none"
     stroke="#cccccc"
     id="path3" />
  <path
     d="m28.5 26.5h-13.5"
     fill="none"
     stroke="#cccccc"
     id="path4" />
  <path
     d="m28.5 21.5h-13.5"
     fill="none"
     stroke="#cccccc"
     id="path5" />
  <path
     d="m28.5 16.5h-13.5"
     fill="none"
     stroke="#cccccc"
     id="path6" />
  <path
     d="m4.5 23.5 7.5-6.5v13"
     fill="#ff6600"
     id="path7" />
  <path
     d="m3.75 8.7499997 6 6.0000003 4.5-6.0000003 4.5 3.0000003 4.730523 9 4.269477-4.5 4.5 5.25"
     fill="none"
     stroke="#2a7efe"
     stroke-linecap="round"
     stroke-linejoin="round"
     stroke-width="1.65"
     id="path8" />
  <rect
     x="14.73832"
     y="5.7382989"
     width="14.523355"
     height="25.523323"
     fill="none"
     stroke="#4d4d4d"
     stroke-linecap="round"
     stroke-linejoin="round"
     stroke-width="1.47664"
     style="paint-order:markers stroke fill"
     id="rect8" />
</svg>
