<?xml version="1.0" encoding="UTF-8" standalone="no"?>
<svg
   height="24"
   viewBox="0 0 6.3499998 6.3500003"
   width="24"
   version="1.1"
   id="svg157"
   sodipodi:docname="Database_09_24.svg"
   inkscape:export-filename="Database_09_24.png"
   inkscape:export-xdpi="96"
   inkscape:export-ydpi="96"
   inkscape:version="1.2.1 (9c6d41e410, 2022-07-14)"
   xmlns:inkscape="http://www.inkscape.org/namespaces/inkscape"
   xmlns:sodipodi="http://sodipodi.sourceforge.net/DTD/sodipodi-0.dtd"
   xmlns="http://www.w3.org/2000/svg"
   xmlns:svg="http://www.w3.org/2000/svg">
  <defs
     id="defs161" />
  <sodipodi:namedview
     id="namedview159"
     pagecolor="#ffffff"
     bordercolor="#666666"
     borderopacity="1.0"
     inkscape:showpageshadow="2"
     inkscape:pageopacity="0.0"
     inkscape:pagecheckerboard="0"
     inkscape:deskcolor="#d1d1d1"
     showgrid="true"
     inkscape:zoom="38.25"
     inkscape:cx="11.986928"
     inkscape:cy="12"
     inkscape:current-layer="svg157">
    <inkscape:grid
       type="xygrid"
       id="grid984" />
  </sodipodi:namedview>
  <g
     stroke-linecap="round"
     id="g155">
    <path
       d="m2.9104167.396875c-1.3150841 0-2.38125003.41462434-2.38125003.9260417v.74104c0 .5114173 1.06616593.9260417 2.38125003.9260417.1357863 0 .2688462-.004945.3984253-.0134359a2.1166668 2.1166668 0 0 1 1.3213664-.4630208 2.1166668 2.1166668 0 0 1 .324528.0253214c.2138451-.1388883.3369303-.3012574.3369303-.4749064v-.7312215-.0098185c0-.51141736-1.0661655-.9260417-2.38125-.9260417zm0 .55552165c1.1001582 0 1.8187486.35604825 2.1564575.63613685-.3369511.2297597-1.0535834.4913158-2.1564575.4754232-1.0919122-.0157983-1.808379-.2733167-2.14922285-.4924764.33889565-.2811163 1.05098395-.61908365 2.14922285-.61908365zm-2.38125003 1.66708175v.9260416c0 .4598134.86186993.8413173 1.99160973.9136394a2.1166668 2.1166668 0 0 1 .2935221-.9146729c-1.2704417-.0196526-2.28513183-.4261333-2.28513183-.9250081zm0 1.4815633v.9260417c0 .5114178 1.06616463.9260416 2.38125003.9260416.0225422 0 .0447875-.0002747.0671794-.0005167a2.1166668 2.1166668 0 0 1 -.4268474-.936377c-1.1444878-.0674173-2.02158203-.4513032-2.02158203-.9151896z"
       fill="#00aad4"
       stroke-linejoin="round"
       stroke-miterlimit="5.6"
       stroke-width=".529169"
       id="path143" />
    <g
       fill="none"
       stroke="#00d455"
       transform="scale(.26458334)"
       id="g153">
      <circle
         cx="17.5"
         cy="17.5"
         r="5.9"
         stroke-dashoffset="1.49998"
         stroke-linejoin="round"
         stroke-width="1.2"
         transform="matrix(0 1 1 0 0 0)"
         id="circle145" />
      <g
         stroke-width="2"
         id="g151">
        <path
           d="m17.5 15v5"
           id="path147" />
        <path
           d="m20 17.5h-5"
           id="path149" />
      </g>
    </g>
  </g>
</svg>
