<?xml version="1.0" encoding="UTF-8" standalone="no"?>
<svg
   height="32"
   viewBox="0 0 8.4667 8.4667"
   width="32"
   version="1.1"
   id="svg308"
   sodipodi:docname="menu_source_guessunclosedblock_200.svg"
   inkscape:export-filename="menu_source_guessunclosedblock_200.png"
   inkscape:export-xdpi="96"
   inkscape:export-ydpi="96"
   inkscape:version="1.2.2 (732a01da63, 2022-12-09)"
   xmlns:inkscape="http://www.inkscape.org/namespaces/inkscape"
   xmlns:sodipodi="http://sodipodi.sourceforge.net/DTD/sodipodi-0.dtd"
   xmlns="http://www.w3.org/2000/svg"
   xmlns:svg="http://www.w3.org/2000/svg">
  <defs
     id="defs312" />
  <sodipodi:namedview
     id="namedview310"
     pagecolor="#ffffff"
     bordercolor="#666666"
     borderopacity="1.0"
     inkscape:showpageshadow="2"
     inkscape:pageopacity="0.0"
     inkscape:pagecheckerboard="0"
     inkscape:deskcolor="#d1d1d1"
     showgrid="true"
     inkscape:zoom="28.6875"
     inkscape:cx="15.982571"
     inkscape:cy="16"
     inkscape:current-layer="svg308">
    <inkscape:grid
       type="xygrid"
       id="grid535" />
  </sodipodi:namedview>
  <g
     fill="none"
     stroke-width=".529168"
     id="g304">
    <path
       d="m3.4395969 7.1437781 4.4979343-.0000002"
       stroke="#d4aa00"
       id="path290" />
    <path
       d="m4.6302266 5.0271031h3.3073046"
       stroke="#f00"
       id="path292" />
    <path
       d="m2.1166752.7937527 5.820856.0000004"
       stroke="#d4aa00"
       id="path294" />
    <path
       d="m4.7625187 3.9687656 3.1750125-.0000001"
       stroke="#2a7fff"
       id="path296" />
    <path
       d="m4.4979344 2.9104281h3.4395968"
       stroke="#2a7fff"
       id="path298" />
    <path
       d="m3.1750126 1.8520905h4.7625186"
       stroke="#f00"
       id="path300" />
    <path
       d="m3.7041812 6.0854406 4.23335-.0000001"
       stroke="#d4aa00"
       id="path302" />
  </g>
  <path
     d="m.8101114 4.0812127.8062368.104488c.132886-.5955524.4658882-.8567814.9544242-.8567814.5193788 0 .8401446.3478386.8401446.6864908 0 .430725-.19492.5073574-.6279412.8951762-.5910994.5293902-.6830688.8250909-.6663008 1.5717309h.7937531c0-.65115.1686999-.7645739.4401747-1.0245601.5043668-.4830228.9180046-.7391226.9180046-1.4423482 0-.7976836-.7847332-1.3695644-1.7249656-1.36956s-1.650931.5553108-1.7335304 1.4353638zm1.3065638 3.8563182-.0000002-.7937528h.7937531v.7937531z"
     fill="#2a7fff"
     id="path306" />
</svg>
