<svg width="32" height="32" version="1.1" xmlns="http://www.w3.org/2000/svg">
 <linearGradient id="a" x1="8" x2="8" y1="15" y2="4" gradientUnits="userSpaceOnUse">
  <stop stop-color="#d58914" stop-opacity=".956863" offset="0"/>
  <stop stop-color="#f4a428" stop-opacity=".992157" offset="1"/>
 </linearGradient>
 <path transform="matrix(1.9999812 0 0 1.9999812 .00015 .528282)" d="m8.0000002.49986362 2.3511408 4.76393198 5.257311.7639323-3.804226 3.7082037.898056 5.2360684-4.702282-2.472136-4.7022822 2.472135.8980561-5.2360674-3.80422596-3.7082041 5.25731106-.7639318z" fill="url(#a)" fill-rule="evenodd"/>
</svg>
