<?xml version="1.0" encoding="UTF-8" standalone="no"?>
<svg
   height="32"
   width="32"
   version="1.1"
   id="svg5"
   sodipodi:docname="ddconnection_close_200.svg"
   inkscape:export-filename="ddconnection_close_200.png"
   inkscape:export-xdpi="96"
   inkscape:export-ydpi="96"
   inkscape:version="1.3 (0e150ed6c4, 2023-07-21)"
   xmlns:inkscape="http://www.inkscape.org/namespaces/inkscape"
   xmlns:sodipodi="http://sodipodi.sourceforge.net/DTD/sodipodi-0.dtd"
   xmlns="http://www.w3.org/2000/svg"
   xmlns:svg="http://www.w3.org/2000/svg">
  <defs
     id="defs5" />
  <sodipodi:namedview
     id="namedview5"
     pagecolor="#ffffff"
     bordercolor="#000000"
     borderopacity="0.25"
     inkscape:showpageshadow="2"
     inkscape:pageopacity="0.0"
     inkscape:pagecheckerboard="0"
     inkscape:deskcolor="#d1d1d1"
     showgrid="true"
     inkscape:current-layer="svg5">
    <inkscape:grid
       id="grid5"
       units="px"
       originx="0"
       originy="0"
       spacingx="0.5"
       spacingy="0.5"
       empcolor="#0099e5"
       empopacity="0.30196078"
       color="#0099e5"
       opacity="0.14901961"
       empspacing="2"
       dotted="false"
       gridanglex="30"
       gridanglez="30"
       visible="true" />
  </sodipodi:namedview>
  <g
     stroke-linecap="round"
     id="g5">
    <g
       stroke="#ff2828"
       stroke-width="1.6"
       id="g3">
      <circle
         cx="24"
         cy="24"
         fill="#ffebeb"
         r="7"
         stroke-dashoffset="1.49998"
         stroke-linejoin="round"
         transform="matrix(0 1 1 0 0 0)"
         id="circle1" />
      <g
         fill="none"
         id="g2">
        <path
           d="m26.5 21.5-5 5"
           id="path1" />
        <path
           d="m26.5 26.5-5-5"
           id="path2" />
      </g>
    </g>
    <g
       fill="none"
       stroke-linejoin="round"
       stroke-width="2.39994"
       transform="translate(-3.000784 -3.00039)"
       id="g4">
      <path
         d="m17.556085 14.444496-2.828359-2.828359-6.5052241 6.505224 2.8283571 2.828359-6.0501051 6.050106"
         stroke="#00aad4"
         id="path3" />
      <path
         d="m14.444891 17.555691 2.828357 2.828357 6.505224-6.505224-2.828357-2.828359 6.050105-6.0501049"
         stroke="#00c1f0"
         id="path4" />
    </g>
  </g>
</svg>
