<svg width="32" height="32" version="1.1" xmlns="http://www.w3.org/2000/svg">
 <path d="m6 16 6 6 14-14" fill="none" stroke="#36cd36" stroke-linecap="round" stroke-linejoin="round" stroke-width="4"/>
</svg>
