<?xml version="1.0" encoding="UTF-8" standalone="no"?>
<svg
   width="48"
   height="48"
   version="1.1"
   viewBox="0 0 48 48"
   id="svg9"
   sodipodi:docname="topendialog_200.svg"
   inkscape:export-filename="topendialog_200.png"
   inkscape:export-xdpi="96"
   inkscape:export-ydpi="96"
   inkscape:version="1.3.2 (091e20e, 2023-11-25, custom)"
   xmlns:inkscape="http://www.inkscape.org/namespaces/inkscape"
   xmlns:sodipodi="http://sodipodi.sourceforge.net/DTD/sodipodi-0.dtd"
   xmlns="http://www.w3.org/2000/svg"
   xmlns:svg="http://www.w3.org/2000/svg">
  <sodipodi:namedview
     id="namedview9"
     pagecolor="#ffffff"
     bordercolor="#000000"
     borderopacity="0.25"
     inkscape:showpageshadow="2"
     inkscape:pageopacity="0.0"
     inkscape:pagecheckerboard="0"
     inkscape:deskcolor="#d1d1d1"
     showgrid="true"
     inkscape:current-layer="svg9">
    <inkscape:grid
       id="grid9"
       units="px"
       originx="0"
       originy="0"
       spacingx="0.5"
       spacingy="0.5"
       empcolor="#0099e5"
       empopacity="0.30196078"
       color="#0099e5"
       opacity="0.14901961"
       empspacing="2"
       dotted="false"
       gridanglex="30"
       gridanglez="30"
       visible="true" />
  </sodipodi:namedview>
  <defs
     id="defs4">
    <linearGradient
       id="a"
       x1="-27.785778"
       x2="-9.214345"
       y1="1036.5765"
       y2="1045.1479"
       gradientTransform="matrix(1.3999996,0,0,1.4,47.900077,-1424.2071)"
       gradientUnits="userSpaceOnUse">
      <stop
         stop-color="#ffe496"
         offset="0"
         id="stop1" />
      <stop
         stop-color="#ffcc40"
         offset="1"
         id="stop2" />
    </linearGradient>
    <linearGradient
       id="b"
       x1="-28.500042"
       x2="-21.000042"
       y1="1030.8622"
       y2="1034.3622"
       gradientTransform="matrix(2,0,0,2,66.000084,-2042.7244)"
       gradientUnits="userSpaceOnUse">
      <stop
         stop-color="#fdbd17"
         offset="0"
         id="stop3" />
      <stop
         stop-color="#e3a726"
         offset="1"
         id="stop4" />
    </linearGradient>
    <linearGradient
       id="b-5"
       x1="-28.250021"
       x2="-15.500021"
       y1="1031.1122"
       y2="1033.3622"
       gradientTransform="matrix(2,0,0,2,66.000083,-2042.7244)"
       gradientUnits="userSpaceOnUse">
      <stop
         stop-color="#fdbd17"
         offset="0"
         id="stop3-8" />
      <stop
         stop-color="#e3a726"
         offset="1"
         id="stop4-1" />
    </linearGradient>
    <linearGradient
       id="a-9"
       x1="-27.590912"
       x2="-9.40909"
       y1="1036.6687"
       y2="1045.0558"
       gradientTransform="matrix(1.3749997,0,0,1.5499999,47.437539,-1581.3364)"
       gradientUnits="userSpaceOnUse">
      <stop
         stop-color="#ffe496"
         offset="0"
         id="stop1-6" />
      <stop
         stop-color="#ffcc40"
         offset="1"
         id="stop2-3" />
    </linearGradient>
  </defs>
  <rect
     x="2.5"
     y="8.5"
     width="43"
     height="37"
     fill="#f9f9f9"
     stroke="#2a7efe"
     style="paint-order:normal"
     id="rect1" />
  <path
     d="m 5,2 h 38 c 1.8,0 3,1.2 3,3 V 8 H 2 V 5 C 2,3.2 3.2,2 5,2 Z"
     fill="#2a7efe"
     id="path1" />
  <path
     d="M 8.0001435,27 8,20.0004 c -4.62e-5,-1.1047 0.8954295,-2.0002 2.000084,-2.0002 l 8,-2e-4 c 1.104598,0 2.000077,0.8954 2.000132,2 l 6.6e-5,0.9998 13.999803,2e-4 c 1.104563,1.4e-5 1.999986,0.895436 2,2 l -4.2e-5,4 z"
     fill="url(#b)"
     stroke-width="2"
     id="path5"
     style="fill:url(#b-5)"
     sodipodi:nodetypes="cccccccccc" />
  <path
     d="m 24.5,14.5 h 15 v 21 h -15 z"
     fill="#ffffff"
     fill-rule="evenodd"
     stroke="#b3b3b3"
     id="path6" />
  <path
     d="M 34.440518,24.25 H 9.5595655 a 1.3095238,1.4090908 0 0 0 -1.309524,1.40906 v 12.681878 a 1.3095238,1.4090908 0 0 0 1.309524,1.409061 H 34.440518 a 1.3095238,1.4090908 0 0 0 1.309525,-1.409061 V 25.65906 A 1.3095238,1.4090908 0 0 0 34.440518,24.25 Z"
     fill="url(#a)"
     stroke-width="1.30268"
     id="path6-3"
     style="fill:url(#a-9);stroke:#edb020;stroke-width:0.5;stroke-dasharray:none;stroke-opacity:1" />
  <path
     d="m 28,18.25 h 8"
     fill="none"
     stroke="#b3b3b3"
     stroke-width="1.5"
     id="path8" />
  <path
     d="m 28,21.25 h 8"
     fill="none"
     stroke="#b3b3b3"
     stroke-width="1.5"
     id="path9" />
</svg>
