<?xml version="1.0" encoding="UTF-8" standalone="no"?>
<svg
   height="48"
   width="48"
   version="1.1"
   id="svg735"
   sodipodi:docname="Grid_09_48.svg"
   inkscape:export-filename="Grid_09_48.png"
   inkscape:export-xdpi="96"
   inkscape:export-ydpi="96"
   inkscape:version="1.2-beta (1b65182ce9, 2022-04-05)"
   xmlns:inkscape="http://www.inkscape.org/namespaces/inkscape"
   xmlns:sodipodi="http://sodipodi.sourceforge.net/DTD/sodipodi-0.dtd"
   xmlns="http://www.w3.org/2000/svg"
   xmlns:svg="http://www.w3.org/2000/svg">
  <defs
     id="defs739" />
  <sodipodi:namedview
     id="namedview737"
     pagecolor="#ffffff"
     bordercolor="#666666"
     borderopacity="1.0"
     inkscape:pageshadow="2"
     inkscape:pageopacity="0.0"
     inkscape:pagecheckerboard="0"
     inkscape:deskcolor="#d1d1d1"
     showgrid="true"
     inkscape:zoom="19.125"
     inkscape:cx="24"
     inkscape:cy="24"
     inkscape:current-layer="svg735">
    <inkscape:grid
       type="xygrid"
       id="grid1209" />
  </sodipodi:namedview>
  <linearGradient
     id="a"
     gradientTransform="matrix(0 -1.5 -1.5 0 24 24)"
     gradientUnits="userSpaceOnUse"
     x1="9"
     x2="6"
     y1="10"
     y2="10.5">
    <stop
       offset="0"
       stop-color="#72cef6"
       id="stop688" />
    <stop
       offset="1"
       stop-color="#d2f5f8"
       id="stop690" />
  </linearGradient>
  <linearGradient
     id="b"
     gradientTransform="matrix(0 -1.5 -1.5 0 24 24)"
     gradientUnits="userSpaceOnUse"
     x1="10"
     x2="5"
     y1="12.5"
     y2="12.5">
    <stop
       offset="0"
       stop-color="#4674a8"
       id="stop693" />
    <stop
       offset="1"
       stop-color="#42a0ce"
       id="stop695" />
  </linearGradient>
  <linearGradient
     id="c"
     gradientUnits="userSpaceOnUse"
     x1="-8.75"
     x2="-13.75"
     y1="-1.75"
     y2="-6.75">
    <stop
       offset="0"
       stop-color="#a00"
       id="stop698" />
    <stop
       offset="1"
       stop-color="#f55"
       id="stop700" />
  </linearGradient>
  <path
     d="m-35.489361 12.510639h22.978724v22.978724h-22.978724z"
     style="fill:#fff;stroke:#999;stroke-width:1.02128;stroke-linecap:round;stroke-linejoin:round;stroke-dashoffset:1.49998"
     transform="matrix(-2 0 0 2 -23.999995 -23.999998)"
     id="path703" />
  <g
     fill="none"
     stroke="#b3b3b3"
     transform="matrix(-2 0 0 -2 48.000005 48.000002)"
     id="g715">
    <path
       d="m1 18.5h22"
       id="path705" />
    <path
       d="m6.5 23v-22"
       id="path707" />
    <path
       d="m23 5.5h-22"
       id="path709" />
    <path
       d="m18.5 23v-22"
       id="path711" />
    <path
       d="m12.5 23v-22"
       id="path713" />
  </g>
  <g
     stroke-linejoin="round"
     transform="matrix(2 0 0 -2 .000005 48.000002)"
     id="g721">
    <path
       d="m.5-16.5h23v8h-23z"
       fill="none"
       opacity=".5"
       stroke="#fff"
       stroke-dashoffset="1.49998"
       transform="scale(1 -1)"
       id="path717" />
    <path
       d="m23.5 15.5h-23v-6h23z"
       fill="url(#a)"
       stroke="url(#b)"
       stroke-linecap="round"
       id="path719" />
  </g>
  <circle
     cx="-11.25"
     cy="-4.25"
     r="4"
     style="stroke:#800000;stroke-width:.5;stroke-linecap:round;stroke-linejoin:round;stroke-dashoffset:1.49998;fill:url(#c)"
     transform="matrix(3 0 0 3 63.250004 47.250003)"
     id="circle723" />
  <g
     fill="none"
     stroke="#fff"
     id="g733">
    <g
       stroke-linecap="round"
       transform="matrix(2.12132034 2.12132034 -2.12132034 2.12132034 62.380469 19.650762)"
       id="g729">
      <path
         d="m-4.25 13.25v-4"
         id="path725" />
      <path
         d="m-2.25 11.25h-4"
         id="path727" />
    </g>
    <circle
       cx="-4.25"
       cy="-11.25"
       opacity=".7"
       r="4.5"
       stroke-dashoffset="1.49998"
       stroke-linejoin="round"
       stroke-width=".5"
       transform="matrix(0 3 3 0 63.250004 47.250003)"
       id="circle731" />
  </g>
</svg>
