<svg width="64" height="64" version="1.1" xmlns="http://www.w3.org/2000/svg">
 <g fill="none" stroke-linecap="round">
  <path d="m5 50h18" stroke="#ffffff" stroke-width="10"/>
  <path d="m14 59v-18" stroke="#ffffff" stroke-width="10"/>
  <path d="m5 50h18" stroke="#ff6600" stroke-width="4"/>
  <path d="m14 59v-18" stroke="#ff6600" stroke-width="4"/>
 </g>
</svg>
