<?xml version="1.0" encoding="UTF-8" standalone="no"?>
<svg
   height="32"
   width="32"
   version="1.1"
   id="svg155"
   sodipodi:docname="menu_search_next_error_200.svg"
   inkscape:export-filename="menu_search_next_error_200.png"
   inkscape:export-xdpi="96"
   inkscape:export-ydpi="96"
   inkscape:version="1.2.2 (732a01da63, 2022-12-09)"
   xmlns:inkscape="http://www.inkscape.org/namespaces/inkscape"
   xmlns:sodipodi="http://sodipodi.sourceforge.net/DTD/sodipodi-0.dtd"
   xmlns="http://www.w3.org/2000/svg"
   xmlns:svg="http://www.w3.org/2000/svg">
  <defs
     id="defs159" />
  <sodipodi:namedview
     id="namedview157"
     pagecolor="#ffffff"
     bordercolor="#666666"
     borderopacity="1.0"
     inkscape:showpageshadow="2"
     inkscape:pageopacity="0.0"
     inkscape:pagecheckerboard="0"
     inkscape:deskcolor="#d1d1d1"
     showgrid="true"
     inkscape:zoom="28.6875"
     inkscape:cx="16"
     inkscape:cy="16"
     inkscape:current-layer="svg155">
    <inkscape:grid
       type="xygrid"
       id="grid388" />
  </sodipodi:namedview>
  <circle
     cx="22"
     cy="15.5"
     fill="#f00"
     fill-rule="evenodd"
     r="10"
     id="circle143" />
  <path
     d="M 14,15.5 H 30"
     stroke="#ffffff"
     stroke-width="3"
     id="path145"
     style="fill:none" />
  <path
     d="m 1.5,23.50009 4,5 4,-5"
     stroke-linejoin="round"
     id="path147"
     style="fill:none;stroke:#00d400;stroke-width:3;stroke-linecap:round" />
  <path
     d="M 5.5,27.70009 V 7.5"
     id="path149"
     style="fill:none;stroke:#00d400;stroke-width:3;stroke-linecap:round" />
</svg>
