<?xml version="1.0" encoding="UTF-8" standalone="no"?>
<svg
   height="16"
   width="16"
   version="1.1"
   id="svg8"
   sodipodi:docname="laz_open.svg"
   inkscape:export-filename="laz_open.png"
   inkscape:export-xdpi="96"
   inkscape:export-ydpi="96"
   inkscape:version="1.2.2 (732a01da63, 2022-12-09)"
   xml:space="preserve"
   xmlns:inkscape="http://www.inkscape.org/namespaces/inkscape"
   xmlns:sodipodi="http://sodipodi.sourceforge.net/DTD/sodipodi-0.dtd"
   xmlns:xlink="http://www.w3.org/1999/xlink"
   xmlns="http://www.w3.org/2000/svg"
   xmlns:svg="http://www.w3.org/2000/svg"><defs
     id="defs12"><linearGradient
       inkscape:collect="always"
       id="linearGradient885"><stop
         style="stop-color:#f4e1a6;stop-opacity:1;"
         offset="0"
         id="stop883" /><stop
         style="stop-color:#f4c731;stop-opacity:1;"
         offset="1"
         id="stop881" /></linearGradient><linearGradient
       inkscape:collect="always"
       xlink:href="#linearGradient885"
       id="linearGradient887"
       x1="7"
       y1="8"
       x2="8"
       y2="13"
       gradientUnits="userSpaceOnUse" /></defs><sodipodi:namedview
     id="namedview10"
     pagecolor="#ffffff"
     bordercolor="#666666"
     borderopacity="1.0"
     inkscape:showpageshadow="2"
     inkscape:pageopacity="0.0"
     inkscape:pagecheckerboard="0"
     inkscape:deskcolor="#d1d1d1"
     showgrid="true"
     inkscape:zoom="57.375"
     inkscape:cx="8"
     inkscape:cy="8"
     inkscape:current-layer="svg8"><inkscape:grid
       type="xygrid"
       id="grid501" /></sodipodi:namedview><path
     d="m 0.5,13.5 -1e-7,-10 c -10e-9,-0.5 0.5,-1 1.0000002,-1 h 3 c 0.5,0 1,0.5 1,1 H 13.5 v 3"
     fill="#fff3cc"
     id="path2"
     sodipodi:nodetypes="csssccc"
     style="stroke:#d4aa00;stroke-linecap:round;stroke-linejoin:round" /><path
     d="m 15.5,6.5 h -13 l -2,7 h 13 z"
     fill="#f4c025"
     id="path4"
     sodipodi:nodetypes="ccccc"
     style="stroke:#d4aa00;stroke-linecap:round;stroke-linejoin:round;fill-opacity:1;fill:url(#linearGradient887)" /></svg>
