<svg width="32" height="32" version="1.0" xmlns="http://www.w3.org/2000/svg" xmlns:xlink="http://www.w3.org/1999/xlink">
 <defs>
  <linearGradient id="f" x1="11" x2="21" y1="25.75" y2="25.75" gradientTransform="matrix(.625 0 0 .625 -2.996317 5)" gradientUnits="userSpaceOnUse" xlink:href="#b"/>
  <linearGradient id="b" x1="11" x2="21" y1="25.75" y2="25.75" gradientTransform="matrix(.3125 0 0 .3125 -19.1875 -2)" gradientUnits="userSpaceOnUse">
   <stop stop-color="#999999" offset="0"/>
   <stop stop-color="#ffffff" offset=".4"/>
   <stop stop-color="#999999" offset="1"/>
  </linearGradient>
  <radialGradient id="c" cx="8.25" cy="3.675" r="4.5" gradientTransform="matrix(-1.3888888,1.3888889,-1.3888888,-1.3888888,22.941183,3.645832)" gradientUnits="userSpaceOnUse" xlink:href="#a"/>
  <radialGradient id="a" cx="8.25" cy="3.675" r="4.5" gradientTransform="matrix(-.69444438 .69444444 -.69444438 -.69444438 -6.21875 -2.6770836)" gradientUnits="userSpaceOnUse">
   <stop stop-color="#ffffff" offset="0"/>
   <stop stop-color="#ffffff" offset=".2"/>
   <stop stop-color="#ffcc00" offset="1"/>
  </radialGradient>
  <linearGradient id="g" x1="11" x2="21" y1="25.75" y2="25.75" gradientTransform="matrix(.625 0 0 .625 6.996319 11)" gradientUnits="userSpaceOnUse" xlink:href="#b"/>
  <radialGradient id="d" cx="8.25" cy="3.675" r="4.5" gradientTransform="matrix(-1.3888888,1.3888889,-1.3888888,-1.3888888,32.933817,9.645832)" gradientUnits="userSpaceOnUse" xlink:href="#a"/>
  <radialGradient id="e" cx="8.25" cy="3.675" r="4.5" gradientTransform="matrix(-1.3888888 1.3888889 -1.3888888 -1.3888888 40.933817 -.3541672)" gradientUnits="userSpaceOnUse" xlink:href="#a"/>
  <linearGradient id="h" x1="11" x2="21" y1="25.75" y2="25.75" gradientTransform="matrix(.625 0 0 .625 14.996319 1)" gradientUnits="userSpaceOnUse" xlink:href="#b"/>
 </defs>
 <path d="m24.996317 1.3125c-2.93401 2e-7 -5.3125 2.37849-5.3125 5.3125 0 1.76277 0.374976 2.455008 1.081542 3.630186 1.41314 2.350364 1.418458 1.682128 1.418458 4.18213h5.625c0-2.500002 0.02242-1.83177 1.43555-4.18213 0.706558-1.17518 1.06445-1.867416 1.06445-3.630186 0-2.93401-2.37849-5.3124998-5.3125-5.3125z" fill="url(#e)" fill-rule="evenodd" stroke="#ffcc00" stroke-width=".625px"/>
 <path d="m23.121317 19.4375h3.75l-1.25 1.5625h-1.25z" fill="#333333" fill-rule="evenodd" stroke-width="1.25" style="paint-order:normal"/>
 <path d="m22.183819 14.4375h5.624998v3.75c0 0.690356-0.559644 1.25-1.25 1.25h-3.125c-0.690356 0-1.249998-0.559644-1.249998-1.25z" fill="url(#h)" stroke="#999999" stroke-width=".625"/>
 <path d="m16.996317 11.3125c-2.934008 0-5.312498 2.37849-5.312498 5.3125 0 1.76277 0.374976 2.455008 1.08154 3.630186 1.413142 2.350364 1.41846 1.682128 1.41846 4.182128h5.624998c0-2.5 0.02242-1.831768 1.43555-4.182128 0.706558-1.17518 1.06445-1.867416 1.06445-3.630186 0-2.93401-2.37849-5.3125-5.3125-5.3125z" fill="url(#d)" fill-rule="evenodd" stroke="#ffcc00" stroke-width=".625px"/>
 <path d="m15.121319 29.4375h3.749998l-1.25 1.5625h-1.25z" fill="#333333" fill-rule="evenodd" stroke-width="1.25" style="paint-order:normal"/>
 <path d="m14.183819 24.4375h5.624998v3.75c0 0.690356-0.559644 1.25-1.25 1.25h-3.125c-0.690356 0-1.249998-0.559644-1.249998-1.25z" fill="url(#g)" stroke="#999999" stroke-width=".625"/>
 <path d="m7.003683 5.3125c-2.93401 0-5.3125 2.37849-5.3125 5.3125 0 1.76277 0.374976 2.455008 1.081542 3.630186 1.41314 2.350364 1.418458 1.682128 1.418458 4.18213h5.625c0-2.500002 0.02242-1.83177 1.435548-4.18213 0.70656-1.17518 1.064452-1.867416 1.064452-3.630186 0-2.93401-2.37849-5.3125-5.3125-5.3125z" fill="url(#c)" fill-rule="evenodd" stroke="#ffcc00" stroke-width=".625px"/>
 <path d="m5.128683 23.4375h3.75l-1.25 1.5625h-1.25z" fill="#333333" fill-rule="evenodd" stroke-width="1.25" style="paint-order:normal"/>
 <path d="m4.191183 18.4375h5.625v3.75c0 0.690356-0.559644 1.25-1.25 1.25h-3.125c-0.690356 0-1.25-0.559644-1.25-1.25z" fill="url(#f)" stroke="#999999" stroke-width=".625"/>
</svg>
