<svg width="24" height="24" version="1.1" xmlns="http://www.w3.org/2000/svg">
 <rect x="4.375" y="1.375" width="16.25" height="21.25" ry="1.8389423" fill="#ebfcff" stroke="#00aad4" stroke-linejoin="round" stroke-width=".75"/>
</svg>
