<?xml version="1.0" encoding="UTF-8" standalone="no"?>
<svg
   width="48"
   height="48"
   version="1.1"
   viewBox="0 0 48 48"
   id="svg9"
   sodipodi:docname="textjsxmlwebdatainputadaptor_200.svg"
   inkscape:export-filename="textjsxmlwebdatainputadaptor_200.png"
   inkscape:export-xdpi="96"
   inkscape:export-ydpi="96"
   inkscape:version="1.3.2 (091e20e, 2023-11-25, custom)"
   xmlns:inkscape="http://www.inkscape.org/namespaces/inkscape"
   xmlns:sodipodi="http://sodipodi.sourceforge.net/DTD/sodipodi-0.dtd"
   xmlns="http://www.w3.org/2000/svg"
   xmlns:svg="http://www.w3.org/2000/svg">
  <defs
     id="defs9" />
  <sodipodi:namedview
     id="namedview9"
     pagecolor="#ffffff"
     bordercolor="#000000"
     borderopacity="0.25"
     inkscape:showpageshadow="2"
     inkscape:pageopacity="0.0"
     inkscape:pagecheckerboard="0"
     inkscape:deskcolor="#d1d1d1"
     showgrid="true"
     inkscape:current-layer="svg9">
    <inkscape:grid
       id="grid9"
       units="px"
       originx="0"
       originy="0"
       spacingx="0.5"
       spacingy="0.5"
       empcolor="#0099e5"
       empopacity="0.30196078"
       color="#0099e5"
       opacity="0.14901961"
       empspacing="2"
       dotted="false"
       gridanglex="30"
       gridanglez="30"
       visible="true" />
  </sodipodi:namedview>
  <path
     d="m39.5 24.5v-16"
     fill="none"
     stroke="#0097bd"
     stroke-linecap="round"
     stroke-width="3"
     id="path1" />
  <path
     d="m43.5 12.5-4-4-4 4"
     fill="none"
     stroke="#0097bd"
     stroke-linecap="round"
     stroke-linejoin="round"
     stroke-width="3"
     id="path2" />
  <g
     transform="translate(22.999998,-6.5)"
     id="g3">
    <circle
       cx="-5.9999981"
       cy="23.5"
       r="14.5"
       fill="#d5f6ff"
       stroke="#5599ff"
       stroke-dashoffset="1.49998"
       stroke-linecap="square"
       stroke-linejoin="round"
       id="circle2" />
    <path
       d="m-18.583534 24.755149c-0.200744-0.0899-0.14254 0.21234 0 0zm20.825658-3.367488c-0.929862-0.247974-0.05718 0.851294 0 0zm-6.263866-7.131186c0.19526 1.534044 2.215826-0.535546 0.634752-0.238238-0.1983 0.04924-0.600198-0.0703-0.634752 0.238238zm-14.903822 9.508264c0.824878 0.840692 1.111642 2.581448 2.570994 2.507494 0.852182 0.1504 1.378626 1.004268 2.102564 1.443328 1.64531 0.10886-0.906686 2.291672 0.505974 3.092764 0.50677 1.204194 1.98552 1.597382 1.616906 3.177986 0.0257 0.740514 0.310978 2.51848-0.907246 1.45801-3.857794-2.25614-6.500186-6.479812-6.767054-10.948658-0.08336-0.637606 0.0795-2.177724 0.58431-0.846226 0.0341 0.67143 0.78032 1.539504 0.33805 0.396864l-0.04458-0.281616zm27.10767-1.0158c0.11714 2.427766-0.3369 4.879874-1.481062 7.040182-0.639316 1.572168-1.80349 2.865234-2.985784 4.052544-2.658732 2.372426-6.127266 3.937196-9.733152 3.85526-5.518786 0.08074-10.844904-3.467258-13.012934-8.527554-1.585658-3.597414-1.559546-7.837666 0.0851-11.41188 1.507148-3.676118 4.746568-6.445802 8.468818-7.721486 1.525416-0.565044 3.176896-0.591876 4.777418-0.736004 1.974936 0.1774 3.987158 0.487376 5.78315 1.393724 4.607656 2.177972 7.784866 6.979958 8.098436 12.055214zm-1.728-2.117552c-0.66936 0.02764-1.769944 8.8e-4 -2.151406-0.18308-0.06772-1.021026 0.59619-0.89496 1.179326-0.465194-0.087-1.009648 0.728298 0.403682 0.97208 0.648278zm-3.671944-4.970252c0.874782 0.04134 1.086234 0.2766 0.403112 0.805948-0.06298 1.016784-0.965454 0.958214-1.73865 0.896654 0.451768-0.445904 1.083656-1.472834 0.816072-2.318198 0.309504-0.650472 0.891216-1.025628 0.516688-0.04286-0.06944 0.214776-0.04902 0.443824 0.0026 0.658462zm-17.171752-2.268978c1.588638 0.04832-0.0098 2.063284-0.864026 1.080466 0.955602 0.1309 0.817632-1.434572 0.13612-1.019074-0.85492-0.765032 2.722154-1.334482 1.384482-0.59699-0.32286-0.0036-0.495566 0.310036-0.65656 0.535598zm2.159934-1.512708c-0.207816 0.12262-0.354688 0.209276 0 0zm14.47178 9.508266c0.993936-0.67762-1.144338-1.414448-0.26909-1.46623 0.862774 0.17412 1.48887 2.885736 1.673048 0.925942 0.617344 0.437158 0.89972 1.350616 1.94394 1.08052 0.1344 1.876812-1.706894 0.6212-2.55606 0.872648-0.42888 0.651706-1.394896 0.263176-1.913882 0.11204 0.363524-1.220736-1.960276-0.93332-2.658394-0.692054-1.541696-0.03388-1.127086 1.32512-2.171728 2.01922-0.48 1.33865-0.583836 3.33779 0.843362 4.146286 0.926852 0.32578 2.051494-0.302984 2.889248 0.391574 0.434708 0.781518 1.054776 2.003572 1.11095 3.004656-1.056508 1.151172 0.567448 3.189984-0.605076 3.921844-3.418696 1.82707-7.611512 2.203066-11.246198 0.81026 0.666732-1.04352 1.969126-1.64661 2.535332-2.757946 1.212734-0.443796 0.875336-2.07056 1.693718-2.931324-0.46016-1.370014-2.758388-0.980878-2.941952-2.70347-1.16687-0.19704-2.112946-1.492232-3.396388-0.9711-0.660266 0.84434-2.130532 0.292672-1.649562-0.859852-0.93695 0.18382-0.818222-0.464432-0.453074-1.121418-0.672776 0.256658-1.910844 1.169254-1.654176-0.27438-0.353028-1.325512 2.075138-2.063702 2.513234-0.994984 0.412326 1.063892 0.16682-1.189548 0.875838-1.382962 0.718506-0.916062 1.456562-1.27195 2.710392-1.457548 0.837262 0.06072-1.058412-1.710076 0.434472-1.363618 0.613128-0.266258 0.948718-0.499442 0.488276 0.297748-0.213048 0.587978 1.787874 0.498828 0.727692-0.217342-0.625964-0.17312 0.242486-1.435104-0.763212-1.198692 0.17876-0.651872-0.952294-1.53709-0.534442-1.441738-0.738424 0.897804-0.981596-1.461172-1.788142-0.1866-0.14546 0.682336-0.395144 1.524344-1.043928 1.299662 0.0014-1.007628-2.435604-1.031564-0.999194-2.194622 0.297912-1.043404 2.286918-1.135396 1.733108-2.337984-0.568486 0.15586-0.619136 1.262168-1.048798 0.279242-0.269134-1.043986 0.204806-0.898862 0.914898-0.412524 1.207914-0.57573 1.669616 0.99987 0.605724 1.526834-0.318972 0.265852 1.836236 0.947602 1.28303 0.12702 0.86665 0.230452-0.345558-0.976016 0.650208-0.571574 1.088554-0.896472-0.822368-0.521738-0.510242-1.496236-0.917608-0.483224-0.89805-1.473324-1.861734-1.28949 1.190272 0.15228 1.673974-2.313324 2.774832-1.460032-0.96697-0.15732-1.159584 1.37044-0.03942 0.974544 1.226672-0.269564 0.570898 1.343912 1.443322 1.34984-1.068636 0.325958 1.099504 1.499028 0.48619 2.201618-0.0388 1.02454 1.677242 2.287074 1.67996 0.622364 0.354428-1.078832 0.939014-2.01302 1.842058-2.471174 0.221716-0.890752 0.455552-1.788332 0.413878-2.727436 0.227692-0.985894 2.020318 0.208858 2.831724 0.373848 0.9548 0.55059 3.33577 1.182938 3.064244 2.22726-0.677138 0.851422-1.729376 1.79756-2.054244 2.613452 0.03716 0.78358 0.405206 0.927724 1.01915 0.602632 0.06842 0.427066 0.18646 1.842048-0.11646 0.682458-0.10436-0.822244-0.493144 0.50312-0.202512 0.845266-0.761294-6e-3 -1.655886 0.07288-1.961098 0.461752 0.968764 0.855814 0.17914 1.279904-0.788652 1.108006-0.736836 1.317982 1.113838 2.396226 1.594558 0.843526 0.87757-1.436712 2.066052-0.05402 2.451266 1.260276z"
       clip-rule="evenodd"
       fill="#0066ff"
       fill-rule="evenodd"
       image-rendering="optimizeQuality"
       shape-rendering="geometricPrecision"
       stroke-width="2"
       id="path3" />
  </g>
  <text
     x="-38.500004"
     y="64.999954"
     stroke-width="2"
     id="text3"><tspan
       x="-38.500004"
       y="94.156204"
       stroke-width="2"
       id="tspan3" /></text>
  <path
     d="m2 29h44v17h-44z"
     fill="#fff"
     stroke="#b3b3b3"
     stroke-dashoffset="1.49998"
     stroke-linecap="square"
     stroke-linejoin="round"
     stroke-width="1.99999"
     id="path4" />
  <g
     fill="#f00"
     id="g9">
    <path
       d="m8.2848074 33h1.7151926v5.708436c0 .746642-.06116 1.321232-.1853309 1.72384-.1656265.524253-.4653083.945854-.900934 1.264566-.4337609.316736-1.0074732.476054-1.721139.476054-.8358311 0-1.4785867-.247484-1.9280507-.744508-.4514741-.497103-.6782483-1.226891-.6821183-2.187311l1.620546-.201331c.019614.513877.088708.876678.210941 1.088392.1833249.322983.4612905.48444.8359016.48444.3765483 0 .6446929-.115325.800418-.348079.1557109-.230704.2345891-.710952.2345891-1.440743z"
       clip-rule="evenodd"
       image-rendering="optimizeQuality"
       shape-rendering="geometricPrecision"
       stroke="#000"
       stroke-width=".003143"
       id="path5" />
    <path
       d="m11.358801 39.112668 1.500735-.17731c.09045.597347.271401 1.034261.546351 1.314971.275013.280712.645763.420026 1.112314.420026.493126 0 .86568-.124511 1.115728-.373587.250112-.249083.376104-.540311.376104-.873828 0-.215303-.05316-.396849-.157871-.548757-.104645-.149842-.289207-.280709-.551706-.390474-.179222-.07599-.587186-.206862-1.225788-.396847-.821298-.244787-1.397838-.544609-1.729558-.901231-.466549-.500318-.698984-1.110253-.698984-1.830025 0-.46217.110009-.89709.32817-1.300151.219974-.403143.535772-.709182.949033-.920274.413389-.211003.910065-.316633 1.495381-.316633.952644 0 1.671047.251159 2.151854.755623.482483.504464.7344 1.175649.759173 2.017855l-1.543314.06325c-.06559-.468538-.205733-.804129-.420423-1.008925-.214631-.204802-.537513-.30819-.966772-.30819-.443519 0-.791237.109756-1.041284.329299-.161471.141399-.243016.329221-.243016.565638 0 .215236.07625.398921.228822.550904.193349.196271.663439.398921 1.410225.610009.746855.208945 1.298495.428472 1.655052.652228.358361.225826.638665.531865.840844.922414.202247.390479.303336.871758.303336 1.443774 0 .519201-.120651 1.006776-.363655 1.460579-.243015.453801-.585378.791544-1.028831 1.011075-.443519.221684-.996966.331371-1.658663.331371-.963159 0-1.702913-.263822-2.219137-.793692-.516224-.527645-.823105-1.298079-.92426-2.309157z"
       clip-rule="evenodd"
       image-rendering="optimizeQuality"
       shape-rendering="geometricPrecision"
       stroke="#000"
       stroke-width=".003096"
       id="path6" />
    <path
       d="m26.751542 42.000001h-1.931295l-1.24551-2.930958q-.07059-.16319-.14623-.602512h-.02017q-.03531.207113-.166404.627614l-1.250551 2.905856h-1.941382l2.304445-4.499997-2.107786-4.5h1.981722l1.033723 2.698743q.121029.320082.216829.759415h.02018q.0605-.263598.226915-.784518l1.149696-2.67364h1.815316l-2.168293 4.462342z"
       stroke-width="1.07113"
       id="path7" />
    <path
       d="m36.999894 42h-1.764596v-5.384937q0-.872385.06629-1.926778h-.04425q-.138297.82845-.248933 1.192469l-1.858636 6.119246h-1.460295l-1.89183-6.056485q-.07746-.244771-.248923-1.25523h-.04978q.07193 1.330543.07193 2.334728v4.976987h-1.609652v-8.999999h2.616481l1.620766 5.334727q.193587.640167.28212 1.28661h.03321q.14932-.746863.315305-1.299161l1.620806-5.322176h2.550093z"
       stroke-width="1.00344"
       id="path8" />
    <path
       d="m43.306336 42h-4.306336v-9h1.628744v7.355649h2.677592z"
       stroke-width="1.07113"
       id="path9" />
  </g>
</svg>
