<?xml version="1.0" encoding="UTF-8" standalone="no"?>
<svg
   height="36"
   viewBox="0 0 9.5249997 9.5250005"
   width="36"
   version="1.1"
   id="svg500"
   sodipodi:docname="Health_07_36.svg"
   inkscape:version="1.2.1 (9c6d41e410, 2022-07-14)"
   inkscape:export-filename="Health_07_36.png"
   inkscape:export-xdpi="96"
   inkscape:export-ydpi="96"
   xmlns:inkscape="http://www.inkscape.org/namespaces/inkscape"
   xmlns:sodipodi="http://sodipodi.sourceforge.net/DTD/sodipodi-0.dtd"
   xmlns="http://www.w3.org/2000/svg"
   xmlns:svg="http://www.w3.org/2000/svg">
  <defs
     id="defs504">
    <linearGradient
       id="a"
       gradientUnits="userSpaceOnUse"
       x1="22.361082"
       x2="22.361082"
       y1="10"
       y2="23.632265">
      <stop
         offset="0"
         stop-color="#f9f9f9"
         id="stop2" />
      <stop
         offset="1"
         stop-color="#4d4d4d"
         id="stop4" />
    </linearGradient>
    <radialGradient
       id="b"
       cx="255.82098"
       cy="47.135281"
       gradientTransform="matrix(-0.17354495,0.12638092,-0.14833423,-0.23030364,59.076216,-1.823996)"
       gradientUnits="userSpaceOnUse"
       r="37.290001">
      <stop
         offset="0"
         stop-color="#fff"
         id="stop7" />
      <stop
         offset="1"
         stop-color="#b3b3b3"
         id="stop9" />
    </radialGradient>
    <radialGradient
       id="c"
       cx="237.76395"
       cy="70.045906"
       gradientTransform="matrix(-0.24345746,0.20338717,-0.23009377,-0.36968367,81.397307,-4.599836)"
       gradientUnits="userSpaceOnUse"
       r="37.483974">
      <stop
         offset="0"
         stop-color="#fff"
         id="stop12" />
      <stop
         offset="1"
         stop-color="#ccc"
         id="stop14" />
    </radialGradient>
  </defs>
  <sodipodi:namedview
     id="namedview502"
     pagecolor="#ffffff"
     bordercolor="#666666"
     borderopacity="1.0"
     inkscape:showpageshadow="2"
     inkscape:pageopacity="0.0"
     inkscape:pagecheckerboard="0"
     inkscape:deskcolor="#d1d1d1"
     showgrid="true"
     inkscape:zoom="25.5"
     inkscape:cx="18"
     inkscape:cy="18"
     inkscape:current-layer="svg500">
    <inkscape:grid
       type="xygrid"
       id="grid1268" />
  </sodipodi:namedview>
  <g
     transform="matrix(0.59345509,0,0,0.59531132,-5.4622809,-5.3577845)"
     id="g47">
    <path
       d="m 17.54112,10.000044 a 6.7498082,5.7527049 70.446443 0 0 -1.476621,0.221111 l -3.12e-4,-0.0013 -0.01557,0.0049 -1.786606,0.560414 0.122161,0.340219 4.37184,12.164187 0.123077,0.342662 1.704452,-0.700899 -3.12e-4,-3.12e-4 a 6.7498082,5.7527049 70.446443 0 0 0.321284,-0.143234 6.7498082,5.7527049 70.446443 0 0 2.397105,-8.679543 6.7498082,5.7527049 70.446443 0 0 -5.760504,-4.1082762 z"
       fill="url(#a)"
       stroke-dashoffset="1.49998"
       stroke-linecap="round"
       stroke-linejoin="round"
       stroke-width="0.462462"
       id="path39"
       style="fill:url(#a)" />
    <ellipse
       cx="7.8529902"
       cy="22.749216"
       rx="5.6345201"
       ry="6.590611"
       style="fill:url(#b);stroke:url(#c);stroke-width:0.45341;stroke-linecap:round;stroke-linejoin:round;stroke-dashoffset:1.49998"
       transform="matrix(0.89787723,-0.44024594,0.41203644,0.91116737,0,0)"
       id="ellipse41" />
    <path
       d="m 11.550806,20.37371 c 2.375474,-3.977525 5.744875,-5.94027 9.740528,-6.190147"
       fill="#808080"
       id="path43" />
    <path
       d="m 11.550806,20.37371 c 4.395676,-0.131049 7.564892,-2.55435 9.740528,-6.190147"
       fill="#f9f9f9"
       id="path45" />
  </g>
</svg>
