<?xml version="1.0" encoding="UTF-8" standalone="no"?>
<svg
   height="64"
   width="64"
   version="1.1"
   id="svg8"
   sodipodi:docname="Folder_18_64.svg"
   inkscape:export-filename="Folder_18_64.png"
   inkscape:export-xdpi="96"
   inkscape:export-ydpi="96"
   inkscape:version="1.2.2 (732a01da63, 2022-12-09)"
   xmlns:inkscape="http://www.inkscape.org/namespaces/inkscape"
   xmlns:sodipodi="http://sodipodi.sourceforge.net/DTD/sodipodi-0.dtd"
   xmlns="http://www.w3.org/2000/svg"
   xmlns:svg="http://www.w3.org/2000/svg">
  <defs
     id="defs12" />
  <sodipodi:namedview
     id="namedview10"
     pagecolor="#ffffff"
     bordercolor="#000000"
     borderopacity="0.25"
     inkscape:showpageshadow="2"
     inkscape:pageopacity="0.0"
     inkscape:pagecheckerboard="0"
     inkscape:deskcolor="#d1d1d1"
     showgrid="true"
     inkscape:zoom="14.21875"
     inkscape:cx="31.964835"
     inkscape:cy="32"
     inkscape:current-layer="svg8">
    <inkscape:grid
       type="xygrid"
       id="grid931" />
  </sodipodi:namedview>
  <g
     stroke="#00aad4"
     stroke-linejoin="round"
     stroke-width="2.9"
     transform="translate(0,2)"
     id="g6">
    <path
       d="m 6.023,1.45 c -2.256622,0 -4.5729995,2.674416 -4.5729995,5 V 27.999871 H 62.549999 V 10.648906 C 62.549999,8.3233225 60.733289,6.45 58.476666,6.45 H 24.789667 c 0,-2.325584 -2.317043,-5 -4.573667,-5 z"
       fill="#ebfcff"
       id="path2"
       sodipodi:nodetypes="ssccsscss" />
    <path
       d="M 5.5233335,20.45 H 21.490334 c 0,-2.653344 2.092098,-5.043565 4.573666,-5.043565 h 32.412666 c 2.256627,0 4.073333,1.872224 4.073333,4.197812 V 49.35 c 0,2.325587 -1.816706,4.2 -4.073333,4.2 H 5.5233335 c -2.256626,0 -4.073333,-1.874413 -4.073333,-4.2 v -24.8 c 0,-2.325588 1.816707,-4.1 4.073333,-4.1 z"
       fill="#c2f3ff"
       id="path4"
       sodipodi:nodetypes="scsssssssss" />
  </g>
  <g
     id="g989"
     style="stroke-width:0.939024"
     transform="matrix(1.0649351,0,0,1.0649351,-4.0519505,-4.0519509)">
    <circle
       cx="47"
       cy="47"
       r="15.4"
       stroke-dashoffset="1.49998"
       stroke-linejoin="round"
       id="circle794-0"
       style="fill:#ffffff;stroke:#00aad4;stroke-width:3.00488;stroke-linecap:round;stroke-dasharray:none" />
    <path
       d="m 40.5,40.5 13,13"
       id="path796"
       style="fill:none;stroke:#00aad4;stroke-width:3.00488;stroke-linecap:round;stroke-dasharray:none"
       sodipodi:nodetypes="cc" />
    <path
       d="m 53.5,40.5 -13,13"
       id="path798"
       style="fill:none;stroke:#00aad4;stroke-width:3.00488;stroke-linecap:round;stroke-dasharray:none"
       sodipodi:nodetypes="cc" />
  </g>
</svg>
