<?xml version="1.0" encoding="UTF-8" standalone="no"?>
<svg
   width="36"
   height="36"
   version="1.1"
   viewBox="0 0 36 36"
   id="svg13"
   sodipodi:docname="tidedialoglayoutstorage_150.svg"
   inkscape:export-filename="tidedialoglayoutstorage_150.png"
   inkscape:export-xdpi="96"
   inkscape:export-ydpi="96"
   inkscape:version="1.3.2 (091e20e, 2023-11-25, custom)"
   xmlns:inkscape="http://www.inkscape.org/namespaces/inkscape"
   xmlns:sodipodi="http://sodipodi.sourceforge.net/DTD/sodipodi-0.dtd"
   xmlns:xlink="http://www.w3.org/1999/xlink"
   xmlns="http://www.w3.org/2000/svg"
   xmlns:svg="http://www.w3.org/2000/svg">
  <sodipodi:namedview
     id="namedview13"
     pagecolor="#ffffff"
     bordercolor="#000000"
     borderopacity="0.25"
     inkscape:showpageshadow="2"
     inkscape:pageopacity="0.0"
     inkscape:pagecheckerboard="0"
     inkscape:deskcolor="#d1d1d1"
     showgrid="true"
     inkscape:current-layer="svg13">
    <inkscape:grid
       id="grid13"
       units="px"
       originx="0"
       originy="0"
       spacingx="0.5"
       spacingy="0.5"
       empcolor="#0099e5"
       empopacity="0.30196078"
       color="#0099e5"
       opacity="0.14901961"
       empspacing="2"
       dotted="false"
       gridanglex="30"
       gridanglez="30"
       visible="true" />
  </sodipodi:namedview>
  <defs
     id="defs2">
    <linearGradient
       id="c"
       x1="11"
       x2="11"
       y1="1030.3622"
       y2="1033.3622"
       gradientTransform="matrix(1.3181818,0,0,1.3149211,6.5909097,-1346.5404)"
       gradientUnits="userSpaceOnUse"
       xlink:href="#a" />
    <linearGradient
       id="a">
      <stop
         stop-color="#c1d3f1"
         offset="0"
         id="stop1" />
      <stop
         stop-color="#eaf2fa"
         offset="1"
         id="stop2" />
    </linearGradient>
    <linearGradient
       id="b"
       x1="11.5"
       x2="11.5"
       y1="1039.8622"
       y2="1033.8622"
       gradientTransform="matrix(1.3181818,0,0,1.0384604,6.5909097,-1060.4903)"
       gradientUnits="userSpaceOnUse"
       xlink:href="#a" />
  </defs>
  <rect
     x="2.9999981"
     y="20.999983"
     width="30.000004"
     height="14.000017"
     ry="2.0000172"
     fill="#739bdf"
     fill-rule="evenodd"
     style="paint-order:normal"
     id="rect2" />
  <path
     d="M 25.549998,24.5499 V 31.45 h 3.888467"
     fill="none"
     stroke="#ffffff"
     stroke-linecap="round"
     stroke-linejoin="round"
     stroke-width="1.1"
     id="path2" />
  <path
     d="m 15.699998,31.45 v -6.9001 l 3.276083,5.6115 3.27608,-5.6115 V 31.45"
     fill="none"
     stroke="#ffffff"
     stroke-linecap="round"
     stroke-linejoin="round"
     stroke-width="1.1"
     id="path3" />
  <path
     d="m 12.609698,24.5499 -4.2193999,6.9002 m 0,-6.9002 4.2193999,6.9002"
     fill="none"
     stroke="#ffffff"
     stroke-linecap="round"
     stroke-linejoin="round"
     stroke-width="1.1"
     id="path4" />
  <rect
     x="3.5"
     y="4.4999828"
     width="19"
     height="13"
     fill="#f9f9f9"
     stroke="#2a7efe"
     style="paint-order:normal"
     id="rect4" />
  <path
     d="m 4.5,2 h 17.000002 c 0.75,0 1.500001,0.6717 1.5,1.5 L 23,5 H 3 V 3.5 C 3,2.75 3.75,2 4.5,2 Z"
     fill="#2a7efe"
     stroke-width="1.05"
     id="path5" />
  <path
     d="m 29.5,8.5 3,4 h -21 l 3,-4 z"
     fill="url(#c)"
     fill-rule="evenodd"
     stroke="#2a7efe"
     stroke-linejoin="round"
     id="path6"
     style="fill:url(#c)" />
  <path
     d="m 11.5,19.5 h 21 v -7 h -21 z"
     fill="url(#b)"
     fill-rule="evenodd"
     stroke="#2a7efe"
     stroke-linejoin="round"
     id="path7"
     style="fill:url(#b)" />
  <path
     d="m 14.5,14 v 4"
     fill="#c1d3f1"
     stroke="#2a7efe"
     stroke-linejoin="round"
     id="path8" />
  <path
     d="m 29.5,14 v 4"
     fill="#c1d3f1"
     stroke="#2a7efe"
     stroke-linejoin="round"
     id="path9" />
  <path
     d="m 26.5,14 v 4"
     fill="#c1d3f1"
     stroke="#2a7efe"
     stroke-linejoin="round"
     id="path10" />
  <path
     d="M 23.500001,14.75 H 20.5"
     fill="none"
     stroke="#00ff00"
     stroke-linejoin="round"
     stroke-width="1.5"
     id="path11" />
  <path
     d="m 17.5,14 v 4"
     fill="#c1d3f1"
     stroke="#2a7efe"
     stroke-linejoin="round"
     id="path12" />
  <path
     d="M 23.500001,17.25 H 20.5"
     fill="none"
     stroke="#ff0000"
     stroke-linejoin="round"
     stroke-width="1.5"
     id="path13" />
</svg>
