<?xml version="1.0" encoding="UTF-8" standalone="no"?>
<svg
   width="48"
   height="48"
   version="1.1"
   viewBox="0 0 48 48"
   id="svg5"
   sodipodi:docname="Charge_01_48.svg"
   inkscape:version="1.3.2 (091e20e, 2023-11-25, custom)"
   xmlns:inkscape="http://www.inkscape.org/namespaces/inkscape"
   xmlns:sodipodi="http://sodipodi.sourceforge.net/DTD/sodipodi-0.dtd"
   xmlns="http://www.w3.org/2000/svg"
   xmlns:svg="http://www.w3.org/2000/svg">
  <defs
     id="defs5" />
  <sodipodi:namedview
     id="namedview5"
     pagecolor="#ffffff"
     bordercolor="#000000"
     borderopacity="0.25"
     inkscape:showpageshadow="2"
     inkscape:pageopacity="0.0"
     inkscape:pagecheckerboard="0"
     inkscape:deskcolor="#d1d1d1"
     showgrid="true"
     inkscape:current-layer="svg5">
    <inkscape:grid
       id="grid5"
       units="px"
       originx="0"
       originy="0"
       spacingx="0.5"
       spacingy="0.5"
       empcolor="#0099e5"
       empopacity="0.30196078"
       color="#0099e5"
       opacity="0.14901961"
       empspacing="2"
       dotted="false"
       gridanglex="30"
       gridanglez="30"
       visible="true" />
  </sodipodi:namedview>
  <rect
     x="6"
     y="14"
     width="34"
     height="20"
     ry="3.1428576"
     fill="none"
     stroke="#2a7efe"
     stroke-width="2"
     id="rect1" />
  <rect
     x="40"
     y="20.5"
     width="4.0000005"
     height="7.0000005"
     ry="1.0465716"
     fill="none"
     stroke="#2a7efe"
     stroke-width="2"
     id="rect2" />
  <path
     d="m10.999998 18.5v11"
     fill="none"
     stroke="#ff7f00"
     stroke-linecap="round"
     stroke-width="4"
     id="path2" />
  <path
     d="m29 18.5v11"
     fill="none"
     stroke="#ff7f00"
     stroke-linecap="round"
     stroke-width="4"
     id="path3" />
  <path
     d="m22.999999 18.5v11"
     fill="none"
     stroke="#ff7f00"
     stroke-linecap="round"
     stroke-width="4"
     id="path4" />
  <path
     d="m16.999999 18.5v11"
     fill="none"
     stroke="#ff7f00"
     stroke-linecap="round"
     stroke-width="4"
     id="path5" />
</svg>
