<svg width="48" height="48" version="1.1" viewBox="0 0 48 48" xmlns="http://www.w3.org/2000/svg">
 <g fill="none" stroke-linecap="round">
  <path d="m15.600169 29.375968 8.399788-7.599797 8.399873 7.599797" stroke="#ffffff" stroke-linejoin="round" stroke-width="7.19985"/>
  <path d="M 24.000265,21.776406 24,44.575797" stroke="#ffffff" stroke-width="7.19985"/>
  <path d="m15.600169 29.375968 8.399788-7.599797 8.399873 7.599797" stroke="#ff7f00" stroke-linejoin="round" stroke-width="2.39995"/>
  <path d="M 24.000265,21.776406 24,44.575797" stroke="#ff7f00" stroke-width="2.39995"/>
 </g>
</svg>
