<svg width="16" height="16" version="1.1" xmlns="http://www.w3.org/2000/svg">
 <rect x="2.25" y="3.25" width="13.5" height="11.5" fill="#f9f9f9" stroke="#2a7efe" stroke-width=".5" style="paint-order:normal"/>
 <path d="m14.9 1h-11.8c-0.6 0-1.1 0.5-1.1 1.1v1.4h14v-1.4c0-0.6-0.5-1.1-1.1-1.1z" fill="#2a7efe"/>
 <path d="m2.5 6v6l-0.5 0.5v-7z" fill="#f9f9f9"/>
 <path d="m5 9h9" fill="none" stroke="#f00" stroke-width="2"/>
 <path d="m0 5 4.5 4-4.5 4z" fill="#0c0"/>
</svg>
