<?xml version="1.0" encoding="UTF-8" standalone="no"?>
<svg
   width="48"
   height="48"
   version="1.1"
   viewBox="0 0 48 48"
   id="svg8"
   sodipodi:docname="tfilelistbox_200.svg"
   inkscape:export-filename="tfilelistbox_200.png"
   inkscape:export-xdpi="96"
   inkscape:export-ydpi="96"
   inkscape:version="1.3.2 (091e20e, 2023-11-25, custom)"
   xmlns:inkscape="http://www.inkscape.org/namespaces/inkscape"
   xmlns:sodipodi="http://sodipodi.sourceforge.net/DTD/sodipodi-0.dtd"
   xmlns="http://www.w3.org/2000/svg"
   xmlns:svg="http://www.w3.org/2000/svg">
  <defs
     id="defs8" />
  <sodipodi:namedview
     id="namedview8"
     pagecolor="#ffffff"
     bordercolor="#000000"
     borderopacity="0.25"
     inkscape:showpageshadow="2"
     inkscape:pageopacity="0.0"
     inkscape:pagecheckerboard="0"
     inkscape:deskcolor="#d1d1d1"
     showgrid="true"
     inkscape:current-layer="svg8">
    <inkscape:grid
       id="grid8"
       units="px"
       originx="0"
       originy="0"
       spacingx="0.5"
       spacingy="0.5"
       empcolor="#0099e5"
       empopacity="0.30196078"
       color="#0099e5"
       opacity="0.14901961"
       empspacing="2"
       dotted="false"
       gridanglex="30"
       gridanglez="30"
       visible="true" />
  </sodipodi:namedview>
  <rect
     x="5.5"
     y="5.4999828"
     width="37"
     height="37"
     fill="#f9f9f9"
     stroke="#2a7efe"
     style="paint-order:normal"
     id="rect1" />
  <rect
     x="36.5"
     y="5.4999828"
     width="6"
     height="37"
     fill="#e6e6e6"
     stroke="#2a7efe"
     style="paint-order:normal"
     id="rect2" />
  <path
     d="M 39.5,11 V 23"
     fill="#e6e6e6"
     stroke="#2a7efe"
     stroke-linecap="round"
     stroke-linejoin="round"
     stroke-width="2"
     id="path2" />
  <path
     d="M 18,12.5 H 32"
     fill="#b3b3b3"
     stroke="#b3b3b3"
     stroke-width="3"
     id="path3" />
  <path
     d="M 18,23.5 H 32"
     fill="#b3b3b3"
     stroke="#b3b3b3"
     stroke-width="3"
     id="path4" />
  <path
     d="M 18,34.5 H 32"
     fill="#b3b3b3"
     stroke="#b3b3b3"
     stroke-width="3"
     id="path5" />
  <path
     d="m 8.5,16.5 v -8 h 4 l 2,2 v 6 z"
     fill="none"
     stroke="#666666"
     stroke-linejoin="round"
     id="path6"
     style="fill:#ffffff" />
  <path
     d="m 8.5,38.5 v -8 h 4 l 2,2 v 6 z"
     fill="none"
     stroke="#666666"
     stroke-linejoin="round"
     id="path7"
     style="fill:#ffffff" />
  <path
     d="m 8.5,27.5 v -8 h 4 l 2,2 v 6 z"
     fill="none"
     stroke="#666666"
     stroke-linejoin="round"
     id="path8"
     style="fill:#ffffff" />
</svg>
