<?xml version="1.0" encoding="UTF-8" standalone="no"?>
<svg
   height="36"
   width="36"
   version="1.1"
   id="svg161"
   sodipodi:docname="Zoom_02_36.svg"
   inkscape:version="1.2-beta (1b65182ce9, 2022-04-05)"
   inkscape:export-filename="Zoom_02_36.png"
   inkscape:export-xdpi="96"
   inkscape:export-ydpi="96"
   xmlns:inkscape="http://www.inkscape.org/namespaces/inkscape"
   xmlns:sodipodi="http://sodipodi.sourceforge.net/DTD/sodipodi-0.dtd"
   xmlns="http://www.w3.org/2000/svg"
   xmlns:svg="http://www.w3.org/2000/svg">
  <defs
     id="defs165" />
  <sodipodi:namedview
     id="namedview163"
     pagecolor="#ffffff"
     bordercolor="#666666"
     borderopacity="1.0"
     inkscape:pageshadow="2"
     inkscape:pageopacity="0.0"
     inkscape:pagecheckerboard="0"
     inkscape:deskcolor="#d1d1d1"
     showgrid="true"
     inkscape:zoom="25.5"
     inkscape:cx="14.862745"
     inkscape:cy="18"
     inkscape:current-layer="svg161">
    <inkscape:grid
       type="xygrid"
       id="grid622" />
  </sodipodi:namedview>
  <radialGradient
     id="a"
     cx="5.988626"
     cy="7.28811"
     gradientTransform="matrix(-.00000042 2.6 -2.4000002 -.00000038 23.472531 12.929576)"
     gradientUnits="userSpaceOnUse"
     r="3.75">
    <stop
       offset="0"
       stop-color="#f8fbff"
       id="stop146" />
    <stop
       offset=".66666657"
       stop-color="#d1e3ff"
       id="stop148" />
    <stop
       offset="1"
       stop-color="#f8fbff"
       id="stop150" />
  </radialGradient>
  <g
     stroke-linecap="round"
     transform="matrix(1.5 0 0 1.5 .014204 -35.985796)"
     id="g159">
    <circle
       cx="8.231062"
       cy="32.25"
       fill="url(#a)"
       fill-rule="evenodd"
       r="7.6875"
       stroke="#dd8703"
       stroke-linejoin="round"
       stroke-width="1.125"
       id="circle155" />
    <path
       d="m14.625 38.606062 7.5 7.5"
       fill="none"
       stroke="#a05a2c"
       stroke-width="3.75"
       id="path157" />
  </g>
  <g
     id="g3777">
    <path
       d="m 8.5,21.875 v 11.25"
       id="path474"
       style="fill:none;stroke:#ffffff;stroke-width:5.5;stroke-linecap:round;stroke-dasharray:none" />
    <path
       d="M 14.125,27.5 H 2.875"
       id="path1031"
       style="fill:none;stroke:#ffffff;stroke-width:5.5;stroke-linecap:round;stroke-dasharray:none" />
    <path
       d="m 8.5,21.875 v 11.25"
       id="path11"
       style="fill:none;stroke:#00aa00;stroke-width:3;stroke-linecap:round;stroke-dasharray:none;stroke-opacity:1" />
    <path
       d="M 14.125,27.5 H 2.875"
       id="path13-4"
       style="fill:none;stroke:#00aa00;stroke-width:3;stroke-linecap:round;stroke-dasharray:none;stroke-opacity:1" />
  </g>
</svg>
