<?xml version="1.0" encoding="UTF-8" standalone="no"?>
<svg
   width="24"
   height="24"
   version="1.1"
   viewBox="0 0 24 24"
   id="svg8"
   sodipodi:docname="TPSImport_StdCtrls.svg"
   inkscape:version="1.3.2 (091e20e, 2023-11-25, custom)"
   xmlns:inkscape="http://www.inkscape.org/namespaces/inkscape"
   xmlns:sodipodi="http://sodipodi.sourceforge.net/DTD/sodipodi-0.dtd"
   xmlns="http://www.w3.org/2000/svg"
   xmlns:svg="http://www.w3.org/2000/svg">
  <sodipodi:namedview
     id="namedview8"
     pagecolor="#ffffff"
     bordercolor="#000000"
     borderopacity="0.25"
     inkscape:showpageshadow="2"
     inkscape:pageopacity="0.0"
     inkscape:pagecheckerboard="0"
     inkscape:deskcolor="#d1d1d1"
     showgrid="true"
     inkscape:current-layer="svg8">
    <inkscape:grid
       id="grid8"
       units="px"
       originx="0"
       originy="0"
       spacingx="0.5"
       spacingy="0.5"
       empcolor="#0099e5"
       empopacity="0.30196078"
       color="#0099e5"
       opacity="0.14901961"
       empspacing="2"
       dotted="false"
       gridanglex="30"
       gridanglez="30"
       visible="true" />
  </sodipodi:namedview>
  <defs
     id="defs4">
    <linearGradient
       id="a"
       x1="12.5"
       x2="24"
       y1="1043.3622"
       y2="1046.1492"
       gradientUnits="userSpaceOnUse"
       gradientTransform="translate(0,-1028.3622)">
      <stop
         stop-color="#d7eef4"
         offset="0"
         id="stop1" />
      <stop
         stop-color="#afc6e9"
         offset="1"
         id="stop2" />
    </linearGradient>
    <linearGradient
       id="b"
       x1="10"
       x2="10"
       y1="1042.3622"
       y2="1029.8622"
       gradientUnits="userSpaceOnUse"
       gradientTransform="translate(0,-1028.3622)">
      <stop
         stop-color="#00aa00"
         offset="0"
         id="stop3" />
      <stop
         stop-color="#55d400"
         offset="1"
         id="stop4" />
    </linearGradient>
  </defs>
  <path
     d="M 1.5,7.5 7.75,1.25 v 4 c 11.5,0 11.75,8.25 11.75,14.75 0,2 -2,2 -2,0 0,-7.5 -2.75,-10.25 -9.75,-10.25 v 4 z"
     fill="url(#b)"
     fill-rule="evenodd"
     stroke="#00a300"
     stroke-linejoin="round"
     stroke-width="0.5"
     id="path4"
     style="fill:url(#b)" />
  <path
     d="m 23.5,20.5 -12,3 v -10 l 12,-1.5 z"
     fill="url(#a)"
     fill-rule="evenodd"
     stroke="#2a7efe"
     stroke-linejoin="round"
     stroke-width="1px"
     id="path5"
     style="fill:url(#a)" />
  <path
     d="m 15.5,15.1004 3,2 -2.5,2.5"
     fill="none"
     stroke="#000000"
     stroke-width="1px"
     id="path6"
     style="stroke:#4d4d4d" />
  <rect
     x="0.25"
     y="15.249983"
     width="10.5"
     height="8.5"
     fill="#ffffff"
     fill-rule="evenodd"
     stroke="#2a7efe"
     stroke-linecap="square"
     stroke-linejoin="round"
     stroke-width="0.5"
     style="paint-order:normal"
     id="rect6" />
  <path
     d="M 2.4,21.5999 V 17.4 h 1.288359 c 1.717811,0 1.717811,2.3023 0,2.3023 H 2.4"
     fill="none"
     stroke="#4d4d4d"
     stroke-linecap="round"
     stroke-linejoin="round"
     stroke-width="0.8"
     id="path7" />
  <path
     d="M 9.000493,17.6741 C 8.73141,17.4893 8.331859,17.4 7.854528,17.4 c -0.674552,0 -1.288359,0.3533 -1.288359,1.0879 0,0.5755 0.487318,0.8121 1.288359,0.9505 1.115397,0.1928 1.288359,0.5676 1.288359,1.0736 10e-7,0.9143 -0.763884,1.0879 -1.288359,1.0879 -0.407156,0 -0.825073,-0.049 -1.349257,-0.3198"
     fill="none"
     stroke="#4d4d4d"
     stroke-linecap="round"
     stroke-linejoin="round"
     stroke-width="0.8"
     id="path8" />
</svg>
