<?xml version="1.0" encoding="UTF-8" standalone="no"?>
<svg
   height="64"
   width="64"
   version="1.1"
   id="svg6"
   sodipodi:docname="Ok_02_64.svg"
   inkscape:export-filename="Ok_02_64.png"
   inkscape:export-xdpi="96"
   inkscape:export-ydpi="96"
   inkscape:version="1.2-beta (1b65182ce9, 2022-04-05)"
   xmlns:inkscape="http://www.inkscape.org/namespaces/inkscape"
   xmlns:sodipodi="http://sodipodi.sourceforge.net/DTD/sodipodi-0.dtd"
   xmlns="http://www.w3.org/2000/svg"
   xmlns:svg="http://www.w3.org/2000/svg">
  <defs
     id="defs8" />
  <sodipodi:namedview
     id="namedview12"
     pagecolor="#ffffff"
     bordercolor="#666666"
     borderopacity="1.0"
     inkscape:pageshadow="2"
     inkscape:pageopacity="0.0"
     inkscape:pagecheckerboard="0"
     inkscape:deskcolor="#d1d1d1"
     showgrid="true"
     inkscape:zoom="14.34375"
     inkscape:cx="32"
     inkscape:cy="32"
     inkscape:current-layer="svg6">
    <inkscape:grid
       type="xygrid"
       id="grid139" />
  </sodipodi:namedview>
  <path
     d="M 6.0001993,33.000036 13.000145,26.000091 25.000052,37.999997 50.999849,12.000199 57.999795,19.000145 25.000052,51.999896 Z"
     fill="#71c837"
     fill-rule="evenodd"
     stroke="#008000"
     stroke-opacity="0.964706"
     stroke-width="1.99998"
     id="path4" />
</svg>
