<?xml version="1.0" encoding="UTF-8" standalone="no"?>
<svg
   height="36"
   viewBox="0 0 9.5249997 9.5250005"
   width="36"
   version="1.1"
   id="svg500"
   sodipodi:docname="Health_13_36.svg"
   inkscape:version="1.2.1 (9c6d41e410, 2022-07-14)"
   inkscape:export-filename="Health_13_36.png"
   inkscape:export-xdpi="96"
   inkscape:export-ydpi="96"
   xmlns:inkscape="http://www.inkscape.org/namespaces/inkscape"
   xmlns:sodipodi="http://sodipodi.sourceforge.net/DTD/sodipodi-0.dtd"
   xmlns="http://www.w3.org/2000/svg"
   xmlns:svg="http://www.w3.org/2000/svg">
  <defs
     id="defs504" />
  <sodipodi:namedview
     id="namedview502"
     pagecolor="#ffffff"
     bordercolor="#666666"
     borderopacity="1.0"
     inkscape:showpageshadow="2"
     inkscape:pageopacity="0.0"
     inkscape:pagecheckerboard="0"
     inkscape:deskcolor="#d1d1d1"
     showgrid="true"
     inkscape:zoom="25.5"
     inkscape:cx="17.980392"
     inkscape:cy="18"
     inkscape:current-layer="svg500">
    <inkscape:grid
       type="xygrid"
       id="grid1268" />
  </sodipodi:namedview>
  <path
     style="fill:none;stroke:#00aad4;stroke-width:0.476251;stroke-dasharray:none;stroke-opacity:1"
     d="m 4.9691429,8.2974503 c -0.067731,0.048216 -0.1366078,0.096443 -0.2066428,0.1446734 -7.1151963,-4.8999931 -2.2705811,-9.7630578 0,-6.1655586 1.6792431,-2.66058587 4.766372,-0.6936075 3.3822948,2.4934868"
     id="path5231" />
  <g
     id="g3814"
     transform="matrix(0.59531251,0,0,0.59531251,-1.3025438e-4,0)"
     style="stroke:#00aad4;stroke-opacity:1">
    <circle
       cx="10.5"
       cy="10.5"
       fill="url(#a)"
       fill-rule="evenodd"
       r="2.8500001"
       stroke="#dd8703"
       stroke-linejoin="round"
       id="circle15"
       style="fill:none;stroke:#00aad4;stroke-width:0.8;stroke-linecap:round;stroke-dasharray:none;stroke-opacity:1" />
    <path
       d="M 12.75,12.75 15.3,15.3"
       stroke="#a05a2c"
       stroke-width="1.4"
       id="path11"
       style="fill:none;stroke:#00aad4;stroke-linecap:round;stroke-opacity:1"
       sodipodi:nodetypes="cc" />
  </g>
</svg>
