<?xml version="1.0" encoding="UTF-8" standalone="no"?>
<svg
   height="64"
   width="64"
   version="1.1"
   id="svg1220"
   sodipodi:docname="Ok_01_64.svg"
   inkscape:export-filename="Ok_01_64.png"
   inkscape:export-xdpi="96"
   inkscape:export-ydpi="96"
   inkscape:version="1.2-beta (1b65182ce9, 2022-04-05)"
   xmlns:inkscape="http://www.inkscape.org/namespaces/inkscape"
   xmlns:sodipodi="http://sodipodi.sourceforge.net/DTD/sodipodi-0.dtd"
   xmlns="http://www.w3.org/2000/svg"
   xmlns:svg="http://www.w3.org/2000/svg">
  <defs
     id="defs1224" />
  <sodipodi:namedview
     id="namedview1222"
     pagecolor="#ffffff"
     bordercolor="#666666"
     borderopacity="1.0"
     inkscape:pageshadow="2"
     inkscape:pageopacity="0.0"
     inkscape:pagecheckerboard="0"
     inkscape:deskcolor="#d1d1d1"
     showgrid="true"
     inkscape:zoom="14.34375"
     inkscape:cx="32"
     inkscape:cy="32"
     inkscape:current-layer="svg1220">
    <inkscape:grid
       type="xygrid"
       id="grid1447" />
  </sodipodi:namedview>
  <g
     stroke-linecap="round"
     stroke-linejoin="round"
     transform="matrix(4,0,0,4,112,-40)"
     id="g1218">
    <path
       d="m -24,17 3,3 8,-8"
       fill="none"
       stroke="#00d455"
       stroke-width="1.6"
       id="path1214" />
    <path
       d="m -21,11 c -3.857106,0 -7,3.142894 -7,7 0,3.857106 3.142894,7 7,7 3.857106,0 7,-3.142894 7,-7 0,-0.660693 -0.0934,-1.299675 -0.265625,-1.90625 l -1.271484,1.271484 C -15.513378,17.573435 -15.5,17.785256 -15.5,18 c 0,3.046447 -2.453553,5.5 -5.5,5.5 -3.046447,0 -5.5,-2.453553 -5.5,-5.5 0,-3.046447 2.453553,-5.5 5.5,-5.5 1.311274,0 2.511869,0.456046 3.455078,1.216797 l 1.058594,-1.058594 C -17.706395,11.625525 -19.281774,11 -21,11 Z"
       fill="#00d455"
       stroke-dashoffset="1.49998"
       id="path1216" />
  </g>
</svg>
