<?xml version="1.0" encoding="UTF-8" standalone="no"?>
<svg
   width="32"
   height="32"
   version="1.1"
   viewBox="0 0 8.4667 8.4667"
   id="svg7"
   sodipodi:docname="div_left_200.svg"
   inkscape:export-filename="div_left_200.png"
   inkscape:export-xdpi="96"
   inkscape:export-ydpi="96"
   inkscape:version="1.3.2 (091e20e, 2023-11-25, custom)"
   xmlns:inkscape="http://www.inkscape.org/namespaces/inkscape"
   xmlns:sodipodi="http://sodipodi.sourceforge.net/DTD/sodipodi-0.dtd"
   xmlns="http://www.w3.org/2000/svg"
   xmlns:svg="http://www.w3.org/2000/svg">
  <defs
     id="defs7" />
  <sodipodi:namedview
     id="namedview7"
     pagecolor="#ffffff"
     bordercolor="#000000"
     borderopacity="0.25"
     inkscape:showpageshadow="2"
     inkscape:pageopacity="0.0"
     inkscape:pagecheckerboard="0"
     inkscape:deskcolor="#d1d1d1"
     showgrid="true"
     inkscape:current-layer="svg7">
    <inkscape:grid
       id="grid7"
       units="px"
       originx="0"
       originy="0"
       spacingx="0.13229219"
       spacingy="0.13229219"
       empcolor="#0099e5"
       empopacity="0.30196078"
       color="#0099e5"
       opacity="0.14901961"
       empspacing="2"
       dotted="false"
       gridanglex="30"
       gridanglez="30"
       visible="true" />
  </sodipodi:namedview>
  <path
     d="m 1.0582255,5.2916394 5.2917999,4.84e-5"
     fill="none"
     stroke="#008dd2"
     stroke-width="0.52917"
     id="path1"
     sodipodi:nodetypes="cc" />
  <path
     d="m1.0582255 1.0583394 6.3501354-1.3e-6"
     fill="none"
     stroke="#008dd2"
     stroke-width=".52917"
     id="path2" />
  <path
     d="m1.0582255 4.2333394 6.3500254-1e-7"
     fill="none"
     stroke="#008dd2"
     stroke-width=".52917"
     id="path3" />
  <path
     d="m 1.0582255,3.1750394 4.2334623,-2.67e-5"
     fill="none"
     stroke="#008dd2"
     stroke-width="0.52917"
     id="path4"
     sodipodi:nodetypes="cc" />
  <path
     d="m 1.0582255,2.1166394 5.2917999,3.57e-5"
     fill="none"
     stroke="#008dd2"
     stroke-width="0.52917"
     id="path5"
     sodipodi:nodetypes="cc" />
  <path
     d="m1.0582255 6.3500394h6.3500254"
     fill="none"
     stroke="#008dd2"
     stroke-width=".52917"
     id="path6" />
  <path
     d="m 1.0583376,7.4083016 2.6458439,6.14e-5"
     fill="none"
     stroke="#008dd2"
     stroke-width="0.52917"
     id="path7"
     sodipodi:nodetypes="cc" />
</svg>
