<svg width="16" height="16" version="1.1" xmlns="http://www.w3.org/2000/svg">
 <g>
  <path d="m11.499907 7.5 3.5 7h-6.9999997z" fill="none" stroke="#ffffff" stroke-linejoin="round" stroke-width="3"/>
  <path d="m11.499907 7.5-3.4999997 7h6.9999997z" fill="#ffd42a" stroke="#806600" stroke-linejoin="round" stroke-width="1px"/>
  <path d="M 11.499907,10.000001 V 12" fill="none" stroke="#000000"/>
  <path d="m11.499907 13v1" fill="none" stroke="#000000"/>
 </g>
</svg>
