<?xml version="1.0" encoding="UTF-8" standalone="no"?>
<svg
   width="48"
   height="48"
   version="1.1"
   viewBox="0 0 48 48"
   id="svg7"
   sodipodi:docname="TPSImport_DateUtils_200.svg"
   inkscape:version="1.3.2 (091e20e, 2023-11-25, custom)"
   xmlns:inkscape="http://www.inkscape.org/namespaces/inkscape"
   xmlns:sodipodi="http://sodipodi.sourceforge.net/DTD/sodipodi-0.dtd"
   xmlns="http://www.w3.org/2000/svg"
   xmlns:svg="http://www.w3.org/2000/svg">
  <sodipodi:namedview
     id="namedview7"
     pagecolor="#ffffff"
     bordercolor="#000000"
     borderopacity="0.25"
     inkscape:showpageshadow="2"
     inkscape:pageopacity="0.0"
     inkscape:pagecheckerboard="0"
     inkscape:deskcolor="#d1d1d1"
     showgrid="true"
     inkscape:current-layer="svg7">
    <inkscape:grid
       id="grid7"
       units="px"
       originx="0"
       originy="0"
       spacingx="0.5"
       spacingy="0.5"
       empcolor="#0099e5"
       empopacity="0.30196078"
       color="#0099e5"
       opacity="0.14901961"
       empspacing="2"
       dotted="false"
       gridanglex="30"
       gridanglez="30"
       visible="true" />
  </sodipodi:namedview>
  <defs
     id="defs2">
    <linearGradient
       id="b"
       x1="10"
       x2="10"
       y1="1042.3622"
       y2="1029.8622"
       gradientTransform="matrix(1.9999996,0,0,1.9999996,3e-6,-2056.824)"
       gradientUnits="userSpaceOnUse">
      <stop
         stop-color="#00aa00"
         offset="0"
         id="stop1" />
      <stop
         stop-color="#55d400"
         offset="1"
         id="stop2" />
    </linearGradient>
  </defs>
  <path
     d="M 3,15 15.5,2.5 v 8 C 38.499996,10.5 39,27 39,40 39,44 35,44 35,40 35,25 29.499997,19.5 15.5,19.5 v 8 z"
     fill="url(#b)"
     fill-rule="evenodd"
     stroke="#00a300"
     stroke-linejoin="round"
     id="path2"
     style="fill:url(#b)" />
  <rect
     x="0.49999949"
     y="30.499983"
     width="20.999987"
     height="16.999989"
     fill="#ffffff"
     fill-rule="evenodd"
     stroke="#2a7efe"
     stroke-linecap="square"
     stroke-linejoin="round"
     stroke-width="0.999999"
     style="paint-order:normal"
     id="rect2" />
  <path
     d="M 4.65,43.3503 V 34.65 h 2.65813 c 3.54415,0 3.54415,4.7695 0,4.7695 H 4.65"
     fill="none"
     stroke="#4d4d4d"
     stroke-linecap="round"
     stroke-linejoin="round"
     stroke-width="1.3"
     id="path3" />
  <path
     d="M 17.63211,35.2178 C 17.07695,34.835 16.25262,34.65 15.26779,34.65 c -1.39173,0 -2.65814,0.7319 -2.65814,2.2537 0,1.1921 1.00545,1.6822 2.65814,1.9691 2.30127,0.3993 2.65812,1.1756 2.65812,2.2238 0,1.8941 -1.57603,2.2537 -2.65812,2.2537 -0.84003,0 -1.70229,-0.1022 -2.78379,-0.6624"
     fill="none"
     stroke="#4d4d4d"
     stroke-linecap="round"
     stroke-linejoin="round"
     stroke-width="1.3"
     id="path4" />
  <rect
     x="23.489468"
     y="25.489485"
     width="23.021063"
     height="22.021097"
     fill="#ffffff"
     stroke="#999999"
     stroke-linecap="round"
     stroke-width="0.978936"
     style="paint-order:normal"
     id="rect4" />
  <path
     d="M 25,21 H 44.999966 A 2.0000348,2.0000348 0 0 1 47,23 v 4 H 23 v -4 a 2,2 0 0 1 2,-2 z"
     fill="#d40000"
     style="paint-order:normal"
     id="path5" />
  <path
     d="M 31.793603,42.1781 V 31.8219 l -3.08221,1.9726"
     fill="none"
     stroke="#4d4d4d"
     stroke-linecap="round"
     stroke-linejoin="round"
     stroke-width="1.64384"
     id="path6" />
  <path
     d="m 39.310019,31.8221 -3.397952,6.2162 m -0.300678,1.181 c 0,-1.3618 1.103954,-2.4658 2.465754,-2.4658 1.361798,0 2.465752,1.104 2.465752,2.4658 v 0.4932 c 0,1.3616 -1.103954,2.4656 -2.465752,2.4656 -1.3618,0 -2.465754,-1.104 -2.465754,-2.4656 z"
     fill="none"
     stroke="#4d4d4d"
     stroke-linecap="round"
     stroke-linejoin="round"
     stroke-width="1.64384"
     id="path7" />
</svg>
