<?xml version="1.0" encoding="UTF-8" standalone="no"?>
<svg
   height="24"
   width="24"
   version="1.1"
   id="svg2"
   sodipodi:docname="dddomain_150.svg"
   inkscape:export-filename="dddomain_150.png"
   inkscape:export-xdpi="96"
   inkscape:export-ydpi="96"
   inkscape:version="1.3-beta (cedbd6c6ff, 2023-05-28)"
   xmlns:inkscape="http://www.inkscape.org/namespaces/inkscape"
   xmlns:sodipodi="http://sodipodi.sourceforge.net/DTD/sodipodi-0.dtd"
   xmlns="http://www.w3.org/2000/svg"
   xmlns:svg="http://www.w3.org/2000/svg">
  <defs
     id="defs2" />
  <sodipodi:namedview
     id="namedview2"
     pagecolor="#ffffff"
     bordercolor="#000000"
     borderopacity="0.25"
     inkscape:showpageshadow="2"
     inkscape:pageopacity="0.0"
     inkscape:pagecheckerboard="0"
     inkscape:deskcolor="#d1d1d1"
     showgrid="true"
     inkscape:current-layer="svg2">
    <inkscape:grid
       id="grid2"
       units="px"
       originx="0"
       originy="0"
       spacingx="0.5"
       spacingy="0.5"
       empcolor="#0099e5"
       empopacity="0.30196078"
       color="#0099e5"
       opacity="0.14901961"
       empspacing="2"
       dotted="false"
       gridanglex="30"
       gridanglez="30"
       visible="true" />
  </sodipodi:namedview>
  <rect
     fill="#ebfcff"
     height="15.893894"
     ry="2.0290074"
     width="18.893896"
     x="0.55305141"
     y="0.55305141"
     id="rect2"
     style="stroke:#00aad4;stroke-width:1.10611;stroke-linejoin:round" />
  <path
     d="m 4.8558499,5.0000135 2.11641,3.4316547 -2.17383,3.5683728 h 1.10196 l 1.59141,-2.7179792 1.6050795,2.7179792 H 10.201569 L 8.0031294,8.4234652 10.094929,5.0000135 H 8.9929794 L 7.4863299,7.5703362 5.9605399,5.0000135 Z"
     id="path48"
     style="fill:#00aad4;fill-opacity:1;stroke-width:0.264583" />
  <path
     d="m 13.991064,9.1547608 v 2.8452662 h -0.98213 V 9.1547608 L 10.876194,5 h 1.09285 L 13.500004,8.1581962 15.030954,5 h 1.09285 z"
     id="path50"
     style="fill:#00aad4;fill-opacity:1;stroke-width:0.264583" />
  <g
     id="g2366">
    <circle
       cx="17.5"
       cy="17.5"
       r="5.8999996"
       stroke-dashoffset="1.49998"
       stroke-linejoin="round"
       stroke-width="1.2"
       transform="matrix(0,1,1,0,0,0)"
       id="circle274"
       style="fill:#e5ffd5;fill-opacity:1;stroke:#00d455;stroke-linecap:round" />
    <path
       d="m 17.5,14.5 v 6"
       id="path276"
       style="fill:none;stroke:#00d455;stroke-width:1.2;stroke-linecap:round;stroke-dasharray:none"
       sodipodi:nodetypes="cc" />
    <path
       d="m 20.5,17.5 h -6"
       id="path278"
       style="fill:none;stroke:#00d455;stroke-width:1.2;stroke-linecap:round;stroke-dasharray:none"
       sodipodi:nodetypes="cc" />
  </g>
</svg>
