<?xml version="1.0" encoding="UTF-8" standalone="no"?>
<svg
   height="24"
   width="24"
   version="1.1"
   id="svg701"
   sodipodi:docname="Download_01_24.svg"
   inkscape:export-filename="Download_01_24.png"
   inkscape:export-xdpi="96"
   inkscape:export-ydpi="96"
   inkscape:version="1.2-beta (1b65182ce9, 2022-04-05)"
   xmlns:inkscape="http://www.inkscape.org/namespaces/inkscape"
   xmlns:sodipodi="http://sodipodi.sourceforge.net/DTD/sodipodi-0.dtd"
   xmlns="http://www.w3.org/2000/svg"
   xmlns:svg="http://www.w3.org/2000/svg">
  <defs
     id="defs705" />
  <sodipodi:namedview
     id="namedview703"
     pagecolor="#ffffff"
     bordercolor="#666666"
     borderopacity="1.0"
     inkscape:pageshadow="2"
     inkscape:pageopacity="0.0"
     inkscape:pagecheckerboard="0"
     inkscape:deskcolor="#d1d1d1"
     showgrid="true"
     inkscape:zoom="38.25"
     inkscape:cx="11.986928"
     inkscape:cy="12"
     inkscape:current-layer="svg701">
    <inkscape:grid
       type="xygrid"
       id="grid2067" />
  </sodipodi:namedview>
  <g
     transform="translate(0 -24)"
     id="g699">
    <g
       fill-rule="evenodd"
       id="g695">
      <rect
         fill="#f9f9f9"
         height="9"
         rx=".766667"
         stroke="#999"
         stroke-linejoin="round"
         width="23"
         x=".5"
         y="38.5"
         id="rect689" />
      <path
         d="m18.5 40.5h2.5v2.5h-2.5z"
         fill="#f00"
         id="path691" />
      <path
         d="m7 38-6.5-6.5h4v-7h5v7h4z"
         fill="#94cf8a"
         stroke="#52a14c"
         stroke-linejoin="round"
         id="path693" />
    </g>
    <path
       d="m3 44.5h14"
       fill="none"
       stroke="#666"
       id="path697" />
  </g>
</svg>
