<?xml version="1.0" encoding="UTF-8" standalone="no"?>
<svg
   width="24"
   height="24"
   version="1.1"
   viewBox="0 0 24 24"
   id="svg7"
   sodipodi:docname="tpaintbox.svg"
   inkscape:export-filename="tpaintbox.png"
   inkscape:export-xdpi="96"
   inkscape:export-ydpi="96"
   inkscape:version="1.3.2 (091e20e, 2023-11-25, custom)"
   xmlns:inkscape="http://www.inkscape.org/namespaces/inkscape"
   xmlns:sodipodi="http://sodipodi.sourceforge.net/DTD/sodipodi-0.dtd"
   xmlns="http://www.w3.org/2000/svg"
   xmlns:svg="http://www.w3.org/2000/svg">
  <sodipodi:namedview
     id="namedview7"
     pagecolor="#ffffff"
     bordercolor="#000000"
     borderopacity="0.25"
     inkscape:showpageshadow="2"
     inkscape:pageopacity="0.0"
     inkscape:pagecheckerboard="0"
     inkscape:deskcolor="#d1d1d1"
     showgrid="true"
     inkscape:current-layer="svg7">
    <inkscape:grid
       id="grid7"
       units="px"
       originx="0"
       originy="0"
       spacingx="0.5"
       spacingy="0.5"
       empcolor="#0099e5"
       empopacity="0.30196078"
       color="#0099e5"
       opacity="0.14901961"
       empspacing="2"
       dotted="false"
       gridanglex="30"
       gridanglez="30"
       visible="true" />
  </sodipodi:namedview>
  <defs
     id="defs2">
    <linearGradient
       id="a"
       x1="20"
       x2="-3"
       y1="1048.3622"
       y2="1025.3622"
       gradientTransform="matrix(1.0291667 0 0 1.0291667 -.34999987 -1058.7061)"
       gradientUnits="userSpaceOnUse">
      <stop
         stop-color="#cccccc"
         offset="0"
         id="stop1" />
      <stop
         stop-color="#ffffff"
         offset="1"
         id="stop2" />
    </linearGradient>
  </defs>
  <rect
     x="2.25"
     y="2.2499826"
     width="19.5"
     height="19.5"
     fill="url(#a)"
     stroke="#2a7efe"
     stroke-linecap="round"
     stroke-linejoin="round"
     stroke-width=".5"
     style="paint-order:normal"
     id="rect2" />
  <path
     d="m18.96875 4.725035-7.453125 6.623047-0.425781 0.423828-1.3066409 2.111328-0.5976562 0.59375c-0.4255501-0.132806-0.9253433-0.131775-1.4667969 0.072266-0.6184611 0.23306-0.8980441 0.891618-1.46875 1.792968-0.6997436 1.105147-1.8624561 1.033857-3.0644531 1.148438 3.0247392 1.029134 5.1451504 1.382986 6.4707031 0.449219 0.84694-0.596615 1.044005-1.462114 0.810547-2.189454l0.568359-0.568359 2.119141-1.265625 0.425781-0.423828 6.785156-7.6191405c0.167114-0.1876546 0.18177-0.7507572-0.162109-1.1074219-0.331998-0.3443414-0.870865-0.3640406-1.234375-0.0410156z"
     fill="none"
     stroke="#ffffff"
     stroke-linecap="round"
     stroke-linejoin="round"
     stroke-width="1.5"
     id="path2" />
  <path
     d="m8.9316396 14.731647 0.851596-0.849301 1.2512024 1.299684-0.851596 0.849301z"
     fill="#ffffff"
     fill-rule="evenodd"
     stroke-width=".802639"
     id="path3" />
  <path
     d="m3.1850341 17.490665c1.2019982-0.114581 2.3655887-0.04293 3.0653834-1.148046 0.5706561-0.901383 0.8491401-1.560011 1.4675891-1.793106 2.3423394-0.882516 3.9246024 1.991066 1.939042 3.389729-1.325547 0.933778-3.4472723 0.580558-6.4720145-0.448577z"
     fill="#ff0000"
     fill-rule="evenodd"
     stroke-width=".802639"
     id="path4" />
  <path
     d="m9.7832356 13.882346 1.2512024 1.299684 2.120258-1.265373-2.064483-2.144479z"
     fill="#b3b3b3"
     fill-rule="evenodd"
     stroke-width=".802639"
     id="path5" />
  <path
     d="m20.202187 4.7652315c-0.334257-0.3461646-0.876729-0.3642213-1.23273-0.0410326l-7.45312 6.6236681 2.064157 2.14414 6.785146-7.6187639c0.176549-0.1788068 0.180168-0.7510978-0.163453-1.1080116z"
     fill="#c87137"
     fill-rule="evenodd"
     stroke-width=".802639"
     id="path6" />
  <path
     d="m11.090213 11.772178 0.425798-0.42465 2.064483 2.144479-0.425798 0.42465z"
     fill="#ffffff"
     fill-rule="evenodd"
     stroke-width=".802639"
     id="path7" />
</svg>
