<?xml version="1.0" encoding="UTF-8" standalone="no"?>
<svg
   height="32"
   width="32"
   version="1.1"
   id="svg286"
   sodipodi:docname="menu_view_forms_200.svg"
   inkscape:export-filename="menu_view_forms_200.png"
   inkscape:export-xdpi="96"
   inkscape:export-ydpi="96"
   inkscape:version="1.2.2 (732a01da63, 2022-12-09)"
   xmlns:inkscape="http://www.inkscape.org/namespaces/inkscape"
   xmlns:sodipodi="http://sodipodi.sourceforge.net/DTD/sodipodi-0.dtd"
   xmlns="http://www.w3.org/2000/svg"
   xmlns:svg="http://www.w3.org/2000/svg">
  <defs
     id="defs290" />
  <sodipodi:namedview
     id="namedview288"
     pagecolor="#ffffff"
     bordercolor="#666666"
     borderopacity="1.0"
     inkscape:showpageshadow="2"
     inkscape:pageopacity="0.0"
     inkscape:pagecheckerboard="0"
     inkscape:deskcolor="#d1d1d1"
     showgrid="true"
     inkscape:zoom="28.6875"
     inkscape:cx="15.982571"
     inkscape:cy="16"
     inkscape:current-layer="svg286">
    <inkscape:grid
       type="xygrid"
       id="grid513" />
  </sodipodi:namedview>
  <g
     stroke-width="2"
     id="g284">
    <g
       transform="translate(6 6)"
       id="g278">
      <path
         d="m1 3h24v20h-24z"
         fill="#2a7fff"
         stroke="#2a7fff"
         stroke-linecap="round"
         stroke-linejoin="round"
         stroke-miterlimit="5.6"
         id="path274" />
      <path
         d="m2 7h22v15h-22z"
         fill="#fff"
         id="path276" />
    </g>
    <path
       d="m1 3h24v20h-24z"
       fill="#2a7fff"
       stroke="#2a7fff"
       stroke-linecap="round"
       stroke-linejoin="round"
       stroke-miterlimit="5.6"
       id="path280" />
    <path
       d="m2 7h22v15h-22z"
       fill="#fff"
       id="path282" />
  </g>
</svg>
