<?xml version="1.0" encoding="UTF-8" standalone="no"?>
<svg
   width="32"
   height="32"
   version="1.1"
   id="svg652"
   sodipodi:docname="Zoom_05_32.svg"
   inkscape:export-filename="Zoom_05_32.png"
   inkscape:export-xdpi="96"
   inkscape:export-ydpi="96"
   inkscape:version="1.2.1 (9c6d41e410, 2022-07-14)"
   xmlns:inkscape="http://www.inkscape.org/namespaces/inkscape"
   xmlns:sodipodi="http://sodipodi.sourceforge.net/DTD/sodipodi-0.dtd"
   xmlns="http://www.w3.org/2000/svg"
   xmlns:svg="http://www.w3.org/2000/svg">
  <defs
     id="defs656" />
  <sodipodi:namedview
     id="namedview654"
     pagecolor="#ffffff"
     bordercolor="#666666"
     borderopacity="1.0"
     inkscape:showpageshadow="2"
     inkscape:pageopacity="0.0"
     inkscape:pagecheckerboard="0"
     inkscape:deskcolor="#d1d1d1"
     showgrid="true"
     inkscape:zoom="28.6875"
     inkscape:cx="16"
     inkscape:cy="16"
     inkscape:current-layer="svg652">
    <inkscape:grid
       type="xygrid"
       id="grid1149" />
  </sodipodi:namedview>
  <path
     d="M 13.7,31.200001 H 4.8 V 0.80000006 H 19.563636 L 27.2,8.4000002 V 13.7"
     fill="none"
     stroke="#00aad4"
     stroke-width="2"
     id="path648"
     style="stroke-width:1.6;stroke-linecap:round;stroke-linejoin:round;stroke-dasharray:none"
     sodipodi:nodetypes="cccccc" />
  <path
     d="M 19.199999,0.80000001 V 8.8 h 8"
     fill="none"
     stroke="#00aad4"
     stroke-width="2"
     id="path650"
     style="stroke-width:1.6;stroke-linecap:butt;stroke-linejoin:round;stroke-dasharray:none" />
  <g
     id="g2164"
     transform="translate(3.3,2.799999)">
    <path
       style="fill:none;stroke:#00aad4;stroke-width:1.6;stroke-linecap:round;stroke-linejoin:round;stroke-dasharray:none;stroke-opacity:1"
       d="M 21.728572,20.171429 27.9,14.000001"
       id="path1834"
       sodipodi:nodetypes="cc" />
    <path
       style="fill:none;stroke:#00aad4;stroke-width:1.6;stroke-linecap:round;stroke-linejoin:round;stroke-dasharray:none;stroke-opacity:1"
       d="m 13.5,18.525715 v -4.525714 h 4.525715"
       id="path1838"
       sodipodi:nodetypes="ccc" />
    <path
       style="fill:none;stroke:#00aad4;stroke-width:1.6;stroke-linecap:round;stroke-linejoin:round;stroke-dasharray:none;stroke-opacity:1"
       d="M 27.9,18.525715 V 14.000001 H 23.374286"
       id="path1840"
       sodipodi:nodetypes="ccc" />
    <path
       style="fill:none;stroke:#00aad4;stroke-width:1.6;stroke-linecap:round;stroke-linejoin:round;stroke-dasharray:none;stroke-opacity:1"
       d="m 27.9,23.874287 v 4.525714 h -4.525714"
       id="path1842"
       sodipodi:nodetypes="ccc" />
    <path
       style="fill:none;stroke:#00aad4;stroke-width:1.6;stroke-linecap:round;stroke-linejoin:round;stroke-dasharray:none;stroke-opacity:1"
       d="m 13.5,23.874287 v 4.525714 h 4.525715"
       id="path1844"
       sodipodi:nodetypes="ccc" />
    <path
       style="fill:none;stroke:#00aad4;stroke-width:1.6;stroke-linecap:round;stroke-linejoin:round;stroke-dasharray:none;stroke-opacity:1"
       d="m 13.5,28.400001 6.171429,-6.171429"
       id="path2414"
       sodipodi:nodetypes="cc" />
    <path
       style="fill:none;stroke:#00aad4;stroke-width:1.6;stroke-linecap:round;stroke-linejoin:round;stroke-dasharray:none;stroke-opacity:1"
       d="M 27.9,28.400001 21.728572,22.228572"
       id="path2416"
       sodipodi:nodetypes="cc" />
    <path
       style="fill:none;stroke:#00aad4;stroke-width:1.6;stroke-linecap:round;stroke-linejoin:round;stroke-dasharray:none;stroke-opacity:1"
       d="M 19.671429,20.171429 13.5,14.000001"
       id="path2418"
       sodipodi:nodetypes="cc" />
  </g>
</svg>
