<?xml version="1.0" encoding="UTF-8" standalone="no"?>
<svg
   width="48"
   height="48"
   version="1.1"
   viewBox="0 0 48 48"
   id="svg6"
   sodipodi:docname="TPSScript_200.svg"
   inkscape:version="1.3.2 (091e20e, 2023-11-25, custom)"
   xmlns:inkscape="http://www.inkscape.org/namespaces/inkscape"
   xmlns:sodipodi="http://sodipodi.sourceforge.net/DTD/sodipodi-0.dtd"
   xmlns="http://www.w3.org/2000/svg"
   xmlns:svg="http://www.w3.org/2000/svg">
  <sodipodi:namedview
     id="namedview6"
     pagecolor="#ffffff"
     bordercolor="#000000"
     borderopacity="0.25"
     inkscape:showpageshadow="2"
     inkscape:pageopacity="0.0"
     inkscape:pagecheckerboard="0"
     inkscape:deskcolor="#d1d1d1"
     showgrid="true"
     inkscape:current-layer="svg6">
    <inkscape:grid
       id="grid6"
       units="px"
       originx="0"
       originy="0"
       spacingx="0.5"
       spacingy="0.5"
       empcolor="#0099e5"
       empopacity="0.30196078"
       color="#0099e5"
       opacity="0.14901961"
       empspacing="2"
       dotted="false"
       gridanglex="30"
       gridanglez="30"
       visible="true" />
  </sodipodi:namedview>
  <defs
     id="defs2">
    <linearGradient
       id="a"
       x1="2.5"
       x2="21.5"
       y1="1030.8622"
       y2="1049.8622"
       gradientTransform="matrix(2,0,0,1.999997,-3.7098252e-8,-2056.7213)"
       gradientUnits="userSpaceOnUse">
      <stop
         stop-color="#dbe2e3"
         offset="0"
         id="stop1" />
      <stop
         stop-color="#2c5aa0"
         offset="1"
         id="stop2" />
    </linearGradient>
  </defs>
  <rect
     x="3"
     y="2.9999826"
     width="41.999996"
     height="41.999935"
     ry="5.9999914"
     fill="url(#a)"
     fill-rule="evenodd"
     stroke="#2f5da1"
     stroke-linecap="square"
     stroke-linejoin="round"
     stroke-width="2"
     style="fill:url(#a);paint-order:normal"
     id="rect2" />
  <path
     d="m 34.07568,11.8864 v 3.1108 h -4.943181 l -0.426136,6.4772 q -0.127841,1.6833 -0.127841,2.9191 0,2.9616 0.681818,3.6221 0.703125,0.6392 1.683238,0.6392 2.045455,0 2.428977,-2.5781 h 0.767046 Q 33.436476,32 29.409488,32 q -1.875,0 -3.025568,-1.1506 -1.129262,-1.1505 -1.129262,-3.409 0,-1.4915 0.447444,-6.3069 l 0.575284,-6.1363 H 21.760341 Q 21.312897,22.7529 20.673693,26.3324 20.055795,29.9119 19.28875,30.956 18.543011,32 17.243295,32 q -0.980113,0 -1.661931,-0.5753 -0.660512,-0.5753 -0.660512,-1.5128 0,-0.8948 1.150569,-2.4502 1.683238,-2.2586 2.514204,-4.6875 0.830966,-2.4503 1.257102,-7.777 h -1.448863 q -1.747159,0 -2.684659,0.7883 -0.916193,0.7671 -1.747159,2.2159 H 13.195 q 0.617898,-2.2798 1.598012,-3.75 0.980113,-1.4701 2.00284,-1.9176 1.044034,-0.4474 3.68608,-0.4474 z"
     stroke-width="2"
     id="path2"
     style="fill:#ffffff" />
  <rect
     x="1"
     y="30.999983"
     width="20"
     height="15.999935"
     fill="#ffffff"
     fill-rule="evenodd"
     stroke="#666666"
     stroke-linecap="square"
     stroke-linejoin="round"
     stroke-width="2"
     style="paint-order:normal"
     id="rect3" />
  <path
     d="m 5.7993604,40.3376 v 3.5889 H 4.0681816 v -9.7479 q 1.7311788,-0.073 2.0241475,-0.073 2.3104578,0 3.3757986,0.7124 1.0719993,0.7058 1.0719993,2.2106 0,3.3558 -3.9550778,3.3558 -0.2929687,0 -0.7856888,-0.047 z m 0,-4.6608 v 3.1227 q 0.4394531,0.047 0.6924715,0.047 1.1851916,0 1.7311788,-0.3929 0.5459871,-0.3995 0.5459871,-1.2917 0,-1.5181 -2.4436254,-1.5181 -0.2729936,0 -0.526012,0.033 z"
     id="path3"
     style="fill:#000000;stroke-width:2" />
  <path
     d="m 12.109693,43.3872 0.639204,-1.5514 q 1.025391,0.7191 2.01749,0.7191 1.524769,0 1.524769,-1.0654 0,-0.4993 -0.359553,-0.9521 -0.359552,-0.4528 -1.484819,-1.0121 -1.118608,-0.566 -1.511452,-0.9255 -0.386186,-0.3662 -0.599254,-0.8656 -0.20641,-0.4994 -0.20641,-1.1053 0,-1.1319 0.825639,-1.8777 0.832298,-0.7457 2.130682,-0.7457 1.691228,0 2.483575,0.6326 l -0.526012,1.4914 q -0.912198,-0.6525 -1.924271,-0.6525 -0.599255,0 -0.932174,0.3196 -0.32626,0.313 -0.32626,0.819 0,0.839 1.857688,1.7445 0.978782,0.4794 1.411576,0.8856 0.432795,0.3995 0.65918,0.9388 0.226385,0.5327 0.226385,1.1918 0,1.1852 -0.938832,1.9509 -0.932173,0.7658 -2.50355,0.7658 -1.364968,0 -2.463601,-0.7058 z"
     id="path4"
     style="fill:#000000;stroke-width:2" />
  <rect
     x="0.49999949"
     y="30.499983"
     width="20.999987"
     height="16.999989"
     fill="#ffffff"
     fill-rule="evenodd"
     stroke="#2a7efe"
     stroke-linecap="square"
     stroke-linejoin="round"
     stroke-width="0.999999"
     style="paint-order:normal"
     id="rect4" />
  <path
     d="M 4.65,43.3503 V 34.65 h 2.65813 c 3.54415,0 3.54415,4.7695 0,4.7695 H 4.65"
     fill="none"
     stroke="#4d4d4d"
     stroke-linecap="round"
     stroke-linejoin="round"
     stroke-width="1.3"
     id="path5" />
  <path
     d="M 17.63211,35.2178 C 17.07695,34.835 16.25262,34.65 15.26779,34.65 c -1.39173,0 -2.65814,0.7319 -2.65814,2.2537 0,1.1921 1.00545,1.6822 2.65814,1.9691 2.30127,0.3993 2.65812,1.1756 2.65812,2.2238 0,1.8941 -1.57603,2.2537 -2.65812,2.2537 -0.84003,0 -1.70229,-0.1022 -2.78379,-0.6624"
     fill="none"
     stroke="#4d4d4d"
     stroke-linecap="round"
     stroke-linejoin="round"
     stroke-width="1.3"
     id="path6" />
</svg>
