<?xml version="1.0" encoding="UTF-8" standalone="no"?>
<svg
   height="24"
   width="24"
   version="1.1"
   id="svg302"
   sodipodi:docname="File_05_24.svg"
   inkscape:export-filename="File_05_24.png"
   inkscape:export-xdpi="96"
   inkscape:export-ydpi="96"
   inkscape:version="1.2-beta (1b65182ce9, 2022-04-05)"
   xmlns:inkscape="http://www.inkscape.org/namespaces/inkscape"
   xmlns:sodipodi="http://sodipodi.sourceforge.net/DTD/sodipodi-0.dtd"
   xmlns="http://www.w3.org/2000/svg"
   xmlns:svg="http://www.w3.org/2000/svg">
  <defs
     id="defs306" />
  <sodipodi:namedview
     id="namedview304"
     pagecolor="#ffffff"
     bordercolor="#666666"
     borderopacity="1.0"
     inkscape:pageshadow="2"
     inkscape:pageopacity="0.0"
     inkscape:pagecheckerboard="0"
     inkscape:deskcolor="#d1d1d1"
     showgrid="true"
     inkscape:zoom="38.25"
     inkscape:cx="12"
     inkscape:cy="12"
     inkscape:current-layer="svg302">
    <inkscape:grid
       type="xygrid"
       id="grid994" />
  </sodipodi:namedview>
  <g
     fill="none"
     stroke="#00aad4"
     stroke-linecap="round"
     id="g300">
    <path
       d="m11 23.25h-7.25v-22.5h11.25l5.25 5.25v3.5"
       stroke-linejoin="round"
       stroke-width="1.5"
       id="path286" />
    <path
       d="m14.75 1v5.249999h5.25"
       stroke-linejoin="round"
       stroke-width="1.5"
       id="path288" />
    <g
       id="g298">
      <circle
         cx="17.25"
         cy="17.25"
         r="6"
         stroke-dashoffset="2.24997"
         stroke-linejoin="round"
         stroke-width="1.5"
         id="circle290" />
      <g
         stroke="#00aad4"
         transform="matrix(1.06066017 1.06066017 -1.06066017 1.06066017 18.3106605 -8.2058445)"
         id="g296">
        <path
           d="m10.085786 11.085786 2.828428 2.828428"
           id="path292" />
        <path
           d="m12.914214 11.085786-2.828428 2.828428"
           id="path294" />
      </g>
    </g>
  </g>
</svg>
