<?xml version="1.0" encoding="UTF-8" standalone="no"?>
<svg
   width="36"
   height="36"
   version="1.1"
   id="svg3803"
   sodipodi:docname="Time_06_36.svg"
   inkscape:export-filename="Time_06_36.png"
   inkscape:export-xdpi="96"
   inkscape:export-ydpi="96"
   inkscape:version="1.2.1 (9c6d41e410, 2022-07-14)"
   xmlns:inkscape="http://www.inkscape.org/namespaces/inkscape"
   xmlns:sodipodi="http://sodipodi.sourceforge.net/DTD/sodipodi-0.dtd"
   xmlns="http://www.w3.org/2000/svg"
   xmlns:svg="http://www.w3.org/2000/svg">
  <defs
     id="defs3807" />
  <sodipodi:namedview
     id="namedview3805"
     pagecolor="#ffffff"
     bordercolor="#666666"
     borderopacity="1.0"
     inkscape:showpageshadow="2"
     inkscape:pageopacity="0.0"
     inkscape:pagecheckerboard="0"
     inkscape:deskcolor="#d1d1d1"
     showgrid="true"
     inkscape:zoom="25.5"
     inkscape:cx="17.392157"
     inkscape:cy="18"
     inkscape:current-layer="g3801">
    <inkscape:grid
       type="xygrid"
       id="grid4238" />
  </sodipodi:namedview>
  <g
     fill="none"
     stroke="#00aad4"
     id="g3801">
    <path
       d="m 18,11 v 9 h 6.5"
       stroke-width="2.2499"
       id="path3783"
       sodipodi:nodetypes="ccc" />
    <g
       transform="matrix(2.2499 0 0 2.2499 .00015 .001198)"
       id="g3799">
      <g
         stroke-linecap="round"
         stroke-linejoin="round"
         id="g3791">
        <circle
           cx="3.5"
           cy="14.5"
           r="1.125"
           stroke-width=".75"
           id="circle3785" />
        <circle
           cx="12.5"
           cy="14.5"
           r="1.125"
           stroke-width=".75"
           id="circle3787" />
        <circle
           cx="8.0004"
           cy="9"
           r="5.5"
           id="circle3789" />
      </g>
      <g
         stroke-width=".8"
         id="g3797">
        <path
           d="m9.2925 2.4761c.52582-.79895 1.8506-1.5809 3.2409-.67033 1.3903.91054 1.1978 2.434.67198 3.233z"
           id="path3793" />
        <path
           d="m6.7075 2.4761c-.52582-.79895-1.8506-1.5809-3.2409-.67033-1.3903.91054-1.1978 2.434-.67198 3.233z"
           id="path3795" />
      </g>
    </g>
  </g>
</svg>
