<?xml version="1.0" encoding="UTF-8" standalone="no"?>
<svg
   height="24"
   width="24"
   version="1.1"
   id="svg8"
   sodipodi:docname="menu_view_messages_150.svg"
   inkscape:export-filename="menu_view_messages_150.png"
   inkscape:export-xdpi="96"
   inkscape:export-ydpi="96"
   inkscape:version="1.2.2 (732a01da63, 2022-12-09)"
   xmlns:inkscape="http://www.inkscape.org/namespaces/inkscape"
   xmlns:sodipodi="http://sodipodi.sourceforge.net/DTD/sodipodi-0.dtd"
   xmlns="http://www.w3.org/2000/svg"
   xmlns:svg="http://www.w3.org/2000/svg">
  <defs
     id="defs12" />
  <sodipodi:namedview
     id="namedview10"
     pagecolor="#ffffff"
     bordercolor="#666666"
     borderopacity="1.0"
     inkscape:showpageshadow="2"
     inkscape:pageopacity="0.0"
     inkscape:pagecheckerboard="0"
     inkscape:deskcolor="#d1d1d1"
     showgrid="true"
     inkscape:zoom="38.25"
     inkscape:cx="11.03268"
     inkscape:cy="12"
     inkscape:current-layer="svg8">
    <inkscape:grid
       type="xygrid"
       id="grid514" />
  </sodipodi:namedview>
  <g
     stroke-width="1.5"
     id="g6">
    <path
       d="m 0.75,1.75 h 22.5 v 19.5 H 0.75 Z"
       fill="#2a7fff"
       stroke="#2a7fff"
       stroke-linecap="round"
       stroke-linejoin="round"
       stroke-miterlimit="5.6"
       id="path2"
       sodipodi:nodetypes="ccccc" />
    <path
       d="m 1.5,4.75 h 21 V 20.5 h -21 z"
       fill="#ffffff"
       id="path4"
       sodipodi:nodetypes="ccccc" />
  </g>
  <rect
     style="fill:#ffffff;stroke:#ff0000;stroke-width:1.2;stroke-linecap:round;stroke-linejoin:round;stroke-miterlimit:5.6;stroke-dasharray:none"
     id="rect535"
     width="14.8"
     height="3.8"
     x="4.6000004"
     y="14.6" />
</svg>
