<?xml version="1.0" encoding="UTF-8" standalone="no"?>
<svg
   height="32"
   width="32"
   version="1.1"
   id="svg456"
   sodipodi:docname="Grid_12_32.svg"
   inkscape:export-filename="Grid_12_32.png"
   inkscape:export-xdpi="96"
   inkscape:export-ydpi="96"
   inkscape:version="1.2-beta (1b65182ce9, 2022-04-05)"
   xmlns:inkscape="http://www.inkscape.org/namespaces/inkscape"
   xmlns:sodipodi="http://sodipodi.sourceforge.net/DTD/sodipodi-0.dtd"
   xmlns="http://www.w3.org/2000/svg"
   xmlns:svg="http://www.w3.org/2000/svg">
  <defs
     id="defs460" />
  <sodipodi:namedview
     id="namedview458"
     pagecolor="#ffffff"
     bordercolor="#666666"
     borderopacity="1.0"
     inkscape:pageshadow="2"
     inkscape:pageopacity="0.0"
     inkscape:pagecheckerboard="0"
     inkscape:deskcolor="#d1d1d1"
     showgrid="true"
     inkscape:zoom="28.6875"
     inkscape:cx="15.511983"
     inkscape:cy="16"
     inkscape:current-layer="svg456">
    <inkscape:grid
       type="xygrid"
       id="grid997" />
  </sodipodi:namedview>
  <g
     stroke-width="1.5"
     id="g454">
    <path
       d="m.75.75h30.500002v30.500002h-30.500002z"
       fill="#fff"
       stroke="#999"
       stroke-dashoffset="1.49998"
       stroke-linecap="round"
       stroke-linejoin="round"
       id="path438" />
    <g
       fill="none"
       stroke="#b3b3b3"
       id="g452">
      <path
         d="m1.5 7.25h29"
         id="path440" />
      <path
         d="m10.25 1.5v29"
         id="path442" />
      <path
         d="m30.5 25.25h-29"
         id="path444" />
      <path
         d="m21.25 1.5v29"
         id="path446" />
      <path
         d="m1.5 19.25h29"
         id="path448" />
      <path
         d="m1.5 13.25h29"
         id="path450" />
    </g>
  </g>
  <g
     transform="matrix(2,0,0,2,12,12.000742)"
     id="g6"
     style="stroke-width:0.5">
    <path
       d="M 6.2192367,3.5783e-4 C 5.9459231,-0.00799007 5.680021,0.13007991 5.5334161,0.37735863 L 5.074197,1.1514134 4.9237977,1.1494081 4.4665841,0.37936395 C 4.2710045,0.05048984 3.8635817,-0.0858424 3.5100447,0.06051752 L 2.5615268,0.45356091 C 2.2080463,0.60005714 2.0160756,0.98310643 2.110329,1.3539512 L 2.3309145,2.2242615 2.2246324,2.3305436 1.3543221,2.1079528 C 0.98296511,2.0130364 0.59835292,2.2049268 0.45192651,2.5591506 L 0.05888312,3.5076685 C -0.0880517,3.8616815 0.0480246,4.2707399 0.37772955,4.4662132 L 1.1517844,4.9254322 1.1497791,5.0758315 0.37772955,5.5330451 C 0.04885568,5.7286249 -0.08547147,6.1360476 0.06088844,6.4895845 L 0.45393183,7.4381024 C 0.60042806,7.7915829 0.98347735,7.9835536 1.3543221,7.8893002 L 2.2246324,7.6687147 2.3309145,7.7749968 2.1083237,8.6453071 C 2.013407,9.0166641 2.205298,9.4012762 2.5595215,9.5477027 L 3.5080394,9.9407461 C 3.8620526,10.08768 4.271111,9.9516049 4.4665841,9.6218996 l 0.459219,-0.7740547 0.1503993,0.00201 0.4572137,0.7720494 C 5.7289958,9.9507738 6.1364185,10.085101 6.4899554,9.9387408 L 7.4384734,9.5456974 C 7.7919538,9.3992012 7.9839245,9.0161519 7.8896711,8.6453071 L 7.6690856,7.7749968 7.7753677,7.6687147 8.645678,7.8913055 C 9.017035,7.986222 9.4016471,7.7943314 9.5480736,7.4401077 L 9.941117,6.4915898 C 10.088052,6.1375768 9.9519756,5.7285184 9.6222706,5.5330451 L 8.8482158,5.0738261 8.8502211,4.9254322 9.6222706,4.4662132 C 9.9511444,4.2706333 10.085472,3.8632107 9.9391117,3.5096738 L 9.5460683,2.5611559 C 9.3995721,2.2076754 9.0165228,2.0157047 8.645678,2.1099581 L 7.7753677,2.3305436 7.6690856,2.2242615 7.8916764,1.3539512 C 7.9865928,0.98259419 7.7947024,0.597982 7.4404787,0.45155559 L 6.4919607,0.0585122 C 6.4034575,0.02177849 6.3103413,0.00314045 6.2192367,3.5783e-4 Z M 5.0000001,4.2295849 A 0.7700442,0.7700442 0 0 1 5.7700443,4.9996291 0.7700442,0.7700442 0 0 1 5.0000001,5.7696733 0.7700442,0.7700442 0 0 1 4.2299559,4.9996291 0.7700442,0.7700442 0 0 1 5.0000001,4.2295849 Z"
       fill="#ffffff"
       id="path2"
       style="stroke-width:0.25" />
    <path
       d="M 2.8558434,1.1646588 3.1855584,2.4584766 2.4596532,3.1845834 1.1641293,2.8551589 0.77126042,3.8036283 1.9202725,4.4867638 1.9201299,5.5134913 0.77211887,6.195215 1.1650297,7.1437858 2.4588475,6.8140708 3.1849543,7.539976 2.8555299,8.8354999 3.8039992,9.2283688 4.4871347,8.0793568 5.5138623,8.0794994 6.1955859,9.2275103 7.1441567,8.8345995 6.8144418,7.5407817 7.5403469,6.8146749 8.8358708,7.1440994 9.2287397,6.19563 8.0797277,5.5124945 8.0798703,4.485767 9.2278812,3.8040433 8.8349704,2.8554725 7.5411526,3.1851875 6.8150458,2.4592823 7.1444703,1.1637584 6.1960009,0.7708895 5.5128654,1.9199015 4.4861379,1.9197589 3.8044142,0.77174795 Z M 4.4106338,3.576773 A 1.5400884,1.5400884 0 0 1 6.4228562,4.4102629 1.5400884,1.5400884 0 0 1 5.5893663,6.4224853 1.5400884,1.5400884 0 0 1 3.5771439,5.5889954 1.5400884,1.5400884 0 0 1 4.4106338,3.576773 Z"
       fill="#2c5aa0"
       id="path4"
       style="stroke-width:0.25" />
  </g>
</svg>
