<?xml version="1.0" encoding="UTF-8" standalone="no"?>
<svg
   height="16"
   width="16"
   version="1.1"
   id="svg16"
   sodipodi:docname="menu_view_anchor_editor.svg"
   inkscape:export-filename="menu_view_anchor_editor.png"
   inkscape:export-xdpi="96"
   inkscape:export-ydpi="96"
   inkscape:version="1.2.2 (732a01da63, 2022-12-09)"
   xmlns:inkscape="http://www.inkscape.org/namespaces/inkscape"
   xmlns:sodipodi="http://sodipodi.sourceforge.net/DTD/sodipodi-0.dtd"
   xmlns="http://www.w3.org/2000/svg"
   xmlns:svg="http://www.w3.org/2000/svg">
  <defs
     id="defs20" />
  <sodipodi:namedview
     id="namedview18"
     pagecolor="#ffffff"
     bordercolor="#666666"
     borderopacity="1.0"
     inkscape:showpageshadow="2"
     inkscape:pageopacity="0.0"
     inkscape:pagecheckerboard="0"
     inkscape:deskcolor="#d1d1d1"
     showgrid="true"
     inkscape:zoom="57.375"
     inkscape:cx="7.9912854"
     inkscape:cy="8"
     inkscape:current-layer="svg16">
    <inkscape:grid
       type="xygrid"
       id="grid555" />
  </sodipodi:namedview>
  <path
     d="m1.5 1.5h14v13h-14z"
     fill="#2a7fff"
     stroke="#2a7fff"
     stroke-linecap="round"
     stroke-linejoin="round"
     stroke-miterlimit="5.6"
     id="path2" />
  <path
     d="m2 3.5h13v10.5h-13z"
     fill="#fff"
     id="path4" />
  <g
     fill="none"
     stroke="#4d4d4d"
     id="g14">
    <circle
       cx="8.5"
       cy="6.5"
       r="1.25"
       stroke-linecap="round"
       stroke-miterlimit="5.6"
       id="circle6" />
    <path
       d="m6.3 8.3h4.347826"
       stroke-linecap="round"
       stroke-width=".6"
       id="path8" />
    <path
       d="m8.5 8.5v4"
       id="path10" />
    <path
       d="m11 10.5h1.5c-1.5 2.677391-6.6858809 2.65592-8 0h1.5"
       stroke-linecap="round"
       stroke-linejoin="round"
       id="path12" />
  </g>
</svg>
