<?xml version="1.0" encoding="UTF-8" standalone="no"?>
<svg
   height="48"
   viewBox="0 0 12.7 12.700001"
   width="48"
   version="1.1"
   id="svg746"
   sodipodi:docname="Health_13_48.svg"
   inkscape:version="1.2.1 (9c6d41e410, 2022-07-14)"
   inkscape:export-filename="Health_13_48.png"
   inkscape:export-xdpi="96"
   inkscape:export-ydpi="96"
   xmlns:inkscape="http://www.inkscape.org/namespaces/inkscape"
   xmlns:sodipodi="http://sodipodi.sourceforge.net/DTD/sodipodi-0.dtd"
   xmlns="http://www.w3.org/2000/svg"
   xmlns:svg="http://www.w3.org/2000/svg">
  <defs
     id="defs750" />
  <sodipodi:namedview
     id="namedview748"
     pagecolor="#ffffff"
     bordercolor="#666666"
     borderopacity="1.0"
     inkscape:showpageshadow="2"
     inkscape:pageopacity="0.0"
     inkscape:pagecheckerboard="0"
     inkscape:deskcolor="#d1d1d1"
     showgrid="true"
     inkscape:zoom="19.125"
     inkscape:cx="23.973856"
     inkscape:cy="24"
     inkscape:current-layer="svg746">
    <inkscape:grid
       type="xygrid"
       id="grid1256" />
  </sodipodi:namedview>
  <path
     style="fill:none;stroke:#00aad4;stroke-width:0.635001;stroke-dasharray:none;stroke-opacity:1"
     d="m 6.8142413,11.192254 c -0.1505503,0.109441 -0.30527,0.218942 -0.464241,0.328456 -9.9916767,-6.8832083 -3.1885153,-13.714542 0,-8.6609968 2.3791284,-3.77073133 6.7707047,-0.924577 4.6962047,3.6227862"
     id="path5231" />
  <g
     id="g3814"
     transform="matrix(0.79375003,0,0,0.79375003,-1.7367251e-4,0)"
     style="stroke:#00aad4;stroke-opacity:1">
    <circle
       cx="10.5"
       cy="10.5"
       fill="url(#a)"
       fill-rule="evenodd"
       r="2.8500001"
       stroke="#dd8703"
       stroke-linejoin="round"
       id="circle15"
       style="fill:none;stroke:#00aad4;stroke-width:0.8;stroke-linecap:round;stroke-dasharray:none;stroke-opacity:1" />
    <path
       d="M 12.75,12.75 15.3,15.3"
       stroke="#a05a2c"
       stroke-width="1.4"
       id="path11"
       style="fill:none;stroke:#00aad4;stroke-linecap:round;stroke-opacity:1"
       sodipodi:nodetypes="cc" />
  </g>
</svg>
