<?xml version="1.0" encoding="UTF-8" standalone="no"?>
<svg
   height="32"
   viewBox="0 0 8.4666664 8.4666671"
   width="32"
   version="1.1"
   id="svg479"
   sodipodi:docname="Box_03_32.svg"
   inkscape:version="1.2.2 (732a01da63, 2022-12-09)"
   xmlns:inkscape="http://www.inkscape.org/namespaces/inkscape"
   xmlns:sodipodi="http://sodipodi.sourceforge.net/DTD/sodipodi-0.dtd"
   xmlns="http://www.w3.org/2000/svg"
   xmlns:svg="http://www.w3.org/2000/svg">
  <defs
     id="defs483" />
  <sodipodi:namedview
     id="namedview481"
     pagecolor="#ffffff"
     bordercolor="#000000"
     borderopacity="0.25"
     inkscape:showpageshadow="2"
     inkscape:pageopacity="0.0"
     inkscape:pagecheckerboard="0"
     inkscape:deskcolor="#d1d1d1"
     showgrid="true"
     inkscape:zoom="28.4375"
     inkscape:cx="13.696703"
     inkscape:cy="16"
     inkscape:current-layer="g477">
    <inkscape:grid
       type="xygrid"
       id="grid1043" />
  </sodipodi:namedview>
  <filter
     id="a"
     color-interpolation-filters="sRGB"
     height="1.5481179"
     width="1.2644428"
     x="-0.13222142"
     y="-0.27405897">
    <feGaussianBlur
       stdDeviation=".063698439"
       id="feGaussianBlur454" />
  </filter>
  <g
     stroke-linejoin="round"
     id="g477">
    <g
       stroke="#c87137"
       id="g465">
      <path
         d="m8.0565644 3.0427094-.4852466-1.0583132a.44373488.46965637 0 0 0 -.3992089-.2646051h-5.8775569a.44373488.46965637 0 0 0 -.39920893.2646051l-.4852469 1.0583132z"
         fill="#fc0"
         stroke-linecap="round"
         stroke-width=".264582"
         id="path457" />
      <g
         stroke-linecap="square"
         id="g463">
        <path
           d="m.75880467 2.7781247h6.94905773c.2005086 0 .36193.1644321.36193.3686821v3.7605553c0 .204249-.16142.3686817-.36193.3686817h-6.94905773c-.2005086 0-.3619303-.1644301-.3619303-.3686817v-3.7605553c0-.204249.1614201-.3686821.3619303-.3686821z"
           fill="#fc0"
           stroke-width=".264582"
           id="path459" />
        <path
           d="m.5291665 4.3656249h7.4083414"
           fill="#ccc"
           stroke-width=".264583"
           id="path461" />
      </g>
    </g>
    <path
       d="m5.1593749 3.9084139v1.1790061a.3365384.33653848 0 0 1 -.3365385.3365384h-1.1790062a.3365384.33653848 0 0 1 -.3365382-.3365384v-1.1790061a.3365384.33653848 0 0 1 .3365382-.3365384h1.1790062a.3365384.33653848 0 0 1 .3365385.3365384z"
       fill="#ccc"
       stroke="#808080"
       stroke-linecap="round"
       stroke-width=".264584"
       id="path467"
       style="fill:#ececec" />
    <g
       fill="none"
       id="g475">
      <path
         d="m2.7781255 1.9050002v-.4295303c0-.3765037.3283242-.6817199.7333333-.6817199h1.4437505c.4050088 0 .7333333.3052162.7333333.6817199v.4295303"
         stroke="#808080"
         stroke-linecap="square"
         stroke-width=".79375"
         id="path469" />
      <path
         d="m-3.65125.62618048v-.47021108c0-.27610263.2268424-.49992783.5066666-.4999278h.9975003c.2798241.00000002.5066665.22382517.5066665.4999278v.47021108"
         filter="url(#a)"
         stroke="#cccac8"
         stroke-linecap="square"
         stroke-width=".225998"
         transform="matrix(1.4473687 0 0 1.3636367 8.06283 1.262784)"
         id="path471"
         style="stroke:#ececec" />
      <path
         d="m3.8364584 4.6302084h.79375"
         stroke="#808080"
         stroke-linecap="round"
         stroke-width=".264584"
         id="path473" />
    </g>
  </g>
</svg>
