<?xml version="1.0" encoding="UTF-8" standalone="no"?>
<svg
   height="36"
   width="36"
   version="1.1"
   id="svg4"
   sodipodi:docname="File_26_36.svg"
   inkscape:export-filename="File_26_36.png"
   inkscape:export-xdpi="96"
   inkscape:export-ydpi="96"
   inkscape:version="1.3.2 (091e20e, 2023-11-25, custom)"
   xmlns:inkscape="http://www.inkscape.org/namespaces/inkscape"
   xmlns:sodipodi="http://sodipodi.sourceforge.net/DTD/sodipodi-0.dtd"
   xmlns="http://www.w3.org/2000/svg"
   xmlns:svg="http://www.w3.org/2000/svg">
  <defs
     id="defs4" />
  <sodipodi:namedview
     id="namedview4"
     pagecolor="#ffffff"
     bordercolor="#000000"
     borderopacity="0.25"
     inkscape:showpageshadow="2"
     inkscape:pageopacity="0.0"
     inkscape:pagecheckerboard="0"
     inkscape:deskcolor="#d1d1d1"
     showgrid="true"
     inkscape:current-layer="svg4">
    <inkscape:grid
       id="grid4"
       units="px"
       originx="0"
       originy="0"
       spacingx="0.5"
       spacingy="0.5"
       empcolor="#0099e5"
       empopacity="0.30196078"
       color="#0099e5"
       opacity="0.14901961"
       empspacing="2"
       dotted="false"
       gridanglex="30"
       gridanglez="30"
       visible="true" />
  </sodipodi:namedview>
  <linearGradient
     id="a"
     gradientTransform="matrix(.66909781 -.00000002 .00000005 .58542853 1.861676 4.291566)"
     gradientUnits="userSpaceOnUse"
     x1="29.5"
     x2="7.5"
     y1="33.5"
     y2="2.5">
    <stop
       offset="0"
       stop-color="#cdf"
       id="stop1" />
    <stop
       offset="1"
       stop-color="#fff"
       id="stop2" />
  </linearGradient>
  <g
     stroke-linecap="round"
     stroke-linejoin="round"
     id="g4">
    <path
       d="m6.125 34.875v-33.75h16.875l7.875 7.875v25.875z"
       fill="url(#a)"
       stroke="#b3b3b3"
       stroke-width="2.25"
       id="path2" />
    <path
       d="m22.125 1.125v8.75h8.75"
       fill="none"
       stroke="#b3b3b3"
       stroke-width="2.25"
       id="path3" />
    <path
       d="m2.75 9.3098668 21.460135 25.9401332h-21.460135zm4.5179 12.9701192v8.458704h7.341589z"
       fill="#fca"
       stroke="#ff7f2a"
       stroke-width="1.5"
       id="path4" />
  </g>
</svg>
