<?xml version="1.0" encoding="UTF-8" standalone="no"?>
<svg
   height="64"
   width="64"
   version="1.1"
   id="svg16"
   sodipodi:docname="File_16_64.svg"
   inkscape:export-filename="File_16_64.png"
   inkscape:export-xdpi="96"
   inkscape:export-ydpi="96"
   inkscape:version="1.2.1 (9c6d41e410, 2022-07-14)"
   xmlns:inkscape="http://www.inkscape.org/namespaces/inkscape"
   xmlns:sodipodi="http://sodipodi.sourceforge.net/DTD/sodipodi-0.dtd"
   xmlns:xlink="http://www.w3.org/1999/xlink"
   xmlns="http://www.w3.org/2000/svg"
   xmlns:svg="http://www.w3.org/2000/svg">
  <defs
     id="defs20">
    <radialGradient
       id="a-9"
       cx="9.1740294"
       cy="7.8253603"
       gradientTransform="matrix(0.66909781,-2.2758851e-8,4.5190518e-8,0.58542853,1.8616763,4.291566)"
       gradientUnits="userSpaceOnUse"
       r="7.5"
       fx="9.1740294"
       fy="7.8253603">
      <stop
         offset="0"
         stop-color="#fff"
         id="stop2-5"
         style="stop-color:#ccddff;stop-opacity:1;" />
      <stop
         offset="1"
         stop-color="#8fc1c7"
         id="stop4-2"
         style="stop-color:#ffffff;stop-opacity:1" />
    </radialGradient>
    <linearGradient
       inkscape:collect="always"
       xlink:href="#a-9"
       id="linearGradient4344"
       x1="52"
       y1="60"
       x2="12"
       y2="4"
       gradientUnits="userSpaceOnUse" />
    <radialGradient
       id="a"
       cx="4.1671958"
       cy="1041.9056"
       gradientTransform="matrix(0.09628186,-0.96268178,0.91820995,0.09182587,-933.88939,-67.612204)"
       gradientUnits="userSpaceOnUse"
       r="9">
      <stop
         offset="0"
         stop-color="#acf"
         id="stop1058" />
      <stop
         offset="1"
         stop-color="#fff"
         id="stop1060" />
    </radialGradient>
    <linearGradient
       id="a-1"
       gradientUnits="userSpaceOnUse"
       x1="28.381756"
       x2="18.618242"
       y1="28.381756"
       y2="18.618242"
       gradientTransform="matrix(1.049827,0,0,1.049827,-1.6709351,-1.6709345)">
      <stop
         offset="0"
         stop-color="#009600"
         id="stop698" />
      <stop
         offset="1"
         stop-color="#6edb39"
         id="stop700" />
    </linearGradient>
  </defs>
  <sodipodi:namedview
     id="namedview18"
     pagecolor="#ffffff"
     bordercolor="#666666"
     borderopacity="1.0"
     inkscape:pageshadow="2"
     inkscape:pageopacity="0.0"
     inkscape:pagecheckerboard="0"
     inkscape:deskcolor="#d1d1d1"
     showgrid="true"
     inkscape:zoom="14.34375"
     inkscape:cx="32"
     inkscape:cy="32"
     inkscape:current-layer="svg16"
     inkscape:showpageshadow="2">
    <inkscape:grid
       type="xygrid"
       id="grid1649" />
  </sodipodi:namedview>
  <path
     d="M 10,62 V 2 h 29 l 15,15 v 45 z"
     id="path2911"
     style="fill:url(#linearGradient4344);stroke:#b3b3b3;stroke-width:4;stroke-linecap:round;stroke-linejoin:round;stroke-opacity:1;fill-opacity:1"
     sodipodi:nodetypes="cccccc" />
  <path
     d="M 38,2 V 18 H 54"
     id="path2913"
     style="fill:none;stroke:#b3b3b3;stroke-width:4;stroke-linecap:round;stroke-linejoin:round;stroke-opacity:1" />
  <g
     id="g4385"
     transform="scale(2)">
    <circle
       cx="23"
       cy="23"
       fill="url(#a)"
       stroke-dashoffset="1.49998"
       stroke-linejoin="round"
       stroke-width="1.37838"
       transform="matrix(0,1,1,0,0,0)"
       id="circle703"
       style="fill:url(#a-1);stroke:#ffffff;stroke-width:1.6;stroke-linecap:round;stroke-dasharray:none"
       r="8.1999998" />
    <path
       style="fill:none;stroke:#ffffff;stroke-width:2;stroke-linecap:round;stroke-linejoin:round;stroke-dasharray:none;stroke-opacity:1"
       d="M 26.210407,19.999933 22,26.5 19.710407,23.094176"
       id="path1953"
       sodipodi:nodetypes="ccc" />
  </g>
</svg>
