<?xml version="1.0" encoding="UTF-8" standalone="no"?>
<svg
   height="64"
   width="64"
   version="1.1"
   id="svg697"
   sodipodi:docname="dialog_information_200.svg"
   inkscape:export-filename="dialog_information_200.png"
   inkscape:export-xdpi="96"
   inkscape:export-ydpi="96"
   inkscape:version="1.2.1 (9c6d41e410, 2022-07-14)"
   xmlns:inkscape="http://www.inkscape.org/namespaces/inkscape"
   xmlns:sodipodi="http://sodipodi.sourceforge.net/DTD/sodipodi-0.dtd"
   xmlns="http://www.w3.org/2000/svg"
   xmlns:svg="http://www.w3.org/2000/svg">
  <defs
     id="defs701" />
  <sodipodi:namedview
     id="namedview699"
     pagecolor="#ffffff"
     bordercolor="#666666"
     borderopacity="1.0"
     inkscape:showpageshadow="2"
     inkscape:pageopacity="0.0"
     inkscape:pagecheckerboard="0"
     inkscape:deskcolor="#d1d1d1"
     showgrid="true"
     inkscape:zoom="14.34375"
     inkscape:cx="31.965142"
     inkscape:cy="32"
     inkscape:current-layer="svg697">
    <inkscape:grid
       type="xygrid"
       id="grid1833" />
  </sodipodi:namedview>
  <linearGradient
     id="a"
     gradientUnits="userSpaceOnUse"
     x1="32.0000018"
     x2="47.57949093846"
     y1="183.64615273846"
     y2="219.25640890256">
    <stop
       offset="0"
       stop-color="#fff"
       id="stop686" />
    <stop
       offset="1"
       stop-color="#acf"
       id="stop688" />
  </linearGradient>
  <g
     transform="translate(0 -165)"
     id="g695">
    <circle
       cx="32"
       cy="197"
       r="28.933334"
       style="fill-rule:evenodd;stroke:#0055d4;stroke-width:4.13333;stroke-linecap:round;stroke-linejoin:round;stroke-opacity:.954902;fill:url(#a)"
       id="circle691" />
    <path
       d="m7.0969468 4.9403563v-1.5670657l1.806106.0000002v1.5670656zm-.0000001 8.0965087.0000001-7.0517979 1.806106.0000001-.0000001 7.0517978z"
       fill="#0055d4"
       transform="matrix(3.3220645 0 0 3.8288109 5.423485 166.08431)"
       id="path693" />
  </g>
</svg>
