<svg width="24" height="24" version="1.0" xmlns="http://www.w3.org/2000/svg">
 <defs>
  <linearGradient id="a" x1="5.375" x2="19.625" y1="4.375" y2="18.625" gradientUnits="userSpaceOnUse">
   <stop stop-color="#ffd5d5" offset="0"/>
   <stop stop-color="#ff0000" offset="1"/>
  </linearGradient>
 </defs>
 <rect x="5.375" y="4.375" width="14.25" height="14.25" fill="url(#a)" stroke="#aa0000" stroke-linecap="round" stroke-linejoin="round" stroke-width=".75" style="paint-order:normal"/>
</svg>
