<?xml version="1.0" encoding="UTF-8" standalone="no"?>
<svg
   height="24"
   width="24"
   version="1.1"
   id="svg284"
   sodipodi:docname="laz_refresh_150.svg"
   inkscape:export-filename="laz_refresh_150.png"
   inkscape:export-xdpi="96"
   inkscape:export-ydpi="96"
   inkscape:version="1.2.2 (732a01da63, 2022-12-09)"
   xmlns:inkscape="http://www.inkscape.org/namespaces/inkscape"
   xmlns:sodipodi="http://sodipodi.sourceforge.net/DTD/sodipodi-0.dtd"
   xmlns="http://www.w3.org/2000/svg"
   xmlns:svg="http://www.w3.org/2000/svg">
  <defs
     id="defs288" />
  <sodipodi:namedview
     id="namedview286"
     pagecolor="#ffffff"
     bordercolor="#666666"
     borderopacity="1.0"
     inkscape:showpageshadow="2"
     inkscape:pageopacity="0.0"
     inkscape:pagecheckerboard="0"
     inkscape:deskcolor="#d1d1d1"
     showgrid="true"
     inkscape:zoom="38.25"
     inkscape:cx="10.48366"
     inkscape:cy="12"
     inkscape:current-layer="svg284">
    <inkscape:grid
       type="xygrid"
       id="grid2716" />
  </sodipodi:namedview>
  <g
     id="g3087">
    <path
       d="M 15.409482,10.874972 H 21.875 V 4.4107148"
       id="path274"
       style="fill:none;stroke:#ff0000;stroke-width:2.25;stroke-linecap:round" />
    <path
       d="M 20.517242,10.551755 C 17.025862,3.4241371 9.2672414,-1.7595854 3.125,7.9598941"
       id="path276"
       style="fill:none;stroke:#ff0000;stroke-width:2.25;stroke-linecap:round" />
  </g>
  <g
     id="g3091"
     style="stroke:#2a7fff;stroke-opacity:1">
    <path
       d="M 9.5905173,13.124972 H 3.125 v 6.464256"
       id="path278"
       style="fill:none;stroke:#2a7fff;stroke-width:2.25;stroke-linecap:round;stroke-opacity:1" />
    <path
       d="M 4.4827586,13.448189 C 7.9741379,20.575856 15.732758,25.759617 21.875,16.040069"
       id="path280"
       style="fill:none;stroke:#2a7fff;stroke-width:2.25;stroke-linecap:round;stroke-opacity:1" />
  </g>
</svg>
