<?xml version="1.0" encoding="UTF-8" standalone="no"?>
<svg
   height="24"
   width="24"
   version="1.1"
   id="svg14"
   sodipodi:docname="pg_save_simple_150.svg"
   inkscape:export-filename="pg_save_simple_150.png"
   inkscape:export-xdpi="96"
   inkscape:export-ydpi="96"
   inkscape:version="1.3-beta (cedbd6c6ff, 2023-05-28)"
   xmlns:inkscape="http://www.inkscape.org/namespaces/inkscape"
   xmlns:sodipodi="http://sodipodi.sourceforge.net/DTD/sodipodi-0.dtd"
   xmlns="http://www.w3.org/2000/svg"
   xmlns:svg="http://www.w3.org/2000/svg">
  <defs
     id="defs14" />
  <sodipodi:namedview
     id="namedview14"
     pagecolor="#ffffff"
     bordercolor="#000000"
     borderopacity="0.25"
     inkscape:showpageshadow="2"
     inkscape:pageopacity="0.0"
     inkscape:pagecheckerboard="0"
     inkscape:deskcolor="#d1d1d1"
     showgrid="true"
     inkscape:current-layer="svg14">
    <inkscape:grid
       id="grid14"
       units="px"
       originx="0"
       originy="0"
       spacingx="0.5"
       spacingy="0.5"
       empcolor="#0099e5"
       empopacity="0.30196078"
       color="#0099e5"
       opacity="0.14901961"
       empspacing="2"
       dotted="false"
       gridanglex="30"
       gridanglez="30"
       visible="true" />
  </sodipodi:namedview>
  <linearGradient
     id="a"
     gradientUnits="userSpaceOnUse"
     x1="22.5"
     x2=".5"
     y1="23.5"
     y2=".5">
    <stop
       offset="0"
       stop-color="#2a7fff"
       id="stop1" />
    <stop
       offset="1"
       stop-color="#66a4ff"
       id="stop2" />
  </linearGradient>
  <linearGradient
     id="b"
     gradientUnits="userSpaceOnUse"
     x1="21.188"
     x2="13.812"
     y1="21.188"
     y2="13.813">
    <stop
       offset="0"
       stop-color="#009600"
       id="stop3" />
    <stop
       offset="1"
       stop-color="#6edb39"
       id="stop4" />
  </linearGradient>
  <linearGradient
     id="c"
     gradientTransform="matrix(1.1818 0 0 1.1667 -3.2727 -2.5)"
     gradientUnits="userSpaceOnUse"
     x1="11.231"
     x2="11.231"
     y1="2.1429"
     y2="9">
    <stop
       offset="0"
       stop-color="#ececec"
       id="stop5" />
    <stop
       offset="1"
       stop-color="#b7bec8"
       id="stop6" />
  </linearGradient>
  <path
     d="m.00000001-.00000004 21 .00000004 2 2v22l-23 .000001z"
     fill="url(#a)"
     id="path6" />
  <rect
     fill="#fff"
     height="12"
     rx="1.5"
     width="17"
     x="3"
     y="11"
     id="rect6" />
  <path
     d="m5 0v8h13v-8zm8 1h3v6h-3z"
     fill="url(#c)"
     fill-rule="evenodd"
     id="path7" />
  <g
     fill="none"
     id="g11">
    <g
       stroke="#e6e6e6"
       id="g10">
      <path
         d="m4.9896 13.5h13"
         id="path8" />
      <path
         d="m5 15.5h12.99"
         id="path9" />
      <path
         d="m5 17.5h12.99"
         id="path10" />
    </g>
    <path
       d="m3 22h17"
       stroke="#f60"
       stroke-width="2"
       id="path11" />
  </g>
</svg>
