<?xml version="1.0" encoding="UTF-8" standalone="no"?>
<svg
   height="24"
   width="24"
   version="1.1"
   id="svg179"
   sodipodi:docname="menu_tool_syntax_check_150.svg"
   inkscape:export-filename="menu_tool_syntax_check_150.png"
   inkscape:export-xdpi="96"
   inkscape:export-ydpi="96"
   inkscape:version="1.2.2 (732a01da63, 2022-12-09)"
   xmlns:inkscape="http://www.inkscape.org/namespaces/inkscape"
   xmlns:sodipodi="http://sodipodi.sourceforge.net/DTD/sodipodi-0.dtd"
   xmlns="http://www.w3.org/2000/svg"
   xmlns:svg="http://www.w3.org/2000/svg">
  <defs
     id="defs183" />
  <sodipodi:namedview
     id="namedview181"
     pagecolor="#ffffff"
     bordercolor="#666666"
     borderopacity="1.0"
     inkscape:showpageshadow="2"
     inkscape:pageopacity="0.0"
     inkscape:pagecheckerboard="0"
     inkscape:deskcolor="#d1d1d1"
     showgrid="true"
     inkscape:zoom="38.25"
     inkscape:cx="10.300654"
     inkscape:cy="12"
     inkscape:current-layer="svg179">
    <inkscape:grid
       type="xygrid"
       id="grid568" />
  </sodipodi:namedview>
  <path
     d="m4.6 1.6h15.8v19.799999h-15.8z"
     style="fill:#fff;stroke:#d4aa00;stroke-width:1.2;stroke-linecap:round;stroke-linejoin:round;stroke-miterlimit:5.6;stroke-opacity:1"
     id="path153" />
  <path
     d="m 8,5.5 h 9"
     id="path155"
     style="fill:none;stroke:#2a7fff;stroke-opacity:1" />
  <path
     d="m 8,11.5 h 9"
     id="path161"
     style="fill:none;stroke:#2a7fff;stroke-opacity:1" />
  <path
     d="m 8,9.5 h 9"
     id="path163"
     style="fill:none;stroke:#2a7fff;stroke-opacity:1" />
  <path
     d="m 8,7.5 h 9"
     id="path165"
     style="fill:none;stroke:#2a7fff;stroke-opacity:1" />
  <g
     stroke-linecap="round"
     stroke-linejoin="round"
     transform="matrix(1.5,0,0,1.5,-0.15,1.45)"
     id="g175"
     style="fill:none">
    <path
       d="m 7.6,9.3 2,2 4.9,-6"
       stroke="#ffffff"
       stroke-width="3.2"
       id="path171" />
    <path
       d="m 7.6,9.3 2,2 4.9,-6"
       stroke="#008000"
       stroke-width="1.2"
       id="path173" />
  </g>
</svg>
