<?xml version="1.0" encoding="UTF-8" standalone="no"?>
<svg
   height="32"
   viewBox="0 0 8.4667 8.4667"
   width="32"
   version="1.1"
   id="svg901"
   sodipodi:docname="Window_10_32.svg"
   inkscape:version="1.2.2 (732a01da63, 2022-12-09)"
   xmlns:inkscape="http://www.inkscape.org/namespaces/inkscape"
   xmlns:sodipodi="http://sodipodi.sourceforge.net/DTD/sodipodi-0.dtd"
   xmlns="http://www.w3.org/2000/svg"
   xmlns:svg="http://www.w3.org/2000/svg">
  <defs
     id="defs905">
    <radialGradient
       id="a"
       cx="7.4875011"
       cy="6.25"
       gradientTransform="matrix(-4e-8,0.63500238,-0.63500238,-1.1e-7,7.963989,-1.420819)"
       gradientUnits="userSpaceOnUse"
       r="2.25">
      <stop
         offset="0"
         stop-color="#f99"
         id="stop608" />
      <stop
         offset="1"
         stop-color="#d40000"
         id="stop610" />
    </radialGradient>
    <radialGradient
       id="b"
       cx="7.4875011"
       cy="6.25"
       gradientTransform="matrix(-5e-8,0.63500238,-0.63500238,-7e-8,6.905652,0.695856)"
       gradientUnits="userSpaceOnUse"
       r="2.25">
      <stop
         offset="0"
         stop-color="#a0c2f8"
         id="stop613" />
      <stop
         offset="1"
         stop-color="#2672e5"
         id="stop615" />
    </radialGradient>
    <radialGradient
       id="c"
       cx="7.4875011"
       cy="6.25"
       gradientTransform="matrix(-7e-8,0.63500238,-0.63500228,-1.8e-7,9.022327,0.695857)"
       gradientUnits="userSpaceOnUse"
       r="2.25">
      <stop
         offset="0"
         stop-color="#fce99c"
         id="stop618" />
      <stop
         offset="1"
         stop-color="#fc0"
         id="stop620" />
    </radialGradient>
  </defs>
  <sodipodi:namedview
     id="namedview903"
     pagecolor="#ffffff"
     bordercolor="#000000"
     borderopacity="0.25"
     inkscape:showpageshadow="2"
     inkscape:pageopacity="0.0"
     inkscape:pagecheckerboard="0"
     inkscape:deskcolor="#d1d1d1"
     showgrid="true"
     inkscape:zoom="28.4375"
     inkscape:cx="13.696703"
     inkscape:cy="16"
     inkscape:current-layer="svg901">
    <inkscape:grid
       type="xygrid"
       id="grid1668" />
  </sodipodi:namedview>
  <rect
     fill="#f5f7ff"
     height="7.011486"
     rx=".582086"
     stroke="#00aad4"
     stroke-linejoin="round"
     stroke-width=".396877"
     width="7.011486"
     x=".727607"
     y=".727607"
     id="rect897" />
  <path
     d="m.79375312.79375312h6.87919378v1.05833748h-6.87919378z"
     fill="#00aad4"
     fill-rule="evenodd"
     stroke-width=".529161"
     id="path899" />
  <g
     stroke-width="0.264584"
     id="g633"
     transform="translate(0,0.07937554)">
    <circle
       cx="4.2333498"
       cy="3.5718889"
       fill="url(#a)"
       r="1.19063"
       stroke="#aa0000"
       id="circle627"
       style="fill:url(#a)" />
    <circle
       cx="3.1750131"
       cy="5.6885638"
       fill="url(#b)"
       r="1.19063"
       stroke="#0055d4"
       id="circle629"
       style="fill:url(#b)" />
    <circle
       cx="5.291688"
       cy="5.6885638"
       fill="url(#c)"
       r="1.19063"
       stroke="#d4aa00"
       id="circle631"
       style="fill:url(#c)" />
  </g>
</svg>
