<?xml version="1.0" encoding="UTF-8" standalone="no"?>
<svg
   height="48"
   width="48"
   version="1.1"
   id="svg580"
   sodipodi:docname="Window_03_48.svg"
   inkscape:export-filename="Window_03_48.png"
   inkscape:export-xdpi="96"
   inkscape:export-ydpi="96"
   inkscape:version="1.2-beta (1b65182ce9, 2022-04-05)"
   xmlns:inkscape="http://www.inkscape.org/namespaces/inkscape"
   xmlns:sodipodi="http://sodipodi.sourceforge.net/DTD/sodipodi-0.dtd"
   xmlns="http://www.w3.org/2000/svg"
   xmlns:svg="http://www.w3.org/2000/svg">
  <defs
     id="defs584" />
  <sodipodi:namedview
     id="namedview582"
     pagecolor="#ffffff"
     bordercolor="#666666"
     borderopacity="1.0"
     inkscape:pageshadow="2"
     inkscape:pageopacity="0.0"
     inkscape:pagecheckerboard="0"
     inkscape:deskcolor="#d1d1d1"
     showgrid="true"
     inkscape:zoom="19.125"
     inkscape:cx="24"
     inkscape:cy="24"
     inkscape:current-layer="svg580">
    <inkscape:grid
       type="xygrid"
       id="grid703" />
  </sodipodi:namedview>
  <g
     id="g975">
    <path
       d="m 1.5,1.5 h 45 v 45 h -45 z"
       stroke-dashoffset="1.49998"
       stroke-linecap="round"
       id="path568"
       style="fill:none;stroke:#00aad4;stroke-width:3" />
    <path
       d="m 1.5,1.5 h 45 v 5 h -45 z"
       fill="#00aad4"
       stroke-dashoffset="1.49998"
       stroke-linecap="round"
       stroke-width="2.99998"
       id="path572"
       style="stroke:#00aad4" />
  </g>
  <g
     id="g1773"
     transform="scale(2)">
    <path
       d="M 8.25,4 V 22.5"
       id="path1666"
       style="fill:none;stroke:#00aad4;stroke-width:1.5;stroke-opacity:1"
       sodipodi:nodetypes="cc" />
    <path
       d="m 3.75,6.75 h 1.5"
       stroke-linecap="round"
       id="path1668"
       style="fill:none;stroke:#00aad4;stroke-width:1.5;stroke-opacity:1" />
    <path
       d="m 3.75,15.75 h 1.5"
       stroke-linecap="round"
       id="path1670"
       style="fill:none;stroke:#00aad4;stroke-width:1.5;stroke-opacity:1" />
    <path
       d="m 3.75,12.75 h 1.5"
       stroke-linecap="round"
       id="path1672"
       style="fill:none;stroke:#00aad4;stroke-width:1.5;stroke-opacity:1" />
    <path
       d="m 3.75,9.75 h 1.5"
       stroke-linecap="round"
       id="path1674"
       style="fill:none;stroke:#00aad4;stroke-width:1.5;stroke-opacity:1" />
    <path
       d="m 11.25,6.75 h 3"
       stroke-linecap="round"
       id="path1676"
       style="fill:none;stroke:#00aad4;stroke-width:1.5;stroke-opacity:1" />
    <path
       d="m 17.25,6.75 h 3"
       stroke-linecap="round"
       id="path1678"
       style="fill:none;stroke:#00aad4;stroke-width:1.5;stroke-opacity:1" />
    <path
       d="m 11.25,18.75 h 3"
       stroke-linecap="round"
       id="path1680"
       style="fill:none;stroke:#00aad4;stroke-width:1.5;stroke-opacity:1" />
    <path
       d="m 17.25,18.75 h 3"
       stroke-linecap="round"
       id="path1682"
       style="fill:none;stroke:#00aad4;stroke-width:1.5;stroke-opacity:1" />
    <path
       d="m 11.25,15.75 h 3"
       stroke-linecap="round"
       id="path1684"
       style="fill:none;stroke:#00aad4;stroke-width:1.5;stroke-opacity:1" />
    <path
       d="m 17.25,15.75 h 3"
       stroke-linecap="round"
       id="path1686"
       style="fill:none;stroke:#00aad4;stroke-width:1.5;stroke-opacity:1" />
    <path
       d="m 11.25,12.75 h 3"
       stroke-linecap="round"
       id="path1688"
       style="fill:none;stroke:#00aad4;stroke-width:1.5;stroke-opacity:1" />
    <path
       d="m 17.25,12.75 h 3"
       stroke-linecap="round"
       id="path1690"
       style="fill:none;stroke:#00aad4;stroke-width:1.5;stroke-opacity:1" />
    <path
       d="m 11.25,9.75 h 3"
       stroke-linecap="round"
       id="path1692"
       style="fill:none;stroke:#00aad4;stroke-width:1.5;stroke-opacity:1" />
    <path
       d="m 17.25,9.75 h 3"
       stroke-linecap="round"
       id="path1694"
       style="fill:none;stroke:#00aad4;stroke-width:1.5;stroke-opacity:1" />
  </g>
</svg>
