<?xml version="1.0" encoding="UTF-8" standalone="no"?>
<svg
   width="36"
   height="36"
   version="1.1"
   viewBox="0 0 36 36"
   id="svg15"
   sodipodi:docname="tjsonpropstorage_150.svg"
   inkscape:export-filename="tjsonpropstorage_150.png"
   inkscape:export-xdpi="96"
   inkscape:export-ydpi="96"
   inkscape:version="1.3.2 (091e20e, 2023-11-25, custom)"
   xmlns:inkscape="http://www.inkscape.org/namespaces/inkscape"
   xmlns:sodipodi="http://sodipodi.sourceforge.net/DTD/sodipodi-0.dtd"
   xmlns:xlink="http://www.w3.org/1999/xlink"
   xmlns="http://www.w3.org/2000/svg"
   xmlns:svg="http://www.w3.org/2000/svg">
  <sodipodi:namedview
     id="namedview15"
     pagecolor="#ffffff"
     bordercolor="#000000"
     borderopacity="0.25"
     inkscape:showpageshadow="2"
     inkscape:pageopacity="0.0"
     inkscape:pagecheckerboard="0"
     inkscape:deskcolor="#d1d1d1"
     showgrid="true"
     inkscape:current-layer="svg15">
    <inkscape:grid
       id="grid15"
       units="px"
       originx="0"
       originy="0"
       spacingx="0.5"
       spacingy="0.5"
       empcolor="#0099e5"
       empopacity="0.30196078"
       color="#0099e5"
       opacity="0.14901961"
       empspacing="2"
       dotted="false"
       gridanglex="30"
       gridanglez="30"
       visible="true" />
  </sodipodi:namedview>
  <defs
     id="defs2">
    <linearGradient
       id="b"
       x1="11.5"
       x2="11.5"
       y1="1039.8622"
       y2="1033.8622"
       gradientTransform="matrix(1.5151513,0,0,1.4634147,0.57575924,-1503.6155)"
       gradientUnits="userSpaceOnUse"
       xlink:href="#a" />
    <linearGradient
       id="a">
      <stop
         stop-color="#c1d3f1"
         offset="0"
         id="stop1" />
      <stop
         stop-color="#eaf2fa"
         offset="1"
         id="stop2" />
    </linearGradient>
    <linearGradient
       id="c"
       x1="11"
       x2="11"
       y1="1030.3622"
       y2="1033.3622"
       gradientTransform="matrix(1.5151513,0,0,1.4634147,0.57575924,-1503.6155)"
       gradientUnits="userSpaceOnUse"
       xlink:href="#a" />
  </defs>
  <rect
     x="2.9999981"
     y="20.999983"
     width="30.000004"
     height="14.000017"
     ry="2.0000172"
     fill="#739bdf"
     fill-rule="evenodd"
     style="paint-order:normal"
     id="rect2" />
  <path
     d="M 26.333334,3.5 30.5,8.5 h -25 l 4.1666675,-5 z"
     fill="url(#c)"
     fill-rule="evenodd"
     stroke="#2a7efe"
     stroke-linejoin="round"
     id="path2"
     style="fill:url(#c)" />
  <path
     d="M 5.5296223,18.5 H 30.5 V 8.5 H 5.5000003 Z"
     fill="url(#b)"
     fill-rule="evenodd"
     stroke="#2a7efe"
     stroke-linejoin="round"
     id="path3"
     style="fill:url(#b)" />
  <path
     d="M 8.4999998,11.5 V 16"
     fill="#c1d3f1"
     stroke="#2a7efe"
     stroke-linejoin="round"
     stroke-width="0.75"
     id="path4" />
  <path
     d="M 27.500001,11.5 V 16"
     fill="#c1d3f1"
     stroke="#2a7efe"
     stroke-linejoin="round"
     stroke-width="0.75"
     id="path5" />
  <path
     d="M 24.500001,11.5 V 16"
     fill="#c1d3f1"
     stroke="#2a7efe"
     stroke-linejoin="round"
     stroke-width="0.75"
     id="path6" />
  <path
     d="M 21.5,11.5 V 16"
     fill="#c1d3f1"
     stroke="#2a7efe"
     stroke-linejoin="round"
     stroke-width="0.75"
     id="path7" />
  <path
     d="m 19.5,12.25 h -3"
     fill="none"
     stroke="#00ff00"
     stroke-linejoin="round"
     stroke-width="1.49999"
     id="path8" />
  <path
     d="M 14.5,11.5 V 16"
     fill="#c1d3f1"
     stroke="#2a7efe"
     stroke-linejoin="round"
     stroke-width="0.75"
     id="path9" />
  <path
     d="M 11.5,11.5 V 16"
     fill="#c1d3f1"
     stroke="#2a7efe"
     stroke-linejoin="round"
     stroke-width="0.75"
     id="path10" />
  <path
     d="m 19.5,15.25 h -3"
     fill="none"
     stroke="#ff0000"
     stroke-linejoin="round"
     stroke-width="1.49999"
     id="path11" />
  <path
     d="m 19.70043,24.45 c 1.12212,0 2.02547,0.8358 2.02547,1.874 v 2.3516 c 0,1.0382 -0.90335,1.874 -2.02547,1.874 -1.12209,0 -2.02543,-0.8358 -2.02543,-1.874 V 26.324 c 0,-1.0382 0.90334,-1.874 2.02543,-1.874 z"
     fill="none"
     stroke="#ffffff"
     stroke-linecap="round"
     stroke-linejoin="round"
     stroke-width="0.9"
     id="path12" />
  <path
     d="m 9.308826,24.45 v 4.0874 c 0,2.4443 -2.205754,2.1977 -2.758826,1.6424"
     fill="none"
     stroke="#ffffff"
     stroke-linecap="round"
     stroke-linejoin="round"
     stroke-width="0.9"
     id="path13" />
  <path
     d="M 24.297,30.5496 V 24.45 l 4.347751,6.0996 V 24.45"
     fill="none"
     stroke="#ffffff"
     stroke-linecap="round"
     stroke-linejoin="round"
     stroke-width="0.9"
     id="path14" />
  <path
     d="M 15.21078,24.8481 C 14.82162,24.5797 14.24376,24.45 13.5534,24.45 c -0.97558,0 -1.86333,0.5132 -1.86333,1.58 0,0.8358 0.7048,1.1794 1.86333,1.3805 1.61317,0.28 1.86332,0.8242 1.86332,1.5591 10e-6,1.3279 -1.10478,1.58 -1.86332,1.58 -0.58885,0 -1.19328,-0.072 -1.9514,-0.4644"
     fill="none"
     stroke="#ffffff"
     stroke-linecap="round"
     stroke-linejoin="round"
     stroke-width="0.9"
     id="path15" />
</svg>
