<?xml version="1.0" encoding="UTF-8" standalone="no"?>
<svg
   height="16"
   width="16"
   version="1.1"
   id="svg4"
   sodipodi:docname="issue_qt6.svg"
   inkscape:export-filename="issue_qt6.png"
   inkscape:export-xdpi="96"
   inkscape:export-ydpi="96"
   inkscape:version="1.3-alpha (2a5ddc9d23, 2023-03-29)"
   xmlns:inkscape="http://www.inkscape.org/namespaces/inkscape"
   xmlns:sodipodi="http://sodipodi.sourceforge.net/DTD/sodipodi-0.dtd"
   xmlns="http://www.w3.org/2000/svg"
   xmlns:svg="http://www.w3.org/2000/svg">
  <defs
     id="defs4" />
  <sodipodi:namedview
     id="namedview4"
     pagecolor="#ffffff"
     bordercolor="#000000"
     borderopacity="0.25"
     inkscape:showpageshadow="2"
     inkscape:pageopacity="0.0"
     inkscape:pagecheckerboard="0"
     inkscape:deskcolor="#d1d1d1"
     showgrid="true"
     inkscape:zoom="56.8125"
     inkscape:cx="8"
     inkscape:cy="8"
     inkscape:current-layer="svg4">
    <inkscape:grid
       id="grid4"
       units="px"
       originx="0"
       originy="0"
       spacingx="0.5"
       spacingy="0.5"
       empcolor="#0099e5"
       empopacity="0.30196078"
       color="#0099e5"
       opacity="0.14901961"
       empspacing="2"
       dotted="false"
       gridanglex="30"
       gridanglez="30"
       visible="true" />
  </sodipodi:namedview>
  <path
     d="m1.5 10v-7l1.5-1.5h10l1.5 1.5v7l-1.5 1.5h-10z"
     fill="#8a0"
     fill-rule="evenodd"
     id="path1" />
  <g
     fill="#fff"
     transform="translate(0 -1)"
     id="g3">
    <path
       d="m7.8600324 7.500661c.0009087-.8095229-.1801001-1.7424572-.8778289-2.2403158-.7472592-.5332006-1.9335563-.3445359-2.4261468.4588827-.4814108.7851845-.5161615 1.7637706-.361613 2.6466675.1209476.6909435.552048 1.3917762 1.2628873 1.5973711.69598.2012975 1.5194158-.0202377 1.9329178-.6382239.3578349-.5347906.4690751-1.1931326.4697836-1.8243816zm.1267036 2.59375c.4239497-.1249488.86868-.1645661 1.309264-.16146v1.109375c-.9672568-.09874-1.9404575-.051969-2.9069841.0297-.8076186.068242-1.6713414-.072818-2.3111937-.608981-.8588926-.7197079-1.1489944-1.8854173-1.1498222-2.962384-.0008355-1.0870011.3072508-2.2647199 1.1759074-2.9825643.8121953-.6711856 1.9838212-.7894774 2.9603819-.4566651.9060495.308782 1.5556081 1.1331075 1.801522 2.0419312.3075722 1.1366942.2495752 2.4333663-.4036301 3.4440105-.1306106.2020818-.3366062.3844886-.4754452.5470377z"
       id="path2" />
    <path
       d="m13.571333 10.97958c-.603767.152674-1.257347.202-1.860677.02116-.47255-.13472-.841977-.562811-.882019-1.0557855-.04272-.5172232-.015-1.037551-.02293-1.556264 0-.4783849 0-.9567697 0-1.4351545-.314236 0-.628472 0-.942708 0 0-.3385417 0-.6770833 0-1.015625h.942708c0-.4704861 0-.9409723 0-1.4114584h1.234375v1.4114584h1.458334v1.015625c-.486111 0-.972223 0-1.458334 0 .0035.8631262-.0072 1.7266445.0055 2.5895183-.01089.2786538.218879.5037967.490233.5205077.347604.04355.699963-.01314 1.035481-.104816.000001.340277.000001.680555.000002 1.020832z"
       id="path3" />
  </g>
  <path
     d="m11.303254 14.188506c-.340399-.638503-.274508-1.379367-.03787-2.028587.218-.598086.599661-1.137582.925638-1.692394l.862237-1.467525h1.04579l-1.534755 2.576791s.161148-.116221.403196-.146049c.613729-.07563 1.291138.110139 1.62128.574915.344061.484372.385616 1.078426.298752 1.625683-.08455.532694-.461156 1.055241-1.071761 1.246143-.261897.08188-.541005.116341-.819559.122022-.676936.01381-1.400138-.261767-1.692948-.810999zm2.618279-.642297c.0697-.415059.03211-.918162-.381233-1.187072-.418609-.272335-1.140122-.180626-1.355468.262517-.187389.385615-.216102.853475.0068 1.224049.148252.246466.490164.345826.804675.353325.445256.01062.86102-.270489.925223-.652819z"
     stroke="#fff"
     stroke-width="2"
     id="path4"
     style="fill:#000000;paint-order:stroke fill markers" />
</svg>
