<?xml version="1.0" encoding="UTF-8" standalone="no"?>
<svg
   height="32"
   width="32"
   version="1.1"
   id="svg46"
   sodipodi:docname="Grid_06_32.svg"
   inkscape:export-filename="Grid_06_32.png"
   inkscape:export-xdpi="96"
   inkscape:export-ydpi="96"
   inkscape:version="1.2-beta (1b65182ce9, 2022-04-05)"
   xmlns:inkscape="http://www.inkscape.org/namespaces/inkscape"
   xmlns:sodipodi="http://sodipodi.sourceforge.net/DTD/sodipodi-0.dtd"
   xmlns="http://www.w3.org/2000/svg"
   xmlns:svg="http://www.w3.org/2000/svg">
  <defs
     id="defs50" />
  <sodipodi:namedview
     id="namedview48"
     pagecolor="#ffffff"
     bordercolor="#666666"
     borderopacity="1.0"
     inkscape:pageshadow="2"
     inkscape:pageopacity="0.0"
     inkscape:pagecheckerboard="0"
     inkscape:deskcolor="#d1d1d1"
     showgrid="true"
     inkscape:zoom="28.6875"
     inkscape:cx="16"
     inkscape:cy="16"
     inkscape:current-layer="svg46">
    <inkscape:grid
       type="xygrid"
       id="grid1128" />
  </sodipodi:namedview>
  <linearGradient
     id="a"
     gradientTransform="matrix(0 -.9375 -1.0166667 0 84.133336 49.78125)"
     gradientUnits="userSpaceOnUse"
     x1="9"
     x2="6"
     y1="10"
     y2="10.5">
    <stop
       offset="0"
       stop-color="#72cef6"
       id="stop2" />
    <stop
       offset="1"
       stop-color="#d2f5f8"
       id="stop4" />
  </linearGradient>
  <linearGradient
     id="b"
     gradientTransform="matrix(0 -.9375 -1.0166667 0 84.133336 49.78125)"
     gradientUnits="userSpaceOnUse"
     x1="10"
     x2="5"
     y1="12.5"
     y2="12.5">
    <stop
       offset="0"
       stop-color="#4674a8"
       id="stop7" />
    <stop
       offset="1"
       stop-color="#42a0ce"
       id="stop9" />
  </linearGradient>
  <g
     id="g1201">
    <path
       d="m-31.25.749999h30.500002v30.500002h-30.500002z"
       style="fill:#fff;stroke:#999;stroke-width:1.5;stroke-linecap:round;stroke-linejoin:round;stroke-dashoffset:1.49998"
       transform="rotate(-90)"
       id="path12" />
    <g
       fill="none"
       stroke="#b3b3b3"
       stroke-width=".75"
       transform="matrix(0 -2 -2 0 99.999999 168)"
       id="g24">
      <path
         d="m68.75 46.625h14.5"
         id="path14" />
      <path
         d="m72.125 49.25v-14.5"
         id="path16" />
      <path
         d="m83.25 37.375h-14.5"
         id="path18" />
      <path
         d="m80.125 49.25v-14.5"
         id="path20" />
      <path
         d="m76.125 49.25v-14.5"
         id="path22" />
    </g>
    <g
       stroke-linejoin="round"
       stroke-width=".75"
       transform="matrix(0 2 -2 0 103 -136)"
       id="g30">
      <path
         d="m68.375-45.375h15.25v5.25h-15.25z"
         fill="none"
         opacity=".5"
         stroke="#fff"
         stroke-dashoffset="1.49998"
         transform="scale(1 -1)"
         id="path26" />
      <path
         d="m83.625003 44.625h-15.250001v-3.75h15.250001z"
         fill="url(#a)"
         stroke="url(#b)"
         stroke-linecap="round"
         id="path28" />
    </g>
    <g
       fill="none"
       stroke-linecap="round"
       stroke-opacity=".996078"
       transform="matrix(-2 0 0 2 32.50032 -4)"
       id="g44">
      <g
         stroke="#fff"
         stroke-width="3"
         transform="translate(-19.5 11)"
         id="g36">
        <path
           d="m27.5-1h3.5"
           opacity=".7"
           id="path32" />
        <path
           d="m31.5-4 3 3-3 3"
           opacity=".7"
           stroke-linejoin="round"
           id="path34" />
      </g>
      <g
         stroke="#3771c8"
         stroke-width="2"
         id="g42">
        <path
           d="m8 10h7"
           id="path38" />
        <path
           d="m12 7 3 3-3 3"
           stroke-linejoin="round"
           id="path40" />
      </g>
    </g>
  </g>
</svg>
