<?xml version="1.0" encoding="UTF-8" standalone="no"?>
<svg
   width="48"
   height="48"
   version="1.1"
   viewBox="0 0 48 48"
   id="svg13"
   sodipodi:docname="tcodytreeview_200.svg"
   inkscape:version="1.3.2 (091e20e, 2023-11-25, custom)"
   xmlns:inkscape="http://www.inkscape.org/namespaces/inkscape"
   xmlns:sodipodi="http://sodipodi.sourceforge.net/DTD/sodipodi-0.dtd"
   xmlns="http://www.w3.org/2000/svg"
   xmlns:svg="http://www.w3.org/2000/svg">
  <defs
     id="defs13" />
  <sodipodi:namedview
     id="namedview13"
     pagecolor="#ffffff"
     bordercolor="#000000"
     borderopacity="0.25"
     inkscape:showpageshadow="2"
     inkscape:pageopacity="0.0"
     inkscape:pagecheckerboard="0"
     inkscape:deskcolor="#d1d1d1"
     showgrid="true"
     inkscape:current-layer="svg13">
    <inkscape:grid
       id="grid13"
       units="px"
       originx="0"
       originy="0"
       spacingx="0.5"
       spacingy="0.5"
       empcolor="#0099e5"
       empopacity="0.30196078"
       color="#0099e5"
       opacity="0.14901961"
       empspacing="2"
       dotted="false"
       gridanglex="30"
       gridanglez="30"
       visible="true" />
  </sodipodi:namedview>
  <rect
     x="2.5"
     y="2.4999826"
     width="43"
     height="43.000034"
     fill="#ffffff"
     stroke="#2a7efe"
     stroke-linecap="round"
     stroke-linejoin="round"
     style="paint-order:normal"
     id="rect1" />
  <path
     d="m8.5 8v32"
     fill="none"
     stroke="#666666"
     stroke-linejoin="round"
     id="path1" />
  <path
     d="m14.500001 18.999998-2e-6 16.000004"
     fill="none"
     stroke="#666666"
     stroke-linejoin="round"
     id="path2" />
  <path
     d="m14 8.999995h22.999998"
     fill="none"
     stroke="#b3b3b3"
     stroke-linejoin="round"
     stroke-width="1.99999"
     id="path3" />
  <path
     d="m14 38.999995h20.999998"
     fill="none"
     stroke="#b3b3b3"
     stroke-linejoin="round"
     stroke-width="2"
     id="path4" />
  <path
     d="m19.999998 20.999999h15"
     fill="none"
     stroke="#b3b3b3"
     stroke-linejoin="round"
     stroke-width="2"
     id="path5" />
  <path
     d="m19.999998 26.999999h19"
     fill="none"
     stroke="#b3b3b3"
     stroke-linejoin="round"
     stroke-width="2"
     id="path6" />
  <path
     d="m19.999998 32.999999h13"
     fill="none"
     stroke="#b3b3b3"
     stroke-linejoin="round"
     stroke-width="1.99999"
     id="path7" />
  <path
     d="m14 14.999995h19"
     fill="none"
     stroke="#b3b3b3"
     stroke-linejoin="round"
     stroke-width="2"
     id="path8" />
  <rect
     x="7"
     y="7"
     width="4"
     height="3.9999914"
     fill="#ff6600"
     stroke-width="1.33333"
     style="paint-order:normal"
     id="rect8" />
  <rect
     x="7"
     y="13"
     width="4"
     height="3.9999914"
     fill="#0000ff"
     stroke-width="1.33333"
     style="paint-order:normal"
     id="rect9" />
  <rect
     x="13"
     y="19"
     width="4"
     height="3.9999905"
     fill="#00aa00"
     stroke-width="1.33333"
     style="paint-order:normal"
     id="rect10" />
  <rect
     x="13"
     y="25"
     width="4"
     height="4"
     fill="#ffcc00"
     stroke-width="1.33333"
     style="paint-order:normal"
     id="rect11" />
  <rect
     x="13"
     y="31"
     width="4"
     height="4"
     fill="#c83737"
     stroke-width="1.33333"
     style="paint-order:normal"
     id="rect12" />
  <rect
     x="7"
     y="37"
     width="4"
     height="4"
     fill="#00ccff"
     stroke-width="1.33333"
     style="paint-order:normal"
     id="rect13" />
</svg>
