<svg width="32" height="32" version="1.0" xmlns="http://www.w3.org/2000/svg">
 <rect x="2.5" y="7.5" width="27" height="21" fill="#f9f9f9" stroke="#2a7efe" style="paint-order:normal"/>
 <path d="m9 12 4 4-4 4" fill="none" stroke="#666666" stroke-linecap="round" stroke-linejoin="round" stroke-width="1.7"/>
 <path x="1" y="2" width="13" height="2.5" ry="0" d="m4 3h24c1.10457 0 2 0.8954306 2 2v3h-28v-3c0-1.1045694 0.8954306-2 2-2z" fill="#2a7efe" stroke-width="2"/>
 <path d="m15 22.5h8" fill="#000000" stroke="#666666" stroke-linecap="round" stroke-linejoin="round" stroke-width="1.4"/>
</svg>
