<?xml version="1.0" encoding="UTF-8" standalone="no"?>
<svg
   height="32"
   width="32"
   version="1.1"
   id="svg329"
   sodipodi:docname="menu_new_search_200.svg"
   inkscape:export-filename="menu_new_search_200.png"
   inkscape:export-xdpi="96"
   inkscape:export-ydpi="96"
   inkscape:version="1.2.2 (732a01da63, 2022-12-09)"
   xmlns:inkscape="http://www.inkscape.org/namespaces/inkscape"
   xmlns:sodipodi="http://sodipodi.sourceforge.net/DTD/sodipodi-0.dtd"
   xmlns="http://www.w3.org/2000/svg"
   xmlns:svg="http://www.w3.org/2000/svg">
  <defs
     id="defs333" />
  <sodipodi:namedview
     id="namedview331"
     pagecolor="#ffffff"
     bordercolor="#666666"
     borderopacity="1.0"
     inkscape:showpageshadow="2"
     inkscape:pageopacity="0.0"
     inkscape:pagecheckerboard="0"
     inkscape:deskcolor="#d1d1d1"
     showgrid="true"
     inkscape:zoom="28.6875"
     inkscape:cx="15.982571"
     inkscape:cy="16"
     inkscape:current-layer="svg329">
    <inkscape:grid
       type="xygrid"
       id="grid556" />
  </sodipodi:namedview>
  <radialGradient
     id="a"
     cx="5.9886"
     cy="7.2881"
     gradientTransform="matrix(-.00000025 1.5642 -1.4439 -.00000023 15.17 -5.6237)"
     gradientUnits="userSpaceOnUse"
     r="3.75">
    <stop
       offset="0"
       stop-color="#f8fbff"
       id="stop304" />
    <stop
       offset=".66667"
       stop-color="#d1e3ff"
       id="stop306" />
    <stop
       offset="1"
       stop-color="#f8fbff"
       id="stop308" />
  </radialGradient>
  <g
     stroke-linecap="round"
     transform="scale(2)"
     id="g315">
    <path
       d="m10 10 4.75 4.75"
       fill="none"
       stroke="#d4aa00"
       stroke-width="2.5"
       id="path311" />
    <circle
       cx="6"
       cy="6"
       fill="url(#a)"
       fill-rule="evenodd"
       r="4.625"
       stroke="#2a7fff"
       stroke-linejoin="round"
       stroke-width=".75"
       id="circle313" />
  </g>
  <g
     fill="none"
     stroke="#e4b600"
     stroke-linecap="round"
     stroke-width="1.6"
     transform="translate(18)"
     id="g325">
    <path
       d="m6.7993.8.0004535 12.4"
       id="path317" />
    <path
       d="m2.6748 2.6748 8.25 8.25"
       id="path319" />
    <path
       d="m13.2 6.7997h-12.4"
       id="path321" />
    <path
       d="m10.925 2.6748-8.25 8.25"
       id="path323" />
  </g>
  <circle
     cx="24.8"
     cy="6.8"
     fill="#fff"
     r="1.7"
     stroke="#ffe680"
     stroke-linejoin="round"
     stroke-miterlimit="5.6"
     id="circle327" />
</svg>
