<svg width="36" height="36" version="1.1" viewBox="0 0 9.525 9.525" xmlns="http://www.w3.org/2000/svg">
 <g fill="none" stroke="#00aad4" stroke-linecap="round" stroke-linejoin="round">
  <path d="m1.2568 0.19844h7.0115v9.1281h-7.0115z" stroke-width=".39687"/>
  <path d="m2.3151 1.2568h4.8948v1.4552h-4.8948z" stroke-width=".39687"/>
  <g stroke-width=".39687">
   <g transform="translate(1e-6 -.26458)">
    <path d="m6.9453 4.0349-4e-7 0.79375h-0.79375"/>
    <path d="m3.2411 4.0349-4e-7 0.79375h-0.79375"/>
    <path d="m5.0932 4.0349-4e-7 0.79375h-0.79375"/>
   </g>
   <g transform="translate(0 3.4396)">
    <path d="m6.9453 4.0349-4e-7 0.79375h-0.79375"/>
    <path d="m3.2411 4.0349-4e-7 0.79375h-0.79375"/>
    <path d="m5.0932 4.0349-4e-7 0.79375h-0.79375"/>
   </g>
   <g transform="translate(0 1.5875)">
    <path d="m6.9453 4.0349-4e-7 0.79375h-0.79375"/>
    <path d="m3.2411 4.0349-4e-7 0.79375h-0.79375"/>
    <path d="m5.0932 4.0349-4e-7 0.79375h-0.79375"/>
   </g>
  </g>
 </g>
</svg>
