<?xml version="1.0" encoding="UTF-8" standalone="no"?>
<svg
   width="36"
   height="36"
   version="1.1"
   viewBox="0 0 36 36"
   id="svg6"
   sodipodi:docname="tdividerbevel_150.svg"
   inkscape:export-filename="tdividerbevel_150.png"
   inkscape:export-xdpi="96"
   inkscape:export-ydpi="96"
   inkscape:version="1.3.2 (091e20e, 2023-11-25, custom)"
   xmlns:inkscape="http://www.inkscape.org/namespaces/inkscape"
   xmlns:sodipodi="http://sodipodi.sourceforge.net/DTD/sodipodi-0.dtd"
   xmlns="http://www.w3.org/2000/svg"
   xmlns:svg="http://www.w3.org/2000/svg">
  <defs
     id="defs6" />
  <sodipodi:namedview
     id="namedview6"
     pagecolor="#ffffff"
     bordercolor="#000000"
     borderopacity="0.25"
     inkscape:showpageshadow="2"
     inkscape:pageopacity="0.0"
     inkscape:pagecheckerboard="0"
     inkscape:deskcolor="#d1d1d1"
     showgrid="true"
     inkscape:current-layer="svg6">
    <inkscape:grid
       id="grid6"
       units="px"
       originx="0"
       originy="0"
       spacingx="0.5"
       spacingy="0.5"
       empcolor="#0099e5"
       empopacity="0.30196078"
       color="#0099e5"
       opacity="0.14901961"
       empspacing="2"
       dotted="false"
       gridanglex="30"
       gridanglez="30"
       visible="true" />
  </sodipodi:namedview>
  <rect
     y="1.9999826"
     width="36"
     height="32"
     fill="#cccccc"
     fill-opacity="0.498039"
     fill-rule="evenodd"
     style="paint-order:normal"
     id="rect1"
     x="0" />
  <path
     d="M 0,17.25 H 6.5"
     fill="#b3b3b3"
     fill-rule="evenodd"
     stroke="#999999"
     stroke-width="1.5"
     id="path1" />
  <path
     d="M 6.5,18.75 H 0"
     fill="none"
     stroke="#ffffff"
     stroke-width="1.5"
     id="path2" />
  <path
     d="M 36,18.75 H 27.5"
     fill="#ffffff"
     fill-rule="evenodd"
     stroke="#ffffff"
     stroke-width="1.5"
     id="path3" />
  <path
     d="M 27.5,17.25 H 36"
     fill="none"
     stroke="#999999"
     stroke-width="1.5"
     id="path4" />
  <path
     d="m 18.75,22.25 h 3.829668 c 3.363703,0 2.776156,-4.8645 -0.228356,-4.8645 M 18.75,22.25 v -9.5 h 3.601312 c 3.007606,0 2.776154,4.6355 0,4.6355 H 18.75"
     fill="none"
     stroke="#2a7fff"
     stroke-linecap="round"
     stroke-linejoin="round"
     stroke-width="1.5"
     id="path5" />
  <path
     d="m 15.558571,19.1451 c 0,1.7887 -0.802077,3.1049 -2.904284,3.1049 H 9.75 v -9.4999 h 2.904287 c 2.102207,0 2.904284,1.3162 2.904284,3.1048 z"
     fill="none"
     stroke="#2a7fff"
     stroke-linecap="round"
     stroke-linejoin="round"
     stroke-width="1.5"
     id="path6" />
</svg>
