<?xml version="1.0" encoding="UTF-8" standalone="no"?>
<svg
   height="16"
   viewBox="0 0 16 16"
   width="16"
   version="1.1"
   id="svg7"
   sodipodi:docname="generatesql.svg"
   inkscape:export-filename="generatesql.png"
   inkscape:export-xdpi="96"
   inkscape:export-ydpi="96"
   inkscape:version="1.3 (0e150ed6c4, 2023-07-21)"
   xmlns:inkscape="http://www.inkscape.org/namespaces/inkscape"
   xmlns:sodipodi="http://sodipodi.sourceforge.net/DTD/sodipodi-0.dtd"
   xmlns="http://www.w3.org/2000/svg"
   xmlns:svg="http://www.w3.org/2000/svg">
  <defs
     id="defs7" />
  <sodipodi:namedview
     id="namedview7"
     pagecolor="#ffffff"
     bordercolor="#000000"
     borderopacity="0.25"
     inkscape:showpageshadow="2"
     inkscape:pageopacity="0.0"
     inkscape:pagecheckerboard="0"
     inkscape:deskcolor="#d1d1d1"
     showgrid="true"
     inkscape:current-layer="svg7">
    <inkscape:grid
       id="grid7"
       units="px"
       originx="0"
       originy="0"
       spacingx="0.5"
       spacingy="0.5"
       empcolor="#0099e5"
       empopacity="0.30196078"
       color="#0099e5"
       opacity="0.14901961"
       empspacing="2"
       dotted="false"
       gridanglex="30"
       gridanglez="30"
       visible="true" />
  </sodipodi:namedview>
  <path
     d="m7.75.5-.25 2-1.1210938.4648438-1.5917968-1.2382813-1.0605469 1.0605469 1.2382813 1.5917968-.4648438 1.1210938-2 .25v1.5l2 .25.4648438 1.1210938-.2949219.3789062h7.6601561l-.294922-.3789062.464844-1.1210938 2-.25v-1.5l-2-.25-.464844-1.1210938 1.238282-1.5917968-1.060547-1.0605469-1.591797 1.2382813-1.121094-.4648438-.25-2zm.75 4a2 2 0 0 1 2 2 2 2 0 0 1 -2 2 2 2 0 0 1 -2-2 2 2 0 0 1 2-2z"
     fill="#c2f3ff"
     fill-rule="evenodd"
     stroke-linejoin="round"
     id="path1" />
  <g
     fill="#00aad4"
     id="g7">
    <path
       d="m7.75 0a.50005.50005 0 0 0 -.4960938.4375l-.2148437 1.7128906-.5820313.2402344-1.3632812-1.0585938a.50005.50005 0 0 0 -.6601562.0410157l-1.0605469 1.0605469a.50005.50005 0 0 0 -.0410157.6601562l1.0585938 1.3632812-.2402344.5820313-1.7128906.2148437a.50005.50005 0 0 0 -.4375.4960938v1.5a.50005.50005 0 0 0 .4375.4960938l1.7128906.2148437.2402344.5820313-.3554688.4570312h1.2675782l.0566406-.0722656a.50005.50005 0 0 0 .0664062-.4980469l-.4648437-1.1210937a.50005.50005 0 0 0 -.3984375-.3046876l-1.5625-.1953124v-.6171876l1.5625-.1953124a.50005.50005 0 0 0 .3984375-.3046876l.4648437-1.1210937a.50005.50005 0 0 0 -.0664062-.4980469l-.9667969-1.2441406.4355469-.4355469 1.2441406.9667969a.50005.50005 0 0 0 .4980469.0664062l1.1210937-.4648437a.50005.50005 0 0 0 .3046876-.3984375l.1953124-1.5625h.6171876l.1953124 1.5625a.50005.50005 0 0 0 .3046876.3984375l1.1210942.4648437a.50005.50005 0 0 0 .498046-.0664062l1.244141-.9667969.435547.4355469-.966797 1.2441406a.50005.50005 0 0 0 -.066406.4980469l.464843 1.1210937a.50005.50005 0 0 0 .398438.3046876l1.5625.1953124v.6171876l-1.5625.1953124a.50005.50005 0 0 0 -.398438.3046876l-.464843 1.1210937a.50005.50005 0 0 0 .066406.4980469l.056641.0722656h1.267578l-.355469-.4570312.240234-.5820313 1.712891-.2148437a.50005.50005 0 0 0 .4375-.4960938v-1.5a.50005.50005 0 0 0 -.4375-.4960938l-1.712891-.2148437-.240234-.5820313 1.058594-1.3632812a.50005.50005 0 0 0 -.041016-.6601562l-1.060547-1.0605469a.50005.50005 0 0 0 -.660156-.0410157l-1.363281 1.0585938-.5820315-.2402344-.2148437-1.7128906a.50005.50005 0 0 0 -.4960938-.4375zm.75 4c-1.3747868 0-2.5 1.1252132-2.5 2.5s1.1252132 2.5 2.5 2.5 2.5-1.1252132 2.5-2.5-1.1252132-2.5-2.5-2.5zm0 1c.8343478 0 1.5.6656522 1.5 1.5s-.6656522 1.5-1.5 1.5-1.5-.6656522-1.5-1.5.6656522-1.5 1.5-1.5z"
       fill-rule="evenodd"
       stroke-linejoin="round"
       id="path2" />
    <g
       stroke="#00aad4"
       stroke-width=".22"
       transform="translate(-.100468 -1028.3622)"
       id="g6">
      <path
         d="m4.9180007 1038.3616c-.403428-.0008-.80822.086-1.148367.3066-.431561.2801-.574951.8269-.539029 1.3164.02872.3891.230008.7806.585903.9472.316818.1482.678148.1722 1.01556.2597.273998.071.585166.077.816356.25.164324.1232.247695.3531.232426.5625-.02154.297-.238321.5454-.519501.6269-.659387.1909-1.424153.059-1.943234-.4023-.142593.1751-.285072.3501-.42771.5253.485559.4239 1.138224.6097 1.775279.6074.439248 0 .895922-.076 1.267498-.3262.39788-.2678.549641-.7626.529263-1.2245-.01785-.4041-.220264-.823-.587872-.9902-.50379-.2291-1.063431-.3009-1.599508-.4335-.30522-.076-.49974-.3892-.468719-.7031.03628-.3661.376644-.5869.708938-.6465.517309-.093 1.04992.069 1.460846.3828.130272-.1819.260318-.3649.390601-.5468-.341081-.2427-.734611-.4226-1.150317-.4844-.130575-.019-.263946-.027-.398413-.027z"
         id="path3" />
      <g
         fill-rule="evenodd"
         id="g5">
        <path
           d="m12.400405 1038.3622v4.9997h2.5v-.6679h-1.798874v-4.3318z"
           id="path4" />
        <path
           d="m7.6034757 1039.399c-.172789.4718-.127249.9764-.128912 1.4667-.0018.5246-.04649 1.0698.17381 1.5643.245162.5504.820056.8977 1.413972.9257.480963.023.9719043-.1427 1.3221843-.4726l.607385.4785.355442-.455c-.209637-.1648-.419248-.3295-.628866-.4942.206046-.4133.183371-.8817.179667-1.33-.0034-.4054.02003-.8127-.01776-1.2167-.04769-.5101-.335903-.9875-.77339-1.2636-.293688-.1853-.6443423-.2385-.9843123-.2402-.501833 0-1.247343.294-1.519436 1.0371zm1.544826-.3633c.305933-.011.7276873.1275.9218183.5215.176568.3583.1226.7607.126946 1.1444.0042.3554.01361.712-.01361 1.0664.006.1835-.06134.2122-.169916.09-.160654-.1263-.3217273-.2526-.4823893-.3789l-.355442.4531c.217423.1712.434868.3424.6523023.5136-.3560093.2979-.9132203.3249-1.2811683.031-.318934-.2545-.380314-.6846-.371088-1.0683.01134-.4782-.01323-.9558.0079-1.4335.0257-.5844.528802-.9513.964785-.9394z"
           id="path5" />
      </g>
    </g>
  </g>
</svg>
