<?xml version="1.0" encoding="UTF-8" standalone="no"?>
<svg
   height="24"
   viewBox="0 0 6.35 6.35"
   width="24"
   version="1.1"
   id="svg229"
   sodipodi:docname="pkg_opm_150.svg"
   inkscape:version="1.2.2 (732a01da63, 2022-12-09)"
   inkscape:export-filename="pkg_opm_150.png"
   inkscape:export-xdpi="96"
   inkscape:export-ydpi="96"
   xmlns:inkscape="http://www.inkscape.org/namespaces/inkscape"
   xmlns:sodipodi="http://sodipodi.sourceforge.net/DTD/sodipodi-0.dtd"
   xmlns:xlink="http://www.w3.org/1999/xlink"
   xmlns="http://www.w3.org/2000/svg"
   xmlns:svg="http://www.w3.org/2000/svg">
  <defs
     id="defs233" />
  <sodipodi:namedview
     id="namedview231"
     pagecolor="#ffffff"
     bordercolor="#000000"
     borderopacity="0.25"
     inkscape:showpageshadow="2"
     inkscape:pageopacity="0.0"
     inkscape:pagecheckerboard="0"
     inkscape:deskcolor="#d1d1d1"
     showgrid="true"
     inkscape:zoom="37.916667"
     inkscape:cx="10.153846"
     inkscape:cy="12"
     inkscape:current-layer="svg229">
    <inkscape:grid
       type="xygrid"
       id="grid665" />
  </sodipodi:namedview>
  <linearGradient
     id="a">
    <stop
       offset="0"
       stop-color="#ffe991"
       id="stop180" />
    <stop
       offset="1"
       stop-color="#f5c400"
       id="stop182" />
  </linearGradient>
  <linearGradient
     id="b"
     gradientTransform="matrix(-.27781 0 0 .28332 6.4625 2.1983)"
     gradientUnits="userSpaceOnUse"
     x1="8.5"
     x2="8.1378"
     y1=".64569"
     y2="4.604">
    <stop
       offset="0"
       stop-color="#ffe478"
       id="stop185" />
    <stop
       offset="1"
       stop-color="#fff2c0"
       id="stop187" />
  </linearGradient>
  <linearGradient
     id="c"
     gradientUnits="userSpaceOnUse"
     x1="4.2017"
     x2="4.101"
     y1="3.5027"
     y2="2.3812">
    <stop
       offset="0"
       stop-color="#ca0"
       id="stop190" />
    <stop
       offset="1"
       stop-color="#ffe66c"
       id="stop192" />
  </linearGradient>
  <linearGradient
     id="d"
     gradientTransform="matrix(-.27781 0 0 .27872 6.4623 2.2228)"
     gradientUnits="userSpaceOnUse"
     x1="8.5002"
     x2="16"
     xlink:href="#a"
     y1="7.9959"
     y2="10.996" />
  <linearGradient
     id="e"
     gradientTransform="matrix(.27781 0 0 .27872 1.7396 2.2216)"
     gradientUnits="userSpaceOnUse"
     x1="8.5"
     x2="16"
     xlink:href="#a"
     y1="8"
     y2="11" />
  <radialGradient
     id="f"
     cx=".68065"
     cy="297.02"
     gradientTransform="matrix(.40595 1.0597 -3.8147 1.2755 1133.2 -377.97)"
     gradientUnits="userSpaceOnUse"
     r="1.869">
    <stop
       offset="0"
       stop-color="#fff"
       id="stop197" />
    <stop
       offset=".40133"
       stop-color="#cce0ff"
       id="stop199" />
    <stop
       offset="1"
       stop-color="#5197ff"
       id="stop201" />
  </radialGradient>
  <linearGradient
     id="g"
     gradientUnits="userSpaceOnUse"
     x1="1.9844"
     x2="2.5797"
     y1="1.9844"
     y2="3.5719">
    <stop
       offset="0"
       stop-color="#80b3ff"
       id="stop204" />
    <stop
       offset="1"
       stop-color="#5197ff"
       id="stop206" />
  </linearGradient>
  <path
     d="m1.1318 3.6512c-.57244 0-1.0127-.52613-1.0127-1.2198 0-.69371.61616-1.1193 1.4178-1.2735.20328-.8914.95982-1.0389 1.4178-1.0389.45795 0 1.1946.090623 1.4178 1.2467 1.8318.6937.88947 2.2855.20254 2.2855z"
     fill="url(#f)"
     fill-rule="evenodd"
     stroke="url(#g)"
     stroke-width=".23812"
     id="path209" />
  <g
     stroke-linejoin="round"
     stroke-width=".19844"
     id="g217">
    <path
       d="m4.101 4.2529 2.0836-.77706v1.6132l-2.0836 1.1149z"
       fill="url(#e)"
       stroke="#ca0"
       id="path211" />
    <path
       d="m4.101 4.4525-2.0836-.97665v1.6133l2.0836 1.116z"
       fill="url(#d)"
       stroke="#ca0"
       id="path213" />
    <path
       d="m4.101 2.4805-2.0836.99161 2.0837.99277 2.0836-.99277z"
       fill="url(#b)"
       stroke="url(#c)"
       id="path215" />
  </g>
  <g
     fill="none"
     stroke="#5f8dd3"
     stroke-linecap="round"
     stroke-width=".26458"
     id="g227">
    <path
       d="m3.2643 2.9184 1.8687 1.0034"
       id="path219" />
    <path
       d="m3.0691 3.9218 1.8687-1.0034"
       id="path221" />
    <path
       d="m3.0427 3.9774v1.6186"
       id="path223" />
    <path
       d="m5.1594 3.9774v1.6186"
       id="path225" />
  </g>
</svg>
