<svg width="24" height="24" version="1.1" xmlns="http://www.w3.org/2000/svg">
 <path d="m15.409482 10.874972h6.465518v-6.4642572" fill="none" stroke="#fa0302" stroke-linecap="round" stroke-width="2.25"/>
 <path d="m20.517242 10.551755c-3.49138-7.1276179-11.250001-12.31134-17.392242-2.5918609" fill="none" stroke="#fa0302" stroke-linecap="round" stroke-width="2.25"/>
 <path d="m9.5905173 13.124972h-6.4655173v6.464256" fill="none" stroke="#2a7efe" stroke-linecap="round" stroke-width="2.25"/>
 <path d="m4.4827586 13.448189c3.4913793 7.127667 11.249999 12.311428 17.392241 2.59188" fill="none" stroke="#2a7efe" stroke-linecap="round" stroke-width="2.25"/>
</svg>
