<?xml version="1.0" encoding="UTF-8" standalone="no"?>
<svg
   width="64"
   height="64"
   version="1.1"
   viewBox="0 0 64 64"
   id="svg35"
   sodipodi:docname="Grid_20_64.svg"
   inkscape:export-filename="Grid_20_64.png"
   inkscape:export-xdpi="96"
   inkscape:export-ydpi="96"
   inkscape:version="1.3.2 (091e20e, 2023-11-25, custom)"
   xmlns:inkscape="http://www.inkscape.org/namespaces/inkscape"
   xmlns:sodipodi="http://sodipodi.sourceforge.net/DTD/sodipodi-0.dtd"
   xmlns="http://www.w3.org/2000/svg"
   xmlns:svg="http://www.w3.org/2000/svg">
  <sodipodi:namedview
     id="namedview35"
     pagecolor="#ffffff"
     bordercolor="#000000"
     borderopacity="0.25"
     inkscape:showpageshadow="2"
     inkscape:pageopacity="0.0"
     inkscape:pagecheckerboard="0"
     inkscape:deskcolor="#d1d1d1"
     showgrid="true"
     inkscape:current-layer="svg35">
    <inkscape:grid
       id="grid35"
       units="px"
       originx="0"
       originy="0"
       spacingx="0.5"
       spacingy="0.5"
       empcolor="#0099e5"
       empopacity="0.30196078"
       color="#0099e5"
       opacity="0.14901961"
       empspacing="2"
       dotted="false"
       gridanglex="30"
       gridanglez="30"
       visible="true" />
  </sodipodi:namedview>
  <defs
     id="defs24">
    <linearGradient
       id="d"
       x1="1.5"
       x2="3.5"
       y1="15.5"
       y2="13.5"
       gradientTransform="matrix(4,0,0,4,32,-15.999996)"
       gradientUnits="userSpaceOnUse">
      <stop
         stop-color="#55ffdd"
         offset="0"
         id="stop1" />
      <stop
         stop-color="#8787de"
         offset="1"
         id="stop2" />
    </linearGradient>
    <linearGradient
       id="e"
       x1="1.5"
       x2="3.5"
       y1="15.5"
       y2="13.5"
       gradientTransform="matrix(4,0,0,4,32,-32)"
       gradientUnits="userSpaceOnUse">
      <stop
         stop-color="#d42aff"
         offset="0"
         id="stop3" />
      <stop
         stop-color="#00aad4"
         offset="1"
         id="stop4" />
    </linearGradient>
    <linearGradient
       id="j"
       x1="5.5"
       x2="7.5"
       y1="11.5"
       y2="9.5"
       gradientTransform="matrix(4,0,0,4,3.4e-5,0)"
       gradientUnits="userSpaceOnUse">
      <stop
         stop-color="#ffcc00"
         offset="0"
         id="stop5" />
      <stop
         stop-color="#aaaaff"
         offset="1"
         id="stop6" />
    </linearGradient>
    <linearGradient
       id="c"
       x1="5.5"
       x2="7.5"
       y1="3.5"
       y2="1.5"
       gradientTransform="matrix(4,0,0,4,3.4e-5,0)"
       gradientUnits="userSpaceOnUse">
      <stop
         stop-color="#aaccff"
         offset="0"
         id="stop7" />
      <stop
         stop-color="#ffc9c9"
         offset="1"
         id="stop8" />
    </linearGradient>
    <linearGradient
       id="f"
       x1="9.5"
       x2="11.5"
       y1="15.5"
       y2="13.5"
       gradientTransform="matrix(4,0,0,4,3.4e-5,0)"
       gradientUnits="userSpaceOnUse">
      <stop
         stop-color="#ff6868"
         offset="0"
         id="stop9" />
      <stop
         stop-color="#00ff00"
         offset="1"
         id="stop10" />
    </linearGradient>
    <linearGradient
       id="l"
       x1="5.5"
       x2="7.5"
       y1="5.5"
       y2="7.5"
       gradientTransform="matrix(4,0,0,4,3.4e-5,0)"
       gradientUnits="userSpaceOnUse">
      <stop
         stop-color="#d45500"
         offset="0"
         id="stop11" />
      <stop
         stop-color="#aaffaa"
         offset="1"
         id="stop12" />
    </linearGradient>
    <linearGradient
       id="k"
       x1="1.5"
       x2="3.5"
       y1="11.5"
       y2="9.5"
       gradientTransform="matrix(4,0,0,4,3.4e-5,0)"
       gradientUnits="userSpaceOnUse">
      <stop
         stop-color="#6868ff"
         offset="0"
         id="stop13" />
      <stop
         stop-color="#aaccff"
         offset="1"
         id="stop14" />
    </linearGradient>
    <linearGradient
       id="h"
       x1="5.5"
       x2="7.5"
       y1="15.5"
       y2="13.5"
       gradientTransform="matrix(4,0,0,4,3.4e-5,0)"
       gradientUnits="userSpaceOnUse">
      <stop
         stop-color="#00d400"
         offset="0"
         id="stop15" />
      <stop
         stop-color="#ffc9c9"
         offset="1"
         id="stop16" />
    </linearGradient>
    <linearGradient
       id="b"
       x1="11.5"
       x2="9.5"
       y1="3.5"
       y2="1.5"
       gradientTransform="matrix(4,0,0,4,3.4e-5,0)"
       gradientUnits="userSpaceOnUse">
      <stop
         stop-color="#ff0000"
         offset="0"
         id="stop17" />
      <stop
         stop-color="#ffff51"
         offset="1"
         id="stop18" />
    </linearGradient>
    <linearGradient
       id="a"
       x1="2.5"
       x2="3"
       y1="7"
       y2="5.5"
       gradientTransform="matrix(4,0,0,4,3.4e-5,0)"
       gradientUnits="userSpaceOnUse">
      <stop
         stop-color="#efef00"
         offset="0"
         id="stop19" />
      <stop
         stop-color="#00ff00"
         offset="1"
         id="stop20" />
    </linearGradient>
    <linearGradient
       id="g"
       x1="3"
       x2="1.5"
       y1="3.5"
       y2="1.5"
       gradientTransform="matrix(4,0,0,4,3.4e-5,0)"
       gradientUnits="userSpaceOnUse">
      <stop
         stop-color="#0000ff"
         offset="0"
         id="stop21" />
      <stop
         stop-color="#ff7171"
         offset="1"
         id="stop22" />
    </linearGradient>
    <linearGradient
       id="i"
       x1="1.5"
       x2="3.5"
       y1="15.5"
       y2="13.5"
       gradientTransform="matrix(4,0,0,4,3.4e-5,0)"
       gradientUnits="userSpaceOnUse">
      <stop
         stop-color="#008000"
         offset="0"
         id="stop23" />
      <stop
         stop-color="#6868ff"
         offset="1"
         id="stop24" />
    </linearGradient>
  </defs>
  <path
     d="m 4.000036,63.999996 v -12 h 12.000068 v 12 z"
     fill="url(#i)"
     fill-rule="evenodd"
     id="path24"
     style="fill:url(#i)" />
  <path
     d="M 4.000036,15.999996 V 4 h 12.000068 v 11.999996 z"
     fill="url(#g)"
     fill-rule="evenodd"
     id="path25"
     style="fill:url(#g)" />
  <path
     d="m 4.000036,31.999996 v -12 h 12.000068 v 12 z"
     fill="url(#a)"
     fill-rule="evenodd"
     id="path26"
     style="fill:url(#a)" />
  <path
     d="m 36.000032,4 v 12 h 12 V 4 Z"
     fill="url(#b)"
     fill-rule="evenodd"
     id="path27"
     style="fill:url(#b)" />
  <path
     d="m 32,56.216797 -1.582031,0.484375 c -0.617731,0.189944 -1.278715,-0.120263 -1.527344,-0.716797 L 27.234375,52 H 20 v 12 h 12 z"
     style="fill:url(#h);fill-rule:evenodd"
     id="path5" />
  <path
     d="M 4,48 V 36 h 12.000068 v 12 z"
     fill="url(#k)"
     fill-rule="evenodd"
     id="path29"
     style="fill:url(#k)" />
  <path
     d="M 20,20 V 32 H 32 V 20 Z"
     style="fill:url(#l);fill-rule:evenodd"
     id="path3" />
  <path
     d="m 38.144531,64 -2.117187,-0.876953 c -0.0096,-0.004 -0.01793,-0.0095 -0.02734,-0.01367 V 64 Z"
     style="fill:url(#f);fill-rule:evenodd"
     id="path8" />
  <path
     d="M 36,59.320312 36.681641,57.082031 36,56.400391 Z"
     style="fill:url(#f);fill-rule:evenodd"
     id="path7" />
  <path
     d="M 48,61.851562 47.244141,60.425781 H 44.753906 L 42.845703,64 H 48 Z"
     style="fill:url(#f);fill-rule:evenodd"
     id="path6" />
  <path
     d="M 20,16 V 4.000002 H 32.000064 V 16 Z"
     fill="url(#c)"
     fill-rule="evenodd"
     id="path32"
     style="fill:url(#c)" />
  <path
     d="m 30.175781,48 1.398438,-0.75 V 44.753906 L 27.410156,42.53125 c -0.570584,-0.30351 -0.817399,-0.990703 -0.570312,-1.587891 l 2.037109,-4.916015 c 0.004,-0.0096 0.0095,-0.01793 0.01367,-0.02734 H 20 v 12 z"
     style="fill:url(#j);fill-rule:evenodd"
     id="path4" />
  <path
     d="m 36,20 v 8.894531 c 0.01415,-0.0065 0.02653,-0.01551 0.04102,-0.02148 l 4.919921,-2.033203 c 0.597685,-0.24678 1.285045,9.41e-4 1.587891,0.572265 l 2.207031,4.16211 h 2.490235 L 48,30.162109 V 20 Z"
     style="fill:url(#e);fill-rule:evenodd"
     id="path2" />
  <path
     id="a-8"
     d="m 28,41.424654 4.829429,2.575432 v 4.000001 l -4.823357,2.587584 2.042001,4.915188 5.224728,-1.60394 2.828424,2.828425 -1.593736,5.235872 L 41.424722,64 l 2.575376,-4.829336 4,4e-6 2.560277,4.828868 4.919488,-2.031656 -1.581,-5.240576 2.828424,-2.828433 5.235937,1.594064 L 64,50.575695 l -4.82932,-2.575648 4e-6,-4.000005 4.82324,-2.587556 -2.042008,-4.915208 -5.224693,1.603984 -2.828428,-2.828433 1.593832,-5.235992 -4.917228,-2.03678 -2.575397,4.829432 -4,4e-6 -2.560264,-4.828776 -4.919477,2.031652 1.5809,5.240352 -2.828428,2.828429 -5.236004,-1.59384 z m 12.511006,2.301772 c 1.25568,-3.031496 4.731116,-4.471068 7.762612,-3.215384 3.031501,1.255692 4.471089,4.731128 3.215393,7.762637 -1.255688,3.031488 -4.731125,4.471076 -7.762637,3.215384 -3.031488,-1.2557 -4.471072,-4.73112 -3.215368,-7.762637 z"
     fill="#2a7fff" />
</svg>
