<?xml version="1.0" encoding="UTF-8" standalone="no"?>
<svg
   height="16"
   width="16"
   version="1.1"
   id="svg155"
   sodipodi:docname="menu_goto_bookmark1.svg"
   inkscape:export-filename="menu_goto_bookmark1.png"
   inkscape:export-xdpi="96"
   inkscape:export-ydpi="96"
   inkscape:version="1.2.2 (732a01da63, 2022-12-09)"
   xmlns:inkscape="http://www.inkscape.org/namespaces/inkscape"
   xmlns:sodipodi="http://sodipodi.sourceforge.net/DTD/sodipodi-0.dtd"
   xmlns="http://www.w3.org/2000/svg"
   xmlns:svg="http://www.w3.org/2000/svg">
  <defs
     id="defs159" />
  <sodipodi:namedview
     id="namedview157"
     pagecolor="#ffffff"
     bordercolor="#666666"
     borderopacity="1.0"
     inkscape:showpageshadow="2"
     inkscape:pageopacity="0.0"
     inkscape:pagecheckerboard="0"
     inkscape:deskcolor="#d1d1d1"
     showgrid="true"
     inkscape:zoom="57.375"
     inkscape:cx="7.7298475"
     inkscape:cy="8"
     inkscape:current-layer="svg155">
    <inkscape:grid
       type="xygrid"
       id="grid1419" />
  </sodipodi:namedview>
  <radialGradient
     id="a"
     cx="8"
     cy="7.5"
     gradientUnits="userSpaceOnUse"
     r="6">
    <stop
       offset="0"
       stop-color="#2a7fff"
       id="stop144" />
    <stop
       offset=".69999999"
       stop-color="#4d94ff"
       id="stop146" />
    <stop
       offset="1"
       stop-color="#96bdff"
       id="stop148" />
  </radialGradient>
  <circle
     cx="8"
     cy="7.5"
     fill="url(#a)"
     r="6"
     id="circle151" />
  <path
     d="M 9,11 H 8.0039063 V 5.0839843 L 6.5108729,5.9999999 6.4999999,5 8.0039061,4 h 0.9960937 z"
     fill="#ffffff"
     id="path153-6"
     sodipodi:nodetypes="cccccccc"
     style="fill:#ffffff;stroke-width:0.999999" />
</svg>
