<?xml version="1.0" encoding="UTF-8" standalone="no"?>
<svg
   height="11"
   width="11"
   version="1.1"
   id="svg10"
   sodipodi:docname="state_information_69.svg"
   inkscape:export-filename="state_information_69.png"
   inkscape:export-xdpi="96"
   inkscape:export-ydpi="96"
   inkscape:version="1.2.2 (732a01da63, 2022-12-09)"
   xmlns:inkscape="http://www.inkscape.org/namespaces/inkscape"
   xmlns:sodipodi="http://sodipodi.sourceforge.net/DTD/sodipodi-0.dtd"
   xmlns="http://www.w3.org/2000/svg"
   xmlns:svg="http://www.w3.org/2000/svg">
  <defs
     id="defs14" />
  <sodipodi:namedview
     id="namedview12"
     pagecolor="#ffffff"
     bordercolor="#666666"
     borderopacity="1.0"
     inkscape:showpageshadow="2"
     inkscape:pageopacity="0.0"
     inkscape:pagecheckerboard="0"
     inkscape:deskcolor="#d1d1d1"
     showgrid="true"
     inkscape:zoom="83.454545"
     inkscape:cx="5.5"
     inkscape:cy="5.5"
     inkscape:current-layer="svg10">
    <inkscape:grid
       type="xygrid"
       id="grid810" />
  </sodipodi:namedview>
  <circle
     cx="5.5"
     cy="5.5"
     r="5.5"
     style="fill:#2a7fff;fill-opacity:1;fill-rule:evenodd;stroke:none;stroke-width:1.2;stroke-linecap:round;stroke-linejoin:round"
     id="circle2" />
  <g
     id="g2958"
     transform="translate(7.15,0.5)">
    <path
       d="M -1.65,4.5 V 8"
       fill="none"
       stroke="#2a7fff"
       stroke-linecap="round"
       stroke-width="3"
       id="path405"
       style="fill:none;stroke:#ffffff;stroke-width:0.999999;stroke-dasharray:none"
       sodipodi:nodetypes="cc" />
    <path
       d="M -1.65,2 V 2.35"
       fill="none"
       stroke="#2a7fff"
       stroke-linecap="round"
       stroke-width="3"
       id="path1602"
       style="fill:none;stroke:#ffffff;stroke-width:0.999999;stroke-dasharray:none"
       sodipodi:nodetypes="cc" />
  </g>
</svg>
