<?xml version="1.0" encoding="UTF-8" standalone="no"?>
<svg
   width="24"
   height="24"
   version="1.1"
   viewBox="0 0 24 24"
   id="svg4"
   sodipodi:docname="tcalendardialog.svg"
   inkscape:export-filename="tcalendardialog.png"
   inkscape:export-xdpi="96"
   inkscape:export-ydpi="96"
   inkscape:version="1.3.2 (091e20e, 2023-11-25, custom)"
   xmlns:inkscape="http://www.inkscape.org/namespaces/inkscape"
   xmlns:sodipodi="http://sodipodi.sourceforge.net/DTD/sodipodi-0.dtd"
   xmlns="http://www.w3.org/2000/svg"
   xmlns:svg="http://www.w3.org/2000/svg">
  <defs
     id="defs4" />
  <sodipodi:namedview
     id="namedview4"
     pagecolor="#ffffff"
     bordercolor="#000000"
     borderopacity="0.25"
     inkscape:showpageshadow="2"
     inkscape:pageopacity="0.0"
     inkscape:pagecheckerboard="0"
     inkscape:deskcolor="#d1d1d1"
     showgrid="true"
     inkscape:current-layer="svg4">
    <inkscape:grid
       id="grid4"
       units="px"
       originx="0"
       originy="0"
       spacingx="0.5"
       spacingy="0.5"
       empcolor="#0099e5"
       empopacity="0.30196078"
       color="#0099e5"
       opacity="0.14901961"
       empspacing="2"
       dotted="false"
       gridanglex="30"
       gridanglez="30"
       visible="true" />
  </sodipodi:namedview>
  <rect
     x="1.25"
     y="4.2499828"
     width="21.5"
     height="18.5"
     fill="#f9f9f9"
     stroke="#2a7efe"
     stroke-width="0.5"
     style="paint-order:normal"
     id="rect1" />
  <path
     d="m 2.5,1 h 19 C 22.35,1 23,1.6 23,2.5 V 4 H 1 V 2.5 C 1,1.6 1.6,1 2.5,1 Z"
     fill="#2a7efe"
     id="path1" />
  <rect
     x="6.2447343"
     y="9.2447338"
     width="11.510531"
     height="11.010549"
     fill="#ffffff"
     stroke="#999999"
     stroke-linecap="round"
     stroke-width="0.489468"
     style="paint-order:normal"
     id="rect2" />
  <path
     d="m 7,7 h 9.999983 A 1.0000174,1.0000174 0 0 1 18,8 v 2 H 6 V 8 A 1,1 0 0 1 7,7 Z"
     fill="#d40000"
     style="paint-order:normal"
     id="path2" />
  <path
     d="M 10.402066,17.589 V 12.4109 L 8.860961,13.3972"
     fill="none"
     stroke="#4d4d4d"
     stroke-linecap="round"
     stroke-linejoin="round"
     stroke-width="0.821922"
     id="path3" />
  <path
     d="m 14.160274,12.411 -1.698976,3.1081 m -0.150339,0.5905 c 0,-0.6809 0.551977,-1.2329 1.232877,-1.2329 0.680899,0 1.232876,0.552 1.232876,1.2329 v 0.2466 c 0,0.6808 -0.551977,1.2328 -1.232876,1.2328 -0.6809,0 -1.232877,-0.552 -1.232877,-1.2328 z"
     fill="none"
     stroke="#4d4d4d"
     stroke-linecap="round"
     stroke-linejoin="round"
     stroke-width="0.821918"
     id="path4" />
</svg>
