<?xml version="1.0" encoding="UTF-8" standalone="no"?>
<svg
   width="36"
   height="36"
   version="1.1"
   viewBox="0 0 36 36"
   id="svg11"
   sodipodi:docname="tiphtmldataprovider_150.svg"
   inkscape:version="1.3.2 (091e20e, 2023-11-25, custom)"
   xmlns:inkscape="http://www.inkscape.org/namespaces/inkscape"
   xmlns:sodipodi="http://sodipodi.sourceforge.net/DTD/sodipodi-0.dtd"
   xmlns="http://www.w3.org/2000/svg"
   xmlns:svg="http://www.w3.org/2000/svg">
  <sodipodi:namedview
     id="namedview11"
     pagecolor="#ffffff"
     bordercolor="#000000"
     borderopacity="0.25"
     inkscape:showpageshadow="2"
     inkscape:pageopacity="0.0"
     inkscape:pagecheckerboard="0"
     inkscape:deskcolor="#d1d1d1"
     showgrid="true"
     inkscape:current-layer="svg11">
    <inkscape:grid
       id="grid11"
       units="px"
       originx="0"
       originy="0"
       spacingx="0.5"
       spacingy="0.5"
       empcolor="#0099e5"
       empopacity="0.30196078"
       color="#0099e5"
       opacity="0.14901961"
       empspacing="2"
       dotted="false"
       gridanglex="30"
       gridanglez="30"
       visible="true" />
  </sodipodi:namedview>
  <defs
     id="defs2">
    <radialGradient
       id="b"
       cx="-4.3552999"
       cy="-7.9933"
       r="6.1504998"
       gradientTransform="matrix(.28455648 1.7447632 -1.6445763 .26822039 -4.7776732 19.045083)"
       gradientUnits="userSpaceOnUse">
      <stop
         stop-color="#fff"
         offset="0"
         id="stop1" />
      <stop
         stop-color="#99c1ff"
         offset="1"
         id="stop2" />
    </radialGradient>
  </defs>
  <path
     d="M 27,9.000075 32.25,3.75"
     fill="none"
     stroke="#ff6600"
     stroke-linecap="round"
     stroke-width="1.5"
     id="path2" />
  <path
     d="m28.5 3.75h3.75v3.75"
     fill="none"
     stroke="#ff6600"
     stroke-linecap="round"
     stroke-linejoin="round"
     stroke-width="1.5"
     id="path3" />
  <path
     d="m27 13.5 5.25 5.25"
     fill="none"
     stroke="#ff6600"
     stroke-linecap="round"
     stroke-width="1.5"
     id="path4" />
  <path
     d="m32.25 15v3.75h-3.75"
     fill="none"
     stroke="#ff6600"
     stroke-linecap="round"
     stroke-linejoin="round"
     stroke-width="1.5"
     id="path5" />
  <path
     d="M 5.499998,23.500001 V 0.499998 L 19,0.5 23.5,5 l -2e-6,18.500001 z"
     fill="#f9f9f9"
     fill-rule="evenodd"
     stroke="#2a7efe"
     stroke-width=".999996"
     id="path6" />
  <rect
     x="2"
     y="23"
     width="32"
     height="13"
     ry="2.25"
     fill="#739bdf"
     fill-rule="evenodd"
     stroke-width="1.5"
     style="paint-order:normal"
     id="rect6" />
  <circle
     cx="10.500002"
     cy="12"
     r="8.625001"
     fill="url(#b)"
     stroke-width=".797062"
     id="circle6" />
  <path
     d="m7.855631 3.9672084c0.745162-0.3496199-0.765891-0.01242-0.563135 0.4827786-0.59164 0.117795 0.240051-0.5632298-0.360292-0.256654-0.130545 0.240712-0.657603 0.394442-0.0228 0.343771 0.632647 0.399852 1.154589-0.6093506 1.843872-0.597738 0.480198-0.025302-0.443735 0.403094 0.137085 0.389684-0.289685 0.731232-0.461915 2.086444 0.760477 1.916578 0.0554-0.655078 0.55053-1.132654 1.074368-1.566574 0.528396-0.459554-0.508707-0.0011-0.212475-0.655246-0.208581-0.7031218-1.194152 0.121752-1.523286-0.1493553-0.329133-0.2711071-1.005584 0.3971753-1.133814 0.0927557zm4.523974-0.2056298c-0.848029 0.044211-0.06672 0.2391734 0.233403 0.4994694 0.13263-0.181524 0.05028-0.5522964-0.233403-0.4994694zm1.419846 0.8923554c-0.500847 0.148864-1.138862 1.403361-0.432831 1.52544 0.401788-0.177595 0.501673 0.910892 0.677799 0.06407-0.07656-0.258142-0.23567-1.440929 0.09768-0.68419 0.09493 0.366878 0.874956 0.735697 0.308118 0.800955 0.118245 0.599686-0.954321 0.420508-0.980753-0.04216 0.162423 0.503557-0.46368 0.977638-0.958276 1.105147 0.477829 0.179364 0.517833 0.869543-0.157849 0.618272-0.729411 0.552571 0.623389 1.327984 0.807247 0.416994 0.309049-0.713037 1.367739-0.381923 1.526241 0.246631-0.616358 0.279225 0.476341 0.137265 0.08529-0.323643-0.383697-0.1299-0.813465-0.843105-0.123465-0.352917 0.390192 0.12066 0.789738 1.401963 0.758289 0.44277 0.517254-0.02352 0.165916-1.146243 0.624841-0.670188 0.259793-0.558298 1.195295 0.934791 0.354726 0.542841-0.698199-0.374905-0.940119 0.738522-0.11892 0.597912 0.839871-0.01887-0.10974 1.150814-0.550269 0.530241-0.593955 0.260349-1.543192-0.02973-1.521478-0.863089-0.358244-0.716015 0.08194 0.723604-0.628827 0.353313-1.040784-0.05419-1.615201 0.782392-1.983432 1.620883-0.294277 0.716747-0.256731 1.456704 0.394454 1.931015 0.391084 0.80934 1.39019 0.0047 1.892476 0.236485 0.85368 0.13746 0.408666 1.140947 0.768987 1.7594-0.363575 0.69415-0.347081 1.396836-0.158549 2.139724-0.06729 1.074092 1.318587 0.206604 1.460048-0.345603 0.358833-0.632196 1.065981-1.130643 1.053714-1.95658 0.13506-0.84009 0.900073-1.409766 1.039543-2.254157-0.85464-0.11325-0.905323-1.261198-1.30638-1.876275-0.315654-0.809851 0.487248 0.431873 0.511191 0.710937 0.425009 0.104355 0.299145 1.25939 0.662733 0.765278 0.422663-0.33489 0.924312-1.010718 0.239141-1.374305-0.501242 0.0057-0.59112-1.06548-0.11205-0.316609 1.005553 0.07275 1.481046 2.561424 0.710101-0.410802-0.550689-1.879574-1.839325-3.804446-3.512905-4.674531-0.12186 0.313069-0.426428 0.672493-0.702674 0.217014 0.892887 0.16638-0.601986-0.549869-0.72396-0.480269zm-8.520516 0.903001c-0.602722-0.161236-2.8957778 1.930267-2.8828273 4.811236-0.096015 0.268339 0.13854 1.380241 0.3325695 1.06587-0.180339-0.308543-0.11286-1.585728 0.034575-0.642071 0.1986105 0.675 0.346653 1.758818 1.1796658 1.584813 0.540941 0.237345 0.865623 1.251941 1.426013 0.885167-0.335783 0.601245-0.462927 1.355839-0.368921 1.967031 0.253032 0.833592 1.182168 1.163545 1.513979 1.927528 0.375435 0.846389 0.530668 1.87178 1.259428 2.49966 0.355278 0.241812 1.079634 0.373005 0.354843-0.0015-0.622926-0.643581-0.06888-1.249408 0.367139-1.748305 0.09643-0.423633 0.15427-0.828464 0.704776-0.900876 0.09378-0.571707 0.535547-1.224167 0.482613-1.728744-0.473607-0.426492-1.501003-0.239489-1.751308-0.610643 0.02083-0.809602-1.041647-0.401263-1.318958-1.020988-0.400531-0.0657-1.065901-0.432852-1.066708 0.0098 0.166075-0.529139-0.282881-0.656232-0.664913-0.667094-0.06447-0.397498-0.01527-0.753832-0.527838-0.662308 0.02319-0.327321-0.0026-1.237976-0.225135-0.426282-0.6925408 0.484218-0.8983348-1.619195 0.07746-1.19484 0.436205-0.537497 0.808223 0.249664 0.899063 0.511242-0.210509-0.895884 0.652639-1.451888 1.083753-2.127666 0.185578-0.84534 1.19304-0.07452 1.368019-0.704255-0.299247 0.591656-0.941424-0.737209-0.219895-0.434902 0.634455 0.09952 1.008976-0.437352 0.399583-0.816269 0.0221-0.575947-0.371586-0.331252-0.66717-0.409191-0.03801-0.866657-0.962164-0.09403-0.821713 0.436208-0.269871 0.12939-0.503102 1.058938-0.587237 0.258753-0.177213-0.329567-0.872034-0.528306-0.277024-0.988026 0.23997-0.357063 0.610969-0.641891 0.87825-0.259628 0.467646-0.042-0.347304-0.540201 0.308206-0.517182 0.05063-0.231355 0.387542-0.626284 0.549422-0.302437-0.351 0.344451 0.579585 0.03423 5.22e-4 0.403378-0.787578 0.234499 0.07643 0.452756 0.348211 0.636605 0.395901-0.160611-0.129945-0.960436 0.458493-0.518873 0.258348-0.294875-0.60615-1.114671-0.905323-1.030756-0.171965 0.273357 0.158667-0.143999-0.349661-0.198615-0.508326-0.05462-0.519676 1.013344-1.391952 0.914195zm1.395639-0.715549c0.316815 0.05659-0.661392 1.262691-0.385914 0.290554 0.03753-0.173133 0.208871-0.30313 0.385914-0.290554zm-0.97227 0.03992-0.545754 0.40704c-0.227793 0.586963 1.26945-0.4585 0.545754-0.40704zm4.866857 0.363278c-0.683633 0.238258 0.848965 0.692654 0.669244 0.101489-0.212928-0.08004-0.444766-0.08822-0.669244-0.101489zm1.742835 0.931654c-0.307691 0.257271 0.290516 0.720164 0.267934 1.035498 0.900754 0.01035-0.09282-0.79741-0.267934-1.035498zm-0.1452 0.374225c-0.562788 0.14184-0.15482 0.827865 0.07252 0.186733 0.0132-0.04767 0.0155-0.187042-0.07252-0.186733zm4.966876 1.059613c0.17008 0.332666 0.768142 1.009388 0.609436 1.32702-0.278667-0.231645-0.877284-1.012033-0.609436-1.32702zm-9.176967 0.490305c-0.290961 0.324506 0.619533 0.534873 0.309693 0.03787 0.01807 0.06306-0.321918-0.142275-0.309693-0.03787zm-3.148072 3.370031c-0.513897 0.369274 0.851049 0.11325 0.361518 0.777397 0.331467 0.02199 0.448282-0.673758 0.557941-0.139695 0.362441 0.05303 1.25276 0.06251 0.431966-0.247938-0.429366-0.182766-0.884229-0.352228-1.351425-0.389764zm12.893696 3.245395c-0.367506 0.352734-1.242447 1.126709-0.708979 1.613549 0.406378-0.367854 0.586323-1.072232 0.888996-1.532463-0.0304-0.06763-0.115515-0.08122-0.180017-0.08109z"
     fill="#2ba12b"
     stroke-width="1.24138"
     id="path7" />
  <circle
     cx="10.5"
     cy="12"
     r="8.6999998"
     fill="none"
     stroke="#2a7efe"
     stroke-width=".6"
     id="circle7" />
  <path
     d="m6.560005 29.499998h3.887843m0-2.939993v5.879988m-3.887843-5.879988v5.879988"
     fill="none"
     stroke="#ffffff"
     stroke-linecap="round"
     stroke-linejoin="round"
     stroke-width="1.12001"
     id="path8" />
  <path
     d="m27.420235 26.560005v5.879988h3.324504"
     fill="none"
     stroke="#ffffff"
     stroke-linecap="round"
     stroke-linejoin="round"
     stroke-width="1.12001"
     id="path9" />
  <path
     d="m18.719005 32.439993v-5.879988l2.800939 4.781918 2.800944-4.781918v5.879988"
     fill="none"
     stroke="#ffffff"
     stroke-linecap="round"
     stroke-linejoin="round"
     stroke-width="1.12001"
     id="path10" />
  <path
     d="m14.519654 32.439991v-5.879986m-2.086649 0h4.17333"
     fill="none"
     stroke="#ffffff"
     stroke-linecap="round"
     stroke-linejoin="round"
     stroke-width="1.12001"
     id="path11" />
</svg>
