<?xml version="1.0" encoding="UTF-8" standalone="no"?>
<svg
   width="36"
   height="36"
   version="1.1"
   viewBox="0 0 36 36"
   id="svg8"
   sodipodi:docname="tlazintegeredit_150.svg"
   inkscape:version="1.3.2 (091e20e, 2023-11-25, custom)"
   xmlns:inkscape="http://www.inkscape.org/namespaces/inkscape"
   xmlns:sodipodi="http://sodipodi.sourceforge.net/DTD/sodipodi-0.dtd"
   xmlns="http://www.w3.org/2000/svg"
   xmlns:svg="http://www.w3.org/2000/svg">
  <defs
     id="defs8" />
  <sodipodi:namedview
     id="namedview8"
     pagecolor="#ffffff"
     bordercolor="#000000"
     borderopacity="0.25"
     inkscape:showpageshadow="2"
     inkscape:pageopacity="0.0"
     inkscape:pagecheckerboard="0"
     inkscape:deskcolor="#d1d1d1"
     showgrid="true"
     inkscape:current-layer="svg8">
    <inkscape:grid
       id="grid8"
       units="px"
       originx="0"
       originy="0"
       spacingx="0.5"
       spacingy="0.5"
       empcolor="#0099e5"
       empopacity="0.30196078"
       color="#0099e5"
       opacity="0.14901961"
       empspacing="2"
       dotted="false"
       gridanglex="30"
       gridanglez="30"
       visible="true" />
  </sodipodi:namedview>
  <rect
     x=".5"
     y="9.4999828"
     width="35"
     height="17"
     fill="#ffffff"
     stroke="#2a7efe"
     stroke-linecap="round"
     stroke-linejoin="round"
     style="paint-order:normal"
     id="rect1" />
  <path
     d="m30.5 13v10"
     fill="none"
     stroke="#4d4d4d"
     stroke-linecap="round"
     id="path1" />
  <path
     d="m29.5 12.2 1 0.5 1-0.5"
     fill="none"
     stroke="#4d4d4d"
     stroke-linecap="round"
     id="path2" />
  <path
     d="m29.5 23.800017 1-0.5 1 0.5"
     fill="none"
     stroke="#4d4d4d"
     stroke-linecap="round"
     id="path3" />
  <path
     d="m19.699614 21.299942v-7.599941l-1.857614 1.189114"
     fill="none"
     stroke="#4d4d4d"
     stroke-linecap="round"
     stroke-linejoin="round"
     stroke-width="1.4"
     id="path4" />
  <path
     d="m24.509158 13.7c1.002273 0 1.809158 0.807048 1.809158 1.809524v3.980952c0 1.002476-0.806885 1.809524-1.809158 1.809524-1.002274 0-1.809158-0.807048-1.809158-1.809524v-3.980952c0-1.002476 0.806884-1.809524 1.809158-1.809524z"
     fill="none"
     stroke="#4d4d4d"
     stroke-linecap="round"
     stroke-linejoin="round"
     stroke-width="1.4"
     id="path5" />
  <path
     d="m15.3 21.299942v-7.599941l-1.857614 1.189114"
     fill="none"
     stroke="#4d4d4d"
     stroke-linecap="round"
     stroke-linejoin="round"
     stroke-width="1.4"
     id="path6" />
  <path
     d="m5.55 21.300016 4.9-7.600032"
     fill="none"
     stroke="#4d4d4d"
     stroke-linecap="round"
     stroke-linejoin="round"
     stroke-width="1.4"
     id="path7" />
  <ellipse
     cx="10.5"
     cy="20.216671"
     rx="1.2679927"
     ry="1.2666705"
     fill="none"
     stroke="#4d4d4d"
     stroke-linejoin="round"
     stroke-width=".9"
     id="ellipse7" />
  <ellipse
     cx="5.5"
     cy="14.78333"
     rx="1.2679927"
     ry="1.2666705"
     fill="none"
     stroke="#4d4d4d"
     stroke-linejoin="round"
     stroke-width=".9"
     id="ellipse8" />
</svg>
