<?xml version="1.0" encoding="UTF-8" standalone="no"?>
<svg
   height="32"
   width="32"
   version="1.1"
   id="svg412"
   sodipodi:docname="scale_200.svg"
   inkscape:export-filename="scale_200.png"
   inkscape:export-xdpi="96"
   inkscape:export-ydpi="96"
   inkscape:version="1.2.1 (9c6d41e410, 2022-07-14)"
   xmlns:inkscape="http://www.inkscape.org/namespaces/inkscape"
   xmlns:sodipodi="http://sodipodi.sourceforge.net/DTD/sodipodi-0.dtd"
   xmlns="http://www.w3.org/2000/svg"
   xmlns:svg="http://www.w3.org/2000/svg">
  <defs
     id="defs416" />
  <sodipodi:namedview
     id="namedview414"
     pagecolor="#ffffff"
     bordercolor="#666666"
     borderopacity="1.0"
     inkscape:showpageshadow="2"
     inkscape:pageopacity="0.0"
     inkscape:pagecheckerboard="0"
     inkscape:deskcolor="#d1d1d1"
     showgrid="true"
     inkscape:zoom="28.6875"
     inkscape:cx="16"
     inkscape:cy="16"
     inkscape:current-layer="svg412">
    <inkscape:grid
       type="xygrid"
       id="grid535" />
  </sodipodi:namedview>
  <linearGradient
     id="a"
     gradientTransform="matrix(2,0,0,2.3333332,32,-16.833334)"
     gradientUnits="userSpaceOnUse"
     x1="-12.90909"
     x2="-7.818182"
     y1="9.318182"
     y2="13.681818">
    <stop
       offset="0"
       stop-color="#b9d6ff"
       id="stop358" />
    <stop
       offset="1"
       stop-color="#84a3df"
       id="stop360" />
  </linearGradient>
  <linearGradient
     id="b"
     gradientTransform="matrix(2,0,0,2.3333332,32,-16.833334)"
     gradientUnits="userSpaceOnUse"
     x1="-7.5"
     x2="-14.5"
     y1="14.5"
     y2="8.5">
    <stop
       offset="0"
       stop-color="#5f8dd3"
       id="stop363" />
    <stop
       offset="1"
       stop-color="#87aade"
       id="stop365" />
  </linearGradient>
  <path
     style="fill:none;stroke:#999999;stroke-width:2;stroke-linecap:butt;stroke-linejoin:miter;stroke-opacity:1;stroke-dasharray:2, 2;stroke-dashoffset:0"
     d="m 20,9 h 9 V 29 H 9 v -9"
     id="path957" />
  <g
     id="g3833">
    <path
       d="m 25,20 v 5 h -5"
       id="path368"
       style="fill:none;stroke:#ff7f00;stroke-width:2;stroke-linecap:round;stroke-linejoin:round;stroke-dasharray:none;stroke-opacity:1"
       sodipodi:nodetypes="ccc" />
    <path
       d="M 24,24 19.5,19.5"
       stroke-width="3"
       id="path370"
       style="fill:none;stroke:#ff7f00;stroke-width:2.5;stroke-linecap:round;stroke-linejoin:round;stroke-dasharray:none;stroke-opacity:1"
       sodipodi:nodetypes="cc" />
  </g>
  <path
     d="M 3,3 H 17 V 17 H 3 Z"
     fill="url(#a)"
     fill-rule="evenodd"
     stroke="url(#b)"
     stroke-linejoin="round"
     stroke-opacity="0.976471"
     id="path408"
     style="fill:url(#a);stroke:url(#b);stroke-width:2" />
</svg>
