<?xml version="1.0" encoding="UTF-8" standalone="no"?>
<svg
   height="16"
   viewBox="0 0 4.2333332 4.2333335"
   width="16"
   version="1.1"
   id="svg2"
   sodipodi:docname="Repeat_03_16.svg"
   inkscape:version="1.2.1 (9c6d41e410, 2022-07-14)"
   xml:space="preserve"
   inkscape:export-filename="Repeat_03_16.png"
   inkscape:export-xdpi="96"
   inkscape:export-ydpi="96"
   xmlns:inkscape="http://www.inkscape.org/namespaces/inkscape"
   xmlns:sodipodi="http://sodipodi.sourceforge.net/DTD/sodipodi-0.dtd"
   xmlns="http://www.w3.org/2000/svg"
   xmlns:svg="http://www.w3.org/2000/svg"><defs
     id="defs6" /><sodipodi:namedview
     id="namedview4"
     pagecolor="#ffffff"
     bordercolor="#666666"
     borderopacity="1.0"
     inkscape:showpageshadow="2"
     inkscape:pageopacity="0.0"
     inkscape:pagecheckerboard="0"
     inkscape:deskcolor="#d1d1d1"
     showgrid="true"
     inkscape:zoom="57.375"
     inkscape:cx="6.0130719"
     inkscape:cy="8"
     inkscape:current-layer="g846"><inkscape:grid
       type="xygrid"
       id="grid1292" /></sodipodi:namedview><g
     id="g846"><path
       style="fill:none;stroke:#00aad4;stroke-width:0.396875;stroke-linecap:round;stroke-linejoin:round;stroke-miterlimit:5.6;stroke-dasharray:none;stroke-opacity:1"
       id="path297"
       sodipodi:type="arc"
       sodipodi:cx="2.1166668"
       sodipodi:cy="2.1166666"
       sodipodi:rx="1.8520833"
       sodipodi:ry="1.8520833"
       sodipodi:start="0.40142573"
       sodipodi:end="5.8049651"
       sodipodi:arc-type="arc"
       d="M 3.8215185,2.8403332 A 1.8520833,1.8520833 0 0 1 1.7823303,3.9383229 1.8520833,1.8520833 0 0 1 0.26594861,2.187764 1.8520833,1.8520833 0 0 1 1.64356,0.32602908 1.8520833,1.8520833 0 0 1 3.7609749,1.2643382"
       sodipodi:open="true" /><path
       style="fill:none;stroke:#00aad4;stroke-width:0.264583;stroke-linecap:round;stroke-linejoin:miter;stroke-dasharray:none;stroke-opacity:1"
       d="m 3.9687498,0.66145816 2e-7,0.79375024 -0.7937502,-2e-7"
       id="path907"
       sodipodi:nodetypes="ccc" /><path
       style="fill:none;stroke:#ff7f2a;stroke-width:0.529167;stroke-linecap:round;stroke-linejoin:miter;stroke-dasharray:none;stroke-opacity:1"
       d="M 2.1166667,1.190625 V 2.2489583"
       id="path1059"
       sodipodi:nodetypes="cc" /><circle
       style="fill:#ff7f2a;fill-opacity:1;stroke:none;stroke-width:0.396875;stroke-linecap:round;stroke-linejoin:round;stroke-miterlimit:5.6;stroke-dasharray:none;stroke-opacity:1"
       id="path1115"
       cx="2.1166666"
       cy="3.0427084"
       r="0.26458332" /></g></svg>
