<?xml version="1.0" encoding="UTF-8" standalone="no"?>
<svg
   height="32"
   width="32"
   version="1.1"
   id="svg284"
   sodipodi:docname="Refresh_03_32.svg"
   inkscape:export-filename="Refresh_03_32.png"
   inkscape:export-xdpi="96"
   inkscape:export-ydpi="96"
   inkscape:version="1.2-beta (1b65182ce9, 2022-04-05)"
   xmlns:inkscape="http://www.inkscape.org/namespaces/inkscape"
   xmlns:sodipodi="http://sodipodi.sourceforge.net/DTD/sodipodi-0.dtd"
   xmlns="http://www.w3.org/2000/svg"
   xmlns:svg="http://www.w3.org/2000/svg">
  <defs
     id="defs288" />
  <sodipodi:namedview
     id="namedview286"
     pagecolor="#ffffff"
     bordercolor="#666666"
     borderopacity="1.0"
     inkscape:pageshadow="2"
     inkscape:pageopacity="0.0"
     inkscape:pagecheckerboard="0"
     inkscape:deskcolor="#d1d1d1"
     showgrid="true"
     inkscape:zoom="28.6875"
     inkscape:cx="16"
     inkscape:cy="16"
     inkscape:current-layer="svg284">
    <inkscape:grid
       type="xygrid"
       id="grid1119" />
  </sodipodi:namedview>
  <g
     fill="none"
     stroke="#00aad4"
     stroke-linecap="round"
     stroke-width="3"
     transform="translate(1 -.000019)"
     id="g282">
    <path
       d="m18.87931 14.499981h8.62069v-8.6190079"
       id="path274" />
    <path
       d="m25.689656 14.069025c-4.655174-9.5034899-15-16.4151199-23.189656-3.455814"
       id="path276" />
    <path
       d="m11.12069 17.499981h-8.62069v8.619008"
       id="path278" />
    <path
       d="m4.3103448 17.930937c4.6551732 9.503556 14.9999992 16.415238 23.1896552 3.45584"
       id="path280" />
  </g>
</svg>
