<?xml version="1.0" encoding="UTF-8" standalone="no"?>
<svg
   width="32"
   height="32"
   viewBox="0 0 32 32"
   version="1.1"
   id="svg1"
   sodipodi:docname="tag_sup_200.svg"
   inkscape:version="1.3.2 (091e20e, 2023-11-25, custom)"
   inkscape:export-filename="tag_sup_200.png"
   inkscape:export-xdpi="96"
   inkscape:export-ydpi="96"
   xmlns:inkscape="http://www.inkscape.org/namespaces/inkscape"
   xmlns:sodipodi="http://sodipodi.sourceforge.net/DTD/sodipodi-0.dtd"
   xmlns="http://www.w3.org/2000/svg"
   xmlns:svg="http://www.w3.org/2000/svg">
  <defs
     id="defs1" />
  <sodipodi:namedview
     id="namedview1"
     pagecolor="#ffffff"
     bordercolor="#000000"
     borderopacity="0.25"
     inkscape:showpageshadow="2"
     inkscape:pageopacity="0.0"
     inkscape:pagecheckerboard="0"
     inkscape:deskcolor="#d1d1d1"
     showgrid="true"
     inkscape:current-layer="svg1">
    <inkscape:grid
       id="grid1"
       units="px"
       originx="0"
       originy="0"
       spacingx="0.5"
       spacingy="0.5"
       empcolor="#0099e5"
       empopacity="0.30196078"
       color="#0099e5"
       opacity="0.14901961"
       empspacing="2"
       dotted="false"
       gridanglex="30"
       gridanglez="30"
       visible="true" />
  </sodipodi:namedview>
  <g
     fill="#00aad4"
     id="g2-3"
     transform="scale(3.7795275)"
     style="fill:#008dd2;fill-opacity:1">
    <path
       d="M 6.6534688,2.3266625 7.6380999,1.0568934 C 7.7555598,0.90541959 7.8258516,0.67695329 7.7249618,0.49705679 7.6357519,0.33798509 7.4102041,0.31824109 7.2535985,0.37995699 7.1198867,0.43265089 7.0464228,0.57602069 7.034151,0.71345629 c -0.1262838,-0.001208 -0.2574056,0.00242 -0.3806818,-0.0018 0.032966,-0.2658066 0.1746937,-0.5375954 0.4319602,-0.6463906 0.2150514,-0.090944 0.4661633,-0.082124 0.6837557,-0.00276 0.2200429,0.080258 0.3570489,0.3001233 0.3776095,0.528832 C 8.1718746,0.87031229 8.0385667,1.1292555 7.874755,1.3446655 L 7.173073,2.2673628 H 8.1653717 V 2.6453376 H 6.6534692 Z"
       stroke-width="0.264584"
       id="path1-1"
       style="fill:#008dd2;fill-opacity:1" />
    <text
       stroke-linejoin="round"
       stroke-width="0.396875"
       x="1.550722"
       y="1.322915"
       id="text1-1"
       style="fill:#008dd2;fill-opacity:1"><tspan
         stroke-width="0.396875"
         x="1.550722"
         y="1.322915"
         id="tspan1-7"
         style="fill:#008dd2;fill-opacity:1" /></text>
    <path
       d="m 1.4281012,1.4922371 1.821391,2.6945796 -1.9054089,2.7876002 h 1.194258 L 3.8376173,5.0750077 5.0828875,6.9744169 H 6.2771397 L 4.3957365,4.2288258 6.1931298,1.4922371 H 4.9928676 L 3.8346154,3.3736415 2.6283572,1.4922371 Z"
       stroke-width="0.264584"
       id="path2-0"
       style="fill:#008dd2;fill-opacity:1" />
  </g>
</svg>
