<?xml version="1.0" encoding="UTF-8" standalone="no"?>
<svg
   height="48"
   width="48"
   version="1.1"
   id="svg656"
   sodipodi:docname="Grid_02_48.svg"
   inkscape:export-filename="Grid_02_48.png"
   inkscape:export-xdpi="96"
   inkscape:export-ydpi="96"
   inkscape:version="1.2-beta (1b65182ce9, 2022-04-05)"
   xmlns:inkscape="http://www.inkscape.org/namespaces/inkscape"
   xmlns:sodipodi="http://sodipodi.sourceforge.net/DTD/sodipodi-0.dtd"
   xmlns="http://www.w3.org/2000/svg"
   xmlns:svg="http://www.w3.org/2000/svg">
  <defs
     id="defs660" />
  <sodipodi:namedview
     id="namedview658"
     pagecolor="#ffffff"
     bordercolor="#666666"
     borderopacity="1.0"
     inkscape:pageshadow="2"
     inkscape:pageopacity="0.0"
     inkscape:pagecheckerboard="0"
     inkscape:deskcolor="#d1d1d1"
     showgrid="true"
     inkscape:zoom="19.124997"
     inkscape:cx="24.000004"
     inkscape:cy="24.000004"
     inkscape:current-layer="svg656">
    <inkscape:grid
       type="xygrid"
       id="grid1176" />
  </sodipodi:namedview>
  <linearGradient
     id="a"
     gradientTransform="matrix(0 -1.5 -1.5 0 24 24)"
     gradientUnits="userSpaceOnUse"
     x1="9"
     x2="6"
     y1="10"
     y2="10.5">
    <stop
       offset="0"
       stop-color="#72cef6"
       id="stop626" />
    <stop
       offset="1"
       stop-color="#d2f5f8"
       id="stop628" />
  </linearGradient>
  <linearGradient
     id="b"
     gradientTransform="matrix(0 -1.5 -1.5 0 24 24)"
     gradientUnits="userSpaceOnUse"
     x1="10"
     x2="5"
     y1="12.5"
     y2="12.5">
    <stop
       offset="0"
       stop-color="#4674a8"
       id="stop631" />
    <stop
       offset="1"
       stop-color="#42a0ce"
       id="stop633" />
  </linearGradient>
  <path
     d="m-35.489361 12.510639h22.978724v22.978724h-22.978724z"
     style="fill:#fff;stroke:#999;stroke-width:1.02128;stroke-linecap:round;stroke-linejoin:round;stroke-dashoffset:1.49998"
     transform="matrix(0 -2 2 0 -24.000001 -23.999999)"
     id="path636" />
  <g
     fill="none"
     stroke="#b3b3b3"
     transform="matrix(0 -2 -2 0 47.999999 48.000001)"
     id="g648">
    <path
       d="m1 18.5h22"
       id="path638" />
    <path
       d="m6.5 23v-22"
       id="path640" />
    <path
       d="m23 5.5h-22"
       id="path642" />
    <path
       d="m18.5 23v-22"
       id="path644" />
    <path
       d="m12.5 23v-22"
       id="path646" />
  </g>
  <g
     stroke-linejoin="round"
     transform="matrix(0 2 -2 0 47.999999 .000001)"
     id="g654">
    <path
       d="m.5-16.5h23v8h-23z"
       fill="none"
       opacity=".5"
       stroke="#fff"
       stroke-dashoffset="1.49998"
       transform="scale(1 -1)"
       id="path650" />
    <path
       d="m23.5 15.5h-23v-6h23z"
       fill="url(#a)"
       stroke="url(#b)"
       stroke-linecap="round"
       id="path652" />
  </g>
</svg>
