<?xml version="1.0" encoding="UTF-8" standalone="no"?>
<svg
   width="32"
   height="32"
   version="1.1"
   viewBox="0 0 32 32"
   id="svg5"
   sodipodi:docname="Random_01_32.svg"
   inkscape:version="1.3.2 (091e20e, 2023-11-25, custom)"
   xmlns:inkscape="http://www.inkscape.org/namespaces/inkscape"
   xmlns:sodipodi="http://sodipodi.sourceforge.net/DTD/sodipodi-0.dtd"
   xmlns="http://www.w3.org/2000/svg"
   xmlns:svg="http://www.w3.org/2000/svg">
  <defs
     id="defs5" />
  <sodipodi:namedview
     id="namedview5"
     pagecolor="#ffffff"
     bordercolor="#000000"
     borderopacity="0.25"
     inkscape:showpageshadow="2"
     inkscape:pageopacity="0.0"
     inkscape:pagecheckerboard="0"
     inkscape:deskcolor="#d1d1d1"
     showgrid="true"
     inkscape:current-layer="svg5">
    <inkscape:grid
       id="grid5"
       units="px"
       originx="0"
       originy="0"
       spacingx="0.5"
       spacingy="0.5"
       empcolor="#0099e5"
       empopacity="0.30196078"
       color="#0099e5"
       opacity="0.14901961"
       empspacing="2"
       dotted="false"
       gridanglex="30"
       gridanglez="30"
       visible="true" />
  </sodipodi:namedview>
  <path
     d="m25.000046 7.999964 4.000018 2.000009-4.000018 2.000008z"
     fill="#ff1a1a"
     stroke="#ff1a1a"
     stroke-linecap="round"
     stroke-linejoin="round"
     stroke-width="2.00001"
     id="path1" />
  <path
     d="m25.000046 20.000018 4.000018 2.000009-4.000018 2.000009z"
     fill="#2a7efe"
     stroke="#2a7efe"
     stroke-linecap="round"
     stroke-linejoin="round"
     stroke-width="2.00001"
     id="path2" />
  <path
     d="m24.000041 9.999973c-2.000009 0-4.000018 1.000003-5.000023 2.000008l-8.000036 8.000037c-1.000005 1.000004-3.000014 2.000009-5.000023 2.000009h-3.000014"
     fill="none"
     stroke="#ff1a1a"
     stroke-linejoin="round"
     stroke-width="2.00001"
     id="path3" />
  <path
     d="m12.999991 13.99999-1.893285-1.893285c-1.106729-1.106729-3.106738-2.106732-5.106747-2.106732h-3.000014"
     fill="none"
     stroke="#2a7efe"
     stroke-linejoin="round"
     stroke-width="2.00001"
     id="path4" />
  <path
     d="m24.000041 22.000027c-2.000009 0-4.000018-1.000005-5.000023-2.000009l-2.000009-2.00001"
     fill="none"
     stroke="#2a7efe"
     stroke-linejoin="round"
     stroke-width="2.00001"
     id="path5" />
</svg>
