<svg width="24" height="24" version="1.1" xmlns="http://www.w3.org/2000/svg">
 <defs>
  <radialGradient id="a" cx="12.1" cy="10.900001" r="4.5" gradientTransform="matrix(0,1.5892257,-1.5892254,2.9972888e-8,32.677102,-3.8750849)" gradientUnits="userSpaceOnUse">
   <stop stop-color="#ff7f2a" offset="0"/>
   <stop stop-color="#d45500" offset="1"/>
  </radialGradient>
 </defs>
 <g stroke="#ffffff" stroke-linecap="round">
  <circle transform="matrix(0,1,1,0,0,0)" cx="17.5" cy="17.5" r="5.9000001" fill="url(#a)" stroke-dashoffset="1.49998" stroke-linejoin="round" stroke-width="1.2"/>
  <path d="m17.125008 20.124935-2.624936-2.624828 2.624936-2.625045" fill="none" stroke-linejoin="round" stroke-width="1.49996"/>
  <path d="m14.500072 17.500092h5.999856" fill="none" stroke-width="1.49996px"/>
 </g>
</svg>
