<?xml version="1.0" encoding="UTF-8" standalone="no"?>
<svg
   height="16"
   width="16"
   version="1.1"
   id="svg155"
   sodipodi:docname="Cut_03_16.svg"
   inkscape:export-filename="Cut_03_16.png"
   inkscape:export-xdpi="96"
   inkscape:export-ydpi="96"
   inkscape:version="1.2.2 (732a01da63, 2022-12-09)"
   xmlns:inkscape="http://www.inkscape.org/namespaces/inkscape"
   xmlns:sodipodi="http://sodipodi.sourceforge.net/DTD/sodipodi-0.dtd"
   xmlns="http://www.w3.org/2000/svg"
   xmlns:svg="http://www.w3.org/2000/svg">
  <defs
     id="defs159" />
  <sodipodi:namedview
     id="namedview157"
     pagecolor="#ffffff"
     bordercolor="#000000"
     borderopacity="0.25"
     inkscape:showpageshadow="2"
     inkscape:pageopacity="0.0"
     inkscape:pagecheckerboard="0"
     inkscape:deskcolor="#d1d1d1"
     showgrid="true"
     inkscape:zoom="56.875"
     inkscape:cx="7.9296703"
     inkscape:cy="8"
     inkscape:current-layer="svg155">
    <inkscape:grid
       type="xygrid"
       id="grid970" />
  </sodipodi:namedview>
  <g
     stroke="#00aad4"
     id="g151">
    <path
       d="m5.3.375c-1.8 1.125.2 5.625 1.3 8.125l-1.1 2.6.8 1.4 1.7-2.5 1.7 2.5.8-1.4-1.1-2.6c1.1-2.5 3.1-7 1.3-8.125l-2.7 6.125z"
       fill="#c2f3ff"
       fill-rule="evenodd"
       stroke-linejoin="round"
       stroke-width=".75"
       id="path143" />
    <g
       fill="none"
       stroke-dashoffset="1.49998"
       stroke-width="1.00051"
       id="g149">
      <ellipse
         cx="-7.94175"
         cy="11.968819"
         rx="1.643221"
         ry="2.234606"
         transform="matrix(-.97401041 -.22650325 -.27031482 .96277199 0 0)"
         id="ellipse145" />
      <ellipse
         cx="7.478375"
         cy="15.596579"
         rx="1.643221"
         ry="2.234606"
         transform="matrix(.97401041 -.22650325 .27031482 .96277199 0 0)"
         id="ellipse147" />
    </g>
  </g>
  <circle
     cx="8"
     cy="8.25"
     fill="#00aad4"
     r=".6"
     id="circle153" />
</svg>
