<?xml version="1.0" encoding="UTF-8" standalone="no"?>
<svg
   height="16"
   width="16"
   version="1.1"
   id="svg159"
   sodipodi:docname="Folder_09_16.svg"
   inkscape:export-filename="Folder_09_16.png"
   inkscape:export-xdpi="96"
   inkscape:export-ydpi="96"
   inkscape:version="1.2 (dc2aedaf03, 2022-05-15)"
   xmlns:inkscape="http://www.inkscape.org/namespaces/inkscape"
   xmlns:sodipodi="http://sodipodi.sourceforge.net/DTD/sodipodi-0.dtd"
   xmlns="http://www.w3.org/2000/svg"
   xmlns:svg="http://www.w3.org/2000/svg">
  <defs
     id="defs163">
    <linearGradient
       id="a"
       gradientUnits="userSpaceOnUse"
       x1="14.084459"
       x2="8.9155407"
       y1="14.084459"
       y2="8.9155407"
       gradientTransform="matrix(0.99150328,0,0,0.99150326,0.09771238,0.09771254)">
      <stop
         offset="0"
         stop-color="#009600"
         id="stop2" />
      <stop
         offset="1"
         stop-color="#6edb39"
         id="stop4" />
    </linearGradient>
  </defs>
  <sodipodi:namedview
     id="namedview161"
     pagecolor="#ffffff"
     bordercolor="#666666"
     borderopacity="1.0"
     inkscape:pageshadow="2"
     inkscape:pageopacity="0.0"
     inkscape:pagecheckerboard="0"
     inkscape:deskcolor="#d1d1d1"
     showgrid="true"
     inkscape:zoom="57.375"
     inkscape:cx="7.9912854"
     inkscape:cy="8"
     inkscape:current-layer="svg159"
     inkscape:showpageshadow="2">
    <inkscape:grid
       type="xygrid"
       id="grid836" />
  </sodipodi:namedview>
  <g
     id="g1529"
     transform="translate(0,-1)">
    <path
       d="m 0.5,6.5 v -3 c 0,-0.5 0.5,-1 1,-1 h 3 c 0.5,0 1,0.5 1,1 h 10 v 3"
       stroke-linejoin="round"
       id="path145-8"
       style="fill:#fff3cc;fill-opacity:1;stroke:#f4c025;stroke-linecap:round;stroke-opacity:1"
       sodipodi:nodetypes="ccccccc" />
    <path
       d="m 15.5,6.5 h -15 v 8 h 15 z"
       stroke-linejoin="round"
       id="path147"
       style="fill:#f4c025;fill-opacity:1;stroke:#f4c025;stroke-linecap:round;stroke-opacity:1"
       sodipodi:nodetypes="ccccc" />
  </g>
  <g
     id="g1628">
    <circle
       cx="11.5"
       cy="11.5"
       fill="url(#a)"
       stroke-dashoffset="1.49998"
       stroke-linejoin="round"
       stroke-width="0.72973"
       transform="matrix(0,1,1,0,0,0)"
       id="circle7"
       style="fill:url(#a);stroke:#ffffff;stroke-width:0.8;stroke-linecap:round;stroke-dasharray:none"
       r="4.0999999" />
    <g
       id="g1622">
      <path
         d="m 11.5,9.5 v 4"
         id="path9"
         style="fill:none;stroke:#ffffff;stroke-linecap:round" />
      <path
         d="m 13.5,11.5 h -4"
         id="path11"
         style="fill:none;stroke:#ffffff;stroke-linecap:round" />
    </g>
  </g>
</svg>
