<?xml version="1.0" encoding="UTF-8" standalone="no"?>
<svg
   width="36"
   height="36"
   version="1.1"
   viewBox="0 0 36 36"
   id="svg6"
   sodipodi:docname="tdirectoryedit_150.svg"
   inkscape:export-filename="tdirectoryedit_150.png"
   inkscape:export-xdpi="96"
   inkscape:export-ydpi="96"
   inkscape:version="1.3.2 (091e20e, 2023-11-25, custom)"
   xmlns:inkscape="http://www.inkscape.org/namespaces/inkscape"
   xmlns:sodipodi="http://sodipodi.sourceforge.net/DTD/sodipodi-0.dtd"
   xmlns="http://www.w3.org/2000/svg"
   xmlns:svg="http://www.w3.org/2000/svg">
  <sodipodi:namedview
     id="namedview6"
     pagecolor="#ffffff"
     bordercolor="#000000"
     borderopacity="0.25"
     inkscape:showpageshadow="2"
     inkscape:pageopacity="0.0"
     inkscape:pagecheckerboard="0"
     inkscape:deskcolor="#d1d1d1"
     showgrid="true"
     inkscape:current-layer="svg6">
    <inkscape:grid
       id="grid6"
       units="px"
       originx="0"
       originy="0"
       spacingx="0.5"
       spacingy="0.5"
       empcolor="#0099e5"
       empopacity="0.30196078"
       color="#0099e5"
       opacity="0.14901961"
       empspacing="2"
       dotted="false"
       gridanglex="30"
       gridanglez="30"
       visible="true" />
  </sodipodi:namedview>
  <defs
     id="defs4">
    <linearGradient
       id="b"
       x1="-28.000051"
       x2="-7.5000529"
       y1="1031.3622"
       y2="1034.3622"
       gradientTransform="translate(36.000053,2)"
       gradientUnits="userSpaceOnUse">
      <stop
         stop-color="#fdbd17"
         offset="0"
         id="stop1" />
      <stop
         stop-color="#e3a726"
         offset="1"
         id="stop2" />
    </linearGradient>
    <linearGradient
       id="a"
       x1="-27.768297"
       x2="-8.2560968"
       y1="1036.5144"
       y2="1045.21"
       gradientTransform="matrix(1.0249997,0,0,1.15,36.462497,-154.6293)"
       gradientUnits="userSpaceOnUse">
      <stop
         stop-color="#ffe496"
         offset="0"
         id="stop3" />
      <stop
         stop-color="#ffcc40"
         offset="1"
         id="stop4" />
    </linearGradient>
  </defs>
  <g
     transform="translate(0,-1016.3622)"
     id="g6">
    <rect
       x="24.499998"
       y="1018.8622"
       width="10.000003"
       height="10"
       fill="#ffffff"
       stroke="#2a7efe"
       stroke-linecap="round"
       stroke-linejoin="round"
       stroke-width=".999998"
       style="paint-order:normal"
       id="rect4" />
    <rect
       x="2.4999981"
       y="1018.8622"
       width="22"
       height="10.000001"
       fill="#ffffff"
       fill-rule="evenodd"
       stroke="#2a7efe"
       stroke-linecap="round"
       stroke-linejoin="round"
       stroke-width=".999996"
       style="paint-order:normal"
       id="rect5" />
    <circle
       cx="29.5"
       cy="1023.8622"
       r="2.75"
       fill="#c8ab37"
       id="circle5" />
    <path
       d="m7 1039.3622 1e-6 -5.9998c-2e-5 -0.5523 0.447722-1.0001 1.000051-1.0001l6-1e-4c0.552289 0 1.000007 0.4477 1 1v1l13.000042 1e-4c0.552229 0 0.999898 0.4477 0.999906 0.9999l-1e-5 4z"
       fill="url(#b)"
       id="path5" />
    <path
       d="m27.773801 1036.6122h-19.54761c-0.5391515 0-0.9762135 0.4681-0.97619 1.0455v9.409c-2.35e-5 0.5774 0.4370385 1.0455 0.97619 1.0455h19.547609c0.539152 0 0.976213-0.4681 0.97619-1.0455v-9.409c2.3e-5 -0.5774-0.437038-1.0455-0.976189-1.0455z"
       fill="url(#a)"
       stroke="#edb020"
       stroke-width=".5"
       id="path6" />
  </g>
</svg>
