<svg width="24" height="24" version="1.0" xmlns="http://www.w3.org/2000/svg" xmlns:xlink="http://www.w3.org/1999/xlink">
 <defs>
  <radialGradient id="b" cx="-6" cy="4" r="2.5" gradientTransform="matrix(1.8,0,0,1.5,25.3,10.5)" gradientUnits="userSpaceOnUse">
   <stop stop-color="#ffffff" offset="0"/>
   <stop stop-color="#37abc8" offset="1"/>
  </radialGradient>
  <radialGradient id="a" cx="-6" cy="4" r="2.5" gradientTransform="matrix(1.8,0,0,1.5,25.3,0)" gradientUnits="userSpaceOnUse">
   <stop stop-color="#ffffff" offset="0"/>
   <stop stop-color="#37abc8" offset="1"/>
  </radialGradient>
 </defs>
 <path d="m15.25 6.75h-10.5v-6" fill="none" stroke="#b3b3b3" stroke-linecap="square" stroke-width="1.5px"/>
 <circle cx="15.25" cy="6.75" r="3.75" fill="url(#a)" fill-rule="evenodd" stroke-width="1.5" style="paint-order:normal"/>
 <path d="m15.25 17.25h-7.5v-10.5" fill="none" stroke="#b3b3b3" stroke-linecap="square" stroke-width="1.5px"/>
 <circle cx="15.25" cy="17.25" r="3.75" fill="url(#b)" fill-rule="evenodd" stroke-width="1.5" style="paint-order:normal"/>
</svg>
