<?xml version="1.0" encoding="UTF-8" standalone="no"?>
<svg
   height="24"
   width="24"
   version="1.1"
   id="svg30"
   sodipodi:docname="menu_source_invertassignment_150.svg"
   inkscape:export-filename="menu_source_invertassignment_150.png"
   inkscape:export-xdpi="96"
   inkscape:export-ydpi="96"
   inkscape:version="1.2.2 (732a01da63, 2022-12-09)"
   xmlns:inkscape="http://www.inkscape.org/namespaces/inkscape"
   xmlns:sodipodi="http://sodipodi.sourceforge.net/DTD/sodipodi-0.dtd"
   xmlns="http://www.w3.org/2000/svg"
   xmlns:svg="http://www.w3.org/2000/svg">
  <defs
     id="defs34" />
  <sodipodi:namedview
     id="namedview32"
     pagecolor="#ffffff"
     bordercolor="#666666"
     borderopacity="1.0"
     inkscape:showpageshadow="2"
     inkscape:pageopacity="0.0"
     inkscape:pagecheckerboard="0"
     inkscape:deskcolor="#d1d1d1"
     showgrid="true"
     inkscape:zoom="38.25"
     inkscape:cx="11.986928"
     inkscape:cy="12"
     inkscape:current-layer="svg30">
    <inkscape:grid
       type="xygrid"
       id="grid605" />
  </sodipodi:namedview>
  <g
     fill="none"
     id="g28">
    <g
       stroke="#00d400"
       stroke-linecap="round"
       stroke-width=".264581"
       transform="matrix(5.6693363 0 0 5.6693363 7.499999 -7)"
       id="g6">
      <path
         d="m1.058325 1.5874873.3968719.3968719-.3968719.3968719"
         stroke-linejoin="round"
         id="path2" />
      <path
         d="m1.4551969 1.9843592h-1.5874875"
         id="path4" />
    </g>
    <g
       stroke="#f00"
       stroke-linecap="round"
       stroke-width=".264581"
       transform="matrix(-5.6693363 0 0 5.6693363 16.5 8.000001)"
       id="g12">
      <path
         d="m1.058325 1.5874873.3968719.3968719-.3968719.3968719"
         stroke-linejoin="round"
         id="path8" />
      <path
         d="m1.4551969 1.9843592h-1.5874875"
         id="path10" />
    </g>
    <path
       d="m10.666666 5.9999999h4"
       stroke="#d4aa00"
       stroke-width=".666667"
       transform="matrix(1.5000001 0 0 1.5000001 -7.000001 3.5)"
       id="path14" />
    <path
       d="m10.666666 6.6666667h4"
       stroke="#d4aa00"
       stroke-width=".666667"
       transform="matrix(1.5000001 0 0 1.5000001 -7.000001 .499999)"
       id="path16" />
    <g
       stroke="#2a7fff"
       stroke-linecap="round"
       stroke-width="1.5"
       id="g26">
      <path
         d="m1.25 8.7499993 4.5000003 6.0000007"
         id="path18" />
      <path
         d="m5.7500003 8.7499993-4.5000003 6.0000007"
         id="path20" />
      <path
         d="m18.500001 8.7499993 2.25 3.0000007"
         id="path22" />
      <path
         d="m23.000001 8.7499993-2.25 3.0000007v3"
         id="path24" />
    </g>
  </g>
</svg>
