<?xml version="1.0" encoding="UTF-8" standalone="no"?>
<svg
   width="16"
   height="16"
   version="1.1"
   viewBox="0 0 16 16"
   id="svg2"
   sodipodi:docname="tag_a.svg"
   inkscape:export-filename="tag_a.png"
   inkscape:export-xdpi="96"
   inkscape:export-ydpi="96"
   inkscape:version="1.3.2 (091e20e, 2023-11-25, custom)"
   xmlns:inkscape="http://www.inkscape.org/namespaces/inkscape"
   xmlns:sodipodi="http://sodipodi.sourceforge.net/DTD/sodipodi-0.dtd"
   xmlns="http://www.w3.org/2000/svg"
   xmlns:svg="http://www.w3.org/2000/svg">
  <defs
     id="defs2" />
  <sodipodi:namedview
     id="namedview2"
     pagecolor="#ffffff"
     bordercolor="#000000"
     borderopacity="0.25"
     inkscape:showpageshadow="2"
     inkscape:pageopacity="0.0"
     inkscape:pagecheckerboard="0"
     inkscape:deskcolor="#d1d1d1"
     showgrid="true"
     inkscape:current-layer="svg2">
    <inkscape:grid
       id="grid2"
       units="px"
       originx="0"
       originy="0"
       spacingx="0.5"
       spacingy="0.5"
       empcolor="#0099e5"
       empopacity="0.30196078"
       color="#0099e5"
       opacity="0.14901961"
       empspacing="2"
       dotted="false"
       gridanglex="30"
       gridanglez="30"
       visible="true" />
  </sodipodi:namedview>
  <path
     d="m9.4051265 4.7570288c-1.383549-1.3835493-3.6553857-1.3627608-5.0469698 0.0288233l-2.3029865 2.3029865c-1.3915846 1.3915847-1.4123728 3.6634214-0.028823 5.0469694 1.297077 1.297079 3.3761841 1.358583 4.7774715 0.214733-0.4220985-0.275998-0.7848033-0.611366-1.0909633-1.007375-0.8288113 0.559701-1.935803 0.476711-2.6531888-0.240677-0.8170457-0.817045-0.8125701-2.1389419 0.0288225-2.9803344l2.3029851-2.3029851c0.8413912-0.8413912 2.1632896-0.8458687 2.9803349-0.0288234 0.5900614 0.5900614 0.7497048 1.4436035 0.4770266 2.189134-0.1437497 0.3930267-0.3604391 0.6457904-0.5274672 0.8128187 0.1423229 0.5206165 0.7106308 0.9168992 1.3129036 0.7249071 0.1146183-0.1420572 0.2170033-0.2910729 0.3069683-0.4453208 0.7973376-1.3670478 0.6250486-3.1536943-0.5361139-4.3148563z"
     fill="#00aad4"
     stroke-linecap="round"
     stroke-linejoin="round"
     id="path1" />
  <path
     d="m13.972941 3.8641914c-1.297077-1.2970776-3.376184-1.3585816-4.7774704-0.2147338 0.422096 0.2760005 0.7848028 0.6113676 1.0909634 1.007376 0.828812-0.5597032 1.935803-0.4767115 2.65319 0.2406751 0.817045 0.8170446 0.814011 2.1403839-0.02738 2.9817767l-2.302987 2.3029876c-0.8413886 0.84139-2.1647297 0.844426-2.9817753 0.02738-0.590063-0.5900607-0.7214514-1.4328948-0.4755871-2.1876925 0.1006324-0.3151111 0.3393702-0.5512674 0.5260261-0.8142595-0.1415001-0.5175762-0.7057914-0.9165424-1.3114627-0.7234665-0.1146182 0.1420569-0.2184443 0.2896318-0.3084098 0.4438798-0.7973371 1.3670483-0.6250482 3.1536947 0.5361141 4.3148567 1.3835504 1.383549 3.6568267 1.364202 5.0484107-0.02738l2.302987-2.3029853c1.391584-1.391585 1.410931-3.6648613 0.02738-5.0484123z"
     fill="#ff7f00"
     stroke-linecap="round"
     stroke-linejoin="round"
     id="path2" />
</svg>
