<?xml version="1.0" encoding="UTF-8" standalone="no"?>
<svg
   width="48"
   height="48"
   version="1.1"
   viewBox="0 0 48 48"
   id="svg20"
   sodipodi:docname="ttipropertygrid_200.svg"
   inkscape:version="1.3.2 (091e20e, 2023-11-25, custom)"
   xmlns:inkscape="http://www.inkscape.org/namespaces/inkscape"
   xmlns:sodipodi="http://sodipodi.sourceforge.net/DTD/sodipodi-0.dtd"
   xmlns="http://www.w3.org/2000/svg"
   xmlns:svg="http://www.w3.org/2000/svg">
  <sodipodi:namedview
     id="namedview20"
     pagecolor="#ffffff"
     bordercolor="#000000"
     borderopacity="0.25"
     inkscape:showpageshadow="2"
     inkscape:pageopacity="0.0"
     inkscape:pagecheckerboard="0"
     inkscape:deskcolor="#d1d1d1"
     showgrid="true"
     inkscape:current-layer="svg20">
    <inkscape:grid
       id="grid20"
       units="px"
       originx="0"
       originy="0"
       spacingx="0.5"
       spacingy="0.5"
       empcolor="#0099e5"
       empopacity="0.30196078"
       color="#0099e5"
       opacity="0.14901961"
       empspacing="2"
       dotted="false"
       gridanglex="30"
       gridanglez="30"
       visible="true" />
  </sodipodi:namedview>
  <defs
     id="defs6">
    <radialGradient
       id="a"
       cx="5.3999925"
       cy="1034.7039"
       r="4"
       gradientTransform="matrix(2.4999876,-2.5000158,1.5000215,1.5000046,-1553.5779,-1526.5605)"
       gradientUnits="userSpaceOnUse">
      <stop
         stop-color="#198d19"
         offset="0"
         id="stop1" />
      <stop
         stop-color="#ffffff"
         offset="1"
         id="stop2" />
    </radialGradient>
    <radialGradient
       id="c"
       cx="5.3999925"
       cy="1034.7039"
       r="4"
       gradientTransform="matrix(2.4999876,-2.5000158,1.5000215,1.5000046,-1537.5779,-1526.5604)"
       gradientUnits="userSpaceOnUse">
      <stop
         stop-color="#1a75ff"
         offset="0"
         id="stop3" />
      <stop
         stop-color="#ffffff"
         offset="1"
         id="stop4" />
    </radialGradient>
    <radialGradient
       id="b"
       cx="5.3999925"
       cy="1034.7039"
       r="4"
       gradientTransform="matrix(2.4999876,-2.5000158,1.5000215,1.5000046,-1553.5779,-1510.5604)"
       gradientUnits="userSpaceOnUse">
      <stop
         stop-color="#ff1919"
         offset="0"
         id="stop5" />
      <stop
         stop-color="#ffffff"
         offset="1"
         id="stop6" />
    </radialGradient>
  </defs>
  <circle
     cx="10"
     cy="9.9999828"
     r="7"
     fill="url(#a)"
     fill-rule="evenodd"
     stroke="#198d19"
     stroke-linecap="square"
     stroke-linejoin="round"
     stroke-width="2"
     style="fill:url(#a);paint-order:normal"
     id="circle6" />
  <circle
     cx="26"
     cy="9.9999828"
     r="7"
     fill="url(#c)"
     fill-rule="evenodd"
     stroke="#1a75ff"
     stroke-linecap="square"
     stroke-linejoin="round"
     stroke-width="2"
     style="fill:url(#c);paint-order:normal"
     id="circle7" />
  <circle
     cx="10"
     cy="25.999983"
     r="7"
     fill="url(#b)"
     fill-rule="evenodd"
     stroke="#ff1a1a"
     stroke-linecap="square"
     stroke-linejoin="round"
     stroke-width="2"
     style="fill:url(#b);paint-order:normal"
     id="circle8" />
  <rect
     x="18.5"
     y="18.499983"
     width="29"
     height="29"
     fill="#f9f9f9"
     stroke="#2a7efe"
     style="paint-order:normal"
     id="rect8" />
  <rect
     x="40.499996"
     y="18.499983"
     width="6.9999981"
     height="29"
     fill="#e6e6e6"
     stroke="#2a7efe"
     style="paint-order:normal"
     id="rect9" />
  <path
     d="M 44,24 V 34"
     fill="#e6e6e6"
     stroke="#2a7efe"
     stroke-linecap="round"
     stroke-linejoin="round"
     stroke-width="2"
     id="path9" />
  <path
     d="m 22,35 h 4"
     fill="none"
     stroke="#b3b3b3"
     stroke-width="2px"
     id="path10" />
  <path
     d="m 22,31 h 4"
     fill="none"
     stroke="#b3b3b3"
     stroke-width="2px"
     id="path11" />
  <path
     d="m 22,27 h 4"
     fill="none"
     stroke="#b3b3b3"
     stroke-width="2px"
     id="path12" />
  <path
     d="m 22,23 h 4"
     fill="none"
     stroke="#b3b3b3"
     stroke-width="2px"
     id="path13" />
  <path
     d="m 22,39 h 4"
     fill="none"
     stroke="#b3b3b3"
     stroke-width="2px"
     id="path14" />
  <path
     d="M 29.5,19 V 47"
     fill="#ffffff"
     stroke="#2a7efe"
     stroke-linejoin="round"
     id="path15" />
  <path
     d="m 32,35 h 6"
     fill="none"
     stroke="#b3b3b3"
     stroke-width="2px"
     id="path16" />
  <path
     d="m 32,31 h 6"
     fill="none"
     stroke="#b3b3b3"
     stroke-width="2px"
     id="path17" />
  <path
     d="m 32,27 h 6"
     fill="none"
     stroke="#b3b3b3"
     stroke-width="2px"
     id="path18" />
  <path
     d="m 32,23 h 6"
     fill="none"
     stroke="#b3b3b3"
     stroke-width="2px"
     id="path19" />
  <path
     d="m 32,39 h 6"
     fill="none"
     stroke="#b3b3b3"
     stroke-width="2px"
     id="path20" />
</svg>
