<?xml version="1.0" encoding="UTF-8" standalone="no"?>
<svg
   width="24"
   height="24"
   version="1.1"
   viewBox="0 0 24 24"
   id="svg12"
   sodipodi:docname="tsqlquery.svg"
   inkscape:version="1.3.2 (091e20e, 2023-11-25, custom)"
   xmlns:inkscape="http://www.inkscape.org/namespaces/inkscape"
   xmlns:sodipodi="http://sodipodi.sourceforge.net/DTD/sodipodi-0.dtd"
   xmlns:xlink="http://www.w3.org/1999/xlink"
   xmlns="http://www.w3.org/2000/svg"
   xmlns:svg="http://www.w3.org/2000/svg">
  <sodipodi:namedview
     id="namedview12"
     pagecolor="#ffffff"
     bordercolor="#000000"
     borderopacity="0.25"
     inkscape:showpageshadow="2"
     inkscape:pageopacity="0.0"
     inkscape:pagecheckerboard="0"
     inkscape:deskcolor="#d1d1d1"
     showgrid="true"
     inkscape:current-layer="svg12">
    <inkscape:grid
       id="grid14"
       units="px"
       originx="0"
       originy="0"
       spacingx="0.5"
       spacingy="0.5"
       empcolor="#0099e5"
       empopacity="0.30196078"
       color="#0099e5"
       opacity="0.14901961"
       empspacing="2"
       dotted="false"
       gridanglex="30"
       gridanglez="30"
       visible="true" />
  </sodipodi:namedview>
  <defs
     id="defs3">
    <linearGradient
       id="b"
       x1="2"
       x2="14"
       y1="2"
       y2="2"
       gradientTransform="translate(1.9209289e-8,-1)"
       gradientUnits="userSpaceOnUse"
       xlink:href="#a" />
    <linearGradient
       id="a"
       x1="2"
       x2="14"
       y1="2"
       y2="2"
       gradientUnits="userSpaceOnUse">
      <stop
         stop-color="#4276c4"
         offset="0"
         id="stop1" />
      <stop
         stop-color="#80b3ff"
         offset=".3333333"
         id="stop2" />
      <stop
         stop-color="#04a"
         offset="1"
         id="stop3" />
    </linearGradient>
    <linearGradient
       inkscape:collect="always"
       xlink:href="#a"
       id="linearGradient12"
       gradientUnits="userSpaceOnUse"
       gradientTransform="translate(1.9209289e-8,-1)"
       x1="2"
       y1="2"
       x2="14"
       y2="2" />
    <linearGradient
       inkscape:collect="always"
       xlink:href="#a"
       id="linearGradient13"
       gradientUnits="userSpaceOnUse"
       gradientTransform="translate(1.9209289e-8,-1)"
       x1="2"
       y1="2"
       x2="14"
       y2="2" />
    <linearGradient
       inkscape:collect="always"
       xlink:href="#a"
       id="linearGradient14"
       gradientUnits="userSpaceOnUse"
       gradientTransform="translate(1.9209289e-8,-1)"
       x1="2"
       y1="2"
       x2="14"
       y2="2" />
  </defs>
  <path
     d="m 19.138367,8.9893 h -1.328125 q -0.0052,-0.2865 -0.0052,-0.349 0,-0.6458 0.213541,-1.0625 0.213542,-0.4166 0.854167,-0.9375 0.640625,-0.5208 0.765625,-0.6823 0.192708,-0.2552 0.192708,-0.5625 0,-0.427 -0.34375,-0.7291 -0.338541,-0.3073 -0.916666,-0.3073 -0.557292,0 -0.932292,0.3177 -0.375,0.3177 -0.515625,0.9687 L 15.779,5.4789 q 0.05729,-0.9323 0.791667,-1.5834 0.739583,-0.651 1.9375,-0.651 1.260416,0 2.005208,0.6615 0.744792,0.6562 0.744792,1.5312 0,0.4844 -0.276042,0.9167 -0.270833,0.4323 -1.166667,1.1771 -0.463541,0.3854 -0.578125,0.6197 -0.109375,0.2344 -0.09896,0.8386 z"
     id="path3"
     style="fill:#d40000" />
  <path
     d="M 17.835992,11.432 V 9.9685 h 1.463542 v 1.4635 z"
     id="path4"
     style="fill:#d40000" />
  <rect
     x="1"
     y="14.999983"
     width="20"
     height="8.9999828"
     ry="1.5"
     fill="#739bdf"
     fill-rule="evenodd"
     style="paint-order:normal"
     id="rect4" />
  <ellipse
     cx="8"
     cy="12.499983"
     rx="5.0999999"
     ry="1.6"
     fill="none"
     stroke="url(#b)"
     stroke-linecap="round"
     stroke-linejoin="round"
     stroke-width="1.8"
     id="ellipse4"
     style="stroke:url(#linearGradient12)" />
  <ellipse
     cx="8"
     cy="11.200056"
     rx="4.9000001"
     ry="1.4"
     fill="none"
     stroke="#ffffff"
     stroke-linecap="round"
     stroke-linejoin="round"
     stroke-width="1.2"
     id="ellipse5" />
  <ellipse
     cx="8"
     cy="9.4999828"
     rx="5.0999999"
     ry="1.6"
     fill="none"
     stroke="url(#b)"
     stroke-linecap="round"
     stroke-linejoin="round"
     stroke-width="1.8"
     id="ellipse6"
     style="stroke:url(#linearGradient13)" />
  <ellipse
     cx="8"
     cy="8.2000561"
     rx="4.9000001"
     ry="1.4"
     fill="none"
     stroke="#ffffff"
     stroke-linecap="round"
     stroke-linejoin="round"
     stroke-width="1.2"
     id="ellipse7" />
  <ellipse
     cx="8"
     cy="6.4999828"
     rx="5.0999999"
     ry="1.6"
     fill="none"
     stroke="url(#b)"
     stroke-linecap="round"
     stroke-linejoin="round"
     stroke-width="1.8"
     id="ellipse8"
     style="stroke:url(#linearGradient14)" />
  <ellipse
     cx="8"
     cy="5.2000561"
     rx="4.9000001"
     ry="1.4"
     fill="none"
     stroke="#ffffff"
     stroke-linecap="round"
     stroke-linejoin="round"
     stroke-width="1.2"
     id="ellipse9" />
  <ellipse
     cx="8"
     cy="3.4999826"
     rx="5.4000001"
     ry="1.9"
     fill="#80b3ff"
     fill-rule="evenodd"
     stroke="url(#b)"
     stroke-linecap="round"
     stroke-linejoin="round"
     stroke-width="1.2"
     id="ellipse10"
     style="stroke:url(#b)" />
  <path
     d="m 14.607,17.4 v 4.1999 h 2.37462"
     fill="none"
     stroke="#ffffff"
     stroke-linecap="round"
     stroke-linejoin="round"
     stroke-width="0.8"
     id="path10" />
  <path
     d="m 11.500618,20.5 1.500489,1.0999 M 11.000457,17.4 c 0.775852,0 1.400455,0.5755 1.400455,1.2903 v 1.6193 c 0,0.7148 -0.624603,1.2903 -1.400455,1.2903 C 10.224605,21.5999 9.6,21.0244 9.6,20.3096 V 18.6903 C 9.6,17.9755 10.224605,17.4 11.000457,17.4 Z"
     fill="none"
     stroke="#ffffff"
     stroke-linecap="round"
     stroke-linejoin="round"
     stroke-width="0.8"
     id="path11" />
  <path
     d="M 7.713912,17.6741 C 7.444829,17.4893 7.045278,17.4 6.567947,17.4 c -0.674552,0 -1.288359,0.3533 -1.288359,1.0879 0,0.5755 0.487318,0.8121 1.288359,0.9505 1.115397,0.1928 1.288359,0.5676 1.288359,1.0736 1e-6,0.9143 -0.763884,1.0879 -1.288359,1.0879 -0.407156,0 -0.825073,-0.049 -1.349257,-0.3198"
     fill="none"
     stroke="#ffffff"
     stroke-linecap="round"
     stroke-linejoin="round"
     stroke-width="0.8"
     id="path12" />
</svg>
