<?xml version="1.0" encoding="UTF-8" standalone="no"?>
<svg
   height="24"
   viewBox="0 0 6.3499998 6.3500003"
   width="24"
   version="1.1"
   id="svg331"
   sodipodi:docname="Box_03_24.svg"
   inkscape:version="1.2.2 (732a01da63, 2022-12-09)"
   xmlns:inkscape="http://www.inkscape.org/namespaces/inkscape"
   xmlns:sodipodi="http://sodipodi.sourceforge.net/DTD/sodipodi-0.dtd"
   xmlns="http://www.w3.org/2000/svg"
   xmlns:svg="http://www.w3.org/2000/svg">
  <defs
     id="defs335" />
  <sodipodi:namedview
     id="namedview333"
     pagecolor="#ffffff"
     bordercolor="#000000"
     borderopacity="0.25"
     inkscape:showpageshadow="2"
     inkscape:pageopacity="0.0"
     inkscape:pagecheckerboard="0"
     inkscape:deskcolor="#d1d1d1"
     showgrid="true"
     inkscape:zoom="37.916667"
     inkscape:cx="10.246154"
     inkscape:cy="12"
     inkscape:current-layer="g319">
    <inkscape:grid
       type="xygrid"
       id="grid1062" />
  </sodipodi:namedview>
  <filter
     id="a"
     color-interpolation-filters="sRGB"
     height="1.5672629"
     width="1.2836314"
     x="-0.1418157"
     y="-0.28363146">
    <feGaussianBlur
       stdDeviation=".063698439"
       id="feGaussianBlur304" />
  </filter>
  <g
     stroke-linejoin="round"
     id="g329">
    <g
       stroke-width=".211667"
       id="g319">
      <g
         stroke="#c87137"
         id="g315">
        <path
           d="m5.9266667 2.3283334-.3492429-.7196519a.31936587.31936587 32.056485 0 0 -.2873196-.1799313h-4.2302084a.31936587.31936587 147.94351 0 0 -.2873196.1799313l-.34924286.7196519z"
           fill="#fc0"
           stroke-linecap="round"
           id="path307" />
        <g
           stroke-linecap="square"
           id="g313">
          <path
             d="m.63500017 2.2225001h5.07999953c.1465791 0 .2645833.1180042.2645833.2645833v2.6987496c0 .1465792-.1180042.2645833-.2645833.2645833h-5.07999953c-.14657916 0-.26458332-.1180041-.26458332-.2645833v-2.6987496c0-.1465791.11800416-.2645833.26458332-.2645833z"
             fill="#fc0"
             id="path309" />
          <path
             d="m.39687501 3.2808335h5.55625009"
             fill="#ccc"
             id="path311" />
        </g>
      </g>
      <path
         d="m3.8629168 3.0016669v.875833a.25.25 135 0 1 -.25.25h-.8758333a.25.25 45 0 1 -.25-.25v-.875833a.25.25 135 0 1 .25-.25h.8758333a.25.25 45 0 1 .25.25z"
         fill="#ccc"
         stroke="#808080"
         stroke-linecap="round"
         id="path317"
         style="fill:#ececec" />
    </g>
    <g
       fill="none"
       id="g327">
      <path
         d="m2.1695833 1.5345832v-.3202804c0-.27610263.2268424-.49992783.5066666-.4999278h.9975003c.2798241.00000002.5066665.22382517.5066665.4999278v.3202804"
         stroke="#808080"
         stroke-linecap="square"
         stroke-width=".635"
         id="path321" />
      <path
         d="m2.1695833 1.7197915v-.5054887c0-.27610263.2268424-.49992783.5066666-.4999278h.9975003c.2798241.00000002.5066665.22382517.5066665.4999278v.5054887"
         filter="url(#a)"
         stroke="#cccac8"
         stroke-linecap="square"
         stroke-width=".264583"
         id="path323"
         style="stroke:#ececec" />
      <path
         d="m2.9104167 3.5454169h.5291667"
         stroke="#808080"
         stroke-linecap="round"
         stroke-width=".211667"
         id="path325" />
    </g>
  </g>
</svg>
