<?xml version="1.0" encoding="UTF-8" standalone="no"?>
<svg
   height="32"
   width="32"
   version="1.1"
   id="svg5"
   sodipodi:docname="issue_fpgui_200.svg"
   inkscape:export-filename="issue_fpgui_200.png"
   inkscape:export-xdpi="96"
   inkscape:export-ydpi="96"
   inkscape:version="1.3-alpha (2a5ddc9d23, 2023-03-29)"
   xmlns:inkscape="http://www.inkscape.org/namespaces/inkscape"
   xmlns:sodipodi="http://sodipodi.sourceforge.net/DTD/sodipodi-0.dtd"
   xmlns="http://www.w3.org/2000/svg"
   xmlns:svg="http://www.w3.org/2000/svg">
  <defs
     id="defs5" />
  <sodipodi:namedview
     id="namedview5"
     pagecolor="#ffffff"
     bordercolor="#000000"
     borderopacity="0.25"
     inkscape:showpageshadow="2"
     inkscape:pageopacity="0.0"
     inkscape:pagecheckerboard="0"
     inkscape:deskcolor="#d1d1d1"
     showgrid="true"
     inkscape:zoom="28.40625"
     inkscape:cx="16"
     inkscape:cy="16"
     inkscape:current-layer="svg5">
    <inkscape:grid
       id="grid5"
       units="px"
       originx="0"
       originy="0"
       spacingx="0.5"
       spacingy="0.5"
       empcolor="#0099e5"
       empopacity="0.30196078"
       color="#0099e5"
       opacity="0.14901961"
       empspacing="2"
       dotted="false"
       gridanglex="30"
       gridanglez="30"
       visible="true" />
  </sodipodi:namedview>
  <rect
     fill="#fc0"
     height="32"
     rx="6"
     width="32"
     id="rect1" />
  <g
     fill="#333"
     stroke-width=".999999"
     id="g5">
    <path
       d="m9.597648 4.999962v10.000038h1.402352v-4.210954h4.136735v-1.332036h-4.136735v-3.121106h4.890641v-1.335942z"
       id="path1" />
    <path
       d="m12.970358 22.62266v1.711597c0 .727766-.140598 1.370639-.424532 1.927231-.282103.55303-.68468.982282-1.206206 1.287067-.516215.301682-1.116355.451481-1.799198.451481-.69182 0-1.301995-.138837-1.826151-.424533-.52258-.284838-.925428-.69182-1.212941-1.212936-.287508-.521117-.431267-1.125342-.431267-1.812676v-2.890847c0-.727766.141506-1.367929.424532-1.920492.283011-.552563.683252-.978643 1.199467-1.280328.521526-.304788 1.123094-.458224 1.805938-.458224.561547 0 1.076795.123985 1.549871.363886.474829.240794.873766.577271 1.192728 1.017525.318954.440251.534591.950136.646904 1.529655h-1.489229c-.08088-.327942-.218985-.607813-.411054-.842322-.194267-.237195-.420899-.415951-.680598-.539083-.26143-.123958-.530094-.188682-.80863-.188682-.404311 0-.759212.09659-1.064693.289754-.305461.193175-.540449.46538-.707542.815368-.165355.34633-.249336.750228-.249336 1.212943v2.890847c0 .422288.08443.793411.256063 1.111864.169777.314971.41051.560257.721021.734501.313927.176164.6761.262806 1.084909.262806.404315 0 .760199-.08818 1.064697-.269541.306482-.182528.541326-.449244.707546-.795151.166224-.34591.249336-.756967.249336-1.233158v-.424531h-1.987873v-1.314021z"
       id="path2" />
    <path
       d="m26 28.000037h-1.403036v-10.000037h1.403036z"
       id="path3" />
    <path
       d="m17.597648 4.999962v10.000038h1.406257v-3.878921h2.468757c.596111 0 1.120331-.126727 1.574226-.378906.453921-.252178.802394-.608348 1.050788-1.06641.251338-.463531.378935-.999568.378935-1.609382 0-.609815-.128504-1.145336-.378935-1.609381-.249377-.46214-.59785-.816394-1.050788-1.070316-.454908-.255024-.978161-.386721-1.574226-.386721zm1.406257 1.335942h2.51563c.302589 0 .566631.07366.79688.218752.228208.143784.405543.345014.53125.605471.126539.26225.191395.562371.191395.906254 0 .339295-.06501.640095-.191395.902347-.125707.260462-.301984.463334-.53125.605475-.229266.142133-.494291.210935-.79688.210935h-2.51563z"
       id="path4" />
    <path
       d="m18.471734 28.000038c-.730658 0-1.358426-.140258-1.878829-.428864-.518865-.287754-.9131-.709785-1.184489-1.259366-.273184-.55322-.408416-1.21852-.408416-1.994561v-6.317247h1.388708v6.364898c0 .721583.181493 1.279787.544558 1.674616.363062.394826.875864.592239 1.538468.592239.667091 0 1.180982-.198547 1.545275-.592239.366388-.395968.551437-.953031.551437-1.674616v-6.364898h1.388701v6.317247c0 .776041-.135232 1.441338-.408416 1.994561-.27137.549576-.670568.966784-1.191292 1.259365-.634809.356689-1.146198.428865-1.885705.428865z"
       id="path5" />
  </g>
</svg>
