<?xml version="1.0" encoding="UTF-8" standalone="no"?>
<svg
   height="36"
   width="36"
   version="1.1"
   id="svg385"
   sodipodi:docname="Cancel_07_36.svg"
   inkscape:export-filename="Cancel_07_36.png"
   inkscape:export-xdpi="96"
   inkscape:export-ydpi="96"
   inkscape:version="1.2.2 (732a01da63, 2022-12-09)"
   xmlns:inkscape="http://www.inkscape.org/namespaces/inkscape"
   xmlns:sodipodi="http://sodipodi.sourceforge.net/DTD/sodipodi-0.dtd"
   xmlns="http://www.w3.org/2000/svg"
   xmlns:svg="http://www.w3.org/2000/svg">
  <defs
     id="defs389" />
  <sodipodi:namedview
     id="namedview387"
     pagecolor="#ffffff"
     bordercolor="#666666"
     borderopacity="1.0"
     inkscape:showpageshadow="2"
     inkscape:pageopacity="0.0"
     inkscape:pagecheckerboard="0"
     inkscape:deskcolor="#d1d1d1"
     showgrid="true"
     inkscape:zoom="25.5"
     inkscape:cx="16.54902"
     inkscape:cy="18"
     inkscape:current-layer="svg385">
    <inkscape:grid
       type="xygrid"
       id="grid876" />
  </sodipodi:namedview>
  <circle
     cx="18"
     cy="18"
     r="15.3"
     style="fill:#e0edff;fill-rule:evenodd;stroke:#2a7efe;stroke-linecap:round;stroke-linejoin:round;stroke-width:3"
     id="circle383" />
  <path
     d="m 12.375,12.375 11.25,11.25"
     stroke-width="3.6"
     id="path291"
     style="fill:none;stroke:#2a7efe;stroke-linecap:round;stroke-width:3;stroke-dasharray:none" />
  <path
     d="m 23.625,12.375 -11.25,11.25"
     stroke-width="3.6"
     id="path293"
     style="fill:none;stroke:#2a7efe;stroke-linecap:round;stroke-width:3;stroke-dasharray:none" />
</svg>
