<?xml version="1.0" encoding="UTF-8" standalone="no"?>
<svg
   height="48"
   viewBox="0 0 12.7 12.700001"
   width="48"
   version="1.1"
   id="svg2309"
   sodipodi:docname="Picture_02_48.svg"
   inkscape:export-filename="Picture_02_48.png"
   inkscape:export-xdpi="96"
   inkscape:export-ydpi="96"
   inkscape:version="1.2 (dc2aedaf03, 2022-05-15)"
   xmlns:inkscape="http://www.inkscape.org/namespaces/inkscape"
   xmlns:sodipodi="http://sodipodi.sourceforge.net/DTD/sodipodi-0.dtd"
   xmlns="http://www.w3.org/2000/svg"
   xmlns:svg="http://www.w3.org/2000/svg">
  <defs
     id="defs2313">
    <linearGradient
       id="a-1"
       gradientUnits="userSpaceOnUse"
       x1="42.679054"
       x2="28.320946"
       y1="42.679054"
       y2="28.320946"
       gradientTransform="matrix(0.98376471,0,0,0.98376471,0.57635198,0.57635198)">
      <stop
         offset="0"
         stop-color="#009600"
         id="stop1250" />
      <stop
         offset="1"
         stop-color="#6edb39"
         id="stop1252" />
    </linearGradient>
  </defs>
  <sodipodi:namedview
     id="namedview2311"
     pagecolor="#ffffff"
     bordercolor="#666666"
     borderopacity="1.0"
     inkscape:showpageshadow="2"
     inkscape:pageopacity="0.0"
     inkscape:pagecheckerboard="0"
     inkscape:deskcolor="#d1d1d1"
     showgrid="true"
     inkscape:zoom="19.125"
     inkscape:cx="23.189542"
     inkscape:cy="24"
     inkscape:current-layer="svg2309">
    <inkscape:grid
       type="xygrid"
       id="grid3964" />
  </sodipodi:namedview>
  <linearGradient
     id="a"
     gradientTransform="matrix(1.0666667,0,0,1.0909091,-0.533333,-0.727273)"
     gradientUnits="userSpaceOnUse"
     x1="11.75"
     x2="12.21875"
     y1="3.416667"
     y2="7.541667">
    <stop
       offset="0"
       stop-color="#99c2ff"
       id="stop2271" />
    <stop
       offset="1"
       stop-color="#e5eeff"
       id="stop2273" />
  </linearGradient>
  <linearGradient
     id="b"
     gradientTransform="matrix(1.0666667,0,0,1.0833381,-0.533333,-1.625064)"
     gradientUnits="userSpaceOnUse"
     x1="10.34375"
     x2="9.875"
     y1="13.5"
     y2="7.500026">
    <stop
       offset="0"
       stop-color="#aade87"
       id="stop2276" />
    <stop
       offset="1"
       stop-color="#0a0"
       id="stop2278" />
  </linearGradient>
  <g
     transform="matrix(0.79375003,0,0,0.79375003,0,-0.79375003)"
     id="g2307">
    <path
       d="M 16,14 H 0 V 2 h 16 z"
       fill="url(#a)"
       id="path2281"
       style="fill:url(#a)" />
    <path
       d="M 16,10 C 14.333333,8.3333333 12.5,5 11,5 9.5,5 7.5,10.5 6.5,10.5 c -1,0 -2,-2 -3,-2 -1.1042859,0 -2.3333333,2 -3.5,3 V 14 h 16 z"
       fill="url(#b)"
       id="path2283"
       style="fill:url(#b)" />
    <g
       fill="none"
       id="g2301">
      <path
         d="m 5.5,3.5 v 1"
         stroke="#ffd42a"
         stroke-linecap="round"
         stroke-width="0.5"
         id="path2285" />
      <path
         d="M 6.9142136,4.0857864 6.2071068,4.7928932"
         stroke="#ffd42a"
         stroke-linecap="round"
         stroke-width="0.5"
         id="path2287" />
      <path
         d="M 4.0857864,4.0857864 4.7928932,4.7928932"
         stroke="#ffd42a"
         stroke-linecap="round"
         stroke-width="0.5"
         id="path2289" />
      <path
         d="m 3.5,5.5 h 1"
         stroke="#ffd42a"
         stroke-linecap="round"
         stroke-width="0.5"
         id="path2291" />
      <path
         d="M 4.0857864,6.9142136 4.7928932,6.2071068"
         stroke="#ffd42a"
         stroke-linecap="round"
         stroke-width="0.5"
         id="path2293" />
      <path
         d="m 5.5,7.5 v -1"
         stroke="#ffd42a"
         stroke-linecap="round"
         stroke-width="0.5"
         id="path2295" />
      <path
         d="M 6.9142136,6.9142136 6.2071068,6.2071068"
         stroke="#ffd42a"
         stroke-linecap="round"
         stroke-width="0.5"
         id="path2297" />
      <path
         d="m 7.5,5.5 h -1"
         stroke="#ffd42a"
         stroke-linecap="round"
         stroke-width="0.5"
         id="path2299" />
    </g>
    <circle
       cx="5.5"
       cy="5.5"
       fill="#ffe680"
       r="1.25"
       id="circle2303" />
    <path
       d="M 0.259471,2.259471 H 15.740528 V 13.740528 H 0.259471 Z"
       fill="none"
       stroke="#ffffff"
       stroke-linecap="round"
       stroke-width="0.518942"
       id="path2305" />
  </g>
  <g
     id="g6670"
     transform="scale(0.26458334)">
    <circle
       cx="35.5"
       cy="35.5"
       fill="url(#a)"
       stroke-dashoffset="1.49998"
       stroke-linejoin="round"
       stroke-width="2.02703"
       transform="matrix(0,1,1,0,0,0)"
       id="circle1255"
       style="fill:url(#a-1);stroke:#ffffff;stroke-width:2.4;stroke-linecap:round;stroke-dasharray:none"
       r="11.3" />
    <g
       fill="none"
       stroke-width="3"
       id="g1261"
       style="stroke:#ffffff;stroke-linecap:round">
      <path
         d="m 35.5,29.5 v 12"
         id="path1257" />
      <path
         d="m 41.5,35.5 h -12"
         id="path1259" />
    </g>
  </g>
</svg>
