<?xml version="1.0" encoding="UTF-8" standalone="no"?>
<svg
   height="36"
   width="36"
   version="1.1"
   id="svg859"
   sodipodi:docname="Edit_01_36.svg"
   inkscape:export-filename="Edit_01_36.png"
   inkscape:export-xdpi="96"
   inkscape:export-ydpi="96"
   inkscape:version="1.2-beta (1b65182ce9, 2022-04-05)"
   xmlns:inkscape="http://www.inkscape.org/namespaces/inkscape"
   xmlns:sodipodi="http://sodipodi.sourceforge.net/DTD/sodipodi-0.dtd"
   xmlns="http://www.w3.org/2000/svg"
   xmlns:svg="http://www.w3.org/2000/svg">
  <defs
     id="defs863" />
  <sodipodi:namedview
     id="namedview861"
     pagecolor="#ffffff"
     bordercolor="#666666"
     borderopacity="1.0"
     inkscape:pageshadow="2"
     inkscape:pageopacity="0.0"
     inkscape:pagecheckerboard="0"
     inkscape:deskcolor="#d1d1d1"
     showgrid="true"
     inkscape:zoom="25.5"
     inkscape:cx="18"
     inkscape:cy="18"
     inkscape:current-layer="svg859">
    <inkscape:grid
       type="xygrid"
       id="grid2042" />
  </sodipodi:namedview>
  <linearGradient
     id="a"
     gradientTransform="matrix(1.5758809,0,0,1.2533254,-44.630158,-1294.6087)"
     gradientUnits="userSpaceOnUse"
     x1="34"
     x2="37"
     y1="1029.3622"
     y2="1029.3622">
    <stop
       offset="0"
       stop-color="#999"
       id="stop824" />
    <stop
       offset=".49999997"
       stop-color="#fff"
       id="stop826" />
    <stop
       offset="1"
       stop-color="#999"
       id="stop828" />
  </linearGradient>
  <linearGradient
     id="b"
     gradientTransform="matrix(1.5758809,0,0,1.2533254,-44.630158,-1294.6087)"
     gradientUnits="userSpaceOnUse"
     x1="34"
     x2="37"
     y1="1027.3622"
     y2="1027.3622">
    <stop
       offset="0"
       stop-color="#a00"
       id="stop831" />
    <stop
       offset=".51070523"
       stop-color="#f00"
       id="stop833" />
    <stop
       offset="1"
       stop-color="#a00"
       id="stop835" />
  </linearGradient>
  <linearGradient
     id="c"
     gradientTransform="matrix(1.5758809,0,0,1.2533254,-44.630158,-1294.6087)"
     gradientUnits="userSpaceOnUse"
     x1="34"
     x2="37"
     y1="1033.8622"
     y2="1033.8622">
    <stop
       offset="0"
       stop-color="#a05a2c"
       id="stop838" />
    <stop
       offset=".29605222"
       stop-color="#ff0"
       id="stop840" />
    <stop
       offset=".44562081"
       stop-color="#e1e100"
       id="stop842" />
    <stop
       offset="1"
       stop-color="#a05a2c"
       id="stop844" />
  </linearGradient>
  <g
     fill-rule="evenodd"
     stroke-width="0.666667"
     transform="matrix(2.25,0,0,2.25,-6.623236e-7,-1.1734989e-6)"
     id="g857">
    <path
       d="m 8.949791,-5.736227 h 4.727643 v 2.506673 H 8.949791 Z"
       fill="url(#a)"
       transform="rotate(45)"
       id="path847"
       style="fill:url(#a)" />
    <path
       d="m 8.949791,-8.242877 h 4.727643 v 2.506673 H 8.949791 Z"
       fill="url(#b)"
       transform="rotate(45)"
       id="path849"
       style="fill:url(#b)" />
    <path
       d="m 8.949791,-3.229576 h 4.727643 V 5.543723 H 8.949791 Z"
       fill="url(#c)"
       transform="rotate(45)"
       id="path851"
       style="fill:url(#c)" />
    <path
       d="M 2.4084531,10.248462 0.86093585,14.024912 1.9752519,15.139228 5.7514012,13.59141 Z"
       fill="#d38d5f"
       id="path853" />
    <path
       d="m 1.3782969,12.762359 1.8582868,1.858287 -2.0516921,0.842546 C 0.78476645,15.6272 0.37296256,15.215321 0.53693666,14.815236 Z"
       fill="#333333"
       id="path855" />
  </g>
</svg>
