<?xml version="1.0" encoding="UTF-8" standalone="no"?>
<svg
   height="24"
   viewBox="0 0 6.3499998 6.3500003"
   width="24"
   version="1.1"
   id="svg171"
   sodipodi:docname="Font_08_24.svg"
   inkscape:export-filename="Font_08_24.png"
   inkscape:export-xdpi="96"
   inkscape:export-ydpi="96"
   inkscape:version="1.2 (dc2aedaf03, 2022-05-15)"
   xmlns:inkscape="http://www.inkscape.org/namespaces/inkscape"
   xmlns:sodipodi="http://sodipodi.sourceforge.net/DTD/sodipodi-0.dtd"
   xmlns="http://www.w3.org/2000/svg"
   xmlns:svg="http://www.w3.org/2000/svg">
  <defs
     id="defs175">
    <filter
       inkscape:collect="always"
       style="color-interpolation-filters:sRGB"
       id="filter4100"
       x="-0.077519639"
       y="-0.072638999"
       width="1.1550393"
       height="1.145278">
      <feGaussianBlur
         inkscape:collect="always"
         stdDeviation="0.19217504"
         id="feGaussianBlur4102" />
    </filter>
  </defs>
  <sodipodi:namedview
     id="namedview173"
     pagecolor="#ffffff"
     bordercolor="#666666"
     borderopacity="1.0"
     inkscape:showpageshadow="2"
     inkscape:pageopacity="0.0"
     inkscape:pagecheckerboard="0"
     inkscape:deskcolor="#d1d1d1"
     showgrid="true"
     inkscape:zoom="38.25"
     inkscape:cx="12"
     inkscape:cy="12"
     inkscape:current-layer="svg171">
    <inkscape:grid
       type="xygrid"
       id="grid1259" />
  </sodipodi:namedview>
  <g
     id="g4106">
    <path
       id="path3732"
       style="stroke:none;filter:url(#filter4100);fill:#ffffff"
       d="M 2.5802043 0 A 0.39652402 0.39652402 0 0 0 2.2071004 0.26354981 L 0.22272542 5.8203166 A 0.39652402 0.39652402 0 0 0 0.59582927 6.3494833 L 1.4748454 6.3494833 A 0.39652402 0.39652402 0 0 0 1.8474325 6.0859335 L 2.3202718 4.7614665 L 4.0292115 4.7614665 L 4.5020508 6.0859335 A 0.39652402 0.39652402 0 0 0 4.8751547 6.3494833 L 5.753654 6.3494833 A 0.39652402 0.39652402 0 0 0 6.1267579 5.8203166 L 4.1423828 0.26354981 A 0.39652402 0.39652402 0 0 0 3.769279 0 L 2.5802043 0 z M 3.1760336 2.3693644 L 3.4628378 3.1760336 L 2.8866455 3.1760336 L 3.1760336 2.3693644 z " />
    <path
       d="M 2.5796876,0.39687507 0.59531252,5.953125 H 1.4741074 l 0.5669643,-1.5875 h 2.267857 l 0.5669643,1.5875 H 5.7546875 L 3.7703126,0.39687507 Z M 3.1750001,1.190625 4.0254465,3.571875 H 2.3245537 Z"
       stroke="#ffffff"
       stroke-width="0.198438"
       id="path723"
       sodipodi:nodetypes="ccccccccccccc"
       style="stroke:none" />
  </g>
</svg>
