<?xml version="1.0" encoding="UTF-8" standalone="no"?>
<svg
   width="24"
   height="24"
   version="1.1"
   viewBox="0 0 24 24"
   id="svg9"
   sodipodi:docname="tfixedformatdataset.svg"
   inkscape:export-filename="tfixedformatdataset.png"
   inkscape:export-xdpi="96"
   inkscape:export-ydpi="96"
   inkscape:version="1.3.2 (091e20e, 2023-11-25, custom)"
   xmlns:inkscape="http://www.inkscape.org/namespaces/inkscape"
   xmlns:sodipodi="http://sodipodi.sourceforge.net/DTD/sodipodi-0.dtd"
   xmlns="http://www.w3.org/2000/svg"
   xmlns:svg="http://www.w3.org/2000/svg">
  <sodipodi:namedview
     id="namedview9"
     pagecolor="#ffffff"
     bordercolor="#000000"
     borderopacity="0.25"
     inkscape:showpageshadow="2"
     inkscape:pageopacity="0.0"
     inkscape:pagecheckerboard="0"
     inkscape:deskcolor="#d1d1d1"
     showgrid="true"
     inkscape:current-layer="svg9">
    <inkscape:grid
       id="grid9"
       units="px"
       originx="0"
       originy="0"
       spacingx="0.5"
       spacingy="0.5"
       empcolor="#0099e5"
       empopacity="0.30196078"
       color="#0099e5"
       opacity="0.14901961"
       empspacing="2"
       dotted="false"
       gridanglex="30"
       gridanglez="30"
       visible="true" />
  </sodipodi:namedview>
  <defs
     id="defs3">
    <linearGradient
       id="a"
       x1="3"
       x2="15"
       y1="2"
       y2="2"
       gradientUnits="userSpaceOnUse">
      <stop
         stop-color="#4276c4"
         offset="0"
         id="stop1" />
      <stop
         stop-color="#80b3ff"
         offset=".3333333"
         id="stop2" />
      <stop
         stop-color="#04a"
         offset="1"
         id="stop3" />
    </linearGradient>
  </defs>
  <ellipse
     cx="9"
     cy="12.5"
     rx="5.0999999"
     ry="1.6"
     fill="none"
     stroke="url(#a)"
     stroke-linecap="round"
     stroke-linejoin="round"
     stroke-width="1.8"
     id="ellipse3" />
  <ellipse
     cx="9"
     cy="11.2"
     rx="4.9000001"
     ry="1.4"
     fill="none"
     stroke="#ffffff"
     stroke-linecap="round"
     stroke-linejoin="round"
     stroke-width="1.2"
     id="ellipse4" />
  <ellipse
     cx="9"
     cy="9.5"
     rx="5.0999999"
     ry="1.6"
     fill="none"
     stroke="url(#a)"
     stroke-linecap="round"
     stroke-linejoin="round"
     stroke-width="1.8"
     id="ellipse5" />
  <ellipse
     cx="9"
     cy="8.1999998"
     rx="4.9000001"
     ry="1.4"
     fill="none"
     stroke="#ffffff"
     stroke-linecap="round"
     stroke-linejoin="round"
     stroke-width="1.2"
     id="ellipse6" />
  <ellipse
     cx="9"
     cy="6.5"
     rx="5.0999999"
     ry="1.6"
     fill="none"
     stroke="url(#a)"
     stroke-linecap="round"
     stroke-linejoin="round"
     stroke-width="1.8"
     id="ellipse7" />
  <ellipse
     cx="9"
     cy="5.1999998"
     rx="4.9000001"
     ry="1.4"
     fill="none"
     stroke="#ffffff"
     stroke-linecap="round"
     stroke-linejoin="round"
     stroke-width="1.2"
     id="ellipse8" />
  <ellipse
     cx="9"
     cy="3.5"
     rx="5.4000001"
     ry="1.9"
     fill="#80b3ff"
     fill-rule="evenodd"
     stroke="url(#a)"
     stroke-linecap="round"
     stroke-linejoin="round"
     stroke-width="1.2"
     id="ellipse9" />
  <path
     d="m16.25 5.2499846v5.5000274l5.500031-2.7500136z"
     fill="#00d455"
     fill-rule="evenodd"
     stroke="#00b100"
     stroke-linejoin="round"
     stroke-width=".5"
     id="path9" />
  <rect
     x="2"
     y="14"
     width="20"
     height="9"
     ry="1.5"
     fill="#d45500"
     fill-rule="evenodd"
     id="rect9" />
  <path
     d="M 9.5449457,18.449911 H 7.4 M 9.8729937,16.35 H 7.4 v 4.199822"
     fill="none"
     stroke="#2a7fff"
     stroke-linecap="round"
     stroke-linejoin="round"
     stroke-width="0.7"
     id="path9-7"
     style="stroke:#ffffff;stroke-width:0.8;stroke-dasharray:none" />
  <path
     d="m 11.6,16.400089 v 4.199822"
     fill="none"
     stroke="#2a7fff"
     stroke-linecap="round"
     stroke-linejoin="round"
     stroke-width="0.7"
     id="path14"
     style="stroke:#ffffff;stroke-width:0.8;stroke-dasharray:none" />
  <path
     d="m 16.28697,16.400089 -2.573941,4.199821 m 0,-4.19982 2.573941,4.19982"
     fill="none"
     stroke="#2a7fff"
     stroke-linecap="round"
     stroke-linejoin="round"
     stroke-width="0.7"
     id="path27"
     style="stroke:#ffffff;stroke-width:0.8;stroke-dasharray:none" />
</svg>
