<?xml version="1.0" encoding="UTF-8" standalone="no"?>
<svg
   width="16"
   height="16"
   version="1.0"
   id="svg10"
   sodipodi:docname="menu_build_clean.svg"
   inkscape:export-filename="menu_build_clean.png"
   inkscape:export-xdpi="96"
   inkscape:export-ydpi="96"
   inkscape:version="1.3.2 (091e20e, 2023-11-25, custom)"
   xmlns:inkscape="http://www.inkscape.org/namespaces/inkscape"
   xmlns:sodipodi="http://sodipodi.sourceforge.net/DTD/sodipodi-0.dtd"
   xmlns="http://www.w3.org/2000/svg"
   xmlns:svg="http://www.w3.org/2000/svg">
  <sodipodi:namedview
     id="namedview10"
     pagecolor="#ffffff"
     bordercolor="#000000"
     borderopacity="0.25"
     inkscape:showpageshadow="2"
     inkscape:pageopacity="0.0"
     inkscape:pagecheckerboard="0"
     inkscape:deskcolor="#d1d1d1"
     showgrid="true"
     inkscape:current-layer="svg10">
    <inkscape:grid
       id="grid10"
       units="px"
       originx="0"
       originy="0"
       spacingx="0.5"
       spacingy="0.5"
       empcolor="#0099e5"
       empopacity="0.30196078"
       color="#0099e5"
       opacity="0.14901961"
       empspacing="2"
       dotted="false"
       gridanglex="30"
       gridanglez="30"
       visible="true" />
  </sodipodi:namedview>
  <defs
     id="defs5">
    <linearGradient
       id="b"
       x1="2"
       x2="4"
       y1="4"
       y2="2"
       gradientTransform="matrix(-.82215714 .18186864 .18213869 .8210789 15.925204 2.7610008)"
       gradientUnits="userSpaceOnUse">
      <stop
         stop-color="#9d660d"
         offset="0"
         id="stop1" />
      <stop
         stop-color="#eea632"
         offset=".58515817"
         id="stop2" />
      <stop
         stop-color="#ae6f0e"
         offset="1"
         id="stop3" />
    </linearGradient>
    <radialGradient
       id="a"
       cx="9.032692"
       cy="8.5654745"
       r="6.499989"
       gradientTransform="matrix(-.28745933 .60591337 1.39474 .66192696 1.1425414 -.53848533)"
       gradientUnits="userSpaceOnUse">
      <stop
         stop-color="#fef6ce"
         offset="0"
         id="stop4" />
      <stop
         stop-color="#d5c015"
         offset="1"
         id="stop5" />
    </radialGradient>
  </defs>
  <g
     id="g7">
    <path
       d="m13.682068 8.1272021 1.920055-3.0088427c0.960028-1.5044212-1.048564-2.7828417-2.008593-1.2784204l-1.920054 3.0088426"
       fill="url(#b)"
       fill-rule="evenodd"
       stroke="#a86400"
       stroke-linejoin="round"
       stroke-width=".3"
       id="path5" />
    <path
       d="m10.702783 6.249983 3.647379 2.324872-1.700811 1.1600082c0.41262 2.5327168 0.134155 4.6696128-0.625894 6.0128218-3.8977359 0.080256-6.1316627-1.947145-6.6734627-3.612549 2.4472832-1.325376 2.1165397-2.81855 5.0197447-3.8533178z"
       fill="url(#a)"
       fill-rule="evenodd"
       stroke="#897c17"
       stroke-linecap="round"
       stroke-linejoin="round"
       stroke-width=".499999"
       id="path6" />
    <path
       d="m12.649351 9.7348632-2.279612-1.453045"
       fill="none"
       stroke="#d40000"
       stroke-linecap="round"
       stroke-width="1px"
       id="path7" />
  </g>
  <path
     d="m6.75 1.5-0.25 2-1.1210938 0.4648438-1.5917968-1.2382813-1.0605469 1.0605469 1.2382813 1.5917968-0.4648438 1.1210938-2 0.25v1.5l2 0.25 0.4648438 1.1210938-1.2382813 1.5917972 1.0605469 1.060547 0.1152344-0.08984c-0.0143413-0.536426 0.2705025-1.061143 0.7578124-1.324223 0.9533092-0.516866 1.2800069-0.9572529 1.8554688-1.6210937a2 2 0 0 1-1.015625-1.7382813 2 2 0 0 1 2-2 2 2 0 0 1 1.7011719 0.953125l0.0722656-0.4394531c0.078991-0.4787539 0.3950155-0.8896323 0.8378905-1.0878907a1.20012 1.20012 0 0 0 2e-3 0c0.378444-0.1687704 0.810537-0.1649715 1.183594 0.00195l0.824172-1.2929656-0.908203-0.9082031-1.5917972 1.2382813-1.1210938-0.4648438-0.25-2z"
     fill="#aaccff"
     fill-rule="evenodd"
     stroke-linejoin="round"
     id="path8" />
  <path
     d="m6.75 1a0.50005 0.50005 0 0 0-0.4960938 0.4375l-0.2148437 1.7128906-0.5820313 0.2402344-1.3632812-1.0585937a0.50005 0.50005 0 0 0-0.6601562 0.0410156l-1.0605469 1.0605469a0.50005 0.50005 0 0 0-0.0410156 0.6601562l1.0585937 1.3632812-0.2402344 0.5820313-1.7128906 0.2148437a0.50005 0.50005 0 0 0-0.4375 0.4960938v1.5a0.50005 0.50005 0 0 0 0.4375 0.4960938l1.7128906 0.2148437 0.2402344 0.5820313-1.0585937 1.3632812a0.50005 0.50005 0 0 0 0.041016 0.660156l1.0605469 1.060547a0.50005 0.50005 0 0 0 0.5800781 0.07813c-0.014309-0.04036-0.029805-0.08063-0.042969-0.121094a1.20012 1.20012 0 0 0-0.00195-2e-3c-0.1312963-0.406344-0.0677267-0.84179 0.1425748-1.193317l-0.2832031 0.21875-0.4355469-0.435547 0.9667969-1.2441406a0.50005 0.50005 0 0 0 0.0664062-0.4980469l-0.4648437-1.1210937a0.50005 0.50005 0 0 0-0.3984375-0.3046875l-1.5625-0.1953126v-0.6171875l1.5625-0.1953125a0.50005 0.50005 0 0 0 0.3984375-0.3046875l0.4648437-1.1210937a0.50005 0.50005 0 0 0-0.0664062-0.4980469l-0.9667969-1.2441406 0.4355469-0.4355469 1.2441406 0.9667969a0.50005 0.50005 0 0 0 0.4980469 0.066406l1.1210937-0.4648435a0.50005 0.50005 0 0 0 0.3046875-0.3984375l0.1953125-1.5625h0.6171875l0.1953126 1.5625a0.50005 0.50005 0 0 0 0.3046875 0.3984375l1.1210937 0.4648437a0.50005 0.50005 0 0 0 0.4980469-0.0664062l1.2441406-0.9667969 0.435547 0.4355469-0.761719 0.9804687c0.154938 0.015312 0.307366 0.054794 0.451172 0.1191407l1.099609-1.7246094-0.830078-0.8300781a0.50005 0.50005 0 0 0-0.660156-0.0410156l-1.3632812 1.0585937-0.5820313-0.2402344-0.2148437-1.7128906a0.50005 0.50005 0 0 0-0.4960938-0.4375z"
     fill="#457abe"
     fill-rule="evenodd"
     stroke-linejoin="round"
     id="path9" />
  <path
     d="M 6.1855469,9.6210938 C 6.3137211,9.474099 6.4457207,9.3177712 6.5976562,9.1445313 6.6793152,9.0514221 6.7709931,8.9562244 6.8671875,8.8613281 6.3536107,8.6243769 6,8.1072214 6,7.5 6,6.6656522 6.6656522,6 7.5,6 c 0.7960607,0 1.4368509,0.6064286 1.4941406,1.3867187 0.020126,-0.010102 0.038275,-0.021211 0.058594,-0.03125 L 9.2734375,6.0136719 C 9.2853967,5.9411885 9.3056816,5.8716037 9.328125,5.8027344 8.8707679,5.310701 8.2204773,5 7.5,5 6.1252132,5 5,6.1252132 5,7.5 5,8.3927966 5.476291,9.1786185 6.1855469,9.6210938 Z"
     fill="#457abe"
     fill-rule="evenodd"
     stroke-linejoin="round"
     id="path10" />
</svg>
