<?xml version="1.0" encoding="UTF-8" standalone="no"?>
<svg
   width="24"
   height="24"
   version="1.1"
   viewBox="0 0 24 24"
   id="svg9"
   sodipodi:docname="tfilenameedit.svg"
   inkscape:export-filename="tfilenameedit.png"
   inkscape:export-xdpi="96"
   inkscape:export-ydpi="96"
   inkscape:version="1.3.2 (091e20e, 2023-11-25, custom)"
   xmlns:inkscape="http://www.inkscape.org/namespaces/inkscape"
   xmlns:sodipodi="http://sodipodi.sourceforge.net/DTD/sodipodi-0.dtd"
   xmlns="http://www.w3.org/2000/svg"
   xmlns:svg="http://www.w3.org/2000/svg">
  <sodipodi:namedview
     id="namedview9"
     pagecolor="#ffffff"
     bordercolor="#000000"
     borderopacity="0.25"
     inkscape:showpageshadow="2"
     inkscape:pageopacity="0.0"
     inkscape:pagecheckerboard="0"
     inkscape:deskcolor="#d1d1d1"
     showgrid="true"
     inkscape:current-layer="svg9">
    <inkscape:grid
       id="grid9"
       units="px"
       originx="0"
       originy="0"
       spacingx="0.5"
       spacingy="0.5"
       empcolor="#0099e5"
       empopacity="0.30196078"
       color="#0099e5"
       opacity="0.14901961"
       empspacing="2"
       dotted="false"
       gridanglex="30"
       gridanglez="30"
       visible="true" />
  </sodipodi:namedview>
  <defs
     id="defs2">
    <linearGradient
       id="a"
       x1="-10"
       x2="-11.5"
       y1="1047.3622"
       y2="1040.3622"
       gradientTransform="matrix(1.7622378,0,0,1.5624935,30.04021,-1614.5279)"
       gradientUnits="userSpaceOnUse">
      <stop
         stop-color="#d5f6ff"
         offset="0"
         id="stop1" />
      <stop
         stop-color="#ffffff"
         offset="1"
         id="stop2" />
    </linearGradient>
  </defs>
  <rect
     x="15.25"
     y="1.2499826"
     width="7.5"
     height="7.4999995"
     fill="#ffffff"
     stroke="#2a7efe"
     stroke-linecap="round"
     stroke-linejoin="round"
     stroke-width="0.499999"
     style="paint-order:normal"
     id="rect2" />
  <rect
     x="1.25"
     y="1.2499826"
     width="14"
     height="7.5"
     fill="#ffffff"
     fill-rule="evenodd"
     stroke="#2a7efe"
     stroke-linecap="round"
     stroke-linejoin="round"
     stroke-width="0.5"
     style="paint-order:normal"
     id="rect3" />
  <circle
     cx="19"
     cy="4.9999828"
     r="2"
     fill="#c8ab37"
     id="circle3" />
  <path
     d="M 6.25,10.250002 14,10.250071 16.75,13 v 9.75 H 6.25 Z"
     fill="url(#a)"
     fill-rule="evenodd"
     stroke="#2a7efe"
     stroke-width="0.999997px"
     id="path3"
     style="fill:url(#a);stroke-width:0.5;stroke-dasharray:none"
     sodipodi:nodetypes="cccccc" />
  <path
     d="m 13.75,10.5 v 2.75 h 2.75"
     fill="none"
     stroke="#2a7efe"
     stroke-width="1px"
     id="path4"
     style="stroke-width:0.5;stroke-dasharray:none"
     sodipodi:nodetypes="ccc" />
  <path
     d="m 8,16.5 h 7"
     fill="none"
     stroke="#b3b3b3"
     stroke-linejoin="round"
     id="path5"
     sodipodi:nodetypes="cc" />
  <path
     d="m 8,12.5 h 4"
     fill="none"
     stroke="#b3b3b3"
     stroke-linejoin="round"
     id="path6"
     sodipodi:nodetypes="cc" />
  <path
     d="m 8,14.5 h 5"
     fill="none"
     stroke="#b3b3b3"
     stroke-linejoin="round"
     id="path7"
     sodipodi:nodetypes="cc" />
  <path
     d="m 8,20.5 h 7"
     fill="none"
     stroke="#b3b3b3"
     stroke-linejoin="round"
     id="path8"
     sodipodi:nodetypes="cc" />
  <path
     d="m 8,18.5 h 7"
     fill="none"
     stroke="#b3b3b3"
     stroke-linejoin="round"
     id="path9"
     sodipodi:nodetypes="cc" />
</svg>
