<?xml version="1.0" encoding="UTF-8" standalone="no"?>
<svg
   height="36"
   width="36"
   version="1.1"
   id="svg467"
   sodipodi:docname="Grid_13_36.svg"
   inkscape:export-filename="Grid_13_36.png"
   inkscape:export-xdpi="96"
   inkscape:export-ydpi="96"
   inkscape:version="1.2.1 (9c6d41e410, 2022-07-14)"
   xmlns:inkscape="http://www.inkscape.org/namespaces/inkscape"
   xmlns:sodipodi="http://sodipodi.sourceforge.net/DTD/sodipodi-0.dtd"
   xmlns="http://www.w3.org/2000/svg"
   xmlns:svg="http://www.w3.org/2000/svg">
  <defs
     id="defs471" />
  <sodipodi:namedview
     id="namedview469"
     pagecolor="#ffffff"
     bordercolor="#666666"
     borderopacity="1.0"
     inkscape:showpageshadow="2"
     inkscape:pageopacity="0.0"
     inkscape:pagecheckerboard="0"
     inkscape:deskcolor="#d1d1d1"
     showgrid="true"
     inkscape:zoom="25.5"
     inkscape:cx="17.980392"
     inkscape:cy="18"
     inkscape:current-layer="svg467">
    <inkscape:grid
       type="xygrid"
       id="grid1021" />
  </sodipodi:namedview>
  <g
     fill="none"
     stroke="#00aad4"
     stroke-width="1.8"
     id="g465">
    <path
       d="m6.9.8999995h22.199998v34.2000005h-22.199998z"
       stroke-dashoffset="1.5"
       stroke-linecap="round"
       stroke-linejoin="round"
       id="path445" />
    <path
       d="m6.75 7.9h22.500001"
       id="path447" />
    <path
       d="m13.9.7499995v34.5000005"
       id="path449" />
    <path
       d="m29.250001 28.9h-22.500001"
       id="path451" />
    <path
       d="m21.9.7499995v34.2000015"
       id="path453" />
    <path
       d="m6.75 21.9h22.5"
       id="path455" />
    <path
       d="m6.75 14.9h22.500001"
       id="path457" />
    <g
       stroke-linecap="round"
       stroke-linejoin="round"
       id="g463">
      <path
         d="m.9 22.199999 4.35-4.199999-4.35-4.2"
         id="path459" />
      <path
         d="m35.1 22.199999-4.35-4.199999 4.35-4.2"
         id="path461" />
    </g>
  </g>
</svg>
