<?xml version="1.0" encoding="UTF-8" standalone="no"?>
<svg
   height="32"
   width="32"
   version="1.1"
   id="svg501"
   sodipodi:docname="Health_15_32.svg"
   inkscape:export-filename="Health_15_32.png"
   inkscape:export-xdpi="96"
   inkscape:export-ydpi="96"
   inkscape:version="1.2.1 (9c6d41e410, 2022-07-14)"
   xmlns:inkscape="http://www.inkscape.org/namespaces/inkscape"
   xmlns:sodipodi="http://sodipodi.sourceforge.net/DTD/sodipodi-0.dtd"
   xmlns="http://www.w3.org/2000/svg"
   xmlns:svg="http://www.w3.org/2000/svg">
  <defs
     id="defs505" />
  <sodipodi:namedview
     id="namedview503"
     pagecolor="#ffffff"
     bordercolor="#666666"
     borderopacity="1.0"
     inkscape:showpageshadow="2"
     inkscape:pageopacity="0.0"
     inkscape:pagecheckerboard="0"
     inkscape:deskcolor="#d1d1d1"
     showgrid="true"
     inkscape:zoom="28.6875"
     inkscape:cx="14.745098"
     inkscape:cy="16"
     inkscape:current-layer="svg501">
    <inkscape:grid
       type="xygrid"
       id="grid1084" />
  </sodipodi:namedview>
  <radialGradient
     id="a"
     cx="8.559438"
     cy="9.409261"
     gradientTransform="matrix(.50174021 1.9178751 -1.7966053 .52073812 31.850712 -2.707957)"
     gradientUnits="userSpaceOnUse"
     r="5.499738">
    <stop
       offset="0"
       stop-color="#faa"
       id="stop470" />
    <stop
       offset="1"
       stop-color="#f00"
       id="stop472" />
  </radialGradient>
  <linearGradient
     id="b"
     gradientTransform="matrix(1.7692309 0 0 2.454545 -2.153848 -3.636363)"
     gradientUnits="userSpaceOnUse"
     x1="6.227273"
     x2="3.863637"
     y1="13.076924"
     y2="5.461539">
    <stop
       offset="0"
       stop-color="#e3ce49"
       id="stop475" />
    <stop
       offset="1"
       stop-color="#fceb84"
       id="stop477" />
  </linearGradient>
  <linearGradient
     id="c"
     gradientTransform="matrix(1.7692309 0 0 2.454545 -2.153848 -3.636363)"
     gradientUnits="userSpaceOnUse"
     x1="7.5"
     x2="7.5"
     y1="13.5"
     y2="2.5">
    <stop
       offset="0"
       stop-color="#aa8e1e"
       id="stop480" />
    <stop
       offset="1"
       stop-color="#ccaa24"
       id="stop482" />
  </linearGradient>
  <linearGradient
     id="d"
     gradientTransform="matrix(.84615394 0 0 .5454545 5.230772 -7.863637)"
     gradientUnits="userSpaceOnUse"
     x1="5.399997"
     x2="5.399997"
     y1="4.333334"
     y2="11.666667">
    <stop
       offset="0"
       stop-color="#fc0"
       id="stop485"
       style="stop-color:#ff6600;stop-opacity:1;" />
    <stop
       offset="1"
       stop-color="#fff6d5"
       id="stop487" />
  </linearGradient>
  <linearGradient
     id="e"
     gradientTransform="matrix(.84615394 0 0 .5454545 5.230772 -7.863637)"
     gradientUnits="userSpaceOnUse"
     x1="7.999997"
     x2="7.999997"
     y1="13.500001"
     y2="2.5">
    <stop
       offset="0"
       stop-color="#744b18"
       id="stop490" />
    <stop
       offset="1"
       stop-color="#ca7f26"
       id="stop492" />
  </linearGradient>
  <rect
     fill="url(#b)"
     fill-rule="evenodd"
     height="26.999998"
     rx="1.5"
     stroke="url(#c)"
     stroke-linecap="square"
     width="23"
     x=".5"
     y="2.500001"
     id="rect495" />
  <rect
     fill="url(#d)"
     fill-rule="evenodd"
     height="6"
     rx="1.5"
     stroke="url(#e)"
     stroke-linecap="square"
     transform="scale(1 -1)"
     width="11"
     x="6.5"
     y="-6.500001"
     id="rect497" />
  <path
     d="m22.000736 15.867378c5.53214-8.75493 17.58324 2.759992-.0013 15.33264-17.584492-12.572669-5.529924-24.08757.0013-15.33264z"
     fill="url(#a)"
     stroke="#fff"
     stroke-linejoin="round"
     stroke-width="1.6"
     id="path499" />
</svg>
