<?xml version="1.0" encoding="UTF-8" standalone="no"?>
<svg
   height="48"
   width="48"
   version="1.1"
   id="svg913"
   sodipodi:docname="SaveAs_01_48.svg"
   inkscape:export-filename="SaveAs_01_48.png"
   inkscape:export-xdpi="96"
   inkscape:export-ydpi="96"
   inkscape:version="1.2-beta (1b65182ce9, 2022-04-05)"
   xmlns:inkscape="http://www.inkscape.org/namespaces/inkscape"
   xmlns:sodipodi="http://sodipodi.sourceforge.net/DTD/sodipodi-0.dtd"
   xmlns="http://www.w3.org/2000/svg"
   xmlns:svg="http://www.w3.org/2000/svg">
  <defs
     id="defs917" />
  <sodipodi:namedview
     id="namedview915"
     pagecolor="#ffffff"
     bordercolor="#666666"
     borderopacity="1.0"
     inkscape:pageshadow="2"
     inkscape:pageopacity="0.0"
     inkscape:pagecheckerboard="0"
     inkscape:deskcolor="#d1d1d1"
     showgrid="true"
     inkscape:zoom="19.125"
     inkscape:cx="23.973856"
     inkscape:cy="24"
     inkscape:current-layer="svg913">
    <inkscape:grid
       type="xygrid"
       id="grid1430" />
  </sodipodi:namedview>
  <linearGradient
     id="a"
     gradientTransform="matrix(1,0,0,0.88368658,-52,-914.05199)"
     gradientUnits="userSpaceOnUse"
     x1="33"
     x2="36"
     y1="1037.3622"
     y2="1037.3622">
    <stop
       offset="0"
       stop-color="#999"
       id="stop855" />
    <stop
       offset=".49999997"
       stop-color="#fff"
       id="stop857" />
    <stop
       offset="1"
       stop-color="#999"
       id="stop859" />
  </linearGradient>
  <linearGradient
     id="b"
     gradientTransform="matrix(1,0,0,0.88368658,-52,-914.05199)"
     gradientUnits="userSpaceOnUse"
     x1="33"
     x2="36"
     y1="1035.3622"
     y2="1035.3622">
    <stop
       offset="0"
       stop-color="#a00"
       id="stop862" />
    <stop
       offset=".51070523"
       stop-color="#f00"
       id="stop864" />
    <stop
       offset="1"
       stop-color="#a00"
       id="stop866" />
  </linearGradient>
  <linearGradient
     id="c"
     gradientTransform="matrix(1,0,0,0.92685372,-52,-958.89784)"
     gradientUnits="userSpaceOnUse"
     x1="33"
     x2="36"
     y1="1041.8622"
     y2="1041.8622">
    <stop
       offset="0"
       stop-color="#a05a2c"
       id="stop869" />
    <stop
       offset=".26457807"
       stop-color="#ff0"
       id="stop871" />
    <stop
       offset=".75078517"
       stop-color="#ff0"
       id="stop873" />
    <stop
       offset="1"
       stop-color="#a05a2c"
       id="stop875" />
  </linearGradient>
  <linearGradient
     id="d"
     gradientUnits="userSpaceOnUse"
     x1="9"
     x2="11.25"
     y1="1.5"
     y2="9">
    <stop
       offset="0"
       stop-color="#ccc"
       id="stop878" />
    <stop
       offset="1"
       stop-color="#f2f2f2"
       id="stop880" />
  </linearGradient>
  <g
     id="g1393"
     transform="scale(2.0000122)">
    <g
       fill-rule="evenodd"
       id="g891">
      <path
         d="M 22,24 V 2.5 L 19.5,0 H 0 v 24 z"
         fill="#0062f5"
         id="path883" />
      <path
         d="m -19.5,-23 h 17 v 3 h -17 z"
         fill="#ff0000"
         transform="scale(-1)"
         id="path885" />
      <path
         d="m -19.5,-20 h 17 v 9 h -17 z"
         fill="#ffffff"
         transform="scale(-1)"
         id="path887" />
      <path
         d="M 18,9 V 0 H 6 V 9 Z M 16.5,7.5 h -3 v -6 h 3 z"
         fill="url(#d)"
         id="path889"
         style="fill:url(#d)" />
    </g>
    <g
       stroke-width="0.712914"
       transform="matrix(0.9917689,0.99194073,-0.9917689,0.99194073,38.454072,23.26105)"
       id="g911">
      <path
         d="m -19,0 v 10 l 1.033203,2.67969 c 0.07409,0.192396 0.260677,0.319587 0.466844,0.32031 0.206167,-7.23e-4 0.390753,-0.127916 0.464844,-0.320312 C -17.03125,12.695313 -16,10 -16,10 V 0 Z"
         fill="none"
         stroke="#ffffff"
         stroke-dashoffset="1.49998"
         stroke-linecap="square"
         stroke-width="1.42582"
         id="path893" />
      <g
         stroke-width="0.712914"
         id="g909">
        <g
           fill-rule="evenodd"
           id="g905">
          <g
             stroke-width="0.758377"
             id="g901">
            <path
               d="m -19,2 h 3 v 2 h -3 z"
               fill="url(#a)"
               id="path895"
               style="fill:url(#a)" />
            <path
               d="m -19,0 3,5e-6 V 2.0104462 L -19,2 Z"
               fill="url(#b)"
               id="path897"
               style="fill:url(#b)" />
            <path
               d="m -19,4 h 3 v 6 h -3 z"
               fill="url(#c)"
               id="path899"
               style="fill:url(#c)" />
          </g>
          <path
             d="m -19,10 0.771286,2 h 1.457428 L -16,10 Z"
             fill="#d38d5f"
             stroke-width="0.720463"
             id="path903" />
        </g>
        <path
           d="M -17,12.5 A 0.5,0.5 0 0 1 -17.5,13 0.5,0.5 0 0 1 -18,12.5 0.5,0.5 0 0 1 -17.5,12 0.5,0.5 0 0 1 -17,12.5 Z M -18.228714,12 h 1.457428 l -0.262202,0.679907 h -0.933024 z"
           fill="#333333"
           stroke-dashoffset="1.49998"
           stroke-linecap="round"
           stroke-linejoin="round"
           stroke-width="0.950842"
           id="path907" />
      </g>
    </g>
  </g>
</svg>
