<?xml version="1.0" encoding="UTF-8" standalone="no"?>
<svg
   height="64"
   width="64"
   version="1.1"
   id="svg176"
   sodipodi:docname="Note_01_64.svg"
   inkscape:export-filename="Note_01_64.png"
   inkscape:export-xdpi="96"
   inkscape:export-ydpi="96"
   inkscape:version="1.2-beta (1b65182ce9, 2022-04-05)"
   xmlns:inkscape="http://www.inkscape.org/namespaces/inkscape"
   xmlns:sodipodi="http://sodipodi.sourceforge.net/DTD/sodipodi-0.dtd"
   xmlns="http://www.w3.org/2000/svg"
   xmlns:svg="http://www.w3.org/2000/svg">
  <defs
     id="defs180">
    <linearGradient
       id="c"
       gradientUnits="userSpaceOnUse"
       x1="7"
       x2="7"
       y1="8"
       y2="26">
      <stop
         offset="0"
         stop-color="#e8d769"
         id="stop162" />
      <stop
         offset="1"
         stop-color="#fceb84"
         id="stop164" />
    </linearGradient>
    <linearGradient
       id="a-0"
       gradientUnits="userSpaceOnUse"
       x1="15"
       x2="15"
       y1="27"
       y2="5">
      <stop
         offset="0"
         stop-color="#bb9c21"
         id="stop152" />
      <stop
         offset="1"
         stop-color="#d9b62a"
         id="stop154" />
    </linearGradient>
    <radialGradient
       id="b"
       cx="12"
       cy="4"
       gradientUnits="userSpaceOnUse"
       r="5">
      <stop
         offset="0"
         stop-color="#fff"
         id="stop157" />
      <stop
         offset="1"
         stop-color="#d40000"
         id="stop159" />
    </radialGradient>
  </defs>
  <sodipodi:namedview
     id="namedview178"
     pagecolor="#ffffff"
     bordercolor="#666666"
     borderopacity="1.0"
     inkscape:pageshadow="2"
     inkscape:pageopacity="0.0"
     inkscape:pagecheckerboard="0"
     inkscape:deskcolor="#d1d1d1"
     showgrid="true"
     inkscape:zoom="14.34375"
     inkscape:cx="28.479303"
     inkscape:cy="32"
     inkscape:current-layer="svg176">
    <inkscape:grid
       type="xygrid"
       id="grid1029" />
  </sodipodi:namedview>
  <radialGradient
     id="a"
     cx="5.988626"
     cy="7.28811"
     gradientTransform="matrix(-.00000055 3.4666666 -3.2000002 -.0000005 31.296708 -14.760566)"
     gradientUnits="userSpaceOnUse"
     r="3.75">
    <stop
       offset="0"
       stop-color="#f8fbff"
       id="stop149" />
    <stop
       offset=".66666657"
       stop-color="#d1e3ff"
       id="stop151" />
    <stop
       offset="1"
       stop-color="#f8fbff"
       id="stop153" />
  </radialGradient>
  <g
     id="g1042"
     transform="scale(2)">
    <rect
       fill="url(#c)"
       fill-rule="evenodd"
       height="22"
       rx="1"
       stroke="url(#a)"
       stroke-linecap="square"
       stroke-width="2"
       width="26"
       x="3"
       y="5"
       id="rect167"
       style="fill:url(#c);stroke:url(#a-0)" />
    <path
       d="m 13,5 6,6"
       fill="none"
       stroke="#999999"
       stroke-width="2"
       id="path169" />
    <circle
       cx="13"
       cy="5"
       fill="url(#b)"
       fill-rule="evenodd"
       r="4"
       id="circle171"
       style="fill:url(#b)" />
  </g>
</svg>
