<?xml version="1.0" encoding="UTF-8" standalone="no"?>
<svg
   height="36"
   viewBox="0 0 9.5249997 9.5250005"
   width="36"
   version="1.1"
   id="svg425"
   sodipodi:docname="Sound_04_36.svg"
   inkscape:export-filename="Sound_04_36.png"
   inkscape:export-xdpi="96"
   inkscape:export-ydpi="96"
   inkscape:version="1.2 (dc2aedaf03, 2022-05-15)"
   xmlns:inkscape="http://www.inkscape.org/namespaces/inkscape"
   xmlns:sodipodi="http://sodipodi.sourceforge.net/DTD/sodipodi-0.dtd"
   xmlns="http://www.w3.org/2000/svg"
   xmlns:svg="http://www.w3.org/2000/svg">
  <defs
     id="defs429" />
  <sodipodi:namedview
     id="namedview427"
     pagecolor="#ffffff"
     bordercolor="#666666"
     borderopacity="1.0"
     inkscape:showpageshadow="2"
     inkscape:pageopacity="0.0"
     inkscape:pagecheckerboard="0"
     inkscape:deskcolor="#d1d1d1"
     showgrid="true"
     inkscape:zoom="25.5"
     inkscape:cx="17.980392"
     inkscape:cy="18"
     inkscape:current-layer="svg425">
    <inkscape:grid
       type="xygrid"
       id="grid845" />
  </sodipodi:namedview>
  <g
     fill="none"
     stroke="#00aad4"
     stroke-linecap="round"
     stroke-linejoin="round"
     id="g423">
    <path
       d="m2.5135349 3.5718154 1.6316467-2.2269451h.8598752v6.8350839l-.8598752.0000001-1.6316467-1.9623682"
       stroke-width=".573249"
       id="path413" />
    <rect
       height="2.854847"
       rx=".598838"
       stroke-width=".584736"
       transform="scale(-1 1)"
       width="1.796514"
       x="-2.618049"
       y="3.467368"
       id="rect415" />
    <g
       stroke-width=".264648"
       transform="matrix(0 -2.2499451 2.2488394 0 .069554 .000116)"
       id="g421">
      <path
         d="m-1.5875001 2.7781248a.5291667.39687499 0 0 1 -.2645834.3437038.5291667.39687499 0 0 1 -.5291667 0 .5291667.39687499 0 0 1 -.2645833-.3437038"
         id="path417" />
      <path
         d="m-.92604184 2.7781248a1.190625 1.0583334 0 0 1 -.59531246.9165436 1.190625 1.0583334 0 0 1 -1.190625 0 1.190625 1.0583334 0 0 1 -.5953124-.9165436"
         id="path419" />
    </g>
  </g>
</svg>
