<?xml version="1.0" encoding="UTF-8" standalone="no"?>
<svg
   width="36"
   height="36"
   version="1.1"
   viewBox="0 0 36 36"
   id="svg13"
   sodipodi:docname="ttitrackbar_150.svg"
   inkscape:version="1.3.2 (091e20e, 2023-11-25, custom)"
   xmlns:inkscape="http://www.inkscape.org/namespaces/inkscape"
   xmlns:sodipodi="http://sodipodi.sourceforge.net/DTD/sodipodi-0.dtd"
   xmlns="http://www.w3.org/2000/svg"
   xmlns:svg="http://www.w3.org/2000/svg">
  <sodipodi:namedview
     id="namedview13"
     pagecolor="#ffffff"
     bordercolor="#000000"
     borderopacity="0.25"
     inkscape:showpageshadow="2"
     inkscape:pageopacity="0.0"
     inkscape:pagecheckerboard="0"
     inkscape:deskcolor="#d1d1d1"
     showgrid="true"
     inkscape:current-layer="svg13">
    <inkscape:grid
       id="grid13"
       units="px"
       originx="0"
       originy="0"
       spacingx="0.5"
       spacingy="0.5"
       empcolor="#0099e5"
       empopacity="0.30196078"
       color="#0099e5"
       opacity="0.14901961"
       empspacing="2"
       dotted="false"
       gridanglex="30"
       gridanglez="30"
       visible="true" />
  </sodipodi:namedview>
  <defs
     id="defs6">
    <radialGradient
       id="a"
       cx="5.3999925"
       cy="1034.7039"
       r="4"
       gradientTransform="matrix(1.9642759,-1.9642982,1.1785882,1.1785751,-1221.5255,-1200.2975)"
       gradientUnits="userSpaceOnUse">
      <stop
         stop-color="#198d19"
         offset="0"
         id="stop1" />
      <stop
         stop-color="#ffffff"
         offset="1"
         id="stop2" />
    </radialGradient>
    <radialGradient
       id="c"
       cx="5.3999925"
       cy="1034.7039"
       r="4"
       gradientTransform="matrix(1.9642759,-1.9660222,1.1785882,1.1796095,-1209.5255,-1201.357)"
       gradientUnits="userSpaceOnUse">
      <stop
         stop-color="#1a75ff"
         offset="0"
         id="stop3" />
      <stop
         stop-color="#ffffff"
         offset="1"
         id="stop4" />
    </radialGradient>
    <radialGradient
       id="b"
       cx="5.3999925"
       cy="1034.7039"
       r="4"
       gradientTransform="matrix(1.9642759,-1.9660222,1.1785882,1.1796095,-1221.5255,-1189.3522)"
       gradientUnits="userSpaceOnUse">
      <stop
         stop-color="#ff1919"
         offset="0"
         id="stop5" />
      <stop
         stop-color="#ffffff"
         offset="1"
         id="stop6" />
    </radialGradient>
  </defs>
  <circle
     cx="7"
     cy="6.9999828"
     r="5.5"
     fill="url(#a)"
     fill-rule="evenodd"
     stroke="#198d19"
     stroke-linecap="square"
     stroke-linejoin="round"
     style="fill:url(#a);paint-order:normal"
     id="circle6" />
  <ellipse
     cx="19"
     cy="6.9999828"
     rx="5.5"
     ry="5.504827"
     fill="url(#c)"
     fill-rule="evenodd"
     stroke="#1a75ff"
     stroke-linecap="square"
     stroke-linejoin="round"
     style="fill:url(#c);paint-order:normal"
     id="ellipse6" />
  <ellipse
     cx="7"
     cy="19.004866"
     rx="5.5"
     ry="5.504827"
     fill="url(#b)"
     fill-rule="evenodd"
     stroke="#ff1a1a"
     stroke-linecap="square"
     stroke-linejoin="round"
     style="fill:url(#b);paint-order:normal"
     id="ellipse7" />
  <path
     d="m 11.5,31 v 3"
     fill="none"
     stroke="#2a7efe"
     id="path7" />
  <path
     d="m 28.5,31 8e-6,3"
     fill="none"
     stroke="#2a7efe"
     id="path8" />
  <path
     d="m 24.499998,31 v 2.8243"
     fill="none"
     stroke="#2a7efe"
     id="path9" />
  <path
     d="m 20.5,31 v 3"
     fill="none"
     stroke="#2a7efe"
     id="path10" />
  <path
     d="m 15.5,31 v 3"
     fill="none"
     stroke="#2a7efe"
     id="path11" />
  <rect
     x="9.499999"
     y="21.499983"
     width="26"
     height="6"
     fill="#ececec"
     stroke="#2a7efe"
     stroke-width="0.999999"
     id="rect11" />
  <path
     d="m 15,20 h 5.999999 v 7.5 L 18,31.5 l -3,-4 z"
     fill="#2a7efe"
     fill-rule="evenodd"
     stroke-width="1.5"
     id="path12" />
  <path
     d="m 32.5,31 8e-6,3"
     fill="none"
     stroke="#2a7efe"
     id="path13" />
</svg>
