<svg width="24" height="24" version="1.1" xmlns="http://www.w3.org/2000/svg">
 <rect x=".375" y="5.375" width="23.25" height="17.25" fill="#f9f9f9" stroke="#2a7efe" stroke-width=".75" style="paint-order:normal"/>
 <path d="m2 1h20c1 0 2 1 2 2v2.5h-24v-2.5c0-1 1-2 2-2z" fill="#2a7efe"/>
 <path d="m18.75 14.25v6" fill="none" stroke="#000000" stroke-linecap="round" stroke-linejoin="round" stroke-width="1.5"/>
 <path d="m14.25 19.05 2.25-1.8-2.25-1.8z" fill="none" stroke="#4d4d4d" stroke-linecap="round" stroke-linejoin="round" stroke-width="1.5"/>
 <path d="m16.5 17.25h-11.25" fill="none" stroke="#4d4d4d" stroke-linecap="round" stroke-linejoin="round" stroke-width="1.5"/>
 <path d="m5.25 8.25v6" fill="none" stroke="#000000" stroke-linecap="round" stroke-linejoin="round" stroke-width="1.5"/>
 <path d="m9.75 13.05-2.25-1.8 2.25-1.8z" fill="none" stroke="#4d4d4d" stroke-linecap="round" stroke-linejoin="round" stroke-width="1.5"/>
 <path d="m7.5 11.25h11.25" fill="none" stroke="#4d4d4d" stroke-linecap="round" stroke-linejoin="round" stroke-width="1.5"/>
</svg>
