<?xml version="1.0" encoding="UTF-8" standalone="no"?>
<svg
   height="48"
   viewBox="0 0 12.7 12.7"
   width="48"
   version="1.1"
   id="svg743"
   sodipodi:docname="Window_14_48.svg"
   inkscape:version="1.2.2 (732a01da63, 2022-12-09)"
   xmlns:inkscape="http://www.inkscape.org/namespaces/inkscape"
   xmlns:sodipodi="http://sodipodi.sourceforge.net/DTD/sodipodi-0.dtd"
   xmlns="http://www.w3.org/2000/svg"
   xmlns:svg="http://www.w3.org/2000/svg">
  <defs
     id="defs747" />
  <sodipodi:namedview
     id="namedview745"
     pagecolor="#ffffff"
     bordercolor="#000000"
     borderopacity="0.25"
     inkscape:showpageshadow="2"
     inkscape:pageopacity="0.0"
     inkscape:pagecheckerboard="0"
     inkscape:deskcolor="#d1d1d1"
     showgrid="true"
     inkscape:zoom="18.958333"
     inkscape:cx="23.973626"
     inkscape:cy="24"
     inkscape:current-layer="svg743">
    <inkscape:grid
       type="xygrid"
       id="grid970" />
  </sodipodi:namedview>
  <rect
     fill="#f5f7ff"
     height="10.530416"
     rx=".873125"
     stroke="#00aad4"
     stroke-linejoin="round"
     stroke-width=".582083"
     width="10.530416"
     x="1.084792"
     y="1.084792"
     id="rect723" />
  <g
     fill="#00aad4"
     id="g741">
    <path
       d="m1.190625 1.3229167h10.31875v1.4816667h-10.31875z"
       fill-rule="evenodd"
       stroke-width=".793744"
       id="path725" />
    <g
       stroke-width=".946605"
       id="g739">
      <path
         d="m2.6458333 3.96875v1.8520833h1.5875v-1.8520833z"
         id="path727" />
      <path
         d="m5.55625 3.96875v1.8520833h1.5875v-1.8520833z"
         id="path729" />
      <path
         d="m8.4666667 3.96875v1.8520833h1.5875003v-1.8520833z"
         id="path731" />
      <path
         d="m2.6458333 6.8791667v1.8520833h1.5875v-1.8520833z"
         id="path733" />
      <path
         d="m5.55625 6.8791667v1.8520833h1.5875v-1.8520833z"
         id="path735" />
      <path
         d="m8.4666667 6.8791667v1.8520833h1.5875003v-1.8520833z"
         id="path737" />
    </g>
  </g>
</svg>
