<?xml version="1.0" encoding="UTF-8" standalone="no"?>
<svg
   height="24"
   width="24"
   version="1.1"
   id="svg561"
   sodipodi:docname="menu_goto_bookmark1_150.svg"
   inkscape:export-filename="menu_goto_bookmark1_150.png"
   inkscape:export-xdpi="96"
   inkscape:export-ydpi="96"
   inkscape:version="1.2.2 (732a01da63, 2022-12-09)"
   xmlns:inkscape="http://www.inkscape.org/namespaces/inkscape"
   xmlns:sodipodi="http://sodipodi.sourceforge.net/DTD/sodipodi-0.dtd"
   xmlns="http://www.w3.org/2000/svg"
   xmlns:svg="http://www.w3.org/2000/svg">
  <defs
     id="defs565" />
  <sodipodi:namedview
     id="namedview563"
     pagecolor="#ffffff"
     bordercolor="#666666"
     borderopacity="1.0"
     inkscape:showpageshadow="2"
     inkscape:pageopacity="0.0"
     inkscape:pagecheckerboard="0"
     inkscape:deskcolor="#d1d1d1"
     showgrid="true"
     inkscape:zoom="38.25"
     inkscape:cx="10.535948"
     inkscape:cy="11.45098"
     inkscape:current-layer="g559">
    <inkscape:grid
       type="xygrid"
       id="grid1381" />
  </sodipodi:namedview>
  <radialGradient
     id="a"
     cx="10.5"
     cy="12"
     gradientUnits="userSpaceOnUse"
     r="6">
    <stop
       offset="0"
       stop-color="#2a7fff"
       id="stop548" />
    <stop
       offset=".69999999"
       stop-color="#4d94ff"
       id="stop550" />
    <stop
       offset="1"
       stop-color="#96bdff"
       id="stop552" />
  </radialGradient>
  <g
     stroke-width=".666667"
     transform="matrix(1.5 0 0 1.5 -3.75 -6.5)"
     id="g559">
    <circle
       cx="10.5"
       cy="12"
       fill="url(#a)"
       r="6"
       id="circle555" />
    <path
       d="M 11.448661,15.666667 H 10.5 V 10.032366 L 9.0780641,10.904762 9.0677087,9.9523801 10.5,8.9999991 h 0.948661 z"
       fill="#ffffff"
       id="path153"
       sodipodi:nodetypes="cccccccc"
       style="fill:#ffffff;stroke-width:0.666667" />
  </g>
</svg>
