<?xml version="1.0" encoding="UTF-8" standalone="no"?>
<svg
   height="36"
   viewBox="0 0 36 36"
   width="36"
   version="1.1"
   id="svg500"
   sodipodi:docname="Paint_02_36.svg"
   inkscape:version="1.3 (0e150ed6c4, 2023-07-21)"
   inkscape:export-filename="Paint_02_36.png"
   inkscape:export-xdpi="96"
   inkscape:export-ydpi="96"
   xmlns:inkscape="http://www.inkscape.org/namespaces/inkscape"
   xmlns:sodipodi="http://sodipodi.sourceforge.net/DTD/sodipodi-0.dtd"
   xmlns="http://www.w3.org/2000/svg"
   xmlns:svg="http://www.w3.org/2000/svg">
  <defs
     id="defs504" />
  <sodipodi:namedview
     id="namedview502"
     pagecolor="#ffffff"
     bordercolor="#666666"
     borderopacity="1.0"
     inkscape:showpageshadow="2"
     inkscape:pageopacity="0.0"
     inkscape:pagecheckerboard="0"
     inkscape:deskcolor="#d1d1d1"
     showgrid="true"
     inkscape:zoom="25.5"
     inkscape:cx="18"
     inkscape:cy="18"
     inkscape:current-layer="svg500">
    <inkscape:grid
       id="grid1"
       units="px"
       originx="0"
       originy="0"
       spacingx="0.5"
       spacingy="0.5"
       empcolor="#0099e5"
       empopacity="0.30196078"
       color="#0099e5"
       opacity="0.14901961"
       empspacing="2"
       dotted="false"
       gridanglex="30"
       gridanglez="30"
       visible="true" />
  </sodipodi:namedview>
  <g
     id="g2"
     transform="matrix(2.25,0,0,2.25,-0.24999955,0.25000066)">
    <path
       id="path1-7"
       style="fill:#00aad4;stroke-width:0.200312;stroke-linecap:round;stroke-linejoin:round"
       d="M 13.862683,4.9701691 C 12.689285,6.1435669 11.652891,7.0096268 10.321642,5.6783773 8.9903915,4.3471272 9.8564522,3.3107338 11.02985,2.1373358 c 1.173398,-1.17339792 2.758776,-1.49047373 3.541041,-0.708208 0.782265,0.7822649 0.46519,2.3676434 -0.708208,3.5410413 z"
       sodipodi:nodetypes="sssss" />
    <path
       style="fill:none;stroke:#00aad4;stroke-width:1;stroke-linecap:round;stroke-linejoin:round;stroke-dasharray:none;stroke-opacity:1"
       d="M 8.4895927,3.9748741 12.025127,7.510408"
       id="path2-2" />
    <path
       style="fill:#ffffff;stroke:#00aad4;stroke-width:0.8;stroke-linecap:round;stroke-linejoin:round;stroke-dasharray:none;stroke-opacity:1"
       d="M 9.1966997,5.3890877 4.6005054,9.9852821 3.8933986,12.106602 6.0147189,11.399495 10.610913,6.8033013"
       id="path3-4"
       sodipodi:nodetypes="ccccc" />
    <path
       id="path4-6"
       style="fill:#00aad4;fill-opacity:1;stroke:none;stroke-width:0.999999;stroke-linecap:round;stroke-linejoin:round"
       d="M 4.6292322,14.250001 C 4.9167438,15.008996 4.2645161,15.5 3.8146159,15.5 3.3647159,15.5 2.9999998,14.940357 2.9999998,14.250001 2.9999998,13.559644 3.3647159,13 3.8146159,13 c -0.00973,1.250001 0.5748946,0.617166 0.8146163,1.250001 z"
       sodipodi:nodetypes="ssscs" />
  </g>
</svg>
