<?xml version="1.0" encoding="UTF-8" standalone="no"?>
<svg
   height="36"
   viewBox="0 0 9.5249997 9.5250005"
   width="36"
   version="1.1"
   id="svg4"
   sodipodi:docname="Font_26_36.svg"
   inkscape:version="1.3-beta (cedbd6c6ff, 2023-05-28)"
   inkscape:export-filename="Font_26_36.png"
   inkscape:export-xdpi="96"
   inkscape:export-ydpi="96"
   xmlns:inkscape="http://www.inkscape.org/namespaces/inkscape"
   xmlns:sodipodi="http://sodipodi.sourceforge.net/DTD/sodipodi-0.dtd"
   xmlns="http://www.w3.org/2000/svg"
   xmlns:svg="http://www.w3.org/2000/svg">
  <defs
     id="defs4" />
  <sodipodi:namedview
     id="namedview4"
     pagecolor="#ffffff"
     bordercolor="#000000"
     borderopacity="0.25"
     inkscape:showpageshadow="2"
     inkscape:pageopacity="0.0"
     inkscape:pagecheckerboard="0"
     inkscape:deskcolor="#d1d1d1"
     showgrid="true"
     inkscape:current-layer="svg4">
    <inkscape:grid
       id="grid4"
       units="px"
       originx="0"
       originy="0"
       spacingx="0.13229166"
       spacingy="0.13229167"
       empcolor="#0099e5"
       empopacity="0.30196078"
       color="#0099e5"
       opacity="0.14901961"
       empspacing="2"
       dotted="false"
       gridanglex="30"
       gridanglez="30"
       visible="true" />
  </sodipodi:namedview>
  <g
     fill="#00aad4"
     stroke-width=".396873"
     id="g3">
    <path
       d="m1.3650814 3.8840701c-.2388437 0-.45612646.049968-.65484616.133068-.2093332.087534-.3790915.2104209-.5078779.3687843l.487414.340269c.10041-.075834.2152782-.13473.34416626-.1767894.130869-.0427.264642-.06463.3999771-.06463.2182832 0 .3851694.065949.5041573.191996.1189485.1260045.178593.3009576.178593.5284644v.098748h-.935759c-.38417686 0-.67144046.086786-.86134616.2585314-.1899057.1717458-.2846346.4282968-.2846346.771786 0 .3613307.102774.6320236.3106797.8098052.2068317.1768613.5203791.26423.93948096.26423.1418835-.0000008.2694572-.015444.383234-.045623.1132455-.03006.212253-.07515.2976573-.1349685.055746-.03905.1063515-.084461.1506894-.136869v.317461h.6362421v-2.2335173c0-.2721142-.053817-.5036653-.1581306-.6957485-.1052374-.1937872-.2592427-.3357538-.4576477-.4410204-.2687195-.1425727-.5228261-.1539772-.772049-.1539772zm-.2139413 1.9692842h.9655259v.6767382c-.00741.1071645-.071233.186848-.1897567.2395197-.1245886.055368-.3138797.083643-.5692697.083643-.233562 0-.40930576-.042077-.52462106-.1273605-.113883-.08423-.1692924-.2153923-.1692924-.3915962 0-.162825.043287-.2830546.128364-.36118.081909-.075215.2003868-.1197585.35904996-.1197642z"
       id="path1" />
    <path
       d="m3.4395833 2.6458151v4.7625184h.667869v-.4632292c.07309.139767.172142.2291625.3013788.3125388.1567158.101103.3426528.1506894.554387.1506894.2466585.0000003.4580575-.052236.6343823-.1599918.1772932-.1083495.3120202-.2431593.4036978-.4483461.0916785-.2051864.137664-.4522903.137664-.7404229v-.7913946c0-.2924974-.046311-.5423568-.135807-.7497249-.0894933-.2073675-.2208883-.362436-.392533-.4706705-.1710676-.1078704-.3756682-.1637116-.6157787-.1637116-.2030048 0-.3861915.055246-.5525265.1637106-.130893.085353-.2432063.1964527-.334866.3385849v-1.7405505zm1.3357377 1.8391509c.2204649 0 .3909273.069524.5115987.2065004.121626.13806.1841766.3315902.1841766.5804321v.7876758c0 .2444769-.061995.4338824-.1841766.5692695-.120114.1330995-.2911332.1990592-.5115987.1990592-.1418835 0-.2626138-.02682-.36277-.081856-.0984821-.0541094-.1727142-.1318121-.2251017-.2344052-.0523889-.1025936-.079997-.227684-.079997-.3739331v-.9774326c0-.1418835.027612-.2623618.079997-.3627699.052387-.1025925.126637-.180609.2251012-.2325465.1001745-.052837.2208861-.079997.3627705-.0799937z"
       id="path2" />
    <path
       d="m8.223622 7.4083518c-.3767011 0-.5751742-.057844-.7956395-.173535-.2182825-.1156893-.3852684-.2837668-.5009581-.504232-.1156896-.2204652-.1735347-.4867697-.1735347-.7989137v-.5872724c0-.3077796.057844-.5708088.1735351-.789091.1156905-.2182832.2826767-.384178.500958-.4976843.220465-.1156905.485678-.173535.7956395-.173535.1768077 0 .3427034.021816.4976843.065484.1571658.041476.2979553.1025925.4223773.1833558.12442.080766.228104.1789927.311051.2946828l-.481313.4322007c-.0960442-.1091416-.2084583-.1931803-.3372451-.2521162-.128787-.0589358-.2630315-.0884056-.4027311-.0884056-.2575737 0-.4573019.072033-.5991855.216098-.1418836.144066-.2128258.3470666-.2128258.6090083v.5872725c0 .2684889.06985.4758555.2095498.6221051.1418835.14625.3427032.2193739.6024597.2193739.1418835 0 .277219-.031644.4060053-.094955.128787-.063303.2401101-.152799.3339727-.2684891l.481313.4649414c-.08513.113507-.189906.2106421-.314328.2914073-.124422.078581-.2663034.1346775-.4223763.1800836-.1705359.049613-.3485865.062216-.4944086.0622159z"
       id="path3" />
  </g>
  <path
     d="m.0000002 5.5562502h9.5249997"
     fill="none"
     stroke="#00aad4"
     stroke-linejoin="round"
     stroke-width=".529167"
     id="path4" />
</svg>
