<?xml version="1.0" encoding="UTF-8" standalone="no"?>
<svg
   height="24"
   width="24"
   version="1.1"
   id="svg3"
   sodipodi:docname="insertcodetag_150.svg"
   inkscape:export-filename="insertcodetag_150.png"
   inkscape:export-xdpi="96"
   inkscape:export-ydpi="96"
   inkscape:version="1.3.2 (091e20e, 2023-11-25, custom)"
   xmlns:inkscape="http://www.inkscape.org/namespaces/inkscape"
   xmlns:sodipodi="http://sodipodi.sourceforge.net/DTD/sodipodi-0.dtd"
   xmlns="http://www.w3.org/2000/svg"
   xmlns:svg="http://www.w3.org/2000/svg">
  <defs
     id="defs3" />
  <sodipodi:namedview
     id="namedview3"
     pagecolor="#ffffff"
     bordercolor="#000000"
     borderopacity="0.25"
     inkscape:showpageshadow="2"
     inkscape:pageopacity="0.0"
     inkscape:pagecheckerboard="0"
     inkscape:deskcolor="#d1d1d1"
     showgrid="true"
     inkscape:current-layer="svg3">
    <inkscape:grid
       id="grid3"
       units="px"
       originx="0"
       originy="0"
       spacingx="0.5"
       spacingy="0.5"
       empcolor="#0099e5"
       empopacity="0.30196078"
       color="#0099e5"
       opacity="0.14901961"
       empspacing="2"
       dotted="false"
       gridanglex="30"
       gridanglez="30"
       visible="true" />
  </sodipodi:namedview>
  <g
     fill="#2a7fff"
     transform="matrix(1.4507336 0 0 1.5014662 .394131 -.140617)"
     id="g3">
    <path
       d="m5.1666664 10.177083q0 .192708-.015625.302083-.015625.109375-.052083.15625-.03125.04687-.083333.04167-.046875-.0052-.125-.04167l-3.99479245-1.9895831q-.0729167-.041667-.109375-.171875-.03125-.1354166-.03125-.4010416 0-.1354167.0104167-.234375.0104167-.1041667.0260417-.1666667.015625-.067708.0416667-.1041667.03125-.041667.0677083-.0625l3.98958335-1.9791667q.1510417-.072917.2135417.03125.0625.098958.0625.4114583 0 .2135417-.010417.3385417-.00521.125-.026042.1979167-.020833.072917-.057292.1041666-.036458.03125-.098958.0625l-2.9999994 1.4062501 2.9427084 1.3645834q.078125.036458.125.072917.052083.036458.078125.1145834.026042.072917.036458.203125.010417.125.010417.3437496z"
       id="path1" />
    <path
       d="m7.0260413 12.432291q-.0260417.067709-.0677083.109375-.041667.04167-.1197917.06771-.072917.02604-.1875.03646-.109375.01563-.28125.01563-.2135417 0-.3489584-.02083-.1354166-.02083-.2083333-.0625-.067708-.04167-.078125-.109375-.010417-.0625.020833-.151042l3.1145838-8.7448029q.020833-.067708.0625-.109375.041667-.046875.1145833-.072917.072917-.026042.1875-.036458.1197917-.015625.2864583-.015625.2187501 0 .3489584.020833.1354166.020833.2031246.0625.06771.041667.07813.109375.01042.0625-.01563.1510416z"
       id="path2" />
    <path
       d="m15.244792 8.0885413q0 .1354166-.01042.234375-.01042.098958-.03125.1666666-.01563.067708-.04687.109375-.02604.036458-.0625.052083l-3.994791 1.9791671q-.07292.03646-.125.03125-.05208-.0052-.08854-.05729-.03125-.05208-.04687-.151041-.01042-.104167-.01042-.260417 0-.2135421.0052-.3385421.01042-.125.03125-.1979167.02083-.072917.05729-.1041666.03646-.036458.09896-.0625l3-1.4062501-2.942709-1.3645833q-.08333-.036458-.135416-.072917-.04687-.036458-.07292-.109375-.02604-.078125-.03646-.203125-.0052-.1302084-.0052-.3489584 0-.1927083.01042-.3020833.01563-.109375.04687-.15625.03646-.046875.08854-.041667.05208.00521.125.041667l4 1.9947917q.06771.03125.104166.1666667.04167.1354167.04167.4010417z"
       id="path3" />
  </g>
</svg>
