<svg width="24" height="24" version="1.0" xmlns="http://www.w3.org/2000/svg" xmlns:xlink="http://www.w3.org/1999/xlink">
 <defs>
  <linearGradient id="a">
   <stop stop-color="#ffcc00" offset="0"/>
   <stop stop-color="#ffffff" offset="1"/>
  </linearGradient>
  <radialGradient id="b" cx="9.5" cy="9.5" r="5.9999995" gradientTransform="matrix(1.6500003 0 0 1.6500001 -1.2000012 .299999)" gradientUnits="userSpaceOnUse">
   <stop stop-color="#cecece" offset="0"/>
   <stop stop-color="#ffffff" offset="1"/>
  </radialGradient>
  <radialGradient id="d" cx="12.5" cy="3.4999998" r="2.7509992" gradientTransform="matrix(.28179158 -1.4428847 1.4359747 .3151182 -2.1510555 21.899269)" gradientUnits="userSpaceOnUse" xlink:href="#a"/>
  <radialGradient id="c" cx="12.5" cy="3.4999998" r="2.7509992" gradientTransform="matrix(-.28179158 -1.4428847 -1.4359747 .3151182 26.151055 21.899269)" gradientUnits="userSpaceOnUse" xlink:href="#a"/>
 </defs>
 <circle cx="5.25" cy="21.75" r="1.875" fill="#e6e6e6" fill-rule="evenodd" stroke="#4d4d4d" stroke-linecap="round" stroke-linejoin="round" stroke-width=".75" style="paint-order:normal"/>
 <circle cx="18.75" cy="21.75" r="1.875" fill="#e6e6e6" fill-rule="evenodd" stroke="#4d4d4d" stroke-linecap="round" stroke-linejoin="round" stroke-width=".75" style="paint-order:normal"/>
 <circle cx="12" cy="13.5" r="8.249999" fill="url(#b)" stroke="#71a6ce" stroke-linecap="round" stroke-linejoin="round" stroke-width="3" style="paint-order:normal"/>
 <path d="m11 8.523701h1.5v4.5h3v1.5h-4.5z" fill="#4d4d4d" fill-rule="evenodd"/>
 <path d="m9.6928517 3.153011c-0.8425145-1.283281-2.9651948-2.539224-5.1928517-1.076699s-1.9192132 3.90957-1.0766997 5.192852z" fill="url(#d)" fill-rule="evenodd" stroke="#c7910b" stroke-width=".75"/>
 <path d="m14.307149 3.153011c0.842513-1.283281 2.965193-2.539224 5.192851-1.076699 2.227657 1.462525 1.919214 3.90957 1.0767 5.192852z" fill="url(#c)" fill-rule="evenodd" stroke="#c7910b" stroke-width=".75"/>
</svg>
