<?xml version="1.0" encoding="UTF-8" standalone="no"?>
<svg
   height="36"
   viewBox="0 0 9.5249997 9.5250005"
   width="36"
   version="1.1"
   id="svg33"
   sodipodi:docname="Delete_02_36.svg"
   inkscape:export-filename="Delete_02_36.png"
   inkscape:export-xdpi="96"
   inkscape:export-ydpi="96"
   inkscape:version="1.2 (dc2aedaf03, 2022-05-15)"
   xmlns:inkscape="http://www.inkscape.org/namespaces/inkscape"
   xmlns:sodipodi="http://sodipodi.sourceforge.net/DTD/sodipodi-0.dtd"
   xmlns:xlink="http://www.w3.org/1999/xlink"
   xmlns="http://www.w3.org/2000/svg"
   xmlns:svg="http://www.w3.org/2000/svg">
  <sodipodi:namedview
     id="namedview457"
     pagecolor="#ffffff"
     bordercolor="#666666"
     borderopacity="1.0"
     inkscape:showpageshadow="2"
     inkscape:pageopacity="0.0"
     inkscape:pagecheckerboard="0"
     inkscape:deskcolor="#d1d1d1"
     showgrid="true"
     inkscape:zoom="25.5"
     inkscape:cx="17.980392"
     inkscape:cy="18"
     inkscape:current-layer="svg33">
    <inkscape:grid
       type="xygrid"
       id="grid1094" />
  </sodipodi:namedview>
  <defs
     id="defs37" />
  <linearGradient
     id="a"
     gradientUnits="userSpaceOnUse"
     x1="1"
     x2="15"
     xlink:href="#b"
     y1="9"
     y2="9" />
  <linearGradient
     id="b">
    <stop
       offset="0"
       stop-color="#999"
       id="stop3" />
    <stop
       offset=".42857143"
       stop-color="#ccc"
       id="stop5" />
    <stop
       offset="1"
       stop-color="#666"
       id="stop7" />
  </linearGradient>
  <linearGradient
     id="c"
     gradientUnits="userSpaceOnUse"
     x1="1"
     x2="15"
     xlink:href="#b"
     y1="8"
     y2="8" />
  <g
     fill="none"
     stroke-width=".888889"
     transform="scale(.59531251)"
     id="g31">
    <path
       d="m1.5555555 1.3333333h12.8888885l-2 14.2222217h-8.8888885z"
       stroke="url(#a)"
       id="path11" />
    <g
       stroke="url(#c)"
       id="g19">
      <path
         d="m3.1111111 11.555555h9.7777779"
         id="path13" />
      <path
         d="m2.6666666 8.4444444h10.6666664"
         id="path15" />
      <path
         d="m2 5.3333333h12"
         id="path17" />
    </g>
    <g
       stroke="url(#a)"
       id="g29">
      <path
         d="m1.5555555 2.2222222h12.8888885"
         id="path21" />
      <path
         d="m6 15.5-1.5-14"
         id="path23" />
      <path
         d="m10 15.5 1.5-14"
         id="path25" />
      <path
         d="m8 15.5v-14"
         id="path27" />
    </g>
  </g>
</svg>
