<svg width="24" height="24" version="1.1" xmlns="http://www.w3.org/2000/svg">
 <g fill-rule="evenodd" stroke="#ffffff" stroke-width="1.5">
  <path d="m9.75 23.25h9v-3h4.5v-3h-7.5v3h-3v-3h-3z" fill="#ff7f00"/>
  <path d="m15.75 14.25h-9v3h-4.5v3h7.5v-3h3v3h3z" fill="#00d455"/>
 </g>
</svg>
