<?xml version="1.0" encoding="UTF-8" standalone="no"?>
<svg
   width="36"
   height="36"
   version="1.1"
   viewBox="0 0 36 36"
   id="svg4"
   sodipodi:docname="tdateedit_150.svg"
   inkscape:export-filename="tdateedit_150.png"
   inkscape:export-xdpi="96"
   inkscape:export-ydpi="96"
   inkscape:version="1.3.2 (091e20e, 2023-11-25, custom)"
   xmlns:inkscape="http://www.inkscape.org/namespaces/inkscape"
   xmlns:sodipodi="http://sodipodi.sourceforge.net/DTD/sodipodi-0.dtd"
   xmlns="http://www.w3.org/2000/svg"
   xmlns:svg="http://www.w3.org/2000/svg">
  <defs
     id="defs4" />
  <sodipodi:namedview
     id="namedview4"
     pagecolor="#ffffff"
     bordercolor="#000000"
     borderopacity="0.25"
     inkscape:showpageshadow="2"
     inkscape:pageopacity="0.0"
     inkscape:pagecheckerboard="0"
     inkscape:deskcolor="#d1d1d1"
     showgrid="true"
     inkscape:current-layer="svg4">
    <inkscape:grid
       id="grid4"
       units="px"
       originx="0"
       originy="0"
       spacingx="0.5"
       spacingy="0.5"
       empcolor="#0099e5"
       empopacity="0.30196078"
       color="#0099e5"
       opacity="0.14901961"
       empspacing="2"
       dotted="false"
       gridanglex="30"
       gridanglez="30"
       visible="true" />
  </sodipodi:namedview>
  <rect
     x="9.375"
     y="17.874983"
     width="17.25"
     height="16.750017"
     fill="#ffffff"
     stroke="#999999"
     stroke-linecap="round"
     stroke-width="0.75"
     style="paint-order:normal"
     id="rect1" />
  <path
     d="M 10.5,15 H 25.499974 C 26.328405,15 26.999986,15.6716 27,16.5 V 19 H 9 V 16.5 C 9,15.6716 9.6715729,15 10.5,15 Z"
     fill="#d40000"
     style="paint-order:normal"
     id="path1" />
  <path
     d="M 15.628097,30.3836 V 22.6164 L 13.31644,24.0959"
     fill="none"
     stroke="#4d4d4d"
     stroke-linecap="round"
     stroke-linejoin="round"
     stroke-width="1.23288"
     id="path2" />
  <path
     d="m 21.052755,22.6164 -2.548464,4.6623 m -0.225509,0.8857 c 0,-1.0214 0.827966,-1.8493 1.849315,-1.8493 1.021349,0 1.849315,0.8279 1.849315,1.8493 v 0.3698 c 0,1.0213 -0.827966,1.8494 -1.849315,1.8494 -1.021349,0 -1.849315,-0.8281 -1.849315,-1.8494 z"
     fill="none"
     stroke="#4d4d4d"
     stroke-linecap="round"
     stroke-linejoin="round"
     stroke-width="1.23288"
     id="path3" />
  <rect
     x="24.499998"
     y="2.4999826"
     width="10.000003"
     height="10"
     fill="#ffffff"
     stroke="#2a7efe"
     stroke-linecap="round"
     stroke-linejoin="round"
     stroke-width="0.999998"
     style="paint-order:normal"
     id="rect3" />
  <rect
     x="2.4999981"
     y="2.4999826"
     width="22"
     height="10.000001"
     fill="#ffffff"
     fill-rule="evenodd"
     stroke="#2a7efe"
     stroke-linecap="round"
     stroke-linejoin="round"
     stroke-width="0.999996"
     style="paint-order:normal"
     id="rect4" />
  <circle
     cx="29.5"
     cy="7.4999828"
     r="2.75"
     fill="#c8ab37"
     id="circle4" />
</svg>
