<?xml version="1.0" encoding="UTF-8" standalone="no"?>
<svg
   height="64"
   viewBox="0 0 16.933333 16.933335"
   width="64"
   version="1.1"
   id="svg457"
   sodipodi:docname="Font_12_64.svg"
   inkscape:export-filename="Font_12_64.png"
   inkscape:export-xdpi="96"
   inkscape:export-ydpi="96"
   inkscape:version="1.2 (dc2aedaf03, 2022-05-15)"
   xmlns:inkscape="http://www.inkscape.org/namespaces/inkscape"
   xmlns:sodipodi="http://sodipodi.sourceforge.net/DTD/sodipodi-0.dtd"
   xmlns="http://www.w3.org/2000/svg"
   xmlns:svg="http://www.w3.org/2000/svg">
  <defs
     id="defs461">
    <filter
       inkscape:collect="always"
       style="color-interpolation-filters:sRGB"
       id="filter2521"
       x="-0.077506219"
       y="-0.072650787"
       width="1.1550124"
       height="1.1453016">
      <feGaussianBlur
         inkscape:collect="always"
         stdDeviation="0.51260733"
         id="feGaussianBlur2523" />
    </filter>
  </defs>
  <sodipodi:namedview
     id="namedview459"
     pagecolor="#ffffff"
     bordercolor="#666666"
     borderopacity="1.0"
     inkscape:showpageshadow="2"
     inkscape:pageopacity="0.0"
     inkscape:pagecheckerboard="0"
     inkscape:deskcolor="#d1d1d1"
     showgrid="true"
     inkscape:zoom="14.34375"
     inkscape:cx="27.572985"
     inkscape:cy="32"
     inkscape:current-layer="svg457">
    <inkscape:grid
       type="xygrid"
       id="grid1219" />
  </sodipodi:namedview>
  <g
     id="g2527">
    <path
       id="path2154"
       style="fill:#ffffff;stroke:none;filter:url(#filter2521)"
       d="M 6.8786502,0 A 1.0586996,1.0586996 0 0 0 5.8828453,0.70331627 L 0.59169517,15.519467 a 1.0586996,1.0586996 0 0 0 0.99632163,1.414384 h 2.3435263 a 1.0586996,1.0586996 0 0 0 0.9963217,-0.703317 l 1.2614217,-3.5295 h 4.5547605 l 1.261939,3.5295 a 1.0586996,1.0586996 0 0 0 0.995805,0.703317 h 2.344043 a 1.0586996,1.0586996 0 0 0 0.995805,-1.414384 L 11.051005,0.70331627 A 1.0586996,1.0586996 0 0 0 10.054684,0 Z M 8.466667,6.3205447 9.2325118,8.466667 H 7.701339 Z" />
    <path
       d="M 6.8791671,1.0583333 1.5875001,15.875001 H 3.930953 l 1.5119048,-4.233334 h 6.0476192 l 1.511905,4.233334 h 2.343452 L 10.054167,1.0583333 Z M 8.4666669,3.1750001 10.734524,9.5250007 H 6.1988099 Z"
       stroke="#ffffff"
       stroke-width="0.198438"
       id="path723"
       sodipodi:nodetypes="ccccccccccccc"
       style="stroke:none" />
  </g>
  <g
     id="g3715"
     transform="matrix(0.52916636,0,0,0.52916636,4.2009961e-6,1.0333739e-5)">
    <path
       d="m 24.438473,12.000716 c -0.546627,-0.0167 -1.078431,0.259453 -1.371641,0.754029 l -0.918438,1.548167 -0.300799,-0.004 -0.914427,-1.540145 C 20.542009,12.100983 19.727163,11.828309 19.020089,12.12104 l -1.897035,0.786115 c -0.706961,0.293004 -1.090903,1.059131 -0.902396,1.800848 l 0.441171,1.740685 -0.212564,0.212572 -1.740621,-0.445198 c -0.742714,-0.18984 -1.511938,0.193955 -1.804791,0.902429 l -0.786087,1.897106 c -0.293869,0.708053 -0.02172,1.5262 0.637693,1.917161 l 1.54811,0.918472 -0.004,0.30081 -1.544099,0.914461 c -0.657748,0.391174 -0.926402,1.206049 -0.633682,1.91315 l 0.786087,1.897106 c 0.292992,0.706987 1.059091,1.090943 1.80078,0.902429 l 1.740621,-0.441188 0.212564,0.212573 -0.445182,1.740685 c -0.189833,0.742741 0.193949,1.511994 0.902396,1.804858 l 1.897036,0.786116 c 0.708026,0.293879 1.526143,0.02172 1.917089,-0.637717 l 0.918438,-1.548167 0.300799,0.004 0.914427,1.544157 c 0.39116,0.657763 1.206005,0.926427 1.913079,0.633696 l 1.897036,-0.786116 c 0.706961,-0.293003 1.090902,-1.05913 0.902395,-1.800847 l -0.441171,-1.740685 0.212564,-0.212573 1.740621,0.445199 c 0.742714,0.18984 1.511938,-0.193956 1.804791,-0.90243 l 0.786087,-1.897106 c 0.29387,-0.708052 0.02172,-1.526199 -0.637693,-1.91716 l -1.548109,-0.918472 0.004,-0.296799 1.544099,-0.918472 c 0.657748,-0.391175 0.926403,-1.20605 0.633682,-1.91315 l -0.786086,-1.897106 c -0.292993,-0.706987 -1.059091,-1.090943 -1.800781,-0.902429 l -1.740621,0.441187 -0.212564,-0.212572 0.445182,-1.740685 c 0.189833,-0.742742 -0.193948,-1.511995 -0.902396,-1.804858 l -1.897036,-0.786116 c -0.177006,-0.07347 -0.363238,-0.110748 -0.545448,-0.116313 z M 22,20.459484 A 1.5400884,1.5401455 0 0 1 23.540089,21.999629 1.5400884,1.5401455 0 0 1 22,23.539775 1.5400884,1.5401455 0 0 1 20.459912,21.999629 1.5400884,1.5401455 0 0 1 22,20.459484 Z"
       fill="#ffffff"
       id="path403"
       style="stroke:none;stroke-width:0.499999" />
    <path
       d="m 17.711687,14.329404 0.65943,2.587732 -1.451811,1.452267 -2.591047,-0.658873 -0.785738,1.897009 2.298024,1.366322 -2.85e-4,2.053531 -2.296022,1.363498 0.785821,1.897212 2.587636,-0.659455 1.452214,1.451864 -0.658849,2.591144 1.896938,0.785767 1.366271,-2.298109 2.053456,2.85e-4 1.363447,2.296107 1.897141,-0.78585 -0.659429,-2.587732 1.45181,-1.452268 2.591048,0.658874 0.785737,-1.897009 -2.298024,-1.366322 2.86e-4,-2.053531 2.296021,-1.363498 -0.785821,-1.897212 -2.587636,0.659454 -1.452213,-1.451864 0.658849,-2.591144 -1.896939,-0.785767 -1.366271,2.298109 -2.053455,-2.85e-4 -1.363448,-2.296107 z m 3.109581,4.824407 a 3.0801768,3.0802911 0 0 1 4.024444,1.667042 3.0801768,3.0802911 0 0 1 -1.666979,4.024594 3.0801768,3.0802911 0 0 1 -4.024445,-1.667041 3.0801768,3.0802911 0 0 1 1.66698,-4.024595 z"
       fill="#2c5aa0"
       id="path405"
       style="fill:#3771c8;fill-opacity:0.996078;stroke:none;stroke-width:0.499999" />
  </g>
</svg>
