<?xml version="1.0" encoding="UTF-8" standalone="no"?>
<svg
   width="24"
   height="24"
   version="1.1"
   id="svg308"
   sodipodi:docname="menu_new_form_150.svg"
   inkscape:export-filename="menu_new_form_150.png"
   inkscape:export-xdpi="96"
   inkscape:export-ydpi="96"
   inkscape:version="1.2.2 (732a01da63, 2022-12-09)"
   xmlns:inkscape="http://www.inkscape.org/namespaces/inkscape"
   xmlns:sodipodi="http://sodipodi.sourceforge.net/DTD/sodipodi-0.dtd"
   xmlns="http://www.w3.org/2000/svg"
   xmlns:svg="http://www.w3.org/2000/svg">
  <defs
     id="defs312" />
  <sodipodi:namedview
     id="namedview310"
     pagecolor="#ffffff"
     bordercolor="#666666"
     borderopacity="1.0"
     inkscape:showpageshadow="2"
     inkscape:pageopacity="0.0"
     inkscape:pagecheckerboard="0"
     inkscape:deskcolor="#d1d1d1"
     showgrid="true"
     inkscape:zoom="38.25"
     inkscape:cx="11.986928"
     inkscape:cy="12"
     inkscape:current-layer="svg308">
    <inkscape:grid
       type="xygrid"
       id="grid431" />
  </sodipodi:namedview>
  <path
     d="m4.6 3.6h18.8v16.8h-18.8z"
     fill="#fff"
     stroke="#2a7fff"
     stroke-linecap="round"
     stroke-linejoin="round"
     stroke-miterlimit="5.6"
     stroke-width="1.2"
     id="path290" />
  <g
     fill="none"
     id="g304">
    <path
       d="m5 4.8h18"
       stroke="#2a7fff"
       stroke-width="2.8"
       id="path292" />
    <g
       stroke="#e4b600"
       stroke-linecap="round"
       id="g302">
      <path
         d="m4.5 0.5v8"
         id="path294" />
      <path
         d="m1.3448 1.3448 6.3104 6.3104"
         id="path296" />
      <path
         d="m8.5 4.5h-8"
         id="path298" />
      <path
         d="m7.6552 1.3448-6.3104 6.3104"
         id="path300" />
    </g>
  </g>
  <circle
     cx="4.5"
     cy="4.5"
     r="1.3003"
     fill="#fff"
     stroke="#ffe680"
     stroke-linejoin="round"
     stroke-miterlimit="5.6"
     id="circle306" />
</svg>
