<svg width="32" height="32" version="1.1" xmlns="http://www.w3.org/2000/svg">
 <g transform="matrix(1.5384615,0,0,1.5384615,1.23077,1.1149232)" fill="none" stroke-linecap="round" stroke-linejoin="round">
  <g stroke="#ffffff" stroke-width="4">
   <path d="m9 10h9"/>
   <path d="m14.5 6.5 3.5 3.5-3.5 3.5"/>
  </g>
  <g stroke="#ff0000" stroke-opacity=".996078" stroke-width="2.00002">
   <path d="m9 10h9"/>
   <path d="m14.5 6.5 3.5 3.5-3.5 3.5"/>
  </g>
 </g>
</svg>
