<?xml version="1.0" encoding="UTF-8" standalone="no"?>
<svg
   height="36"
   width="36"
   version="1.1"
   id="svg385"
   sodipodi:docname="Info_05_36.svg"
   inkscape:export-filename="Info_05_36.png"
   inkscape:export-xdpi="96"
   inkscape:export-ydpi="96"
   inkscape:version="1.2.2 (732a01da63, 2022-12-09)"
   xmlns:inkscape="http://www.inkscape.org/namespaces/inkscape"
   xmlns:sodipodi="http://sodipodi.sourceforge.net/DTD/sodipodi-0.dtd"
   xmlns="http://www.w3.org/2000/svg"
   xmlns:svg="http://www.w3.org/2000/svg">
  <defs
     id="defs389" />
  <sodipodi:namedview
     id="namedview387"
     pagecolor="#ffffff"
     bordercolor="#666666"
     borderopacity="1.0"
     inkscape:showpageshadow="2"
     inkscape:pageopacity="0.0"
     inkscape:pagecheckerboard="0"
     inkscape:deskcolor="#d1d1d1"
     showgrid="true"
     inkscape:zoom="25.5"
     inkscape:cx="17.392157"
     inkscape:cy="18"
     inkscape:current-layer="svg385">
    <inkscape:grid
       type="xygrid"
       id="grid876" />
  </sodipodi:namedview>
  <circle
     cx="18"
     cy="18"
     r="15.3"
     style="fill:#e5ffd5;fill-rule:evenodd;stroke:#01a901;stroke-linecap:round;stroke-linejoin:round;stroke-width:3"
     id="circle383" />
  <path
     style="fill:none;stroke:#01a901;stroke-width:4.50002;stroke-linecap:round;stroke-linejoin:miter;stroke-dasharray:none;stroke-opacity:1"
     d="m 17.999997,10.124995 -1e-6,1.125"
     id="path6395"
     sodipodi:nodetypes="cc" />
  <path
     style="fill:none;stroke:#01a901;stroke-width:4.50002;stroke-linecap:round;stroke-linejoin:miter;stroke-dasharray:none;stroke-opacity:1"
     d="m 17.999996,17.999996 1e-6,7.875003"
     id="path6397"
     sodipodi:nodetypes="cc" />
</svg>
