<?xml version="1.0" encoding="UTF-8" standalone="no"?>
<svg
   height="16"
   width="16"
   version="1.1"
   id="svg19"
   sodipodi:docname="Setup_02_16.svg"
   inkscape:export-filename="Setup_02_16.png"
   inkscape:export-xdpi="96"
   inkscape:export-ydpi="96"
   inkscape:version="1.2-beta (1b65182ce9, 2022-04-05)"
   xmlns:inkscape="http://www.inkscape.org/namespaces/inkscape"
   xmlns:sodipodi="http://sodipodi.sourceforge.net/DTD/sodipodi-0.dtd"
   xmlns="http://www.w3.org/2000/svg"
   xmlns:svg="http://www.w3.org/2000/svg">
  <defs
     id="defs23" />
  <sodipodi:namedview
     id="namedview21"
     pagecolor="#ffffff"
     bordercolor="#666666"
     borderopacity="1.0"
     inkscape:pageshadow="2"
     inkscape:pageopacity="0.0"
     inkscape:pagecheckerboard="0"
     inkscape:deskcolor="#d1d1d1"
     showgrid="true"
     inkscape:zoom="57.375"
     inkscape:cx="8"
     inkscape:cy="8"
     inkscape:current-layer="svg19">
    <inkscape:grid
       type="xygrid"
       id="grid306" />
  </sodipodi:namedview>
  <linearGradient
     id="a"
     gradientUnits="userSpaceOnUse"
     x1="14.15625"
     x2="8.84375"
     y1="14.15625"
     y2="8.84375">
    <stop
       offset="0"
       stop-color="#009600"
       id="stop2" />
    <stop
       offset="1"
       stop-color="#6edb39"
       id="stop4" />
  </linearGradient>
  <path
     d="M 9.2184124,1.2506869 8.1504689,3.1286977 6.8496007,3.1291648 5.7812049,1.2499869 4.2959453,1.8652015 4.8692548,3.9494508 3.9490719,4.8689735 1.8659676,4.2961694 1.2506871,5.7815876 3.1286979,6.849531 3.129165,8.1503993 1.2499869,9.2187956 l 0.6152146,1.4852584 2.0842496,-0.573309 0.9195226,0.920184 -0.5728041,2.083103 1.4854182,0.61528 1.0679435,-1.87801 1.3008683,-4.68e-4 1.068396,1.879179 1.4852594,-0.615213 -0.57331,-2.084251 0.920184,-0.919523 2.083104,0.572804 0.61528,-1.4854179 -1.87801,-1.0679434 -4.68e-4,-1.3008683 1.879178,-1.0683955 -0.615214,-1.4852596 -2.08425,0.5733093 -0.919523,-0.920183 0.572804,-2.0831043 z M 8.320374,5.5194423 A 2.1437401,2.1437401 0 0 1 9.4805576,8.3203738 2.1437401,2.1437401 0 0 1 6.6796263,9.4805574 2.1437401,2.1437401 0 0 1 5.5194425,6.6796261 2.1437401,2.1437401 0 0 1 8.320374,5.5194423 Z"
     fill="#aaccff"
     fill-rule="evenodd"
     stroke="#457abe"
     stroke-linejoin="round"
     id="path7"
     style="stroke-width:1" />
  <g
     stroke="#fff"
     stroke-linecap="round"
     id="g17">
    <circle
       cx="11.5"
       cy="11.5"
       fill="url(#a)"
       r="4.25"
       stroke-dashoffset="1.49998"
       stroke-linejoin="round"
       stroke-width=".5"
       transform="matrix(0 1 1 0 0 0)"
       id="circle9" />
    <g
       fill="none"
       transform="matrix(1 0 0 -1 15.75 22.75)"
       id="g15">
      <path
         d="m-4.25 13.25v-4"
         id="path11" />
      <path
         d="m-2.25 11.25h-4"
         id="path13" />
    </g>
  </g>
</svg>
