<?xml version="1.0" encoding="UTF-8" standalone="no"?>
<svg
   width="16"
   height="16"
   version="1.1"
   viewBox="0 0 16 16"
   id="svg17"
   sodipodi:docname="Chart_20_16.svg"
   inkscape:version="1.3.2 (091e20e, 2023-11-25, custom)"
   xmlns:inkscape="http://www.inkscape.org/namespaces/inkscape"
   xmlns:sodipodi="http://sodipodi.sourceforge.net/DTD/sodipodi-0.dtd"
   xmlns="http://www.w3.org/2000/svg"
   xmlns:svg="http://www.w3.org/2000/svg">
  <defs
     id="defs17" />
  <sodipodi:namedview
     id="namedview17"
     pagecolor="#ffffff"
     bordercolor="#000000"
     borderopacity="0.25"
     inkscape:showpageshadow="2"
     inkscape:pageopacity="0.0"
     inkscape:pagecheckerboard="0"
     inkscape:deskcolor="#d1d1d1"
     showgrid="true"
     inkscape:current-layer="svg17">
    <inkscape:grid
       id="grid17"
       units="px"
       originx="0"
       originy="0"
       spacingx="0.5"
       spacingy="0.5"
       empcolor="#0099e5"
       empopacity="0.30196078"
       color="#0099e5"
       opacity="0.14901961"
       empspacing="2"
       dotted="false"
       gridanglex="30"
       gridanglez="30"
       visible="true" />
  </sodipodi:namedview>
  <rect
     x="1"
     y="13"
     width="2"
     height="2"
     fill="#2a7efe"
     id="rect1" />
  <rect
     x="10"
     y="10"
     width="2"
     height="2"
     fill="#ff7f00"
     id="rect2" />
  <rect
     x="10"
     y="13"
     width="2"
     height="2"
     fill="#ff7f00"
     id="rect3" />
  <rect
     x="7"
     y="7"
     width="2"
     height="2"
     fill="#2a7efe"
     id="rect4" />
  <rect
     x="7"
     y="10"
     width="2"
     height="2"
     fill="#2a7efe"
     id="rect5" />
  <rect
     x="7"
     y="13"
     width="2"
     height="2"
     fill="#2a7efe"
     id="rect6" />
  <rect
     x="4"
     y="4"
     width="2"
     height="2"
     fill="#2a7efe"
     id="rect7" />
  <rect
     x="4"
     y="7"
     width="2"
     height="2"
     fill="#2a7efe"
     id="rect8" />
  <rect
     x="4"
     y="10"
     width="2"
     height="2"
     fill="#2a7efe"
     id="rect9" />
  <rect
     x="4"
     y="13"
     width="2"
     height="2"
     fill="#2a7efe"
     id="rect10" />
  <rect
     x="1"
     y="10"
     width="2"
     height="2"
     fill="#2a7efe"
     id="rect11" />
  <rect
     x="13"
     y="7"
     width="2"
     height="2"
     fill="#2a7efe"
     id="rect12" />
  <rect
     x="13"
     y="10"
     width="2"
     height="2"
     fill="#2a7efe"
     id="rect13" />
  <rect
     x="13"
     y="13"
     width="2"
     height="2"
     fill="#2a7efe"
     id="rect14" />
  <rect
     x="10"
     y="1"
     width="2"
     height="2"
     fill="#ff7f00"
     id="rect15" />
  <rect
     x="10"
     y="4"
     width="2"
     height="2"
     fill="#ff7f00"
     id="rect16" />
  <rect
     x="10"
     y="7"
     width="2"
     height="2"
     fill="#ff7f00"
     id="rect17" />
</svg>
