<?xml version="1.0" encoding="UTF-8" standalone="no"?>
<svg
   height="24"
   viewBox="0 0 24 24"
   width="24"
   version="1.1"
   id="svg40"
   sodipodi:docname="Zoom_07_24.svg"
   inkscape:export-filename="Zoom_07_24.png"
   inkscape:export-xdpi="96"
   inkscape:export-ydpi="96"
   inkscape:version="1.3.2 (091e20e, 2023-11-25, custom)"
   xmlns:inkscape="http://www.inkscape.org/namespaces/inkscape"
   xmlns:sodipodi="http://sodipodi.sourceforge.net/DTD/sodipodi-0.dtd"
   xmlns="http://www.w3.org/2000/svg"
   xmlns:svg="http://www.w3.org/2000/svg">
  <defs
     id="defs40" />
  <sodipodi:namedview
     id="namedview40"
     pagecolor="#ffffff"
     bordercolor="#000000"
     borderopacity="0.25"
     inkscape:showpageshadow="2"
     inkscape:pageopacity="0.0"
     inkscape:pagecheckerboard="0"
     inkscape:deskcolor="#d1d1d1"
     showgrid="true"
     inkscape:current-layer="svg40">
    <inkscape:grid
       id="grid40"
       units="px"
       originx="0"
       originy="0"
       spacingx="0.5"
       spacingy="0.5"
       empcolor="#0099e5"
       empopacity="0.30196078"
       color="#0099e5"
       opacity="0.14901961"
       empspacing="2"
       dotted="false"
       gridanglex="30"
       gridanglez="30"
       visible="true" />
  </sodipodi:namedview>
  <g
     stroke-linecap="round"
     id="g40">
    <path
       d="m2.488166 1.488166h11.023668v11.023668h-11.023668z"
       fill="#fff"
       stroke="#ccc"
       stroke-width=".976332"
       id="path1" />
    <g
       fill="#2a7fff"
       stroke-linejoin="round"
       stroke-width="7.5"
       id="g5">
      <path
         d="m1 0h3v3h-3z"
         id="path2" />
      <path
         d="m1 20h3v3h-3z"
         id="path3" />
      <path
         d="m21 20h3v3h-3z"
         id="path4" />
      <path
         d="m21 0h3v3h-3z"
         id="path5" />
    </g>
    <path
       d="m7.25 6.25 11 11"
       fill="none"
       stroke="#2a7fff"
       stroke-width="1.5"
       id="path6" />
    <g
       fill="#3f7cd7"
       stroke-linejoin="round"
       stroke-width="5"
       id="g39">
      <path
         d="m2 4h1v1h-1z"
         id="path7" />
      <path
         d="m2 12h1v1h-1z"
         id="path8" />
      <path
         d="m2 10h1v1h-1z"
         id="path9" />
      <path
         d="m2 8h1v1h-1z"
         id="path10" />
      <path
         d="m2 6h1v1h-1z"
         id="path11" />
      <path
         d="m2 14h1v1h-1z"
         id="path12" />
      <path
         d="m2 18h1v1h-1z"
         id="path13" />
      <path
         d="m2 16h1v1h-1z"
         id="path14" />
      <path
         d="m22 4h1v1h-1z"
         id="path15" />
      <path
         d="m22 12h1v1h-1z"
         id="path16" />
      <path
         d="m22 10h1v1h-1z"
         id="path17" />
      <path
         d="m22 8h1v1h-1z"
         id="path18" />
      <path
         d="m22 6h1v1h-1z"
         id="path19" />
      <path
         d="m22 14h1v1h-1z"
         id="path20" />
      <path
         d="m22 18h1v1h-1z"
         id="path21" />
      <path
         d="m22 16h1v1h-1z"
         id="path22" />
      <g
         transform="matrix(0 1 -1 0 24 -2)"
         id="g30">
        <path
           d="m3 4h1v1h-1z"
           id="path23" />
        <path
           d="m3 12h1v1h-1z"
           id="path24" />
        <path
           d="m3 10h1v1h-1z"
           id="path25" />
        <path
           d="m3 8h1v1h-1z"
           id="path26" />
        <path
           d="m3 6h1v1h-1z"
           id="path27" />
        <path
           d="m3 14h1v1h-1z"
           id="path28" />
        <path
           d="m3 18h1v1h-1z"
           id="path29" />
        <path
           d="m3 16h1v1h-1z"
           id="path30" />
      </g>
      <g
         transform="matrix(0 1 -1 0 24 18)"
         id="g38">
        <path
           d="m3 4h1v1h-1z"
           id="path31" />
        <path
           d="m3 12h1v1h-1z"
           id="path32" />
        <path
           d="m3 10h1v1h-1z"
           id="path33" />
        <path
           d="m3 8h1v1h-1z"
           id="path34" />
        <path
           d="m3 6h1v1h-1z"
           id="path35" />
        <path
           d="m3 14h1v1h-1z"
           id="path36" />
        <path
           d="m3 18h1v1h-1z"
           id="path37" />
        <path
           d="m3 16h1v1h-1z"
           id="path38" />
      </g>
    </g>
    <path
       d="m18.25 12.75v4.5h-4.5"
       fill="none"
       stroke="#2a7fff"
       stroke-width="1.5"
       id="path39" />
  </g>
</svg>
