<svg width="16" height="16" version="1.1" viewBox="0 0 16 16" xmlns="http://www.w3.org/2000/svg">
 <defs>
  <linearGradient id="a" x1="112.7" x2="144.74" y1="19.467" y2="232.79" gradientTransform="matrix(.95614 0 0 .95614 -323.17 -186.01)" gradientUnits="userSpaceOnUse">
   <stop stop-color="#fcfcfd" offset="0"/>
   <stop stop-color="#a6b6d9" offset=".49645"/>
   <stop stop-color="#47d2f9" offset="1"/>
  </linearGradient>
  <filter id="b" x="-.036" y="-.036" width="1.072" height="1.072" color-interpolation-filters="sRGB">
   <feGaussianBlur stdDeviation="3.27"/>
  </filter>
 </defs>
 <circle cx="8" cy="8" r="7.25" fill="#20345e"/>
 <circle cx="8" cy="8" r="6.75" fill="#3371b4" stroke-width=".999983"/>
 <circle transform="matrix(.05990609 0 0 .05990701 20.028543 11.811703)" cx="-200.78999" cy="-63.626999" r="109" fill="url(#a)" filter="url(#b)" stroke-width="1.03572"/>
 <path d="m8.0837243 3.7817514c0.05001 0.1159386 0.1560462 0.1796936 0.1157967 0.2685032-0.03071 0.067762-0.025646 0.00824-0.2152789 0.075036-0.235794 0.083052-0.4027108 0.2556197-0.4142549 0.4286051-0.00409 0.061354 0.044084 0.2480637 0.1060129 0.4152578 0.088481 0.2388807 0.1061761 0.3931313 0.083175 0.7171132-0.03783 0.5328597 0.048199 0.7724481 0.3343377 0.9322559 0.4024789 0.2247856 0.916247 0.1766214 1.285127-0.1184024 0.3003912-0.240248 0.3999912-0.4168711 0.4240417-0.7554695 0.0257926-0.3631006-0.1434405-0.7795421-0.4468721-1.1039961-0.1260275-0.1347566-0.4324276-0.4908188-0.6817203-0.7904938-0.2492955-0.29968-0.468935-0.5455511-0.5269411-0.5499569-0.058003-0.00441-0.1693494 0.063265-0.1734325 0.1198873-0.00408 0.056623 0.046269 0.2138904 0.1100088 0.3616602zm-2.9372557 0.9489257c0.0016716 0.2394641-0.0353751 0.4686552-0.1092777 0.6687496-0.302231 0.8183031-0.025208 1.6401587 0.6393168 1.8945098 0.4679484 0.1791112 1.1732746-0.0038433 1.4238135-0.3702365 0.2152487-0.3147828 0.1545517-0.5965938-0.2479047-1.1623992-0.1003533-0.1410824-0.2000661-0.3512479-0.2218065-0.4669549-0.0971104-0.5168438-0.2939127-0.6951575-0.7306519-0.6620817-0.2549403 0.0193078-0.2320594 0.0485936-0.3490146-0.4636261-0.0258402-0.1131708-0.0673157-0.1508408-0.1990328-0.1498109-0.1317246 0.00103-0.2088234 0.2273888-0.2054421 0.7118499zm5.1944614 2.1229109c-0.337457 0.7612842-0.3652222 1.0346879-0.133735 1.2824737 0.08323 0.089089 0.27437 0.2094422 0.424037 0.2685015 0.509131 0.2009061 0.940325 0.1147224 1.324311-0.2668302 0.463404-0.4604651 0.39884-1.0468692 0.159318-1.9061654-0.080844-0.2900323-0.207311-0.5623734-0.329219-0.7304555-0.181102-0.2496975-0.310961-0.4063601-0.439685-0.3719269-0.128721 0.034432-0.136335 0.063783-0.117251 0.2545444 0.01908 0.1907601 0.09372 0.2877916 0.04407 0.3589868-0.04965 0.071195 0.184581-0.04396-0.149006 0.050232s-0.390061 0.1745574-0.78284 1.0606395zm-7.140167 0.8238791c-0.016925 0.240053 0.2517811 1.3303362 0.4028352 1.6327144 0.1305388 0.261311 0.5132148 0.6506072 0.7420562 0.7554675 0.7489909 0.343205 1.688319-0.1733385 1.6912863-0.928919 7.897e-4 -0.2010573-0.0282753-0.2626688-0.2006019-0.4286042-0.1108516-0.1067412-0.4902423-0.3791231-0.8431834-0.6053835-0.6862519-0.4399342-0.942386-0.5103178-1.1954209-0.3285357-0.1090899 0.0783712-0.1202826 0.0708979-0.2136533-0.1250755-0.0746928-0.1567699-0.1312989-0.206796-0.2421144-0.2068056-0.1108193-1.04e-5 -0.1264912 0.0264594-0.1412038 0.2351416zm3.6467844 1.4092166c-0.031434 0.085348-0.057069 0.3172343-0.057069 0.5153225 0 0.4398268-0.1026729 0.6823068-0.3897799 0.9189088-0.3710152 0.305749-0.4447951 0.590517-0.2609473 1.005661 0.2191618 0.494891 0.5848561 0.774604 1.1040898 0.847199 0.1499821 0.02097 0.3451443 0.03177 0.4338196 0.02333 1.5067879-0.143497 3.2582754-0.730751 3.6711694-1.230787 0.282864-0.34256 0.351765-0.884369 0.167987-1.322495-0.126874-0.302466-0.286537-0.4081938-0.750214-0.4986245-0.393731-0.076789-0.599088-0.2130451-0.8040381-0.5336666-0.2753797-0.4308011-0.697843-0.6814152-1.0707943-0.6789433-0.541311 0.0035878-1.0464065 0.1760451-1.4133643 0.3324336-0.3669577 0.1563888-0.5625731 0.4362556-0.6308589 0.6216615z" fill="#000000" stroke-width=".999991"/>
</svg>
