<?xml version="1.0" encoding="UTF-8" standalone="no"?>
<svg
   height="16"
   width="16"
   version="1.1"
   id="svg12"
   sodipodi:docname="Database_11_16.svg"
   inkscape:export-filename="Database_11_16.png"
   inkscape:export-xdpi="96"
   inkscape:export-ydpi="96"
   inkscape:version="1.2.1 (9c6d41e410, 2022-07-14)"
   xmlns:inkscape="http://www.inkscape.org/namespaces/inkscape"
   xmlns:sodipodi="http://sodipodi.sourceforge.net/DTD/sodipodi-0.dtd"
   xmlns="http://www.w3.org/2000/svg"
   xmlns:svg="http://www.w3.org/2000/svg">
  <defs
     id="defs16" />
  <sodipodi:namedview
     id="namedview14"
     pagecolor="#ffffff"
     bordercolor="#666666"
     borderopacity="1.0"
     inkscape:showpageshadow="2"
     inkscape:pageopacity="0.0"
     inkscape:pagecheckerboard="0"
     inkscape:deskcolor="#d1d1d1"
     showgrid="true"
     inkscape:zoom="57.375"
     inkscape:cx="6.7538126"
     inkscape:cy="8"
     inkscape:current-layer="svg12">
    <inkscape:grid
       type="xygrid"
       id="grid861" />
  </sodipodi:namedview>
  <path
     id="path2"
     style="fill:#00aad4;stroke-width:2;stroke-linecap:round;stroke-linejoin:round;stroke-miterlimit:5.6"
     d="M 7 1 C 3.6863019 1 1 2.045335 1 3.3339844 L 1 5.1992188 C 1 6.4878682 3.6863019 7.5332031 7 7.5332031 C 7.2464735 7.5332031 7.4878784 7.5268614 7.7265625 7.515625 A 5.5 5.5 0 0 1 11.5 6 A 5.5 5.5 0 0 1 12.537109 6.0996094 C 12.835471 5.8224513 13 5.5184257 13 5.1992188 L 13 3.3339844 C 13 2.045335 10.3137 1 7 1 z M 7 2.4003906 C 9.7722252 2.4003906 11.582683 3.296186 12.433594 4.0019531 C 11.584714 4.580954 9.7793862 5.2392699 7 5.1992188 C 4.2503361 5.1594352 2.4454187 4.5129445 1.5859375 3.9609375 C 2.4399516 3.2526235 4.2329107 2.4003906 7 2.4003906 z M 1 6.5996094 L 1 8.9335938 C 1 10.092061 3.1734407 11.051864 6.0195312 11.234375 A 5.5 5.5 0 0 1 6.6542969 8.9277344 C 3.5024498 8.8576366 1 7.8428616 1 6.5996094 z M 1 10.333984 L 1 12.666016 C 1 13.954665 3.6862986 15 7 15 C 7.0890479 15 7.1755701 14.995635 7.2636719 14.994141 A 5.5 5.5 0 0 1 6.1347656 12.638672 C 3.232296 12.475336 1 11.508024 1 10.333984 z " />
  <g
     fill="none"
     stroke="#ff2828"
     stroke-linecap="round"
     id="g8">
    <circle
       cx="11.5"
       cy="11.5"
       r="4"
       stroke-dashoffset="1.49998"
       stroke-linejoin="round"
       id="circle2" />
    <path
       d="m 10,10 3,3"
       id="path4" />
    <path
       d="m 13,10 -3,3"
       id="path6" />
  </g>
</svg>
