<?xml version="1.0" encoding="UTF-8" standalone="no"?>
<svg
   height="16"
   width="16"
   version="1.1"
   id="svg28"
   sodipodi:docname="Flag_03_16.svg"
   inkscape:export-filename="Flag_03_16.png"
   inkscape:export-xdpi="96"
   inkscape:export-ydpi="96"
   inkscape:version="1.2.1 (9c6d41e410, 2022-07-14)"
   xmlns:inkscape="http://www.inkscape.org/namespaces/inkscape"
   xmlns:sodipodi="http://sodipodi.sourceforge.net/DTD/sodipodi-0.dtd"
   xmlns="http://www.w3.org/2000/svg"
   xmlns:svg="http://www.w3.org/2000/svg">
  <defs
     id="defs32" />
  <sodipodi:namedview
     id="namedview30"
     pagecolor="#ffffff"
     bordercolor="#666666"
     borderopacity="1.0"
     inkscape:pageshadow="2"
     inkscape:pageopacity="0.0"
     inkscape:pagecheckerboard="0"
     inkscape:deskcolor="#d1d1d1"
     showgrid="true"
     inkscape:zoom="57.375"
     inkscape:cx="6.1176471"
     inkscape:cy="8"
     inkscape:current-layer="svg28"
     inkscape:showpageshadow="2">
    <inkscape:grid
       type="xygrid"
       id="grid932" />
  </sodipodi:namedview>
  <path
     id="path4"
     style="fill-rule:evenodd;stroke-width:1;stroke:none;fill:#ff7f00;fill-opacity:1"
     d="M 8.5175781 2.3417969 C 8.5100429 2.3516325 7.858512 4.05487 7.859375 4.0625 C 7.8599119 4.0672454 7.9513388 4.1055714 8.0625 4.1464844 C 8.4786237 4.29964 8.8288991 4.3700473 9.3203125 4.3984375 C 9.4540452 4.406164 9.5839289 4.4102531 9.6074219 4.4082031 C 9.6467172 4.4048081 9.6750375 4.3364792 9.9765625 3.5507812 C 10.156847 3.0810088 10.302881 2.6937062 10.300781 2.6914062 C 10.298643 2.6891113 10.200354 2.6834744 10.082031 2.6777344 C 9.521748 2.6505766 9.1428567 2.576697 8.6953125 2.40625 C 8.5983932 2.369339 8.5192281 2.3396369 8.5175781 2.3417969 z M 12.677734 2.6289062 C 12.63545 2.6296382 12.595341 2.6318645 12.558594 2.6347656 L 12.443359 2.6425781 L 12.117188 3.4921875 C 11.938251 3.9592041 11.793975 4.3434131 11.796875 4.3457031 C 11.79974 4.3479931 11.923628 4.3527488 12.070312 4.3554688 C 12.540331 4.3641854 12.968152 4.436465 13.345703 4.5722656 C 13.463041 4.6144716 13.566772 4.6487714 13.576172 4.6484375 C 13.592165 4.6478749 14.245887 2.968617 14.242188 2.9375 C 14.23958 2.9154061 13.898815 2.7962877 13.695312 2.7460938 C 13.388866 2.6705095 12.973725 2.6237828 12.677734 2.6289062 z M 6.3476562 2.75 C 6.3431675 2.7555586 6.1961836 3.1364829 6.0195312 3.5957031 L 5.6972656 4.4296875 L 5.7421875 4.5195312 C 5.8234871 4.6873229 6.0140808 4.9796313 6.1445312 5.1347656 C 6.3556364 5.3858151 6.6943166 5.647583 6.9941406 5.7929688 C 7.0605832 5.8251863 7.08703 5.8311751 7.09375 5.8144531 C 7.1308686 5.722198 7.7445678 4.1151081 7.7441406 4.1113281 C 7.7438406 4.1086831 7.7011654 4.0845037 7.6484375 4.0585938 C 7.4905546 3.9810127 7.2061243 3.7958871 7.0820312 3.6894531 C 6.8378102 3.4799865 6.6207059 3.2118784 6.4589844 2.921875 C 6.4030943 2.8216513 6.3521362 2.74444 6.3476562 2.75 z M 11.658203 4.4414062 C 11.655972 4.4396273 11.391155 4.4485515 11.070312 4.4609375 C 10.74947 4.4733225 10.351295 4.4854013 10.185547 4.4882812 C 10.019801 4.4911612 9.8432627 4.4970131 9.7929688 4.5019531 L 9.7011719 4.5117188 L 9.375 5.359375 C 9.1959508 5.8255958 9.0537438 6.2090206 9.0585938 6.2128906 C 9.0741853 6.2253346 9.6804255 6.213554 10.316406 6.1875 C 10.656467 6.173577 10.946578 6.1629525 10.960938 6.1640625 C 10.975297 6.1651755 10.9934 6.1593237 11 6.1523438 C 11.013671 6.1378678 11.664403 4.4463562 11.658203 4.4414062 z M 13.640625 4.7675781 L 13.314453 5.6152344 C 13.135192 6.0824247 12.987262 6.4750031 12.986328 6.4863281 C 12.985393 6.4976526 13.061237 6.5456743 13.154297 6.59375 C 13.616569 6.8325587 14.082352 7.2760134 14.382812 7.7617188 C 14.425392 7.8305579 14.46405 7.8855023 14.46875 7.8847656 C 14.473409 7.8840064 14.622563 7.5006999 14.800781 7.0332031 L 15.125 6.1835938 L 15 5.9882812 C 14.682061 5.4910065 14.273724 5.1036857 13.796875 4.8496094 L 13.640625 4.7675781 z M 7.1308594 5.9570312 C 7.1231442 5.9670691 6.4737232 7.6699015 6.4746094 7.6777344 C 6.4751463 7.6824797 6.5665733 7.7208058 6.6777344 7.7617188 C 7.0938581 7.9148744 7.4441334 7.9852816 7.9355469 8.0136719 C 8.0692794 8.021401 8.1972102 8.0254832 8.2207031 8.0234375 C 8.2599986 8.0200425 8.2902717 7.9517143 8.5917969 7.1660156 C 8.7720808 6.6962433 8.9172025 6.3097306 8.9140625 6.3066406 C 8.9109252 6.3035506 8.7966686 6.2938994 8.6601562 6.2871094 C 8.1484262 6.261673 7.7795571 6.190228 7.3417969 6.0292969 C 7.2278487 5.9874069 7.1326694 5.9546713 7.1308594 5.9570312 z M 11.185547 6.2421875 C 11.138618 6.2431222 11.104302 6.2465825 11.091797 6.25 C 11.063592 6.257709 10.990824 6.4319122 10.732422 7.1074219 C 10.553787 7.5744041 10.409209 7.9586475 10.412109 7.9609375 C 10.414975 7.9632275 10.53691 7.9679831 10.683594 7.9707031 C 11.153613 7.9794198 11.583386 8.0516994 11.960938 8.1875 C 12.078275 8.229706 12.182006 8.2640059 12.191406 8.2636719 C 12.20684 8.2631295 12.859322 6.5870523 12.857422 6.5527344 C 12.856999 6.5449024 12.763743 6.5044116 12.650391 6.4628906 C 12.416227 6.3771163 11.998142 6.2848117 11.740234 6.2617188 C 11.584674 6.2477905 11.326332 6.2393835 11.185547 6.2421875 z M 4.9628906 6.3652344 C 4.9584018 6.3707929 4.8113868 6.7517205 4.6347656 7.2109375 L 4.3125 8.0449219 L 4.3554688 8.1269531 C 4.504175 8.4140647 4.6522982 8.6342273 4.828125 8.8300781 C 4.9690404 8.9870405 5.3123769 9.2507979 5.515625 9.3574219 C 5.644277 9.4249051 5.7005813 9.4457185 5.7070312 9.4296875 C 5.7441603 9.3374036 6.3598021 7.7303425 6.359375 7.7265625 C 6.359076 7.7239175 6.3144457 7.6997381 6.2617188 7.6738281 C 6.1038357 7.5962472 5.8213589 7.4111215 5.6972656 7.3046875 C 5.4530446 7.0952209 5.2339872 6.8271129 5.0722656 6.5371094 C 5.0163759 6.4368862 4.9673734 6.3596788 4.9628906 6.3652344 z M 10.271484 8.0566406 C 10.269266 8.0548706 10.004438 8.0637859 9.6835938 8.0761719 C 9.3627506 8.0885569 8.9645755 8.1006356 8.7988281 8.1035156 C 8.6330808 8.1063956 8.4565439 8.1122475 8.40625 8.1171875 L 8.3164062 8.1269531 L 7.9902344 8.9746094 C 7.8111852 9.4408302 7.66694 9.8237952 7.6699219 9.8261719 C 7.6830584 9.8366523 7.9859147 9.835615 8.390625 9.8222656 C 8.6317176 9.8143134 8.9552936 9.8036817 9.1113281 9.7988281 C 9.267363 9.793977 9.4476887 9.7851669 9.5097656 9.7792969 L 9.6210938 9.7675781 L 9.9492188 8.9140625 C 10.12912 8.4442735 10.273684 8.0584006 10.271484 8.0566406 z M 12.255859 8.3828125 L 11.929688 9.2324219 C 11.750426 9.6996122 11.602962 10.091706 11.601562 10.103516 C 11.600193 10.115346 11.630272 10.137537 11.669922 10.154297 C 11.796877 10.207959 12.081783 10.391597 12.248047 10.525391 C 12.525498 10.748658 12.846983 11.11335 13.013672 11.396484 C 13.047772 11.454392 13.079284 11.500533 13.083984 11.5 C 13.088669 11.499465 13.237797 11.117888 13.416016 10.650391 L 13.740234 9.7988281 L 13.615234 9.6035156 C 13.297295 9.106241 12.888957 8.7208733 12.412109 8.4667969 L 12.255859 8.3828125 z " />
  <path
     d="M 15.8624,4.3792671 C 15.294673,3.3667383 14.457818,2.7615248 13.177529,2.6093207 12.260767,2.5003335 10.264425,2.8096794 9.1635133,2.5120803 7.9625488,2.187435 7.4218442,1.62431 7.0392256,0.8167713 L 4.268457,8.048332 c 0.3826185,0.8075387 0.9233231,1.3706636 2.1242876,1.6953089 1.1009117,0.2975991 3.097253,-0.011747 4.0140154,0.09724 1.28029,0.1522041 2.117144,0.7574191 2.684872,1.7699481 z"
     fill="#ffffff"
     fill-rule="evenodd"
     stroke="#808080"
     stroke-width="0.25"
     id="path2"
     style="stroke:#00aad4;stroke-opacity:1;fill:none" />
  <path
     d="M 6.3042407,0.75081333 0.74919199,15.249198"
     fill="none"
     stroke="#c87137"
     stroke-linecap="round"
     stroke-width="1.5"
     id="path26"
     style="stroke:#00aad4;stroke-opacity:1" />
</svg>
