<?xml version="1.0" encoding="UTF-8" standalone="no"?>
<svg
   height="24"
   viewBox="0 0 6.3499998 6.3500003"
   width="24"
   version="1.1"
   id="svg131"
   sodipodi:docname="Font_15_24.svg"
   inkscape:version="1.2 (dc2aedaf03, 2022-05-15)"
   inkscape:export-filename="Font_15_24.png"
   inkscape:export-xdpi="96"
   inkscape:export-ydpi="96"
   xmlns:inkscape="http://www.inkscape.org/namespaces/inkscape"
   xmlns:sodipodi="http://sodipodi.sourceforge.net/DTD/sodipodi-0.dtd"
   xmlns="http://www.w3.org/2000/svg"
   xmlns:svg="http://www.w3.org/2000/svg">
  <defs
     id="defs135">
    <filter
       inkscape:collect="always"
       style="color-interpolation-filters:sRGB"
       id="filter902"
       x="-0.087501355"
       y="-0.065624233"
       width="1.1750027"
       height="1.1312485">
      <feGaussianBlur
         inkscape:collect="always"
         stdDeviation="0.17361667"
         id="feGaussianBlur904" />
    </filter>
  </defs>
  <sodipodi:namedview
     id="namedview133"
     pagecolor="#ffffff"
     bordercolor="#666666"
     borderopacity="1.0"
     inkscape:showpageshadow="2"
     inkscape:pageopacity="0.0"
     inkscape:pagecheckerboard="0"
     inkscape:deskcolor="#d1d1d1"
     showgrid="true"
     inkscape:zoom="38.25"
     inkscape:cx="9.4117647"
     inkscape:cy="12"
     inkscape:current-layer="svg131">
    <inkscape:grid
       type="xygrid"
       id="grid1286" />
  </sodipodi:namedview>
  <g
     id="g908">
    <path
       id="path343"
       style="fill:#ffffff;fill-opacity:1;stroke:none;stroke-width:0.264583;stroke-dasharray:none;filter:url(#filter902)"
       d="M 1.3223999 0 A 0.39652402 0.39652402 0 0 0 0.92552491 0.39635824 L 0.92552491 5.953125 A 0.39652402 0.39652402 0 0 0 1.3223999 6.3494833 L 3.6189006 6.3494833 C 4.226607 6.3494833 4.7446771 6.1894227 5.1170004 5.8688925 C 5.4893236 5.5483623 5.687508 5.0728053 5.6875082 4.5645793 C 5.6875086 3.8834298 5.2976036 3.4461824 4.8379476 3.1445109 C 4.9314047 3.0688886 5.0583488 3.0452776 5.1345704 2.947107 C 5.3679844 2.6464782 5.4901042 2.2478594 5.4901042 1.784904 C 5.4901042 1.3551708 5.2937639 0.92994615 4.9609375 0.5896281 C 4.6281112 0.24931005 4.1379419 -6.1762786e-09 3.5548218 0 L 1.3223999 0 z M 2.7109457 1.5880168 L 3.3067749 1.5880168 C 3.3733113 1.5880168 3.4856538 1.6343712 3.5723918 1.7208252 C 3.6591298 1.8072792 3.7052002 1.9184892 3.7052002 1.984375 C 3.7052002 2.0520676 3.6600916 2.1642496 3.5744588 2.2499919 C 3.488826 2.3357342 3.3778032 2.3807333 3.3067749 2.3807333 L 2.7109457 2.3807333 L 2.7109457 1.5880168 z M 2.7305827 3.96875 L 3.5057292 3.96875 C 3.5722653 3.96875 3.6850967 4.0132421 3.7713461 4.0994914 C 3.8575954 4.1857407 3.9020873 4.298572 3.9020874 4.3651083 C 3.9020871 4.4977254 3.8667823 4.6023039 3.8204387 4.6581136 C 3.774095 4.7139234 3.7150174 4.7635336 3.5057292 4.7635336 L 2.7305827 4.7635336 L 2.7305827 3.96875 z " />
    <path
       d="M 1.3229167,0.39687499 V 5.9531251 h 2.2959839 c 1.0774535,0 1.6727661,-0.562756 1.6727665,-1.3890627 5e-7,-0.7937501 -0.6463449,-1.3012166 -1.1906254,-1.3890623 0.5953124,-0.1984376 0.9921874,-0.5953124 0.9921874,-1.3890625 0,-0.5953126 -0.5953124,-1.38906261 -1.539441,-1.38906261 z M 2.3151041,1.190625 h 0.9921875 c 0.3968752,0 0.7937501,0.396875 0.7937501,0.7937501 0,0.396875 -0.391449,0.79375 -0.7937501,0.79375 H 2.3151041 Z m 0.019378,2.38125 H 3.505729 c 0.396875,0 0.7937501,0.396875 0.7937501,0.7937501 -6e-7,0.396875 -0.1984382,0.79375 -0.7937507,0.79375 H 2.3344828 Z"
       id="path2"
       style="fill:#000000;fill-opacity:1;stroke:none;stroke-width:0.264583;stroke-dasharray:none"
       sodipodi:nodetypes="ccsscssccssscccssscc" />
  </g>
</svg>
