<?xml version="1.0" encoding="UTF-8" standalone="no"?>
<svg
   width="36"
   height="36"
   version="1.1"
   viewBox="0 0 36 36"
   id="svg12"
   sodipodi:docname="ttiradiogroup_150.svg"
   inkscape:version="1.3.2 (091e20e, 2023-11-25, custom)"
   xmlns:inkscape="http://www.inkscape.org/namespaces/inkscape"
   xmlns:sodipodi="http://sodipodi.sourceforge.net/DTD/sodipodi-0.dtd"
   xmlns="http://www.w3.org/2000/svg"
   xmlns:svg="http://www.w3.org/2000/svg">
  <sodipodi:namedview
     id="namedview12"
     pagecolor="#ffffff"
     bordercolor="#000000"
     borderopacity="0.25"
     inkscape:showpageshadow="2"
     inkscape:pageopacity="0.0"
     inkscape:pagecheckerboard="0"
     inkscape:deskcolor="#d1d1d1"
     showgrid="true"
     inkscape:current-layer="svg12">
    <inkscape:grid
       id="grid12"
       units="px"
       originx="0"
       originy="0"
       spacingx="0.5"
       spacingy="0.5"
       empcolor="#0099e5"
       empopacity="0.30196078"
       color="#0099e5"
       opacity="0.14901961"
       empspacing="2"
       dotted="false"
       gridanglex="30"
       gridanglez="30"
       visible="true" />
  </sodipodi:namedview>
  <defs
     id="defs6">
    <radialGradient
       id="a"
       cx="5.3999925"
       cy="1034.7039"
       r="4"
       gradientTransform="matrix(1.9642759,-1.9642982,1.1785882,1.1785751,-1221.5255,-1200.2975)"
       gradientUnits="userSpaceOnUse">
      <stop
         stop-color="#198d19"
         offset="0"
         id="stop1" />
      <stop
         stop-color="#ffffff"
         offset="1"
         id="stop2" />
    </radialGradient>
    <radialGradient
       id="b"
       cx="5.3999925"
       cy="1034.7039"
       r="4"
       gradientTransform="matrix(1.9642759,-1.9660222,1.1785882,1.1796095,-1221.5255,-1189.3522)"
       gradientUnits="userSpaceOnUse">
      <stop
         stop-color="#ff1919"
         offset="0"
         id="stop3" />
      <stop
         stop-color="#ffffff"
         offset="1"
         id="stop4" />
    </radialGradient>
    <radialGradient
       id="c"
       cx="5.3999925"
       cy="1034.7039"
       r="4"
       gradientTransform="matrix(1.7857054,-1.7872929,1.0714438,1.0723723,-1097.8414,-1091.5063)"
       gradientUnits="userSpaceOnUse">
      <stop
         stop-color="#1a75ff"
         offset="0"
         id="stop5" />
      <stop
         stop-color="#ffffff"
         offset="1"
         id="stop6" />
    </radialGradient>
  </defs>
  <circle
     cx="7"
     cy="6.9999828"
     r="5.5"
     fill="url(#a)"
     fill-rule="evenodd"
     stroke="#198d19"
     stroke-linecap="square"
     stroke-linejoin="round"
     style="paint-order:normal"
     id="circle6" />
  <ellipse
     cx="7"
     cy="19.004866"
     rx="5.5"
     ry="5.504827"
     fill="url(#b)"
     fill-rule="evenodd"
     stroke="#ff1a1a"
     stroke-linecap="square"
     stroke-linejoin="round"
     style="paint-order:normal"
     id="ellipse6" />
  <rect
     x="13.499999"
     y="13.499983"
     width="22.000002"
     height="22.000002"
     fill="#f9f9f9"
     stroke="#2a7efe"
     stroke-width=".999998"
     style="paint-order:normal"
     id="rect6" />
  <rect
     x="16.000002"
     y="12.999983"
     width="13"
     height="3"
     fill="#f9f9f9"
     stroke-width="1.46666"
     style="paint-order:normal"
     id="rect7" />
  <path
     d="m18.500001 12.5h8"
     fill="none"
     stroke="#2a7efe"
     stroke-linecap="round"
     stroke-width="3"
     id="path7" />
  <circle
     cx="18"
     cy="18.999983"
     r="1.3833334"
     fill="#2a7efe"
     stroke="#999999"
     stroke-linejoin="round"
     stroke-width=".733333"
     style="paint-order:normal"
     id="circle7" />
  <path
     d="M 21.499999,19.25 H 32.5"
     fill="none"
     stroke="#b3b3b3"
     stroke-width="1.5"
     id="path8" />
  <path
     d="M 21.499999,29.25 H 32.5"
     fill="none"
     stroke="#b3b3b3"
     stroke-width="1.5"
     id="path9" />
  <path
     d="M 21.499999,24.25 H 31"
     fill="none"
     stroke="#b3b3b3"
     stroke-width="1.5"
     id="path10" />
  <circle
     cx="18"
     cy="28.999983"
     r="1.3833334"
     fill="#ffffff"
     stroke="#999999"
     stroke-linejoin="round"
     stroke-width=".733333"
     style="paint-order:normal"
     id="circle10" />
  <circle
     cx="18"
     cy="23.999983"
     r="1.3833334"
     fill="#ffffff"
     stroke="#999999"
     stroke-linejoin="round"
     stroke-width=".733333"
     style="paint-order:normal"
     id="circle11" />
  <path
     d="M 15.953125,10.951172 A 3,3 0 0 1 18.5,9.5 h 4.830078 A 5,5.0043883 0 0 0 24,7 5,5.0043883 0 0 0 19,1.9960937 5,5.0043883 0 0 0 14,7 a 5,5.0043883 0 0 0 1.953125,3.951172 z"
     fill="url(#c)"
     fill-rule="evenodd"
     stroke-linecap="square"
     stroke-linejoin="round"
     id="path11" />
  <path
     d="m 19,0.99609375 c -3.308017,0 -6,2.69369755 -6,6.00390625 0,2.0329142 1.016631,3.831239 2.566406,4.917969 a 3,3 0 0 1 0.378907,-0.955078 C 14.761779,10.049021 14,8.616857 14,7 c 0,-2.7702432 2.232897,-5.0039062 5,-5.0039063 2.767103,0 5,2.2336631 5,5.0039063 0,0.911808 -0.242784,1.7649687 -0.666016,2.5 h 1.119141 C 24.803579,8.7380677 25,7.8921692 25,7 25,3.6897913 22.308017,0.99609375 19,0.99609375 Z"
     fill="#1a75ff"
     fill-rule="evenodd"
     stroke-linecap="square"
     stroke-linejoin="round"
     id="path12" />
</svg>
