<svg width="24" height="24" version="1.0" xmlns="http://www.w3.org/2000/svg">
 <defs>
  <linearGradient id="c" x1="34" x2="37" y1="1029.3622" y2="1029.3622" gradientTransform="matrix(1.5,0,0,1.5,-34.865341,-1547.2271)" gradientUnits="userSpaceOnUse">
   <stop stop-color="#999999" offset="0"/>
   <stop stop-color="#ffffff" offset=".49999997"/>
   <stop stop-color="#999999" offset="1"/>
  </linearGradient>
  <linearGradient id="b" x1="34" x2="37" y1="1027.3622" y2="1027.3622" gradientTransform="matrix(1.5,0,0,1.5,-34.865341,-1547.2271)" gradientUnits="userSpaceOnUse">
   <stop stop-color="#aa0000" offset="0"/>
   <stop stop-color="#ff0000" offset=".51070523"/>
   <stop stop-color="#aa0000" offset="1"/>
  </linearGradient>
  <linearGradient id="a" x1="34" x2="37" y1="1033.8622" y2="1033.8622" gradientTransform="matrix(1.5,0,0,1.5,-34.865341,-1547.2271)" gradientUnits="userSpaceOnUse">
   <stop stop-color="#a05a2c" offset="0"/>
   <stop stop-color="#ffff00" offset=".26457807"/>
   <stop stop-color="#ffff00" offset=".75078517"/>
   <stop stop-color="#a05a2c" offset="1"/>
  </linearGradient>
 </defs>
 <rect x="16.375" y="13.375" width="6.25" height="4.25" fill="#f9f9f9" fill-rule="evenodd" stroke="#2a7efe" stroke-linecap="round" stroke-linejoin="round" stroke-width=".75" style="paint-order:normal"/>
 <rect x="8.375" y="19.375" width="7.25" height="4.25" fill="#f9f9f9" fill-rule="evenodd" stroke="#2a7efe" stroke-linecap="round" stroke-linejoin="round" stroke-width=".75" style="paint-order:normal"/>
 <rect x="1.375" y="13.375" width="6.25" height="4.25" fill="#f9f9f9" fill-rule="evenodd" stroke="#2a7efe" stroke-linecap="round" stroke-linejoin="round" stroke-width=".75" style="paint-order:normal"/>
 <rect x="1.375" y="2.625" width="21.25" height="8" fill="#f9f9f9" fill-rule="evenodd" stroke="#2a7efe" stroke-linecap="round" stroke-linejoin="round" stroke-width=".75" style="paint-order:normal"/>
 <path d="m12 10.5v9" fill="none" stroke="#2a7efe"/>
 <path d="m7.5 15.5h9" fill="none" stroke="#2a7efe"/>
 <path x="1" y="2" width="13" height="2.5" ry="0" d="m2.5 0h19c0.828428 0 1.5 0.671572 1.5 1.5v1.5h-22v-1.5c0-0.828428 0.671572-1.5 1.5-1.5z" fill="#2a7efe" stroke-width="1.5"/>
 <rect transform="rotate(45)" x="16.134628" y="-4.6842394" width="4.5" height="3.0000262" fill="url(#c)" fill-rule="evenodd" style="paint-order:normal"/>
 <rect transform="rotate(45)" x="16.134628" y="-7.6842337" width="4.5" height="3.0000262" fill="url(#b)" fill-rule="evenodd" style="paint-order:normal"/>
 <rect transform="rotate(45)" x="16.134628" y="-1.6842394" width="4.5" height="10.500026" fill="url(#a)" fill-rule="evenodd" style="paint-order:normal"/>
 <path d="M 5.1752105,17.642617 4,22 8.3571905,20.824599 Z" fill="#d38d5f" fill-rule="evenodd"/>
 <path d="M 4.5310396,20.03104 5.9688741,21.468874 4,22 Z" fill="#333333" fill-rule="evenodd"/>
</svg>
