<?xml version="1.0" encoding="UTF-8" standalone="no"?>
<svg
   height="64"
   width="64"
   version="1.1"
   id="svg16"
   sodipodi:docname="Preview_01_64.svg"
   inkscape:export-filename="Preview_01_64.png"
   inkscape:export-xdpi="96"
   inkscape:export-ydpi="96"
   inkscape:version="1.2-beta (1b65182ce9, 2022-04-05)"
   xmlns:inkscape="http://www.inkscape.org/namespaces/inkscape"
   xmlns:sodipodi="http://sodipodi.sourceforge.net/DTD/sodipodi-0.dtd"
   xmlns="http://www.w3.org/2000/svg"
   xmlns:svg="http://www.w3.org/2000/svg">
  <defs
     id="defs20">
    <radialGradient
       id="a"
       cx="9.1740294"
       cy="7.8253603"
       gradientTransform="matrix(0.66909781,-2.2758851e-8,4.5190518e-8,0.58542853,1.8616763,4.291566)"
       gradientUnits="userSpaceOnUse"
       r="7.5"
       fx="9.1740294"
       fy="7.8253603">
      <stop
         offset="0"
         stop-color="#fff"
         id="stop2" />
      <stop
         offset="1"
         stop-color="#8fc1c7"
         id="stop4" />
    </radialGradient>
  </defs>
  <sodipodi:namedview
     id="namedview18"
     pagecolor="#ffffff"
     bordercolor="#666666"
     borderopacity="1.0"
     inkscape:pageshadow="2"
     inkscape:pageopacity="0.0"
     inkscape:pagecheckerboard="0"
     inkscape:deskcolor="#d1d1d1"
     showgrid="true"
     inkscape:zoom="14.34375"
     inkscape:cx="30.535948"
     inkscape:cy="32"
     inkscape:current-layer="g1290">
    <inkscape:grid
       type="xygrid"
       id="grid1649" />
  </sodipodi:namedview>
  <g
     id="g4535"
     transform="scale(2)">
    <g
       id="g3453">
      <path
         d="M 22,31 H 5 V 1 H 19.5 L 27,8.5 V 24"
         id="path2911"
         style="fill:none;stroke:#00aad4;stroke-width:2;stroke-linecap:round;stroke-linejoin:round"
         sodipodi:nodetypes="cccccc" />
      <path
         d="m 19,1 v 8 h 8"
         id="path2913"
         style="fill:none;stroke:#00aad4;stroke-width:2;stroke-linecap:round;stroke-linejoin:round" />
    </g>
    <g
       id="g1290"
       transform="scale(2)">
      <path
         d="M 11,9.5 A 3,2.9992276 0 1 1 5.0000001,9.5 3,2.9992276 0 1 1 11,9.5 Z"
         fill="url(#a)"
         fill-rule="evenodd"
         stroke-linejoin="round"
         stroke-width="1.43488"
         id="path7"
         style="fill:none;stroke:#00aad4;stroke-width:1;stroke-linecap:round;stroke-dasharray:none" />
      <path
         d="m 10.5,12 3.25,3.25"
         fill="none"
         stroke-width="2.5"
         id="path9"
         style="stroke:#00aad4;stroke-width:1.5;stroke-linecap:round;stroke-dasharray:none"
         sodipodi:nodetypes="cc" />
    </g>
  </g>
</svg>
