<?xml version="1.0" encoding="UTF-8" standalone="no"?>
<svg
   width="24"
   height="24"
   version="1.1"
   viewBox="0 0 24 24"
   id="svg11"
   sodipodi:docname="tiphttpdataprovider.svg"
   inkscape:version="1.3.2 (091e20e, 2023-11-25, custom)"
   xmlns:inkscape="http://www.inkscape.org/namespaces/inkscape"
   xmlns:sodipodi="http://sodipodi.sourceforge.net/DTD/sodipodi-0.dtd"
   xmlns="http://www.w3.org/2000/svg"
   xmlns:svg="http://www.w3.org/2000/svg">
  <sodipodi:namedview
     id="namedview11"
     pagecolor="#ffffff"
     bordercolor="#000000"
     borderopacity="0.25"
     inkscape:showpageshadow="2"
     inkscape:pageopacity="0.0"
     inkscape:pagecheckerboard="0"
     inkscape:deskcolor="#d1d1d1"
     showgrid="true"
     inkscape:current-layer="svg11">
    <inkscape:grid
       id="grid11"
       units="px"
       originx="0"
       originy="0"
       spacingx="0.5"
       spacingy="0.5"
       empcolor="#0099e5"
       empopacity="0.30196078"
       color="#0099e5"
       opacity="0.14901961"
       empspacing="2"
       dotted="false"
       gridanglex="30"
       gridanglez="30"
       visible="true" />
  </sodipodi:namedview>
  <defs
     id="defs2">
    <radialGradient
       id="b"
       cx="-4.3552999"
       cy="-7.9933"
       r="6.1504998"
       gradientTransform="matrix(.18970432 1.1631755 -1.0963842 .17881359 -3.1851158 12.696722)"
       gradientUnits="userSpaceOnUse">
      <stop
         stop-color="#fff"
         offset="0"
         id="stop1" />
      <stop
         stop-color="#99c1ff"
         offset="1"
         id="stop2" />
    </radialGradient>
  </defs>
  <path
     d="M 18,6.00005 21.5,2.5"
     fill="none"
     stroke="#ff6600"
     stroke-linecap="round"
     id="path2" />
  <path
     d="m19 2.5h2.5v2.5"
     fill="none"
     stroke="#ff6600"
     stroke-linecap="round"
     stroke-linejoin="round"
     id="path3" />
  <path
     d="m18 9 3.5 3.5"
     fill="none"
     stroke="#ff6600"
     stroke-linecap="round"
     id="path4" />
  <path
     d="m21.5 10v2.5h-2.5"
     fill="none"
     stroke="#ff6600"
     stroke-linecap="round"
     stroke-linejoin="round"
     id="path5" />
  <path
     d="m3.2499997 15.75v-15.5h9.3750003l3.124999 3.0999999v12.4z"
     fill="#f9f9f9"
     fill-rule="evenodd"
     stroke="#2a7efe"
     stroke-width=".5"
     id="path6" />
  <rect
     x=".99999982"
     y="15"
     width="22"
     height="9"
     ry="1.5"
     fill="#739bdf"
     fill-rule="evenodd"
     style="paint-order:normal"
     id="rect6" />
  <circle
     cx="7.0000005"
     cy="8"
     r="5.7500005"
     fill="url(#b)"
     stroke-width=".531375"
     id="circle6" />
  <path
     d="m5.2370869 2.6448056c0.496775-0.2330799-0.510594-0.00828-0.375423 0.3218523-0.394427 0.07853 0.160034-0.3754864-0.240195-0.1711023-0.08703 0.1604747-0.438402 0.2629609-0.0152 0.2291803 0.421765 0.266568 0.769726-0.4062336 1.229248-0.3984919 0.320132-0.016868-0.295823 0.2687295 0.09139 0.2597891-0.193123 0.487488-0.307943 1.3909629 0.506985 1.2777189 0.03693-0.4367187 0.36702-0.7551026 0.716245-1.0443824 0.352264-0.3063697-0.339138-7.51e-4 -0.14165-0.4368311-0.139054-0.4687477-0.7961015 0.081168-1.015524-0.09957-0.2194225-0.1807381-0.670389 0.2647833-0.755876 0.061837zm3.015983-0.1370865c-0.565353 0.0294737-0.044479 0.1594488 0.1556018 0.3329798 0.088417-0.121016 0.033524-0.3681978-0.1556018-0.3329798zm0.9465643 0.5949033c-0.3338981 0.099243-0.7592413 0.9355744-0.2885545 1.0169609 0.2678588-0.1183969 0.3344487 0.6072604 0.4518664 0.042715-0.051044-0.1720954-0.1571136-0.9606202 0.065122-0.4561273 0.063287 0.2445853 0.5833039 0.4904648 0.2054113 0.5339704 0.078829 0.3997903-0.6362134 0.2803382-0.6538343-0.028111 0.1082817 0.3357047-0.3091206 0.6517584-0.6388517 0.7367644 0.3185535 0.119576 0.3452227 0.5796956-0.105233 0.4121816-0.4862735 0.3683802 0.415593 0.8853228 0.5381654 0.277996 0.2060331-0.4753585 0.9118259-0.2546158 1.0174943 0.1644207-0.4109051 0.1861501 0.3175609 0.091512 0.056858-0.2157625-0.2557986-0.086604-0.5423107-0.5620699-0.082311-0.2352778 0.2601279 0.080439 0.5264919 0.9346418 0.5055259 0.2951806 0.344836-0.015683 0.110611-0.7641621 0.416561-0.4467919 0.173195-0.3721996 0.796863 0.623193 0.236484 0.3618931-0.465466-0.2499367-0.626746 0.4923488-0.07928 0.3986082 0.559914-0.012577-0.07316 0.7672094-0.366846 0.3534946-0.39597 0.1735654-1.0287956-0.019824-1.0143191-0.5753934-0.2388288-0.477343 0.054626 0.4824035-0.4192185 0.2355418-0.6938553-0.036125-1.0768005 0.5215951-1.3222875 1.0805892-0.196185 0.4778309-0.171154 0.9711358 0.262969 1.2873429 0.260723 0.5395597 0.9267943 0.00314 1.2616513 0.1576572 0.5691201 0.091638 0.2724433 0.7606314 0.5126581 1.1729328-0.242383 0.4627671-0.2313875 0.9312241-0.1056991 1.4264831-0.044856 0.716061 0.8790578 0.137736 0.9733648-0.230402 0.239222-0.421464 0.710654-0.753762 0.702476-1.3043869 0.09004-0.5600601 0.600049-0.9398437 0.693029-1.5027707-0.56976-0.075498-0.603549-0.8407991-0.87092-1.2508502-0.210436-0.5399011 0.324832 0.2879146 0.340794 0.4739575 0.283339 0.069572 0.19943 0.8395929 0.441822 0.5101857 0.281775-0.2232606 0.616208-0.6738121 0.159427-0.9162035-0.334161 0.00384-0.39408-0.71032-0.0747-0.2110732 0.670369 0.048504 0.987364 1.7076165 0.473401-0.2738673-0.367126-1.2530497-1.226217-2.5362974-2.341937-3.1163546-0.081242 0.208713-0.2842852 0.4483286-0.4684494 0.144676 0.5952584 0.11092-0.4013233-0.366579-0.4826394-0.3201794zm-5.6803443 0.6020012c-0.401815-0.107491-1.9305187 1.2868439-1.921885 3.20749-0.06401 0.178893 0.09236 0.9201614 0.221713 0.7105804-0.120226-0.2056952-0.07524-1.0571523 0.02305-0.4280465 0.132407 0.4499996 0.231102 1.1725442 0.786444 1.056542 0.360627 0.1582295 0.577082 0.8346268 0.950675 0.590111-0.223855 0.4008296-0.308618 0.9038924-0.245947 1.3113535 0.168688 0.555728 0.788112 0.775697 1.009319 1.285019 0.25029 0.564259 0.353779 1.247853 0.839619 1.66644 0.236852 0.161208 0.719756 0.24867 0.236562-1e-3 -0.415284-0.429054-0.04592-0.832939 0.244759-1.165537 0.06429-0.282422 0.102847-0.552309 0.469851-0.600584 0.06252-0.381138 0.357031-0.816111 0.321742-1.152496-0.315738-0.2843282-1.000669-0.159659-1.167539-0.4070953 0.01389-0.539735-0.694431-0.2675082-0.879305-0.6806589-0.267021-0.043801-0.710601-0.2885675-0.711139 0.00651 0.110717-0.3527592-0.188587-0.4374875-0.443275-0.4447286-0.04298-0.2649997-0.01018-0.5025552-0.351892-0.4415397 0.01546-0.2182134-0.0017-0.8253168-0.15009-0.2841872-0.461694 0.3228115-0.59889-1.0794629 0.05164-0.7965608 0.290803-0.358331 0.538815 0.1664435 0.599375 0.3408286-0.140339-0.5972565 0.435093-0.967925 0.722502-1.4184443 0.123719-0.5635596 0.79536-0.049683 0.912013-0.4695026-0.199498 0.3944366-0.627616-0.4914727-0.146597-0.2899355 0.42297 0.066351 0.672651-0.2915672 0.266389-0.5441783 0.01473-0.3839652-0.247724-0.2208354-0.44478-0.2727948-0.02534-0.5777709-0.641443-0.062687-0.547809 0.2908053-0.179914 0.086264-0.335401 0.7059589-0.391491 0.1725018-0.118142-0.219711-0.581356-0.3522035-0.184683-0.658684 0.15998-0.2380417 0.407313-0.4279269 0.5855-0.1730848 0.311764-0.027998-0.231536-0.3601345 0.205471-0.3447883 0.03375-0.1542367 0.258361-0.4175228 0.366281-0.2016244-0.234 0.2296339 0.38639 0.022818 3.48e-4 0.2689187-0.525052 0.1563325 0.05095 0.3018369 0.232141 0.4244034 0.263934-0.1070742-0.08663-0.6402912 0.305662-0.3459153 0.172232-0.1965834-0.4041-0.7431142-0.603549-0.6871712-0.114643 0.1822379 0.1057775-0.095999-0.233107-0.1324095-0.3388845-0.03641-0.346451 0.6755621-0.927968 0.6094633zm0.930426-0.4770327c0.21121 0.037727-0.440928 0.8417942-0.257276 0.1937027 0.02502-0.1154222 0.139247-0.2020867 0.257276-0.1937027zm-0.64818 0.026612-0.363836 0.2713599c-0.151862 0.3913084 0.8463-0.3056666 0.363836-0.2713599zm3.244571 0.2421853c-0.455755 0.1588387 0.565977 0.4617689 0.446163 0.067659-0.141952-0.053361-0.296511-0.058811-0.446163-0.067659zm1.16189 0.6211032c-0.2051274 0.1715133 0.1936778 0.4801082 0.1786229 0.690332 0.6005034 0.00687-0.061875-0.531607-0.1786229-0.690332zm-0.096799 0.2494827c-0.375192 0.09456-0.103213 0.5519094 0.048346 0.1244887 0.00884-0.031783 0.010331-0.1246951-0.048346-0.1244887zm3.3112511 0.7064093c0.113387 0.2217766 0.512095 0.6729245 0.406291 0.8846792-0.185778-0.15443-0.584856-0.6746884-0.406291-0.8846792zm-6.1179781 0.3268696c-0.193974 0.2163369 0.413022 0.3565822 0.206462 0.025254 0.01205 0.042039-0.214612-0.09485-0.206462-0.025254zm-2.098715 2.2466869c-0.342598 0.2461834 0.567366 0.075499 0.241012 0.5182647 0.220978 0.014663 0.298855-0.449172 0.371961-0.093129 0.241627 0.035351 0.835173 0.041668 0.287977-0.1652915-0.286244-0.1218442-0.589486-0.2348188-0.90095-0.2598442zm8.5957981 2.1635967c-0.245004 0.2351564-0.828298 0.7511394-0.472653 1.0756994 0.270919-0.245236 0.390882-0.714821 0.592664-1.0216424-0.02027-0.045088-0.07701-0.054146-0.120011-0.054057z"
     fill="#2ba12b"
     stroke-width=".827588"
     id="path7" />
  <circle
     cx="7"
     cy="8"
     r="5.8000002"
     fill="none"
     stroke="#2a7efe"
     stroke-width=".4"
     id="circle7" />
  <path
     d="m4.4907515 19.499972h3.0184964m0-2.10922v4.218441m-3.0184964-4.218441v4.218441"
     fill="none"
     stroke="#ffffff"
     stroke-linecap="round"
     stroke-linejoin="round"
     stroke-width=".781503"
     id="path8" />
  <path
     d="m10.499989 21.599944v-4.199944m-1.4904475 0h2.9809175"
     fill="none"
     stroke="#ffffff"
     stroke-linecap="round"
     stroke-linejoin="round"
     stroke-width=".8"
     id="path9" />
  <path
     d="m17.4 21.6v-4.199945h1.288359c1.717811 0 1.717811 2.302379 0 2.302379h-1.288359"
     fill="none"
     stroke="#ffffff"
     stroke-linecap="round"
     stroke-linejoin="round"
     stroke-width=".8"
     id="path10" />
  <path
     d="m14.499989 21.599944v-4.199944m-1.490447 0h2.980917"
     fill="none"
     stroke="#ffffff"
     stroke-linecap="round"
     stroke-linejoin="round"
     stroke-width=".8"
     id="path11" />
</svg>
