<?xml version="1.0" encoding="UTF-8" standalone="no"?>
<svg
   height="48"
   width="48"
   version="1.1"
   id="svg151"
   sodipodi:docname="Add_03_48.svg"
   inkscape:export-filename="Add_03_48.png"
   inkscape:export-xdpi="96"
   inkscape:export-ydpi="96"
   inkscape:version="1.2-beta (1b65182ce9, 2022-04-05)"
   xmlns:inkscape="http://www.inkscape.org/namespaces/inkscape"
   xmlns:sodipodi="http://sodipodi.sourceforge.net/DTD/sodipodi-0.dtd"
   xmlns="http://www.w3.org/2000/svg"
   xmlns:svg="http://www.w3.org/2000/svg">
  <defs
     id="defs155" />
  <sodipodi:namedview
     id="namedview153"
     pagecolor="#ffffff"
     bordercolor="#666666"
     borderopacity="1.0"
     inkscape:pageshadow="2"
     inkscape:pageopacity="0.0"
     inkscape:pagecheckerboard="0"
     inkscape:deskcolor="#d1d1d1"
     showgrid="true"
     inkscape:zoom="19.125"
     inkscape:cx="24"
     inkscape:cy="24"
     inkscape:current-layer="svg151">
    <inkscape:grid
       type="xygrid"
       id="grid274" />
  </sodipodi:namedview>
  <g
     fill-rule="evenodd"
     transform="matrix(2,0,0,2,0,-48)"
     id="g149">
    <circle
       cx="12"
       cy="36"
       fill="#aaccff"
       r="10"
       stroke="#3f71b0"
       stroke-linecap="round"
       stroke-linejoin="round"
       id="circle141" />
    <g
       fill="#ffffff"
       id="g147">
      <path
         d="M 9.9999996,31 V 41.000002 H 14 V 31 Z"
         id="path143" />
      <path
         d="M 7.0000003,37.999999 H 17.000001 V 33.999998 H 7.0000003 Z"
         id="path145" />
    </g>
  </g>
</svg>
