<?xml version="1.0" encoding="UTF-8" standalone="no"?>
<svg
   height="11"
   width="11"
   version="1.1"
   id="svg4468"
   sodipodi:docname="bookmark0.svg"
   inkscape:export-filename="bookmark0.png"
   inkscape:export-xdpi="96"
   inkscape:export-ydpi="96"
   inkscape:version="1.2.2 (732a01da63, 2022-12-09)"
   xmlns:inkscape="http://www.inkscape.org/namespaces/inkscape"
   xmlns:sodipodi="http://sodipodi.sourceforge.net/DTD/sodipodi-0.dtd"
   xmlns="http://www.w3.org/2000/svg"
   xmlns:svg="http://www.w3.org/2000/svg">
  <defs
     id="defs4472" />
  <sodipodi:namedview
     id="namedview4470"
     pagecolor="#ffffff"
     bordercolor="#666666"
     borderopacity="1.0"
     inkscape:showpageshadow="2"
     inkscape:pageopacity="0.0"
     inkscape:pagecheckerboard="0"
     inkscape:deskcolor="#d1d1d1"
     showgrid="true"
     inkscape:zoom="83.454545"
     inkscape:cx="5.5"
     inkscape:cy="5.5"
     inkscape:current-layer="svg4468">
    <inkscape:grid
       type="xygrid"
       id="grid5029" />
  </sodipodi:namedview>
  <radialGradient
     id="a"
     cx="5.5"
     cy="5.5"
     gradientUnits="userSpaceOnUse"
     r="5.5">
    <stop
       offset="0"
       stop-color="#4881cc"
       id="stop4457" />
    <stop
       offset=".81818181"
       stop-color="#4781cc"
       id="stop4459" />
    <stop
       offset="1"
       stop-color="#569af2"
       id="stop4461" />
  </radialGradient>
  <circle
     cx="5.5"
     cy="5.5"
     fill="url(#a)"
     r="5.5"
     id="circle4464" />
  <path
     d="M 5.4999396,8.9993104 C 3.9964968,8.964687 3.5,7.9999999 3.5,7.0000001 V 4 C 3.5,3 4,2 5.5,2 7,2 7.5000002,3 7.5000002,4 v 3.0000001 c 0,0.9999998 -0.4966179,2.0339338 -2.0000606,1.9993103 z M 6.4999999,7.0000001 V 4 C 6.4999999,3.5 6.3646021,3 5.5,3 4.6353981,3 4.5,3.5 4.5,4 v 3.0000001 c 0,0.5000001 0.091204,0.9999998 1,0.9999998 0.9087961,0 0.9999999,-0.4999997 0.9999999,-0.9999998 z"
     fill="#ffffff"
     id="path4466-2"
     style="fill:#ffffff;stroke-width:0.999999"
     sodipodi:nodetypes="zcczcczcczcczc" />
</svg>
