<svg width="16" height="16" version="1.1" xmlns="http://www.w3.org/2000/svg">
 <rect x="2.25" y=".25" width="9.5" height="12.5" ry="1.6666667" fill="#c2f3ff" stroke="#00aad4" stroke-linejoin="round" stroke-width=".5"/>
 <rect x="5.25" y="3.25" width="9.5" height="12.5" ry="1.6666666" fill="#ebfcff" stroke="#00aad4" stroke-linejoin="round" stroke-width=".5"/>
</svg>
