<?xml version="1.0" encoding="UTF-8" standalone="no"?>
<svg
   height="64"
   viewBox="0 0 16.933333 16.933335"
   width="64"
   version="1.1"
   id="svg570"
   sodipodi:docname="Chart_08_64.svg"
   inkscape:export-filename="Chart_08_64.png"
   inkscape:export-xdpi="96"
   inkscape:export-ydpi="96"
   inkscape:version="1.2 (dc2aedaf03, 2022-05-15)"
   xmlns:inkscape="http://www.inkscape.org/namespaces/inkscape"
   xmlns:sodipodi="http://sodipodi.sourceforge.net/DTD/sodipodi-0.dtd"
   xmlns:xlink="http://www.w3.org/1999/xlink"
   xmlns="http://www.w3.org/2000/svg"
   xmlns:svg="http://www.w3.org/2000/svg">
  <defs
     id="defs574">
    <linearGradient
       inkscape:collect="always"
       id="linearGradient1456">
      <stop
         style="stop-color:#ffffff;stop-opacity:1"
         offset="0"
         id="stop1454" />
      <stop
         style="stop-color:#ffd42a;stop-opacity:1;"
         offset="1"
         id="stop1452" />
    </linearGradient>
    <linearGradient
       inkscape:collect="always"
       id="linearGradient1446">
      <stop
         style="stop-color:#ffffff;stop-opacity:1"
         offset="0"
         id="stop1444" />
      <stop
         style="stop-color:#ff5555;stop-opacity:1;"
         offset="1"
         id="stop1442" />
    </linearGradient>
    <linearGradient
       inkscape:collect="always"
       id="linearGradient1436">
      <stop
         style="stop-color:#ffffff;stop-opacity:1"
         offset="0"
         id="stop1434" />
      <stop
         style="stop-color:#87decd;stop-opacity:1;"
         offset="1"
         id="stop1432" />
    </linearGradient>
    <linearGradient
       inkscape:collect="always"
       xlink:href="#linearGradient1436"
       id="linearGradient1438"
       x1="2.1166661"
       y1="11.641667"
       x2="6.3499992"
       y2="11.641667"
       gradientUnits="userSpaceOnUse" />
    <linearGradient
       inkscape:collect="always"
       xlink:href="#linearGradient1446"
       id="linearGradient1448"
       x1="6.3499992"
       y1="10.054167"
       x2="10.583333"
       y2="10.054167"
       gradientUnits="userSpaceOnUse" />
    <linearGradient
       inkscape:collect="always"
       xlink:href="#linearGradient1456"
       id="linearGradient1458"
       x1="10.583334"
       y1="8.466667"
       x2="14.816667"
       y2="8.466667"
       gradientUnits="userSpaceOnUse" />
    <linearGradient
       id="a"
       gradientUnits="userSpaceOnUse"
       x1="14.084459"
       x2="8.9155407"
       y1="14.084458"
       y2="8.9155388">
      <stop
         offset="0"
         stop-color="#a00"
         id="stop1100" />
      <stop
         offset="1"
         stop-color="#f55"
         id="stop1102" />
    </linearGradient>
  </defs>
  <sodipodi:namedview
     id="namedview572"
     pagecolor="#ffffff"
     bordercolor="#666666"
     borderopacity="1.0"
     inkscape:showpageshadow="2"
     inkscape:pageopacity="0.0"
     inkscape:pagecheckerboard="0"
     inkscape:deskcolor="#d1d1d1"
     showgrid="true"
     inkscape:zoom="14.34375"
     inkscape:cx="29.559913"
     inkscape:cy="32"
     inkscape:current-layer="svg570">
    <inkscape:grid
       type="xygrid"
       id="grid1949" />
  </sodipodi:namedview>
  <path
     d="M 6.0854152,6.614584 H 2.3812501 V 16.66875 h 3.7041651 z"
     fill="#87decd"
     stroke="#5fd3bc"
     id="path556"
     style="stroke-width:0.529168;stroke-linecap:round;stroke-dashoffset:1.49998;fill-opacity:1;fill:url(#linearGradient1438)" />
  <path
     d="M 14.552083,0.26458396 H 10.847918 V 16.66875 h 3.704165 z"
     fill="#ffd42a"
     stroke="#ffcc00"
     id="path558"
     style="stroke-width:0.529168;stroke-linecap:round;stroke-dashoffset:1.49998;fill-opacity:1;fill:url(#linearGradient1458)" />
  <path
     d="M 10.318749,3.439584 H 6.6145832 V 16.66875 h 3.7041658 z"
     fill="#ff5555"
     stroke="#ff5252"
     id="path560"
     style="stroke-width:0.529168;stroke-linecap:round;stroke-dashoffset:1.49998;fill-opacity:1;fill:url(#linearGradient1448)" />
  <g
     stroke="#ffffff"
     stroke-linecap="round"
     id="g1113"
     transform="scale(0.52916669)">
    <circle
       cx="11.5"
       cy="11.5"
       fill="url(#a)"
       r="4.1351352"
       stroke-dashoffset="1.49998"
       stroke-linejoin="round"
       stroke-width="0.72973"
       transform="matrix(0,1.8888888,1.8888888,0,1.777779,1.777779)"
       id="circle1105"
       style="fill:url(#a)" />
    <g
       fill="none"
       stroke-width="1.28565"
       transform="matrix(1.8365134,0,0,1.8365134,2.3800946,2.3800965)"
       id="g1111">
      <path
         d="m 12.914214,10.085786 -2.828428,2.828427"
         id="path1107" />
      <path
         d="M 12.914214,12.914213 10.085786,10.085786"
         id="path1109" />
    </g>
  </g>
</svg>
