<?xml version="1.0" encoding="UTF-8" standalone="no"?>
<svg
   height="33"
   width="33"
   version="1.1"
   id="svg213"
   sodipodi:docname="da_block_150.svg"
   inkscape:export-filename="da_block_150.png"
   inkscape:export-xdpi="96"
   inkscape:export-ydpi="96"
   inkscape:version="1.2.1 (9c6d41e410, 2022-07-14)"
   xmlns:inkscape="http://www.inkscape.org/namespaces/inkscape"
   xmlns:sodipodi="http://sodipodi.sourceforge.net/DTD/sodipodi-0.dtd"
   xmlns="http://www.w3.org/2000/svg"
   xmlns:svg="http://www.w3.org/2000/svg">
  <defs
     id="defs217" />
  <sodipodi:namedview
     id="namedview215"
     pagecolor="#ffffff"
     bordercolor="#666666"
     borderopacity="1.0"
     inkscape:showpageshadow="2"
     inkscape:pageopacity="0.0"
     inkscape:pagecheckerboard="0"
     inkscape:deskcolor="#d1d1d1"
     showgrid="true"
     inkscape:zoom="27.818182"
     inkscape:cx="16.482026"
     inkscape:cy="16.5"
     inkscape:current-layer="svg213">
    <inkscape:grid
       type="xygrid"
       id="grid2119" />
  </sodipodi:namedview>
  <linearGradient
     id="a"
     gradientUnits="userSpaceOnUse"
     x1="8.5"
     x2="10.486842"
     y1="-2.5"
     y2="2.494157">
    <stop
       offset="0"
       stop-color="#aeefff"
       id="stop172" />
    <stop
       offset="1"
       stop-color="#0cf"
       id="stop174" />
  </linearGradient>
  <g
     stroke="#333"
     transform="matrix(1.5 0 0 1.5 0 9)"
     id="g211">
    <path
       d="m10.486842 2.4342149-9.2368421-4.1052632 10.2631581-3.0789474 9.236842 4.10526318z"
       fill="url(#a)"
       fill-rule="evenodd"
       stroke-linejoin="round"
       stroke-width=".5"
       id="path177" />
    <path
       d="m1.2499999-1.6710483v12.3157893l9.2368421 4.105263v-12.3157891z"
       fill="#f0f000"
       fill-rule="evenodd"
       stroke-linejoin="round"
       stroke-width=".5"
       id="path179" />
    <path
       d="m20.75-.64473252v11.80262652l-10.263158 3.59211v-12.3157891z"
       fill="#00d455"
       fill-rule="evenodd"
       stroke-linejoin="round"
       stroke-width=".5"
       id="path181" />
    <g
       fill="none"
       id="g209">
      <g
         stroke-width=".487179"
         transform="matrix(1.0263158 0 0 1.0263158 -.289474 -.13158)"
         id="g191">
        <path
           d="m10.5 6.5 10-3.45"
           id="path183" />
        <path
           d="m10.5 10.275388 10-3.4617187"
           id="path185" />
        <path
           d="m14 1.45v11.825"
           id="path187" />
        <path
           d="m17 .55000001v11.67499999"
           id="path189" />
      </g>
      <path
         d="m10.486842 6.5394728-9.2368305-4.1052632"
         stroke-width=".5"
         id="path193" />
      <path
         d="m10.486842 10.414213-9.2368421-4.1052633"
         stroke-width=".5"
         id="path195" />
      <path
         d="m7.4078947 1.065792v12.315792"
         stroke-width=".5"
         id="path197" />
      <path
         d="m4.3289473-.30263079v12.31579379"
         stroke-width=".5"
         id="path199" />
      <path
         d="m14.078947 1.356578-9.2368418-4.1052683"
         stroke-width=".5"
         id="path201" />
      <path
         d="m17.157895.4328989-9.2368308-4.1052632"
         stroke-width=".5"
         id="path203" />
      <path
         d="m17.671053-2.0131589-10.2631583 3.0789527"
         stroke-width=".5"
         id="path205" />
      <path
         d="m14.592105-3.3815799-10.2631577 3.07895264"
         stroke-width=".5"
         id="path207" />
    </g>
  </g>
</svg>
