<?xml version="1.0" encoding="UTF-8" standalone="no"?>
<svg
   height="11"
   width="11"
   version="1.1"
   id="svg10"
   sodipodi:docname="UnknownBreakPoint.svg"
   inkscape:export-filename="UnknownBreakPoint.png"
   inkscape:export-xdpi="96"
   inkscape:export-ydpi="96"
   inkscape:version="1.2.2 (732a01da63, 2022-12-09)"
   xmlns:inkscape="http://www.inkscape.org/namespaces/inkscape"
   xmlns:sodipodi="http://sodipodi.sourceforge.net/DTD/sodipodi-0.dtd"
   xmlns="http://www.w3.org/2000/svg"
   xmlns:svg="http://www.w3.org/2000/svg">
  <defs
     id="defs14">
    <radialGradient
       id="a"
       cx="4"
       cy="4"
       gradientTransform="matrix(4e-8,1.2727273,-1.2727273,2e-8,9.090909,-1.090909)"
       gradientUnits="userSpaceOnUse"
       r="5.5">
      <stop
         offset="0"
         stop-color="#ff8080"
         id="stop268" />
      <stop
         offset="1"
         stop-color="#f00"
         id="stop270" />
    </radialGradient>
  </defs>
  <sodipodi:namedview
     id="namedview12"
     pagecolor="#ffffff"
     bordercolor="#666666"
     borderopacity="1.0"
     inkscape:showpageshadow="2"
     inkscape:pageopacity="0.0"
     inkscape:pagecheckerboard="0"
     inkscape:deskcolor="#d1d1d1"
     showgrid="true"
     inkscape:zoom="83.454545"
     inkscape:cx="5.5"
     inkscape:cy="5.5"
     inkscape:current-layer="svg10">
    <inkscape:grid
       type="xygrid"
       id="grid666" />
  </sodipodi:namedview>
  <circle
     cx="5.5"
     cy="5.5"
     fill="url(#a)"
     r="5.5"
     id="circle273"
     style="fill:url(#a)" />
  <g
     fill="#f00"
     stroke-width="0.876906"
     transform="matrix(0.89600699,0,0,0.89600699,38.411924,-922.82181)"
     id="g8"
     style="fill:#ffffff">
    <path
       d="m -36.161167,1037.9195 h -1.328125 q -0.0052,-0.2865 -0.0052,-0.349 0,-0.6458 0.213541,-1.0625 0.213542,-0.4166 0.854167,-0.9375 0.640625,-0.5208 0.765625,-0.6823 0.192708,-0.2552 0.192708,-0.5625 0,-0.427 -0.34375,-0.7291 -0.338541,-0.3073 -0.916666,-0.3073 -0.557292,0 -0.932292,0.3177 -0.375,0.3177 -0.515625,0.9687 l -1.34375,-0.1666 q 0.05729,-0.9323 0.791667,-1.5834 0.739583,-0.651 1.9375,-0.651 1.260416,0 2.005208,0.6615 0.744792,0.6562 0.744792,1.5312 0,0.4844 -0.276042,0.9167 -0.270833,0.4323 -1.166667,1.1771 -0.463541,0.3854 -0.578125,0.6197 -0.109375,0.2344 -0.09896,0.8386 z"
       id="path4"
       style="fill:#ffffff;stroke-width:0.876906" />
    <path
       d="m -37.463542,1040.3622 v -1.4635 H -36 v 1.4635 z"
       id="path6"
       style="fill:#ffffff;stroke-width:0.876906" />
  </g>
</svg>
