<svg width="24" height="24" version="1.1" xmlns="http://www.w3.org/2000/svg">
 <rect x="3.375" y="4.375" width="20.25" height="17.25" fill="#f9f9f9" stroke="#2a7efe" stroke-width=".75" style="paint-order:normal"/>
 <path d="m4.65 1h17.7c0.9 0 1.65 0.75 1.65 1.65v2.1h-21v-2.1c1e-6 -0.9 0.75-1.65 1.65-1.65z" fill="#2a7efe" stroke-width="1.5"/>
 <path d="m7.5 12.5h14" fill="none" stroke="#f00" stroke-width="3"/>
 <path d="m4.5 9v7l-1.5 1.5v-10z" fill="#f9f9f9"/>
 <path d="m0 6.5 6.75 6-6.75 6z" fill="#0c0"/>
</svg>
