<?xml version="1.0" encoding="UTF-8" standalone="no"?>
<svg
   width="36"
   height="36"
   version="1.1"
   viewBox="0 0 36 36"
   id="svg18"
   sodipodi:docname="ttreefilteredit_150.svg"
   inkscape:version="1.3.2 (091e20e, 2023-11-25, custom)"
   xmlns:inkscape="http://www.inkscape.org/namespaces/inkscape"
   xmlns:sodipodi="http://sodipodi.sourceforge.net/DTD/sodipodi-0.dtd"
   xmlns="http://www.w3.org/2000/svg"
   xmlns:svg="http://www.w3.org/2000/svg">
  <sodipodi:namedview
     id="namedview18"
     pagecolor="#ffffff"
     bordercolor="#000000"
     borderopacity="0.25"
     inkscape:showpageshadow="2"
     inkscape:pageopacity="0.0"
     inkscape:pagecheckerboard="0"
     inkscape:deskcolor="#d1d1d1"
     showgrid="true"
     inkscape:current-layer="svg18">
    <inkscape:grid
       id="grid18"
       units="px"
       originx="0"
       originy="0"
       spacingx="0.5"
       spacingy="0.5"
       empcolor="#0099e5"
       empopacity="0.30196078"
       color="#0099e5"
       opacity="0.14901961"
       empspacing="2"
       dotted="false"
       gridanglex="30"
       gridanglez="30"
       visible="true" />
  </sodipodi:namedview>
  <defs
     id="defs9">
    <linearGradient
       id="b"
       x1="11"
       x2="21"
       y1="1032.3622"
       y2="1030.3622"
       gradientTransform="matrix(1.5115058,0,0,1.6340315,3.0716604,-1675.8147)"
       gradientUnits="userSpaceOnUse">
      <stop
         stop-color="#ffcc00"
         offset="0"
         id="stop1" />
      <stop
         stop-color="#fff6d5"
         offset=".33333102"
         id="stop2" />
      <stop
         stop-color="#ffcc00"
         offset="1"
         id="stop3" />
    </linearGradient>
    <linearGradient
       id="a"
       x1="13.775862"
       x2="17.224138"
       y1="1039.2141"
       y2="1039.2141"
       gradientTransform="matrix(1.5115058,0,0,1.6340315,3.0716604,-1675.8147)"
       gradientUnits="userSpaceOnUse">
      <stop
         stop-color="#ffcc00"
         offset="0"
         id="stop4" />
      <stop
         stop-color="#fff6d5"
         offset=".38293254"
         id="stop5" />
      <stop
         stop-color="#ffcc00"
         offset="1"
         id="stop6" />
    </linearGradient>
    <linearGradient
       id="c"
       x1="12.8125"
       x2="19"
       y1="1039.6122"
       y2="1039.6122"
       gradientTransform="matrix(1.459385,0,0,1.5735118,2.4201486,-1627.3165)"
       gradientUnits="userSpaceOnUse">
      <stop
         stop-color="#c88e2c"
         offset="0"
         id="stop7" />
      <stop
         stop-color="#e6c790"
         offset=".41"
         id="stop8" />
      <stop
         stop-color="#c88e2c"
         offset="1"
         id="stop9" />
    </linearGradient>
  </defs>
  <path
     d="m1.4999998 1.5h32.999999v33h-32.999999z"
     fill="#ffffff"
     fill-rule="evenodd"
     stroke="#2a7efe"
     stroke-linecap="round"
     stroke-linejoin="round"
     id="path9" />
  <rect
     x="4"
     y="4.9999828"
     width="6"
     height="3.0000174"
     fill="#d4aa00"
     style="paint-order:normal"
     id="rect9" />
  <rect
     x="4"
     y="3.9999826"
     width="3"
     height="1.0000174"
     fill="#ffd42a"
     style="paint-order:normal"
     id="rect10" />
  <path
     d="m6.5 8v5.5h3.5"
     fill="none"
     stroke="#999999"
     stroke-linejoin="round"
     id="path10" />
  <rect
     x="16"
     y="28.999983"
     width="6"
     height="3.0000174"
     fill="#d4aa00"
     style="paint-order:normal"
     id="rect11" />
  <rect
     x="16"
     y="27.999983"
     width="3"
     height="1.0000174"
     fill="#ffd42a"
     style="paint-order:normal"
     id="rect12" />
  <rect
     x="10"
     y="12"
     width="6"
     height="3.0000174"
     fill="#d4aa00"
     style="paint-order:normal"
     id="rect13" />
  <rect
     x="10"
     y="11"
     width="3"
     height="1.0000174"
     fill="#ffd42a"
     style="paint-order:normal"
     id="rect14" />
  <path
     d="m12.5 15v15.5h3.5"
     fill="none"
     stroke="#999999"
     stroke-linejoin="round"
     id="path14" />
  <rect
     x="10"
     y="21.000017"
     width="6"
     height="3.0000174"
     fill="#d4aa00"
     style="paint-order:normal"
     id="rect15" />
  <rect
     x="10"
     y="20.000017"
     width="3"
     height="1.0000174"
     fill="#ffd42a"
     style="paint-order:normal"
     id="rect16" />
  <path
     d="m17.378845 8.6468435 6.098145 8.7531995h6.046022l6.098145-8.7531995v-3.268h-18.242312z"
     fill="url(#b)"
     fill-rule="evenodd"
     stroke="#c88e2c"
     stroke-linecap="round"
     stroke-linejoin="round"
     stroke-width=".757687"
     id="path16" />
  <path
     d="m29.523012 17.400043-0.833934 9.2212h-4.378154l-0.833934-9.2212z"
     fill="url(#a)"
     fill-rule="evenodd"
     stroke="#c88e2c"
     stroke-linecap="round"
     stroke-linejoin="round"
     stroke-width=".757687"
     id="path17" />
  <path
     d="m17.743691 8.5258435h17.51262"
     fill="none"
     stroke="url(#c)"
     stroke-linecap="round"
     stroke-linejoin="round"
     stroke-width=".757687"
     id="path18" />
</svg>
