<?xml version="1.0" encoding="UTF-8" standalone="no"?>
<svg
   height="48"
   width="48"
   version="1.1"
   id="svg535"
   sodipodi:docname="Cloud_08_48.svg"
   inkscape:export-filename="Cloud_08_48.png"
   inkscape:export-xdpi="96"
   inkscape:export-ydpi="96"
   inkscape:version="1.2.1 (9c6d41e410, 2022-07-14)"
   xmlns:inkscape="http://www.inkscape.org/namespaces/inkscape"
   xmlns:sodipodi="http://sodipodi.sourceforge.net/DTD/sodipodi-0.dtd"
   xmlns="http://www.w3.org/2000/svg"
   xmlns:svg="http://www.w3.org/2000/svg">
  <defs
     id="defs539">
    <linearGradient
       id="a-5"
       gradientUnits="userSpaceOnUse"
       x1="42.679054"
       x2="28.320946"
       y1="42.679054"
       y2="28.320946"
       gradientTransform="matrix(0.9576471,0,0,0.9576471,1.8035268,1.803529)">
      <stop
         offset="0"
         stop-color="#009600"
         id="stop1250" />
      <stop
         offset="1"
         stop-color="#6edb39"
         id="stop1252" />
    </linearGradient>
  </defs>
  <sodipodi:namedview
     id="namedview537"
     pagecolor="#ffffff"
     bordercolor="#666666"
     borderopacity="1.0"
     inkscape:showpageshadow="2"
     inkscape:pageopacity="0.0"
     inkscape:pagecheckerboard="0"
     inkscape:deskcolor="#d1d1d1"
     showgrid="true"
     inkscape:zoom="19.125"
     inkscape:cx="23.189542"
     inkscape:cy="24"
     inkscape:current-layer="svg535">
    <inkscape:grid
       type="xygrid"
       id="grid798" />
  </sodipodi:namedview>
  <linearGradient
     id="a"
     gradientTransform="matrix(1.0000001 0 0 .96627921 -.000186 .205037)"
     gradientUnits="userSpaceOnUse"
     x1="7.5"
     x2="9"
     y1="2"
     y2="13">
    <stop
       offset="0"
       stop-color="#5ab4f2"
       id="stop528" />
    <stop
       offset="1"
       stop-color="#0090ff"
       id="stop530" />
  </linearGradient>
  <path
     d="m3.2916407 12.766668c-4.3402416 0-4.3402416-5.8903528-.285861-5.8903528-.5693964-6.06642825 9.1223573-5.7049988 9.1223573-1.4725883 4.918075-.3594726 5.574823 7.3629411-.506798 7.3629411z"
     fill="url(#a)"
     transform="matrix(2.9999998 0 0 2.9999998 .000558 .000001)"
     id="path533" />
  <g
     id="g2303">
    <circle
       cx="35.799999"
       cy="35.799999"
       fill="url(#a)"
       stroke-dashoffset="1.49998"
       stroke-linejoin="round"
       stroke-width="2.02703"
       transform="matrix(0,1,1,0,0,0)"
       id="circle1255"
       style="fill:url(#a-5);stroke:#ffffff;stroke-width:2.4;stroke-linecap:round;stroke-dasharray:none"
       r="11.000001" />
    <path
       d="M 35.800002,30.5 V 41.1"
       id="path1340"
       style="fill:none;stroke:#ffffff;stroke-width:2.4;stroke-linecap:round;stroke-dasharray:none" />
    <path
       d="m 41.100002,35.8 h -10.6"
       id="path1342"
       style="fill:none;stroke:#ffffff;stroke-width:2.4;stroke-linecap:round;stroke-dasharray:none" />
    <rect
       style="fill:none;stroke:none;stroke-width:1.5;stroke-linecap:round;stroke-linejoin:round;stroke-miterlimit:5.6"
       id="rect1633"
       width="25"
       height="25"
       x="23"
       y="23" />
  </g>
</svg>
