<?xml version="1.0" encoding="UTF-8" standalone="no"?>
<svg
   width="16"
   height="16"
   version="1.1"
   viewBox="0 0 4.2333 4.2333"
   id="svg4563"
   sodipodi:docname="Health_10_16.svg"
   inkscape:export-filename="Health_10_16.png"
   inkscape:export-xdpi="96"
   inkscape:export-ydpi="96"
   inkscape:version="1.2.1 (9c6d41e410, 2022-07-14)"
   xmlns:inkscape="http://www.inkscape.org/namespaces/inkscape"
   xmlns:sodipodi="http://sodipodi.sourceforge.net/DTD/sodipodi-0.dtd"
   xmlns="http://www.w3.org/2000/svg"
   xmlns:svg="http://www.w3.org/2000/svg">
  <defs
     id="defs4567" />
  <sodipodi:namedview
     id="namedview4565"
     pagecolor="#ffffff"
     bordercolor="#666666"
     borderopacity="1.0"
     inkscape:showpageshadow="2"
     inkscape:pageopacity="0.0"
     inkscape:pagecheckerboard="0"
     inkscape:deskcolor="#d1d1d1"
     showgrid="true"
     inkscape:zoom="57.375"
     inkscape:cx="7.3551198"
     inkscape:cy="8"
     inkscape:current-layer="svg4563">
    <inkscape:grid
       type="xygrid"
       id="grid4686" />
  </sodipodi:namedview>
  <path
     d="m 2.1166505,0.96990483 c 1.0466642,-1.65610883 3.2798746,0.58260307 0,2.83831517 -3.2798747,-2.2557121 -1.0466643,-4.494424 0,-2.83831517 z"
     id="path5231"
     style="fill:none;stroke:#00aad4;stroke-width:0.264565;stroke-dasharray:none;stroke-opacity:1"
     sodipodi:nodetypes="ccc" />
</svg>
