<?xml version="1.0" encoding="UTF-8" standalone="no"?>
<svg
   width="48"
   height="48"
   clip-rule="evenodd"
   fill-rule="evenodd"
   image-rendering="optimizeQuality"
   shape-rendering="geometricPrecision"
   text-rendering="geometricPrecision"
   version="1.1"
   viewBox="0 0 1384.9437 1384.9437"
   id="svg17"
   sodipodi:docname="tsessionjsonrpcdispatcher_200.svg"
   inkscape:export-filename="tsessionjsonrpcdispatcher_200.png"
   inkscape:export-xdpi="96"
   inkscape:export-ydpi="96"
   inkscape:version="1.3.2 (091e20e, 2023-11-25, custom)"
   xmlns:inkscape="http://www.inkscape.org/namespaces/inkscape"
   xmlns:sodipodi="http://sodipodi.sourceforge.net/DTD/sodipodi-0.dtd"
   xmlns="http://www.w3.org/2000/svg"
   xmlns:svg="http://www.w3.org/2000/svg">
  <defs
     id="defs17" />
  <sodipodi:namedview
     id="namedview17"
     pagecolor="#ffffff"
     bordercolor="#000000"
     borderopacity="0.25"
     inkscape:showpageshadow="2"
     inkscape:pageopacity="0.0"
     inkscape:pagecheckerboard="0"
     inkscape:deskcolor="#d1d1d1"
     showgrid="true"
     inkscape:current-layer="svg17">
    <inkscape:grid
       id="grid17"
       units="px"
       originx="0"
       originy="0"
       spacingx="14.426497"
       spacingy="14.426497"
       empcolor="#0099e5"
       empopacity="0.30196078"
       color="#0099e5"
       opacity="0.14901961"
       empspacing="2"
       dotted="false"
       gridanglex="30"
       gridanglez="30"
       visible="true" />
  </sodipodi:namedview>
  <rect
     x="28.853014"
     y="28.853014"
     width="1327.2377"
     height="1327.2377"
     rx="115.41197"
     fill="#fff"
     stroke="#b3b3b3"
     stroke-dashoffset="1.49998"
     stroke-linecap="round"
     stroke-linejoin="round"
     stroke-width="57.706"
     id="rect1" />
  <g
     transform="matrix(1.6077946 0 0 1.6077946 120.78604 -48.49796)"
     clip-rule="evenodd"
     fill="#e31e24"
     fill-rule="nonzero"
     image-rendering="optimizeQuality"
     shape-rendering="geometricPrecision"
     id="g4">
    <path
       d="m144.36 461.65h28.755v89.967c0 11.766-1.0247 20.823-3.1066 27.17-2.776 8.2625-7.7999 14.907-15.105 19.931-7.2717 4.9911-16.889 7.503-28.854 7.503-14.014 0-24.789-3.8999-32.324-11.734-7.5696-7.8325-11.37-19.335-11.437-34.473l27.17-3.1732c.33066 8.0977 1.4873 13.816 3.5365 17.155 3.0739 5.0893 7.7344 7.635 14.014 7.635 6.3124 0 10.808-1.8179 13.419-5.4865 2.6112-3.637 3.9326-11.205 3.9326-22.707v-91.785z"
       id="path1" />
    <path
       d="m199.03 557.63 27.962-2.776c1.6858 9.3537 5.0577 16.195 10.181 20.592 5.1231 4.3964 12.03 6.5777 20.724 6.5777 9.1889 0 16.13-1.95 20.789-5.8499 4.6605-3.8999 7.0077-8.4611 7.0077-13.684 0-3.3718-.99196-6.2144-2.9419-8.5942-1.95-2.346-5.3872-4.3953-10.279-6.115-3.3379-1.1905-10.94-3.2386-22.839-6.2143-15.303-3.8333-26.046-8.5277-32.225-14.113-8.6935-7.8325-13.023-17.385-13.023-28.657 0-7.2378 2.0503-14.047 6.115-20.359 4.0996-6.3125 9.9822-11.106 17.683-14.41 7.7017-3.3052 16.956-4.9584 27.862-4.9584 17.748 0 31.136 3.9338 40.093 11.833 8.9903 7.8991 13.683 18.409 14.147 31.598l-28.755.99189c-1.2232-7.3371-3.8344-12.593-7.8336-15.798-3.9992-3.207-10.015-4.8252-18.013-4.8252-8.2624 0-14.741 1.7186-19.401 5.1559-3.0072 2.2151-4.5284 5.157-4.5284 8.8583 0 3.3707 1.4218 6.2471 4.2632 8.627 3.6032 3.0739 12.362 6.2471 26.276 9.5512 13.915 3.2725 24.194 6.7097 30.838 10.214 6.677 3.5365 11.898 8.3279 15.667 14.443 3.7679 6.115 5.6524 13.651 5.6524 22.608 0 8.1304-2.2478 15.765-6.7752 22.871-4.5285 7.107-10.908 12.395-19.171 15.832-8.2624 3.47-18.575 5.1897-30.904 5.1897-17.947 0-31.73-4.1324-41.348-12.428-9.6178-8.2625-15.336-20.327-17.22-36.159z"
       id="path2" />
    <path
       d="m335.79 533.5c0-14.477 2.1814-26.64 6.5112-36.489 3.207-7.2378 7.635-13.749 13.221-19.501 5.5858-5.7505 11.701-10.015 18.343-12.824 8.8584-3.7352 19.072-5.6197 30.64-5.6197 20.955 0 37.679 6.5111 50.272 19.501 12.56 13.023 18.839 31.102 18.839 54.271 0 22.972-6.247 40.951-18.707 53.908-12.461 12.99-29.152 19.468-50.008 19.468-21.121 0-37.944-6.4457-50.405-19.369-12.46-12.89-18.707-30.672-18.707-53.346zm29.548-.95804c0 16.096 3.7352 28.292 11.173 36.623 7.4364 8.2952 16.889 12.46 28.325 12.46 11.47 0 20.856-4.1324 28.226-12.361 7.3372-8.2625 11.007-20.626 11.007-37.118 0-16.295-3.5704-28.458-10.742-36.457-7.1397-8.0323-16.625-12.031-28.491-12.031-11.833 0-21.385 4.0658-28.624 12.164-7.2378 8.1316-10.874 20.361-10.874 36.721z"
       id="path3" />
    <path
       d="m580.77481 603.61058-57.54163-93.33561v93.33561h-26.57269v-141.98658h27.82973l58.43306 95.15233v-95.15233h26.57269v141.98658z"
       stroke-width=".11284"
       id="path4" />
  </g>
  <path
     d="m604.27721 1211.8255h-44.74828l-36.861-61.8106q-4.98994-8.5311-9.81888-14.4868-4.66798-6.1167-9.6579-9.9799-4.82894-3.8631-10.6237-5.6337-5.79476-1.7707-13.03818-1.7707h-15.45264v93.6817h-38.14874v-230.82392h75.97554q16.25746 0 29.9395 3.86316 13.68202 3.86316 23.82284 11.75046 10.14078 7.7263 15.77456 19.4768 5.79476 11.5895 5.79476 27.2031 0 12.2333-3.70222 22.5351-3.54122 10.1408-10.30176 18.189-6.59958 7.8873-16.0965 13.5211-9.33598 5.6338-21.08644 8.6921v0.6439q6.27764 3.5412 10.94564 7.8873 4.66798 4.185 8.85308 8.6921 4.18508 4.507 8.20922 10.3017 4.18508 5.6338 9.175 13.1992zm-140.20058-199.7577v75.0098h31.87108q8.8531 0 16.25746-2.7364 7.56536-2.7364 13.03818-7.8873t8.53116-12.5553 3.05834-16.5794q0-16.5794-10.46274-25.9154-10.46272-9.336-30.10046-9.336z"
     fill="#04a"
     stroke-width="61.8106"
     id="path5" />
  <path
     d="m694.89098 1128.1237v83.7018h-38.14874v-230.82392h70.0198q39.75836 0 61.64962 18.51098 21.89124 18.51104 21.89124 52.15264 0 33.6417-22.85704 55.0501-22.85702 21.4084-61.81058 21.4084zm0-115.573v84.3458h24.7886q24.62766 0 37.50486-11.4286 12.87722-11.4285 12.87722-32.193 0-40.7242-47.32376-40.7242z"
     fill="#04a"
     stroke-width="61.8106"
     id="path6" />
  <path
     d="m1022.9349 1198.7427q-25.2317 13.0832-62.76785 13.0832-48.59452 0-77.87582-30.6831-29.28132-30.6831-29.28132-80.5236 0-53.5786 32.86358-86.5979 33.01938-33.01936 83.32714-33.01936 32.39627 0 53.73427 9.18934v36.75742q-22.584-13.3947-49.84047-13.3947-36.29014 0-58.87414 23.207-22.42822 23.207-22.42822 61.9892 0 36.9131 21.02648 58.8741 21.02646 21.8052 55.29182 21.8052 31.61753 0 54.82453-14.9521z"
     fill="#04a"
     stroke-width="59.8088"
     id="path7" />
  <path
     d="m257.77266 357.86293c12.01704-.28594 21.8053-3.15688 29.3653-8.75664 7.56002-5.5259 12.65254-13.13452 15.12002-22.75254 2.46746-9.68952 3.82014-26.19782 3.97934-49.59562.0802-23.39782.4777-38.82962 1.19354-46.29418 1.43158-11.77134 3.97932-21.17184 7.79944-28.34874 3.73976-7.10576 8.43496-12.84818 14.0067-17.15382 5.57028-4.23476 12.73134-7.53786 21.40534-9.76196 5.88866-1.36372 15.43734-2.08178 28.80668-2.08178h12.97094v33.15964h-7.16268c-15.99468 0-26.57866 2.6549-31.83068 7.89498-5.17294 5.23868-7.79946 16.93746-7.79946 35.16928 0 36.67616-.87506 59.8589-2.6252 69.54816-2.78588 15.00036-7.6388 26.55548-14.40398 34.66528-6.84416 8.1111-17.50672 15.36056-32.14938 21.60456 17.268 6.46012 29.76266 16.29218 37.56136 29.498 7.71774 13.20582 11.61682 34.88162 11.61682 64.9549 0 27.27454.1592 43.49292.47768 48.66272 1.2724 9.54586 4.3767 16.14962 9.38892 19.95384 5.09402 3.8039 14.96268 5.67086 29.6827 5.67086h7.24294v33.15964h-13.05134c-15.19868 0-26.26134-1.14892-33.10402-3.37436-9.8681-3.22944-18.14398-8.39696-24.668-15.64692-6.52564-7.1769-10.74324-16.2922-12.65402-27.34454-1.98976-11.05312-3.024-29.21164-3.18174-54.404-.1592-25.19236-1.512-42.63256-3.97936-52.25182-2.4673-9.68954-7.4021-17.29764-14.88134-22.8951-7.55984-5.59848-17.18796-8.5405-29.12528-8.82776v-34.45142z"
     clip-rule="evenodd"
     fill="#1f1b20"
     fill-rule="nonzero"
     image-rendering="optimizeQuality"
     shape-rendering="geometricPrecision"
     stroke-width=".138735"
     id="path8" />
  <path
     d="m1127.171 357.86293c-12.0153-.28594-21.8022-3.15688-29.3611-8.75662-7.5589-5.52592-12.6508-13.13454-15.1179-22.75256-2.4671-9.6895-3.8196-26.19782-3.9787-49.59564-.08-23.39782-.4777-38.82962-1.1934-46.29418-1.4314-11.77134-3.9788-21.17182-7.7984-28.34874-3.7393-7.10576-8.4337-12.84816-14.0046-17.1538-5.5695-4.23476-12.7297-7.53786-21.4023-9.76196-5.8877-1.36372-15.4352-2.08178-28.8026-2.08178h-12.96906v33.15964h7.16152c15.99244 0 26.57484 2.6549 31.82614 7.89496 5.1722 5.23868 7.7983 16.93748 7.7983 35.16932 0 36.67616.875 59.85886 2.6248 69.54814 2.7856 15.00036 7.6377 26.55548 14.402 34.66528 6.8432 8.11108 17.5042 15.36054 32.1448 21.60456-17.2656 6.4601-29.7585 16.29218-37.556 29.498-7.7167 13.2058-11.6151 34.88162-11.6151 64.9549 0 27.27454-.1592 43.4929-.4777 48.6627-1.2722 9.54586-4.3762 16.14964-9.3876 19.95384-5.0933 3.8039-14.9605 5.67088-29.67844 5.67088h-7.2419v33.15964h13.04954c15.1964 0 26.2575-1.14892 33.0992-3.37438 9.8668-3.22944 18.1415-8.39696 24.6645-15.6469 6.5247-7.17692 10.7417-16.29222 12.6522-27.34456 1.9895-11.05312 3.0236-29.21162 3.1813-54.40398.1592-25.19236 1.5118-42.63258 3.9788-52.25184 2.4672-9.68954 7.4011-17.29762 14.8792-22.8951 7.5589-5.59848 17.1855-8.54048 29.1212-8.82774v-34.45144z"
     clip-rule="evenodd"
     fill="#1f1b20"
     fill-rule="nonzero"
     image-rendering="optimizeQuality"
     shape-rendering="geometricPrecision"
     stroke-width=".138725"
     id="path9" />
  <g
     fill="none"
     id="g17">
    <path
       d="m461.64788 201.97063h461.64788"
       stroke="#666"
       stroke-width="57.706"
       id="path10" />
    <path
       d="m461.64788 317.38259h461.64788"
       stroke="#666"
       stroke-width="57.706"
       id="path11" />
    <path
       d="m923.29576 432.79457h-461.64788"
       stroke="#666"
       stroke-width="57.706"
       id="path12" />
    <path
       d="m923.29576 548.20653h-461.64788"
       stroke="#666"
       stroke-width="57.706"
       id="path13" />
    <path
       d="m692.47162 288.52994v288.52991"
       stroke="#fff"
       stroke-linecap="round"
       stroke-width="144.26497"
       id="path14" />
    <path
       d="m692.4716 620.33938 115.41198-115.41196m-115.41198 115.41196-115.41196-115.41196"
       stroke="#fff"
       stroke-linecap="round"
       stroke-width="158.691"
       id="path15" />
    <path
       d="m692.47182 288.52994v288.52991"
       stroke="#0097bd"
       stroke-linecap="round"
       stroke-width="86.558981"
       id="path16" />
    <path
       d="m692.47182 620.3394 115.41198-115.41196m-115.41198 115.41196-115.41196-115.41196"
       stroke="#0097bd"
       stroke-linecap="round"
       stroke-width="86.559"
       id="path17" />
  </g>
</svg>
