<?xml version="1.0" encoding="UTF-8" standalone="no"?>
<svg
   height="24"
   width="24"
   version="1.1"
   id="svg16"
   sodipodi:docname="Folder_10_24.svg"
   inkscape:export-filename="Folder_10_24.png"
   inkscape:export-xdpi="96"
   inkscape:export-ydpi="96"
   inkscape:version="1.2 (dc2aedaf03, 2022-05-15)"
   xml:space="preserve"
   xmlns:inkscape="http://www.inkscape.org/namespaces/inkscape"
   xmlns:sodipodi="http://sodipodi.sourceforge.net/DTD/sodipodi-0.dtd"
   xmlns="http://www.w3.org/2000/svg"
   xmlns:svg="http://www.w3.org/2000/svg"><defs
     id="defs20"><radialGradient
       id="a"
       cx="12.1"
       cy="10.900001"
       gradientTransform="matrix(0,1.5892257,-1.5892254,2.9972888e-8,32.677103,-3.8750849)"
       gradientUnits="userSpaceOnUse"
       r="4.5"><stop
         offset="0"
         stop-color="#f55"
         id="stop138" /><stop
         offset="1"
         stop-color="#a00"
         id="stop140" /></radialGradient></defs><sodipodi:namedview
     id="namedview18"
     pagecolor="#ffffff"
     bordercolor="#666666"
     borderopacity="1.0"
     inkscape:pageshadow="2"
     inkscape:pageopacity="0.0"
     inkscape:pagecheckerboard="0"
     inkscape:deskcolor="#d1d1d1"
     showgrid="true"
     inkscape:zoom="38.25"
     inkscape:cx="11.986928"
     inkscape:cy="12"
     inkscape:current-layer="g557"
     showguides="true"
     inkscape:showpageshadow="2"><inkscape:grid
       type="xygrid"
       id="grid849" /></sodipodi:namedview><g
     id="g557"><g
       id="g1540"
       transform="translate(6.665e-5)"><path
         d="m 0.75020035,8.75 -2.67e-4,-4 c 0,-1.25 0.75013295,-2 2.00013295,-2 h 3.7499335 c 1.5000004,0 2.0000004,0.75 2.0000004,2 H 23.250067 v 4"
         id="path8-5"
         style="fill:#fff3cc;fill-opacity:1;stroke:#f4c025;stroke-width:1.5;stroke-linecap:round;stroke-linejoin:round"
         sodipodi:nodetypes="ccccccc" /><path
         d="M 23.25,8.75 H 0.75 v 12.5 h 22.5 z"
         stroke-linecap="round"
         id="path10"
         style="fill:#f4c025;fill-opacity:1;stroke:#f4c025;stroke-width:1.5;stroke-linejoin:round;stroke-opacity:1"
         sodipodi:nodetypes="ccccc" /></g><g
       id="g1848"><circle
         cx="17.5"
         cy="17.5"
         style="fill:url(#a);stroke:#ffffff;stroke-width:1.2;stroke-linecap:round;stroke-linejoin:round;stroke-dasharray:none;stroke-dashoffset:1.49998"
         transform="matrix(0,1,1,0,0,0)"
         id="circle143"
         r="5.9000001" /><g
         id="g4083"
         transform="matrix(1.5,0,0,1.5,0.25,0.25)"><path
           d="m 13,10 -3,3"
           id="path3550"
           style="fill:none;stroke:#ffffff;stroke-width:1.2;stroke-linecap:round;stroke-dasharray:none"
           sodipodi:nodetypes="cc" /><path
           d="M 13,13 10,10"
           id="path3552"
           style="fill:none;stroke:#ffffff;stroke-width:1.2;stroke-linecap:round;stroke-dasharray:none"
           sodipodi:nodetypes="cc" /></g></g></g></svg>
