<?xml version="1.0" encoding="UTF-8" standalone="no"?>
<svg
   height="32"
   width="32"
   version="1.1"
   id="svg328"
   sodipodi:docname="menu_view_restriction_browser_200.svg"
   inkscape:export-filename="menu_view_restriction_browser_200.png"
   inkscape:export-xdpi="96"
   inkscape:export-ydpi="96"
   inkscape:version="1.2.2 (732a01da63, 2022-12-09)"
   xmlns:inkscape="http://www.inkscape.org/namespaces/inkscape"
   xmlns:sodipodi="http://sodipodi.sourceforge.net/DTD/sodipodi-0.dtd"
   xmlns="http://www.w3.org/2000/svg"
   xmlns:svg="http://www.w3.org/2000/svg">
  <defs
     id="defs332" />
  <sodipodi:namedview
     id="namedview330"
     pagecolor="#ffffff"
     bordercolor="#666666"
     borderopacity="1.0"
     inkscape:showpageshadow="2"
     inkscape:pageopacity="0.0"
     inkscape:pagecheckerboard="0"
     inkscape:deskcolor="#d1d1d1"
     showgrid="true"
     inkscape:zoom="28.6875"
     inkscape:cx="15.982571"
     inkscape:cy="16"
     inkscape:current-layer="svg328">
    <inkscape:grid
       type="xygrid"
       id="grid594" />
  </sodipodi:namedview>
  <path
     d="m2.90351 2.90351h25.192979v26.19298h-25.192979z"
     style="fill:#2a7fff;stroke:#2a7fff;stroke-linecap:round;stroke-linejoin:round;stroke-miterlimit:5.6;stroke-width:1.80702"
     id="path302" />
  <path
     d="m4 6h23v22h-23z"
     fill="#fff"
     stroke-width="1.80702"
     id="path304" />
  <circle
     cx="8"
     cy="11"
     fill="#ff7f00"
     r="2"
     stroke-width="2"
     id="circle306" />
  <circle
     cx="8"
     cy="23"
     fill="#fa0302"
     r="2"
     stroke-width="2"
     id="circle308" />
  <circle
     cx="8"
     cy="17"
     fill="#01a901"
     r="2"
     stroke-width="2"
     id="circle310" />
  <path
     d="m 12,11.25 h 8"
     id="path312"
     style="fill:none;stroke:#999999;stroke-width:1.5" />
  <path
     d="m 12,23.25 h 8"
     id="path314"
     style="fill:none;stroke:#999999;stroke-width:1.5" />
  <path
     d="m 12,17.25 h 8"
     id="path316"
     style="fill:none;stroke:#999999;stroke-width:1.5" />
  <path
     d="m23.25 11h-2.5l-9.5 19h17.75v-7.5z"
     fill="#fff"
     id="path320" />
  <path
     d="m21.999846 13.0252159-8.974567 17.9491291h17.9491297z"
     fill="#ffd42a"
     stroke="#806600"
     stroke-linejoin="round"
     stroke-width="2.05131"
     id="path322" />
  <path
     d="m21.999844 20.97419v3.000047"
     fill="none"
     stroke="#000"
     stroke-linecap="round"
     stroke-width="2.00003"
     id="path324" />
  <circle
     cx="21.999844"
     cy="26.974282"
     r="1.000016"
     id="circle326" />
</svg>
