<?xml version="1.0" encoding="UTF-8" standalone="no"?>
<svg
   height="32"
   viewBox="0 0 8.4666664 8.4666671"
   width="32"
   version="1.1"
   id="svg7"
   sodipodi:docname="Delete_04_32.svg"
   inkscape:version="1.3 (0e150ed6c4, 2023-07-21)"
   inkscape:export-filename="Delete_04_32.png"
   inkscape:export-xdpi="96"
   inkscape:export-ydpi="96"
   xmlns:inkscape="http://www.inkscape.org/namespaces/inkscape"
   xmlns:sodipodi="http://sodipodi.sourceforge.net/DTD/sodipodi-0.dtd"
   xmlns="http://www.w3.org/2000/svg"
   xmlns:svg="http://www.w3.org/2000/svg">
  <defs
     id="defs7" />
  <sodipodi:namedview
     id="namedview7"
     pagecolor="#ffffff"
     bordercolor="#000000"
     borderopacity="0.25"
     inkscape:showpageshadow="2"
     inkscape:pageopacity="0.0"
     inkscape:pagecheckerboard="0"
     inkscape:deskcolor="#d1d1d1"
     inkscape:current-layer="g7"
     showgrid="true">
    <inkscape:grid
       id="grid7"
       units="px"
       originx="0"
       originy="0"
       spacingx="0.13229166"
       spacingy="0.13229167"
       empcolor="#0099e5"
       empopacity="0.30196078"
       color="#0099e5"
       opacity="0.14901961"
       empspacing="2"
       dotted="false"
       gridanglex="30"
       gridanglez="30"
       visible="true" />
  </sodipodi:namedview>
  <g
     stroke="#00aad4"
     stroke-linecap="round"
     stroke-linejoin="round"
     stroke-width=".529166"
     id="g7">
    <g
       fill="#f5f7ff"
       id="g3">
      <path
         d="m1.3229162 2.1166668.4233334 6.0854174h4.9741671l.4233334-6.0854174"
         id="path1"
         style="fill:#f5f7ff;fill-opacity:1" />
      <path
         d="m.79374955 2.1166668c2.35193575-.4821338 4.49791745-.5291663 6.87916725 0"
         id="path2" />
      <path
         d="m3.1749997 1.5875002v-.79375012c.7937501-.26458337 1.3229168-.26458337 2.1166669 0v.79375012"
         id="path3" />
    </g>
    <path
       d="M 4.2333326,2.9104167 V 7.1437503"
       id="path4"
       style="fill:none;stroke:#75d4f0;stroke-opacity:1" />
    <path
       d="m 3.0691663,7.1437507 -0.3175,-4.233334"
       id="path5"
       style="fill:none;stroke:#75d4f0;stroke-opacity:1" />
    <path
       d="M 5.3975,7.1437507 5.715,2.9104167"
       id="path6"
       style="fill:none;stroke:#75d4f0;stroke-opacity:1" />
  </g>
</svg>
