<?xml version="1.0" encoding="UTF-8" standalone="no"?>
<svg
   width="36"
   height="36"
   version="1.1"
   viewBox="0 0 36 36"
   id="svg3"
   sodipodi:docname="tstatictext_150.svg"
   inkscape:export-filename="tstatictext_150.png"
   inkscape:export-xdpi="96"
   inkscape:export-ydpi="96"
   inkscape:version="1.3.2 (091e20e, 2023-11-25, custom)"
   xmlns:inkscape="http://www.inkscape.org/namespaces/inkscape"
   xmlns:sodipodi="http://sodipodi.sourceforge.net/DTD/sodipodi-0.dtd"
   xmlns="http://www.w3.org/2000/svg"
   xmlns:svg="http://www.w3.org/2000/svg">
  <defs
     id="defs3" />
  <sodipodi:namedview
     id="namedview3"
     pagecolor="#ffffff"
     bordercolor="#000000"
     borderopacity="0.25"
     inkscape:showpageshadow="2"
     inkscape:pageopacity="0.0"
     inkscape:pagecheckerboard="0"
     inkscape:deskcolor="#d1d1d1"
     showgrid="true"
     inkscape:current-layer="svg3">
    <inkscape:grid
       id="grid3"
       units="px"
       originx="0"
       originy="0"
       spacingx="0.5"
       spacingy="0.5"
       empcolor="#0099e5"
       empopacity="0.30196078"
       color="#0099e5"
       opacity="0.14901961"
       empspacing="2"
       dotted="false"
       gridanglex="30"
       gridanglez="30"
       visible="true" />
  </sodipodi:namedview>
  <rect
     x="2.5"
     y="9.5"
     width="31"
     height="17"
     fill="none"
     stroke="#2a7efe"
     stroke-linecap="round"
     stroke-linejoin="round"
     style="paint-order:normal"
     id="rect1" />
  <path
     d="m13.416073 18.520817h-2.514644c-1.234151 0-1.676429 0.8674-1.676429 1.4908 0 1.0414 0.6878 1.8059 1.676429 1.8059 0.819387 0 1.66884-0.5187 2.514644-0.7514m0 0.7514v-4.1067c0-1.8168-0.928713-2.179-2.095537-2.179-0.28587 0-0.859925 0.016-1.427588 0.3885"
     fill="none"
     stroke="#2a7efe"
     stroke-linecap="round"
     stroke-linejoin="round"
     stroke-width="1.2"
     id="path1" />
  <path
     d="m18.695537 15.531817h2e-6c1.160927 0 2.095535 0.9345 2.095535 2.0952v2.0953c0 1.1607-0.934608 2.0952-2.095535 2.0952h-2e-6c-1.160927 0-2.095537-0.9345-2.095537-2.0952v-2.0953c0-1.1607 0.93461-2.0952 2.095537-2.0952zm-2.095537-2.5143v8.8"
     fill="none"
     stroke="#2a7efe"
     stroke-linecap="round"
     stroke-linejoin="round"
     stroke-width="1.2"
     id="path2" />
  <path
     d="m27.382602 16.381017c-0.381003-0.5158-0.993664-0.8492-1.687062-0.8492h-1e-6c-1.160927 0-2.095539 0.9345-2.095539 2.0952l9.69e-4 2.0953c0 1.1607 0.93461 2.0952 2.095537 2.0952h3e-6c0.693397 0 1.306059-0.3334 1.687063-0.8492"
     fill="none"
     stroke="#2a7efe"
     stroke-linecap="round"
     stroke-linejoin="round"
     stroke-width="1.2"
     id="path3" />
</svg>
