<?xml version="1.0" encoding="UTF-8" standalone="no"?>
<svg
   width="24"
   height="24"
   version="1.1"
   viewBox="0 0 24 24"
   id="svg19"
   sodipodi:docname="tshelllistview.svg"
   inkscape:export-filename="tshelllistview.png"
   inkscape:export-xdpi="96"
   inkscape:export-ydpi="96"
   inkscape:version="1.3.2 (091e20e, 2023-11-25, custom)"
   xmlns:inkscape="http://www.inkscape.org/namespaces/inkscape"
   xmlns:sodipodi="http://sodipodi.sourceforge.net/DTD/sodipodi-0.dtd"
   xmlns="http://www.w3.org/2000/svg"
   xmlns:svg="http://www.w3.org/2000/svg">
  <sodipodi:namedview
     id="namedview19"
     pagecolor="#ffffff"
     bordercolor="#000000"
     borderopacity="0.25"
     inkscape:showpageshadow="2"
     inkscape:pageopacity="0.0"
     inkscape:pagecheckerboard="0"
     inkscape:deskcolor="#d1d1d1"
     showgrid="true"
     inkscape:current-layer="svg19">
    <inkscape:grid
       id="grid19"
       units="px"
       originx="0"
       originy="0"
       spacingx="0.5"
       spacingy="0.5"
       empcolor="#0099e5"
       empopacity="0.30196078"
       color="#0099e5"
       opacity="0.14901961"
       empspacing="2"
       dotted="false"
       gridanglex="30"
       gridanglez="30"
       visible="true" />
  </sodipodi:namedview>
  <defs
     id="defs10">
    <linearGradient
       id="e"
       x1="-18"
       x2="-16"
       y1="1033.3622"
       y2="1035.3622"
       gradientTransform="matrix(1.5,0,0,1.4999913,38,-1539.0341)"
       gradientUnits="userSpaceOnUse">
      <stop
         stop-color="#d35f8d"
         offset="0"
         id="stop1" />
      <stop
         stop-color="#782144"
         offset="1"
         id="stop2" />
    </linearGradient>
    <linearGradient
       id="d"
       x1="-18"
       x2="-16"
       y1="1033.3622"
       y2="1035.3622"
       gradientTransform="matrix(1.5,0,0,1.4999913,32,-1539.0342)"
       gradientUnits="userSpaceOnUse">
      <stop
         stop-color="#ffcc00"
         offset="0"
         id="stop3" />
      <stop
         stop-color="#aa8800"
         offset="1"
         id="stop4" />
    </linearGradient>
    <linearGradient
       id="c"
       x1="-18"
       x2="-16"
       y1="1033.3622"
       y2="1035.3622"
       gradientTransform="matrix(1.5,0,0,1.4999913,32,-1533.0342)"
       gradientUnits="userSpaceOnUse">
      <stop
         stop-color="#00d4aa"
         offset="0"
         id="stop5" />
      <stop
         stop-color="#008066"
         offset="1"
         id="stop6" />
    </linearGradient>
    <linearGradient
       id="b"
       x1="10"
       x2="13"
       y1="1031.3622"
       y2="1034.3622"
       gradientTransform="translate(1,-1026.3622)"
       gradientUnits="userSpaceOnUse">
      <stop
         stop-color="#d40000"
         offset="0"
         id="stop7" />
      <stop
         stop-color="#aa0000"
         offset="1"
         id="stop8" />
    </linearGradient>
    <linearGradient
       id="a"
       x1="-18"
       x2="-16"
       y1="1033.3622"
       y2="1035.3622"
       gradientTransform="matrix(1.5,0,0,1.4999913,32,-1545.0342)"
       gradientUnits="userSpaceOnUse">
      <stop
         stop-color="#2a7fff"
         offset="0"
         id="stop9" />
      <stop
         stop-color="#0055d4"
         offset="1"
         id="stop10" />
    </linearGradient>
  </defs>
  <rect
     x="2.25"
     y="3.2499826"
     width="18.5"
     height="18.5"
     fill="#f9f9f9"
     stroke="#2a7efe"
     stroke-width="0.5"
     style="paint-order:normal"
     id="rect10" />
  <rect
     x="17.25"
     y="3.2499826"
     width="3.5"
     height="18.5"
     fill="#e6e6e6"
     stroke="#2a7efe"
     stroke-width="0.5"
     style="paint-order:normal"
     id="rect11" />
  <path
     d="m 19,6.5 v 6"
     fill="#e6e6e6"
     stroke="#2a7efe"
     stroke-linecap="round"
     stroke-linejoin="round"
     id="path11" />
  <rect
     x="5"
     y="4.9999828"
     width="3"
     height="2.9999826"
     fill="url(#a)"
     style="fill:url(#a);paint-order:normal"
     id="rect12" />
  <rect
     x="11"
     y="4.9999828"
     width="3"
     height="2.9999826"
     fill="url(#b)"
     style="fill:url(#b);paint-order:normal"
     id="rect13" />
  <rect
     x="5"
     y="16.999983"
     width="3"
     height="2.9999826"
     fill="url(#c)"
     style="fill:url(#c);paint-order:normal"
     id="rect14" />
  <rect
     x="5"
     y="10.999983"
     width="3"
     height="2.9999826"
     fill="url(#d)"
     style="fill:url(#d);paint-order:normal"
     id="rect15" />
  <rect
     x="11"
     y="10.999983"
     width="3"
     height="2.9999826"
     fill="url(#e)"
     style="fill:url(#e);paint-order:normal"
     id="rect16" />
  <path
     d="M 4,9.5 H 9"
     fill="#ececec"
     stroke="#999999"
     stroke-linejoin="round"
     id="path16" />
  <path
     d="m 10,9.5 h 5"
     fill="#ececec"
     stroke="#999999"
     stroke-linejoin="round"
     id="path17" />
  <path
     d="m 10,15.5 h 5"
     fill="#ececec"
     stroke="#999999"
     stroke-linejoin="round"
     id="path18" />
  <path
     d="M 4,15.5 H 9"
     fill="#ececec"
     stroke="#999999"
     stroke-linejoin="round"
     id="path19" />
</svg>
