<?xml version="1.0" encoding="UTF-8" standalone="no"?>
<svg
   height="36"
   width="36"
   version="1.1"
   id="svg18"
   sodipodi:docname="Chart_03_36.svg"
   inkscape:version="1.2 (dc2aedaf03, 2022-05-15)"
   inkscape:export-filename="Chart_03_36.png"
   inkscape:export-xdpi="96"
   inkscape:export-ydpi="96"
   xmlns:inkscape="http://www.inkscape.org/namespaces/inkscape"
   xmlns:sodipodi="http://sodipodi.sourceforge.net/DTD/sodipodi-0.dtd"
   xmlns="http://www.w3.org/2000/svg"
   xmlns:svg="http://www.w3.org/2000/svg">
  <defs
     id="defs22" />
  <sodipodi:namedview
     id="namedview20"
     pagecolor="#ffffff"
     bordercolor="#666666"
     borderopacity="1.0"
     inkscape:pageshadow="2"
     inkscape:pageopacity="0.0"
     inkscape:pagecheckerboard="0"
     inkscape:deskcolor="#d1d1d1"
     showgrid="true"
     inkscape:zoom="25.5"
     inkscape:cx="15.509804"
     inkscape:cy="18"
     inkscape:current-layer="svg18"
     inkscape:showpageshadow="2">
    <inkscape:grid
       type="xygrid"
       id="grid147"
       originx="0"
       originy="0" />
  </sodipodi:namedview>
  <path
     style="fill:none;stroke:#00aad4;stroke-width:2.25px;stroke-linecap:round;stroke-linejoin:round;stroke-opacity:1"
     d="m 1.125,3.625 v 29.25 h 33.75"
     id="path350"
     sodipodi:nodetypes="ccc" />
  <path
     style="fill:none;stroke:#00aad4;stroke-width:2.8125;stroke-linecap:round;stroke-linejoin:miter;stroke-dasharray:none;stroke-opacity:1"
     d="M 7.40625,28.62525 V 17.375"
     id="path534"
     sodipodi:nodetypes="cc" />
  <path
     style="fill:none;stroke:#00aad4;stroke-width:2.8125;stroke-linecap:round;stroke-linejoin:miter;stroke-dasharray:none;stroke-opacity:1"
     d="M 14.40625,28.62525 V 12.875"
     id="path536"
     sodipodi:nodetypes="cc" />
  <path
     style="fill:none;stroke:#00aad4;stroke-width:2.8125;stroke-linecap:round;stroke-linejoin:miter;stroke-dasharray:none;stroke-opacity:1"
     d="M 21.40625,28.62525 V 19.625"
     id="path538"
     sodipodi:nodetypes="cc" />
  <path
     style="fill:none;stroke:#00aad4;stroke-width:2.8125;stroke-linecap:round;stroke-linejoin:miter;stroke-dasharray:none;stroke-opacity:1"
     d="M 28.40625,28.62525 V 8.375"
     id="path540"
     sodipodi:nodetypes="cc" />
</svg>
