<?xml version="1.0" encoding="UTF-8" standalone="no"?>
<svg
   width="24"
   height="24"
   viewBox="0 0 24 24"
   version="1.1"
   id="svg1"
   sodipodi:docname="tag_nbsp_150.svg"
   inkscape:version="1.3.2 (091e20e, 2023-11-25, custom)"
   inkscape:export-filename="tag_nbsp_150.png"
   inkscape:export-xdpi="96"
   inkscape:export-ydpi="96"
   xmlns:inkscape="http://www.inkscape.org/namespaces/inkscape"
   xmlns:sodipodi="http://sodipodi.sourceforge.net/DTD/sodipodi-0.dtd"
   xmlns="http://www.w3.org/2000/svg"
   xmlns:svg="http://www.w3.org/2000/svg">
  <defs
     id="defs1" />
  <sodipodi:namedview
     id="namedview1"
     pagecolor="#ffffff"
     bordercolor="#000000"
     borderopacity="0.25"
     inkscape:showpageshadow="2"
     inkscape:pageopacity="0.0"
     inkscape:pagecheckerboard="0"
     inkscape:deskcolor="#d1d1d1"
     showgrid="true"
     inkscape:current-layer="svg1">
    <inkscape:grid
       id="grid1"
       units="px"
       originx="0"
       originy="0"
       spacingx="0.5"
       spacingy="0.5"
       empcolor="#0099e5"
       empopacity="0.30196078"
       color="#0099e5"
       opacity="0.14901961"
       empspacing="2"
       dotted="false"
       gridanglex="30"
       gridanglez="30"
       visible="true" />
  </sodipodi:namedview>
  <path
     d="m 3.9999998,9.4999864 v 8.9999786 m 0,-5.774986 c 0,-1.786647 1.3801323,-3.2249926 3.0944693,-3.2249926 1.7143407,0 2.9055231,1.4383456 2.9055231,3.2249926 v 5.774986"
     fill="none"
     stroke="#008dd2"
     stroke-linecap="round"
     stroke-linejoin="round"
     stroke-width="2.39999"
     id="path1" />
  <path
     d="m 17.999992,9.4999864 h 4e-6 c 1.661998,0 2.999992,1.3379966 2.999992,2.9999926 v 2.999993 c 0,1.661996 -1.337994,2.999993 -2.999992,2.999993 h -4e-6 c -1.661995,0 -2.999993,-1.337997 -2.999993,-2.999993 v -2.999993 c 0,-1.661996 1.337998,-2.9999926 2.999993,-2.9999926 z M 14.999999,5.8999944 V 18.499965"
     fill="none"
     stroke="#008dd2"
     stroke-linecap="round"
     stroke-linejoin="round"
     stroke-width="2.39999"
     id="path2" />
</svg>
