<?xml version="1.0" encoding="UTF-8" standalone="no"?>
<svg
   height="32"
   width="32"
   version="1.1"
   id="svg5"
   sodipodi:docname="inserturltag_200.svg"
   inkscape:export-filename="inserturltag_200.png"
   inkscape:export-xdpi="96"
   inkscape:export-ydpi="96"
   inkscape:version="1.3.2 (091e20e, 2023-11-25, custom)"
   xmlns:inkscape="http://www.inkscape.org/namespaces/inkscape"
   xmlns:sodipodi="http://sodipodi.sourceforge.net/DTD/sodipodi-0.dtd"
   xmlns="http://www.w3.org/2000/svg"
   xmlns:svg="http://www.w3.org/2000/svg">
  <defs
     id="defs5" />
  <sodipodi:namedview
     id="namedview5"
     pagecolor="#ffffff"
     bordercolor="#000000"
     borderopacity="0.25"
     inkscape:showpageshadow="2"
     inkscape:pageopacity="0.0"
     inkscape:pagecheckerboard="0"
     inkscape:deskcolor="#d1d1d1"
     showgrid="true"
     inkscape:current-layer="svg5">
    <inkscape:grid
       id="grid5"
       units="px"
       originx="0"
       originy="0"
       spacingx="0.5"
       spacingy="0.5"
       empcolor="#0099e5"
       empopacity="0.30196078"
       color="#0099e5"
       opacity="0.14901961"
       empspacing="2"
       dotted="false"
       gridanglex="30"
       gridanglez="30"
       visible="true" />
  </sodipodi:namedview>
  <g
     stroke-linecap="round"
     id="g5">
    <path
       d="m16 2c-7.7235223 0-14 6.2764757-14 14 0 3.915262 1.6177613 7.453881 4.2148437 9.996094-.0471244-.326608-.078125-.657454-.078125-.996094 0-.369074.036-.729387.091797-1.083984-.1889478-.233248-.3707735-.472245-.5429688-.71875.2400702-.036475.4805664-.065642.7207031-.09961.1525733-.537635.3671424-1.049219.6367187-1.527344-.7207942.094235-1.4419362.198944-2.1621093.314454-.8248372-1.557894-1.3359993-3.309885-1.4394531-5.171875v-.002h4.7460937c.035253 1.021702.1496525 2.039889.3320313 3.03711.3952483-.349909.8268005-.660365 1.2929687-.914017-.1040782-.69804-.1743381-1.406062-.2011719-2.121093h5.6777349v1.404296c.492637.08895.969397.225943 1.421874.414063v-1.818359h5.677735c-.01906.508016-.06602 1.009768-.125 1.509765.470848-.118142.957947-.187706 1.458984-.203125.04203-.434824.07476-.869529.08984-1.30664h4.746094c-.04104.738686-.154448 1.456037-.31836 2.154296.447266.247767.86117.54799 1.242188.884766.33387-1.194708.517582-2.451495.517582-3.751953 0-7.7235243-6.276476-14-14-14zm-3.121094 1.8164063c-1.604998 1.4063755-2.78903 3.3059735-3.5683591 5.4433593-1.2097468-.1196199-2.4171972-.2735294-3.625-.4570312 1.6983743-2.4313016 4.2349543-4.2321999 7.1933591-4.9863281zm6.242188 0c2.958405.7541282 5.494985 2.5550265 7.193359 4.9863281-1.208209.1849398-2.417304.3376093-3.623047.4570312-.779325-2.1378718-1.965014-4.0367218-3.570312-5.4433593zm-3.832031.0273437v5.7421875c-1.499449-.0162-2.997947-.081906-4.494141-.1972656.951085-2.3999036 2.459097-4.395037 4.494141-5.5449219zm1.421874 0c2.036304 1.1505968 3.547062 3.1469385 4.498047 5.5488281-1.501098.1155199-3.000494.1780794-4.498047.1933594zm-11.8300776 6.271484c1.3273426.212864 2.6558274.393951 3.9863281.53125-.4078036 1.492029-.6285256 3.065186-.6796875 4.642579h-4.7460937c.1034538-1.861991.6146159-3.615836 1.4394531-5.173829zm22.2382816 0c.824837 1.557993 1.336001 3.311838 1.439453 5.173829h-4.746094c-.05112-1.576173-.272476-3.147674-.679688-4.638672 1.327897-.13716 2.65612-.320127 3.986329-.535157zm-16.798828.664063c1.653706.13612 3.310577.212781 4.96875.230469v4.279297h-5.6777349c.05466-1.550853.2915668-3.081446.7089849-4.509766zm11.363281.0039c.416613 1.427059.65048 2.956613.705078 4.50586h-5.677735v-4.279297c1.655791-.0164 3.312846-.09016 4.972657-.226563z"
       fill="#2a7fff"
       stroke-dashoffset="1.49998"
       stroke-linejoin="round"
       stroke-width="1.5"
       id="path1" />
    <g
       fill="none"
       stroke="#2a7fff"
       stroke-width="1.00748"
       transform="matrix(1.9734206 0 0 1.9969842 -1.721035 -1.959265)"
       id="g4">
      <path
         d="m11.590652 14.919052c.36155.359031.859542.580858 1.409348.580903l.500012.000023c1.104634-.000023 2.000108-.895434 2.000108-1.999978s-.895474-1.999955-2.000108-1.999977l-.500012-.000023c-.556843 0-1.060537.227541-1.423162.59471"
         stroke-linejoin="round"
         id="path2" />
      <path
         d="m7.499736 13.5h6.000264"
         id="path3" />
      <path
         d="m9.409468 14.919052c-.36155.359031-.859542.580858-1.409348.580903l-.500012.000023c-1.104634-.000023-2.000108-.895434-2.000108-1.999978s.895474-1.999955 2.000108-1.999977l.500012-.000023c.556843 0 1.060537.227541 1.423162.59471"
         stroke-linejoin="round"
         id="path4" />
    </g>
  </g>
</svg>
