<?xml version="1.0" encoding="UTF-8" standalone="no"?>
<svg
   height="24"
   width="24"
   version="1.1"
   id="svg1"
   sodipodi:docname="insertvartag_150.svg"
   inkscape:export-filename="insertvartag_150.png"
   inkscape:export-xdpi="96"
   inkscape:export-ydpi="96"
   inkscape:version="1.3.2 (091e20e, 2023-11-25, custom)"
   xmlns:inkscape="http://www.inkscape.org/namespaces/inkscape"
   xmlns:sodipodi="http://sodipodi.sourceforge.net/DTD/sodipodi-0.dtd"
   xmlns="http://www.w3.org/2000/svg"
   xmlns:svg="http://www.w3.org/2000/svg">
  <defs
     id="defs1" />
  <sodipodi:namedview
     id="namedview1"
     pagecolor="#ffffff"
     bordercolor="#000000"
     borderopacity="0.25"
     inkscape:showpageshadow="2"
     inkscape:pageopacity="0.0"
     inkscape:pagecheckerboard="0"
     inkscape:deskcolor="#d1d1d1"
     showgrid="true"
     inkscape:current-layer="svg1">
    <inkscape:grid
       id="grid1"
       units="px"
       originx="0"
       originy="0"
       spacingx="0.5"
       spacingy="0.5"
       empcolor="#0099e5"
       empopacity="0.30196078"
       color="#0099e5"
       opacity="0.14901961"
       empspacing="2"
       dotted="false"
       gridanglex="30"
       gridanglez="30"
       visible="true" />
  </sodipodi:namedview>
  <path
     d="m21.848106 32.948472q0 .171875-.0078.289062-.0078.117188-.03125.1875-.02344.0625-.0625.101562-.03125.03125-.09375.03125-.06251 0-.15625-.03125-.08594-.03906-.203126-.07031-.10938-.03906-.249999-.07031-.140625-.03125-.304687-.03125-.195314 0-.382814.07812-.1875.07813-.398437.257813-.203124.179687-.429687.476562-.226563.296875-.5.726563v4.625q0 .0625-.03125.109375-.03124.03906-.101565.07031-.0703.03125-.195312.04687-.124995.01562-.320313.01562-.1875 0-.312499-.01562-.124995-.01563-.203126-.04687-.0703-.03125-.101565-.07031-.02345-.04687-.02345-.109375v-7.03125q0-.0625.02345-.101562.02344-.04687.09375-.07812.0703-.03906.179687-.04687.10938-.01563.289063-.01563.171875 0 .28125.01563.117195.0078.179687.04687.06251.03125.08593.07812.03125.03906.03125.101562v1.023438q.289063-.421875.539062-.6875.257813-.265625.484376-.414063.226563-.15625.445312-.210937.226563-.0625.453125-.0625.101565 0 .226563.01563.13281.0078.273438.03906.140625.03125.249999.07031.117195.03906.164062.07813.04687.03906.06251.07812.01563.03125.02344.08594.01563.05469.01563.164063.0078.101562.0078.28125zm-6.46875 6.578125q0 .09375-.0625.140625-.0625.04687-.171874.07031-.10938.02344-.320313.02344-.203126 0-.328125-.02344-.117188-.02344-.171875-.07031-.05469-.04687-.05469-.140625v-.703125q-.460934.492187-1.031246.765625-.5625.273438-1.195313.273438-.554687 0-1.007812-.148438-.445313-.140625-.765625-.414063-.3125005-.273437-.492188-.671875-.171875-.398437-.171875-.90625 0-.59375.2421875-1.03125.2421875-.4375.6953125-.726562.453125-.289063 1.109375-.429688.65625-.148437 1.476563-.148437h.96875v-.546875q0-.40625-.08594-.71875-.08594-.3125-.28125-.515625-.1875-.210938-.492188-.3125-.304687-.109376-.75-.109376-.476562 0-.859375.117188-.375.109375-.664062.25-.28125.132813-.476563.25-.1875.109375-.28125.109375-.0625 0-.109375-.03125-.04687-.03125-.08594-.09375-.03125-.0625-.046875-.15625-.015626-.101562-.015626-.21875 0-.195313.023437-.304688.031249-.117187.132813-.21875.109375-.101562.367187-.234375.257813-.140625.59375-.25.335938-.117187.734375-.1875.398438-.07812.804688-.07812.757812 0 1.289062.171875.53125.171874.859375.507812.328125.328125.476562.820313.14844.492187.14844 1.148437zm-1.28125-3.210938h-1.101563q-.53125 0-.921875.09375-.390625.08594-.648437.265625-.257813.171875-.382813.421875-.117187.242188-.117187.5625 0 .546875.34375.875.351562.320313.976562.320313.507813 0 .9375-.257813.4375-.257812.914063-.789062zm-5.2500007-3.84375q0 .03125-.00782.07031 0 .03125-.00781.07031-.00782.03906-.023437.08594-.00782.04687-.023437.101562l-2.3984327 6.679688q-.031249.08594-.085938.140625-.046875.05469-.148437.08594-.101562.03125-.2578125.03906-.1562499.01562-.390625.01562-.234375 0-.3906249-.01562-.1562501-.01563-.2578125-.04687-.09375-.03125-.148437-.08594-.054687-.05469-.085938-.132813l-2.3906262-6.679687q-.03125-.09375-.054687-.164062-.015625-.07031-.023437-.101563 0-.03906 0-.0625 0-.0625.031249-.109376.031249-.04687.101562-.07031.078124-.03125.1953126-.03906.1249995-.0078.3046875-.0078.2265625 0 .3593749.01563.140625.0078.2109375.03906.078124.03125.1093755.07813.039063.04687.070312.117187l1.9843751 5.796875.031249.09375.023437-.09375 1.9609377-5.796875q.015625-.07031.054687-.117187.039063-.04687.1093755-.07813.078124-.03125.2031249-.03906.132813-.01563.34375-.01563.1796876 0 .2968751.0078.1171875.0078.1796874.03906.070312.03125.09375.07812.03125.03906.03125.101562z"
     fill="#2a7fff"
     transform="translate(0 -24)"
     id="path1" />
</svg>
