<?xml version="1.0" encoding="UTF-8" standalone="no"?>
<svg
   height="64"
   width="64"
   version="1.1"
   id="svg175"
   sodipodi:docname="Grid_06_64.svg"
   inkscape:export-filename="Grid_06_64.png"
   inkscape:export-xdpi="96"
   inkscape:export-ydpi="96"
   inkscape:version="1.2-beta (1b65182ce9, 2022-04-05)"
   xmlns:inkscape="http://www.inkscape.org/namespaces/inkscape"
   xmlns:sodipodi="http://sodipodi.sourceforge.net/DTD/sodipodi-0.dtd"
   xmlns="http://www.w3.org/2000/svg"
   xmlns:svg="http://www.w3.org/2000/svg">
  <defs
     id="defs179">
    <linearGradient
       id="a"
       gradientTransform="matrix(0,-0.9375,-1.0166667,0,84.133336,49.78125)"
       gradientUnits="userSpaceOnUse"
       x1="9"
       x2="6"
       y1="10"
       y2="10.5">
      <stop
         offset="0"
         stop-color="#72cef6"
         id="stop2" />
      <stop
         offset="1"
         stop-color="#d2f5f8"
         id="stop4" />
    </linearGradient>
    <linearGradient
       id="b"
       gradientTransform="matrix(0,-0.9375,-1.0166667,0,84.133336,49.78125)"
       gradientUnits="userSpaceOnUse"
       x1="10"
       x2="5"
       y1="12.5"
       y2="12.5">
      <stop
         offset="0"
         stop-color="#4674a8"
         id="stop7" />
      <stop
         offset="1"
         stop-color="#42a0ce"
         id="stop9" />
    </linearGradient>
  </defs>
  <sodipodi:namedview
     id="namedview177"
     pagecolor="#ffffff"
     bordercolor="#666666"
     borderopacity="1.0"
     inkscape:pageshadow="2"
     inkscape:pageopacity="0.0"
     inkscape:pagecheckerboard="0"
     inkscape:deskcolor="#d1d1d1"
     showgrid="true"
     inkscape:zoom="14.34375"
     inkscape:cx="30.431373"
     inkscape:cy="32"
     inkscape:current-layer="svg175">
    <inkscape:grid
       type="xygrid"
       id="grid1362" />
  </sodipodi:namedview>
  <g
     id="g1201"
     transform="matrix(1.9999995,0,0,1.9999995,1.4000001e-5,4.000001e-6)">
    <path
       d="M -31.25,0.749999 H -0.749998 V 31.250001 H -31.25 Z"
       style="fill:#ffffff;stroke:#999999;stroke-width:1.5;stroke-linecap:round;stroke-linejoin:round;stroke-dashoffset:1.49998"
       transform="rotate(-90)"
       id="path12" />
    <g
       fill="none"
       stroke="#b3b3b3"
       stroke-width="0.75"
       transform="matrix(0,-2,-2,0,99.999999,168)"
       id="g24">
      <path
         d="m 68.75,46.625 h 14.5"
         id="path14" />
      <path
         d="M 72.125,49.25 V 34.75"
         id="path16" />
      <path
         d="M 83.25,37.375 H 68.75"
         id="path18" />
      <path
         d="M 80.125,49.25 V 34.75"
         id="path20" />
      <path
         d="M 76.125,49.25 V 34.75"
         id="path22" />
    </g>
    <g
       stroke-linejoin="round"
       stroke-width="0.75"
       transform="matrix(0,2,-2,0,103,-136)"
       id="g30">
      <path
         d="m 68.375,-45.375 h 15.25 v 5.25 h -15.25 z"
         fill="none"
         opacity="0.5"
         stroke="#ffffff"
         stroke-dashoffset="1.49998"
         transform="scale(1,-1)"
         id="path26" />
      <path
         d="M 83.625003,44.625 H 68.375002 v -3.75 h 15.250001 z"
         fill="url(#a)"
         stroke="url(#b)"
         stroke-linecap="round"
         id="path28"
         style="fill:url(#a);stroke:url(#b)" />
    </g>
    <g
       fill="none"
       stroke-linecap="round"
       stroke-opacity="0.996078"
       transform="matrix(-2,0,0,2,32.50032,-4)"
       id="g44">
      <g
         stroke="#ffffff"
         stroke-width="3"
         transform="translate(-19.5,11)"
         id="g36">
        <path
           d="M 27.5,-1 H 31"
           opacity="0.7"
           id="path32" />
        <path
           d="m 31.5,-4 3,3 -3,3"
           opacity="0.7"
           stroke-linejoin="round"
           id="path34" />
      </g>
      <g
         stroke="#3771c8"
         stroke-width="2"
         id="g42">
        <path
           d="m 8,10 h 7"
           id="path38" />
        <path
           d="m 12,7 3,3 -3,3"
           stroke-linejoin="round"
           id="path40" />
      </g>
    </g>
  </g>
</svg>
