<?xml version="1.0" encoding="UTF-8" standalone="no"?>
<svg
   height="48"
   width="48"
   version="1.1"
   id="svg409"
   sodipodi:docname="Info_01_48.svg"
   inkscape:export-filename="Info_01_48.png"
   inkscape:export-xdpi="96"
   inkscape:export-ydpi="96"
   inkscape:version="1.2-beta (1b65182ce9, 2022-04-05)"
   xmlns:inkscape="http://www.inkscape.org/namespaces/inkscape"
   xmlns:sodipodi="http://sodipodi.sourceforge.net/DTD/sodipodi-0.dtd"
   xmlns="http://www.w3.org/2000/svg"
   xmlns:svg="http://www.w3.org/2000/svg">
  <defs
     id="defs413" />
  <sodipodi:namedview
     id="namedview411"
     pagecolor="#ffffff"
     bordercolor="#666666"
     borderopacity="1.0"
     inkscape:pageshadow="2"
     inkscape:pageopacity="0.0"
     inkscape:pagecheckerboard="0"
     inkscape:deskcolor="#d1d1d1"
     showgrid="true"
     inkscape:zoom="19.125"
     inkscape:cx="22.823529"
     inkscape:cy="24"
     inkscape:current-layer="svg409">
    <inkscape:grid
       type="xygrid"
       id="grid1490" />
  </sodipodi:namedview>
  <g
     fill="none"
     stroke="#00aad4"
     stroke-linecap="round"
     id="g407"
     transform="scale(2)">
    <path
       d="m 12,11.25 v 6"
       stroke-width="2.4"
       id="path401" />
    <path
       d="m 12,6.7500003 v 0.75"
       stroke-width="2.4"
       id="path403" />
    <circle
       cx="12"
       cy="12"
       r="10.5"
       stroke-linejoin="round"
       stroke-width="1.5"
       id="circle405" />
  </g>
</svg>
