<?xml version="1.0" encoding="UTF-8" standalone="no"?>
<svg
   height="24"
   width="24"
   version="1.1"
   id="svg2"
   sodipodi:docname="ddfields_150.svg"
   inkscape:export-filename="ddfields_150.png"
   inkscape:export-xdpi="96"
   inkscape:export-ydpi="96"
   inkscape:version="1.3-beta (cedbd6c6ff, 2023-05-28)"
   xmlns:inkscape="http://www.inkscape.org/namespaces/inkscape"
   xmlns:sodipodi="http://sodipodi.sourceforge.net/DTD/sodipodi-0.dtd"
   xmlns="http://www.w3.org/2000/svg"
   xmlns:svg="http://www.w3.org/2000/svg">
  <defs
     id="defs2" />
  <sodipodi:namedview
     id="namedview2"
     pagecolor="#ffffff"
     bordercolor="#000000"
     borderopacity="0.25"
     inkscape:showpageshadow="2"
     inkscape:pageopacity="0.0"
     inkscape:pagecheckerboard="0"
     inkscape:deskcolor="#d1d1d1"
     showgrid="true"
     inkscape:current-layer="svg2">
    <inkscape:grid
       id="grid2"
       units="px"
       originx="0"
       originy="0"
       spacingx="0.5"
       spacingy="0.5"
       empcolor="#0099e5"
       empopacity="0.30196078"
       color="#0099e5"
       opacity="0.14901961"
       empspacing="2"
       dotted="false"
       gridanglex="30"
       gridanglez="30"
       visible="true" />
  </sodipodi:namedview>
  <rect
     fill="#c2f3ff"
     height="18.800011"
     ry="2.4000001"
     width="18.800009"
     x="0.59999502"
     y="0.59999502"
     id="rect1"
     style="stroke:#00aad4;stroke-width:1.19999;stroke-linejoin:round" />
  <rect
     fill="#ebfcff"
     height="18.800011"
     ry="2.400001"
     width="18.800009"
     x="3.5999951"
     y="3.5999949"
     id="rect2"
     style="stroke:#00aad4;stroke-width:1.19999;stroke-linejoin:round" />
  <rect
     style="fill:#ffffff;stroke:#00aad4;stroke-width:1;stroke-linecap:round;stroke-linejoin:round;stroke-dasharray:none"
     id="rect4"
     width="11"
     height="11"
     x="7.5"
     y="-18.5"
     transform="rotate(90)" />
  <rect
     style="fill:#00c1f0;fill-opacity:1;stroke:#00aad4;stroke-width:1;stroke-linecap:round;stroke-linejoin:round;stroke-dasharray:none"
     id="rect3"
     width="11"
     height="3"
     x="7.5"
     y="-14.5"
     transform="rotate(90)" />
</svg>
