<?xml version="1.0" encoding="UTF-8" standalone="no"?>
<svg
   height="32"
   viewBox="0 0 8.4666664 8.4666671"
   width="32"
   version="1.1"
   id="svg284"
   sodipodi:docname="Database_11_32.svg"
   inkscape:export-filename="Database_11_32.png"
   inkscape:export-xdpi="96"
   inkscape:export-ydpi="96"
   inkscape:version="1.2.1 (9c6d41e410, 2022-07-14)"
   xmlns:inkscape="http://www.inkscape.org/namespaces/inkscape"
   xmlns:sodipodi="http://sodipodi.sourceforge.net/DTD/sodipodi-0.dtd"
   xmlns="http://www.w3.org/2000/svg"
   xmlns:svg="http://www.w3.org/2000/svg">
  <defs
     id="defs288" />
  <sodipodi:namedview
     id="namedview286"
     pagecolor="#ffffff"
     bordercolor="#666666"
     borderopacity="1.0"
     inkscape:showpageshadow="2"
     inkscape:pageopacity="0.0"
     inkscape:pagecheckerboard="0"
     inkscape:deskcolor="#d1d1d1"
     showgrid="true"
     inkscape:zoom="28.6875"
     inkscape:cx="15.982571"
     inkscape:cy="16"
     inkscape:current-layer="svg284">
    <inkscape:grid
       type="xygrid"
       id="grid839" />
  </sodipodi:namedview>
  <path
     id="path274"
     style="fill:#00aad4;stroke-width:0.529167;stroke-linecap:round;stroke-linejoin:round;stroke-miterlimit:5.6"
     d="m 3.7041667,0.52916667 c -1.7534455,0 -3.17500003,0.55266013 -3.17500003,1.23455003 V 2.75177 c 0,0.6818899 1.42155453,1.23455 3.17500003,1.23455 0.453214,0 0.8837717,-0.037338 1.2738241,-0.1038696 C 5.3137825,3.7039779 5.6841002,3.5999858 6.0637126,3.5775594 6.5705252,3.358801 6.8791667,3.0694194 6.8791667,2.75177 V 1.7766358 1.7637167 c 0,-0.6818899 -1.4215542,-1.23455003 -3.175,-1.23455003 z m 0,0.74104003 c 1.4667589,0 2.4249525,0.4740558 2.8752767,0.8474935 C 6.1302385,2.4240713 5.1748302,2.7729625 3.7041667,2.75177 2.2474469,2.7306938 1.2918188,2.3878021 0.83767498,2.0954794 1.2893393,1.7205769 2.2393193,1.2702067 3.7041667,1.2702067 Z M 0.52916667,3.4922933 v 1.2350668 c 0,0.6664481 1.35816083,1.2092643 3.05666103,1.2335164 0.04305,-0.4448341 0.1980779,-0.8715151 0.4506185,-1.2402344 -0.1092543,0.00442 -0.2200184,0.00672 -0.3322795,0.00672 -1.7534472,0 -3.17500003,-0.5531765 -3.17500003,-1.2350668 z m 0,1.9755901 v 1.2350667 c 0,0.6818904 1.42155283,1.23455 3.17500003,1.23455 0.1674679,0 0.3320128,-0.00527 0.4924764,-0.014986 C 3.9015387,7.5725266 3.7022937,7.1519575 3.6183838,6.7019166 1.9047293,6.6841648 0.52916667,6.1385794 0.52916667,5.4678834 Z"
     sodipodi:nodetypes="ssssccscssscccscsccsccssccc" />
  <g
     fill="none"
     stroke="#ff2828"
     stroke-linecap="round"
     stroke-width="2"
     transform="matrix(0.24988426,0,0,0.24988426,0.47037044,0.47037044)"
     id="g800">
    <circle
       cx="23"
       cy="23"
       r="8"
       stroke-dashoffset="1.49998"
       stroke-linejoin="round"
       id="circle794" />
    <path
       d="m 20,20 6,6"
       id="path796" />
    <path
       d="m 26,20 -6,6"
       id="path798" />
  </g>
</svg>
