<?xml version="1.0" encoding="UTF-8" standalone="no"?>
<svg
   height="32"
   width="32"
   version="1.1"
   id="svg465"
   sodipodi:docname="Refresh_02_32.svg"
   inkscape:export-filename="Refresh_02_32.png"
   inkscape:export-xdpi="96"
   inkscape:export-ydpi="96"
   inkscape:version="1.2-beta (1b65182ce9, 2022-04-05)"
   xmlns:inkscape="http://www.inkscape.org/namespaces/inkscape"
   xmlns:sodipodi="http://sodipodi.sourceforge.net/DTD/sodipodi-0.dtd"
   xmlns:xlink="http://www.w3.org/1999/xlink"
   xmlns="http://www.w3.org/2000/svg"
   xmlns:svg="http://www.w3.org/2000/svg">
  <defs
     id="defs469" />
  <sodipodi:namedview
     id="namedview467"
     pagecolor="#ffffff"
     bordercolor="#666666"
     borderopacity="1.0"
     inkscape:pageshadow="2"
     inkscape:pageopacity="0.0"
     inkscape:pagecheckerboard="0"
     inkscape:deskcolor="#d1d1d1"
     showgrid="true"
     inkscape:zoom="28.6875"
     inkscape:cx="15.982571"
     inkscape:cy="16"
     inkscape:current-layer="svg465">
    <inkscape:grid
       type="xygrid"
       id="grid1490" />
  </sodipodi:namedview>
  <linearGradient
     id="a"
     gradientUnits="userSpaceOnUse"
     x1="24"
     x2="24"
     xlink:href="#c"
     y1="3"
     y2="14" />
  <linearGradient
     id="b"
     gradientTransform="matrix(-2 0 0 -2 32 32)"
     gradientUnits="userSpaceOnUse"
     x1="12"
     x2="12"
     xlink:href="#c"
     y1="1.5"
     y2="7" />
  <linearGradient
     id="c">
    <stop
       offset="0"
       stop-color="#21b2fc"
       id="stop454" />
    <stop
       offset="1"
       stop-color="#97edff"
       id="stop456" />
  </linearGradient>
  <g
     fill-rule="evenodd"
     stroke="#2c5aa0"
     stroke-linejoin="round"
     stroke-width="1.5"
     id="g463">
    <path
       d="m16 2.5000804c-2.376849 0-4.554214.8320254-6.3203124 2.1796876l3.5703124 3.5703124c.809003-.4646444 1.738524-.75 2.75-.75 3.067178 0 5.5 2.4328222 5.5 5.4999996l-4.5-.000039 7 7.000001 7-7.000001-4.5.000039c0-5.7693778-4.730622-10.4999996-10.5-10.4999996z"
       fill="url(#a)"
       id="path459" />
    <path
       d="m16 29.49992c2.376849 0 4.554214-.832026 6.320312-2.179688l-3.570312-3.570312c-.809003.464644-1.738524.75-2.75.75-3.067178 0-5.5-2.432822-5.5-5.5l4.5.000039-7-7.000001-7 7.000001 4.5-.000039c0 5.769378 4.730622 10.5 10.5 10.5z"
       fill="url(#b)"
       id="path461" />
  </g>
</svg>
