<svg width="16" height="16" version="1.1" xmlns="http://www.w3.org/2000/svg">
 <g stroke="#01a901" stroke-linecap="round">
  <circle transform="matrix(0,1,1,0,0,0)" cx="11.5" cy="11.5" r="4" fill="#e5ffd5" stroke-dashoffset="1.49998" stroke-linejoin="round"/>
  <path d="m11.5 10v3" fill="none"/>
  <path d="m13 11.5h-3" fill="none"/>
 </g>
</svg>
