<?xml version="1.0" encoding="UTF-8" standalone="no"?>
<svg
   height="32"
   width="32"
   version="1.1"
   id="svg48"
   sodipodi:docname="16_col_right_200.svg"
   inkscape:export-filename="16_col_right_200.png"
   inkscape:export-xdpi="96"
   inkscape:export-ydpi="96"
   inkscape:version="1.1.2 (0a00cf5339, 2022-02-04, custom)"
   xmlns:inkscape="http://www.inkscape.org/namespaces/inkscape"
   xmlns:sodipodi="http://sodipodi.sourceforge.net/DTD/sodipodi-0.dtd"
   xmlns:xlink="http://www.w3.org/1999/xlink"
   xmlns="http://www.w3.org/2000/svg"
   xmlns:svg="http://www.w3.org/2000/svg">
  <defs
     id="defs1073">
    <linearGradient
       inkscape:collect="always"
       id="linearGradient28615">
      <stop
         style="stop-color:#72cef6;stop-opacity:1"
         offset="0"
         id="stop28611" />
      <stop
         style="stop-color:#d2f5f8;stop-opacity:1"
         offset="1"
         id="stop28613" />
    </linearGradient>
    <linearGradient
       inkscape:collect="always"
       id="linearGradient17975">
      <stop
         style="stop-color:#4674a8;stop-opacity:1"
         offset="0"
         id="stop17971" />
      <stop
         style="stop-color:#42a0ce;stop-opacity:1"
         offset="1"
         id="stop17973" />
    </linearGradient>
    <linearGradient
       inkscape:collect="always"
       xlink:href="#linearGradient28615"
       id="linearGradient28617"
       x1="9"
       y1="10"
       x2="6"
       y2="10.5"
       gradientUnits="userSpaceOnUse"
       gradientTransform="matrix(0,-0.9375,-1.0166667,0,84.133336,49.78125)" />
    <linearGradient
       inkscape:collect="always"
       xlink:href="#linearGradient17975"
       id="linearGradient17977"
       x1="10"
       y1="12.5"
       x2="5"
       y2="12.5"
       gradientUnits="userSpaceOnUse"
       gradientTransform="matrix(0,-0.9375,-1.0166667,0,84.133336,49.78125)" />
  </defs>
  <sodipodi:namedview
     id="namedview1071"
     pagecolor="#ffffff"
     bordercolor="#666666"
     borderopacity="1.0"
     inkscape:pageshadow="2"
     inkscape:pageopacity="0.0"
     inkscape:pagecheckerboard="0"
     showgrid="true"
     inkscape:zoom="28.5"
     inkscape:cx="16"
     inkscape:cy="16"
     inkscape:current-layer="svg48">
    <inkscape:grid
       type="xygrid"
       id="grid1336" />
  </sodipodi:namedview>
  <g
     id="g862"
     transform="matrix(0,2,-2,0,99.999999,-136)">
    <rect
       style="fill:#ffffff;stroke:#999999;stroke-width:0.75;stroke-linecap:round;stroke-linejoin:round;stroke-miterlimit:4;stroke-dasharray:none;stroke-dashoffset:1.49998;stroke-opacity:1"
       id="rect1279"
       width="15.250001"
       height="15.250001"
       x="-83.625"
       y="-49.625"
       transform="scale(-1)" />
    <g
       id="g1112"
       transform="matrix(-1,0,0,1,152,0)">
      <path
         style="fill:none;stroke:#b3b3b3;stroke-width:0.75;stroke-linecap:butt;stroke-linejoin:miter;stroke-miterlimit:4;stroke-dasharray:none;stroke-opacity:1"
         d="m 68.75,46.625 h 14.5"
         id="path1586"
         sodipodi:nodetypes="cc" />
      <path
         style="fill:none;stroke:#b3b3b3;stroke-width:0.75;stroke-linecap:butt;stroke-linejoin:miter;stroke-miterlimit:4;stroke-dasharray:none;stroke-opacity:1"
         d="M 72.125,49.25 V 34.75"
         id="path1725-7"
         sodipodi:nodetypes="cc" />
      <path
         style="fill:none;stroke:#b3b3b3;stroke-width:0.75;stroke-linecap:butt;stroke-linejoin:miter;stroke-miterlimit:4;stroke-dasharray:none;stroke-opacity:1"
         d="M 83.25,37.375 H 68.75"
         id="path1729"
         sodipodi:nodetypes="cc" />
      <path
         style="fill:none;stroke:#b3b3b3;stroke-width:0.75;stroke-linecap:butt;stroke-linejoin:miter;stroke-miterlimit:4;stroke-dasharray:none;stroke-opacity:1"
         d="M 80.125,49.25 V 34.75"
         id="path1373"
         sodipodi:nodetypes="cc" />
      <path
         style="fill:none;stroke:#b3b3b3;stroke-width:0.75;stroke-linecap:butt;stroke-linejoin:miter;stroke-miterlimit:4;stroke-dasharray:none;stroke-opacity:1"
         d="M 76.125,49.25 V 34.75"
         id="path1375"
         sodipodi:nodetypes="cc" />
    </g>
    <g
       id="g896">
      <rect
         style="opacity:0.5;fill:none;stroke:#ffffff;stroke-width:0.75;stroke-linejoin:round;stroke-miterlimit:4;stroke-dasharray:none;stroke-dashoffset:1.49998"
         id="rect1021"
         width="15.25"
         height="5.25"
         x="68.375"
         y="-45.375"
         transform="scale(1,-1)" />
      <path
         style="fill:url(#linearGradient28617);fill-opacity:1;stroke:url(#linearGradient17977);stroke-width:0.75;stroke-linecap:round;stroke-linejoin:round;stroke-miterlimit:4;stroke-dasharray:none;stroke-opacity:1"
         d="M 83.625003,44.625 H 68.375002 v -3.75 h 15.250001 z"
         id="path17870"
         sodipodi:nodetypes="ccccc" />
    </g>
  </g>
  <g
     id="g12410"
     transform="matrix(2,0,0,2,-0.5,-4)">
    <g
       id="g12059"
       transform="translate(-19.5,11)"
       style="stroke:#ffffff;stroke-width:3;stroke-miterlimit:4;stroke-dasharray:none;stroke-opacity:0.996078">
      <path
         style="opacity:0.7;fill:none;stroke:#ffffff;stroke-width:3;stroke-linecap:round;stroke-linejoin:miter;stroke-miterlimit:4;stroke-dasharray:none;stroke-opacity:0.996078"
         d="M 27.5,-1 H 31"
         id="path11239"
         sodipodi:nodetypes="cc" />
      <path
         style="opacity:0.7;fill:none;stroke:#ffffff;stroke-width:3;stroke-linecap:round;stroke-linejoin:round;stroke-miterlimit:4;stroke-dasharray:none;stroke-opacity:0.996078"
         d="m 31.5,-4 3,3 -3,3"
         id="path11241" />
    </g>
    <g
       id="g1791"
       style="stroke:#4574c7;stroke-opacity:0.996078">
      <path
         style="fill:none;stroke:#3771c8;stroke-width:2;stroke-linecap:round;stroke-linejoin:miter;stroke-miterlimit:4;stroke-dasharray:none;stroke-opacity:0.996078"
         d="m 8,10 h 7"
         id="path1606" />
      <path
         style="fill:none;stroke:#3771c8;stroke-width:2;stroke-linecap:round;stroke-linejoin:round;stroke-miterlimit:4;stroke-dasharray:none;stroke-opacity:0.996078"
         d="m 12,7 3,3 -3,3"
         id="path1641" />
    </g>
  </g>
</svg>
