<?xml version="1.0" encoding="UTF-8" standalone="no"?>
<svg
   width="24"
   height="24"
   version="1.1"
   viewBox="0 0 24 24"
   id="svg19"
   sodipodi:docname="thtmldatasetformeditproducer.svg"
   inkscape:export-filename="thtmldatasetformeditproducer.png"
   inkscape:export-xdpi="96"
   inkscape:export-ydpi="96"
   inkscape:version="1.3.2 (091e20e, 2023-11-25, custom)"
   xmlns:inkscape="http://www.inkscape.org/namespaces/inkscape"
   xmlns:sodipodi="http://sodipodi.sourceforge.net/DTD/sodipodi-0.dtd"
   xmlns:xlink="http://www.w3.org/1999/xlink"
   xmlns="http://www.w3.org/2000/svg"
   xmlns:svg="http://www.w3.org/2000/svg">
  <defs
     id="defs19" />
  <sodipodi:namedview
     id="namedview19"
     pagecolor="#ffffff"
     bordercolor="#000000"
     borderopacity="0.25"
     inkscape:showpageshadow="2"
     inkscape:pageopacity="0.0"
     inkscape:pagecheckerboard="0"
     inkscape:deskcolor="#d1d1d1"
     showgrid="true"
     inkscape:current-layer="svg19">
    <inkscape:grid
       id="grid19"
       units="px"
       originx="0"
       originy="0"
       spacingx="0.5"
       spacingy="0.5"
       empcolor="#0099e5"
       empopacity="0.30196078"
       color="#0099e5"
       opacity="0.14901961"
       empspacing="2"
       dotted="false"
       gridanglex="30"
       gridanglez="30"
       visible="true" />
  </sodipodi:namedview>
  <linearGradient
     id="a"
     x1="-19.72396"
     x2="-10.72396"
     y1="1026.8742"
     y2="1026.8742"
     gradientUnits="userSpaceOnUse"
     xlink:href="#b" />
  <linearGradient
     id="b">
    <stop
       stop-color="#4276c4"
       offset="0"
       id="stop1" />
    <stop
       stop-color="#80b3ff"
       offset=".34375"
       id="stop2" />
    <stop
       stop-color="#04a"
       offset="1"
       id="stop3" />
  </linearGradient>
  <linearGradient
     id="c"
     x1="-19.72396"
     x2="-10.72396"
     y1="1023.8742"
     y2="1023.8742"
     gradientUnits="userSpaceOnUse"
     xlink:href="#b" />
  <linearGradient
     id="d"
     x1="-19.72396"
     x2="-10.72396"
     y1="1020.8742"
     y2="1020.8742"
     gradientUnits="userSpaceOnUse"
     xlink:href="#b" />
  <path
     d="m19.5 2.5v5.5"
     fill="none"
     stroke="#0097bd"
     stroke-linecap="round"
     id="path3" />
  <path
     d="m21.5 7-2 2-2-2"
     fill="none"
     stroke="#0097bd"
     stroke-linecap="round"
     stroke-linejoin="round"
     id="path4" />
  <g
     transform="matrix(1.25 0 0 1.25 26.90495 -1275.0926)"
     fill-rule="evenodd"
     stroke-linecap="round"
     stroke-linejoin="round"
     id="g10">
    <g
       fill="#bdd1ec"
       id="g9">
      <ellipse
         cx="-14.72396"
         cy="1032.3741"
         rx="5"
         ry="1.5"
         stroke="url(#a)"
         stroke-width="2"
         id="ellipse4" />
      <ellipse
         cx="-14.72396"
         cy="1030.4156"
         rx="5.494309"
         ry="1.958482"
         stroke="#fff"
         id="ellipse5" />
      <ellipse
         cx="-14.72396"
         cy="1029.3741"
         rx="5"
         ry="1.5"
         stroke="url(#c)"
         stroke-width="2"
         id="ellipse6" />
      <ellipse
         cx="-14.72396"
         cy="1027.4156"
         rx="5.494309"
         ry="1.958482"
         stroke="#fff"
         id="ellipse7" />
      <ellipse
         cx="-14.72396"
         cy="1026.3741"
         rx="5"
         ry="1.5"
         stroke="url(#d)"
         stroke-width="2"
         id="ellipse8" />
      <ellipse
         cx="-14.72396"
         cy="1024.4156"
         rx="5.494309"
         ry="1.958482"
         stroke="#fff"
         id="ellipse9" />
    </g>
    <ellipse
       cx="-14.72396"
       cy="1023.3741"
       rx="5.5"
       ry="2"
       fill="#80b3ff"
       stroke="url(#a)"
       id="ellipse10" />
  </g>
  <text
     x="-19"
     y="32.499981"
     id="text10"><tspan
       x="-19"
       y="47.078106"
       id="tspan10" /></text>
  <path
     d="m13.500001 10.499999h9.999998v13.000001h-9.999998z"
     fill="#fff"
     stroke="#f00"
     stroke-dashoffset="1.49998"
     stroke-linecap="square"
     stroke-linejoin="round"
     stroke-width=".999999"
     id="path10"
     style="stroke:#d3bc5f;stroke-opacity:1" />
  <g
     fill="none"
     stroke="#666"
     id="g14">
    <path
       d="m16 12.5h5"
       id="path11" />
    <path
       d="m16 18.5h5"
       id="path12" />
    <path
       d="m16 16.5h5"
       id="path13" />
    <path
       d="m16 14.5h5"
       id="path14" />
  </g>
  <path
     d="m0.50000002 16.5h19.000001v7h-19.000001z"
     fill="#fff"
     stroke="#b3b3b3"
     stroke-dashoffset="1.49998"
     stroke-linecap="square"
     stroke-linejoin="round"
     stroke-width=".999995"
     id="path15" />
  <g
     transform="matrix(.96974715 0 0 1.0311966 0 -10.000002)"
     id="g19">
    <path
       d="m4.2609045 27.152923h.8950787v3.878978h-.8950787zm-2.1985112 0h.8950787v3.878978h-.8950787zm.3671834 1.118957h2.4488505l-.0004734.898117h-2.4488505z"
       id="path16" />
    <path
       d="m7.2740976 27.470401h.9197543v3.561509h-.9197543zm-1.0869178-.317467h3.0935899v.704298h-3.0935899z"
       stroke-width=".999995"
       id="path17" />
    <path
       d="m14.009244 27.152933h1.458716v3.878977h-1.006152v-3.011944l.04043.17074-1.123332 2.093688h-.977863l-1.123333-2.040333.04043-.224095v3.011944h-1.006162v-3.878977h1.458716l1.119292 2.299107z"
       id="path18" />
    <path
       d="m16.499146 27.152934h.919754v3.878978h-.919754zm.409525 3.174679h2.168466v.704299h-2.168466z"
       stroke-width=".999995"
       id="path19" />
  </g>
</svg>
