<?xml version="1.0" encoding="UTF-8" standalone="no"?>
<svg
   height="16"
   viewBox="0 0 4.2333332 4.2333335"
   width="16"
   version="1.1"
   id="svg2"
   sodipodi:docname="Arrow_44_16.svg"
   inkscape:version="1.2.1 (9c6d41e410, 2022-07-14)"
   xml:space="preserve"
   inkscape:export-filename="Arrow_44_16.png"
   inkscape:export-xdpi="96"
   inkscape:export-ydpi="96"
   xmlns:inkscape="http://www.inkscape.org/namespaces/inkscape"
   xmlns:sodipodi="http://sodipodi.sourceforge.net/DTD/sodipodi-0.dtd"
   xmlns="http://www.w3.org/2000/svg"
   xmlns:svg="http://www.w3.org/2000/svg"><g
     id="g2544"><path
       style="fill:none;stroke:#00aad4;stroke-width:0.264583;stroke-linecap:round;stroke-linejoin:round;stroke-miterlimit:5.6;stroke-dasharray:none;stroke-opacity:1"
       id="circle1633"
       sodipodi:type="arc"
       sodipodi:cx="1.0583335"
       sodipodi:cy="2.6458333"
       sodipodi:rx="0.66145855"
       sodipodi:ry="0.66145855"
       sodipodi:start="1.5707963"
       sodipodi:end="4.712389"
       sodipodi:arc-type="arc"
       d="m 1.0583335,3.3072918 a 0.66145855,0.66145855 0 0 1 -0.57283989,-0.3307293 0.66145855,0.66145855 0 0 1 0,-0.6614585 0.66145855,0.66145855 0 0 1 0.57283989,-0.3307293"
       sodipodi:open="true" /><path
       style="fill:none;stroke:#00aad4;stroke-width:0.264583;stroke-linecap:round;stroke-linejoin:round;stroke-miterlimit:5.6;stroke-dasharray:none;stroke-opacity:1"
       id="path1741"
       sodipodi:type="arc"
       sodipodi:cx="-3.1749997"
       sodipodi:cy="1.3229166"
       sodipodi:rx="0.66145855"
       sodipodi:ry="0.66145855"
       sodipodi:start="1.5707963"
       sodipodi:end="4.712389"
       sodipodi:arc-type="arc"
       d="m -3.1749997,1.9843752 a 0.66145855,0.66145855 0 0 1 -0.5728399,-0.3307293 0.66145855,0.66145855 0 0 1 0,-0.66145855 0.66145855,0.66145855 0 0 1 0.5728399,-0.33072927"
       sodipodi:open="true"
       transform="scale(-1,1)" /><path
       style="fill:none;stroke:#00aad4;stroke-width:0.264583;stroke-linecap:round;stroke-linejoin:round;stroke-dasharray:none;stroke-opacity:1"
       d="M 0.5291665,0.66145832 H 3.1749998"
       id="path1790"
       sodipodi:nodetypes="cc" /><path
       style="fill:none;stroke:#00aad4;stroke-width:0.264583;stroke-linecap:round;stroke-linejoin:round;stroke-dasharray:none;stroke-opacity:1"
       d="M 1.0583333,3.3072916 H 3.7041667"
       id="path1792"
       sodipodi:nodetypes="cc" /><path
       style="fill:none;stroke:#00aad4;stroke-width:0.264583;stroke-linecap:round;stroke-linejoin:round;stroke-dasharray:none;stroke-opacity:1"
       d="M 3.175,2.778125 3.7041667,3.3072916 3.175,3.8364583"
       id="path1794"
       sodipodi:nodetypes="ccc" /><path
       style="fill:none;stroke:#00aad4;stroke-width:0.264583;stroke-linecap:round;stroke-linejoin:round;stroke-dasharray:none;stroke-opacity:1"
       d="M 1.0583333,1.984375 H 3.175"
       id="path1796"
       sodipodi:nodetypes="cc" /></g><defs
     id="defs6" /><sodipodi:namedview
     id="namedview4"
     pagecolor="#ffffff"
     bordercolor="#666666"
     borderopacity="1.0"
     inkscape:showpageshadow="2"
     inkscape:pageopacity="0.0"
     inkscape:pagecheckerboard="0"
     inkscape:deskcolor="#d1d1d1"
     showgrid="true"
     inkscape:zoom="57.375"
     inkscape:cx="8"
     inkscape:cy="8"
     inkscape:current-layer="svg2"><inkscape:grid
       type="xygrid"
       id="grid1292" /></sodipodi:namedview></svg>
