<?xml version="1.0" encoding="UTF-8" standalone="no"?>
<svg
   width="24"
   height="24"
   version="1.1"
   viewBox="0 0 24 24"
   id="svg12"
   sodipodi:docname="tsynjscriptsyn.svg"
   inkscape:version="1.3.2 (091e20e, 2023-11-25, custom)"
   xmlns:inkscape="http://www.inkscape.org/namespaces/inkscape"
   xmlns:sodipodi="http://sodipodi.sourceforge.net/DTD/sodipodi-0.dtd"
   xmlns="http://www.w3.org/2000/svg"
   xmlns:svg="http://www.w3.org/2000/svg">
  <defs
     id="defs12" />
  <sodipodi:namedview
     id="namedview12"
     pagecolor="#ffffff"
     bordercolor="#000000"
     borderopacity="0.25"
     inkscape:showpageshadow="2"
     inkscape:pageopacity="0.0"
     inkscape:pagecheckerboard="0"
     inkscape:deskcolor="#d1d1d1"
     showgrid="true"
     inkscape:current-layer="svg12">
    <inkscape:grid
       id="grid12"
       units="px"
       originx="0"
       originy="0"
       spacingx="0.5"
       spacingy="0.5"
       empcolor="#0099e5"
       empopacity="0.30196078"
       color="#0099e5"
       opacity="0.14901961"
       empspacing="2"
       dotted="false"
       gridanglex="30"
       gridanglez="30"
       visible="true" />
  </sodipodi:namedview>
  <rect
     x="1.25"
     y="1.2499826"
     width="20.5"
     height="21.5"
     fill="#ffffff"
     fill-rule="evenodd"
     stroke="#2a7efe"
     stroke-linecap="square"
     stroke-linejoin="round"
     stroke-width=".5"
     style="paint-order:normal"
     id="rect1" />
  <rect
     x="1.5"
     y="1.4999826"
     width="3.5"
     height="21.000017"
     fill="#b3b3b3"
     fill-rule="evenodd"
     style="paint-order:normal"
     id="rect2" />
  <path
     d="m7 4.5h11"
     fill="none"
     stroke="#666666"
     stroke-width="1px"
     id="path2" />
  <path
     d="m9 6.5h4"
     fill="none"
     stroke="#666666"
     stroke-width="1px"
     id="path3" />
  <path
     d="m11 8.5h6"
     fill="none"
     stroke="#666666"
     stroke-width="1px"
     id="path4" />
  <path
     d="M 8.9999998,10.5 H 11"
     fill="none"
     stroke="#666666"
     stroke-width="1px"
     id="path5" />
  <path
     d="M 7.0000004,12.5 H 11"
     fill="none"
     stroke="#666666"
     stroke-width="1px"
     id="path6" />
  <path
     d="m14 6.5h3"
     fill="none"
     stroke="#ff0000"
     stroke-width="1px"
     id="path7" />
  <path
     d="m12 12.4999h6"
     fill="none"
     stroke="#ff0000"
     stroke-width="1px"
     id="path8" />
  <path
     d="m11 10.5h3"
     fill="none"
     stroke="#2a7fff"
     stroke-width="1px"
     id="path9" />
  <path
     d="m14 10.5h2"
     fill="none"
     stroke="#666666"
     stroke-width="1px"
     id="path10" />
  <path
     d="m10.552866 15.4v3.484346c0 2.083688-1.881178 1.873466-2.352866 1.400055"
     fill="none"
     stroke="#2c5aa0"
     stroke-linecap="round"
     stroke-linejoin="round"
     stroke-width=".8"
     id="path11" />
  <path
     d="m15.401029 15.739352c-0.3319-0.228746-0.82473-0.339352-1.4135-0.339352-0.83202 0-1.58914 0.43745-1.58914 1.34691 0 0.71244 0.60109 1.00539 1.58914 1.176802 1.3758 0.238681 1.58913 0.702607 1.58913 1.329077 0 1.131993-0.94221 1.34691-1.58913 1.34691-0.50221 0-1.01769-0.06111-1.66425-0.395929"
     fill="none"
     stroke="#2c5aa0"
     stroke-linecap="round"
     stroke-linejoin="round"
     stroke-width=".8"
     id="path12" />
</svg>
