<?xml version="1.0" encoding="UTF-8" standalone="no"?>
<svg
   height="48"
   width="48"
   version="1.1"
   id="svg582"
   sodipodi:docname="Flag_02_48.svg"
   inkscape:export-filename="Flag_02_48.png"
   inkscape:export-xdpi="96"
   inkscape:export-ydpi="96"
   inkscape:version="1.2.1 (9c6d41e410, 2022-07-14)"
   xmlns:inkscape="http://www.inkscape.org/namespaces/inkscape"
   xmlns:sodipodi="http://sodipodi.sourceforge.net/DTD/sodipodi-0.dtd"
   xmlns="http://www.w3.org/2000/svg"
   xmlns:svg="http://www.w3.org/2000/svg">
  <defs
     id="defs586" />
  <sodipodi:namedview
     id="namedview584"
     pagecolor="#ffffff"
     bordercolor="#666666"
     borderopacity="1.0"
     inkscape:pageshadow="2"
     inkscape:pageopacity="0.0"
     inkscape:pagecheckerboard="0"
     inkscape:deskcolor="#d1d1d1"
     showgrid="true"
     inkscape:zoom="19.125"
     inkscape:cx="22.117647"
     inkscape:cy="24"
     inkscape:current-layer="svg582"
     inkscape:showpageshadow="2">
    <inkscape:grid
       type="xygrid"
       id="grid1211" />
  </sodipodi:namedview>
  <path
     d="M 47.587203,13.137777 C 45.884022,10.100189 43.373456,8.2845471 39.532586,7.8279345 36.782299,7.5009726 30.793272,8.429011 27.490536,7.5362131 23.887641,6.5622766 22.265526,4.8729003 21.11767,2.4502827 L 12.805361,24.144979 c 1.147856,2.422618 2.769971,4.111994 6.372866,5.08593 3.302736,0.892799 9.291762,-0.03524 12.042049,0.291722 3.840873,0.456612 6.351436,2.272257 8.05462,5.309845 z"
     fill="#ffffff"
     fill-rule="evenodd"
     stroke="#808080"
     stroke-width="0.749994"
     id="path308"
     style="stroke:#00aad4;stroke-opacity:1;fill:none" />
  <path
     id="path310"
     style="fill-rule:evenodd;stroke-width:2.99998;stroke:none;fill:#00aad4;fill-opacity:1"
     d="M 25.550781 7.0273438 C 25.528175 7.0568504 23.575525 12.16461 23.578125 12.1875 C 23.579735 12.201737 23.854016 12.314761 24.1875 12.4375 C 25.435872 12.896968 26.488649 13.108189 27.962891 13.193359 C 28.364088 13.216529 28.749833 13.228756 28.820312 13.222656 C 28.938199 13.212471 29.027066 13.007486 29.931641 10.650391 C 30.472492 9.2410732 30.910597 8.0811087 30.904297 8.0742188 C 30.897882 8.0673348 30.601063 8.048458 30.246094 8.03125 C 28.565244 7.9497767 27.430524 7.7281383 26.087891 7.2167969 C 25.797134 7.1060627 25.555781 7.0208738 25.550781 7.0273438 z M 38.033203 7.8867188 C 37.90635 7.8889145 37.786022 7.8936404 37.675781 7.9023438 L 37.328125 7.9296875 L 36.353516 10.476562 C 35.816705 11.877613 35.383878 13.030209 35.392578 13.037109 C 35.401176 13.043969 35.768932 13.056253 36.208984 13.064453 C 37.619042 13.090603 38.906409 13.309394 40.039062 13.716797 C 40.391075 13.843416 40.702249 13.946312 40.730469 13.945312 C 40.778448 13.943625 42.737672 8.9058509 42.726562 8.8125 C 42.71874 8.7462183 41.696448 8.3869089 41.085938 8.2363281 C 40.1666 8.0095758 38.921175 7.8713486 38.033203 7.8867188 z M 19.044922 8.25 C 19.031456 8.2666758 18.586598 9.4074942 18.056641 10.785156 L 17.09375 13.289062 L 17.224609 13.560547 C 17.468508 14.063922 18.044195 14.940846 18.435547 15.40625 C 19.068863 16.159399 20.080997 16.944702 20.980469 17.380859 C 21.179791 17.477509 21.259127 17.493529 21.279297 17.443359 C 21.390653 17.166595 23.233722 12.343371 23.232422 12.332031 C 23.231525 12.324094 23.101542 12.253511 22.943359 12.175781 C 22.46971 11.943038 21.620327 11.389615 21.248047 11.070312 C 20.515384 10.441912 19.860165 9.6356358 19.375 8.765625 C 19.20733 8.464955 19.058372 8.233333 19.044922 8.25 z M 34.972656 13.322266 C 34.965962 13.316926 34.171513 13.343699 33.208984 13.380859 C 32.246454 13.418019 31.05193 13.454291 30.554688 13.462891 C 30.057448 13.471531 29.527835 13.491029 29.376953 13.505859 L 29.103516 13.533203 L 28.126953 16.076172 C 27.589806 17.474835 27.161221 18.629015 27.175781 18.640625 C 27.222556 18.677956 29.043228 18.638707 30.951172 18.560547 C 31.971354 18.518767 32.841686 18.488888 32.884766 18.492188 C 32.927838 18.495527 32.978237 18.479924 32.998047 18.458984 C 33.03906 18.415556 34.991266 13.337126 34.972656 13.322266 z M 40.921875 14.300781 L 39.943359 16.847656 C 39.405576 18.249229 38.963737 19.425014 38.960938 19.458984 C 38.958134 19.492958 39.183713 19.638976 39.462891 19.783203 C 40.84971 20.499629 42.247057 21.82804 43.148438 23.285156 C 43.276199 23.491674 43.39214 23.65845 43.40625 23.65625 C 43.420227 23.653972 43.869641 22.504053 44.404297 21.101562 L 45.376953 18.550781 L 45 17.960938 C 44.046182 16.469113 42.82117 15.31301 41.390625 14.550781 L 40.921875 14.300781 z M 21.394531 17.873047 C 21.371385 17.903161 19.419175 23.011656 19.421875 23.035156 C 19.423486 23.049392 19.697766 23.162417 20.03125 23.285156 C 21.279621 23.744624 22.3324 23.953893 23.806641 24.039062 C 24.207838 24.062232 24.593583 24.076412 24.664062 24.070312 C 24.781948 24.060128 24.870815 23.855143 25.775391 21.498047 C 26.316242 20.088729 26.751587 18.927269 26.742188 18.917969 C 26.732777 18.908699 26.390005 18.883651 25.980469 18.863281 C 24.445277 18.786972 23.340625 18.570685 22.027344 18.087891 C 21.685501 17.962215 21.399931 17.865947 21.394531 17.873047 z M 33.792969 18.726562 C 33.531998 18.725707 33.331665 18.732668 33.275391 18.748047 C 33.190776 18.771174 32.97052 19.297688 32.195312 21.324219 C 31.659409 22.725166 31.227628 23.877866 31.236328 23.884766 C 31.244926 23.891626 31.612682 23.903909 32.052734 23.912109 C 33.462792 23.938259 34.750156 24.157051 35.882812 24.564453 C 36.234826 24.691072 36.545999 24.793969 36.574219 24.792969 C 36.62052 24.791342 38.577966 19.761157 38.572266 19.658203 C 38.570997 19.634707 38.293182 19.513236 37.953125 19.388672 C 37.250633 19.131348 35.994427 18.854436 35.220703 18.785156 C 34.831802 18.750344 34.22792 18.727988 33.792969 18.726562 z M 14.888672 19.095703 C 14.875205 19.112379 14.432208 20.253207 13.902344 21.630859 L 12.9375 24.136719 L 13.064453 24.380859 C 13.510572 25.242195 13.954941 25.902682 14.482422 26.490234 C 14.905168 26.961122 15.937131 27.752393 16.546875 28.072266 C 16.932832 28.274726 17.103687 28.339106 17.123047 28.291016 C 17.234435 28.014164 19.077472 23.191027 19.076172 23.179688 C 19.075274 23.171752 18.945291 23.101167 18.787109 23.023438 C 18.31346 22.790695 17.464077 22.235317 17.091797 21.916016 C 16.359134 21.287615 15.703915 20.483292 15.21875 19.613281 C 15.051081 19.312612 14.902122 19.079033 14.888672 19.095703 z M 30.816406 24.169922 C 30.809754 24.164612 30.015265 24.189403 29.052734 24.226562 C 28.090204 24.263722 26.89568 24.301947 26.398438 24.310547 C 25.901196 24.319187 25.371585 24.338686 25.220703 24.353516 L 24.947266 24.380859 L 23.970703 26.923828 C 23.433555 28.322491 23.000866 29.471416 23.009766 29.478516 C 23.049175 29.509956 23.95579 29.504894 25.169922 29.464844 C 25.893199 29.440984 26.867834 29.409091 27.335938 29.394531 C 27.804041 29.379971 28.341114 29.353537 28.527344 29.335938 L 28.865234 29.304688 L 29.845703 26.742188 C 30.385405 25.33282 30.823006 24.175222 30.816406 24.169922 z M 36.765625 25.148438 L 35.787109 27.695312 C 35.249323 29.096884 34.806934 30.273154 34.802734 30.308594 C 34.798651 30.344063 34.89083 30.414574 35.009766 30.464844 C 35.39063 30.625831 36.247303 31.172834 36.746094 31.574219 C 37.578446 32.244021 38.538996 33.340051 39.039062 34.189453 C 39.141338 34.363178 39.23589 34.503553 39.25 34.501953 C 39.264055 34.500349 39.713391 33.351711 40.248047 31.949219 L 41.220703 29.398438 L 40.84375 28.808594 C 39.889932 27.316768 38.664917 26.160667 37.234375 25.398438 L 36.765625 25.148438 z " />
  <path
     d="M 18.912715,2.2524086 2.2475624,45.747592"
     fill="none"
     stroke="#c87137"
     stroke-linecap="round"
     stroke-width="4.49997"
     id="path332"
     style="stroke:#00aad4;stroke-opacity:1;fill:none" />
</svg>
