<svg width="24" height="24" version="1.1" xmlns="http://www.w3.org/2000/svg">
 <defs>
  <linearGradient id="a" x1="17.658785" x2="11.341217" y1="17.658785" y2="11.341217" gradientTransform="matrix(1.1691787 0 0 1.1691786 .54690687 .54690832)" gradientUnits="userSpaceOnUse">
   <stop stop-color="#009600" offset="0"/>
   <stop stop-color="#6edb39" offset="1"/>
  </linearGradient>
 </defs>
 <g stroke="#ffffff" stroke-linecap="round">
  <ellipse transform="matrix(0,1,1,0,0,0)" cx="17.5" cy="17.5" rx="5.9090919" ry="5.9090915" fill="url(#a)" stroke-dashoffset="1.49998" stroke-linejoin="round" stroke-width="1.18182"/>
  <path d="m15.943242 19.317867 3.374676 7e-5 7e-5 -3.374816" fill="none" stroke-linejoin="round" stroke-width="1.3636"/>
  <path d="m18.908365 18.908364-3.818182-3.818182" fill="none" stroke-width="1.63636"/>
 </g>
</svg>
