<svg width="64" height="64" version="1.1" xmlns="http://www.w3.org/2000/svg">
 <g>
  <circle cx="48" cy="50" r="7" fill="#ffffff"/>
  <path d="M 55.999959,55.99996 C 54.072958,58.534401 51.045381,60 47.999878,60 42.488976,60 37.999777,55.589403 37.999777,49.999899 c 0,-5.654977 4.513115,-10.000101 10.000101,-10.000101 H 60 M 51.999134,32.000121 60,39.999798 49.999899,49.999899" fill="none" stroke="#ffffff" stroke-linecap="round" stroke-linejoin="round" stroke-miterlimit="5.6" stroke-width="8"/>
  <path d="M 55.999959,55.99996 C 54.072958,58.534401 51.045381,60 47.999878,60 42.488976,60 37.999777,55.589403 37.999777,49.999899 c 0,-5.654977 4.513115,-10.000101 10.000101,-10.000101 H 60 M 51.999134,32.000121 60,39.999798 51.999919,47.999879" fill="none" stroke="#fa0302" stroke-linecap="round" stroke-linejoin="round" stroke-miterlimit="5.6" stroke-width="4.00004"/>
 </g>
</svg>
