<?xml version="1.0" encoding="UTF-8" standalone="no"?>
<svg
   height="48"
   viewBox="0 0 12.7 12.700001"
   width="48"
   version="1.1"
   id="svg746"
   sodipodi:docname="Font_02_48.svg"
   inkscape:version="1.2 (dc2aedaf03, 2022-05-15)"
   inkscape:export-filename="Font_02_48.png"
   inkscape:export-xdpi="96"
   inkscape:export-ydpi="96"
   xmlns:inkscape="http://www.inkscape.org/namespaces/inkscape"
   xmlns:sodipodi="http://sodipodi.sourceforge.net/DTD/sodipodi-0.dtd"
   xmlns="http://www.w3.org/2000/svg"
   xmlns:svg="http://www.w3.org/2000/svg">
  <defs
     id="defs750" />
  <sodipodi:namedview
     id="namedview748"
     pagecolor="#ffffff"
     bordercolor="#666666"
     borderopacity="1.0"
     inkscape:showpageshadow="2"
     inkscape:pageopacity="0.0"
     inkscape:pagecheckerboard="0"
     inkscape:deskcolor="#d1d1d1"
     showgrid="true"
     inkscape:zoom="19.125"
     inkscape:cx="24"
     inkscape:cy="24"
     inkscape:current-layer="svg746">
    <inkscape:grid
       type="xygrid"
       id="grid1256" />
  </sodipodi:namedview>
  <g
     id="g738"
     transform="matrix(2.9999252,0,0,2.9999252,0.13230157,-0.00101269)">
    <path
       id="path2"
       style="fill:#00aad4;stroke:none;stroke-width:0.997515"
       d="M 1.5167033,0.1984375 0.13229167,4.0348958 H 0.48627523 L 0.87126465,2.9729452 c 0.0121907,-0.034767 0.0450954,-0.058152 0.0821655,-0.058394 H 1.7187581 C 1.8472428,2.7618778 2.0534364,2.653289 2.2096843,2.5884725 H 1.1332642 C 1.0728222,2.5882364 1.0307696,2.528728 1.0510986,2.4722005 L 1.6376261,0.83354086 c 0.012191,-0.0347673 0.045096,-0.0581525 0.082166,-0.0583944 0.03707,2.4235e-4 0.069975,0.0236274 0.082165,0.0583944 L 2.1404378,1.7699178 2.4660017,1.7037718 1.9228801,0.1984375 Z"
       sodipodi:nodetypes="cccccccccccccccc" />
    <path
       id="path2019"
       style="fill:#00aad4;fill-opacity:1;stroke-width:0.204322"
       d="m 2.8555766,1.8520833 c -0.098146,0 -0.2105851,0.010624 -0.3359375,0.03125 -0.1265455,0.018429 -0.2566711,0.051325 -0.3710906,0.078125 -0.045427,0.012779 -0.082744,0.026568 -0.109375,0.037109 -0.020106,0.011249 -0.064253,0.031453 -0.080076,0.054685 -0.00724,0.013754 -0.013672,0.034989 -0.013672,0.064453 0,0.051448 0.013822,0.08737 0.039062,0.1152344 0.025825,0.035068 0.073511,0.038032 0.101559,0.042966 0.036296,0.00638 0.097293,-0.00899 0.1816406,-0.029297 0.2426716,-0.060252 0.4426182,-0.091797 0.6054687,-0.091797 0.1905255,0 0.325166,0.010943 0.4257813,0.089844 0.050543,0.039636 0.142575,0.1394382 0.142575,0.267575 v 0.1191495 c -0.00568,0.065551 -0.029415,0.1109661 -0.1171855,0.099609 -0.1961375,-0.032154 -0.3683151,-0.046875 -0.5136719,-0.046875 -0.3644034,0 -0.6358838,0.084747 -0.8300781,0.2480468 -0.1824158,0.1468282 -0.2830201,0.3366071 -0.2871094,0.5117188 -0.00327,0.1401475 0.053052,0.2859552 0.2063477,0.4169271 0.1483873,0.1251515 0.3536006,0.1748698 0.6061523,0.1748698 0.1040195,0 0.2237517,-0.014066 0.3535156,-0.041016 0.1319893,-0.02453 0.3114802,-0.10062 0.4335938,-0.1503903 0.1503491,-0.072259 0.1518078,0.031851 0.15431,0.107423 h 0.4843669 c 0.05486,0 0.095188,-0.00207 0.1259196,-0.010457 0.030729,-0.00838 0.049208,-0.019546 0.063534,-0.032512 0.029497,-0.026697 0.046875,-0.06134 0.046875,-0.1074219 0,-0.023995 -0.00206,-0.044123 -0.00977,-0.0625 -0.00771,-0.018378 -0.020909,-0.032255 -0.035157,-0.044923 -0.014324,-0.012735 -0.044145,-0.02403 -0.064453,-0.03125 -0.02966,-0.010545 -0.072493,-0.013672 -0.1269531,-0.013672 H 3.843858 C 3.779075,3.6481532 3.747974,3.6031575 3.744247,3.5473765 V 2.5083325 C 3.744247,2.2997711 3.672033,2.1520564 3.5215907,2.0356763 3.3726389,1.9179355 3.1543212,1.8520833 2.8555766,1.8520833 Z m 0.5859375,1.2968814 v 0.2167905 c 7.616e-4,0.028566 -0.021746,0.065448 -0.044926,0.08203 -0.127216,0.091005 -0.2748675,0.1588105 -0.4375,0.2089844 -0.1597614,0.049784 -0.3069583,0.076172 -0.4414062,0.076172 -0.1556968,0 -0.2875387,-0.029129 -0.3925782,-0.097656 -0.072756,-0.047466 -0.1079054,-0.1347299 -0.111335,-0.2011687 -0.00584,-0.1130503 0.073834,-0.208426 0.1816407,-0.2773438 0.1934025,-0.1236369 0.405513,-0.1561888 0.5859484,-0.167971 0.1781368,-0.011632 0.3711659,0.020164 0.578125,0.060547 0.043991,0.011517 0.078459,0.04884 0.082031,0.099616 z"
       sodipodi:nodetypes="sccccscscsssccscscscccssssssssccscsccscssssscc" />
  </g>
</svg>
