<?xml version="1.0" encoding="UTF-8" standalone="no"?>
<svg
   width="24"
   height="24"
   version="1.1"
   viewBox="0 0 6.35 6.35"
   id="svg179"
   sodipodi:docname="menu_edit_select_all_150.svg"
   inkscape:export-filename="menu_edit_select_all_150.png"
   inkscape:export-xdpi="96"
   inkscape:export-ydpi="96"
   inkscape:version="1.2.1 (9c6d41e410, 2022-07-14)"
   xmlns:inkscape="http://www.inkscape.org/namespaces/inkscape"
   xmlns:sodipodi="http://sodipodi.sourceforge.net/DTD/sodipodi-0.dtd"
   xmlns="http://www.w3.org/2000/svg"
   xmlns:svg="http://www.w3.org/2000/svg">
  <defs
     id="defs183" />
  <sodipodi:namedview
     id="namedview181"
     pagecolor="#ffffff"
     bordercolor="#666666"
     borderopacity="1.0"
     inkscape:showpageshadow="2"
     inkscape:pageopacity="0.0"
     inkscape:pagecheckerboard="0"
     inkscape:deskcolor="#d1d1d1"
     showgrid="true"
     inkscape:zoom="38.25"
     inkscape:cx="11.986928"
     inkscape:cy="12"
     inkscape:current-layer="svg179">
    <inkscape:grid
       type="xygrid"
       id="grid568" />
  </sodipodi:namedview>
  <path
     d="M 1.0583333,0.19843499 H 5.5562498"
     id="path159"
     style="fill:none;stroke:#2a7fff;stroke-width:0.39687;stroke-opacity:1"
     sodipodi:nodetypes="cc" />
  <path
     d="M 1.0583333,4.167135 H 5.5562498"
     id="path161"
     style="fill:none;stroke:#2a7fff;stroke-width:0.39687;stroke-opacity:1"
     sodipodi:nodetypes="cc" />
  <path
     d="M 1.0583333,0.992135 H 5.5562498"
     id="path163"
     style="fill:none;stroke:#2a7fff;stroke-width:0.39687;stroke-opacity:1"
     sodipodi:nodetypes="cc" />
  <path
     d="M 1.0583333,3.373435 H 5.5562498"
     id="path165"
     style="fill:none;stroke:#2a7fff;stroke-width:0.39687;stroke-opacity:1"
     sodipodi:nodetypes="cc" />
  <path
     d="M 1.0583333,2.579635 H 5.5562498"
     id="path167"
     style="fill:none;stroke:#2a7fff;stroke-width:0.39687;stroke-opacity:1"
     sodipodi:nodetypes="cc" />
  <path
     d="M 1.0583333,1.785935 H 5.5562498"
     id="path169"
     style="fill:none;stroke:#2a7fff;stroke-width:0.39687;stroke-opacity:1"
     sodipodi:nodetypes="cc" />
  <path
     d="M 1.0583333,4.960935 H 5.5562498"
     id="path171"
     style="fill:none;stroke:#2a7fff;stroke-width:0.39687;stroke-opacity:1"
     sodipodi:nodetypes="cc" />
  <path
     d="M 1.0583333,5.754685 H 5.5562498"
     id="path564"
     style="fill:none;stroke:#2a7fff;stroke-width:0.39687;stroke-opacity:1"
     sodipodi:nodetypes="cc" />
</svg>
