<svg width="24" height="24" version="1.1" xmlns="http://www.w3.org/2000/svg">
 <rect x="1.7763568e-15" y=".5" width="22.5" height="22.5" ry="3.2727275" fill="#dbe9ff" stroke-linejoin="round" stroke-width="1.5"/>
 <path d="m6 4.25h13.5" fill="none" stroke="#808080" stroke-linejoin="round" stroke-width="1.5"/>
 <path d="m3 4.25h1.5" fill="none" stroke="#dc0000" stroke-linejoin="round" stroke-width="1.5"/>
 <path d="m6 7.2499998h13.5" fill="none" stroke="#808080" stroke-linejoin="round" stroke-width="1.5"/>
 <path d="m3 7.2499998h1.5" fill="none" stroke="#dc0000" stroke-linejoin="round" stroke-width="1.5"/>
 <path d="m6 10.25h13.5" fill="none" stroke="#808080" stroke-linejoin="round" stroke-width="1.5"/>
 <path d="m3 10.25h1.5" fill="none" stroke="#dc0000" stroke-linejoin="round" stroke-width="1.5"/>
 <path d="m6 13.25h13.5" fill="none" stroke="#808080" stroke-linejoin="round" stroke-width="1.5"/>
 <path d="m3 13.25h1.5" fill="none" stroke="#dc0000" stroke-linejoin="round" stroke-width="1.5"/>
 <path d="m6 16.25h13.5" fill="none" stroke="#808080" stroke-linejoin="round" stroke-width="1.5"/>
 <path d="m3 16.25h1.5" fill="none" stroke="#dc0000" stroke-linejoin="round" stroke-width="1.5"/>
 <path d="m6 19.25h13.5" fill="none" stroke="#808080" stroke-linejoin="round" stroke-width="1.5"/>
 <path d="m3 19.25h1.5" fill="none" stroke="#dc0000" stroke-linejoin="round" stroke-width="1.5"/>
 <path d="m11.109375 20.390625 9.28125-9.28125m0 9.28125-9.28125-9.28125" fill="none" stroke="#ffffff" stroke-linecap="round" stroke-width="7.21875"/>
 <path d="m11.109375 20.390625 9.28125-9.28125m0 9.28125-9.28125-9.28125" fill="none" stroke="#dc0000" stroke-linecap="round" stroke-width="3.09375"/>
</svg>
