<?xml version="1.0" encoding="UTF-8" standalone="no"?>
<svg
   width="16"
   height="16"
   version="1.1"
   viewBox="0 0 16 16"
   id="svg6"
   sodipodi:docname="Temperature_01_16.svg"
   inkscape:export-filename="Temperature_01_16.png"
   inkscape:export-xdpi="96"
   inkscape:export-ydpi="96"
   inkscape:version="1.3.2 (091e20e, 2023-11-25, custom)"
   xmlns:inkscape="http://www.inkscape.org/namespaces/inkscape"
   xmlns:sodipodi="http://sodipodi.sourceforge.net/DTD/sodipodi-0.dtd"
   xmlns="http://www.w3.org/2000/svg"
   xmlns:svg="http://www.w3.org/2000/svg">
  <defs
     id="defs6" />
  <sodipodi:namedview
     id="namedview6"
     pagecolor="#ffffff"
     bordercolor="#000000"
     borderopacity="0.25"
     inkscape:showpageshadow="2"
     inkscape:pageopacity="0.0"
     inkscape:pagecheckerboard="0"
     inkscape:deskcolor="#d1d1d1"
     showgrid="true"
     inkscape:current-layer="svg6">
    <inkscape:grid
       id="grid6"
       units="px"
       originx="0"
       originy="0"
       spacingx="0.5"
       spacingy="0.5"
       empcolor="#0099e5"
       empopacity="0.30196078"
       color="#0099e5"
       opacity="0.14901961"
       empspacing="2"
       dotted="false"
       gridanglex="30"
       gridanglez="30"
       visible="true" />
  </sodipodi:namedview>
  <path
     d="m10.5 12c0 1.656854-1.343146 3-3 3s-3-1.343146-3-3c5e-3 -1.066759 0.576143-2.0506109 1.5-2.5839842v-6.9160158c0-1.961388 3-1.961388 3 0v6.9023438c0.928073 0.5358234 1.49985 1.5260092 1.5 2.5976562z"
     fill="#ebfcff"
     stroke="#00aad4"
     stroke-linecap="round"
     stroke-linejoin="round"
     stroke-width=".5"
     id="path1" />
  <circle
     cx="7.5000005"
     cy="12"
     r="1.5"
     fill="#ff7f00"
     id="circle1" />
  <path
     d="m10.5 4.5h1.5"
     fill="none"
     stroke="#ff7f00"
     stroke-linecap="round"
     stroke-linejoin="round"
     stroke-width=".5"
     id="path2" />
  <path
     d="m10.5 2.5h1.5"
     fill="none"
     stroke="#ff7f00"
     stroke-linecap="round"
     stroke-linejoin="round"
     stroke-width=".5"
     id="path3" />
  <path
     d="m10.5 8.5h1.5"
     fill="none"
     stroke="#ff7f00"
     stroke-linecap="round"
     stroke-linejoin="round"
     stroke-width=".5"
     id="path4" />
  <path
     d="m10.5 6.5h1.5"
     fill="none"
     stroke="#ff7f00"
     stroke-linecap="round"
     stroke-linejoin="round"
     stroke-width=".5"
     id="path5" />
  <path
     d="m7.5 2.5v9.5"
     fill="none"
     stroke="#ff7f00"
     stroke-linecap="round"
     stroke-linejoin="round"
     stroke-width=".5"
     id="path6" />
</svg>
