<?xml version="1.0" encoding="UTF-8" standalone="no"?>
<svg
   width="36"
   height="36"
   version="1.1"
   viewBox="0 0 36 36"
   id="svg1922"
   sodipodi:docname="ttimer_150.svg"
   inkscape:export-filename="ttimer_150.png"
   inkscape:export-xdpi="96"
   inkscape:export-ydpi="96"
   inkscape:version="1.2.1 (9c6d41e410, 2022-07-14)"
   xmlns:inkscape="http://www.inkscape.org/namespaces/inkscape"
   xmlns:sodipodi="http://sodipodi.sourceforge.net/DTD/sodipodi-0.dtd"
   xmlns="http://www.w3.org/2000/svg"
   xmlns:svg="http://www.w3.org/2000/svg">
  <defs
     id="defs1926">
    <radialGradient
       id="radialGradient892"
       cx="8.8010998"
       cy="1037"
       r="9"
       gradientTransform="matrix(0.33332,1.5,-1.5,0.33333,1530.8,-382.6)"
       gradientUnits="userSpaceOnUse">
      <stop
         stop-color="#ccc"
         offset="0"
         id="stop195" />
      <stop
         stop-color="#fff"
         offset="1"
         id="stop197" />
    </radialGradient>
    <linearGradient
       id="linearGradient851"
       x1="9"
       x2="14"
       y1="1030.4"
       y2="1030.4"
       gradientTransform="matrix(1.5,0,0,1.5,0.75,-1543.1)"
       gradientUnits="userSpaceOnUse">
      <stop
         stop-color="#808080"
         offset="0"
         id="stop200" />
      <stop
         stop-color="#e6e6e6"
         offset=".40312"
         id="stop202" />
      <stop
         stop-color="#808080"
         offset="1"
         id="stop204" />
    </linearGradient>
  </defs>
  <sodipodi:namedview
     id="namedview1924"
     pagecolor="#ffffff"
     bordercolor="#666666"
     borderopacity="1.0"
     inkscape:showpageshadow="2"
     inkscape:pageopacity="0.0"
     inkscape:pagecheckerboard="0"
     inkscape:deskcolor="#d1d1d1"
     showgrid="true"
     inkscape:zoom="25.5"
     inkscape:cx="18"
     inkscape:cy="18"
     inkscape:current-layer="svg1922">
    <inkscape:grid
       type="xygrid"
       id="grid2170" />
  </sodipodi:namedview>
  <path
     d="M 14,4 V 1 h 8 v 3 z"
     fill="url(#linearGradient851)"
     fill-rule="evenodd"
     stroke-width="0"
     id="path209"
     style="fill:url(#linearGradient851)" />
  <circle
     cx="18"
     cy="20"
     r="15"
     fill="#808080"
     stroke-width="0"
     style="paint-order:normal"
     id="circle211" />
  <circle
     cx="-18"
     cy="-20"
     r="13.5"
     fill="url(#radialGradient892)"
     style="fill:url(#radialGradient892);paint-order:normal"
     id="circle213"
     transform="scale(-1)" />
  <path
     d="m 14.25,1.5 h 7.5 v 3 h -7.5 z"
     fill-opacity="0"
     stroke-width="0"
     id="path215" />
  <path
     d="m 16,4 h 4 v 2 h -4 z"
     fill="#808080"
     fill-rule="evenodd"
     id="path217" />
  <circle
     transform="scale(-1,1)"
     cx="-27"
     cy="15"
     r="1"
     fill="#2a7fff"
     style="paint-order:stroke fill markers"
     id="circle223" />
  <circle
     transform="scale(-1,1)"
     cx="-23"
     cy="11"
     r="1"
     fill="#2a7fff"
     style="paint-order:stroke fill markers"
     id="circle225" />
  <g
     fill="#2a7fff"
     id="g255">
    <circle
       cx="9"
       cy="15"
       r="1"
       style="paint-order:stroke fill markers"
       id="circle235" />
    <circle
       cx="13"
       cy="11"
       r="1"
       style="paint-order:stroke fill markers"
       id="circle237" />
    <circle
       cx="18"
       cy="30.5"
       r="1"
       style="paint-order:stroke fill markers"
       id="circle239" />
    <circle
       cx="7.5"
       cy="20"
       r="1"
       style="paint-order:stroke fill markers"
       id="circle241" />
    <circle
       cx="28.5"
       cy="20"
       r="1"
       style="paint-order:stroke fill markers"
       id="circle243" />
    <circle
       transform="scale(-1)"
       cx="-27.5"
       cy="-25"
       r="1"
       style="paint-order:stroke fill markers"
       id="circle245" />
    <circle
       transform="scale(-1)"
       cx="-23.5"
       cy="-29"
       r="1"
       style="paint-order:stroke fill markers"
       id="circle247" />
    <circle
       transform="scale(-1,1)"
       cx="-13"
       cy="29"
       r="1"
       style="paint-order:stroke fill markers"
       id="circle249" />
    <circle
       transform="scale(-1,1)"
       cx="-9"
       cy="25"
       r="1"
       style="paint-order:stroke fill markers"
       id="circle251" />
    <circle
       cx="18"
       cy="9.5"
       r="1"
       style="paint-order:stroke fill markers"
       id="circle253" />
  </g>
  <path
     style="fill:none;stroke:#4d4d4d;stroke-width:2;stroke-linecap:butt;stroke-linejoin:miter;stroke-dasharray:none;stroke-opacity:1"
     d="M 18,11.5 V 20 h 6.5"
     id="path2307"
     sodipodi:nodetypes="ccc" />
</svg>
