<svg width="24" height="24" version="1.1" viewBox="0 0 24 24" xmlns="http://www.w3.org/2000/svg">
 <rect x="4.3863635" y="4.3863635" width="16.227272" height="16.227272" rx="2.9892347" ry="2.9892347" fill="#ebfcff" stroke="#00aad4" stroke-linecap="round" stroke-linejoin="round" stroke-width=".772727" style="paint-order:normal"/>
 <path d="m8.636364 12.5 3.090909 3.090909 4.636363-6.181818" fill="none" stroke="#00aad4" stroke-linecap="round" stroke-linejoin="round" stroke-width="2.3"/>
</svg>
