<?xml version="1.0" encoding="UTF-8" standalone="no"?>
<svg
   width="64"
   height="64"
   version="1.1"
   viewBox="0 0 64 64"
   id="svg1"
   sodipodi:docname="Car_01_64.svg"
   inkscape:version="1.3.2 (091e20e, 2023-11-25, custom)"
   xmlns:inkscape="http://www.inkscape.org/namespaces/inkscape"
   xmlns:sodipodi="http://sodipodi.sourceforge.net/DTD/sodipodi-0.dtd"
   xmlns="http://www.w3.org/2000/svg"
   xmlns:svg="http://www.w3.org/2000/svg">
  <defs
     id="defs1" />
  <sodipodi:namedview
     id="namedview1"
     pagecolor="#ffffff"
     bordercolor="#000000"
     borderopacity="0.25"
     inkscape:showpageshadow="2"
     inkscape:pageopacity="0.0"
     inkscape:pagecheckerboard="0"
     inkscape:deskcolor="#d1d1d1"
     showgrid="true"
     inkscape:current-layer="svg1">
    <inkscape:grid
       id="grid1"
       units="px"
       originx="0"
       originy="0"
       spacingx="0.5"
       spacingy="0.5"
       empcolor="#0099e5"
       empopacity="0.30196078"
       color="#0099e5"
       opacity="0.14901961"
       empspacing="2"
       dotted="false"
       gridanglex="30"
       gridanglez="30"
       visible="true" />
  </sodipodi:namedview>
  <path
     d="m18 12c-1.208312 6.4e-4 -2.294424 0.737088-2.742188 1.859376l-3.257812 8.140624c-2-2-6-2-6 2s2 4 4 4c-1.950104 2.764624-2 6.000008-2 10v12c0 1.104568 0.895432 2 2 2h4c1.104568 0 2-0.895432 2-2v-4h32v4c0 1.104568 0.895432 2 2 2h4c1.104568 0 2-0.895432 2-2v-12c0-3.999992-0.04988-7.235376-2-10 2 0 4 0 4-4s-4-4-6-2l-3.257812-8.140624c-0.447764-1.122288-1.533876-1.858736-2.742188-1.859376zm2 2h24c1.2132-8.92e-4 2.31022 0.721236 2.789064 1.835936l3.632812 8.484376c0.748528 1.740396-0.527336 3.678888-2.421876 3.679688-10.71254-2.686476-21.378528-2.646796-32 0-1.894536-8e-4 -3.170404-1.939292-2.421876-3.679688l3.632812-8.484376c0.478844-1.1147 1.575868-1.836828 2.789064-1.835936zm-4 18c2.20914 0 4 1.79086 4 4s-1.79086 4-4 4-4-1.79086-4-4 1.79086-4 4-4zm12 0h8c1.24236 0 2.393384 0.652644 3.031248 1.718748l2.914064 4.851564c0.906136 1.510724-0.183676 3.43212-1.945312 3.429688h-16c-1.761632 0.0024-2.851448-1.918964-1.945312-3.429688l2.91406-4.851564c0.637868-1.066104 1.788892-1.718748 3.031252-1.718748zm20 0c2.20914 0 4 1.79086 4 4s-1.79086 4-4 4-4-1.79086-4-4 1.79086-4 4-4z"
     fill="#2a7efe"
     stroke-linejoin="round"
     id="path1" />
</svg>
