<?xml version="1.0" encoding="UTF-8" standalone="no"?>
<svg
   height="64"
   viewBox="0 0 16.933333 16.933335"
   width="64"
   version="1.1"
   id="svg623"
   sodipodi:docname="Remove_07_64.svg"
   inkscape:version="1.2 (dc2aedaf03, 2022-05-15)"
   inkscape:export-filename="Remove_07_64.png"
   inkscape:export-xdpi="96"
   inkscape:export-ydpi="96"
   xmlns:inkscape="http://www.inkscape.org/namespaces/inkscape"
   xmlns:sodipodi="http://sodipodi.sourceforge.net/DTD/sodipodi-0.dtd"
   xmlns="http://www.w3.org/2000/svg"
   xmlns:svg="http://www.w3.org/2000/svg">
  <defs
     id="defs627" />
  <sodipodi:namedview
     id="namedview625"
     pagecolor="#ffffff"
     bordercolor="#666666"
     borderopacity="1.0"
     inkscape:showpageshadow="2"
     inkscape:pageopacity="0.0"
     inkscape:pagecheckerboard="0"
     inkscape:deskcolor="#d1d1d1"
     showgrid="true"
     inkscape:zoom="14.34375"
     inkscape:cx="25.167756"
     inkscape:cy="32"
     inkscape:current-layer="g1566">
    <inkscape:grid
       type="xygrid"
       id="grid1262" />
  </sodipodi:namedview>
  <g
     id="g2015"
     transform="matrix(0,4.0000003,-4.0000003,0,16.933335,-0.37041653)">
    <g
       id="g1423"
       style="stroke:#00aad4;stroke-opacity:1"
       transform="matrix(0,-1.5555553,1.5555553,0,-1.0833213,5.4092589)">
      <g
         id="g1566"
         style="stroke:#00aad4;stroke-opacity:1">
        <path
           d="M 2.8820685,2.1166666 H 1.3512648"
           id="path707"
           style="fill:none;stroke:#00aad4;stroke-width:0.510268;stroke-linecap:round;stroke-dasharray:none;stroke-opacity:1"
           sodipodi:nodetypes="cc" />
      </g>
    </g>
  </g>
</svg>
