<?xml version="1.0" encoding="UTF-8" standalone="no"?>
<svg
   height="24"
   width="24"
   version="1.1"
   id="svg193"
   sodipodi:docname="menu_view_unit_info_150.svg"
   inkscape:export-filename="menu_view_unit_info_150.png"
   inkscape:export-xdpi="96"
   inkscape:export-ydpi="96"
   inkscape:version="1.2.2 (732a01da63, 2022-12-09)"
   xmlns:inkscape="http://www.inkscape.org/namespaces/inkscape"
   xmlns:sodipodi="http://sodipodi.sourceforge.net/DTD/sodipodi-0.dtd"
   xmlns="http://www.w3.org/2000/svg"
   xmlns:svg="http://www.w3.org/2000/svg">
  <defs
     id="defs197" />
  <sodipodi:namedview
     id="namedview195"
     pagecolor="#ffffff"
     bordercolor="#666666"
     borderopacity="1.0"
     inkscape:showpageshadow="2"
     inkscape:pageopacity="0.0"
     inkscape:pagecheckerboard="0"
     inkscape:deskcolor="#d1d1d1"
     showgrid="true"
     inkscape:zoom="38.25"
     inkscape:cx="11.986928"
     inkscape:cy="12"
     inkscape:current-layer="svg193">
    <inkscape:grid
       type="xygrid"
       id="grid593" />
  </sodipodi:namedview>
  <linearGradient
     id="a"
     gradientUnits="userSpaceOnUse"
     x1="21"
     x2="13.000003"
     y1="21.000001"
     y2="13.000003">
    <stop
       offset="0"
       stop-color="#009600"
       id="stop160" />
    <stop
       offset="1"
       stop-color="#6edb39"
       id="stop162" />
  </linearGradient>
  <path
     d="m4.6 1.6h15.8v19.799999h-15.8z"
     style="fill:#fff;stroke:#d4aa00;stroke-width:1.2;stroke-linecap:round;stroke-linejoin:round;stroke-miterlimit:5.6"
     id="path165" />
  <g
     fill="none"
     stroke="#2a7fff"
     id="g181">
    <path
       d="m8 5.5h9"
       id="path167" />
    <path
       d="m8 15.5h9"
       id="path169" />
    <path
       d="m8 13.5h9"
       id="path171" />
    <path
       d="m8 11.5h9"
       id="path173" />
    <path
       d="m8 9.5h9"
       id="path175" />
    <path
       d="m8 7.5h9"
       id="path177" />
    <path
       d="m8 17.5h9"
       id="path179" />
  </g>
  <g
     stroke="#fff"
     id="g191">
    <circle
       cx="17.000002"
       cy="17.000002"
       fill="url(#a)"
       r="6.399998"
       stroke-dashoffset="1.49998"
       stroke-linecap="round"
       stroke-linejoin="round"
       stroke-width="1.2"
       transform="matrix(0 1 1 0 0 0)"
       id="circle183" />
    <g
       fill="none"
       stroke-width="1.75"
       id="g189">
      <path
         d="m17.125 16v5"
         id="path185" />
      <path
         d="m17.125 13v2"
         id="path187" />
    </g>
  </g>
</svg>
