<?xml version="1.0" encoding="UTF-8" standalone="no"?>
<svg
   width="48"
   height="48"
   version="1.1"
   viewBox="0 0 48 48"
   id="svg13"
   sodipodi:docname="ttiradiogroup_200.svg"
   inkscape:version="1.3.2 (091e20e, 2023-11-25, custom)"
   xmlns:inkscape="http://www.inkscape.org/namespaces/inkscape"
   xmlns:sodipodi="http://sodipodi.sourceforge.net/DTD/sodipodi-0.dtd"
   xmlns="http://www.w3.org/2000/svg"
   xmlns:svg="http://www.w3.org/2000/svg">
  <sodipodi:namedview
     id="namedview13"
     pagecolor="#ffffff"
     bordercolor="#000000"
     borderopacity="0.25"
     inkscape:showpageshadow="2"
     inkscape:pageopacity="0.0"
     inkscape:pagecheckerboard="0"
     inkscape:deskcolor="#d1d1d1"
     showgrid="true"
     inkscape:current-layer="svg13">
    <inkscape:grid
       id="grid13"
       units="px"
       originx="0"
       originy="0"
       spacingx="0.5"
       spacingy="0.5"
       empcolor="#0099e5"
       empopacity="0.30196078"
       color="#0099e5"
       opacity="0.14901961"
       empspacing="2"
       dotted="false"
       gridanglex="30"
       gridanglez="30"
       visible="true" />
  </sodipodi:namedview>
  <defs
     id="defs6">
    <radialGradient
       id="a"
       cx="5.3999925"
       cy="1034.7039"
       r="4"
       gradientTransform="matrix(2.4999876,-2.5000158,1.5000215,1.5000046,-1553.5779,-1526.5605)"
       gradientUnits="userSpaceOnUse">
      <stop
         stop-color="#198d19"
         offset="0"
         id="stop1" />
      <stop
         stop-color="#ffffff"
         offset="1"
         id="stop2" />
    </radialGradient>
    <radialGradient
       id="b"
       cx="5.3999925"
       cy="1034.7039"
       r="4"
       gradientTransform="matrix(2.4999876,-2.5000158,1.5000215,1.5000046,-1553.5779,-1510.5604)"
       gradientUnits="userSpaceOnUse">
      <stop
         stop-color="#ff1919"
         offset="0"
         id="stop3" />
      <stop
         stop-color="#ffffff"
         offset="1"
         id="stop4" />
    </radialGradient>
    <radialGradient
       id="c"
       cx="5.3999925"
       cy="1034.7039"
       r="4"
       gradientTransform="matrix(2.1428465,-2.1428707,1.2857327,1.2857182,-1314.2096,-1307.0518)"
       gradientUnits="userSpaceOnUse">
      <stop
         stop-color="#1a75ff"
         offset="0"
         id="stop5" />
      <stop
         stop-color="#ffffff"
         offset="1"
         id="stop6" />
    </radialGradient>
  </defs>
  <circle
     cx="10"
     cy="9.9999828"
     r="7"
     fill="url(#a)"
     fill-rule="evenodd"
     stroke="#198d19"
     stroke-linecap="square"
     stroke-linejoin="round"
     stroke-width="2"
     style="paint-order:normal"
     id="circle6" />
  <circle
     cx="10"
     cy="25.999983"
     r="7"
     fill="url(#b)"
     fill-rule="evenodd"
     stroke="#ff1a1a"
     stroke-linecap="square"
     stroke-linejoin="round"
     stroke-width="2"
     style="paint-order:normal"
     id="circle7" />
  <rect
     x="18.5"
     y="16.499983"
     width="29"
     height="31"
     fill="#f9f9f9"
     stroke="#2a7efe"
     style="paint-order:normal"
     id="rect7" />
  <rect
     x="21"
     y="15.999983"
     width="16"
     height="3.6197171"
     fill="#f9f9f9"
     stroke-width="1.94028"
     style="paint-order:normal"
     id="rect8" />
  <path
     d="m24 16h10"
     fill="none"
     stroke="#2a7efe"
     stroke-linecap="round"
     stroke-width="4"
     id="path8" />
  <circle
     cx="25"
     cy="24.999983"
     r="2"
     fill="#2a7efe"
     stroke="#999999"
     stroke-linejoin="round"
     style="paint-order:normal"
     id="circle8" />
  <path
     d="m30 25h14"
     fill="#b3b3b3"
     stroke="#b3b3b3"
     stroke-width="1.99999"
     id="path9" />
  <path
     d="m30 41h14"
     fill="#b3b3b3"
     stroke="#b3b3b3"
     stroke-width="1.99999"
     id="path10" />
  <path
     d="m30 33h12"
     fill="#b3b3b3"
     stroke="#b3b3b3"
     stroke-width="1.99999"
     id="path11" />
  <circle
     cx="25"
     cy="40.999981"
     r="2"
     fill="#ffffff"
     stroke="#999999"
     stroke-linejoin="round"
     style="paint-order:normal"
     id="circle11" />
  <circle
     cx="25"
     cy="32.999981"
     r="2"
     fill="#ffffff"
     stroke="#999999"
     stroke-linejoin="round"
     style="paint-order:normal"
     id="circle12" />
  <path
     d="m21.330078 13.751953a3.5 3.5 0 0 1 2.669922-1.251953h7.429687a6 6 0 0 0 0.570313-2.5 6 6 0 0 0-0.039063-0.6816406c-0.0035-0.031423-0.0077-0.062479-0.01172-0.09375a6 6 0 0 0-0.04492-0.2988281c-8.3e-4 -0.00463-0.0031-0.00905-0.0039-0.013672a6 6 0 0 0-4.8125-4.8125c-0.0046-8.4e-4 -9e-3 -0.00308-0.01367-0.00391a6 6 0 0 0-0.298828-0.044922c-0.03127-4e-3 -0.06233-0.0082-0.09375-0.011719a6 6 0 0 0-0.681649-0.0390583 6 6 0 0 0-6 6 6 6 0 0 0 1.330078 3.751953z"
     fill="url(#c)"
     fill-rule="evenodd"
     stroke-linecap="square"
     stroke-linejoin="round"
     stroke-width="2"
     id="path12" />
  <path
     d="m 26,2 c -4.406425,0 -8,3.5935754 -8,8 0,2.289402 0.971369,4.357805 2.521484,5.818359 a 3.5,3.5 0 0 1 0.798828,-2.05664 C 20.494986,12.73426 20,11.427293 20,10 c 0,-3.3255467 2.674453,-6 6,-6 0.230775,0 0.457813,0.01398 0.681641,0.039063 a 6,6 0 0 1 0.09375,0.011719 c 2.701793,0.345632 4.828196,2.4720346 5.173828,5.1738282 a 6,6 0 0 1 0.01172,0.09375 C 31.986019,9.5421872 32,9.7692252 32,10 c 0,0.894109 -0.195641,1.739345 -0.542969,2.5 h 2.138672 C 33.856004,11.712681 34,10.872685 34,10 34,5.5935754 30.406425,2 26,2 Z"
     fill="#1a75ff"
     fill-rule="evenodd"
     stroke-linecap="square"
     stroke-linejoin="round"
     id="path13" />
</svg>
