<?xml version="1.0" encoding="UTF-8" standalone="no"?>
<svg
   width="24"
   height="24"
   version="1.1"
   viewBox="0 0 6.35 6.35"
   id="svg135"
   sodipodi:docname="Health_12_24.svg"
   inkscape:export-filename="Health_12_24.png"
   inkscape:export-xdpi="96"
   inkscape:export-ydpi="96"
   inkscape:version="1.2.1 (9c6d41e410, 2022-07-14)"
   xmlns:inkscape="http://www.inkscape.org/namespaces/inkscape"
   xmlns:sodipodi="http://sodipodi.sourceforge.net/DTD/sodipodi-0.dtd"
   xmlns="http://www.w3.org/2000/svg"
   xmlns:svg="http://www.w3.org/2000/svg">
  <defs
     id="defs139" />
  <sodipodi:namedview
     id="namedview137"
     pagecolor="#ffffff"
     bordercolor="#666666"
     borderopacity="1.0"
     inkscape:showpageshadow="2"
     inkscape:pageopacity="0.0"
     inkscape:pagecheckerboard="0"
     inkscape:deskcolor="#d1d1d1"
     showgrid="true"
     inkscape:zoom="38.25"
     inkscape:cx="11.594771"
     inkscape:cy="12"
     inkscape:current-layer="svg135">
    <inkscape:grid
       type="xygrid"
       id="grid890" />
  </sodipodi:namedview>
  <path
     style="fill:none;stroke:#00aad4;stroke-width:0.3175;stroke-dasharray:none;stroke-opacity:1"
     d="M 2.5047599,5.1247673 C -1.2406255,2.0427266 1.7391697,-0.75717064 3.175,1.5176623 4.212987,-0.12685443 6.0578651,0.88073269 5.5855197,2.729766"
     id="path2228" />
  <g
     id="g4230"
     transform="scale(0.26458333)">
    <circle
       cx="17.6"
       cy="17.6"
       r="5.7999997"
       stroke-dashoffset="1.49998"
       stroke-linejoin="round"
       stroke-width="1.2"
       transform="matrix(0,1,1,0,0,0)"
       id="circle274"
       style="fill:none;stroke:#00aad4;stroke-linecap:round" />
    <path
       d="m 17.6,14.6 v 6"
       id="path276"
       style="fill:none;stroke:#00aad4;stroke-width:1.2;stroke-linecap:round;stroke-dasharray:none"
       sodipodi:nodetypes="cc" />
    <path
       d="m 20.6,17.6 h -6"
       id="path278"
       style="fill:none;stroke:#00aad4;stroke-width:1.2;stroke-linecap:round;stroke-dasharray:none"
       sodipodi:nodetypes="cc" />
    <rect
       style="fill:none;stroke-width:1.5;stroke-linecap:round;stroke-linejoin:round;stroke-miterlimit:5.6"
       id="rect4222"
       width="13"
       height="13"
       x="11"
       y="11" />
  </g>
</svg>
