<?xml version="1.0" encoding="UTF-8" standalone="no"?>
<svg
   height="48"
   width="48"
   version="1.1"
   id="svg1264"
   sodipodi:docname="03 Update_150.svg"
   inkscape:export-filename="03 Update_150.png"
   inkscape:export-xdpi="96"
   inkscape:export-ydpi="96"
   inkscape:version="1.2.1 (9c6d41e410, 2022-07-14)"
   xmlns:inkscape="http://www.inkscape.org/namespaces/inkscape"
   xmlns:sodipodi="http://sodipodi.sourceforge.net/DTD/sodipodi-0.dtd"
   xmlns:xlink="http://www.w3.org/1999/xlink"
   xmlns="http://www.w3.org/2000/svg"
   xmlns:svg="http://www.w3.org/2000/svg">
  <defs
     id="defs1268">
    <linearGradient
       id="linearGradient1347"
       x1="8.8369999"
       x2="15.576"
       y1="7.8053999"
       y2="10.838"
       gradientTransform="matrix(0.39262,0,0,0.39262,2.7483,3.1533)"
       gradientUnits="userSpaceOnUse"
       xlink:href="#linearGradient933-3" />
    <linearGradient
       id="linearGradient933-3">
      <stop
         stop-color="#ffe991"
         offset="0"
         id="stop472" />
      <stop
         stop-color="#f5c400"
         offset="1"
         id="stop474" />
    </linearGradient>
    <linearGradient
       id="linearGradient1351"
       x1="8.8369999"
       x2="15.576"
       y1="7.8013"
       y2="10.834"
       gradientTransform="matrix(-0.39262,0,0,0.39262,9.4226,3.1549)"
       gradientUnits="userSpaceOnUse"
       xlink:href="#linearGradient933-3" />
    <linearGradient
       id="linearGradient1355"
       x1="1.4239"
       x2="15.576"
       y1="4.4317002"
       y2="4.4317002"
       gradientTransform="matrix(-0.39262,0,0,0.39262,9.4226,3.1549)"
       gradientUnits="userSpaceOnUse">
      <stop
         stop-color="#ffe478"
         offset="0"
         id="stop478" />
      <stop
         stop-color="#fff2c0"
         offset="1"
         id="stop480" />
    </linearGradient>
  </defs>
  <sodipodi:namedview
     id="namedview1266"
     pagecolor="#ffffff"
     bordercolor="#666666"
     borderopacity="1.0"
     inkscape:showpageshadow="2"
     inkscape:pageopacity="0.0"
     inkscape:pagecheckerboard="0"
     inkscape:deskcolor="#d1d1d1"
     showgrid="true"
     inkscape:zoom="19.125"
     inkscape:cx="23.973856"
     inkscape:cy="24"
     inkscape:current-layer="svg1264">
    <inkscape:grid
       type="xygrid"
       id="grid3789" />
  </sodipodi:namedview>
  <linearGradient
     id="a"
     gradientUnits="userSpaceOnUse"
     x1="22"
     x2="28"
     y1="18.02074"
     y2="23.02074">
    <stop
       offset="0"
       stop-color="#ffe991"
       id="stop1223" />
    <stop
       offset="1"
       stop-color="#e6b800"
       id="stop1225" />
  </linearGradient>
  <linearGradient
     id="b"
     gradientUnits="userSpaceOnUse"
     x1="8"
     x2="2"
     y1="14.02074"
     y2="20.02074">
    <stop
       offset="0"
       stop-color="#ffea91"
       id="stop1228" />
    <stop
       offset="1"
       stop-color="#e6b900"
       id="stop1230" />
  </linearGradient>
  <linearGradient
     id="c"
     gradientUnits="userSpaceOnUse"
     x1="9"
     x2="27"
     y1="6.02074"
     y2="9.02074">
    <stop
       offset="0"
       stop-color="#fff2c0"
       id="stop1233" />
    <stop
       offset="1"
       stop-color="#ffe478"
       id="stop1235" />
  </linearGradient>
  <g
     transform="matrix(7.4902678,0,0,7.5171024,-21.581859,-24.248215)"
     stroke-width="0.31984"
     id="g503">
    <g
       stroke="#ccaa00"
       stroke-linejoin="round"
       id="g491">
      <path
         d="M 6.0854,6.2942 8.9958,4.8949 V 7.4084 L 6.0854,8.9959 Z"
         fill="url(#linearGradient1347)"
         id="path485"
         style="fill:url(#linearGradient1347)" />
      <path
         d="M 6.0854,6.2177 3.175,4.8948 v 2.5135 l 2.9104,1.5875 z"
         fill="url(#linearGradient1351)"
         id="path487"
         style="fill:url(#linearGradient1351)" />
      <path
         d="M 6.0854,3.5719 3.175,4.8948 6.0854,6.2177 8.9958,4.8948 Z"
         fill="url(#linearGradient1355)"
         id="path489"
         style="fill:url(#linearGradient1355)" />
    </g>
    <g
       fill="none"
       stroke="#5f8dd3"
       stroke-linecap="round"
       id="g501">
      <path
         d="M 4.736,4.2069 7.6729,5.5563"
         id="path493" />
      <path
         d="M 4.4979,5.5563 7.4348,4.2069"
         id="path495" />
      <path
         d="M 4.4979,5.5563 V 8.1228"
         id="path497" />
      <path
         d="M 7.6729,5.5563 V 8.1228"
         id="path499" />
    </g>
  </g>
  <g
     fill-rule="evenodd"
     stroke="#fff"
     stroke-linecap="round"
     stroke-linejoin="round"
     transform="matrix(1.95744255 0 0 1.95744255 -3.4233665 -1.207343)"
     id="g1262">
    <path
       d="m15.986649 23.999999a1.50015 1.50015 0 0 0 1.044922-2.5742l-.439453-.4394h7.378906a1.50015 1.50015 0 1 0 0-3h-14.621095l5.560548 5.5605a1.50015 1.50015 0 0 0 1.076172.4531z"
       fill="#386cbe"
       id="path1258" />
    <path
       d="m19.01034 11.972799a1.50015 1.50015 0 0 0 -1.044922 2.5742l.439453.4394h-7.378906a1.50015 1.50015 0 1 0 0 3h14.621094l-5.560547-5.5605a1.50015 1.50015 0 0 0 -1.076172-.4531z"
       fill="#e60000"
       id="path1260" />
  </g>
</svg>
