<?xml version="1.0" encoding="UTF-8" standalone="no"?>
<svg
   height="48"
   viewBox="0 0 48 48"
   width="48"
   version="1.1"
   id="svg5"
   sodipodi:docname="Map_02_48.svg"
   inkscape:export-filename="Map_02_48.png"
   inkscape:export-xdpi="96"
   inkscape:export-ydpi="96"
   inkscape:version="1.3-beta (cedbd6c6ff, 2023-05-28)"
   xmlns:inkscape="http://www.inkscape.org/namespaces/inkscape"
   xmlns:sodipodi="http://sodipodi.sourceforge.net/DTD/sodipodi-0.dtd"
   xmlns="http://www.w3.org/2000/svg"
   xmlns:svg="http://www.w3.org/2000/svg">
  <defs
     id="defs5" />
  <sodipodi:namedview
     id="namedview5"
     pagecolor="#ffffff"
     bordercolor="#000000"
     borderopacity="0.25"
     inkscape:showpageshadow="2"
     inkscape:pageopacity="0.0"
     inkscape:pagecheckerboard="0"
     inkscape:deskcolor="#d1d1d1"
     showgrid="true"
     inkscape:current-layer="svg5">
    <inkscape:grid
       id="grid5"
       units="px"
       originx="0"
       originy="0"
       spacingx="0.5"
       spacingy="0.5"
       empcolor="#0099e5"
       empopacity="0.30196078"
       color="#0099e5"
       opacity="0.14901961"
       empspacing="2"
       dotted="false"
       gridanglex="30"
       gridanglez="30"
       visible="true" />
  </sodipodi:namedview>
  <circle
     cx="24"
     cy="24"
     fill="#fff"
     r="20.612745"
     stroke="#00aad4"
     stroke-linecap="round"
     stroke-linejoin="round"
     stroke-width="2.27451"
     id="circle1" />
  <g
     fill="#00aad4"
     id="g4">
    <ellipse
       cx="24"
       cy="5.519606"
       rx="2.132353"
       ry="2.843137"
       id="ellipse1" />
    <ellipse
       cx="5.519608"
       cy="24"
       rx="2.843137"
       ry="2.132353"
       id="ellipse2" />
    <ellipse
       cx="24"
       cy="42.480396"
       rx="2.132353"
       ry="2.843137"
       id="ellipse3" />
    <ellipse
       cx="42.480396"
       cy="24"
       rx="2.843137"
       ry="2.132353"
       id="ellipse4" />
    <path
       d="m11.916667 36.083334 9.067731-15.098937 15.098936-9.067731-9.067731 15.098937z"
       stroke="#00aad4"
       stroke-linejoin="round"
       stroke-width="2.27451"
       id="path4" />
  </g>
  <circle
     cx="24"
     cy="24"
     fill="#fff"
     r="3.553922"
     id="circle4" />
  <circle
     cx="24"
     cy="24"
     fill="none"
     r="15.637255"
     stroke="#00aad4"
     stroke-linecap="round"
     stroke-linejoin="round"
     stroke-width="1.42157"
     id="circle5" />
</svg>
