<?xml version="1.0" encoding="UTF-8" standalone="no"?>
<svg
   height="36"
   viewBox="0 0 9.5249997 9.5250005"
   width="36"
   version="1.1"
   id="svg500"
   sodipodi:docname="Secure_03_36.svg"
   inkscape:version="1.2 (dc2aedaf03, 2022-05-15)"
   inkscape:export-filename="Secure_03_36.png"
   inkscape:export-xdpi="96"
   inkscape:export-ydpi="96"
   xmlns:inkscape="http://www.inkscape.org/namespaces/inkscape"
   xmlns:sodipodi="http://sodipodi.sourceforge.net/DTD/sodipodi-0.dtd"
   xmlns="http://www.w3.org/2000/svg"
   xmlns:svg="http://www.w3.org/2000/svg">
  <defs
     id="defs504" />
  <sodipodi:namedview
     id="namedview502"
     pagecolor="#ffffff"
     bordercolor="#666666"
     borderopacity="1.0"
     inkscape:showpageshadow="2"
     inkscape:pageopacity="0.0"
     inkscape:pagecheckerboard="0"
     inkscape:deskcolor="#d1d1d1"
     showgrid="true"
     inkscape:zoom="25.5"
     inkscape:cx="15.470588"
     inkscape:cy="18"
     inkscape:current-layer="svg500">
    <inkscape:grid
       type="xygrid"
       id="grid1268" />
  </sodipodi:namedview>
  <g
     id="g2320"
     transform="matrix(2.2500229,0,0,2.2500229,-0.097175,-0.09744168)">
    <circle
       style="fill:none;stroke:#00aad4;stroke-width:0.132292;stroke-linecap:round;stroke-linejoin:round;stroke-dasharray:none"
       id="path351"
       cx="3.0427082"
       cy="3.0427084"
       r="0.33072916" />
    <path
       id="path908"
       style="fill:none;stroke:#00aad4;stroke-width:0.264583;stroke-linecap:round;stroke-linejoin:round;stroke-dasharray:none"
       d="m 3.6586715,3.6587713 c -0.4133049,0.4133049 -1.0834045,0.4133049 -1.4967094,0 C 1.8801584,3.3769676 1.7904969,2.975782 1.8929777,2.6180108 L 2.6001936,1.8983216 c 0.3621832,-0.1106387 0.7720126,-0.022725 1.0584779,0.2637403 0.4133049,0.4133049 0.4133049,1.0834045 0,1.4967094 z"
       sodipodi:nodetypes="ssccss" />
    <path
       style="fill:none;stroke:#00aad4;stroke-width:0.198437;stroke-linecap:butt;stroke-linejoin:round;stroke-dasharray:none;stroke-opacity:1"
       d="M 1.8520835,2.5135417 0.37041667,1.0847917 V 0.44979167 l 0.52255211,0.006615 0.26458332,0.238125 v 0.2645829 H 1.4221354 V 1.2236979 h 0.2645834 l -1e-7,0.2645833 0.396875,10e-8 0.4299482,0.363802"
       id="path970"
       sodipodi:nodetypes="cccccccccccc" />
  </g>
</svg>
