<?xml version="1.0" encoding="UTF-8" standalone="no"?>
<svg
   height="24"
   viewBox="0 0 6.3499998 6.3500003"
   width="24"
   version="1.1"
   id="svg171"
   sodipodi:docname="Font_12_24.svg"
   inkscape:export-filename="Font_12_24.png"
   inkscape:export-xdpi="96"
   inkscape:export-ydpi="96"
   inkscape:version="1.2 (dc2aedaf03, 2022-05-15)"
   xmlns:inkscape="http://www.inkscape.org/namespaces/inkscape"
   xmlns:sodipodi="http://sodipodi.sourceforge.net/DTD/sodipodi-0.dtd"
   xmlns="http://www.w3.org/2000/svg"
   xmlns:svg="http://www.w3.org/2000/svg">
  <defs
     id="defs175">
    <filter
       inkscape:collect="always"
       style="color-interpolation-filters:sRGB"
       id="filter4100"
       x="-0.077519639"
       y="-0.072638999"
       width="1.1550393"
       height="1.145278">
      <feGaussianBlur
         inkscape:collect="always"
         stdDeviation="0.19217504"
         id="feGaussianBlur4102" />
    </filter>
  </defs>
  <sodipodi:namedview
     id="namedview173"
     pagecolor="#ffffff"
     bordercolor="#666666"
     borderopacity="1.0"
     inkscape:showpageshadow="2"
     inkscape:pageopacity="0.0"
     inkscape:pagecheckerboard="0"
     inkscape:deskcolor="#d1d1d1"
     showgrid="true"
     inkscape:zoom="38.25"
     inkscape:cx="10.313725"
     inkscape:cy="12"
     inkscape:current-layer="svg171">
    <inkscape:grid
       type="xygrid"
       id="grid1259" />
  </sodipodi:namedview>
  <g
     id="g4106">
    <path
       id="path3732"
       style="fill:#ffffff;stroke:none;filter:url(#filter4100)"
       d="M 2.5802043,0 A 0.39652402,0.39652402 0 0 0 2.2071004,0.26354981 L 0.22272542,5.8203166 A 0.39652402,0.39652402 0 0 0 0.59582927,6.3494833 H 1.4748454 A 0.39652402,0.39652402 0 0 0 1.8474325,6.0859335 l 0.4728393,-1.324467 h 1.7089397 l 0.4728393,1.324467 A 0.39652402,0.39652402 0 0 0 4.8751547,6.3494833 H 5.753654 A 0.39652402,0.39652402 0 0 0 6.1267579,5.8203166 L 4.1423828,0.26354981 A 0.39652402,0.39652402 0 0 0 3.769279,0 Z M 3.1760336,2.3693644 3.4628378,3.1760336 H 2.8866455 Z" />
    <path
       d="M 2.5796876,0.39687507 0.59531252,5.953125 H 1.4741074 l 0.5669643,-1.5875 h 2.267857 l 0.5669643,1.5875 H 5.7546875 L 3.7703126,0.39687507 Z M 3.1750001,1.190625 4.0254465,3.571875 H 2.3245537 Z"
       stroke="#ffffff"
       stroke-width="0.198438"
       id="path723"
       sodipodi:nodetypes="ccccccccccccc"
       style="stroke:none" />
  </g>
  <g
     id="g4453"
     transform="scale(0.26458334)">
    <path
       d="M 18.328644,9.0005368 C 17.918659,8.9880144 17.519791,9.1951271 17.299875,9.566059 l -0.688854,1.161125 -0.225607,-0.003 -0.685846,-1.1551089 C 15.406188,9.0757376 14.795031,8.8712316 14.264706,9.0907797 l -1.42283,0.5895869 c -0.530241,0.2197525 -0.818207,0.7943474 -0.676822,1.3506354 l 0.330891,1.305514 -0.159429,0.159429 -1.305514,-0.333898 c -0.557057,-0.14238 -1.1339963,0.145466 -1.3536441,0.676821 l -0.5895869,1.42283 c -0.2204105,0.531039 -0.016288,1.14465 0.4782874,1.437871 l 1.1611256,0.688854 -0.003,0.225607 -1.1581176,0.685846 c -0.4933292,0.29338 -0.6948274,0.904537 -0.4752793,1.434862 l 0.5895869,1.42283 c 0.2197525,0.53024 0.794348,0.818207 1.350636,0.676822 l 1.305514,-0.330891 0.159429,0.159429 -0.333899,1.305514 c -0.14238,0.557056 0.145467,1.133996 0.676822,1.353644 l 1.422829,0.589587 c 0.53104,0.220409 1.14465,0.01629 1.437871,-0.478288 l 0.688854,-1.161125 0.225607,0.003 0.685846,1.158117 c 0.293381,0.493323 0.904538,0.694821 1.434863,0.475273 l 1.422829,-0.589587 c 0.530241,-0.219753 0.818207,-0.794348 0.676822,-1.350636 l -0.33089,-1.305514 0.159429,-0.159429 1.305514,0.333899 c 0.557056,0.14238 1.133995,-0.145467 1.353643,-0.676822 l 0.589587,-1.42283 c 0.220411,-0.531039 0.01629,-1.144649 -0.478287,-1.43787 l -1.161125,-0.688854 0.003,-0.222599 1.158117,-0.688854 c 0.493329,-0.293381 0.694828,-0.904538 0.475279,-1.434863 L 23.319077,12.841862 C 23.099325,12.311621 22.524729,12.023654 21.968442,12.16504 l -1.305514,0.33089 -0.159429,-0.159429 0.333898,-1.305514 C 20.979777,10.473946 20.691931,9.8970063 20.160575,9.6773585 L 18.737746,9.0877716 c -0.13276,-0.055103 -0.27244,-0.083061 -0.409102,-0.087235 z m -1.828922,6.3440762 a 1.1551092,1.1551092 0 0 1 1.155109,1.155109 1.1551092,1.1551092 0 0 1 -1.155109,1.155109 1.1551092,1.1551092 0 0 1 -1.15511,-1.155109 1.1551092,1.1551092 0 0 1 1.15511,-1.155109 z"
       fill="#ffffff"
       id="path274"
       style="stroke:none;stroke-width:0.666641" />
    <path
       d="m 13.283367,10.747053 0.494591,1.940799 -1.088898,1.0892 -1.943358,-0.494155 -0.589325,1.422757 1.723582,1.024742 -2.14e-4,1.540148 -1.722081,1.022624 0.589388,1.422909 1.940799,-0.494591 1.089201,1.088898 -0.494155,1.943358 1.422757,0.589325 1.024741,-1.723582 1.540149,2.14e-4 1.022623,1.72208 1.422909,-0.589388 -0.494591,-1.940798 1.088898,-1.089201 1.943358,0.494155 0.589326,-1.422757 -1.723582,-1.024741 2.13e-4,-1.540149 1.722081,-1.022623 -0.589388,-1.422909 -1.940799,0.494591 -1.089201,-1.088899 0.494155,-1.943358 -1.422757,-0.589325 -1.024741,1.723582 -1.540148,-2.14e-4 -1.022624,-1.72208 z m 2.332272,3.618306 a 2.3102184,2.3102184 0 0 1 3.018446,1.250281 2.3102184,2.3102184 0 0 1 -1.250281,3.018446 2.3102184,2.3102184 0 0 1 -3.018446,-1.250282 2.3102184,2.3102184 0 0 1 1.250281,-3.018445 z"
       fill="#2c5aa0"
       id="path276"
       style="fill:#3771c8;fill-opacity:0.996078;stroke:none;stroke-width:0.666641" />
  </g>
</svg>
