<?xml version="1.0" encoding="UTF-8" standalone="no"?>
<svg
   height="32"
   width="32"
   version="1.1"
   id="svg392"
   sodipodi:docname="Grid_07_32.svg"
   inkscape:export-filename="Grid_07_32.png"
   inkscape:export-xdpi="96"
   inkscape:export-ydpi="96"
   inkscape:version="1.2-beta (1b65182ce9, 2022-04-05)"
   xmlns:inkscape="http://www.inkscape.org/namespaces/inkscape"
   xmlns:sodipodi="http://sodipodi.sourceforge.net/DTD/sodipodi-0.dtd"
   xmlns="http://www.w3.org/2000/svg"
   xmlns:svg="http://www.w3.org/2000/svg">
  <defs
     id="defs396" />
  <sodipodi:namedview
     id="namedview394"
     pagecolor="#ffffff"
     bordercolor="#666666"
     borderopacity="1.0"
     inkscape:pageshadow="2"
     inkscape:pageopacity="0.0"
     inkscape:pagecheckerboard="0"
     inkscape:deskcolor="#d1d1d1"
     showgrid="true"
     inkscape:zoom="28.6875"
     inkscape:cx="16"
     inkscape:cy="16"
     inkscape:current-layer="svg392">
    <inkscape:grid
       type="xygrid"
       id="grid1164" />
  </sodipodi:namedview>
  <linearGradient
     id="a"
     gradientTransform="matrix(0 -.9375 -1.0166667 0 84.133336 49.78125)"
     gradientUnits="userSpaceOnUse"
     x1="9"
     x2="6"
     y1="10"
     y2="10.5">
    <stop
       offset="0"
       stop-color="#72cef6"
       id="stop346" />
    <stop
       offset="1"
       stop-color="#d2f5f8"
       id="stop348" />
  </linearGradient>
  <linearGradient
     id="b"
     gradientTransform="matrix(0 -.9375 -1.0166667 0 84.133336 49.78125)"
     gradientUnits="userSpaceOnUse"
     x1="10"
     x2="5"
     y1="12.5"
     y2="12.5">
    <stop
       offset="0"
       stop-color="#4674a8"
       id="stop351" />
    <stop
       offset="1"
       stop-color="#42a0ce"
       id="stop353" />
  </linearGradient>
  <g
     id="g1270">
    <g
       stroke-width=".75"
       transform="matrix(0 2 -2 0 99.999999 -136)"
       id="g376">
      <path
         d="m-83.625-49.625h15.250001v15.250001h-15.250001z"
         fill="#fff"
         stroke="#999"
         stroke-dashoffset="1.49998"
         stroke-linecap="round"
         stroke-linejoin="round"
         transform="scale(-1)"
         id="path356" />
      <g
         fill="none"
         stroke="#b3b3b3"
         transform="matrix(-1 0 0 1 152 0)"
         id="g368">
        <path
           d="m68.75 46.625h14.5"
           id="path358" />
        <path
           d="m72.125 49.25v-14.5"
           id="path360" />
        <path
           d="m83.25 37.375h-14.5"
           id="path362" />
        <path
           d="m80.125 49.25v-14.5"
           id="path364" />
        <path
           d="m76.125 49.25v-14.5"
           id="path366" />
      </g>
      <g
         stroke-linejoin="round"
         id="g374">
        <path
           d="m68.375-45.375h15.25v5.25h-15.25z"
           fill="none"
           opacity=".5"
           stroke="#fff"
           stroke-dashoffset="1.49998"
           transform="scale(1 -1)"
           id="path370" />
        <path
           d="m83.625003 44.625h-15.250001v-3.75h15.250001z"
           fill="url(#a)"
           stroke="url(#b)"
           stroke-linecap="round"
           id="path372" />
      </g>
    </g>
    <g
       fill="none"
       stroke-linecap="round"
       stroke-opacity=".996078"
       id="g390">
      <g
         stroke="#fff"
         stroke-width="3"
         transform="matrix(2 0 0 2 -39.5 18)"
         id="g382">
        <path
           d="m27.5-1h3.5"
           opacity=".7"
           id="path378" />
        <path
           d="m31.5-4 3 3-3 3"
           opacity=".7"
           stroke-linejoin="round"
           id="path380" />
      </g>
      <g
         stroke="#3771c8"
         stroke-width="2"
         transform="matrix(2 0 0 2 -.5 -4)"
         id="g388">
        <path
           d="m8 10h7"
           id="path384" />
        <path
           d="m12 7 3 3-3 3"
           stroke-linejoin="round"
           id="path386" />
      </g>
    </g>
  </g>
</svg>
