<?xml version="1.0" encoding="UTF-8" standalone="no"?>
<svg
   width="36"
   height="36"
   version="1.1"
   viewBox="0 0 36 36"
   id="svg5"
   sodipodi:docname="tmaskedit_150.svg"
   inkscape:export-filename="tmaskedit_150.png"
   inkscape:export-xdpi="96"
   inkscape:export-ydpi="96"
   inkscape:version="1.3.2 (091e20e, 2023-11-25, custom)"
   xmlns:inkscape="http://www.inkscape.org/namespaces/inkscape"
   xmlns:sodipodi="http://sodipodi.sourceforge.net/DTD/sodipodi-0.dtd"
   xmlns="http://www.w3.org/2000/svg"
   xmlns:svg="http://www.w3.org/2000/svg">
  <defs
     id="defs5" />
  <sodipodi:namedview
     id="namedview5"
     pagecolor="#ffffff"
     bordercolor="#000000"
     borderopacity="0.25"
     inkscape:showpageshadow="2"
     inkscape:pageopacity="0.0"
     inkscape:pagecheckerboard="0"
     inkscape:deskcolor="#d1d1d1"
     showgrid="true"
     inkscape:current-layer="svg5">
    <inkscape:grid
       id="grid5"
       units="px"
       originx="0"
       originy="0"
       spacingx="0.5"
       spacingy="0.5"
       empcolor="#0099e5"
       empopacity="0.30196078"
       color="#0099e5"
       opacity="0.14901961"
       empspacing="2"
       dotted="false"
       gridanglex="30"
       gridanglez="30"
       visible="true" />
  </sodipodi:namedview>
  <rect
     x=".5"
     y="9.4999828"
     width="35"
     height="17"
     fill="#ffffff"
     stroke="#2a7efe"
     stroke-linecap="round"
     stroke-linejoin="round"
     style="paint-order:normal"
     id="rect1" />
  <path
     d="m30.5 13v10"
     fill="none"
     stroke="#4d4d4d"
     stroke-linecap="round"
     id="path1" />
  <path
     d="m29.5 12.5 1 0.5 1-0.5"
     fill="none"
     stroke="#4d4d4d"
     stroke-linecap="round"
     id="path2" />
  <path
     d="m29.5 23.5 1-0.5 1 0.5"
     fill="none"
     stroke="#4d4d4d"
     stroke-linecap="round"
     id="path3" />
  <circle
     cx="24.000002"
     cy="18"
     r="3"
     fill="#808080"
     id="circle3" />
  <circle
     cx="7.5"
     cy="18"
     r="3"
     fill="#808080"
     id="circle4" />
  <circle
     cx="15.75"
     cy="18"
     r="3"
     fill="#808080"
     id="circle5" />
</svg>
