<?xml version="1.0" encoding="UTF-8" standalone="no"?>
<svg
   height="48"
   width="48"
   version="1.1"
   id="svg20"
   sodipodi:docname="Note_01_48.svg"
   inkscape:export-filename="Note_01_48.png"
   inkscape:export-xdpi="96"
   inkscape:export-ydpi="96"
   inkscape:version="1.2-beta (1b65182ce9, 2022-04-05)"
   xmlns:inkscape="http://www.inkscape.org/namespaces/inkscape"
   xmlns:sodipodi="http://sodipodi.sourceforge.net/DTD/sodipodi-0.dtd"
   xmlns="http://www.w3.org/2000/svg"
   xmlns:svg="http://www.w3.org/2000/svg">
  <defs
     id="defs24">
    <linearGradient
       id="c"
       gradientTransform="matrix(1.5742283,0,0,1.4968152,-0.593826,24.025481)"
       gradientUnits="userSpaceOnUse"
       x1="3.5"
       x2="3.5"
       y1="4"
       y2="13">
      <stop
         offset="0"
         stop-color="#e8d769"
         id="stop306" />
      <stop
         offset="1"
         stop-color="#fceb84"
         id="stop308" />
    </linearGradient>
    <linearGradient
       id="a"
       gradientTransform="matrix(1.5742283,0,0,1.4968152,-0.593826,24.025481)"
       gradientUnits="userSpaceOnUse"
       x1="7.5"
       x2="7.5"
       y1="13.5"
       y2="2.5">
      <stop
         offset="0"
         stop-color="#bb9c21"
         id="stop296" />
      <stop
         offset="1"
         stop-color="#d9b62a"
         id="stop298" />
    </linearGradient>
    <radialGradient
       id="b"
       cx="8.25"
       cy="27.25"
       gradientUnits="userSpaceOnUse"
       r="3.75">
      <stop
         offset="0"
         stop-color="#fff"
         id="stop301" />
      <stop
         offset="1"
         stop-color="#d40000"
         id="stop303" />
    </radialGradient>
  </defs>
  <sodipodi:namedview
     id="namedview22"
     pagecolor="#ffffff"
     bordercolor="#666666"
     borderopacity="1.0"
     inkscape:pageshadow="2"
     inkscape:pageopacity="0.0"
     inkscape:pagecheckerboard="0"
     inkscape:deskcolor="#d1d1d1"
     showgrid="true"
     inkscape:zoom="19.125"
     inkscape:cx="22.535948"
     inkscape:cy="24"
     inkscape:current-layer="svg20">
    <inkscape:grid
       type="xygrid"
       id="grid1108" />
  </sodipodi:namedview>
  <g
     transform="matrix(2.0000004,0,0,2.0000004,-0.03503465,-47.964984)"
     id="g317">
    <rect
       fill="url(#c)"
       fill-rule="evenodd"
       height="16.464966"
       rx="0.78711402"
       ry="0.74840802"
       stroke="url(#a)"
       stroke-linecap="square"
       stroke-width="1.53503"
       width="20.464966"
       x="1.767517"
       y="27.767519"
       id="rect311"
       style="fill:url(#c);stroke:url(#a)" />
    <path
       d="m 9,28 4.5,4.5"
       fill="none"
       stroke="#999999"
       stroke-width="1.5"
       id="path313" />
    <circle
       cx="9"
       cy="28"
       fill="url(#b)"
       fill-rule="evenodd"
       r="3"
       id="circle315"
       style="fill:url(#b)" />
  </g>
</svg>
