<?xml version="1.0" encoding="UTF-8" standalone="no"?>
<svg
   height="36"
   width="36"
   version="1.1"
   id="svg597"
   sodipodi:docname="Database_04_36.svg"
   inkscape:export-filename="Database_04_36.png"
   inkscape:export-xdpi="96"
   inkscape:export-ydpi="96"
   inkscape:version="1.2-beta (1b65182ce9, 2022-04-05)"
   xml:space="preserve"
   xmlns:inkscape="http://www.inkscape.org/namespaces/inkscape"
   xmlns:sodipodi="http://sodipodi.sourceforge.net/DTD/sodipodi-0.dtd"
   xmlns:xlink="http://www.w3.org/1999/xlink"
   xmlns="http://www.w3.org/2000/svg"
   xmlns:svg="http://www.w3.org/2000/svg"><defs
     id="defs601"><linearGradient
       inkscape:collect="always"
       xlink:href="#b"
       id="linearGradient1246"
       gradientUnits="userSpaceOnUse"
       x1="-37.744652"
       y1="21.3936"
       x2="-24.244652"
       y2="21.3936"
       gradientTransform="translate(42.244654,-10.893583)" /><linearGradient
       id="b"><stop
         offset="0"
         stop-color="#4276c4"
         id="stop160" /><stop
         offset=".34375"
         stop-color="#80b3ff"
         id="stop162" /><stop
         offset="1"
         stop-color="#04a"
         id="stop164" /></linearGradient><linearGradient
       id="d"
       gradientUnits="userSpaceOnUse"
       x1="-37.744652"
       x2="-24.244652"
       xlink:href="#b"
       y1="16.8936"
       y2="16.8936"
       gradientTransform="translate(42.244654,-10.893583)" /><linearGradient
       id="c"
       gradientUnits="userSpaceOnUse"
       x1="-37.744652"
       x2="-24.244652"
       xlink:href="#b"
       y1="12.3938"
       y2="12.3938"
       gradientTransform="translate(42.244654,-10.893583)" /><linearGradient
       inkscape:collect="always"
       xlink:href="#b"
       id="linearGradient2642"
       gradientUnits="userSpaceOnUse"
       gradientTransform="translate(42.244654,-10.893583)"
       x1="-37.744652"
       y1="21.3936"
       x2="-24.244652"
       y2="21.3936" /><linearGradient
       id="a-1"
       gradientUnits="userSpaceOnUse"
       x1="14.15625"
       x2="8.84375"
       y1="14.15625"
       y2="8.84375"
       gradientTransform="matrix(0.9705883,0,0,0.9705883,0.33823497,0.33823497)"><stop
         offset="0"
         stop-color="#009600"
         id="stop2-2"
         style="stop-color:#ff7f2a;stop-opacity:1" /><stop
         offset="1"
         stop-color="#6edb39"
         id="stop4-0"
         style="stop-color:#d45500;stop-opacity:1" /></linearGradient><linearGradient
       inkscape:collect="always"
       xlink:href="#linearGradient1797-4"
       id="linearGradient1799"
       x1="8"
       y1="-20"
       x2="3"
       y2="-25"
       gradientUnits="userSpaceOnUse"
       gradientTransform="matrix(1.0337838,0,0,1.0337838,5.8141888,34.760134)" /><linearGradient
       inkscape:collect="always"
       id="linearGradient1797-4"><stop
         style="stop-color:#aa0000;stop-opacity:1"
         offset="0"
         id="stop1793-8" /><stop
         style="stop-color:#ff5555;stop-opacity:1"
         offset="1"
         id="stop1795-1" /></linearGradient></defs><sodipodi:namedview
     id="namedview599"
     pagecolor="#ffffff"
     bordercolor="#666666"
     borderopacity="1.0"
     inkscape:pageshadow="2"
     inkscape:pageopacity="0.0"
     inkscape:pagecheckerboard="0"
     inkscape:deskcolor="#d1d1d1"
     showgrid="true"
     inkscape:zoom="25.5"
     inkscape:cx="12.941176"
     inkscape:cy="18"
     inkscape:current-layer="svg597"><inkscape:grid
       type="xygrid"
       id="grid1093" /></sodipodi:namedview><g
     id="g1656"
     transform="matrix(1.5,0,0,1.5,-2.25,0)"><ellipse
       cx="12"
       cy="18.75"
       rx="7.5"
       ry="2.25"
       stroke="url(#a)"
       stroke-width="3"
       id="ellipse169"
       style="fill:none;fill-rule:evenodd;stroke:url(#linearGradient2642);stroke-linecap:round;stroke-linejoin:round" /><ellipse
       cx="12"
       cy="15.812256"
       rx="8.2414637"
       ry="2.937722"
       stroke="#ffffff"
       stroke-width="1.5"
       id="ellipse171"
       style="fill:none;fill-rule:evenodd;stroke-linecap:round;stroke-linejoin:round" /><ellipse
       cx="12"
       cy="14.25"
       rx="7.5"
       ry="2.25"
       stroke="url(#d)"
       stroke-width="3"
       id="ellipse173"
       style="fill:none;fill-rule:evenodd;stroke:url(#d);stroke-linecap:round;stroke-linejoin:round" /><ellipse
       cx="12"
       cy="11.312256"
       rx="8.2414637"
       ry="2.937722"
       stroke="#ffffff"
       stroke-width="1.5"
       id="ellipse175"
       style="fill:none;fill-rule:evenodd;stroke-linecap:round;stroke-linejoin:round" /><ellipse
       cx="12"
       cy="9.75"
       rx="7.5"
       ry="2.25"
       stroke="url(#c)"
       stroke-width="3"
       id="ellipse177"
       style="fill:none;fill-rule:evenodd;stroke:url(#c);stroke-linecap:round;stroke-linejoin:round" /><ellipse
       cx="12"
       cy="6.8121953"
       rx="8.2414637"
       ry="2.937722"
       stroke="#ffffff"
       stroke-width="1.5"
       id="ellipse179"
       style="fill:none;fill-rule:evenodd;stroke-linecap:round;stroke-linejoin:round" /><ellipse
       cx="12"
       cy="5.2500005"
       fill="#80b3ff"
       rx="8.25"
       ry="3"
       stroke="url(#a)"
       stroke-width="1.5"
       id="ellipse183"
       style="fill-rule:evenodd;stroke:url(#linearGradient1246);stroke-linecap:round;stroke-linejoin:round" /></g><g
     id="g2244"
     transform="matrix(2.111111,0,0,2.111111,2.2222235,2.2222235)"><circle
       style="fill:url(#linearGradient1799);fill-opacity:1;stroke:#ffffff;stroke-width:0.72973;stroke-linecap:round;stroke-linejoin:round;stroke-miterlimit:4;stroke-dasharray:none;stroke-dashoffset:1.49998;stroke-opacity:1"
       id="path883-7"
       cx="11.5"
       cy="11.5"
       transform="matrix(0,1,1,0,0,0)"
       r="4.1351352" /><g
       id="g2238"
       transform="matrix(0.97227187,0,0,0.97227187,0.31887349,0.31887398)"
       style="stroke-width:1.02852"><path
         style="fill:none;stroke:#ffffff;stroke-width:1.28565;stroke-linecap:round;stroke-linejoin:miter;stroke-miterlimit:4;stroke-dasharray:none;stroke-opacity:1"
         d="m 12.914214,10.085786 -2.828428,2.828427"
         id="path1522"
         sodipodi:nodetypes="cc" /><path
         style="fill:none;stroke:#ffffff;stroke-width:1.28565;stroke-linecap:round;stroke-linejoin:miter;stroke-miterlimit:4;stroke-dasharray:none;stroke-opacity:1"
         d="M 12.914214,12.914213 10.085786,10.085786"
         id="path1215"
         sodipodi:nodetypes="cc" /></g></g></svg>
