<?xml version="1.0" encoding="UTF-8" standalone="no"?>
<svg
   height="24"
   width="24"
   version="1.1"
   id="svg1464"
   sodipodi:docname="WiFi_01_24.svg"
   inkscape:export-filename="WiFi_01_24.png"
   inkscape:export-xdpi="96"
   inkscape:export-ydpi="96"
   inkscape:version="1.2-beta (1b65182ce9, 2022-04-05)"
   xmlns:inkscape="http://www.inkscape.org/namespaces/inkscape"
   xmlns:sodipodi="http://sodipodi.sourceforge.net/DTD/sodipodi-0.dtd"
   xmlns="http://www.w3.org/2000/svg"
   xmlns:svg="http://www.w3.org/2000/svg">
  <defs
     id="defs1468" />
  <sodipodi:namedview
     id="namedview1466"
     pagecolor="#ffffff"
     bordercolor="#666666"
     borderopacity="1.0"
     inkscape:pageshadow="2"
     inkscape:pageopacity="0.0"
     inkscape:pagecheckerboard="0"
     inkscape:deskcolor="#d1d1d1"
     showgrid="true"
     inkscape:zoom="38.25"
     inkscape:cx="10.470588"
     inkscape:cy="12"
     inkscape:current-layer="svg1464">
    <inkscape:grid
       type="xygrid"
       id="grid1612" />
  </sodipodi:namedview>
  <g
     id="g2080"
     transform="matrix(1.5000101,0,0,1.5000101,-0.00301032,9.0141185e-4)">
    <circle
       style="fill:#00aad4;stroke-linecap:round;stroke-linejoin:round;stroke-dashoffset:1.49998"
       id="path355"
       cx="3.5"
       cy="12.500191"
       r="2.5" />
    <path
       id="path511"
       style="fill:none;stroke:#00aad4;stroke-linecap:round;stroke-linejoin:round;stroke-dashoffset:1.49998"
       inkscape:transform-center-x="-3.2535488"
       inkscape:transform-center-y="-3.2496422"
       transform="rotate(-90)"
       d="m -7.5,1.5 0.003,2.0039063 a 5,5 0 0 1 -5,5 L -14.5,8.5" />
    <path
       id="path1865"
       style="fill:none;stroke:#00aad4;stroke-linecap:round;stroke-linejoin:round;stroke-dashoffset:1.49998"
       inkscape:transform-center-x="-3.2535488"
       inkscape:transform-center-y="-3.2496422"
       transform="rotate(-90)"
       d="m -4.5,1.5 0.003,2.0039063 a 8,8 0 0 1 -8,7.9999997 L -14.5,11.5" />
    <path
       style="fill:none;stroke:#00aad4;stroke-width:1px;stroke-linecap:round;stroke-linejoin:miter;stroke-opacity:1"
       d="M 1.5,1.5 3.5019532,1.4985 C 9.5790385,1.4969999 14.503906,6.4218678 14.503906,12.497 L 14.5,14.5"
       id="path1870"
       sodipodi:nodetypes="ccc" />
  </g>
</svg>
