<?xml version="1.0" encoding="UTF-8" standalone="no"?>
<svg
   width="48"
   height="48"
   version="1.1"
   viewBox="0 0 48 48"
   id="svg23"
   sodipodi:docname="tsynedit_200.svg"
   inkscape:version="1.3.2 (091e20e, 2023-11-25, custom)"
   xmlns:inkscape="http://www.inkscape.org/namespaces/inkscape"
   xmlns:sodipodi="http://sodipodi.sourceforge.net/DTD/sodipodi-0.dtd"
   xmlns="http://www.w3.org/2000/svg"
   xmlns:svg="http://www.w3.org/2000/svg">
  <sodipodi:namedview
     id="namedview23"
     pagecolor="#ffffff"
     bordercolor="#000000"
     borderopacity="0.25"
     inkscape:showpageshadow="2"
     inkscape:pageopacity="0.0"
     inkscape:pagecheckerboard="0"
     inkscape:deskcolor="#d1d1d1"
     showgrid="true"
     inkscape:current-layer="svg23">
    <inkscape:grid
       id="grid23"
       units="px"
       originx="0"
       originy="0"
       spacingx="0.5"
       spacingy="0.5"
       empcolor="#0099e5"
       empopacity="0.30196078"
       color="#0099e5"
       opacity="0.14901961"
       empspacing="2"
       dotted="false"
       gridanglex="30"
       gridanglez="30"
       visible="true" />
  </sodipodi:namedview>
  <defs
     id="defs10">
    <linearGradient
       id="c"
       x1="34"
       x2="37"
       y1="1029.3622"
       y2="1029.3622"
       gradientTransform="matrix(2.3333336,0,0,1.8557408,-48.892216,-1935.1033)"
       gradientUnits="userSpaceOnUse">
      <stop
         stop-color="#999999"
         offset="0"
         id="stop1" />
      <stop
         stop-color="#ffffff"
         offset=".49999997"
         id="stop2" />
      <stop
         stop-color="#999999"
         offset="1"
         id="stop3" />
    </linearGradient>
    <linearGradient
       id="b"
       x1="34"
       x2="37"
       y1="1027.3622"
       y2="1027.3622"
       gradientTransform="matrix(2.3333336,0,0,1.8557408,-48.892216,-1935.1033)"
       gradientUnits="userSpaceOnUse">
      <stop
         stop-color="#aa0000"
         offset="0"
         id="stop4" />
      <stop
         stop-color="#ff0000"
         offset=".51070523"
         id="stop5" />
      <stop
         stop-color="#aa0000"
         offset="1"
         id="stop6" />
    </linearGradient>
    <linearGradient
       id="a"
       x1="34"
       x2="37"
       y1="1033.8622"
       y2="1033.8622"
       gradientTransform="matrix(2.3333336,0,0,1.8557408,-48.892216,-1935.1033)"
       gradientUnits="userSpaceOnUse">
      <stop
         stop-color="#a05a2c"
         offset="0"
         id="stop7" />
      <stop
         stop-color="#ffff00"
         offset=".26457807"
         id="stop8" />
      <stop
         stop-color="#ffff00"
         offset=".75078517"
         id="stop9" />
      <stop
         stop-color="#a05a2c"
         offset="1"
         id="stop10" />
    </linearGradient>
  </defs>
  <rect
     x="2.4999995"
     y="2.4999826"
     width="41"
     height="43"
     fill="#ffffff"
     fill-rule="evenodd"
     stroke="#2a7efe"
     stroke-linecap="square"
     stroke-linejoin="round"
     stroke-width="0.999999"
     style="paint-order:normal"
     id="rect10" />
  <rect
     x="3"
     y="2.9999826"
     width="7"
     height="42.000019"
     fill="#b3b3b3"
     fill-rule="evenodd"
     style="paint-order:normal"
     id="rect11" />
  <rect
     transform="rotate(45)"
     x="30.44113"
     y="-26.729637"
     width="7.000001"
     height="3.711514"
     fill="url(#c)"
     fill-rule="evenodd"
     style="fill:url(#c);paint-order:normal"
     id="rect12" />
  <rect
     transform="rotate(45)"
     x="30.44113"
     y="-30.441124"
     width="7.000001"
     height="3.711514"
     fill="url(#b)"
     fill-rule="evenodd"
     style="fill:url(#b);paint-order:normal"
     id="rect13" />
  <rect
     transform="rotate(45)"
     x="30.44113"
     y="-23.018211"
     width="7.000001"
     height="12.990217"
     fill="url(#a)"
     fill-rule="evenodd"
     style="fill:url(#a);paint-order:normal"
     id="rect14" />
  <path
     d="m 28.61596,14.4342 -1.525305,3.7223 2.75148,2.7514 3.723573,-1.5239 z"
     fill="#d38d5f"
     fill-rule="evenodd"
     id="path14" />
  <path
     d="m 27.090655,18.1565 2.75148,2.7514 L 27,22 26,21 Z"
     fill="#333333"
     fill-rule="evenodd"
     id="path15" />
  <path
     d="m 28.000096,24.9999 h 11"
     fill="none"
     stroke="#666666"
     stroke-width="2"
     id="path16" />
  <path
     d="m 30.000096,28.9999 h 8"
     fill="none"
     stroke="#2a7fff"
     stroke-width="2"
     id="path17" />
  <path
     d="m 30.000096,32.9999 h 8"
     fill="none"
     stroke="#666666"
     stroke-width="2"
     id="path18" />
  <path
     d="m 28.000096,36.9999 h 11"
     fill="none"
     stroke="#d45500"
     stroke-width="2"
     id="path19" />
  <path
     d="M 17.999998,32.9026 V 38.2 M 12.800025,32.0926 V 38.2 h 10.399746 v -6.1074"
     fill="none"
     stroke="#2c5aa0"
     stroke-linecap="round"
     stroke-linejoin="round"
     stroke-width="1.60005"
     id="path20" />
  <path
     d="M 12.800025,18.2 H 23.199771"
     fill="none"
     stroke="#2c5aa0"
     stroke-linecap="round"
     stroke-linejoin="round"
     stroke-width="1.60005"
     id="path21" />
  <path
     d="M 23.199971,11.8089 H 12.800225 m 0,3.677 V 8.132"
     fill="none"
     stroke="#2c5aa0"
     stroke-linecap="round"
     stroke-linejoin="round"
     stroke-width="1.60005"
     id="path22" />
  <path
     d="m 18.000398,22.3994 c 2.6037,0 5.1995,1.2001 5.1995,3.8002 v 2.6002 h -10.4 v -2.6002 c 0,-2.6001 2.5968,-3.8002 5.2005,-3.8002 z"
     fill="none"
     stroke="#2c5aa0"
     stroke-linecap="round"
     stroke-linejoin="round"
     stroke-width="1.60008"
     id="path23" />
</svg>
