<?xml version="1.0" encoding="UTF-8" standalone="no"?>
<svg
   height="36"
   width="36"
   version="1.1"
   id="svg391"
   sodipodi:docname="Camera_01_36.svg"
   inkscape:export-filename="Camera_01_36.png"
   inkscape:export-xdpi="96"
   inkscape:export-ydpi="96"
   inkscape:version="1.2-beta (1b65182ce9, 2022-04-05)"
   xmlns:inkscape="http://www.inkscape.org/namespaces/inkscape"
   xmlns:sodipodi="http://sodipodi.sourceforge.net/DTD/sodipodi-0.dtd"
   xmlns="http://www.w3.org/2000/svg"
   xmlns:svg="http://www.w3.org/2000/svg">
  <defs
     id="defs395" />
  <sodipodi:namedview
     id="namedview393"
     pagecolor="#ffffff"
     bordercolor="#666666"
     borderopacity="1.0"
     inkscape:pageshadow="2"
     inkscape:pageopacity="0.0"
     inkscape:pagecheckerboard="0"
     inkscape:deskcolor="#d1d1d1"
     showgrid="true"
     inkscape:zoom="25.5"
     inkscape:cx="17.980392"
     inkscape:cy="18"
     inkscape:current-layer="g1215">
    <inkscape:grid
       type="xygrid"
       id="grid1168" />
  </sodipodi:namedview>
  <g
     fill="none"
     stroke="#00aad4"
     id="g14"
     transform="matrix(2.25,0,0,2.25,0,1.5000001)">
    <g
       id="g1215">
      <g
         id="g1779">
        <g
           stroke-linecap="round"
           id="g8" />
        <path
           d="m 6,1.6111111 c -0.5539994,0 -0.8676772,0.5001137 -1,1 L 4.5,4.5 h -3 c -0.55399945,0 -1,0.4460006 -1,1 v 7 c 0,0.553999 0.44600055,1 1,1 h 13 c 0.553999,0 1,-0.446001 1,-1 v -7 c 0,-0.5539994 -0.446001,-1 -1,-1 h -3 L 11,2.6111111 c -0.151934,-0.4821012 -0.446001,-1 -1,-1 z"
           stroke-linejoin="round"
           id="path2"
           sodipodi:nodetypes="sscssssssssccss" />
        <circle
           cx="8"
           cy="8.5"
           r="3.25"
           stroke-linejoin="round"
           id="circle4" />
        <path
           d="m 2.6111111,6.5 v 5.166667"
           id="path6"
           sodipodi:nodetypes="cc"
           style="stroke-linecap:round" />
        <path
           d="M 13.388889,6 V 7"
           id="path10"
           sodipodi:nodetypes="cc" />
        <path
           d="M 7,3.3888888 H 9"
           stroke-linecap="round"
           id="path12"
           sodipodi:nodetypes="cc" />
      </g>
    </g>
  </g>
</svg>
