<svg width="48" height="48" version="1.1" viewBox="0 0 48 48" xmlns="http://www.w3.org/2000/svg">
 <defs>
  <linearGradient id="a" x1="17.658785" x2="11.341217" y1="17.658785" y2="11.341217" gradientTransform="matrix(2.3383569,0,0,2.3383568,1.0938201,1.0938227)" gradientUnits="userSpaceOnUse">
   <stop stop-color="#009600" offset="0"/>
   <stop stop-color="#6edb39" offset="1"/>
  </linearGradient>
 </defs>
 <g stroke="#ffffff" stroke-linecap="round">
  <ellipse transform="matrix(0,1,1,0,0,0)" cx="35" cy="35" rx="11.818182" ry="11.818181" fill="url(#a)" stroke-dashoffset="1.49998" stroke-linejoin="round" stroke-width="2.36364"/>
  <path d="m38.113514 31.364271-6.74935-1.4e-4 -1.4e-4 6.74963" fill="none" stroke-linejoin="round" stroke-width="2.7272"/>
  <path d="m32.18327 32.183277 7.636362 7.636362" fill="none" stroke-width="3.27272"/>
 </g>
</svg>
