<?xml version="1.0" encoding="UTF-8" standalone="no"?>
<svg
   height="36"
   viewBox="0 0 9.5249997 9.5250005"
   width="36"
   version="1.1"
   id="svg16"
   sodipodi:docname="Chart_05_36.svg"
   inkscape:export-filename="Chart_05_36.png"
   inkscape:export-xdpi="96"
   inkscape:export-ydpi="96"
   inkscape:version="1.2 (dc2aedaf03, 2022-05-15)"
   xmlns:inkscape="http://www.inkscape.org/namespaces/inkscape"
   xmlns:sodipodi="http://sodipodi.sourceforge.net/DTD/sodipodi-0.dtd"
   xmlns:xlink="http://www.w3.org/1999/xlink"
   xmlns="http://www.w3.org/2000/svg"
   xmlns:svg="http://www.w3.org/2000/svg">
  <defs
     id="defs20">
    <linearGradient
       inkscape:collect="always"
       id="linearGradient6257">
      <stop
         style="stop-color:#ffffff;stop-opacity:1"
         offset="0"
         id="stop6255" />
      <stop
         style="stop-color:#ffd42a;stop-opacity:1;"
         offset="1"
         id="stop6253" />
    </linearGradient>
    <linearGradient
       inkscape:collect="always"
       id="linearGradient6247">
      <stop
         style="stop-color:#ffffff;stop-opacity:1"
         offset="0"
         id="stop6245" />
      <stop
         style="stop-color:#ff5555;stop-opacity:1;"
         offset="1"
         id="stop6243" />
    </linearGradient>
    <linearGradient
       inkscape:collect="always"
       id="linearGradient6237">
      <stop
         style="stop-color:#ffffff;stop-opacity:1"
         offset="0"
         id="stop6235" />
      <stop
         style="stop-color:#87decd;stop-opacity:1;"
         offset="1"
         id="stop6233" />
    </linearGradient>
    <linearGradient
       inkscape:collect="always"
       xlink:href="#linearGradient6237"
       id="linearGradient6239"
       x1="1.3229164"
       y1="6.3499996"
       x2="3.7041661"
       y2="6.3499996"
       gradientUnits="userSpaceOnUse" />
    <linearGradient
       inkscape:collect="always"
       xlink:href="#linearGradient6247"
       id="linearGradient6249"
       x1="3.7041664"
       y1="5.55625"
       x2="6.0854162"
       y2="5.55625"
       gradientUnits="userSpaceOnUse" />
    <linearGradient
       inkscape:collect="always"
       xlink:href="#linearGradient6257"
       id="linearGradient6259"
       x1="6.0854166"
       y1="4.7625"
       x2="8.4666667"
       y2="4.7625"
       gradientUnits="userSpaceOnUse" />
  </defs>
  <sodipodi:namedview
     id="namedview18"
     pagecolor="#ffffff"
     bordercolor="#666666"
     borderopacity="1.0"
     inkscape:showpageshadow="2"
     inkscape:pageopacity="0.0"
     inkscape:pagecheckerboard="0"
     inkscape:deskcolor="#d1d1d1"
     showgrid="true"
     inkscape:zoom="25.5"
     inkscape:cx="17.137255"
     inkscape:cy="18"
     inkscape:current-layer="svg16">
    <inkscape:grid
       type="xygrid"
       id="grid6627" />
  </sodipodi:namedview>
  <path
     d="M 3.5553376,3.3238283 H 1.4717449 V 9.376171 h 2.0835927 z"
     fill="#87decd"
     stroke="#5fd3bc"
     id="path2"
     style="stroke-width:0.297657;stroke-linecap:round;stroke-dashoffset:1.49998;fill-opacity:1;fill:url(#linearGradient6239)" />
  <path
     d="M 8.3178382,0.14882847 H 6.2342451 V 9.3761715 h 2.0835931 z"
     fill="#ffd42a"
     stroke="#ffcc00"
     id="path4"
     style="stroke-width:0.297657;stroke-linecap:round;stroke-dashoffset:1.49998;fill-opacity:1;fill:url(#linearGradient6259)" />
  <path
     d="M 5.9365877,1.7363285 H 3.8529949 v 7.639843 h 2.0835928 z"
     fill="#ff5555"
     stroke="#ff5252"
     id="path6"
     style="stroke-width:0.297657;stroke-linecap:round;stroke-dashoffset:1.49998;fill-opacity:1;fill:url(#linearGradient6249)" />
  <g
     transform="scale(.26458334)"
     id="g14">
    <path
       d="m27.682321 14.001603c-.60129-.01836-1.186275.285389-1.508806.829402l-1.010282 1.70292-.330878-.0044-1.00587-1.694097c-.430275-.723534-1.326605-1.023465-2.104387-.701473l-2.086739.864695c-.777657.322292-1.199993 1.165-.992635 1.980859l.485288 1.914682-.233821.233821-1.914682-.4897c-.816986-.208816-1.663133.213343-1.985271.992635l-.864695 2.08674c-.323257.778828-.02389 1.678757.701462 2.108798l1.702921 1.010282-.0044.330878-1.698509 1.00587c-.723523.430276-1.019042 1.326606-.69705 2.104387l.864695 2.086739c.322292.777657 1.165 1.199993 1.980859.992635l1.914682-.485288.233821.233821-.4897 1.914683c-.208817.816985.213344 1.663132.992635 1.98527l2.08674.864695c.778829.323255 1.678757.02389 2.108798-.701462l1.010282-1.70292.330878.0044 1.00587 1.698508c.430276.723513 1.326606 1.019033 2.104387.697041l2.086739-.864696c.777657-.322291 1.199993-1.165.992635-1.980858l-.485288-1.914683.233821-.233821 1.914683.4897c.816985.208816 1.663132-.213343 1.98527-.992635l.864695-2.086739c.323257-.778829.02389-1.678758-.701462-2.108799l-1.70292-1.010282.0044-.326466 1.698509-1.010282c.723523-.430276 1.019043-1.326605.697051-2.104387l-.864697-2.086717c-.322291-.777657-1.165-1.199993-1.980858-.992635l-1.914683.485288-.233821-.233821.4897-1.914682c.208816-.816986-.213343-1.663133-.992635-1.985271l-2.086739-.864695c-.194708-.08081-.399563-.121818-.599993-.12794zm-2.682321 9.3043a1.6940972 1.6940972 0 0 1 1.694097 1.694097 1.6940972 1.6940972 0 0 1 -1.694097 1.694097 1.6940972 1.6940972 0 0 1 -1.694097-1.694097 1.6940972 1.6940972 0 0 1 1.694097-1.694097z"
       fill="#fff"
       id="path10" />
    <path
       d="m20.282855 16.563065.725373 2.8464-1.596991 1.597434-2.850153-.724733-.864311 2.086632 2.527826 1.502898-.000313 2.258801-2.525624 1.499792.864403 2.086856 2.846399-.725373 1.597435 1.596991-.724733 2.850153 2.086632.864311 1.502898-2.527826 2.258801.000314 1.499792 2.525624 2.086856-.864404-.725373-2.846399 1.596991-1.597435 2.850153.724734.864311-2.086633-2.527826-1.502898.000314-2.258801 2.525624-1.499792-.864404-2.086856-2.846399.725374-1.597435-1.596992.724734-2.850153-2.086633-.864311-1.502898 2.527826-2.258801-.000313-1.499792-2.525625zm3.420539 5.306652a3.3881945 3.3881945 0 0 1 4.42689 1.833677 3.3881945 3.3881945 0 0 1 -1.833678 4.42689 3.3881945 3.3881945 0 0 1 -4.426889-1.833678 3.3881945 3.3881945 0 0 1 1.833677-4.426889z"
       fill="#3771c8"
       fill-opacity=".996078"
       id="path12" />
  </g>
</svg>
