<?xml version="1.0" encoding="UTF-8" standalone="no"?>
<svg
   height="48"
   viewBox="0 0 12.7 12.700001"
   width="48"
   version="1.1"
   id="svg746"
   sodipodi:docname="Sound_05_48.svg"
   inkscape:version="1.2 (dc2aedaf03, 2022-05-15)"
   inkscape:export-filename="Sound_05_48.png"
   inkscape:export-xdpi="96"
   inkscape:export-ydpi="96"
   xmlns:inkscape="http://www.inkscape.org/namespaces/inkscape"
   xmlns:sodipodi="http://sodipodi.sourceforge.net/DTD/sodipodi-0.dtd"
   xmlns="http://www.w3.org/2000/svg"
   xmlns:svg="http://www.w3.org/2000/svg">
  <defs
     id="defs750" />
  <sodipodi:namedview
     id="namedview748"
     pagecolor="#ffffff"
     bordercolor="#666666"
     borderopacity="1.0"
     inkscape:showpageshadow="2"
     inkscape:pageopacity="0.0"
     inkscape:pagecheckerboard="0"
     inkscape:deskcolor="#d1d1d1"
     showgrid="true"
     inkscape:zoom="19.125"
     inkscape:cx="21.385621"
     inkscape:cy="24"
     inkscape:current-layer="svg746">
    <inkscape:grid
       type="xygrid"
       id="grid1256" />
  </sodipodi:namedview>
  <g
     id="g1560"
     transform="scale(3.0000003)">
    <path
       id="path353"
       style="fill:none;stroke:#00aad4;stroke-width:0.396875;stroke-linecap:round;stroke-linejoin:round;stroke-dasharray:none"
       d="m 1.6536458,0.86045096 c 10e-8,-0.14164105 0.088251,-0.27252278 0.2315105,-0.34334332 0.1432591,-0.0708205 0.3197616,-0.0708205 0.4630208,-10e-9 0.1432592,0.0708205 0.2315105,0.20170228 0.2315104,0.34334333 V 1.9176742 c 1e-7,0.1416411 -0.088251,0.2725228 -0.2315104,0.3433435 -0.1432592,0.07082 -0.3197617,0.07082 -0.4630208,-10e-8 C 1.7418972,2.190197 1.6536459,2.0593153 1.6536458,1.9176742 Z"
       sodipodi:nodetypes="cssccsscc" />
    <path
       style="fill:none;stroke:#00aad4;stroke-width:0.264583;stroke-linecap:round;stroke-linejoin:round"
       id="path355"
       sodipodi:type="arc"
       sodipodi:cx="2.1166666"
       sodipodi:cy="1.8520833"
       sodipodi:rx="1.190625"
       sodipodi:ry="1.190625"
       sodipodi:start="0"
       sodipodi:end="3.1415927"
       sodipodi:open="true"
       sodipodi:arc-type="arc"
       d="m 3.3072915,1.8520833 a 1.190625,1.190625 0 0 1 -0.5953125,1.0311115 1.190625,1.190625 0 0 1 -1.190625,0 1.190625,1.190625 0 0 1 -0.5953124,-1.0311115" />
    <path
       style="fill:none;stroke:#00aad4;stroke-width:0.529167;stroke-linecap:butt;stroke-linejoin:miter;stroke-dasharray:none;stroke-opacity:1"
       d="m 2.1166666,3.0427083 v 0.79375"
       id="path514" />
    <path
       style="fill:none;stroke:#00aad4;stroke-width:0.264583px;stroke-linecap:round;stroke-linejoin:miter;stroke-opacity:1"
       d="M 1.4552083,3.8364583 H 2.778125"
       id="path1071" />
  </g>
</svg>
