<svg width="256" height="256" version="1.1" viewBox="0 0 256 256" xmlns="http://www.w3.org/2000/svg">
 <defs>
  <linearGradient id="c" x1="23" x2="23" y1="6.5" y2="15" gradientTransform="matrix(10.297717 10.303439 -10.301019 10.306741 -.29221455 -196.99798)" gradientUnits="userSpaceOnUse">
   <stop stop-color="#89a02c" offset="0"/>
   <stop stop-color="#445016" offset="1"/>
  </linearGradient>
  <linearGradient id="b" x1="25.714283" x2="25.714283" y1="15.5" y2="6.2142854" gradientTransform="matrix(10.297717 10.303439 -10.301019 10.306741 -.29221455 -196.99798)" gradientUnits="userSpaceOnUse">
   <stop stop-color="#668000" offset="0"/>
   <stop stop-color="#aad400" offset="1"/>
  </linearGradient>
  <radialGradient id="a" cx="21.957434" cy="5.9936466" r="3.105469" gradientTransform="matrix(10.301066,10.307735,-7.7283018,7.7283026,-11.864262,-184.6521)" gradientUnits="userSpaceOnUse">
   <stop stop-color="#803300" offset="0"/>
   <stop stop-color="#d45500" offset="1"/>
  </radialGradient>
 </defs>
 <path d="m199.99998 80.000017 40-16" fill="none" stroke="#d4aa00" stroke-linecap="round" stroke-linejoin="round" stroke-width="16"/>
 <path d="m175.99998 56.000017 16-39.999996" fill="none" stroke="#d4aa00" stroke-linecap="round" stroke-linejoin="round" stroke-width="16"/>
 <path d="m200.505 55.444513a72.960426 94.717289 44.937656 0 0-46.5053-17.382379l-0.0104 63.923766 64.04919-0.0104a72.960426 94.717289 44.937656 0 0-17.53349-46.530987z" fill="url(#a)" stroke-linejoin="round" stroke-width="49.9696"/>
 <path d="m127.99999 16.000028-16 15.999998v31.999999" fill="none" stroke="#aca793" stroke-linecap="round" stroke-linejoin="round" stroke-width="16"/>
 <path d="m16.000019 128.41809 15.999982-16.41807h31.999997" fill="none" stroke="#aca793" stroke-linecap="round" stroke-linejoin="round" stroke-width="16"/>
 <path d="m40.000001 64.000021h23.999997l36.080782 24.952131" fill="none" stroke="#aca793" stroke-linecap="round" stroke-linejoin="round" stroke-width="16"/>
 <path d="m239.99998 128.00002-16.00001 16h-31.99999" fill="none" stroke="#aca793" stroke-linecap="round" stroke-linejoin="round" stroke-width="16"/>
 <path d="m127.58188 239.99998 16.4181-15.99997 1e-5 -32" fill="none" stroke="#aca793" stroke-linecap="round" stroke-linejoin="round" stroke-width="16"/>
 <path d="m191.99997 216 1e-5 -23.99998-24.98404-36.07552" fill="none" stroke="#aca793" stroke-linecap="round" stroke-linejoin="round" stroke-width="16"/>
 <path d="m218.03873 101.65363-63.72737 0.01 0.01-63.561464a72.960426 94.717289 44.937656 0 0-72.342215 32.738299 72.960426 94.717289 44.937656 0 0-15.387583 118.59148 72.960426 94.717289 44.937656 0 0 118.52564-15.39615 72.960426 94.717289 44.937656 0 0 32.92134-72.38235z" fill="url(#b)" stroke-linejoin="round" stroke-width="49.9696"/>
 <path d="m159.30093 96.671484-87.558664 87.607306" fill="#c83737" stroke="url(#c)" stroke-linecap="round" stroke-linejoin="round" stroke-width="17.2304"/>
</svg>
