<?xml version="1.0" encoding="UTF-8" standalone="no"?>
<svg
   height="36"
   viewBox="0 0 9.5249997 9.5250005"
   width="36"
   version="1.1"
   id="svg500"
   sodipodi:docname="Box_01_36.svg"
   inkscape:version="1.2.1 (9c6d41e410, 2022-07-14)"
   inkscape:export-filename="Box_01_36.png"
   inkscape:export-xdpi="96"
   inkscape:export-ydpi="96"
   xmlns:inkscape="http://www.inkscape.org/namespaces/inkscape"
   xmlns:sodipodi="http://sodipodi.sourceforge.net/DTD/sodipodi-0.dtd"
   xmlns="http://www.w3.org/2000/svg"
   xmlns:svg="http://www.w3.org/2000/svg">
  <defs
     id="defs504" />
  <sodipodi:namedview
     id="namedview502"
     pagecolor="#ffffff"
     bordercolor="#666666"
     borderopacity="1.0"
     inkscape:showpageshadow="2"
     inkscape:pageopacity="0.0"
     inkscape:pagecheckerboard="0"
     inkscape:deskcolor="#d1d1d1"
     showgrid="true"
     inkscape:zoom="25.5"
     inkscape:cx="18"
     inkscape:cy="18"
     inkscape:current-layer="svg500">
    <inkscape:grid
       type="xygrid"
       id="grid1268" />
  </sodipodi:namedview>
  <g
     id="g1856">
    <path
       style="fill:none;stroke:#00aad4;stroke-width:0.297657;stroke-linecap:butt;stroke-linejoin:miter;stroke-dasharray:none;stroke-opacity:1"
       d="M 1.7859372,1.6205724 V 3.40651 L 1.4882808,4.7823438 H 0.29765588 L 1.4882808,1.6205724 Z"
       id="path2834"
       sodipodi:nodetypes="cccccc" />
    <path
       style="fill:none;stroke:#00aad4;stroke-width:0.297657;stroke-linecap:butt;stroke-linejoin:miter;stroke-dasharray:none;stroke-opacity:1"
       d="M 7.7390629,1.6205726 V 3.40651 L 8.036719,4.7823438 H 9.2273442 L 8.036719,1.6205726 Z"
       id="path2838"
       sodipodi:nodetypes="cccccc" />
    <path
       style="fill:none;stroke:#00aad4;stroke-width:0.297657;stroke-linecap:butt;stroke-linejoin:miter;stroke-dasharray:none;stroke-opacity:1"
       d="M 1.7859372,1.6205724 H 7.7390626 V 3.40651 H 1.7859372 V 1.6205724"
       id="path2836"
       sodipodi:nodetypes="ccccc" />
    <path
       style="fill:none;stroke:#00aad4;stroke-width:0.595312px;stroke-linecap:round;stroke-linejoin:round;stroke-opacity:1"
       d="M 4.7625,7.6398442 H 0.29765588 V 4.7955726 H 3.2742185 c 0.5953127,1.4221361 2.3812504,1.4221361 2.9765628,0 h 2.9765626 l 3e-7,2.8442716 H 4.7625"
       id="path365"
       sodipodi:nodetypes="cccccccc" />
    <path
       style="fill:none;stroke:#00aad4;stroke-width:0.595312px;stroke-linecap:round;stroke-linejoin:round;stroke-opacity:1"
       d="M 0.29765588,4.7823438 1.4882808,1.6205726 H 8.036719 l 1.1906249,3.1617712"
       id="path463"
       sodipodi:nodetypes="cccc" />
  </g>
</svg>
