<?xml version="1.0" encoding="UTF-8" standalone="no"?>
<svg
   height="64"
   width="64"
   version="1.1"
   id="svg1986"
   sodipodi:docname="04 Uninstall_200.svg"
   inkscape:export-filename="04 Uninstall_200.png"
   inkscape:export-xdpi="96"
   inkscape:export-ydpi="96"
   inkscape:version="1.2.1 (9c6d41e410, 2022-07-14)"
   xmlns:inkscape="http://www.inkscape.org/namespaces/inkscape"
   xmlns:sodipodi="http://sodipodi.sourceforge.net/DTD/sodipodi-0.dtd"
   xmlns:xlink="http://www.w3.org/1999/xlink"
   xmlns="http://www.w3.org/2000/svg"
   xmlns:svg="http://www.w3.org/2000/svg">
  <defs
     id="defs1990">
    <linearGradient
       id="linearGradient1347"
       x1="8.8369999"
       x2="15.576"
       y1="7.8053999"
       y2="10.838"
       gradientTransform="matrix(1.983,0,0,1.983,-0.35541,0.68892)"
       gradientUnits="userSpaceOnUse"
       xlink:href="#linearGradient933-3" />
    <linearGradient
       id="linearGradient933-3">
      <stop
         stop-color="#ffe991"
         offset="0"
         id="stop782" />
      <stop
         stop-color="#f5c400"
         offset="1"
         id="stop784" />
    </linearGradient>
    <linearGradient
       id="linearGradient1351"
       x1="8.8369999"
       x2="15.576"
       y1="7.8013"
       y2="10.834"
       gradientTransform="matrix(-1.983,0,0,1.983,33.356,0.69694)"
       gradientUnits="userSpaceOnUse"
       xlink:href="#linearGradient933-3" />
    <linearGradient
       id="linearGradient1355"
       x1="1.4239"
       x2="15.576"
       y1="4.4317002"
       y2="4.4317002"
       gradientTransform="matrix(-1.983,0,0,1.983,33.356,0.69694)"
       gradientUnits="userSpaceOnUse">
      <stop
         stop-color="#ffe478"
         offset="0"
         id="stop788" />
      <stop
         stop-color="#fff2c0"
         offset="1"
         id="stop790" />
    </linearGradient>
  </defs>
  <sodipodi:namedview
     id="namedview1988"
     pagecolor="#ffffff"
     bordercolor="#666666"
     borderopacity="1.0"
     inkscape:showpageshadow="2"
     inkscape:pageopacity="0.0"
     inkscape:pagecheckerboard="0"
     inkscape:deskcolor="#d1d1d1"
     showgrid="true"
     inkscape:zoom="14.34375"
     inkscape:cx="31.965142"
     inkscape:cy="32"
     inkscape:current-layer="svg1986">
    <inkscape:grid
       type="xygrid"
       id="grid4572" />
  </sodipodi:namedview>
  <linearGradient
     id="a"
     gradientUnits="userSpaceOnUse"
     x1="22"
     x2="28"
     y1="18.02074"
     y2="23.02074">
    <stop
       offset="0"
       stop-color="#ffe991"
       id="stop1923" />
    <stop
       offset="1"
       stop-color="#e6b800"
       id="stop1925" />
  </linearGradient>
  <linearGradient
     id="b"
     gradientUnits="userSpaceOnUse"
     x1="8"
     x2="2"
     y1="14.02074"
     y2="20.02074">
    <stop
       offset="0"
       stop-color="#ffea91"
       id="stop1928" />
    <stop
       offset="1"
       stop-color="#e6b900"
       id="stop1930" />
  </linearGradient>
  <linearGradient
     id="c"
     gradientUnits="userSpaceOnUse"
     x1="9"
     x2="27"
     y1="6.02074"
     y2="9.02074">
    <stop
       offset="0"
       stop-color="#fff2c0"
       id="stop1933" />
    <stop
       offset="1"
       stop-color="#ffe478"
       id="stop1935" />
  </linearGradient>
  <linearGradient
     id="d"
     gradientUnits="userSpaceOnUse"
     x1="10.5"
     x2="21.5"
     y1="10.5"
     y2="21.5">
    <stop
       offset="0"
       stop-color="#b9b9b9"
       id="stop1938" />
    <stop
       offset=".30717328"
       stop-color="#f9f9f9"
       id="stop1940" />
    <stop
       offset=".45454547"
       stop-color="#fff"
       id="stop1942" />
    <stop
       offset=".54545456"
       stop-color="#f2f2f2"
       id="stop1944" />
    <stop
       offset="1"
       stop-color="#ccc"
       id="stop1946" />
  </linearGradient>
  <filter
     id="e"
     color-interpolation-filters="sRGB"
     height="1.1825"
     width="1.1825"
     x="-0.091250001"
     y="-0.091250001">
    <feGaussianBlur
       stdDeviation=".4"
       id="feGaussianBlur1949" />
  </filter>
  <g
     transform="matrix(2.000052,0,0,2.000052,-1.0000071,-2.0061199)"
     stroke-width="1.6"
     id="g813">
    <g
       stroke="#ccaa00"
       stroke-linejoin="round"
       id="g801">
      <path
         d="M 16.5,16.552 31.2,9.4846 v 12.695 l -14.7,8.0179 z"
         fill="url(#linearGradient1347)"
         id="path795"
         style="fill:url(#linearGradient1347)" />
      <path
         d="M 16.5,16.166 1.8,9.4844 v 12.695 l 14.7,8.0179 z"
         fill="url(#linearGradient1351)"
         id="path797"
         style="fill:url(#linearGradient1351)" />
      <path
         d="M 16.5,2.803 1.8,9.4846 16.5,16.1662 31.2,9.4846 Z"
         fill="url(#linearGradient1355)"
         id="path799"
         style="fill:url(#linearGradient1355)" />
    </g>
    <g
       fill="none"
       stroke="#5f8dd3"
       stroke-linecap="round"
       id="g811">
      <path
         d="m 9.6846,6.0101 15.115,6.6157"
         id="path803" />
      <path
         d="M 8.2,12.626 23.315,6.0103"
         id="path805" />
      <path
         d="M 8.2,12.626 V 25.588"
         id="path807" />
      <path
         d="M 24.8,12.626 V 25.588"
         id="path809" />
    </g>
  </g>
  <g
     stroke-linecap="round"
     id="g1984">
    <g
       stroke-linejoin="round"
       transform="matrix(2 0 0 2 11.000002 11)"
       id="g1978">
      <path
         d="m-24-10c-2.617994 0-5.219111 1.0784863-7.070312 2.9296875-1.851202 1.8512012-2.929688 4.4523186-2.929688 7.0703125s1.078486 5.2191113 2.929688 7.0703125c1.851201 1.8512012 4.452318 2.9296875 7.070312 2.9296875s5.219111-1.0784863 7.070312-2.9296875c1.851202-1.8512012 2.929688-4.4523186 2.929688-7.0703125s-1.078486-5.2191113-2.929688-7.0703125c-1.851201-1.8512012-4.452318-2.9296875-7.070312-2.9296875zm0 7c-.19635 0 .778514.0969.585938.058594-.192577-.038306.743903.2450615.5625.1699218-.181404-.07514.680836.3864297.517578.2773438-.163259-.109086.593918.5118869.455078.3730468-.13884-.13884.482133.6183369.373047.4550782s.352483.69898142.277343.5175781c-.07514-.1814033.208228.75507674.169922.5625-.038306-.19257694.058594.78228684.058594.5859373s-.0969.77851424-.05859.5859375-.245061.7439033-.169922.5625c.07514-.18140332-.386429.6808368-.277343.5175781s-.511887.5939182-.373047.4550782c.13884-.1388401-.618337.4821328-.455078.3730468.163258-.1090859-.698982.3524835-.517578.2773438.181403-.07514-.755077.2082277-.5625.1699218.192572-.0383058-.782292.0585938-.585942.0585938s-.778514-.0969-.585938-.058594c.192577.038306-.743903-.2450615-.5625-.1699218.181404.07514-.680836-.3864297-.517578-.2773438.163259.109086-.593918-.5118869-.455078-.3730468.13884.13884-.482133-.6183369-.373047-.4550782s-.352483-.69898142-.277343-.5175781c.07514.1814033-.208228-.75507674-.169922-.5625.038306.19257694-.058594-.78228684-.058594-.5859373s.0969-.77851424.05859-.5859375.245061-.7439033.169922-.5625c-.07514.18140332.386429-.6808368.277343-.5175781s.511887-.5939182.373047-.4550782c-.13884.1388401.618337-.4821328.455078-.3730468-.163258.1090859.698982-.3524835.517578-.2773438-.181403.07514.755077-.2082277.5625-.1699218-.192572.0383058.782292-.0585938.585942-.0585938z"
         fill="#fff"
         fill-rule="evenodd"
         stroke="#fff"
         transform="translate(40 16)"
         id="path1972" />
      <path
         d="m16 7a9 9 0 0 0 -9 9 9 9 0 0 0 9 9 9 9 0 0 0 9-9 9 9 0 0 0 -9-9zm0 7a2 2 0 0 1 2 2 2 2 0 0 1 -2 2 2 2 0 0 1 -2-2 2 2 0 0 1 2-2z"
         fill="url(#d)"
         fill-rule="evenodd"
         stroke="#939dac"
         id="path1974" />
      <circle
         cx="16"
         cy="16"
         fill="none"
         filter="url(#e)"
         r="8"
         stroke="#fff"
         id="circle1976" />
    </g>
    <path
       d="m25.496486 10.503514 5-5.0000004m0 5.0000004-5-5.0000004"
       fill="none"
       stroke="#fff"
       stroke-width="3.5"
       transform="matrix(2.9933798 0 0 2.9990334 -60.804116 25.997195)"
       id="path1980" />
    <path
       d="m25.496486 10.503514 5-5.0000004m0 5.0000004-5-5.0000004"
       fill="none"
       stroke="#dc0000"
       stroke-width="1.5"
       transform="matrix(2.9933798 0 0 2.9990334 -60.804116 25.997195)"
       id="path1982" />
  </g>
</svg>
