<?xml version="1.0" encoding="UTF-8" standalone="no"?>
<svg
   width="36"
   height="36"
   version="1.1"
   viewBox="0 0 36 36"
   id="svg6"
   sodipodi:docname="tselectdirectorydialog_150.svg"
   inkscape:export-filename="tselectdirectorydialog_150.png"
   inkscape:export-xdpi="96"
   inkscape:export-ydpi="96"
   inkscape:version="1.3.2 (091e20e, 2023-11-25, custom)"
   xmlns:inkscape="http://www.inkscape.org/namespaces/inkscape"
   xmlns:sodipodi="http://sodipodi.sourceforge.net/DTD/sodipodi-0.dtd"
   xmlns="http://www.w3.org/2000/svg"
   xmlns:svg="http://www.w3.org/2000/svg">
  <sodipodi:namedview
     id="namedview6"
     pagecolor="#ffffff"
     bordercolor="#000000"
     borderopacity="0.25"
     inkscape:showpageshadow="2"
     inkscape:pageopacity="0.0"
     inkscape:pagecheckerboard="0"
     inkscape:deskcolor="#d1d1d1"
     showgrid="true"
     inkscape:current-layer="svg6">
    <inkscape:grid
       id="grid6"
       units="px"
       originx="0"
       originy="0"
       spacingx="0.5"
       spacingy="0.5"
       empcolor="#0099e5"
       empopacity="0.30196078"
       color="#0099e5"
       opacity="0.14901961"
       empspacing="2"
       dotted="false"
       gridanglex="30"
       gridanglez="30"
       visible="true" />
  </sodipodi:namedview>
  <defs
     id="defs4">
    <linearGradient
       id="a"
       x1="-28.023815"
       x2="-8.9761906"
       y1="1036.3168"
       y2="1045.4077"
       gradientTransform="matrix(1.0249997,0,0,1.15,37.462497,-1174.9915)"
       gradientUnits="userSpaceOnUse">
      <stop
         stop-color="#ffe496"
         offset="0"
         id="stop1" />
      <stop
         stop-color="#ffcc40"
         offset="1"
         id="stop2" />
    </linearGradient>
    <linearGradient
       id="b"
       x1="-28.000051"
       x2="-9.0000525"
       y1="1031.3622"
       y2="1034.3622"
       gradientTransform="translate(37.000052,-1018.3622)"
       gradientUnits="userSpaceOnUse">
      <stop
         stop-color="#fdbd17"
         offset="0"
         id="stop3" />
      <stop
         stop-color="#e3a726"
         offset="1"
         id="stop4" />
    </linearGradient>
  </defs>
  <rect
     x="2.5"
     y="6.5"
     width="31"
     height="27"
     fill="#f9f9f9"
     stroke="#2a7efe"
     style="paint-order:normal"
     id="rect1" />
  <path
     d="M 34,3.5 V 7 H 2 V 3.5 C 2,2.8 2.7,2 3.5,2 h 29 C 33.2,2 34,2.7 34,3.5 Z"
     fill="#2a7efe"
     id="path1" />
  <path
     d="M 7.999999,19 8,13.0002 c -2e-5,-0.5523 0.4477219,-1.0001 1.000051,-1.0001 L 15.000052,12 c 0.552288,0 1.000007,0.4477 1,1 v 1 l 12.000052,10e-5 c 0.552229,4e-6 0.999898,0.447671 0.999906,0.9999 L 29,19 Z"
     fill="url(#b)"
     id="path5"
     style="fill:url(#b)"
     sodipodi:nodetypes="cccccccccc" />
  <path
     d="M 27.77381,16.25 H 9.2261904 A 0.97619043,1.0454545 0 0 0 8.25,17.295454 v 9.409091 A 0.97619043,1.0454545 0 0 0 9.2261904,27.75 H 27.77381 A 0.97619043,1.0454545 0 0 0 28.75,26.704545 V 17.295454 A 0.97619043,1.0454545 0 0 0 27.77381,16.25 Z"
     fill="url(#a)"
     id="path6"
     style="fill:url(#a);stroke:#edb020;stroke-width:0.5;stroke-dasharray:none;stroke-opacity:1" />
</svg>
