<svg width="64" height="64" version="1.1" xmlns="http://www.w3.org/2000/svg">
 <linearGradient id="a" x1="230.26965" x2="271.83875" y1="-115.89568" y2="-42.350357" gradientTransform="matrix(.40443694 0 0 .40394188 -57.890548 71.706913)" gradientUnits="userSpaceOnUse">
  <stop stop-color="#f00" offset="0"/>
  <stop stop-color="#d40000" offset="1"/>
 </linearGradient>
 <g>
  <path d="m33.544047 23.605465c-12.343941-0.351762-17.187173 18.677591 9.449259 38.403558 32.783296-24.278073 17.88179-47.500599 0-34.833763-3.352839-2.375035-6.600652-3.488589-9.449259-3.569795z" fill="url(#a)" stroke="#ffffff" stroke-width="3.2"/>
  <path d="m26.600008 46.500005h2.4l2.999999-4.499999 2.999999 3 4.999999-9.999998 7.999998 12.999997 4.999999-6.999998 3.999999 5.499998h2.399999" fill="none" stroke="#ffffff" stroke-linecap="round" stroke-linejoin="round" stroke-width="9"/>
  <path d="m26.000009 46.500005h2.999999l2.999999-4.499999 2.999999 3 4.999999-9.999998 7.999998 12.999997 4.999999-6.999998 3.999999 5.499998h2.999999" fill="none" stroke="#3771c8" stroke-linecap="round" stroke-linejoin="round" stroke-width="3"/>
 </g>
</svg>
