<?xml version="1.0" encoding="UTF-8" standalone="no"?>
<svg
   width="24"
   height="24"
   version="1.1"
   viewBox="0 0 24 24"
   id="svg9"
   sodipodi:docname="ttibutton.svg"
   inkscape:version="1.3.2 (091e20e, 2023-11-25, custom)"
   xmlns:inkscape="http://www.inkscape.org/namespaces/inkscape"
   xmlns:sodipodi="http://sodipodi.sourceforge.net/DTD/sodipodi-0.dtd"
   xmlns="http://www.w3.org/2000/svg"
   xmlns:svg="http://www.w3.org/2000/svg">
  <sodipodi:namedview
     id="namedview9"
     pagecolor="#ffffff"
     bordercolor="#000000"
     borderopacity="0.25"
     inkscape:showpageshadow="2"
     inkscape:pageopacity="0.0"
     inkscape:pagecheckerboard="0"
     inkscape:deskcolor="#d1d1d1"
     showgrid="true"
     inkscape:current-layer="svg9">
    <inkscape:grid
       id="grid9"
       units="px"
       originx="0"
       originy="0"
       spacingx="0.5"
       spacingy="0.5"
       empcolor="#0099e5"
       empopacity="0.30196078"
       color="#0099e5"
       opacity="0.14901961"
       empspacing="2"
       dotted="false"
       gridanglex="30"
       gridanglez="30"
       visible="true" />
  </sodipodi:namedview>
  <defs
     id="defs6">
    <radialGradient
       id="a"
       cx="5.3999925"
       cy="1034.7039"
       r="4"
       gradientTransform="matrix(1.2499938,-1.2500079,0.75001073,0.75000232,-776.78893,-763.28024)"
       gradientUnits="userSpaceOnUse">
      <stop
         stop-color="#198d19"
         offset="0"
         id="stop1" />
      <stop
         stop-color="#ffffff"
         offset="1"
         id="stop2" />
    </radialGradient>
    <radialGradient
       id="c"
       cx="5.3999925"
       cy="1034.7039"
       r="4"
       gradientTransform="matrix(1.2499938,-1.2500079,0.75001073,0.75000232,-768.78893,-763.28022)"
       gradientUnits="userSpaceOnUse">
      <stop
         stop-color="#1a75ff"
         offset="0"
         id="stop3" />
      <stop
         stop-color="#ffffff"
         offset="1"
         id="stop4" />
    </radialGradient>
    <radialGradient
       id="b"
       cx="5.3999925"
       cy="1034.7039"
       r="4"
       gradientTransform="matrix(1.2499938,-1.2500079,0.75001073,0.75000232,-776.78893,-755.2802)"
       gradientUnits="userSpaceOnUse">
      <stop
         stop-color="#ff1919"
         offset="0"
         id="stop5" />
      <stop
         stop-color="#ffffff"
         offset="1"
         id="stop6" />
    </radialGradient>
  </defs>
  <circle
     cx="5"
     cy="4.9999828"
     r="3.5"
     fill="url(#a)"
     fill-rule="evenodd"
     stroke="#198d19"
     stroke-linecap="square"
     style="fill:url(#a);stroke-linejoin:round;paint-order:normal"
     id="circle6" />
  <circle
     cx="13"
     cy="4.9999828"
     r="3.5"
     fill="url(#c)"
     fill-rule="evenodd"
     stroke="#1a75ff"
     stroke-linecap="square"
     style="fill:url(#c);stroke-linejoin:round;paint-order:normal"
     id="circle7" />
  <circle
     cx="5"
     cy="12.999983"
     r="3.5"
     fill="url(#b)"
     fill-rule="evenodd"
     stroke="#ff1a1a"
     stroke-linecap="square"
     style="fill:url(#b);stroke-linejoin:round;paint-order:normal"
     id="circle8" />
  <rect
     x="7.375"
     y="11.374983"
     width="16.25"
     height="10.25"
     rx="2.1250174"
     ry="2.1250174"
     fill="#ececec"
     stroke="#2a7efe"
     stroke-linecap="round"
     stroke-width="0.75"
     style="stroke-linejoin:round;paint-order:normal"
     id="rect8" />
  <path
     d="m 13.000455,14.4001 c 0.775852,0 1.400454,0.5755 1.400454,1.2902 v 1.6194 c 0,0.7148 -0.624602,1.2902 -1.400454,1.2902 C 12.224601,18.5999 11.6,18.0245 11.6,17.3097 v -1.6194 c 0,-0.7147 0.624601,-1.2902 1.400455,-1.2902 z"
     fill="none"
     stroke="#4d4d4d"
     stroke-linecap="round"
     stroke-width="0.8"
     id="path8"
     style="stroke-linejoin:round" />
  <path
     d="m 18.570021,18.6001 -1.16535,-1.8794 m 0.947007,-1.1206 -1.864908,2.2068 M 16.413,14.4001 v 4.2"
     fill="none"
     stroke="#4d4d4d"
     stroke-linecap="round"
     stroke-width="0.8"
     id="path9"
     style="stroke-linejoin:round" />
</svg>
