<?xml version="1.0" encoding="UTF-8" standalone="no"?>
<svg
   height="48"
   viewBox="0 0 12.7 12.700001"
   width="48"
   version="1.1"
   id="svg296"
   sodipodi:docname="Chart_09_48.svg"
   inkscape:export-filename="Chart_09_48.png"
   inkscape:export-xdpi="96"
   inkscape:export-ydpi="96"
   inkscape:version="1.2 (dc2aedaf03, 2022-05-15)"
   xmlns:inkscape="http://www.inkscape.org/namespaces/inkscape"
   xmlns:sodipodi="http://sodipodi.sourceforge.net/DTD/sodipodi-0.dtd"
   xmlns:xlink="http://www.w3.org/1999/xlink"
   xmlns="http://www.w3.org/2000/svg"
   xmlns:svg="http://www.w3.org/2000/svg">
  <defs
     id="defs300">
    <linearGradient
       inkscape:collect="always"
       id="linearGradient3918">
      <stop
         style="stop-color:#ffffff;stop-opacity:1"
         offset="0"
         id="stop3916" />
      <stop
         style="stop-color:#ffd42a;stop-opacity:1;"
         offset="1"
         id="stop3914" />
    </linearGradient>
    <linearGradient
       inkscape:collect="always"
       id="linearGradient3908">
      <stop
         style="stop-color:#ffffff;stop-opacity:1"
         offset="0"
         id="stop3906" />
      <stop
         style="stop-color:#ff5555;stop-opacity:1;"
         offset="1"
         id="stop3904" />
    </linearGradient>
    <linearGradient
       inkscape:collect="always"
       id="linearGradient3898">
      <stop
         style="stop-color:#ffffff;stop-opacity:1"
         offset="0"
         id="stop3896" />
      <stop
         style="stop-color:#87decd;stop-opacity:1;"
         offset="1"
         id="stop3894" />
    </linearGradient>
    <linearGradient
       inkscape:collect="always"
       xlink:href="#linearGradient3898"
       id="linearGradient3900"
       x1="1.5874996"
       y1="8.73125"
       x2="4.7624994"
       y2="8.73125"
       gradientUnits="userSpaceOnUse" />
    <linearGradient
       inkscape:collect="always"
       xlink:href="#linearGradient3908"
       id="linearGradient3910"
       x1="4.7624994"
       y1="7.540625"
       x2="7.9374996"
       y2="7.540625"
       gradientUnits="userSpaceOnUse" />
    <linearGradient
       inkscape:collect="always"
       xlink:href="#linearGradient3918"
       id="linearGradient3920"
       x1="7.9375002"
       y1="6.35"
       x2="11.1125"
       y2="6.35"
       gradientUnits="userSpaceOnUse" />
    <radialGradient
       id="a"
       cx="-11.5"
       cy="8.5"
       gradientTransform="rotate(90,-11.5,8.5)"
       gradientUnits="userSpaceOnUse"
       r="3.5">
      <stop
         offset="0"
         stop-color="#fff"
         id="stop1384" />
      <stop
         offset="1"
         stop-color="#d5e5ff"
         id="stop1386" />
    </radialGradient>
  </defs>
  <sodipodi:namedview
     id="namedview298"
     pagecolor="#ffffff"
     bordercolor="#666666"
     borderopacity="1.0"
     inkscape:showpageshadow="2"
     inkscape:pageopacity="0.0"
     inkscape:pagecheckerboard="0"
     inkscape:deskcolor="#d1d1d1"
     showgrid="true"
     inkscape:zoom="19.125"
     inkscape:cx="21.30719"
     inkscape:cy="24"
     inkscape:current-layer="svg296">
    <inkscape:grid
       type="xygrid"
       id="grid4287" />
  </sodipodi:namedview>
  <path
     d="M 4.5640614,4.960938 H 1.7859376 v 7.540624 h 2.7781238 z"
     fill="#87decd"
     stroke="#5fd3bc"
     id="path282"
     style="stroke-width:0.396876;stroke-linecap:round;stroke-dashoffset:1.49998;fill-opacity:1;fill:url(#linearGradient3900)" />
  <path
     d="M 10.914062,0.19843797 H 8.1359382 V 12.501562 h 2.7781238 z"
     fill="#ffd42a"
     stroke="#ffcc00"
     id="path284"
     style="stroke-width:0.396876;stroke-linecap:round;stroke-dashoffset:1.49998;fill-opacity:1;fill:url(#linearGradient3920)" />
  <path
     d="M 7.7390616,2.579688 H 4.9609374 v 9.921874 h 2.7781242 z"
     fill="#ff5555"
     stroke="#ff5252"
     id="path286"
     style="stroke-width:0.396876;stroke-linecap:round;stroke-dashoffset:1.49998;fill-opacity:1;fill:url(#linearGradient3910)" />
  <g
     stroke-linecap="round"
     transform="matrix(0.67348485,0,0,0.67348485,15.39394,1.9242427)"
     id="g1399">
    <g
       fill="none"
       id="g1395">
      <circle
         cx="-10.75"
         cy="9.25"
         r="3.875"
         stroke="#ffffff"
         stroke-linejoin="round"
         stroke-width="0.75"
         id="circle1389" />
      <path
         d="M -8.8692311,11.130769 -5.5000004,14.5"
         stroke="#ffffff"
         stroke-width="3"
         id="path1391" />
      <path
         d="M -8.8692311,11.130769 -5.5000004,14.5"
         stroke="#a05a2c"
         stroke-width="1.5"
         id="path1393" />
    </g>
    <circle
       cx="-10.75"
       cy="9.25"
       fill="url(#a)"
       fill-rule="evenodd"
       r="3.125"
       stroke="#dd8703"
       stroke-linejoin="round"
       stroke-width="0.75"
       id="circle1397"
       style="fill:url(#a)" />
  </g>
</svg>
