<?xml version="1.0" encoding="UTF-8" standalone="no"?>
<svg
   width="16"
   height="16"
   version="1.0"
   id="svg56"
   sodipodi:docname="menu_delpkg_to_lazpkg.svg"
   inkscape:export-filename="menu_delpkg_to_lazpkg.png"
   inkscape:export-xdpi="96"
   inkscape:export-ydpi="96"
   inkscape:version="1.2.1 (9c6d41e410, 2022-07-14)"
   xmlns:inkscape="http://www.inkscape.org/namespaces/inkscape"
   xmlns:sodipodi="http://sodipodi.sourceforge.net/DTD/sodipodi-0.dtd"
   xmlns:xlink="http://www.w3.org/1999/xlink"
   xmlns="http://www.w3.org/2000/svg"
   xmlns:svg="http://www.w3.org/2000/svg">
  <sodipodi:namedview
     id="namedview58"
     pagecolor="#ffffff"
     bordercolor="#666666"
     borderopacity="1.0"
     inkscape:showpageshadow="2"
     inkscape:pageopacity="0.0"
     inkscape:pagecheckerboard="0"
     inkscape:deskcolor="#d1d1d1"
     showgrid="true"
     inkscape:zoom="57.375"
     inkscape:cx="8"
     inkscape:cy="8"
     inkscape:current-layer="svg56">
    <inkscape:grid
       type="xygrid"
       id="grid705" />
  </sodipodi:namedview>
  <defs
     id="defs14">
    <linearGradient
       id="linearGradient1347"
       x1="8.5"
       x2="16"
       y1="8"
       y2="11"
       gradientTransform="translate(-0.5)"
       gradientUnits="userSpaceOnUse"
       xlink:href="#linearGradient933-8" />
    <linearGradient
       id="linearGradient933-8">
      <stop
         stop-color="#ffe991"
         offset="0"
         id="stop3" />
      <stop
         stop-color="#f5c400"
         offset="1"
         id="stop5" />
    </linearGradient>
    <linearGradient
       id="linearGradient1351"
       x1="8.5002"
       x2="16"
       y1="7.9959"
       y2="10.996"
       gradientTransform="matrix(-1,0,0,1,16.5,0.004112)"
       gradientUnits="userSpaceOnUse"
       xlink:href="#linearGradient933-8" />
    <linearGradient
       id="linearGradient1355"
       x1="1.0002"
       x2="16"
       y1="4.4959"
       y2="4.4959"
       gradientTransform="matrix(-1,0,0,1,16.5,0.004112)"
       gradientUnits="userSpaceOnUse">
      <stop
         stop-color="#ffe478"
         offset="0"
         id="stop9" />
      <stop
         stop-color="#fff2c0"
         offset="1"
         id="stop11" />
    </linearGradient>
  </defs>
  <path
     id="rect16"
     style="fill:#e60000"
     d="M 0,0 V 9 H 4 V 7.1796875 L 9,4.8808594 V 0 Z"
     sodipodi:nodetypes="ccccccc" />
  <g
     stroke="#ffffff"
     id="g32">
    <path
       d="M 7.5001,3.5 4.5,1.5 1.4999,3.5 Z"
       fill="#ffffff"
       fill-rule="evenodd"
       stroke-linejoin="round"
       id="path18" />
    <g
       fill="none"
       id="g30">
      <g
         stroke-width="1px"
         id="g26">
        <path
           d="M 2.5,4 V 7.5"
           id="path20" />
        <path
           d="M 4.5,4 V 7.5"
           id="path22" />
        <path
           d="M 6.5,4 V 7.5"
           id="path24" />
      </g>
      <path
         d="m 0.5,7.5 h 8"
         id="path28" />
    </g>
  </g>
  <g
     transform="matrix(0.70277,0,0,0.70228,-2.5012,9.0115)"
     id="g52">
    <g
       transform="translate(10.5,-6)"
       stroke="#ccaa00"
       stroke-linejoin="round"
       stroke-width="0.6524"
       id="g40">
      <path
         d="M 8,8 15.5,4.5 V 11 L 8,15 Z"
         fill="url(#linearGradient1347)"
         id="path34"
         style="fill:url(#linearGradient1347)" />
      <path
         d="M 8.0002,8.0041 0.5,4.5 V 11 l 7.5002,4.0041 z"
         fill="url(#linearGradient1351)"
         id="path36"
         style="fill:url(#linearGradient1351)" />
      <path
         d="M 8,1 0.5,4.5 8.0002,8.0041 15.5,4.5 Z"
         fill="url(#linearGradient1355)"
         id="path38"
         style="fill:url(#linearGradient1355)" />
    </g>
    <g
       transform="translate(10.5,-6)"
       fill="none"
       stroke="#5f8dd3"
       stroke-linecap="round"
       stroke-width="0.9786"
       id="g50">
      <path
         d="m 5,2.5 6.7,3.6"
         id="path42" />
      <path
         d="M 4.3,6.1 11,2.5"
         id="path44" />
      <path
         d="m 4.3,6.3 v 6.5"
         id="path46" />
      <path
         d="m 11.7,6.3 v 6.5"
         id="path48" />
    </g>
  </g>
</svg>
