<?xml version="1.0" encoding="UTF-8" standalone="no"?>
<svg
   height="64"
   width="64"
   version="1.1"
   id="svg965"
   sodipodi:docname="Export_01_64.svg"
   inkscape:export-filename="Export_01_64.png"
   inkscape:export-xdpi="96"
   inkscape:export-ydpi="96"
   inkscape:version="1.2-beta (1b65182ce9, 2022-04-05)"
   xmlns:inkscape="http://www.inkscape.org/namespaces/inkscape"
   xmlns:sodipodi="http://sodipodi.sourceforge.net/DTD/sodipodi-0.dtd"
   xmlns="http://www.w3.org/2000/svg"
   xmlns:svg="http://www.w3.org/2000/svg">
  <defs
     id="defs969" />
  <sodipodi:namedview
     id="namedview967"
     pagecolor="#ffffff"
     bordercolor="#666666"
     borderopacity="1.0"
     inkscape:pageshadow="2"
     inkscape:pageopacity="0.0"
     inkscape:pagecheckerboard="0"
     inkscape:deskcolor="#d1d1d1"
     showgrid="true"
     inkscape:zoom="14.34375"
     inkscape:cx="32"
     inkscape:cy="32"
     inkscape:current-layer="svg965">
    <inkscape:grid
       type="xygrid"
       id="grid1528" />
  </sodipodi:namedview>
  <g
     id="g1526"
     transform="scale(2)">
    <path
       d="m 29,27 v 4 H 1 V 7.0000002 H 29 V 11"
       fill="none"
       stroke="#00aad4"
       stroke-linecap="round"
       stroke-linejoin="round"
       stroke-width="2"
       id="path955" />
    <path
       d="M 0,2 H 30 V 8 H 0 Z"
       fill="#00aad4"
       fill-rule="evenodd"
       stroke-width="1.6"
       id="path957" />
    <g
       fill="none"
       stroke="#00aad4"
       stroke-linecap="round"
       stroke-linejoin="round"
       transform="matrix(2,0,0,2,4.1e-5,0)"
       id="g963">
      <path
         d="m 6.499969,9.5 h 9"
         id="path959" />
      <path
         d="M 13,12 15.5,9.5 13,7"
         id="path961" />
    </g>
  </g>
</svg>
