<?xml version="1.0" encoding="UTF-8" standalone="no"?>
<svg
   height="64"
   width="64"
   version="1.1"
   id="svg344"
   sodipodi:docname="Setup_06_64.svg"
   inkscape:export-filename="Setup_06_64.png"
   inkscape:export-xdpi="96"
   inkscape:export-ydpi="96"
   inkscape:version="1.2-beta (1b65182ce9, 2022-04-05)"
   xmlns:inkscape="http://www.inkscape.org/namespaces/inkscape"
   xmlns:sodipodi="http://sodipodi.sourceforge.net/DTD/sodipodi-0.dtd"
   xmlns="http://www.w3.org/2000/svg"
   xmlns:svg="http://www.w3.org/2000/svg">
  <defs
     id="defs346" />
  <sodipodi:namedview
     id="namedview12"
     pagecolor="#ffffff"
     bordercolor="#666666"
     borderopacity="1.0"
     inkscape:pageshadow="2"
     inkscape:pageopacity="0.0"
     inkscape:pagecheckerboard="0"
     inkscape:deskcolor="#d1d1d1"
     showgrid="true"
     inkscape:zoom="14.34375"
     inkscape:cx="31.965142"
     inkscape:cy="32"
     inkscape:current-layer="svg344">
    <inkscape:grid
       type="xygrid"
       id="grid139" />
  </sodipodi:namedview>
  <path
     d="m 40.016034,2.8482058 -4.981739,8.7605402 -6.068287,0.0022 -4.983853,-8.7659831 -6.928436,2.8698491 2.674374,9.722603 -4.292468,4.289388 -9.717262,-2.672016 -2.8701585,6.929176 8.7605425,4.981741 0.0022,6.068287 -8.7659866,4.983849 2.8698527,6.928437 9.7226019,-2.67437 4.289386,4.292469 -2.672016,9.717262 6.929177,2.870159 4.981741,-8.760544 6.068287,-0.0022 4.983857,8.765984 6.928435,-2.869852 -2.674376,-9.722603 4.292469,-4.289387 9.717266,2.672018 2.870159,-6.929175 -8.760548,-4.981745 -0.0022,-6.068287 8.765988,-4.983851 -2.869853,-6.928433 -9.722606,2.674369 -4.289385,-4.292468 2.672016,-9.7172599 z M 35.82687,22.761088 a 10.000115,10.000115 0 0 1 5.41202,13.06578 10.000115,10.000115 0 0 1 -13.065777,5.412026 10.000115,10.000115 0 0 1 -5.412022,-13.065781 10.000115,10.000115 0 0 1 13.065779,-5.412025 z"
     fill="none"
     stroke="#00aad4"
     stroke-linejoin="round"
     stroke-width="4.00003"
     id="path342" />
</svg>
