<?xml version="1.0" encoding="UTF-8" standalone="no"?>
<svg
   height="24"
   width="24"
   version="1.1"
   id="svg1465"
   sodipodi:docname="File_16_24.svg"
   inkscape:version="1.2.1 (9c6d41e410, 2022-07-14)"
   inkscape:export-filename="File_16_24.png"
   inkscape:export-xdpi="96"
   inkscape:export-ydpi="96"
   xmlns:inkscape="http://www.inkscape.org/namespaces/inkscape"
   xmlns:sodipodi="http://sodipodi.sourceforge.net/DTD/sodipodi-0.dtd"
   xmlns:xlink="http://www.w3.org/1999/xlink"
   xmlns="http://www.w3.org/2000/svg"
   xmlns:svg="http://www.w3.org/2000/svg">
  <defs
     id="defs1469">
    <radialGradient
       id="a-0"
       cx="9.1740294"
       cy="7.8253603"
       gradientTransform="matrix(0.66909781,-2.2758851e-8,4.5190518e-8,0.58542853,1.8616763,4.291566)"
       gradientUnits="userSpaceOnUse"
       r="7.5"
       fx="9.1740294"
       fy="7.8253603">
      <stop
         offset="0"
         stop-color="#fff"
         id="stop2-7"
         style="stop-color:#ccddff;stop-opacity:1;" />
      <stop
         offset="1"
         stop-color="#8fc1c7"
         id="stop4-7"
         style="stop-color:#ffffff;stop-opacity:1" />
    </radialGradient>
    <linearGradient
       inkscape:collect="always"
       xlink:href="#a-0"
       id="linearGradient5852"
       x1="19"
       y1="22"
       x2="5"
       y2="2"
       gradientUnits="userSpaceOnUse" />
    <radialGradient
       id="a"
       cx="4.1671958"
       cy="1041.9056"
       gradientTransform="matrix(0.06230003,-0.62291172,0.59413583,0.05941673,-601.69312,-41.160837)"
       gradientUnits="userSpaceOnUse"
       r="9">
      <stop
         offset="0"
         stop-color="#acf"
         id="stop908" />
      <stop
         offset="1"
         stop-color="#fff"
         id="stop910" />
    </radialGradient>
    <linearGradient
       id="a-8"
       gradientUnits="userSpaceOnUse"
       x1="20.98311"
       x2="13.516894"
       y1="-3.0168898"
       y2="-10.483106"
       gradientTransform="matrix(0.98778273,0,0,0.98778273,0.46074562,24.167532)">
      <stop
         offset="0"
         stop-color="#009600"
         id="stop146" />
      <stop
         offset="1"
         stop-color="#6edb39"
         id="stop148" />
    </linearGradient>
  </defs>
  <sodipodi:namedview
     id="namedview1467"
     pagecolor="#ffffff"
     bordercolor="#666666"
     borderopacity="1.0"
     inkscape:pageshadow="2"
     inkscape:pageopacity="0.0"
     inkscape:pagecheckerboard="0"
     inkscape:deskcolor="#d1d1d1"
     showgrid="true"
     inkscape:zoom="38.25"
     inkscape:cx="11.228758"
     inkscape:cy="12"
     inkscape:current-layer="svg1465"
     showguides="true"
     inkscape:showpageshadow="2">
    <inkscape:grid
       type="xygrid"
       id="grid1588" />
  </sodipodi:namedview>
  <path
     d="M 3.75,23.25 V 0.75 H 15 L 20.25,6 v 17.25 z"
     id="path1449"
     style="fill:url(#linearGradient5852);stroke:#b3b3b3;stroke-width:1.5;stroke-linecap:round;stroke-linejoin:round;stroke-opacity:1;fill-opacity:1"
     sodipodi:nodetypes="cccccc" />
  <path
     d="M 14.75,1 V 6.249999 H 20"
     id="path1453"
     style="fill:none;stroke:#b3b3b3;stroke-width:1.5;stroke-linecap:round;stroke-linejoin:round;stroke-opacity:1"
     sodipodi:nodetypes="ccc" />
  <g
     id="g4830">
    <circle
       cx="17.5"
       cy="17.5"
       fill="url(#a)"
       stroke-dashoffset="1.49998"
       stroke-linejoin="round"
       stroke-width="1.05405"
       transform="matrix(0,1,1,0,0,0)"
       id="circle151"
       style="fill:url(#a-8);stroke:#ffffff;stroke-width:1.2;stroke-linecap:round;stroke-dasharray:none"
       r="5.8999996" />
    <path
       style="fill:none;stroke:#ffffff;stroke-width:1.4;stroke-linecap:round;stroke-linejoin:round;stroke-dasharray:none;stroke-opacity:1"
       d="M 19.8,15.2 16.820327,19.800056 15.2,17.389776"
       id="path1953"
       sodipodi:nodetypes="ccc" />
  </g>
</svg>
