<?xml version="1.0" encoding="UTF-8" standalone="no"?>
<svg
   height="36"
   width="36"
   version="1.1"
   id="svg296"
   sodipodi:docname="Folder_10_36.svg"
   inkscape:export-filename="Folder_10_36.png"
   inkscape:export-xdpi="96"
   inkscape:export-ydpi="96"
   inkscape:version="1.2 (dc2aedaf03, 2022-05-15)"
   xmlns:inkscape="http://www.inkscape.org/namespaces/inkscape"
   xmlns:sodipodi="http://sodipodi.sourceforge.net/DTD/sodipodi-0.dtd"
   xmlns="http://www.w3.org/2000/svg"
   xmlns:svg="http://www.w3.org/2000/svg">
  <defs
     id="defs300">
    <radialGradient
       id="a"
       cx="12.1"
       cy="10.900001"
       gradientTransform="matrix(0,2.3164984,-2.3164981,4e-8,48.622559,-4.656904)"
       gradientUnits="userSpaceOnUse"
       r="4.5">
      <stop
         offset="0"
         stop-color="#f55"
         id="stop918" />
      <stop
         offset="1"
         stop-color="#a00"
         id="stop920" />
    </radialGradient>
  </defs>
  <sodipodi:namedview
     id="namedview298"
     pagecolor="#ffffff"
     bordercolor="#666666"
     borderopacity="1.0"
     inkscape:pageshadow="2"
     inkscape:pageopacity="0.0"
     inkscape:pagecheckerboard="0"
     inkscape:deskcolor="#d1d1d1"
     showgrid="true"
     inkscape:zoom="25.5"
     inkscape:cx="17.980392"
     inkscape:cy="18"
     inkscape:current-layer="g859"
     showguides="true"
     inkscape:showpageshadow="2">
    <inkscape:grid
       type="xygrid"
       id="grid823" />
  </sodipodi:namedview>
  <g
     id="g859"
     transform="translate(0,2.0000012)">
    <g
       id="g1564"
       transform="translate(0,-2)">
      <path
         d="M 1.1253953,12.874999 1.1249947,6.1249796 c 0,-1.8749912 1.125195,-2.9999858 3.0001861,-2.9999858 H 9.9 c 2.249989,0 3,1.1249946 3,2.9999858 V 7.124999 h 21.975001 v 5.75"
         id="path8"
         style="fill:#fff3cc;fill-opacity:1;stroke:#f4c025;stroke-width:2.24999;stroke-linecap:round;stroke-linejoin:round"
         sodipodi:nodetypes="cccccccc" />
      <path
         d="M 34.874874,13.124999 H 1.1250605 V 30.87484 H 34.874874 Z"
         stroke-linecap="round"
         id="path290"
         style="fill:#f4c025;fill-opacity:1;stroke:#f4c025;stroke-width:2.24999;stroke-linejoin:round;stroke-opacity:1"
         sodipodi:nodetypes="ccccc" />
    </g>
    <g
       id="g1763"
       transform="translate(3.5762787e-7,-2.0000016)">
      <circle
         cx="26.5"
         cy="26.5"
         r="8.6000004"
         style="fill:url(#a);stroke:#ffffff;stroke-width:1.8;stroke-linecap:round;stroke-linejoin:round;stroke-dashoffset:1.49998"
         transform="matrix(0,1,1,0,0,0)"
         id="circle923" />
      <g
         id="g4083"
         transform="matrix(2.25,0,0,2.25,0.625,0.625)">
        <path
           d="m 13,10 -3,3"
           id="path3550"
           style="fill:none;stroke:#ffffff;stroke-width:1.2;stroke-linecap:round;stroke-dasharray:none"
           sodipodi:nodetypes="cc" />
        <path
           d="M 13,13 10,10"
           id="path3552"
           style="fill:none;stroke:#ffffff;stroke-width:1.2;stroke-linecap:round;stroke-dasharray:none"
           sodipodi:nodetypes="cc" />
      </g>
    </g>
  </g>
</svg>
