<?xml version="1.0" encoding="UTF-8" standalone="no"?>
<svg
   height="64"
   width="64"
   version="1.1"
   id="svg426"
   sodipodi:docname="Add_04_64.svg"
   inkscape:export-filename="Add_04_64.png"
   inkscape:export-xdpi="96"
   inkscape:export-ydpi="96"
   inkscape:version="1.2-beta (1b65182ce9, 2022-04-05)"
   xmlns:inkscape="http://www.inkscape.org/namespaces/inkscape"
   xmlns:sodipodi="http://sodipodi.sourceforge.net/DTD/sodipodi-0.dtd"
   xmlns="http://www.w3.org/2000/svg"
   xmlns:svg="http://www.w3.org/2000/svg">
  <defs
     id="defs430" />
  <sodipodi:namedview
     id="namedview428"
     pagecolor="#ffffff"
     bordercolor="#666666"
     borderopacity="1.0"
     inkscape:pageshadow="2"
     inkscape:pageopacity="0.0"
     inkscape:pagecheckerboard="0"
     inkscape:deskcolor="#d1d1d1"
     showgrid="true"
     inkscape:zoom="14.34375"
     inkscape:cx="31.965142"
     inkscape:cy="32"
     inkscape:current-layer="svg426">
    <inkscape:grid
       type="xygrid"
       id="grid1613" />
  </sodipodi:namedview>
  <linearGradient
     id="a"
     gradientTransform="matrix(-4.1818181,0,0,-4.1818181,86.363636,40.363636)"
     gradientUnits="userSpaceOnUse"
     x1="10.5"
     x2="15.5"
     y1="-2"
     y2="8">
    <stop
       offset="0"
       stop-color="#80b3ff"
       id="stop419" />
    <stop
       offset="1"
       stop-color="#d5e5ff"
       id="stop421" />
  </linearGradient>
  <path
     d="M 25.000001,39 V 55 H 39 l 10e-7,-16 H 55 V 25.000001 L 39.000001,25 39,9.0000004 H 25.000001 V 25 l -16.0000006,1e-6 V 39 Z"
     style="fill:url(#a);fill-rule:evenodd;stroke:#3566a4;stroke-width:2;stroke-linejoin:round;stroke-opacity:0.988235"
     id="path424" />
</svg>
