<?xml version="1.0" encoding="UTF-8" standalone="no"?>
<svg
   height="24"
   width="24"
   version="1.1"
   id="svg51"
   sodipodi:docname="menu_project_save_150.svg"
   inkscape:export-filename="menu_project_save_150.png"
   inkscape:export-xdpi="96"
   inkscape:export-ydpi="96"
   inkscape:version="1.2.2 (732a01da63, 2022-12-09)"
   xmlns:inkscape="http://www.inkscape.org/namespaces/inkscape"
   xmlns:sodipodi="http://sodipodi.sourceforge.net/DTD/sodipodi-0.dtd"
   xmlns="http://www.w3.org/2000/svg"
   xmlns:svg="http://www.w3.org/2000/svg">
  <defs
     id="defs55" />
  <sodipodi:namedview
     id="namedview53"
     pagecolor="#ffffff"
     bordercolor="#666666"
     borderopacity="1.0"
     inkscape:showpageshadow="2"
     inkscape:pageopacity="0.0"
     inkscape:pagecheckerboard="0"
     inkscape:deskcolor="#d1d1d1"
     showgrid="true"
     inkscape:zoom="38.25"
     inkscape:cx="11.986928"
     inkscape:cy="12"
     inkscape:current-layer="svg51">
    <inkscape:grid
       type="xygrid"
       id="grid694" />
  </sodipodi:namedview>
  <linearGradient
     id="a"
     gradientUnits="userSpaceOnUse"
     x1="22.75"
     x2="7.75"
     y1="23.25"
     y2="6.75">
    <stop
       offset="0"
       stop-color="#2a7fff"
       id="stop2" />
    <stop
       offset="1"
       stop-color="#66a4ff"
       id="stop4" />
  </linearGradient>
  <linearGradient
     id="b"
     gradientTransform="matrix(1.038466 0 0 1.0714275 1.75003 2.250038)"
     gradientUnits="userSpaceOnUse"
     x1="13.53"
     x2="13.53"
     y1="3.5"
     y2="8.75">
    <stop
       offset="0"
       stop-color="#ececec"
       id="stop7" />
    <stop
       offset="1"
       stop-color="#b7bec8"
       id="stop9" />
  </linearGradient>
  <radialGradient
     id="c"
     cx="7.388889"
     cy="3.048611"
     gradientTransform="matrix(-.00000005 .81632663 -.81632648 -.00000005 11.774378 1.753967)"
     gradientUnits="userSpaceOnUse"
     r="3.5">
    <stop
       offset="0"
       stop-color="#ff8080"
       id="stop12" />
    <stop
       offset="1"
       stop-color="#e50000"
       id="stop14" />
  </radialGradient>
  <radialGradient
     id="d"
     cx="10.5"
     cy="9.5"
     gradientTransform="matrix(-.00000008 .81632648 -.81632648 -.00000009 19.040818 2.714285)"
     gradientUnits="userSpaceOnUse"
     r="3.5">
    <stop
       offset="0"
       stop-color="#ffe680"
       id="stop17" />
    <stop
       offset="1"
       stop-color="#e5b800"
       id="stop19" />
  </radialGradient>
  <radialGradient
     id="e"
     cx="3"
     cy="10"
     gradientTransform="matrix(0 .81632648 -.81632648 0 15.448978 8.836734)"
     gradientUnits="userSpaceOnUse"
     r="3.5">
    <stop
       offset="0"
       stop-color="#80b2ff"
       id="stop22" />
    <stop
       offset="1"
       stop-color="#2672e5"
       id="stop24" />
  </radialGradient>
  <g
     transform="translate(-4 -5)"
     id="g41">
    <path
       d="m7 6h15.349999l1.650001 1.6875v16.3125h-17z"
       fill="url(#a)"
       fill-rule="evenodd"
       stroke-width="2.0226"
       id="path27" />
    <rect
       fill="#fff"
       height="8.499999"
       rx=".55"
       stroke-width="1.96562"
       width="13.000002"
       x="8.999998"
       y="13.5"
       id="rect29" />
    <path
       d="m12 6v6h9v-6zm5 1.0000001h2v3.9999999h-2z"
       fill="url(#b)"
       fill-rule="evenodd"
       stroke-width="2.0226"
       id="path31" />
    <g
       fill="none"
       id="g39">
      <path
         d="m11 15.5h9"
         stroke="#e6e6e6"
         id="path33" />
      <path
         d="m11 18.5h9"
         stroke="#e6e6e6"
         id="path35" />
      <path
         d="m8.9999995 21.5h13.0000005"
         stroke="#f60"
         id="path37" />
    </g>
  </g>
  <g
     stroke-width=".476191"
     transform="matrix(1.5 0 0 1.5 2 2)"
     id="g49">
    <circle
       cx="10"
       cy="8.5"
       fill="url(#c)"
       r="2.5"
       id="circle43" />
    <circle
       cx="12"
       cy="12"
       fill="url(#d)"
       r="2.5"
       id="circle45" />
    <circle
       cx="8"
       cy="12"
       fill="url(#e)"
       r="2.5"
       id="circle47" />
  </g>
</svg>
