<svg width="24" height="24" version="1.1" xmlns="http://www.w3.org/2000/svg">
 <defs>
  <linearGradient id="a" x1="8.000001" x2="8.000001" y1="13.855285" y2="4.5498314" gradientTransform="matrix(.84117896 0 0 .8153683 10.270571 11.192353)" gradientUnits="userSpaceOnUse">
   <stop stop-color="#d58914" stop-opacity=".956863" offset="0"/>
   <stop stop-color="#f4a428" stop-opacity=".992157" offset="1"/>
  </linearGradient>
 </defs>
 <path d="m17.000002 11.599926 1.977731 3.884359 4.422339 0.622887-3.200034 3.023552 0.755426 4.269324-3.955461-2.015703-3.955462 2.015701 0.755426-4.269322-3.200035-3.023552 4.42234-0.622887z" fill="url(#a)" fill-rule="evenodd" stroke="#ffffff" stroke-linecap="round" stroke-linejoin="round" stroke-width="1.2"/>
</svg>
