<?xml version="1.0" encoding="UTF-8" standalone="no"?>
<svg
   width="36"
   height="36"
   version="1.1"
   viewBox="0 0 36 36"
   id="svg4"
   sodipodi:docname="Atom_01_36.svg"
   inkscape:export-filename="Atom_01_36.png"
   inkscape:export-xdpi="96"
   inkscape:export-ydpi="96"
   inkscape:version="1.3.2 (091e20e, 2023-11-25, custom)"
   xmlns:inkscape="http://www.inkscape.org/namespaces/inkscape"
   xmlns:sodipodi="http://sodipodi.sourceforge.net/DTD/sodipodi-0.dtd"
   xmlns="http://www.w3.org/2000/svg"
   xmlns:svg="http://www.w3.org/2000/svg">
  <sodipodi:namedview
     id="namedview4"
     pagecolor="#ffffff"
     bordercolor="#000000"
     borderopacity="0.25"
     inkscape:showpageshadow="2"
     inkscape:pageopacity="0.0"
     inkscape:pagecheckerboard="0"
     inkscape:deskcolor="#d1d1d1"
     showgrid="true"
     inkscape:current-layer="svg4">
    <inkscape:grid
       id="grid4"
       units="px"
       originx="0"
       originy="0"
       spacingx="0.5"
       spacingy="0.5"
       empcolor="#0099e5"
       empopacity="0.30196078"
       color="#0099e5"
       opacity="0.14901961"
       empspacing="2"
       dotted="false"
       gridanglex="30"
       gridanglez="30"
       visible="true" />
  </sodipodi:namedview>
  <defs
     id="defs4">
    <radialGradient
       id="a"
       cx="16"
       cy="16"
       r="3"
       gradientTransform="matrix(1.1136025 0 0 1.1136 .18235558 .18240078)"
       gradientUnits="userSpaceOnUse">
      <stop
         stop-color="#ffcc00"
         offset="0"
         id="stop1" />
      <stop
         stop-color="#ff6600"
         offset="1"
         id="stop2" />
    </radialGradient>
    <linearGradient
       id="b"
       x1="6.2314053"
       x2="37.481403"
       y1="-5.8564067"
       y2="-5.8564067"
       gradientTransform="matrix(.5568 .96440589 -.96440589 .5568 .18240067 .18240078)"
       gradientUnits="userSpaceOnUse">
      <stop
         stop-color="#f5c400"
         offset="0"
         id="stop3" />
      <stop
         stop-color="#f56200"
         offset="1"
         id="stop4" />
    </linearGradient>
  </defs>
  <path
     d="m26.351999 32.466086a16.703999 7.7951997 60 0 1-15.102841-10.568487 16.703999 7.7951997 60 0 1-1.601158-18.363688 16.703999 7.7951997 60 0 1 15.102839 10.568489 16.703999 7.7951997 60 0 1 1.60116 18.363686zm1e-6 -28.932173a7.7951997 16.703999 30 0 1-1.601158 18.363689 7.7951997 16.703999 30 0 1-15.102841 10.568486 7.7951997 16.703999 30 0 1 1.601159-18.363687 7.7951997 16.703999 30 0 1 15.10284-10.568488zm8.352 14.466088a16.703999 7.7951997 0 0 1-16.704001 7.795199 16.703999 7.7951997 0 0 1-16.703999-7.795199 16.703999 7.7951997 0 0 1 16.703999-7.795199 16.703999 7.7951997 0 0 1 16.704001 7.795199z"
     fill="none"
     stroke="url(#b)"
     stroke-linecap="round"
     stroke-width="1.392"
     id="path4" />
  <circle
     cx="18"
     cy="18.000002"
     r="3.3407998"
     fill="url(#a)"
     stroke-width="1.1136"
     id="circle4" />
</svg>
