<?xml version="1.0" encoding="UTF-8" standalone="no"?>
<svg
   height="32"
   width="32"
   version="1.1"
   id="svg292"
   sodipodi:docname="restore_defaults_200.svg"
   inkscape:export-filename="restore_defaults_200.png"
   inkscape:export-xdpi="96"
   inkscape:export-ydpi="96"
   inkscape:version="1.2.2 (732a01da63, 2022-12-09)"
   xmlns:inkscape="http://www.inkscape.org/namespaces/inkscape"
   xmlns:sodipodi="http://sodipodi.sourceforge.net/DTD/sodipodi-0.dtd"
   xmlns="http://www.w3.org/2000/svg"
   xmlns:svg="http://www.w3.org/2000/svg">
  <defs
     id="defs296" />
  <sodipodi:namedview
     id="namedview294"
     pagecolor="#ffffff"
     bordercolor="#666666"
     borderopacity="1.0"
     inkscape:showpageshadow="2"
     inkscape:pageopacity="0.0"
     inkscape:pagecheckerboard="0"
     inkscape:deskcolor="#d1d1d1"
     showgrid="true"
     inkscape:zoom="28.6875"
     inkscape:cx="15.982571"
     inkscape:cy="16"
     inkscape:current-layer="svg292">
    <inkscape:grid
       type="xygrid"
       id="grid415" />
  </sodipodi:namedview>
  <g
     fill="none"
     stroke="#f00"
     stroke-width="1.75"
     transform="matrix(2.0000506 0 0 2.0000506 0 -.000828)"
     id="g290">
    <path
       d="m9 13.125h1.494664c2.280905 0 4.129944-1.846826 4.129944-4.1249999 0-2.2781748-1.849039-4.1250001-4.129944-4.1250001h-8.494664"
       id="path280" />
    <path
       d="m4.5330707 8.0331072-3.1581069-3.1581069 3.1581069-3.1581075"
       stroke-linecap="round"
       stroke-linejoin="round"
       id="path282" />
    <path
       d="m0 13.125h2"
       id="path284" />
    <path
       d="m3 13.125h2"
       id="path286" />
    <path
       d="m6 13.125h2"
       id="path288" />
  </g>
</svg>
