<?xml version="1.0" encoding="UTF-8" standalone="no"?>
<svg
   height="64"
   width="64"
   version="1.1"
   id="svg969"
   sodipodi:docname="Copy_01_64.svg"
   inkscape:export-filename="Copy_01_64.png"
   inkscape:export-xdpi="96"
   inkscape:export-ydpi="96"
   inkscape:version="1.2-beta (1b65182ce9, 2022-04-05)"
   xmlns:inkscape="http://www.inkscape.org/namespaces/inkscape"
   xmlns:sodipodi="http://sodipodi.sourceforge.net/DTD/sodipodi-0.dtd"
   xmlns:xlink="http://www.w3.org/1999/xlink"
   xmlns="http://www.w3.org/2000/svg"
   xmlns:svg="http://www.w3.org/2000/svg">
  <defs
     id="defs973" />
  <sodipodi:namedview
     id="namedview971"
     pagecolor="#ffffff"
     bordercolor="#666666"
     borderopacity="1.0"
     inkscape:pageshadow="2"
     inkscape:pageopacity="0.0"
     inkscape:pagecheckerboard="0"
     inkscape:deskcolor="#d1d1d1"
     showgrid="true"
     inkscape:zoom="14.34375"
     inkscape:cx="32"
     inkscape:cy="32"
     inkscape:current-layer="svg969">
    <inkscape:grid
       type="xygrid"
       id="grid1532" />
  </sodipodi:namedview>
  <linearGradient
     id="a">
    <stop
       offset="0"
       stop-color="#fff"
       id="stop940" />
    <stop
       offset="1"
       stop-color="#dfeaf4"
       id="stop942" />
  </linearGradient>
  <linearGradient
     id="b"
     gradientTransform="matrix(1.5833334,0,0,1.6428572,8.541667,6.035714)"
     gradientUnits="userSpaceOnUse"
     x1="3"
     x2="13"
     xlink:href="#a"
     y1="2"
     y2="14" />
  <linearGradient
     id="c"
     gradientTransform="matrix(1.5833334,0,0,1.6428572,-3.458334,-1.964286)"
     gradientUnits="userSpaceOnUse"
     x1="3"
     x2="13"
     xlink:href="#a"
     y1="2"
     y2="14" />
  <g
     fill-rule="evenodd"
     id="g967"
     transform="scale(1.9999999)">
    <path
       d="M 0.5,23.500001 V 0.5 h 15 l 4,4 v 19.000001 z"
       fill="url(#c)"
       stroke="#75a5d3"
       stroke-linecap="square"
       stroke-opacity="0.996774"
       id="path947"
       style="fill:url(#c)" />
    <path
       d="m 4.0000002,8 v 2 H 15.000001 V 8 Z"
       fill="#80c1fb"
       id="path949" />
    <path
       d="M 4,4 V 6 H 14 V 4 Z"
       fill="#80c1fb"
       id="path951" />
    <path
       d="m 4.0000002,12 v 2 H 15.000001 v -2 z"
       fill="#a7d4fb"
       id="path953" />
    <path
       d="m 4.0000002,16 v 2 H 15.000001 v -2 z"
       fill="#d7eafb"
       id="path955" />
    <path
       d="M 12.5,31.5 V 8.4999999 l 15,10e-8 4,4 2e-6,19 z"
       fill="url(#b)"
       stroke="#75a5d3"
       stroke-linecap="square"
       id="path957"
       style="fill:url(#b)" />
    <path
       d="m 16.000001,16 v 2 h 11 v -2 z"
       fill="#80c1fb"
       id="path959" />
    <path
       d="m 16,12 v 2 h 10 v -2 z"
       fill="#80c1fb"
       id="path961" />
    <path
       d="m 16.000001,20 v 2 h 11 v -2 z"
       fill="#a7d4fb"
       id="path963" />
    <path
       d="m 16.000001,24 v 2 h 11 v -2 z"
       fill="#d7eafb"
       id="path965" />
  </g>
</svg>
