<?xml version="1.0" encoding="UTF-8" standalone="no"?>
<svg
   height="32"
   width="32"
   version="1.1"
   id="svg338"
   sodipodi:docname="menu_source_invertassignment_200.svg"
   inkscape:export-filename="menu_source_invertassignment_200.png"
   inkscape:export-xdpi="96"
   inkscape:export-ydpi="96"
   inkscape:version="1.2.2 (732a01da63, 2022-12-09)"
   xmlns:inkscape="http://www.inkscape.org/namespaces/inkscape"
   xmlns:sodipodi="http://sodipodi.sourceforge.net/DTD/sodipodi-0.dtd"
   xmlns="http://www.w3.org/2000/svg"
   xmlns:svg="http://www.w3.org/2000/svg">
  <defs
     id="defs342" />
  <sodipodi:namedview
     id="namedview340"
     pagecolor="#ffffff"
     bordercolor="#666666"
     borderopacity="1.0"
     inkscape:showpageshadow="2"
     inkscape:pageopacity="0.0"
     inkscape:pagecheckerboard="0"
     inkscape:deskcolor="#d1d1d1"
     showgrid="true"
     inkscape:zoom="28.6875"
     inkscape:cx="15.982571"
     inkscape:cy="16"
     inkscape:current-layer="svg338">
    <inkscape:grid
       type="xygrid"
       id="grid461" />
  </sodipodi:namedview>
  <g
     fill="none"
     transform="matrix(2.0000001 0 0 2.0000001 -14.000001 -17.000002)"
     id="g336">
    <g
       stroke="#00d400"
       stroke-linecap="round"
       stroke-width=".264581"
       transform="matrix(3.7795573 0 0 3.7795573 12.5 3.500001)"
       id="g314">
      <path
         d="m1.058325 1.5874873.3968719.3968719-.3968719.3968719"
         stroke-linejoin="round"
         id="path310" />
      <path
         d="m1.4551969 1.9843592h-1.5874875"
         id="path312" />
    </g>
    <g
       stroke="#f00"
       stroke-linecap="round"
       stroke-width=".264581"
       transform="matrix(-3.7795573 0 0 3.7795573 18.5 13.500001)"
       id="g320">
      <path
         d="m1.058325 1.5874873.3968719.3968719-.3968719.3968719"
         stroke-linejoin="round"
         id="path316" />
      <path
         d="m1.4551969 1.9843592h-1.5874875"
         id="path318" />
    </g>
    <path
       d="m10.5 6.5000001 4.5-.0000001"
       stroke="#d4aa00"
       stroke-width=".625"
       transform="translate(2.5 10.3125)"
       id="path322" />
    <path
       d="m10.5 6.4999998 4.5.0000002"
       stroke="#d4aa00"
       stroke-width=".625"
       transform="translate(2.5 8.687501)"
       id="path324" />
    <g
       stroke="#2a7fff"
       stroke-linecap="round"
       id="g334">
      <path
         d="m8 14 3 4"
         id="path326" />
      <path
         d="m11 14-3 4"
         id="path328" />
      <path
         d="m19.5 14 1.5 2"
         id="path330" />
      <path
         d="m22.5 14-1.5 2v2"
         id="path332" />
    </g>
  </g>
</svg>
