<?xml version="1.0" encoding="UTF-8" standalone="no"?>
<svg
   width="16"
   height="16"
   viewBox="0 0 16 16"
   version="1.1"
   id="svg1"
   sodipodi:docname="tag_sub.svg"
   inkscape:version="1.3.2 (091e20e, 2023-11-25, custom)"
   inkscape:export-filename="tag_sub.png"
   inkscape:export-xdpi="96"
   inkscape:export-ydpi="96"
   xmlns:inkscape="http://www.inkscape.org/namespaces/inkscape"
   xmlns:sodipodi="http://sodipodi.sourceforge.net/DTD/sodipodi-0.dtd"
   xmlns="http://www.w3.org/2000/svg"
   xmlns:svg="http://www.w3.org/2000/svg">
  <defs
     id="defs1" />
  <sodipodi:namedview
     id="namedview1"
     pagecolor="#ffffff"
     bordercolor="#000000"
     borderopacity="0.25"
     inkscape:showpageshadow="2"
     inkscape:pageopacity="0.0"
     inkscape:pagecheckerboard="0"
     inkscape:deskcolor="#d1d1d1"
     showgrid="true"
     inkscape:current-layer="svg1">
    <inkscape:grid
       id="grid1"
       units="px"
       originx="0"
       originy="0"
       spacingx="0.5"
       spacingy="0.5"
       empcolor="#0099e5"
       empopacity="0.30196078"
       color="#0099e5"
       opacity="0.14901961"
       empspacing="2"
       dotted="false"
       gridanglex="30"
       gridanglez="30"
       visible="true" />
  </sodipodi:namedview>
  <g
     fill="#00aad4"
     id="g2"
     transform="scale(3.7795275)"
     style="fill:#008dd2;fill-opacity:1">
    <path
       d="M 3.4395833,4.0739955 3.9318996,3.43911 c 0.05873,-0.075737 0.093876,-0.1899703 0.043431,-0.2799187 -0.044605,-0.079536 -0.1573791,-0.089408 -0.235682,-0.05855 -0.066856,0.026347 -0.103588,0.098032 -0.1097239,0.1667499 -0.063142,-6.04e-4 -0.128703,0.00121 -0.1903412,-9e-4 0.016483,-0.1329035 0.087347,-0.2687981 0.2159804,-0.3231958 0.1075259,-0.045472 0.233082,-0.041062 0.3418784,-0.00138 0.1100216,0.040129 0.1785247,0.1500619 0.188805,0.2644164 0.01254,0.1394875 -0.054114,0.2689593 -0.13602,0.3766645 L 3.6993858,4.0443456 H 4.1955359 V 4.2333333 H 3.4395835 Z"
       stroke-width="0.264583"
       id="path1"
       style="fill:#008dd2;fill-opacity:1" />
    <text
       stroke-linejoin="round"
       stroke-width="0.396875"
       x="0.66145802"
       y="0.66145802"
       id="text1"
       style="fill:#008dd2;fill-opacity:1"><tspan
         stroke-width="0.396875"
         id="tspan1"
         style="fill:#008dd2;fill-opacity:1" /></text>
    <path
       d="M 0.78284234,0.74611967 1.6935389,2.0934115 0.74083334,3.4872137 H 1.3379629 l 0.649639,-0.949706 0.622636,0.949706 h 0.597127 L 2.2666619,2.1144161 3.1653599,0.74611967 H 2.5652279 L 1.9861009,1.6868233 1.3829709,0.74611967 Z"
       stroke-width="0.264583"
       id="path2"
       style="fill:#008dd2;fill-opacity:1" />
  </g>
</svg>
