<?xml version="1.0" encoding="UTF-8" standalone="no"?>
<svg
   width="24"
   height="24"
   version="1.1"
   viewBox="0 0 24 24"
   id="svg11"
   sodipodi:docname="tlistchartsource.svg"
   inkscape:version="1.3.2 (091e20e, 2023-11-25, custom)"
   xmlns:inkscape="http://www.inkscape.org/namespaces/inkscape"
   xmlns:sodipodi="http://sodipodi.sourceforge.net/DTD/sodipodi-0.dtd"
   xmlns="http://www.w3.org/2000/svg"
   xmlns:svg="http://www.w3.org/2000/svg">
  <defs
     id="defs11" />
  <sodipodi:namedview
     id="namedview11"
     pagecolor="#ffffff"
     bordercolor="#000000"
     borderopacity="0.25"
     inkscape:showpageshadow="2"
     inkscape:pageopacity="0.0"
     inkscape:pagecheckerboard="0"
     inkscape:deskcolor="#d1d1d1"
     showgrid="true"
     inkscape:current-layer="svg11">
    <inkscape:grid
       id="grid11"
       units="px"
       originx="0"
       originy="0"
       spacingx="0.5"
       spacingy="0.5"
       empcolor="#0099e5"
       empopacity="0.30196078"
       color="#0099e5"
       opacity="0.14901961"
       empspacing="2"
       dotted="false"
       gridanglex="30"
       gridanglez="30"
       visible="true" />
  </sodipodi:namedview>
  <rect
     x="1.25"
     y="1.25"
     width="21.5"
     height="21.5"
     fill="#ffffff"
     fill-rule="evenodd"
     stroke="#2a7efe"
     stroke-linecap="square"
     stroke-linejoin="round"
     stroke-width=".5"
     style="paint-order:normal"
     id="rect1" />
  <path
     d="m3.55 13.2 2.95-5.2 2 8.5 3.5-2.5 3.45 6.45"
     fill="none"
     stroke="#2a7efe"
     stroke-linecap="round"
     stroke-linejoin="round"
     stroke-width="1.1"
     id="path1" />
  <path
     d="m3.5 5v15.5h15.5"
     fill="none"
     stroke="#4d4d4d"
     stroke-linecap="round"
     stroke-linejoin="round"
     id="path2" />
  <rect
     x="10.25"
     y="1.25"
     width="12.5"
     height="11.5"
     fill="#f9f9f9"
     stroke="#2a7efe"
     stroke-linejoin="round"
     stroke-width=".5"
     style="paint-order:normal"
     id="rect2" />
  <path
     d="m12 9.5 1.961538 1e-6"
     fill="none"
     stroke="#b3b3b3"
     stroke-width=".999999px"
     id="path3" />
  <path
     d="m12 7.4999994 2.653846 1e-6"
     fill="none"
     stroke="#b3b3b3"
     stroke-width=".999999px"
     id="path4" />
  <path
     d="m12 5.4999992 2.307693 1e-6"
     fill="none"
     stroke="#b3b3b3"
     stroke-width=".999999px"
     id="path5" />
  <path
     d="m12 3.499999 3 1e-6"
     fill="none"
     stroke="#b3b3b3"
     stroke-width=".999999px"
     id="path6" />
  <path
     d="m16.25 1.5v11"
     fill="none"
     stroke="#2a7efe"
     stroke-linecap="round"
     stroke-linejoin="round"
     stroke-width=".5"
     id="path7" />
  <path
     d="m18 9.500001 1.634615 1e-6"
     fill="none"
     stroke="#b3b3b3"
     id="path8" />
  <path
     d="m18 7.5000004 2.211538 1e-6"
     fill="none"
     stroke="#b3b3b3"
     id="path9" />
  <path
     d="m18 5.5000002 1.923077 1e-6"
     fill="none"
     stroke="#b3b3b3"
     id="path10" />
  <path
     d="m18 3.5 2.5 1e-6"
     fill="none"
     stroke="#b3b3b3"
     id="path11" />
</svg>
