<?xml version="1.0" encoding="UTF-8" standalone="no"?>
<svg
   width="32"
   height="32"
   version="1.1"
   viewBox="0 0 8.4667 8.4667"
   id="svg324"
   sodipodi:docname="menu_edit_select_word_200.svg"
   inkscape:export-filename="menu_edit_select_word_200.png"
   inkscape:export-xdpi="96"
   inkscape:export-ydpi="96"
   inkscape:version="1.2.1 (9c6d41e410, 2022-07-14)"
   xmlns:inkscape="http://www.inkscape.org/namespaces/inkscape"
   xmlns:sodipodi="http://sodipodi.sourceforge.net/DTD/sodipodi-0.dtd"
   xmlns="http://www.w3.org/2000/svg"
   xmlns:svg="http://www.w3.org/2000/svg">
  <defs
     id="defs328" />
  <sodipodi:namedview
     id="namedview326"
     pagecolor="#ffffff"
     bordercolor="#666666"
     borderopacity="1.0"
     inkscape:showpageshadow="2"
     inkscape:pageopacity="0.0"
     inkscape:pagecheckerboard="0"
     inkscape:deskcolor="#d1d1d1"
     showgrid="true"
     inkscape:zoom="28.6875"
     inkscape:cx="13.228758"
     inkscape:cy="16"
     inkscape:current-layer="svg324">
    <inkscape:grid
       type="xygrid"
       id="grid551" />
  </sodipodi:namedview>
  <path
     d="m 1.3229219,0.26458499 5.8207185,8e-7"
     id="path304"
     style="fill:none;stroke:#d4aa00;stroke-width:0.52917" />
  <path
     d="m 1.3229219,5.5562849 5.820856,-7e-7"
     id="path306"
     style="fill:none;stroke:#d4aa00;stroke-width:0.52917" />
  <path
     d="m 1.3229219,1.3229849 5.820856,-7e-7"
     id="path308"
     style="fill:none;stroke:#d4aa00;stroke-width:0.52917" />
  <path
     d="m 1.3229219,4.4979849 5.8207185,5e-7"
     id="path310"
     style="fill:none;stroke:#d4aa00;stroke-width:0.52917" />
  <path
     d="m 1.3229219,3.4396849 5.820856,-10e-8"
     id="path312"
     style="fill:none;stroke:#d4aa00;stroke-width:0.52917" />
  <path
     d="m 1.3229219,2.3812849 1.3229218,-2.55e-5"
     id="path314"
     style="fill:none;stroke:#d4aa00;stroke-width:0.52917"
     sodipodi:nodetypes="cc" />
  <path
     d="m 1.3229219,6.6146849 5.8207185,6e-7"
     id="path316"
     style="fill:none;stroke:#d4aa00;stroke-width:0.52917" />
  <path
     d="M 3.175,2.3812849 H 4.7625"
     stroke="#2a7fff"
     id="path320"
     style="fill:none;stroke-width:0.793753;stroke-dasharray:none" />
  <path
     d="m 1.3230596,7.6729463 5.8207185,6e-7"
     id="path553"
     style="fill:none;stroke:#d4aa00;stroke-width:0.52917" />
  <path
     d="m 5.2916875,2.3812594 1.8519529,2.6e-5"
     id="path430"
     style="fill:none;stroke:#d4aa00;stroke-width:0.52917"
     sodipodi:nodetypes="cc" />
</svg>
