<?xml version="1.0" encoding="UTF-8" standalone="no"?>
<svg
   height="36"
   width="36"
   version="1.1"
   id="svg193"
   sodipodi:docname="Health_15_36.svg"
   inkscape:export-filename="Health_15_36.png"
   inkscape:export-xdpi="96"
   inkscape:export-ydpi="96"
   inkscape:version="1.2.1 (9c6d41e410, 2022-07-14)"
   xmlns:inkscape="http://www.inkscape.org/namespaces/inkscape"
   xmlns:sodipodi="http://sodipodi.sourceforge.net/DTD/sodipodi-0.dtd"
   xmlns="http://www.w3.org/2000/svg"
   xmlns:svg="http://www.w3.org/2000/svg">
  <defs
     id="defs197" />
  <sodipodi:namedview
     id="namedview195"
     pagecolor="#ffffff"
     bordercolor="#666666"
     borderopacity="1.0"
     inkscape:showpageshadow="2"
     inkscape:pageopacity="0.0"
     inkscape:pagecheckerboard="0"
     inkscape:deskcolor="#d1d1d1"
     showgrid="true"
     inkscape:zoom="25.5"
     inkscape:cx="16.54902"
     inkscape:cy="18"
     inkscape:current-layer="svg193">
    <inkscape:grid
       type="xygrid"
       id="grid1132" />
  </sodipodi:namedview>
  <radialGradient
     id="a"
     cx="8.559438"
     cy="9.409261"
     gradientTransform="matrix(.5780985 2.2097248 -2.0700251 .59998064 35.849855 -3.967852)"
     gradientUnits="userSpaceOnUse"
     r="5.499738">
    <stop
       offset="0"
       stop-color="#faa"
       id="stop162" />
    <stop
       offset="1"
       stop-color="#f00"
       id="stop164" />
  </radialGradient>
  <linearGradient
     id="b"
     gradientTransform="matrix(1.9461538 0 0 2.7026824 -2.169231 -3.522845)"
     gradientUnits="userSpaceOnUse"
     x1="6.227273"
     x2="3.863637"
     y1="13.076924"
     y2="5.461539">
    <stop
       offset="0"
       stop-color="#e3ce49"
       id="stop167" />
    <stop
       offset="1"
       stop-color="#fceb84"
       id="stop169" />
  </linearGradient>
  <linearGradient
     id="c"
     gradientTransform="matrix(1.9461538 0 0 2.7026824 -2.169231 -3.522845)"
     gradientUnits="userSpaceOnUse"
     x1="7.5"
     x2="7.5"
     y1="13.5"
     y2="2.5">
    <stop
       offset="0"
       stop-color="#aa8e1e"
       id="stop172" />
    <stop
       offset="1"
       stop-color="#ccaa24"
       id="stop174" />
  </linearGradient>
  <linearGradient
     id="d"
     gradientTransform="matrix(.95192312 0 0 .57954542 5.884619 -8.386086)"
     gradientUnits="userSpaceOnUse"
     x1="5.399997"
     x2="5.399997"
     y1="4.333334"
     y2="11.666667">
    <stop
       offset="0"
       stop-color="#fc0"
       id="stop177"
       style="stop-color:#ff6600;stop-opacity:1;" />
    <stop
       offset="1"
       stop-color="#fff6d5"
       id="stop179" />
  </linearGradient>
  <linearGradient
     id="e"
     gradientTransform="matrix(.95192312 0 0 .57954542 5.884619 -8.386086)"
     gradientUnits="userSpaceOnUse"
     x1="7.999997"
     x2="7.999997"
     y1="13.500001"
     y2="2.5">
    <stop
       offset="0"
       stop-color="#744b18"
       id="stop182" />
    <stop
       offset="1"
       stop-color="#ca7f26"
       id="stop184" />
  </linearGradient>
  <rect
     fill="url(#b)"
     fill-rule="evenodd"
     height="28.5"
     rx="1.5"
     stroke="url(#c)"
     stroke-linecap="square"
     stroke-width="1.5"
     width="25.5"
     x=".75"
     y="3.749721"
     id="rect187" />
  <rect
     fill="url(#d)"
     fill-rule="evenodd"
     height="6.375"
     rx="1.5"
     stroke="url(#e)"
     stroke-linecap="square"
     stroke-width="1.125"
     transform="scale(1 -1)"
     width="12.375"
     x="7.3125"
     y="-6.937221"
     id="rect189" />
  <path
     d="m24.500842 17.434157c6.374059-10.0871974 20.25918 3.179989-.0014 17.665862-20.26062-14.485895-6.371506-27.7530594.0014-17.665862z"
     fill="url(#a)"
     stroke="#fff"
     stroke-linejoin="round"
     stroke-width="1.8"
     id="path191" />
</svg>
