<svg width="36" height="36" version="1.1" viewBox="0 0 36 36" xmlns="http://www.w3.org/2000/svg">
 <path d="m26.77408 21.95395c0.818486 0.818322 1.48856 0.738861 2.306954-0.07956 0.818399-0.818413 1.096619-1.687213 0.278307-2.505712l-12.72791-12.728136c-0.816676-0.816867-1.689091-0.538504-2.50583 0.278423-0.818311 0.8185-0.897862 1.488454-0.07956 2.306955" fill="none" stroke="#1a8cff" stroke-linecap="round" stroke-width="1.68752"/>
 <path d="m14.046049 9.22592-2.386503 2.386504" fill="none" stroke="#1a8cff" stroke-linecap="round" stroke-width="1.68752"/>
 <path d="m26.77408 21.95395-2.386504 2.386504" fill="none" stroke="#1a8cff" stroke-linecap="round" stroke-width="1.68752"/>
 <path d="M 10.864045,25.13595 0,36" fill="none" stroke="#1a8cff" stroke-width="4.05003"/>
 <path d="m11.659546 11.612424c-7.955016 4.773009-5.568507 8.750521-0.795499 13.523528 4.773009 4.773009 8.750518 7.159516 13.523529-0.795498" fill="none" stroke="#1a8cff" stroke-linecap="round" stroke-width="1.68752"/>
 <path d="m24.387572 5.248412-3.977509 3.977508" fill="none" stroke="#1a8cff" stroke-linecap="round" stroke-width="3.37503"/>
 <path d="m30.751583 11.612424-3.977508 3.977507" fill="none" stroke="#1a8cff" stroke-linecap="round" stroke-width="3.37503"/>
</svg>
