<?xml version="1.0" encoding="UTF-8" standalone="no"?>
<svg
   height="32"
   viewBox="0 0 8.4667 8.4667"
   width="32"
   version="1.1"
   id="svg497"
   sodipodi:docname="Secure_06_32.svg"
   inkscape:version="1.2.2 (732a01da63, 2022-12-09)"
   xmlns:inkscape="http://www.inkscape.org/namespaces/inkscape"
   xmlns:sodipodi="http://sodipodi.sourceforge.net/DTD/sodipodi-0.dtd"
   xmlns="http://www.w3.org/2000/svg"
   xmlns:svg="http://www.w3.org/2000/svg">
  <defs
     id="defs501" />
  <sodipodi:namedview
     id="namedview499"
     pagecolor="#ffffff"
     bordercolor="#000000"
     borderopacity="0.25"
     inkscape:showpageshadow="2"
     inkscape:pageopacity="0.0"
     inkscape:pagecheckerboard="0"
     inkscape:deskcolor="#d1d1d1"
     showgrid="true"
     inkscape:zoom="28.4375"
     inkscape:cx="13.415385"
     inkscape:cy="16"
     inkscape:current-layer="svg497">
    <inkscape:grid
       type="xygrid"
       id="grid1076" />
  </sodipodi:namedview>
  <filter
     id="a"
     color-interpolation-filters="sRGB"
     height="1.1801321"
     width="1.190248"
     x="-0.095123999"
     y="-0.10785206">
    <feGaussianBlur
       stdDeviation=".1328125"
       id="feGaussianBlur467" />
  </filter>
  <linearGradient
     id="b"
     gradientTransform="matrix(.30102032 0 0 -.26093009 -12.988998 6.840881)"
     gradientUnits="userSpaceOnUse"
     x1="52.5"
     x2="61.5"
     y1="7"
     y2="7">
    <stop
       offset="0"
       stop-color="#fc0"
       id="stop470" />
    <stop
       offset=".37840304"
       stop-color="#f9f9f9"
       id="stop472" />
    <stop
       offset="1"
       stop-color="#ffd42a"
       id="stop474" />
  </linearGradient>
  <linearGradient
     id="c"
     gradientTransform="matrix(1.9356879 0 0 1.9869248 .136143 -.059991)"
     gradientUnits="userSpaceOnUse"
     x1="1.499774"
     x2="3.614834"
     y1="1.322335"
     y2="2.204926">
    <stop
       offset="0"
       stop-color="#80b5fe"
       id="stop477" />
    <stop
       offset="1"
       stop-color="#2a7efe"
       id="stop479" />
  </linearGradient>
  <linearGradient
     id="d"
     gradientTransform="matrix(1.9356879 0 0 1.9869248 .136143 -.059991)"
     gradientUnits="userSpaceOnUse"
     x1=".530372"
     x2="3.879216"
     y1="1.145817"
     y2="2.557962">
    <stop
       offset="0"
       stop-color="#e7c962"
       id="stop482" />
    <stop
       offset="1"
       stop-color="#d4a41c"
       id="stop484" />
  </linearGradient>
  <g
     stroke-linejoin="round"
     id="g495">
    <path
       d="m.99219181 4.6717587-.00000019-3.1565547c1.02352358 0 2.38822188-.52609236 3.24115848-1.05218478.8529364.52609252 2.2176347 1.05218478 3.2411583 1.05218478v3.1565547c0 1.2310702-1.7058728 3.1565545-3.2411583 3.3319187-1.5352856-.1753642-3.24115829-2.1008485-3.24115829-3.3319187z"
       fill="url(#c)"
       stroke="url(#d)"
       stroke-linecap="round"
       stroke-width=".396877"
       id="path487" />
    <path
       d="m3.175011 3.9688232v-.8021616c0-.5798925.4738343-1.049988 1.0583386-1.049988.5845044 0 1.0583391.4700955 1.0583391 1.049988v.8021616"
       fill="none"
       stroke="#b3b3b3"
       stroke-width=".529166"
       id="path489" />
    <path
       d="m5 7.8021661v-1.9099298c0-1.380712 1.119288-2.5 2.5-2.5s2.5 1.119288 2.5 2.5v1.9099298"
       fill="none"
       filter="url(#a)"
       stroke="#fff"
       stroke-width=".31374"
       transform="matrix(.42333543 0 0 .41999523 1.058334 .69195)"
       id="path491" />
    <path
       d="m5.6885642 5.9532058v-1.8520902h-2.9104285v1.8520902z"
       fill="url(#b)"
       stroke="#d4aa00"
       stroke-linecap="round"
       stroke-width=".264584"
       id="path493" />
  </g>
</svg>
