<?xml version="1.0" encoding="UTF-8" standalone="no"?>
<svg
   height="32"
   width="32"
   version="1.1"
   id="svg6"
   sodipodi:docname="Copyright_01_32.svg"
   inkscape:export-filename="Copyright_01_32.png"
   inkscape:export-xdpi="96"
   inkscape:export-ydpi="96"
   inkscape:version="1.2-beta (1b65182ce9, 2022-04-05)"
   xmlns:inkscape="http://www.inkscape.org/namespaces/inkscape"
   xmlns:sodipodi="http://sodipodi.sourceforge.net/DTD/sodipodi-0.dtd"
   xmlns="http://www.w3.org/2000/svg"
   xmlns:svg="http://www.w3.org/2000/svg">
  <defs
     id="defs10" />
  <sodipodi:namedview
     id="namedview8"
     pagecolor="#ffffff"
     bordercolor="#666666"
     borderopacity="1.0"
     inkscape:pageshadow="2"
     inkscape:pageopacity="0.0"
     inkscape:pagecheckerboard="0"
     inkscape:deskcolor="#d1d1d1"
     showgrid="true"
     inkscape:zoom="28.6875"
     inkscape:cx="15.215686"
     inkscape:cy="16"
     inkscape:current-layer="svg6">
    <inkscape:grid
       type="xygrid"
       id="grid794" />
  </sodipodi:namedview>
  <g
     id="g798"
     transform="matrix(0.96875,0,0,0.96875,0.5,0.5)">
    <path
       d="m 16.203126,6.917969 c -1.696356,0 -3.212524,0.358926 -4.54297,1.074219 -1.318418,0.702202 -2.3396,1.758586 -3.054688,3.160156 -0.715332,1.387748 -1.070312,3.023582 -1.070312,4.902344 0,2.873904 0.78377,5.136632 2.359376,6.76953 1.573616,1.63084 3.626948,2.44922 6.136718,2.44922 1.982842,0 3.676766,-0.529706 5.066406,-1.589844 1.402844,-1.073608 2.321172,-2.513994 2.75,-4.300782 0,0 -2.804324,-0.805846 -2.800782,-0.808594 -0.306352,1.239332 -0.931392,2.212012 -1.875,2.933594 -0.944432,0.722214 -2.035958,1.082032 -3.289064,1.082032 -1.560172,0 -2.818552,-0.537734 -3.804686,-1.621094 -0.968364,-1.092868 -1.460936,-2.703794 -1.460936,-4.851562 0,-2.146898 0.517526,-3.781668 1.542968,-4.91797 1.043124,-1.140482 2.355,-1.703124 3.957032,-1.703124 1.099976,0 2.045156,0.274676 2.847656,0.828124 0.816338,0.539614 1.433718,1.320882 1.851562,2.351564 0.0014,0.0024 2.710938,-0.679686 2.710938,-0.679686 C 23.069436,10.436342 22.206934,9.20008 20.945312,8.296876 19.681842,7.377988 18.099438,6.917969 16.203126,6.917969 Z"
       fill="#00aad4"
       id="path2" />
    <circle
       cx="16"
       cy="16"
       fill="none"
       r="14.75"
       stroke="#00aad4"
       stroke-width="2.5"
       id="circle4" />
  </g>
</svg>
