<?xml version="1.0" encoding="UTF-8" standalone="no"?>
<svg
   height="16"
   width="16"
   version="1.1"
   id="svg29"
   sodipodi:docname="menu_view_search_results.svg"
   inkscape:export-filename="menu_view_search_results.png"
   inkscape:export-xdpi="96"
   inkscape:export-ydpi="96"
   inkscape:version="1.2.2 (732a01da63, 2022-12-09)"
   xmlns:inkscape="http://www.inkscape.org/namespaces/inkscape"
   xmlns:sodipodi="http://sodipodi.sourceforge.net/DTD/sodipodi-0.dtd"
   xmlns="http://www.w3.org/2000/svg"
   xmlns:svg="http://www.w3.org/2000/svg">
  <defs
     id="defs33" />
  <sodipodi:namedview
     id="namedview31"
     pagecolor="#ffffff"
     bordercolor="#666666"
     borderopacity="1.0"
     inkscape:showpageshadow="2"
     inkscape:pageopacity="0.0"
     inkscape:pagecheckerboard="0"
     inkscape:deskcolor="#d1d1d1"
     showgrid="true"
     inkscape:zoom="57.375"
     inkscape:cx="7.9912854"
     inkscape:cy="8"
     inkscape:current-layer="svg29">
    <inkscape:grid
       type="xygrid"
       id="grid605" />
  </sodipodi:namedview>
  <radialGradient
     id="a"
     cx="5.9886"
     cy="7.2881"
     gradientTransform="matrix(-.00000017 1.0569 -.97561001 -.00000015 14.696 .64615)"
     gradientUnits="userSpaceOnUse"
     r="3.75">
    <stop
       offset="0"
       stop-color="#f8fbff"
       id="stop2" />
    <stop
       offset=".66667"
       stop-color="#d1e3ff"
       id="stop4" />
    <stop
       offset="1"
       stop-color="#f8fbff"
       id="stop6" />
  </radialGradient>
  <path
     d="m.39993624 12.600064v-8.200128h14.20012676v8.200128z"
     style="stroke-linecap:round;stroke-linejoin:round;stroke-miterlimit:5.6;fill:#2a7fff;stroke:#2a7fff;stroke-width:.799872"
     id="path9" />
  <path
     d="m1 6.5h13v5.5h-13z"
     fill="#fff"
     stroke-width=".723745"
     id="path11" />
  <g
     transform="translate(0 -4)"
     id="g21">
    <path
       d="m15 13-1.5-1.5-2 2 3.5 3.5z"
       fill="#fff"
       id="path13" />
    <g
       stroke-linecap="round"
       id="g19">
      <path
         d="m11 11 4 4"
         fill="none"
         stroke="#d4aa00"
         stroke-width="2"
         id="path15" />
      <circle
         cx="8.5"
         cy="8.5"
         fill="url(#a)"
         fill-rule="evenodd"
         r="3.125"
         stroke="#2c5aa0"
         stroke-linejoin="round"
         stroke-width=".75"
         id="circle17" />
    </g>
  </g>
  <g
     fill="none"
     stroke="#ccc"
     id="g27">
    <path
       d="m2 8.5h4"
       id="path23" />
    <path
       d="m2 10.5h8"
       id="path25" />
  </g>
</svg>
