<?xml version="1.0" encoding="UTF-8" standalone="no"?>
<svg
   height="24"
   width="24"
   version="1.1"
   id="svg6"
   sodipodi:docname="Align_03_24.svg"
   inkscape:export-filename="Align_03_24.png"
   inkscape:export-xdpi="96"
   inkscape:export-ydpi="96"
   inkscape:version="1.3-beta (cedbd6c6ff, 2023-05-28)"
   xmlns:inkscape="http://www.inkscape.org/namespaces/inkscape"
   xmlns:sodipodi="http://sodipodi.sourceforge.net/DTD/sodipodi-0.dtd"
   xmlns="http://www.w3.org/2000/svg"
   xmlns:svg="http://www.w3.org/2000/svg">
  <defs
     id="defs6" />
  <sodipodi:namedview
     id="namedview6"
     pagecolor="#ffffff"
     bordercolor="#000000"
     borderopacity="0.25"
     inkscape:showpageshadow="2"
     inkscape:pageopacity="0.0"
     inkscape:pagecheckerboard="0"
     inkscape:deskcolor="#d1d1d1"
     showgrid="true"
     inkscape:zoom="37.875"
     inkscape:cx="12"
     inkscape:cy="12"
     inkscape:current-layer="g6">
    <inkscape:grid
       id="grid6"
       units="px"
       originx="0"
       originy="0"
       spacingx="0.5"
       spacingy="0.5"
       empcolor="#0099e5"
       empopacity="0.30196078"
       color="#0099e5"
       opacity="0.14901961"
       empspacing="2"
       dotted="false"
       gridanglex="30"
       gridanglez="30"
       visible="true" />
  </sodipodi:namedview>
  <g
     fill="none"
     stroke="#00aad4"
     stroke-width="1.2"
     id="g6">
    <path
       d="M 20,20.6 H 4"
       id="path1" />
    <path
       d="M 20,17.6 H 8"
       id="path2"
       sodipodi:nodetypes="cc" />
    <path
       d="M 20,14.6 H 4"
       id="path3" />
    <path
       d="M 20,11.6 H 8"
       id="path4"
       sodipodi:nodetypes="cc" />
    <path
       d="M 20,8.6 H 4"
       id="path5" />
    <path
       d="M 20,5.6 H 8"
       id="path6"
       sodipodi:nodetypes="cc" />
    <path
       d="M 20,2.6 H 4"
       id="path7" />
  </g>
</svg>
