<?xml version="1.0" encoding="UTF-8" standalone="no"?>
<svg
   height="32"
   width="32"
   version="1.1"
   id="svg299"
   sodipodi:docname="Cancel_04_32.svg"
   inkscape:export-filename="Cancel_04_32.png"
   inkscape:export-xdpi="96"
   inkscape:export-ydpi="96"
   inkscape:version="1.2-beta (1b65182ce9, 2022-04-05)"
   xmlns:inkscape="http://www.inkscape.org/namespaces/inkscape"
   xmlns:sodipodi="http://sodipodi.sourceforge.net/DTD/sodipodi-0.dtd"
   xmlns="http://www.w3.org/2000/svg"
   xmlns:svg="http://www.w3.org/2000/svg">
  <defs
     id="defs303" />
  <sodipodi:namedview
     id="namedview301"
     pagecolor="#ffffff"
     bordercolor="#666666"
     borderopacity="1.0"
     inkscape:pageshadow="2"
     inkscape:pageopacity="0.0"
     inkscape:pagecheckerboard="0"
     inkscape:deskcolor="#d1d1d1"
     showgrid="true"
     inkscape:zoom="28.6875"
     inkscape:cx="15.982571"
     inkscape:cy="16"
     inkscape:current-layer="svg299">
    <inkscape:grid
       type="xygrid"
       id="grid2120" />
  </sodipodi:namedview>
  <g
     fill="none"
     stroke="#00aad4"
     stroke-linecap="round"
     id="g297">
    <path
       d="m11 11 10 10"
       stroke-width="3.2"
       id="path291" />
    <path
       d="m21 11-10 10"
       stroke-width="3.2"
       id="path293" />
    <circle
       cx="16"
       cy="16"
       r="13.5"
       stroke-dashoffset="1.49998"
       stroke-width="3"
       id="circle295" />
  </g>
</svg>
