<?xml version="1.0" encoding="UTF-8" standalone="no"?>
<svg
   width="36"
   height="36"
   version="1.1"
   viewBox="0 0 36 36"
   id="svg547"
   sodipodi:docname="default_150.svg"
   inkscape:export-filename="default_150.png"
   inkscape:export-xdpi="96"
   inkscape:export-ydpi="96"
   inkscape:version="1.2.1 (9c6d41e410, 2022-07-14)"
   xmlns:inkscape="http://www.inkscape.org/namespaces/inkscape"
   xmlns:sodipodi="http://sodipodi.sourceforge.net/DTD/sodipodi-0.dtd"
   xmlns="http://www.w3.org/2000/svg"
   xmlns:svg="http://www.w3.org/2000/svg">
  <defs
     id="defs551" />
  <sodipodi:namedview
     id="namedview549"
     pagecolor="#ffffff"
     bordercolor="#666666"
     borderopacity="1.0"
     inkscape:showpageshadow="2"
     inkscape:pageopacity="0.0"
     inkscape:pagecheckerboard="0"
     inkscape:deskcolor="#d1d1d1"
     showgrid="true"
     inkscape:zoom="25.5"
     inkscape:cx="18"
     inkscape:cy="18"
     inkscape:current-layer="svg547">
    <inkscape:grid
       type="xygrid"
       id="grid1009" />
  </sodipodi:namedview>
  <g
     id="g812"
     transform="matrix(1.5,0,0,1.5,-0.5,-0.355)"
     style="stroke-width:0.666667">
    <g
       id="g3982"
       transform="translate(0,1)"
       style="stroke-width:0.666667">
      <path
         style="color:#000000;fill:#3771c8;fill-opacity:1;stroke-width:0.666667;paint-order:stroke fill markers"
         d="m 9,12.5 v 7 l 7,2.5 v -7 z"
         id="path992"
         sodipodi:nodetypes="ccccc" />
      <path
         style="color:#000000;fill:#80b3ff;fill-opacity:1;stroke-width:0.666667;paint-order:stroke fill markers"
         d="m 9.5,13.193359 6,2.167969 v 5.945313 l -6,-2.167969 z"
         id="path994"
         sodipodi:nodetypes="ccccc" />
      <path
         style="color:#000000;fill:#3771c8;fill-opacity:1;stroke-width:0.666667;paint-order:stroke fill markers"
         d="m 23,12.5 v 7 L 16,22 v -7 z"
         id="path1496"
         sodipodi:nodetypes="ccccc" />
      <path
         style="color:#000000;fill:#5599ff;fill-opacity:1;stroke-width:0.666667;paint-order:stroke fill markers"
         d="m 22.5,13.193359 -6,2.167969 v 5.945313 l 6,-2.167969 z"
         id="path1498"
         sodipodi:nodetypes="ccccc" />
      <path
         style="color:#000000;fill:#3771c8;fill-opacity:1;stroke-width:0.666667;paint-order:stroke fill markers"
         d="M 16,10 23,12.5 16,15 9,12.5 Z"
         id="path1514"
         sodipodi:nodetypes="ccccc" />
      <path
         id="path1516"
         style="color:#000000;fill:#aaccff;fill-opacity:1;stroke-width:0.666667;paint-order:stroke fill markers"
         d="m 16,10.5 -5.570312,2 5.570312,2 5.570312,-2 z" />
    </g>
    <g
       id="g3988"
       transform="translate(0,1)"
       style="stroke-width:0.666667">
      <path
         style="color:#000000;fill:#008033;stroke-width:0.666667;paint-order:stroke fill markers"
         d="m 2,10 v 7 l 7,2.5 v -7 z"
         id="path970"
         sodipodi:nodetypes="ccccc" />
      <path
         style="color:#000000;fill:#87de87;stroke-width:0.666667;paint-order:stroke fill markers"
         d="m 2.5,10.693359 6,2.167969 v 5.945313 l -6,-2.167969 z"
         id="path972"
         sodipodi:nodetypes="ccccc" />
      <path
         style="color:#000000;fill:#008033;fill-opacity:1;stroke-width:0.666667;paint-order:stroke fill markers"
         d="M 9,7.5 16,10 9,12.5 2,10 Z"
         id="path2624"
         sodipodi:nodetypes="ccccc" />
      <path
         id="path2626"
         style="color:#000000;fill:#afe9af;fill-opacity:1;stroke-width:0.666667;paint-order:stroke fill markers"
         d="M 9,8 3.429688,10 9,12 14.570313,10 Z" />
    </g>
    <g
       id="g3974"
       transform="translate(-1,0.64)"
       style="stroke-width:0.666667">
      <path
         style="color:#000000;fill:#c83737;fill-opacity:1;stroke-width:0.666667;paint-order:stroke fill markers"
         d="m 6,4.43 v 7 l 7,2.5 v -7 z"
         id="path2835"
         sodipodi:nodetypes="ccccc" />
      <path
         style="color:#000000;fill:#ff8080;fill-opacity:1;stroke-width:0.666667;paint-order:stroke fill markers"
         d="m 6.5,5.123359 6,2.167969 v 5.945313 l -6,-2.167969 z"
         id="path2837"
         sodipodi:nodetypes="ccccc" />
      <path
         style="color:#000000;fill:#c83737;fill-opacity:1;stroke-width:0.666667;paint-order:stroke fill markers"
         d="m 20,4.43 v 7 l -7,2.5 v -7 z"
         id="path2839"
         sodipodi:nodetypes="ccccc" />
      <path
         style="color:#000000;fill:#ff2a2a;fill-opacity:1;stroke-width:0.666667;paint-order:stroke fill markers"
         d="m 19.5,5.123359 -6,2.167969 v 5.945313 l 6,-2.167969 z"
         id="path2841"
         sodipodi:nodetypes="ccccc" />
      <path
         style="color:#000000;fill:#c83737;fill-opacity:1;stroke-width:0.666667;paint-order:stroke fill markers"
         d="m 13,1.93 7,2.5 -7,2.5 -7,-2.5 z"
         id="path2843"
         sodipodi:nodetypes="ccccc" />
      <path
         id="path2845"
         style="color:#000000;fill:#ffaaaa;fill-opacity:1;stroke-width:0.666667;paint-order:stroke fill markers"
         d="m 13,2.43 -5.570312,2 5.570312,2 5.570312,-2 z" />
    </g>
  </g>
</svg>
