<?xml version="1.0" encoding="UTF-8" standalone="no"?>
<svg
   height="16"
   width="16"
   version="1.1"
   id="svg831"
   sodipodi:docname="menu_toggle_bookmark8.svg"
   inkscape:export-filename="menu_toggle_bookmark8.png"
   inkscape:export-xdpi="96"
   inkscape:export-ydpi="96"
   inkscape:version="1.2.2 (732a01da63, 2022-12-09)"
   xmlns:inkscape="http://www.inkscape.org/namespaces/inkscape"
   xmlns:sodipodi="http://sodipodi.sourceforge.net/DTD/sodipodi-0.dtd"
   xmlns="http://www.w3.org/2000/svg"
   xmlns:svg="http://www.w3.org/2000/svg">
  <defs
     id="defs835" />
  <sodipodi:namedview
     id="namedview833"
     pagecolor="#ffffff"
     bordercolor="#666666"
     borderopacity="1.0"
     inkscape:showpageshadow="2"
     inkscape:pageopacity="0.0"
     inkscape:pagecheckerboard="0"
     inkscape:deskcolor="#d1d1d1"
     showgrid="true"
     inkscape:zoom="57.375"
     inkscape:cx="7.7298475"
     inkscape:cy="8"
     inkscape:current-layer="svg831">
    <inkscape:grid
       type="xygrid"
       id="grid1457" />
  </sodipodi:namedview>
  <radialGradient
     id="a"
     cx="8"
     cy="7.5"
     gradientUnits="userSpaceOnUse"
     r="6">
    <stop
       offset="0"
       stop-color="#2a7fff"
       id="stop820" />
    <stop
       offset=".69999999"
       stop-color="#4d94ff"
       id="stop822" />
    <stop
       offset="1"
       stop-color="#96bdff"
       id="stop824" />
  </radialGradient>
  <circle
     cx="8"
     cy="7.5"
     fill="url(#a)"
     r="6"
     id="circle827" />
  <path
     d="m7.4688107 11.860522c-.7899296.016037-1.6418423-.318756-2.0295893-1.044932-.286028-.53881-.3047093-1.1921931-.1566523-1.7735793.1486517-.4970195.4805537-.9485653.9433382-1.1938489-.5945429-.3147654-.9275378-1.0022436-.8767369-1.6634183-.0254995-.7287125.3856764-1.4667545 1.0662265-1.7600457.657781-.294361 1.4490466-.294361 2.1068276 0 .6902869.2968233 1.0996228 1.0498723 1.0662265 1.7870998.0462773.6557283-.3033495 1.3311929-.8922087 1.6363642.6966554.3769994 1.0970313 1.1870163 1.0466499 1.9676769.0110332.7479813-.416709 1.4952083-1.1099877 1.8026843-.3611853.173932-.7654312.242543-1.1640938.241999zm0-1.010826c.5072343.021756 1.0452295-.279953 1.1784778-.791621.1329217-.4895305.0207617-1.096433-.4339163-1.3831576-.5210355-.3213446-1.2955676-.2760619-1.7136458.1962988-.2994552.3545298-.319401.8795855-.1742192 1.3028768.1764655.457068.6743064.689537 1.1433035.675603zm0-3.3883299c.4674905.0245434.922247-.301022 1.0251294-.7619673.1106912-.4641144.0339464-1.0446358-.4092379-1.3133526-.5312054-.3377736-1.3819971-.1675302-1.6080224.463349-.1632625.4916452-.0893501 1.1359421.3762394 1.4413778.1804006.1209076.4006982.1711564.6158915.1705931z"
     fill="#fff"
     stroke-width=".999996"
     transform="scale(1.0711211 .93360125)"
     id="path829" />
  <g
     id="g1569">
    <path
       d="M 3.85,0.60000002 H 0.60000002 V 3.85"
       stroke="#00cc00"
       id="path11"
       style="fill:none;stroke-width:1.2;stroke-linecap:round" />
    <path
       d="M 12.15,14.4 H 15.4 V 11.15"
       stroke="#ff0000"
       id="path13"
       style="fill:none;stroke-width:1.2;stroke-linecap:round" />
  </g>
</svg>
