<?xml version="1.0" encoding="UTF-8" standalone="no"?>
<svg
   width="36"
   height="36"
   version="1.1"
   viewBox="0 0 36 36"
   id="svg15"
   sodipodi:docname="tdbimage_150.svg"
   inkscape:export-filename="tdbimage_150.png"
   inkscape:export-xdpi="96"
   inkscape:export-ydpi="96"
   inkscape:version="1.3.2 (091e20e, 2023-11-25, custom)"
   xmlns:inkscape="http://www.inkscape.org/namespaces/inkscape"
   xmlns:sodipodi="http://sodipodi.sourceforge.net/DTD/sodipodi-0.dtd"
   xmlns="http://www.w3.org/2000/svg"
   xmlns:svg="http://www.w3.org/2000/svg">
  <sodipodi:namedview
     id="namedview15"
     pagecolor="#ffffff"
     bordercolor="#000000"
     borderopacity="0.25"
     inkscape:showpageshadow="2"
     inkscape:pageopacity="0.0"
     inkscape:pagecheckerboard="0"
     inkscape:deskcolor="#d1d1d1"
     showgrid="true"
     inkscape:current-layer="svg15">
    <inkscape:grid
       id="grid15"
       units="px"
       originx="0"
       originy="0"
       spacingx="0.5"
       spacingy="0.5"
       empcolor="#0099e5"
       empopacity="0.30196078"
       color="#0099e5"
       opacity="0.14901961"
       empspacing="2"
       dotted="false"
       gridanglex="30"
       gridanglez="30"
       visible="true" />
  </sodipodi:namedview>
  <defs
     id="defs8">
    <linearGradient
       id="a"
       x1="3"
       x2="21"
       y1="3"
       y2="3"
       gradientUnits="userSpaceOnUse">
      <stop
         stop-color="#4276c4"
         offset="0"
         id="stop1" />
      <stop
         stop-color="#80b3ff"
         offset=".3333333"
         id="stop2" />
      <stop
         stop-color="#04a"
         offset="1"
         id="stop3" />
    </linearGradient>
    <linearGradient
       id="b"
       x1="7.9999995"
       x2="7.9999995"
       y1="1.4999998"
       y2="11.238683"
       gradientTransform="matrix(1.3999998,0,0,1.0769214,11.300002,17.384706)"
       gradientUnits="userSpaceOnUse">
      <stop
         stop-color="#80b4fe"
         offset="0"
         id="stop4" />
      <stop
         stop-color="#e7f6fe"
         offset="1"
         id="stop5" />
    </linearGradient>
    <radialGradient
       id="c"
       cx="16"
       cy="10"
       r="2.5999999"
       gradientTransform="matrix(1.1249994,0,0,1.1111112,9.5000102,12.389015)"
       gradientUnits="userSpaceOnUse">
      <stop
         stop-color="#ffffff"
         offset="0"
         id="stop6" />
      <stop
         stop-color="#ffe680"
         offset=".57692301"
         id="stop7" />
      <stop
         stop-color="#ffcc00"
         offset="1"
         id="stop8" />
    </radialGradient>
  </defs>
  <ellipse
     cx="12"
     cy="20.25"
     rx="7.65"
     ry="2.4"
     fill="none"
     fill-rule="evenodd"
     stroke="url(#a)"
     stroke-linecap="round"
     stroke-linejoin="round"
     stroke-width="2.7"
     id="ellipse8" />
  <ellipse
     cx="12"
     cy="18.3"
     rx="7.35"
     ry="2.1"
     fill="none"
     fill-rule="evenodd"
     stroke="#ffffff"
     stroke-linecap="round"
     stroke-linejoin="round"
     stroke-width="1.8"
     id="ellipse9" />
  <ellipse
     cx="12"
     cy="15.75"
     rx="7.65"
     ry="2.4"
     fill="none"
     fill-rule="evenodd"
     stroke="url(#a)"
     stroke-linecap="round"
     stroke-linejoin="round"
     stroke-width="2.7"
     id="ellipse10" />
  <ellipse
     cx="12"
     cy="13.8"
     rx="7.35"
     ry="2.1"
     fill="none"
     fill-rule="evenodd"
     stroke="#ffffff"
     stroke-linecap="round"
     stroke-linejoin="round"
     stroke-width="1.8"
     id="ellipse11" />
  <ellipse
     cx="12"
     cy="11.25"
     rx="7.65"
     ry="2.4"
     fill="none"
     fill-rule="evenodd"
     stroke="url(#a)"
     stroke-linecap="round"
     stroke-linejoin="round"
     stroke-width="2.7"
     id="ellipse12" />
  <ellipse
     cx="12"
     cy="9.3"
     rx="7.35"
     ry="2.1"
     fill="none"
     fill-rule="evenodd"
     stroke="#ffffff"
     stroke-linecap="round"
     stroke-linejoin="round"
     stroke-width="1.8"
     id="ellipse13" />
  <ellipse
     cx="12"
     cy="6.75"
     rx="8.1"
     ry="2.85"
     fill="#80b3ff"
     fill-rule="evenodd"
     stroke="url(#a)"
     stroke-linecap="round"
     stroke-linejoin="round"
     stroke-width="1.8"
     id="ellipse14" />
  <rect
     x="9.5"
     y="16.5"
     width="26"
     height="19"
     fill="#ffffff"
     stroke="#2a7efe"
     style="paint-order:normal"
     id="rect14" />
  <rect
     x="12.000001"
     y="19"
     width="20.999998"
     height="13.999977"
     fill="url(#b)"
     stroke-width=".999999"
     id="rect15" />
  <path
     d="m12.000001 32.999999 4.917022-5.83323c1.433141-1.700158 3.838224-1.471679 5.294026 0l4.038951 4.083232 2.642561-1.749996c0.805334-0.533261 1.342766-0.466061 2.131983 0l1.975456 1.166758v2.333236z"
     fill="#01a901"
     stroke-width=".999999"
     id="path15" />
  <ellipse
     cx="27.5"
     cy="23.5"
     rx="2.8124988"
     ry="2.7777781"
     fill="url(#c)"
     stroke-width=".999999"
     id="ellipse15" />
</svg>
