<?xml version="1.0" encoding="UTF-8" standalone="no"?>
<svg
   height="48"
   width="48"
   version="1.1"
   id="svg552"
   sodipodi:docname="Copy_02_48.svg"
   inkscape:export-filename="Copy_02_48.png"
   inkscape:export-xdpi="96"
   inkscape:export-ydpi="96"
   inkscape:version="1.2-beta (1b65182ce9, 2022-04-05)"
   xmlns:inkscape="http://www.inkscape.org/namespaces/inkscape"
   xmlns:sodipodi="http://sodipodi.sourceforge.net/DTD/sodipodi-0.dtd"
   xmlns="http://www.w3.org/2000/svg"
   xmlns:svg="http://www.w3.org/2000/svg">
  <defs
     id="defs556" />
  <sodipodi:namedview
     id="namedview554"
     pagecolor="#ffffff"
     bordercolor="#666666"
     borderopacity="1.0"
     inkscape:pageshadow="2"
     inkscape:pageopacity="0.0"
     inkscape:pagecheckerboard="0"
     inkscape:deskcolor="#d1d1d1"
     showgrid="true"
     inkscape:zoom="19.125"
     inkscape:cx="24"
     inkscape:cy="24"
     inkscape:current-layer="svg552">
    <inkscape:grid
       type="xygrid"
       id="grid675" />
  </sodipodi:namedview>
  <g
     fill="none"
     stroke="#00aad4"
     stroke-width="1.5"
     id="g550"
     transform="scale(2)">
    <path
       d="m 2.75,6.75 h 8.203124 L 15.25,11.071428 V 23.25 H 2.75 Z"
       id="path542" />
    <path
       d="m 10.75,6.25 v 5 h 5"
       id="path544" />
    <path
       d="M 8.75,6.5735294 V 0.75 h 8.203124 L 21.25,5.0714286 V 17.25 h -5.76923"
       id="path546" />
    <path
       d="M 16.75,0.24999998 V 5.25 h 5"
       id="path548" />
  </g>
</svg>
