<?xml version="1.0" encoding="UTF-8" standalone="no"?>
<svg
   height="48"
   viewBox="0 0 12.7 12.700001"
   width="48"
   version="1.1"
   id="svg746"
   sodipodi:docname="Cube_03_48.svg"
   inkscape:version="1.2.1 (9c6d41e410, 2022-07-14)"
   inkscape:export-filename="Cube_03_48.png"
   inkscape:export-xdpi="96"
   inkscape:export-ydpi="96"
   xmlns:inkscape="http://www.inkscape.org/namespaces/inkscape"
   xmlns:sodipodi="http://sodipodi.sourceforge.net/DTD/sodipodi-0.dtd"
   xmlns="http://www.w3.org/2000/svg"
   xmlns:svg="http://www.w3.org/2000/svg">
  <defs
     id="defs750" />
  <sodipodi:namedview
     id="namedview748"
     pagecolor="#ffffff"
     bordercolor="#666666"
     borderopacity="1.0"
     inkscape:showpageshadow="2"
     inkscape:pageopacity="0.0"
     inkscape:pagecheckerboard="0"
     inkscape:deskcolor="#d1d1d1"
     showgrid="true"
     inkscape:zoom="19.125"
     inkscape:cx="23.24183"
     inkscape:cy="24"
     inkscape:current-layer="svg746">
    <inkscape:grid
       type="xygrid"
       id="grid1256" />
  </sodipodi:namedview>
  <g
     id="g2709"
     transform="matrix(2.9999999,0,0,2.9999999,0.79375039,14.208124)">
    <g
       id="g2691">
      <path
         style="color:#000000;fill:#ff0000;fill-opacity:1;stroke:#ffffff;stroke-width:0.0661458;stroke-linejoin:round;stroke-dasharray:none;stroke-opacity:1;paint-order:normal"
         d="m -0.1322918,-2.9104166 v 1.402292 l 1.3229167,0.3968749 v -1.402292 z"
         id="path1480"
         sodipodi:nodetypes="ccccc" />
      <path
         style="color:#000000;fill:#ff4c4c;fill-opacity:1;stroke:#ffffff;stroke-width:0.0661458;stroke-linejoin:round;stroke-dasharray:none;stroke-opacity:1;paint-order:normal"
         d="M 2.5135416,-2.9104166 1.1906249,-2.5135417 -0.1322918,-2.9104166 1.1906249,-3.3072917 Z"
         id="path1484"
         sodipodi:nodetypes="ccccc" />
    </g>
    <g
       id="g2696">
      <path
         style="color:#000000;fill:#00b800;fill-opacity:1;stroke:#ffffff;stroke-width:0.0661458;stroke-linejoin:round;stroke-dasharray:none;stroke-opacity:1;paint-order:normal"
         d="m 1.1906251,-2.5135417 v 1.402292 l 1.3229167,0.39687494 V -2.1166668 Z"
         id="path992"
         sodipodi:nodetypes="ccccc" />
      <path
         style="color:#000000;fill:#00a300;fill-opacity:1;stroke:#ffffff;stroke-width:0.0661458;stroke-linejoin:round;stroke-dasharray:none;stroke-opacity:1;paint-order:normal"
         d="m 3.8364585,-2.5135417 v 1.402292 L 2.5135418,-0.71437476 V -2.1166668 Z"
         id="path1463"
         sodipodi:nodetypes="ccccc" />
      <path
         style="color:#000000;fill:#00d400;fill-opacity:1;stroke:#ffffff;stroke-width:0.0661458;stroke-linejoin:round;stroke-dasharray:none;stroke-opacity:1;paint-order:normal"
         d="M 3.8364585,-2.5135417 2.5135418,-2.1166668 1.1906251,-2.5135417 2.5135418,-2.9104168 Z"
         id="path1473"
         sodipodi:nodetypes="ccccc" />
    </g>
    <g
       id="g2687">
      <path
         style="color:#000000;fill:#0066ff;fill-opacity:1;stroke:#ffffff;stroke-width:0.0661458;stroke-linejoin:round;stroke-dasharray:none;stroke-opacity:1;paint-order:normal"
         d="m 0.52916664,-3.9687498 v 1.2435414 l 1.32291666,0.3968749 v -1.2435414 z"
         id="path1488"
         sodipodi:nodetypes="ccccc" />
      <path
         style="color:#000000;fill:#0052cc;fill-opacity:1;stroke:#ffffff;stroke-width:0.0661458;stroke-linejoin:round;stroke-dasharray:none;stroke-opacity:1;paint-order:normal"
         d="m 3.175,-3.9687498 v 1.2435414 l -1.3229167,0.3968749 v -1.2435414 z"
         id="path1490"
         sodipodi:nodetypes="ccccc" />
      <path
         style="color:#000000;fill:#4c93ff;fill-opacity:1;stroke:#ffffff;stroke-width:0.0661458;stroke-linejoin:round;stroke-dasharray:none;stroke-opacity:1;paint-order:normal"
         d="M 3.175,-3.9687498 1.8520833,-3.5718749 0.52916664,-3.9687498 1.8520833,-4.3656249 Z"
         id="path1492"
         sodipodi:nodetypes="ccccc" />
    </g>
  </g>
</svg>
