<?xml version="1.0" encoding="UTF-8" standalone="no"?>
<svg
   height="16"
   width="16"
   version="1.1"
   id="svg272"
   sodipodi:docname="Time_04_16.svg"
   inkscape:export-filename="Time_04_16.png"
   inkscape:export-xdpi="96"
   inkscape:export-ydpi="96"
   inkscape:version="1.2-beta (1b65182ce9, 2022-04-05)"
   xmlns:inkscape="http://www.inkscape.org/namespaces/inkscape"
   xmlns:sodipodi="http://sodipodi.sourceforge.net/DTD/sodipodi-0.dtd"
   xmlns="http://www.w3.org/2000/svg"
   xmlns:svg="http://www.w3.org/2000/svg">
  <defs
     id="defs276" />
  <sodipodi:namedview
     id="namedview274"
     pagecolor="#ffffff"
     bordercolor="#666666"
     borderopacity="1.0"
     inkscape:pageshadow="2"
     inkscape:pageopacity="0.0"
     inkscape:pagecheckerboard="0"
     inkscape:deskcolor="#d1d1d1"
     showgrid="true"
     inkscape:zoom="57.375"
     inkscape:cx="8"
     inkscape:cy="8"
     inkscape:current-layer="svg272">
    <inkscape:grid
       type="xygrid"
       id="grid1480" />
  </sodipodi:namedview>
  <g
     fill="none"
     stroke="#00aad4"
     id="g270">
    <circle
       cx="8"
       cy="8"
       r="6.875"
       stroke-width="1.25"
       id="circle266" />
    <path
       d="m8 2.5v5.5h4"
       id="path268" />
  </g>
</svg>
