<?xml version="1.0" encoding="UTF-8" standalone="no"?>
<svg
   width="48"
   height="48"
   version="1.1"
   viewBox="0 0 48 48"
   id="svg17"
   sodipodi:docname="tsimpleipcserver_200.svg"
   inkscape:export-filename="tsimpleipcserver_200.png"
   inkscape:export-xdpi="96"
   inkscape:export-ydpi="96"
   inkscape:version="1.3.2 (091e20e, 2023-11-25, custom)"
   xmlns:inkscape="http://www.inkscape.org/namespaces/inkscape"
   xmlns:sodipodi="http://sodipodi.sourceforge.net/DTD/sodipodi-0.dtd"
   xmlns:xlink="http://www.w3.org/1999/xlink"
   xmlns="http://www.w3.org/2000/svg"
   xmlns:svg="http://www.w3.org/2000/svg">
  <sodipodi:namedview
     id="namedview17"
     pagecolor="#ffffff"
     bordercolor="#000000"
     borderopacity="0.25"
     inkscape:showpageshadow="2"
     inkscape:pageopacity="0.0"
     inkscape:pagecheckerboard="0"
     inkscape:deskcolor="#d1d1d1"
     showgrid="true"
     inkscape:current-layer="svg17">
    <inkscape:grid
       id="grid17"
       units="px"
       originx="0"
       originy="0"
       spacingx="0.5"
       spacingy="0.5"
       empcolor="#0099e5"
       empopacity="0.30196078"
       color="#0099e5"
       opacity="0.14901961"
       empspacing="2"
       dotted="false"
       gridanglex="30"
       gridanglez="30"
       visible="true" />
  </sodipodi:namedview>
  <defs
     id="defs4">
    <linearGradient
       id="a">
      <stop
         stop-color="#666666"
         offset="0"
         id="stop1" />
      <stop
         stop-color="#ffffff"
         stop-opacity=".5"
         offset="1"
         id="stop2" />
    </linearGradient>
    <linearGradient
       id="b">
      <stop
         stop-color="#cccccc"
         offset="0"
         id="stop3" />
      <stop
         stop-color="#ffffff"
         stop-opacity=".5"
         offset="1"
         id="stop4" />
    </linearGradient>
    <linearGradient
       id="c"
       x1="3.991713"
       x2="1"
       y1="1033.3567"
       y2="1033.3566"
       gradientTransform="matrix(-4,0,0,2,48.98666,-2053.7352)"
       gradientUnits="userSpaceOnUse"
       xlink:href="#a" />
    <linearGradient
       id="d"
       x1="4"
       x2="1"
       y1="1033.3622"
       y2="1033.3622"
       gradientTransform="matrix(-4,0,0,2,48.98666,-2051.7352)"
       gradientUnits="userSpaceOnUse"
       xlink:href="#b" />
    <linearGradient
       id="e"
       x1="3.991713"
       x2="1"
       y1="1033.3567"
       y2="1033.3566"
       gradientTransform="matrix(-4,0,0,2,48.98666,-2049.7352)"
       gradientUnits="userSpaceOnUse"
       xlink:href="#a" />
    <linearGradient
       id="f"
       x1="3.991713"
       x2="1"
       y1="1033.3567"
       y2="1033.3566"
       gradientTransform="matrix(3.3333332,0,0,2,-2.346674,-2053.7352)"
       gradientUnits="userSpaceOnUse"
       xlink:href="#a" />
    <linearGradient
       id="g"
       x1="4"
       x2="1"
       y1="1033.3622"
       y2="1033.3622"
       gradientTransform="matrix(3.3333332,0,0,2,-2.346674,-2051.7352)"
       gradientUnits="userSpaceOnUse"
       xlink:href="#b" />
    <linearGradient
       id="h"
       x1="3.991713"
       x2="1"
       y1="1033.3567"
       y2="1033.3566"
       gradientTransform="matrix(3.3333332,0,0,2,-2.346674,-2049.7352)"
       gradientUnits="userSpaceOnUse"
       xlink:href="#a" />
  </defs>
  <path
     d="m 0.98665993,15.9873 v 2 H 10.98666 v -2 z"
     color="#000000"
     color-rendering="auto"
     dominant-baseline="auto"
     fill="url(#h)"
     fill-rule="evenodd"
     image-rendering="auto"
     shape-rendering="auto"
     solid-color="#000000"
     style="font-variant-ligatures:normal;font-variant-position:normal;font-variant-caps:normal;font-variant-numeric:normal;font-variant-alternates:normal;font-feature-settings:normal;text-indent:0;text-decoration-line:none;text-decoration-style:solid;text-decoration-color:#000000;text-transform:none;text-orientation:mixed;white-space:normal;shape-padding:0;isolation:auto;mix-blend-mode:normal;fill:url(#h)"
     id="path4" />
  <path
     d="m 0.98665993,13.9873 v 2 H 10.98666 v -2 z"
     color="#000000"
     color-rendering="auto"
     dominant-baseline="auto"
     fill="url(#g)"
     fill-rule="evenodd"
     image-rendering="auto"
     shape-rendering="auto"
     solid-color="#000000"
     style="font-variant-ligatures:normal;font-variant-position:normal;font-variant-caps:normal;font-variant-numeric:normal;font-variant-alternates:normal;font-feature-settings:normal;text-indent:0;text-decoration-line:none;text-decoration-style:solid;text-decoration-color:#000000;text-transform:none;text-orientation:mixed;white-space:normal;shape-padding:0;isolation:auto;mix-blend-mode:normal;fill:url(#g)"
     id="path5" />
  <path
     d="m 0.98665993,11.9873 v 2 H 10.98666 v -2 z"
     color="#000000"
     color-rendering="auto"
     dominant-baseline="auto"
     fill="url(#f)"
     fill-rule="evenodd"
     image-rendering="auto"
     shape-rendering="auto"
     solid-color="#000000"
     style="font-variant-ligatures:normal;font-variant-position:normal;font-variant-caps:normal;font-variant-numeric:normal;font-variant-alternates:normal;font-feature-settings:normal;text-indent:0;text-decoration-line:none;text-decoration-style:solid;text-decoration-color:#000000;text-transform:none;text-orientation:mixed;white-space:normal;shape-padding:0;isolation:auto;mix-blend-mode:normal;fill:url(#f)"
     id="path6" />
  <path
     d="m 44.98666,15.9873 v 2 h -12 v -2 z"
     color="#000000"
     color-rendering="auto"
     dominant-baseline="auto"
     fill="url(#e)"
     fill-rule="evenodd"
     image-rendering="auto"
     shape-rendering="auto"
     solid-color="#000000"
     style="font-variant-ligatures:normal;font-variant-position:normal;font-variant-caps:normal;font-variant-numeric:normal;font-variant-alternates:normal;font-feature-settings:normal;text-indent:0;text-decoration-line:none;text-decoration-style:solid;text-decoration-color:#000000;text-transform:none;text-orientation:mixed;white-space:normal;shape-padding:0;isolation:auto;mix-blend-mode:normal;fill:url(#e)"
     id="path7" />
  <path
     d="m 44.98666,13.9873 v 2 h -12 v -2 z"
     color="#000000"
     color-rendering="auto"
     dominant-baseline="auto"
     fill="url(#d)"
     fill-rule="evenodd"
     image-rendering="auto"
     shape-rendering="auto"
     solid-color="#000000"
     style="font-variant-ligatures:normal;font-variant-position:normal;font-variant-caps:normal;font-variant-numeric:normal;font-variant-alternates:normal;font-feature-settings:normal;text-indent:0;text-decoration-line:none;text-decoration-style:solid;text-decoration-color:#000000;text-transform:none;text-orientation:mixed;white-space:normal;shape-padding:0;isolation:auto;mix-blend-mode:normal;fill:url(#d)"
     id="path8" />
  <path
     d="m 44.98666,11.9873 v 2 h -12 v -2 z"
     color="#000000"
     color-rendering="auto"
     dominant-baseline="auto"
     fill="url(#c)"
     fill-rule="evenodd"
     image-rendering="auto"
     shape-rendering="auto"
     solid-color="#000000"
     style="font-variant-ligatures:normal;font-variant-position:normal;font-variant-caps:normal;font-variant-numeric:normal;font-variant-alternates:normal;font-feature-settings:normal;text-indent:0;text-decoration-line:none;text-decoration-style:solid;text-decoration-color:#000000;text-transform:none;text-orientation:mixed;white-space:normal;shape-padding:0;isolation:auto;mix-blend-mode:normal;fill:url(#c)"
     id="path9" />
  <path
     d="m 19.5,2.5 -8,3.5 v 18.5 l 8,3"
     fill="#ececec"
     fill-rule="evenodd"
     stroke="#999999"
     stroke-linecap="round"
     stroke-linejoin="round"
     id="path10" />
  <rect
     x="19.5"
     y="2.4999826"
     width="13"
     height="25"
     fill="#e6e6e6"
     fill-rule="evenodd"
     stroke="#999999"
     stroke-linecap="round"
     stroke-linejoin="round"
     style="paint-order:normal"
     id="rect10" />
  <rect
     x="23"
     y="11.999983"
     width="6"
     height="2"
     fill="#999999"
     fill-rule="evenodd"
     style="paint-order:normal"
     id="rect11" />
  <rect
     x="23"
     y="15.999983"
     width="6"
     height="2"
     fill="#999999"
     fill-rule="evenodd"
     style="paint-order:normal"
     id="rect12" />
  <rect
     x="23"
     y="19.999983"
     width="6"
     height="2"
     fill="#999999"
     fill-rule="evenodd"
     style="paint-order:normal"
     id="rect13" />
  <rect
     x="22.986658"
     y="5.9872875"
     width="2.0133419"
     height="2.0000348"
     fill="#ff0000"
     fill-rule="evenodd"
     style="paint-order:normal"
     id="rect14" />
  <rect
     x="6"
     y="27.999983"
     width="36"
     height="18.000019"
     fill="#739bdf"
     fill-rule="evenodd"
     style="paint-order:normal"
     id="rect15"
     ry="3.0000172" />
  <rect
     x="26.993328"
     y="5.9999828"
     width="2.0133419"
     height="2.0000348"
     fill="#008000"
     fill-rule="evenodd"
     style="paint-order:normal"
     id="rect17" />
  <path
     d="M 31.87178,39.697241 C 31.304261,41.827101 26.65,42.403501 26.65,38.329303 V 35.67114 c 0,-4.074197 4.654261,-3.497799 5.22178,-1.367938"
     fill="none"
     stroke="#2a7fff"
     stroke-linecap="round"
     stroke-linejoin="round"
     stroke-width="1.3"
     id="path6-0"
     style="stroke:#ffffff" />
  <path
     d="m 15.35,32.65 v 8.700375"
     fill="none"
     stroke="#2a7fff"
     stroke-linecap="round"
     stroke-linejoin="round"
     stroke-width="1.3"
     id="path14"
     style="stroke:#ffffff" />
  <path
     d="M 18.65,41.350375 V 32.65 h 2.65813 c 3.54415,0 3.54415,4.769483 0,4.769483 H 18.65"
     fill="none"
     stroke="#2a7fff"
     stroke-linecap="round"
     stroke-linejoin="round"
     stroke-width="1.3"
     id="path20"
     style="stroke:#ffffff" />
</svg>
