<?xml version="1.0" encoding="UTF-8" standalone="no"?>
<svg
   height="24"
   width="24"
   version="1.1"
   id="svg2"
   sodipodi:docname="ddsequence_150.svg"
   inkscape:export-filename="ddsequence_150.png"
   inkscape:export-xdpi="96"
   inkscape:export-ydpi="96"
   inkscape:version="1.3-beta (cedbd6c6ff, 2023-05-28)"
   xmlns:inkscape="http://www.inkscape.org/namespaces/inkscape"
   xmlns:sodipodi="http://sodipodi.sourceforge.net/DTD/sodipodi-0.dtd"
   xmlns="http://www.w3.org/2000/svg"
   xmlns:svg="http://www.w3.org/2000/svg">
  <defs
     id="defs2" />
  <sodipodi:namedview
     id="namedview2"
     pagecolor="#ffffff"
     bordercolor="#000000"
     borderopacity="0.25"
     inkscape:showpageshadow="2"
     inkscape:pageopacity="0.0"
     inkscape:pagecheckerboard="0"
     inkscape:deskcolor="#d1d1d1"
     showgrid="true"
     inkscape:current-layer="svg2">
    <inkscape:grid
       id="grid2"
       units="px"
       originx="0"
       originy="0"
       spacingx="0.5"
       spacingy="0.5"
       empcolor="#0099e5"
       empopacity="0.30196078"
       color="#0099e5"
       opacity="0.14901961"
       empspacing="2"
       dotted="false"
       gridanglex="30"
       gridanglez="30"
       visible="true" />
  </sodipodi:namedview>
  <rect
     fill="#ebfcff"
     height="18.800011"
     ry="2.400001"
     width="18.800009"
     x="2.5999956"
     y="2.5999947"
     id="rect2"
     style="stroke:#00aad4;stroke-width:1.19999;stroke-linejoin:round" />
  <path
     d="m 9.403997,15.156729 2.605001,-3.360001 c 0.31076,-0.400828 0.496726,-1.00538 0.229806,-1.481413 -0.236023,-0.4209288 -0.832743,-0.4731714 -1.247068,-0.309864 -0.353754,0.139433 -0.548117,0.518815 -0.580584,0.88249 -0.334105,-0.0032 -0.681008,0.0064 -1.007155,-0.0048 0.08722,-0.703365 0.46218,-1.4225593 1.14282,-1.7104479 0.568953,-0.2406491 1.23331,-0.2173121 1.808987,-0.00729 0.582157,0.2123802 0.94463,0.7941721 0.999027,1.3993689 0.06635,0.73821 -0.286332,1.423413 -0.719725,1.993421 l -1.856413,2.441595 h 2.625287 v 1.000175 H 9.403997 Z"
     fill="#ffffff"
     id="path829"
     style="fill:#00aad4;fill-opacity:1;stroke-width:0.264582"
     sodipodi:nodetypes="csssccssssccccc" />
  <path
     d="M 14.674159,15.081749 C 14.527923,14.816922 14.441296,14.522234 14.404,14.222844 h 0.974842 c 0.03685,0.416795 0.367758,0.770865 0.787371,0.830768 0.432689,0.06177 0.972031,-0.01633 1.176955,-0.45221 0.146059,-0.310672 0.112561,-0.671014 0.07825,-1.001895 -0.04272,-0.411953 -0.398036,-0.760231 -0.816719,-0.772183 -0.197641,-0.0056 -0.395454,-0.0026 -0.593163,-0.0044 v -0.91446 c 0.363555,-0.01447 0.785849,0.07245 1.073151,-0.211278 0.292327,-0.288687 0.267516,-0.733608 0.233846,-1.111176 -0.03414,-0.382852 -0.403413,-0.6275073 -0.772288,-0.6537922 -0.42644,-0.030387 -0.880661,0.1950302 -0.992872,0.6170582 -0.04363,0.164113 -0.03046,0.232643 -0.03046,0.232643 h -1.006344 c 0.10089,-0.688947 0.491083,-1.3868813 1.165843,-1.6401117 0.569064,-0.213564 1.236773,-0.1860824 1.783631,0.083647 0.537151,0.2649419 0.802514,0.8734427 0.821461,1.4566127 0.01516,0.466026 -0.09728,0.94131 -0.427244,1.291212 -0.152092,0.16128 -0.524965,0.315193 -0.595463,0.386225 0.563941,0.113612 1.002505,0.608375 1.093575,1.171766 0.101098,0.625432 0.06463,1.334095 -0.350293,1.846645 -0.374293,0.462363 -0.989582,0.616687 -1.560647,0.621954 -0.693102,0.0064 -1.425128,-0.287646 -1.773271,-0.91812 z"
     fill="#ffffff"
     id="path153-3"
     style="fill:#00aad4;fill-opacity:1;stroke-width:0.264583"
     sodipodi:nodetypes="sccssssccssssccsssscssss" />
  <path
     d="M 7.899997,16 H 6.903907 V 10.084009 L 5.41088,11.000021 5.4,10.000025 6.9039,9.0000296 h 0.996089 z"
     fill="#ffffff"
     id="path153-7"
     sodipodi:nodetypes="cccccccc"
     style="fill:#00aad4;fill-opacity:1;stroke-width:0.264583" />
</svg>
