<?xml version="1.0" encoding="UTF-8" standalone="no"?>
<svg
   height="24"
   width="24"
   version="1.1"
   id="svg143"
   sodipodi:docname="btn_abort_150.svg"
   inkscape:export-filename="btn_abort_150.png"
   inkscape:export-xdpi="96"
   inkscape:export-ydpi="96"
   inkscape:version="1.2.2 (732a01da63, 2022-12-09)"
   xmlns:inkscape="http://www.inkscape.org/namespaces/inkscape"
   xmlns:sodipodi="http://sodipodi.sourceforge.net/DTD/sodipodi-0.dtd"
   xmlns="http://www.w3.org/2000/svg"
   xmlns:svg="http://www.w3.org/2000/svg">
  <defs
     id="defs147" />
  <sodipodi:namedview
     id="namedview145"
     pagecolor="#ffffff"
     bordercolor="#666666"
     borderopacity="1.0"
     inkscape:showpageshadow="2"
     inkscape:pageopacity="0.0"
     inkscape:pagecheckerboard="0"
     inkscape:deskcolor="#d1d1d1"
     showgrid="true"
     inkscape:zoom="38.25"
     inkscape:cx="11.986928"
     inkscape:cy="12"
     inkscape:current-layer="svg143">
    <inkscape:grid
       type="xygrid"
       id="grid404" />
  </sodipodi:namedview>
  <g
     fill="none"
     stroke="#fa0302"
     stroke-linecap="round"
     stroke-width="2"
     transform="scale(1.5)"
     id="g141">
    <path
       d="m4 4 8 8"
       id="path137" />
    <path
       d="m12 4-8 8"
       id="path139" />
  </g>
</svg>
