<?xml version="1.0" encoding="UTF-8" standalone="no"?>
<svg
   height="24"
   viewBox="0 0 6.3499998 6.3500003"
   width="24"
   version="1.1"
   id="svg131"
   sodipodi:docname="Delete_03_24.svg"
   inkscape:version="1.2.1 (9c6d41e410, 2022-07-14)"
   inkscape:export-filename="Delete_03_24.png"
   inkscape:export-xdpi="96"
   inkscape:export-ydpi="96"
   xmlns:inkscape="http://www.inkscape.org/namespaces/inkscape"
   xmlns:sodipodi="http://sodipodi.sourceforge.net/DTD/sodipodi-0.dtd"
   xmlns="http://www.w3.org/2000/svg"
   xmlns:svg="http://www.w3.org/2000/svg">
  <defs
     id="defs135" />
  <sodipodi:namedview
     id="namedview133"
     pagecolor="#ffffff"
     bordercolor="#666666"
     borderopacity="1.0"
     inkscape:showpageshadow="2"
     inkscape:pageopacity="0.0"
     inkscape:pagecheckerboard="0"
     inkscape:deskcolor="#d1d1d1"
     showgrid="true"
     inkscape:zoom="38.25"
     inkscape:cx="10.69281"
     inkscape:cy="12"
     inkscape:current-layer="svg131">
    <inkscape:grid
       type="xygrid"
       id="grid1286" />
  </sodipodi:namedview>
  <g
     id="g1655"
     transform="matrix(1.5000002,0,0,1.5000002,-1.2567714,-1.3890632)">
    <path
       style="fill:none;stroke:#00aad4;stroke-width:0.264583px;stroke-linecap:round;stroke-linejoin:round;stroke-opacity:1"
       d="M 1.5875,1.9843749 1.7991667,5.0270833 H 4.28625 L 4.4979167,1.9843749"
       id="path353"
       sodipodi:nodetypes="cccc" />
    <path
       style="fill:none;stroke:#00aad4;stroke-width:0.264583px;stroke-linecap:round;stroke-linejoin:round;stroke-opacity:1"
       d="m 1.3229167,1.9843749 c 1.1759678,-0.2410669 2.2489585,-0.2645831 3.4395833,0"
       id="path355"
       sodipodi:nodetypes="cc" />
    <path
       style="fill:none;stroke:#00aad4;stroke-width:0.264583px;stroke-linecap:round;stroke-linejoin:round;stroke-opacity:1"
       d="m 2.5135417,1.7197916 v -0.396875 c 0.396875,-0.1322917 0.6614583,-0.1322917 1.0583333,0 v 0.396875"
       id="path357"
       sodipodi:nodetypes="cccc" />
    <path
       style="fill:none;stroke:#00aad4;stroke-width:0.264583px;stroke-linecap:round;stroke-linejoin:round;stroke-opacity:1"
       d="M 3.0427081,2.3812498 V 4.4979164"
       id="path359"
       sodipodi:nodetypes="cc" />
    <path
       style="fill:none;stroke:#00aad4;stroke-width:0.264583px;stroke-linecap:round;stroke-linejoin:round;stroke-opacity:1"
       d="M 2.460625,4.4979166 2.301875,2.3812498"
       id="path361"
       sodipodi:nodetypes="cc" />
    <path
       style="fill:none;stroke:#00aad4;stroke-width:0.264583px;stroke-linecap:round;stroke-linejoin:round;stroke-opacity:1"
       d="m 3.6247917,4.4979166 0.15875,-2.1166668"
       id="path363"
       sodipodi:nodetypes="cc" />
  </g>
</svg>
