<?xml version="1.0" encoding="UTF-8" standalone="no"?>
<svg
   height="16"
   viewBox="0 0 16 16"
   width="16"
   version="1.1"
   id="svg5"
   sodipodi:docname="Map_02_16.svg"
   inkscape:export-filename="Map_02_16.png"
   inkscape:export-xdpi="96"
   inkscape:export-ydpi="96"
   inkscape:version="1.3-beta (cedbd6c6ff, 2023-05-28)"
   xmlns:inkscape="http://www.inkscape.org/namespaces/inkscape"
   xmlns:sodipodi="http://sodipodi.sourceforge.net/DTD/sodipodi-0.dtd"
   xmlns="http://www.w3.org/2000/svg"
   xmlns:svg="http://www.w3.org/2000/svg">
  <defs
     id="defs5" />
  <sodipodi:namedview
     id="namedview5"
     pagecolor="#ffffff"
     bordercolor="#000000"
     borderopacity="0.25"
     inkscape:showpageshadow="2"
     inkscape:pageopacity="0.0"
     inkscape:pagecheckerboard="0"
     inkscape:deskcolor="#d1d1d1"
     showgrid="true"
     inkscape:current-layer="svg5">
    <inkscape:grid
       id="grid5"
       units="px"
       originx="0"
       originy="0"
       spacingx="0.5"
       spacingy="0.5"
       empcolor="#0099e5"
       empopacity="0.30196078"
       color="#0099e5"
       opacity="0.14901961"
       empspacing="2"
       dotted="false"
       gridanglex="30"
       gridanglez="30"
       visible="true" />
  </sodipodi:namedview>
  <circle
     cx="8"
     cy="8"
     fill="#fff"
     r="6.870915"
     stroke="#00aad4"
     stroke-linecap="round"
     stroke-linejoin="round"
     stroke-width=".75817"
     id="circle1" />
  <g
     fill="#00aad4"
     id="g4">
    <ellipse
       cx="8"
       cy="1.839869"
       rx=".710784"
       ry=".947712"
       id="ellipse1" />
    <ellipse
       cx="1.839869"
       cy="8"
       rx=".947712"
       ry=".710784"
       id="ellipse2" />
    <ellipse
       cx="8"
       cy="14.160131"
       rx=".710784"
       ry=".947712"
       id="ellipse3" />
    <ellipse
       cx="14.160131"
       cy="8"
       rx=".947712"
       ry=".710784"
       id="ellipse4" />
    <path
       d="m3.9722223 12.027778 3.022577-5.0329787 5.0329787-3.022577-3.0225771 5.0329786z"
       stroke="#00aad4"
       stroke-linejoin="round"
       stroke-width=".75817"
       id="path4" />
  </g>
  <circle
     cx="8"
     cy="8"
     fill="#fff"
     r="1.184641"
     id="circle4" />
  <circle
     cx="8"
     cy="8"
     fill="none"
     r="5.212418"
     stroke="#00aad4"
     stroke-linecap="round"
     stroke-linejoin="round"
     stroke-width=".473856"
     id="circle5" />
</svg>
