<?xml version="1.0" encoding="UTF-8" standalone="no"?>
<svg
   width="36"
   height="36"
   version="1.1"
   viewBox="0 0 36 36"
   id="svg3"
   sodipodi:docname="toracleconnection_150.svg"
   inkscape:version="1.3.2 (091e20e, 2023-11-25, custom)"
   xmlns:inkscape="http://www.inkscape.org/namespaces/inkscape"
   xmlns:sodipodi="http://sodipodi.sourceforge.net/DTD/sodipodi-0.dtd"
   xmlns="http://www.w3.org/2000/svg"
   xmlns:svg="http://www.w3.org/2000/svg">
  <defs
     id="defs3" />
  <sodipodi:namedview
     id="namedview3"
     pagecolor="#ffffff"
     bordercolor="#000000"
     borderopacity="0.25"
     inkscape:showpageshadow="2"
     inkscape:pageopacity="0.0"
     inkscape:pagecheckerboard="0"
     inkscape:deskcolor="#d1d1d1"
     showgrid="true"
     inkscape:current-layer="svg3">
    <inkscape:grid
       id="grid3"
       units="px"
       originx="0"
       originy="0"
       spacingx="0.5"
       spacingy="0.5"
       empcolor="#0099e5"
       empopacity="0.30196078"
       color="#0099e5"
       opacity="0.14901961"
       empspacing="2"
       dotted="false"
       gridanglex="30"
       gridanglez="30"
       visible="true" />
  </sodipodi:namedview>
  <rect
     x="5"
     y="12.999983"
     width="27"
     height="18.000027"
     fill="#ea1c2d"
     fill-rule="evenodd"
     style="paint-order:normal"
     id="rect1" />
  <path
     d="M 15.38683,16.1261 C 12.423366,16.1261 10,18.5497 10,21.513 c 0,2.9633 2.423366,5.387 5.38683,5.387 h 6.226339 C 24.576632,26.9 27,24.4763 27,21.513 27,18.5497 24.576632,16.1261 21.613169,16.1261 Z m 0,1.9587 h 6.226339 c 1.904826,0 3.427981,1.5233 3.427981,3.4282 0,1.9048 -1.523155,3.4282 -3.427981,3.4282 H 15.38683 c -1.904826,0 -3.427983,-1.5234 -3.427983,-3.4282 0,-1.9049 1.523157,-3.4282 3.427983,-3.4282 z"
     color="#000000"
     color-rendering="auto"
     dominant-baseline="auto"
     fill="#ffffff"
     fill-rule="evenodd"
     image-rendering="auto"
     shape-rendering="auto"
     solid-color="#000000"
     style="font-variant-ligatures:normal;font-variant-position:normal;font-variant-caps:normal;font-variant-numeric:normal;font-variant-alternates:normal;font-feature-settings:normal;text-indent:0;text-decoration-line:none;text-decoration-style:solid;text-decoration-color:#000000;text-transform:none;text-orientation:mixed;white-space:normal;shape-padding:0;isolation:auto;mix-blend-mode:normal;paint-order:normal"
     id="path1" />
  <path
     d="m 36,2.5 h -4.5 v 2 h -4 V 2"
     fill="none"
     stroke="#ff0000"
     stroke-linejoin="round"
     id="path2" />
  <path
     d="m 21,2.5 h 4.5 v -2 h 4 V 3"
     fill="none"
     stroke="#2a7efe"
     stroke-linejoin="round"
     id="path3" />
</svg>
