<?xml version="1.0" encoding="UTF-8" standalone="no"?>
<svg
   height="24"
   width="24"
   version="1.1"
   id="svg12"
   sodipodi:docname="Copy_02_24.svg"
   inkscape:export-filename="Copy_02_24.png"
   inkscape:export-xdpi="96"
   inkscape:export-ydpi="96"
   inkscape:version="1.2-beta (1b65182ce9, 2022-04-05)"
   xmlns:inkscape="http://www.inkscape.org/namespaces/inkscape"
   xmlns:sodipodi="http://sodipodi.sourceforge.net/DTD/sodipodi-0.dtd"
   xmlns="http://www.w3.org/2000/svg"
   xmlns:svg="http://www.w3.org/2000/svg">
  <defs
     id="defs16" />
  <sodipodi:namedview
     id="namedview14"
     pagecolor="#ffffff"
     bordercolor="#666666"
     borderopacity="1.0"
     inkscape:pageshadow="2"
     inkscape:pageopacity="0.0"
     inkscape:pagecheckerboard="0"
     inkscape:deskcolor="#d1d1d1"
     showgrid="true"
     inkscape:zoom="38.25"
     inkscape:cx="12"
     inkscape:cy="12"
     inkscape:current-layer="svg12">
    <inkscape:grid
       type="xygrid"
       id="grid987" />
  </sodipodi:namedview>
  <g
     fill="none"
     stroke="#00aad4"
     stroke-width="1.5"
     id="g10">
    <path
       d="m2.75 6.75h8.203124l4.296876 4.321428v12.178572h-12.5z"
       id="path2" />
    <path
       d="m10.75 6.25v5h5"
       id="path4" />
    <path
       d="m8.75 6.5735294v-5.8235294h8.203124l4.296876 4.3214286v12.1785714h-5.76923"
       id="path6" />
    <path
       d="m16.75.24999998v5.00000002h5"
       id="path8" />
  </g>
</svg>
