<?xml version="1.0" encoding="UTF-8" standalone="no"?>
<svg
   width="36"
   height="36"
   version="1.1"
   viewBox="0 0 36 36"
   id="svg13"
   sodipodi:docname="tsynfreepascalsyn_150.svg"
   inkscape:version="1.3.2 (091e20e, 2023-11-25, custom)"
   xmlns:inkscape="http://www.inkscape.org/namespaces/inkscape"
   xmlns:sodipodi="http://sodipodi.sourceforge.net/DTD/sodipodi-0.dtd"
   xmlns="http://www.w3.org/2000/svg"
   xmlns:svg="http://www.w3.org/2000/svg">
  <defs
     id="defs13" />
  <sodipodi:namedview
     id="namedview13"
     pagecolor="#ffffff"
     bordercolor="#000000"
     borderopacity="0.25"
     inkscape:showpageshadow="2"
     inkscape:pageopacity="0.0"
     inkscape:pagecheckerboard="0"
     inkscape:deskcolor="#d1d1d1"
     showgrid="true"
     inkscape:current-layer="svg13">
    <inkscape:grid
       id="grid13"
       units="px"
       originx="0"
       originy="0"
       spacingx="0.5"
       spacingy="0.5"
       empcolor="#0099e5"
       empopacity="0.30196078"
       color="#0099e5"
       opacity="0.14901961"
       empspacing="2"
       dotted="false"
       gridanglex="30"
       gridanglez="30"
       visible="true" />
  </sodipodi:namedview>
  <rect
     x="2.4999981"
     y="2.4999826"
     width="30.000004"
     height="31.000017"
     fill="#ffffff"
     fill-rule="evenodd"
     stroke="#2a7efe"
     stroke-linecap="square"
     stroke-linejoin="round"
     style="paint-order:normal"
     id="rect1" />
  <rect
     x="3"
     y="2.9999826"
     width="4"
     height="30.000017"
     fill="#b3b3b3"
     fill-rule="evenodd"
     style="paint-order:normal"
     id="rect2" />
  <path
     d="m10 6.25h16.775"
     fill="none"
     stroke="#666666"
     stroke-width="1.5"
     id="path2" />
  <path
     d="m13 9.25h6.1"
     fill="none"
     stroke="#666666"
     stroke-width="1.5"
     id="path3" />
  <path
     d="m16 12.25h9.15"
     fill="none"
     stroke="#666666"
     stroke-width="1.5"
     id="path4" />
  <path
     d="m13 15.25h3.05"
     fill="none"
     stroke="#666666"
     stroke-width="1.5"
     id="path5" />
  <path
     d="m10 18.25h6.099999"
     fill="none"
     stroke="#666666"
     stroke-width="1.5"
     id="path6" />
  <path
     d="m21 9.25h4.575"
     fill="none"
     stroke="#ff0000"
     stroke-width="1.5"
     id="path7" />
  <path
     d="m18 18.25h9.15"
     fill="none"
     stroke="#ff0000"
     stroke-width="1.5"
     id="path8" />
  <path
     d="m16 15.25h4.575"
     fill="none"
     stroke="#2a7fff"
     stroke-width="1.5"
     id="path9" />
  <path
     d="m20.5 15.25h3.05"
     fill="none"
     stroke="#666666"
     stroke-width="1.5"
     id="path10" />
  <path
     d="m13.522852 26.49997h-2.922825m3.530459-3.899945h-3.530459v7.799892"
     fill="none"
     stroke="#2c5aa0"
     stroke-linecap="round"
     stroke-linejoin="round"
     stroke-width="1.20005"
     id="path11" />
  <path
     d="m28.282923 28.917596c-0.508952 1.909422-4.682898 2.426163-4.682898-1.226359v-2.383045c0-3.652522 4.173946-3.135779 4.682898-1.226359"
     fill="none"
     stroke="#2c5aa0"
     stroke-linecap="round"
     stroke-linejoin="round"
     stroke-width="1.20005"
     id="path12" />
  <path
     d="m16.600025 30.399971v-7.799894h2.250099c3.000133 0 3.000133 4.275846 0 4.275846h-2.250099"
     fill="none"
     stroke="#2c5aa0"
     stroke-linecap="round"
     stroke-linejoin="round"
     stroke-width="1.20005"
     id="path13" />
</svg>
