<?xml version="1.0" encoding="UTF-8" standalone="no"?>
<svg
   width="24"
   height="24"
   viewBox="0 0 24 24"
   version="1.1"
   id="svg1"
   sodipodi:docname="tag_pre_150.svg"
   inkscape:version="1.3.2 (091e20e, 2023-11-25, custom)"
   inkscape:export-filename="tag_pre_150.png"
   inkscape:export-xdpi="96"
   inkscape:export-ydpi="96"
   xmlns:inkscape="http://www.inkscape.org/namespaces/inkscape"
   xmlns:sodipodi="http://sodipodi.sourceforge.net/DTD/sodipodi-0.dtd"
   xmlns="http://www.w3.org/2000/svg"
   xmlns:svg="http://www.w3.org/2000/svg">
  <defs
     id="defs1" />
  <sodipodi:namedview
     id="namedview1"
     pagecolor="#ffffff"
     bordercolor="#000000"
     borderopacity="0.25"
     inkscape:showpageshadow="2"
     inkscape:pageopacity="0.0"
     inkscape:pagecheckerboard="0"
     inkscape:deskcolor="#d1d1d1"
     showgrid="true"
     inkscape:current-layer="svg1">
    <inkscape:grid
       id="grid1"
       units="px"
       originx="0"
       originy="0"
       spacingx="0.5"
       spacingy="0.5"
       empcolor="#0099e5"
       empopacity="0.30196078"
       color="#0099e5"
       opacity="0.14901961"
       empspacing="2"
       dotted="false"
       gridanglex="30"
       gridanglez="30"
       visible="true" />
  </sodipodi:namedview>
  <path
     d="m 21.695486,15.532257 c -0.459311,0.391982 -1.09038,0.627726 -2.195495,0.627726 -1.462557,0 -2.639991,-1.190356 -2.639991,-2.668959 V 11.62896 c 0,-1.478603 1.177434,-2.66896 2.639991,-2.66896 1.462556,0 2.639996,1.190357 2.639996,2.66896 v 0.868963 H 16.86"
     id="path32"
     style="fill:none;stroke:#008dd2;stroke-width:1.92;stroke-linecap:round;stroke-linejoin:round;stroke-opacity:1" />
  <path
     d="m 3.45999,8.96 v 0 c 1.3296,0 2.4,1.070398 2.4,2.399995 v 2.399994 c 0,1.329597 -1.0704,2.399994 -2.4,2.399994 v 0 C 2.13039,16.159983 1.06,15.089586 1.06,13.759989 V 11.359995 C 1.06,10.030398 2.13039,8.96 3.45999,8.96 Z M 1.06,8.96 v 10.739977"
     id="path47"
     style="fill:none;stroke:#008dd2;stroke-width:1.92;stroke-linecap:round;stroke-linejoin:round;stroke-opacity:1" />
  <path
     d="m 10.01,8.96 v 7.199983 m 0,-4.799988 C 10.01,10.030398 11.08039,8.96 12.40999,8.96 v 0 c 0.52085,0 1.00191,0.164256 1.39445,0.444004"
     id="path49"
     style="fill:none;stroke:#008dd2;stroke-width:1.92;stroke-linecap:round;stroke-linejoin:round;stroke-opacity:1" />
</svg>
