<svg width="48" height="48" version="1.1" xmlns="http://www.w3.org/2000/svg">
 <g>
  <circle cx="34.5" cy="37" r="5" fill="#ffffff"/>
  <path d="m41.000144 41.499969c-1.445251 1.900832-3.715933 3.000031-6.00006 3.000031-4.133177 0-7.500076-3.307948-7.500076-7.500076 0-4.241233 3.384836-7.500076 7.500076-7.500076h9.499916m-6.00065-5.999757 6.00065 5.999757-8.500038 8.500037" fill="none" stroke="#ffffff" stroke-linecap="round" stroke-linejoin="round" stroke-miterlimit="5.6" stroke-width="7"/>
  <path d="m41.000144 41.499969c-1.445251 1.900832-3.715933 3.000031-6.00006 3.000031-4.133177 0-7.500076-3.307948-7.500076-7.500076 0-4.241233 3.384836-7.500076 7.500076-7.500076h9.500203m-6.00065-5.999757 6.00065 5.999757-6.000061 6.000061" fill="none" stroke="#fa0302" stroke-linecap="round" stroke-linejoin="round" stroke-miterlimit="5.6" stroke-width="3.00003"/>
 </g>
</svg>
