<?xml version="1.0" encoding="UTF-8" standalone="no"?>
<svg
   height="32"
   viewBox="0 0 8.4666664 8.4666671"
   width="32"
   version="1.1"
   id="svg377"
   sodipodi:docname="Font_15_32.svg"
   inkscape:version="1.2 (dc2aedaf03, 2022-05-15)"
   inkscape:export-filename="Font_15_32.png"
   inkscape:export-xdpi="96"
   inkscape:export-ydpi="96"
   xmlns:inkscape="http://www.inkscape.org/namespaces/inkscape"
   xmlns:sodipodi="http://sodipodi.sourceforge.net/DTD/sodipodi-0.dtd"
   xmlns="http://www.w3.org/2000/svg"
   xmlns:svg="http://www.w3.org/2000/svg">
  <defs
     id="defs381">
    <filter
       inkscape:collect="always"
       style="color-interpolation-filters:sRGB"
       id="filter3705"
       x="-0.087504067"
       y="-0.06562271"
       width="1.1750081"
       height="1.1312454">
      <feGaussianBlur
         inkscape:collect="always"
         stdDeviation="0.23150234"
         id="feGaussianBlur3707" />
    </filter>
  </defs>
  <sodipodi:namedview
     id="namedview379"
     pagecolor="#ffffff"
     bordercolor="#666666"
     borderopacity="1.0"
     inkscape:showpageshadow="2"
     inkscape:pageopacity="0.0"
     inkscape:pagecheckerboard="0"
     inkscape:deskcolor="#d1d1d1"
     showgrid="true"
     inkscape:zoom="28.6875"
     inkscape:cx="14.291939"
     inkscape:cy="16"
     inkscape:current-layer="svg377">
    <inkscape:grid
       type="xygrid"
       id="grid1274" />
  </sodipodi:namedview>
  <g
     id="g3711">
    <path
       id="path3337"
       style="fill:#ffffff;fill-opacity:1;stroke:none;stroke-width:0.264582;stroke-dasharray:none;filter:url(#filter3705)"
       d="M 1.5880168 0 A 0.52934992 0.52934992 0 0 0 1.0588501 0.52916667 L 1.0588501 7.9375001 A 0.52934992 0.52934992 0 0 0 1.5880168 8.4666667 L 4.6482951 8.4666667 C 5.4586836 8.4666667 6.1518129 8.2537849 6.6486898 7.8263957 C 7.1455667 7.3990065 7.408333 6.7639326 7.4083334 6.0859335 C 7.4083339 5.1775116 6.8867065 4.5964049 6.2735189 4.1935425 C 6.3983268 4.0929147 6.5658971 4.0602656 6.6678101 3.929476 C 6.9797152 3.5291934 7.1447836 2.9983325 7.1447836 2.3807333 C 7.1447836 1.8073939 6.8834366 1.2408556 6.4394003 0.78703207 C 5.995364 0.33320848 5.3401881 -6.1777276e-09 4.5625123 0 L 1.5880168 0 z M 3.4395834 2.1171835 L 4.2322998 2.1171835 C 4.3203641 2.1171835 4.470408 2.1775245 4.5857666 2.2928833 C 4.7011253 2.408242 4.7614665 2.5582858 4.7614665 2.6463501 C 4.7614665 2.7368263 4.7017196 2.8854098 4.5878337 2.9998169 C 4.4739479 3.114224 4.3263621 3.1760337 4.2322998 3.1760336 L 3.4395834 3.1760336 L 3.4395834 2.1171835 z M 3.4649048 5.29115 L 4.4979167 5.29115 C 4.5859806 5.29115 4.7360247 5.351491 4.8513835 5.4668498 C 4.9667423 5.5822085 5.0276 5.7322525 5.0276001 5.8203166 C 5.0276001 5.9965968 4.9798177 6.1348023 4.9180461 6.2089234 C 4.8562744 6.2830445 4.7771119 6.3494833 4.4979167 6.3494833 L 3.4649048 6.3494833 L 3.4649048 5.29115 z " />
    <path
       d="M 1.5874997,0.52916667 V 7.9375001 h 3.061312 c 1.4366046,0 2.2303546,-0.7503414 2.2303554,-1.8520836 6e-7,-1.0583334 -0.8617932,-1.7349554 -1.5875006,-1.852083 0.7937498,-0.2645834 1.3229166,-0.79375 1.3229166,-1.8520834 0,-0.79375 -0.79375,-1.85208343 -2.052588,-1.85208343 z M 2.9104163,1.5875001 h 1.3229166 c 0.5291668,0 1.0583336,0.5291666 1.0583336,1.0583334 0,0.5291666 -0.5219322,1.0583332 -1.0583336,1.0583332 H 2.9104163 Z m 0.025838,3.175 h 1.561662 c 0.5291664,0 1.0583332,0.5291666 1.0583332,1.0583334 0,0.5291666 -0.2645832,1.0583332 -1.0583332,1.0583332 H 2.9362545 Z"
       id="path2"
       style="fill:#000000;fill-opacity:1;stroke:none;stroke-width:0.264582;stroke-dasharray:none"
       sodipodi:nodetypes="ccsscssccssscccssscc" />
  </g>
</svg>
