<?xml version="1.0" encoding="UTF-8" standalone="no"?>
<svg
   width="32"
   height="32"
   version="1.0"
   id="svg11"
   sodipodi:docname="menu_build_clean_200.svg"
   inkscape:export-filename="menu_build_clean_200.png"
   inkscape:export-xdpi="96"
   inkscape:export-ydpi="96"
   inkscape:version="1.3.2 (091e20e, 2023-11-25, custom)"
   xmlns:inkscape="http://www.inkscape.org/namespaces/inkscape"
   xmlns:sodipodi="http://sodipodi.sourceforge.net/DTD/sodipodi-0.dtd"
   xmlns="http://www.w3.org/2000/svg"
   xmlns:svg="http://www.w3.org/2000/svg">
  <sodipodi:namedview
     id="namedview11"
     pagecolor="#ffffff"
     bordercolor="#000000"
     borderopacity="0.25"
     inkscape:showpageshadow="2"
     inkscape:pageopacity="0.0"
     inkscape:pagecheckerboard="0"
     inkscape:deskcolor="#d1d1d1"
     showgrid="true"
     inkscape:current-layer="svg11">
    <inkscape:grid
       id="grid11"
       units="px"
       originx="0"
       originy="0"
       spacingx="0.5"
       spacingy="0.5"
       empcolor="#0099e5"
       empopacity="0.30196078"
       color="#0099e5"
       opacity="0.14901961"
       empspacing="2"
       dotted="false"
       gridanglex="30"
       gridanglez="30"
       visible="true" />
  </sodipodi:namedview>
  <defs
     id="defs5">
    <linearGradient
       id="b"
       x1="2"
       x2="4"
       y1="4"
       y2="2"
       gradientTransform="matrix(-1.526342 .33811518 .33814208 1.5264822 31.559805 5.1931362)"
       gradientUnits="userSpaceOnUse">
      <stop
         stop-color="#9d660d"
         offset="0"
         id="stop1" />
      <stop
         stop-color="#eea632"
         offset=".50192344"
         id="stop2" />
      <stop
         stop-color="#9d650d"
         offset="1"
         id="stop3" />
    </linearGradient>
    <radialGradient
       id="a"
       cx="9.032692"
       cy="8.5654745"
       r="6.499989"
       gradientTransform="matrix(-.58777927 1.2388596 2.8518789 1.3533858 2.4468469 -1.8036809)"
       gradientUnits="userSpaceOnUse">
      <stop
         stop-color="#fef6ce"
         offset="0"
         id="stop4" />
      <stop
         stop-color="#d5c015"
         offset="1"
         id="stop5" />
    </radialGradient>
  </defs>
  <path
     d="m14.46875 2.75-0.509766 4.0839844-2.289062 0.9492187-3.2500001-2.5292969-2.1660157 2.1660157 2.5292969 3.2500001-0.9492187 2.289062-4.0839844 0.509766v3.0625l4.0839844 0.509766 0.9492187 2.289062-2.5292969 3.25 2.1660157 2.166016 0.8828125-0.6875c0.021487-0.60824 0.3601852-1.188208 0.9160156-1.488282 2.233937-1.210117 3.043133-2.345662 4.298828-3.777343 0.0053-0.0061 0.01224-0.01152 0.01758-0.01758a4.0833332 4.0833332 0 0 1-2.619142-3.775389 4.0833332 4.0833332 0 0 1 4.083984-4.083984 4.0833332 4.0833332 0 0 1 3.921875 2.976562l0.345703-2.09375c0.09325-0.580574 0.475207-1.079652 1.011719-1.320312a1.250125 1.250125 0 0 0 2e-3 -2e-3c0.535679-0.238887 1.159857-0.192468 1.654297 0.123046l0.341797 0.216797-0.06055-0.146484 0.853515-1.0957032 1.490235-2.3398438-1.980469-1.9804688-3.25 2.5292969-2.289106-0.9491717-0.509766-4.0839844z"
     fill="#aaccff"
     fill-rule="evenodd"
     stroke-linejoin="round"
     id="path5" />
  <path
     d="m14.46875 2a0.750075 0.750075 0 0 0-0.744141 0.65625l-0.457031 3.6503906-1.482422 0.6152344-2.9042966-2.2597656a0.750075 0.750075 0 0 0-0.9921875 0.0625l-2.1640625 2.1640625a0.750075 0.750075 0 0 0-0.0625 0.9921875l2.2597656 2.9042966-0.6152344 1.482422-3.6503906 0.457031a0.750075 0.750075 0 0 0-0.65625 0.744141v3.0625a0.750075 0.750075 0 0 0 0.65625 0.744141l3.6503906 0.457031 0.6152344 1.482422-2.2597656 2.904297a0.750075 0.750075 0 0 0 0.0625 0.992187l2.1640625 2.164063a0.750075 0.750075 0 0 0 0.9921875 0.0625l0.5898437-0.458985c-0.027132-0.07603-0.061211-0.152515-0.085937-0.228515a1.250125 1.250125 0 0 0 0-2e-3c-0.256988-0.795448 0.098403-1.681009 0.8339844-2.078125 0.657396-0.356109 1.182305-0.705953 1.640625-1.058593a0.750075 0.750075 0 0 0-0.6503915 0.113327l-2.7265621 2.123047-1.2304688-1.230469 2.1230469-2.726562a0.750075 0.750075 0 0 0 0.099609-0.748047l-0.9492184-2.289063a0.750075 0.750075 0 0 0-0.5996094-0.457031l-3.4257812-0.427734v-1.738282l3.4257812-0.427734a0.750075 0.750075 0 0 0 0.5996094-0.457031l0.9492188-2.289063a0.750075 0.750075 0 0 0-0.0996094-0.748047l-2.1230469-2.7265621 1.2304688-1.2304688 2.7265621 2.1230469a0.750075 0.750075 0 0 0 0.748047 0.099609l2.289063-0.9492184a0.750075 0.750075 0 0 0 0.457031-0.5996094l0.427734-3.4257812h1.738282l0.427734 3.4257812a0.750075 0.750075 0 0 0 0.457031 0.5996094l2.289063 0.9492188a0.750075 0.750075 0 0 0 0.748047-0.0996094l2.726562-2.1230469 1.230469 1.2304688-2.123047 2.7265621a0.750075 0.750075 0 0 0-0.08594 0.205079c0.137704 0.04508 0.271785 0.105972 0.396485 0.185546l0.341797 0.21875 2.564453-4.0253903c0.04415-0.069276 0.09183-0.1332785 0.138672-0.1992187l-1.869139-1.8691406a0.750075 0.750075 0 0 0-0.992187-0.0625l-2.904297 2.2597656-1.482422-0.6152344-0.457031-3.6503906a0.750075 0.750075 0 0 0-0.744141-0.65625z"
     fill="#457abe"
     fill-rule="evenodd"
     stroke-linejoin="round"
     id="path6" />
  <path
     d="m13.998047 19.392578c0.170646-0.198159 0.335607-0.389908 0.519531-0.599609 0.17164-0.195695 0.360006-0.3925 0.556641-0.589844-1.394511-0.398875-2.408204-1.675424-2.408203-3.203125 0-1.849828 1.484156-3.333984 3.333984-3.333984 1.849829-1e-6 3.333984 1.484155 3.333984 3.333984 0 0.100425-0.0071 0.198784-0.01563 0.296875 0.13517-0.06323 0.263603-0.127708 0.404297-0.189453l0.423828-2.574219c-0.845605-1.413681-2.386798-2.367189-4.146479-2.367187-2.660486 0-4.833984 2.173498-4.833984 4.833984-1e-6 1.946315 1.165891 3.627828 2.832031 4.392578z"
     fill="#457abe"
     fill-rule="evenodd"
     stroke-linejoin="round"
     id="path7" />
  <path
     d="m12.429688 18.242187c0.222312-0.256522 0.441011-0.512878 0.679687-0.785156 0.09788-0.111664 0.2046-0.225212 0.310547-0.33789-0.471817-0.574872-0.753906-1.312373-0.753906-2.119141 0-1.849828 1.484156-3.333984 3.333984-3.333984 1.007-1e-6 1.903839 0.441421 2.513672 1.140625l0.287109-1.736328c-0.791749-0.566607-1.757647-0.904298-2.800781-0.904297-2.660486 0-4.833984 2.173498-4.833984 4.833984 0 1.247103 0.482227 2.3828 1.263672 3.242187z"
     fill="#457abe"
     fill-rule="evenodd"
     stroke-linejoin="round"
     id="path8" />
  <path
     d="m27.483289 15.70449 3.5646-5.593792c1.7823-2.7968961-1.946668-5.1736301-3.728968-2.376734l-3.5646 5.593792"
     fill="url(#b)"
     fill-rule="evenodd"
     stroke="#a86400"
     stroke-linejoin="round"
     stroke-width=".999999"
     id="path9" />
  <path
     d="m21.995044 12.076123 7.457936 4.753468-3.477713 2.37177c0.843699 5.17843 0.274312 9.547558-1.279789 12.293904-7.969852 0.164094-12.537649-3.981161-13.645489-7.386271 5.004055-2.709885 4.327771-5.762849 10.264068-7.878551z"
     fill="url(#a)"
     fill-rule="evenodd"
     stroke="#897c17"
     stroke-linecap="round"
     stroke-linejoin="round"
     stroke-width=".999999"
     id="path10" />
  <path
     d="m25.975267 19.201361-4.66121-2.970918"
     fill="none"
     stroke="#d40000"
     stroke-linecap="round"
     stroke-width="2px"
     id="path11" />
</svg>
