<?xml version="1.0" encoding="UTF-8" standalone="no"?>
<svg
   width="24"
   height="24"
   version="1.1"
   viewBox="0 0 24 24"
   id="svg14"
   sodipodi:docname="ttifloatspinedit.svg"
   inkscape:version="1.3.2 (091e20e, 2023-11-25, custom)"
   xmlns:inkscape="http://www.inkscape.org/namespaces/inkscape"
   xmlns:sodipodi="http://sodipodi.sourceforge.net/DTD/sodipodi-0.dtd"
   xmlns="http://www.w3.org/2000/svg"
   xmlns:svg="http://www.w3.org/2000/svg">
  <sodipodi:namedview
     id="namedview14"
     pagecolor="#ffffff"
     bordercolor="#000000"
     borderopacity="0.25"
     inkscape:showpageshadow="2"
     inkscape:pageopacity="0.0"
     inkscape:pagecheckerboard="0"
     inkscape:deskcolor="#d1d1d1"
     showgrid="true"
     inkscape:current-layer="svg14">
    <inkscape:grid
       id="grid14"
       units="px"
       originx="0"
       originy="0"
       spacingx="0.5"
       spacingy="0.5"
       empcolor="#0099e5"
       empopacity="0.30196078"
       color="#0099e5"
       opacity="0.14901961"
       empspacing="2"
       dotted="false"
       gridanglex="30"
       gridanglez="30"
       visible="true" />
  </sodipodi:namedview>
  <defs
     id="defs6">
    <radialGradient
       id="a"
       cx="5.3999925"
       cy="1034.7039"
       r="4"
       gradientTransform="matrix(1.2499938,-1.2500079,0.75001073,0.75000232,-776.78893,-763.28024)"
       gradientUnits="userSpaceOnUse">
      <stop
         stop-color="#198d19"
         offset="0"
         id="stop1" />
      <stop
         stop-color="#ffffff"
         offset="1"
         id="stop2" />
    </radialGradient>
    <radialGradient
       id="c"
       cx="5.3999925"
       cy="1034.7039"
       r="4"
       gradientTransform="matrix(1.2499938,-1.2500079,0.75001073,0.75000232,-768.78893,-763.28022)"
       gradientUnits="userSpaceOnUse">
      <stop
         stop-color="#1a75ff"
         offset="0"
         id="stop3" />
      <stop
         stop-color="#ffffff"
         offset="1"
         id="stop4" />
    </radialGradient>
    <radialGradient
       id="b"
       cx="5.3999925"
       cy="1034.7039"
       r="4"
       gradientTransform="matrix(1.2499938,-1.2500079,0.75001073,0.75000232,-776.78893,-755.2802)"
       gradientUnits="userSpaceOnUse">
      <stop
         stop-color="#ff1919"
         offset="0"
         id="stop5" />
      <stop
         stop-color="#ffffff"
         offset="1"
         id="stop6" />
    </radialGradient>
  </defs>
  <circle
     cx="5"
     cy="4.9999828"
     r="3.5"
     fill="url(#a)"
     fill-rule="evenodd"
     stroke="#198d19"
     stroke-linecap="square"
     stroke-linejoin="round"
     style="fill:url(#a);paint-order:normal"
     id="circle6" />
  <circle
     cx="13"
     cy="4.9999828"
     r="3.5"
     fill="url(#c)"
     fill-rule="evenodd"
     stroke="#1a75ff"
     stroke-linecap="square"
     stroke-linejoin="round"
     style="fill:url(#c);paint-order:normal"
     id="circle7" />
  <circle
     cx="5"
     cy="12.999983"
     r="3.5"
     fill="url(#b)"
     fill-rule="evenodd"
     stroke="#ff1a1a"
     stroke-linecap="square"
     stroke-linejoin="round"
     style="fill:url(#b);paint-order:normal"
     id="circle8" />
  <rect
     x="16.5"
     y="13.249983"
     width="7.25"
     height="5.25"
     fill="#ffffff"
     stroke="#2a7efe"
     stroke-linecap="round"
     stroke-linejoin="round"
     stroke-width="0.5"
     style="paint-order:normal"
     id="rect8" />
  <rect
     transform="scale(1,-1)"
     x="16.5"
     y="-23.749983"
     width="7.25"
     height="5.25"
     fill="#ffffff"
     stroke="#2a7efe"
     stroke-linecap="round"
     stroke-linejoin="round"
     stroke-width="0.5"
     style="paint-order:normal"
     id="rect9" />
  <rect
     x="3.25"
     y="13.249983"
     width="13.25"
     height="10.500261"
     fill="#ffffff"
     stroke="#2a7efe"
     stroke-linecap="round"
     stroke-linejoin="round"
     stroke-width="0.5"
     id="rect10" />
  <path
     d="m 20,14.9998 -1.5,1.5 h 3 z"
     fill="#666666"
     fill-rule="evenodd"
     stroke="#666666"
     stroke-linejoin="round"
     stroke-width="1px"
     id="path10" />
  <path
     d="m 20,22 -1.5,-1.5 h 3 z"
     fill="#666666"
     fill-rule="evenodd"
     stroke="#666666"
     stroke-linejoin="round"
     stroke-width="1px"
     id="path11" />
  <path
     d="M 7.6,20.6 V 15.4 L 6.058183,16.3905"
     fill="none"
     stroke="#4d4d4d"
     stroke-linecap="round"
     stroke-linejoin="round"
     stroke-width="0.8"
     id="path12" />
  <path
     d="m 12.927181,15.4 -1.699771,3.1213 m -0.15041,0.593 c 0,-0.6838 0.552236,-1.2381 1.233454,-1.2381 0.681218,0 1.233453,0.5543 1.233453,1.2381 v 0.2476 c 0,0.6838 -0.552235,1.2381 -1.233453,1.2381 C 11.629236,20.6 11.077,20.0457 11.077,19.3619 Z"
     fill="none"
     stroke="#4d4d4d"
     stroke-linecap="round"
     stroke-linejoin="round"
     stroke-width="0.8"
     id="path13" />
  <path
     d="m 9.5,20.5 v 1"
     fill="none"
     stroke="#4d4d4d"
     stroke-linecap="round"
     id="path14" />
</svg>
