<?xml version="1.0" encoding="UTF-8" standalone="no"?>
<svg
   height="36"
   width="36"
   version="1.1"
   id="svg296"
   sodipodi:docname="Folder_06_36.svg"
   inkscape:export-filename="Folder_06_36.png"
   inkscape:export-xdpi="96"
   inkscape:export-ydpi="96"
   inkscape:version="1.2-beta (1b65182ce9, 2022-04-05)"
   xml:space="preserve"
   xmlns:inkscape="http://www.inkscape.org/namespaces/inkscape"
   xmlns:sodipodi="http://sodipodi.sourceforge.net/DTD/sodipodi-0.dtd"
   xmlns="http://www.w3.org/2000/svg"
   xmlns:svg="http://www.w3.org/2000/svg"><defs
     id="defs300" /><sodipodi:namedview
     id="namedview298"
     pagecolor="#ffffff"
     bordercolor="#666666"
     borderopacity="1.0"
     inkscape:pageshadow="2"
     inkscape:pageopacity="0.0"
     inkscape:pagecheckerboard="0"
     inkscape:deskcolor="#d1d1d1"
     showgrid="true"
     inkscape:zoom="25.5"
     inkscape:cx="17.411765"
     inkscape:cy="18"
     inkscape:current-layer="svg296"
     showguides="true"><inkscape:grid
       type="xygrid"
       id="grid823" /></sodipodi:namedview><path
     d="M 34.875035,14.124952 H 5.6251737 L 1.125195,32.874863 h 29.249862 z"
     stroke-linecap="round"
     id="path10"
     style="fill:none;stroke:#00aad4;stroke-width:2.24999;stroke-linejoin:round"
     sodipodi:nodetypes="ccccc" /><path
     d="M 1.125396,32.874026 1.124995,7.1249808 c 0,-1.8749911 1.125195,-2.9999858 3.000186,-2.9999858 H 9.9 c 2.249989,0 3,1.1249947 3,2.9999858 v 1.0000195 h 16.975 v 5.7500007"
     id="path8-0"
     style="fill:none;stroke:#00aad4;stroke-width:2.24999;stroke-linecap:round;stroke-linejoin:round"
     sodipodi:nodetypes="cccccccc" /></svg>
