<?xml version="1.0" encoding="UTF-8" standalone="no"?>
<svg
   width="48"
   height="48"
   version="1.1"
   viewBox="0 0 48 48"
   id="svg4"
   sodipodi:docname="tfpoauth2inistore_200.svg"
   inkscape:export-filename="tfpoauth2inistore_200.png"
   inkscape:export-xdpi="96"
   inkscape:export-ydpi="96"
   inkscape:version="1.3.2 (091e20e, 2023-11-25, custom)"
   xmlns:inkscape="http://www.inkscape.org/namespaces/inkscape"
   xmlns:sodipodi="http://sodipodi.sourceforge.net/DTD/sodipodi-0.dtd"
   xmlns="http://www.w3.org/2000/svg"
   xmlns:svg="http://www.w3.org/2000/svg">
  <defs
     id="defs4" />
  <sodipodi:namedview
     id="namedview4"
     pagecolor="#ffffff"
     bordercolor="#000000"
     borderopacity="0.25"
     inkscape:showpageshadow="2"
     inkscape:pageopacity="0.0"
     inkscape:pagecheckerboard="0"
     inkscape:deskcolor="#d1d1d1"
     showgrid="true"
     inkscape:current-layer="svg4">
    <inkscape:grid
       id="grid4"
       units="px"
       originx="0"
       originy="0"
       spacingx="0.5"
       spacingy="0.5"
       empcolor="#0099e5"
       empopacity="0.30196078"
       color="#0099e5"
       opacity="0.14901961"
       empspacing="2"
       dotted="false"
       gridanglex="30"
       gridanglez="30"
       visible="true" />
  </sodipodi:namedview>
  <path
     d="m2 17c-1.1045229 1.1e-4 -1.99989 0.895477-2 2v14c1.0999989e-4 1.104523 0.8954771 1.99989 2 2h6.5v-3.683594a3 3 0 0 1-1 0.183594 3 3 0 0 1-2.1210938-0.878906 3 3 0 0 1 0-4.242188l4.0000001-4a3.0003 3.0003 0 0 1 4.2421877 0l4 4a3 3 0 0 1 0 4.242188 3 3 0 0 1-3.121094 0.695312v3.683594h7.5c1.104523-1.1e-4 1.99989-0.895477 2-2v-14c-1.1e-4 -1.104523-0.895477-1.99989-2-2z"
     fill="#008dd2"
     stroke-linejoin="round"
     stroke-width="2"
     id="path1" />
  <path
     d="m20 12v-1c0-4.418278-3.581722-8-8-8s-8 3.581722-8 8v6"
     fill="none"
     stroke="#66a6ff"
     stroke-linejoin="round"
     stroke-width="4"
     id="path2" />
  <text
     x="-38"
     y="64.999962"
     font-size="24px"
     stroke-width="2"
     id="text2"><tspan
       x="-38"
       y="94.156212"
       stroke-width="2"
       id="tspan2" /></text>
  <circle
     cx="34"
     cy="35.5"
     r="11.538462"
     fill="#ffffff"
     stroke="#b3b3b3"
     stroke-dashoffset="1.49998"
     stroke-linecap="square"
     stroke-linejoin="round"
     stroke-width="1.92308"
     id="circle2" />
  <text
     x="28.836273"
     y="41.99987"
     font-family="Bahnschrift"
     font-size="19.518px"
     font-weight="bold"
     stroke-width="1.82979"
     id="text3"><tspan
       x="28.836273"
       y="41.99987"
       stroke-width="1.82979"
       id="tspan3">2</tspan></text>
  <g
     transform="matrix(1,0,0,-1,-22,67)"
     fill="none"
     stroke="#ff0000"
     stroke-linecap="round"
     stroke-width="3"
     id="g4">
    <path
       d="m33.5 26.5v16"
       id="path3" />
    <path
       d="m37.5 38.5-4 4-4-4"
       stroke-linejoin="round"
       id="path4" />
  </g>
</svg>
