<?xml version="1.0" encoding="UTF-8" standalone="no"?>
<svg
   width="32"
   height="32"
   version="1.1"
   viewBox="0 0 32 32"
   id="svg2"
   sodipodi:docname="Bluetooth_01_32.svg"
   inkscape:export-filename="Bluetooth_01_32.png"
   inkscape:export-xdpi="96"
   inkscape:export-ydpi="96"
   inkscape:version="1.3.2 (091e20e, 2023-11-25, custom)"
   xmlns:inkscape="http://www.inkscape.org/namespaces/inkscape"
   xmlns:sodipodi="http://sodipodi.sourceforge.net/DTD/sodipodi-0.dtd"
   xmlns="http://www.w3.org/2000/svg"
   xmlns:svg="http://www.w3.org/2000/svg">
  <defs
     id="defs2" />
  <sodipodi:namedview
     id="namedview2"
     pagecolor="#ffffff"
     bordercolor="#000000"
     borderopacity="0.25"
     inkscape:showpageshadow="2"
     inkscape:pageopacity="0.0"
     inkscape:pagecheckerboard="0"
     inkscape:deskcolor="#d1d1d1"
     showgrid="true"
     inkscape:current-layer="svg2">
    <inkscape:grid
       id="grid2"
       units="px"
       originx="0"
       originy="0"
       spacingx="0.5"
       spacingy="0.5"
       empcolor="#0099e5"
       empopacity="0.30196078"
       color="#0099e5"
       opacity="0.14901961"
       empspacing="2"
       dotted="false"
       gridanglex="30"
       gridanglez="30"
       visible="true" />
  </sodipodi:namedview>
  <path
     d="M 16.00105,31 C 22,31 27,28 27,16.000176 27,4 22,1 16.00105,1 10,1 5,4 5,16.000176 5,28 10,31 16.00105,31 Z"
     fill="#0082fc"
     stroke-width=".189485"
     id="path1" />
  <path
     style="fill:none;stroke:#ffffff;stroke-width:1.99997;stroke-linejoin:miter;stroke-dasharray:none"
     d="M 10.000103,10.000104 20.999917,20.999916 16,25.99983 V 6.0001731 l 4.999917,4.9999139 -10.999814,10.999812"
     id="path4" />
</svg>
