<?xml version="1.0" encoding="UTF-8" standalone="no"?>
<svg
   height="36"
   viewBox="0 0 9.5249997 9.5250005"
   width="36"
   version="1.1"
   id="svg12"
   sodipodi:docname="Database_12_36.svg"
   inkscape:export-filename="Database_12_36.png"
   inkscape:export-xdpi="96"
   inkscape:export-ydpi="96"
   inkscape:version="1.2.1 (9c6d41e410, 2022-07-14)"
   xmlns:inkscape="http://www.inkscape.org/namespaces/inkscape"
   xmlns:sodipodi="http://sodipodi.sourceforge.net/DTD/sodipodi-0.dtd"
   xmlns="http://www.w3.org/2000/svg"
   xmlns:svg="http://www.w3.org/2000/svg">
  <defs
     id="defs16" />
  <sodipodi:namedview
     id="namedview14"
     pagecolor="#ffffff"
     bordercolor="#666666"
     borderopacity="1.0"
     inkscape:showpageshadow="2"
     inkscape:pageopacity="0.0"
     inkscape:pagecheckerboard="0"
     inkscape:deskcolor="#d1d1d1"
     showgrid="true"
     inkscape:zoom="25.5"
     inkscape:cx="17.980392"
     inkscape:cy="18"
     inkscape:current-layer="svg12">
    <inkscape:grid
       type="xygrid"
       id="grid861" />
  </sodipodi:namedview>
  <g
     stroke-linecap="round"
     id="g10">
    <path
       d="m4.1010417.59531251c-1.972626 0-3.57187503.62193669-3.57187503 1.38906249v1.1110433c0 .7671261 1.59924903 1.3890625 3.57187503 1.3890625.1806594 0 .3582962-.0054362.5317505-.0155029.42913-.3903673.9977858-.6294189 1.6179891-.6294189.2376314 0 .4676865.0349825.6852295.1002522.4618428-.2340773.7369059-.5265674.7369059-.8443929v-1.0965739-.0144694c0-.7671258-1.5992483-1.38906249-3.571875-1.38906249zm0 .83354089c1.6505445 0 2.7285001.5337779 3.2349447.9539469-.5053578.3446666-1.5804541.7364595-3.2349447.712618-1.6381989-.0237019-2.712951-.4091566-3.22409263-.7379394.50833593-.4216777 1.57671423-.9286255 3.22409263-.9286255zm-3.57187503 2.5001058v1.3890625c0 .7386464 1.48273013 1.3426461 3.35380053 1.3864787-.0284567-.1470745-.0434082-.2988431-.0434082-.4537191 0-.3302025.0678618-.6455819.1901692-.9332764-1.9396181-.0148161-3.50056153-.6307118-3.50056153-1.3885457zm7.14375003 0c0 .1082242-.0317671.2136033-.091984.3147095.0312789.0208789.0617405.0428388.091984.0651123zm-7.14375003 2.2226034v1.3890625c0 .7671266 1.59924703 1.3890625 3.57187503 1.3890625.7888825 0 1.5178695-.0997588 2.1089152-.2682007-.8339275-.0141088-1.5702898-.4597625-1.99316-1.1218953-.0384897.0004772-.0769674.0010335-.1157552.0010335-1.972628 0-3.57187503-.6219359-3.57187503-1.3890625z"
       fill="#00aad4"
       stroke-linejoin="round"
       stroke-miterlimit="5.6"
       stroke-width=".529168"
       id="path2" />
    <g
       fill="none"
       stroke="#ff7f00"
       transform="matrix(.59531251 0 0 .59531251 -.00013 0)"
       id="g8">
      <circle
         cx="10.5"
         cy="10.5"
         r="2.85"
         stroke-linejoin="round"
         stroke-width=".8"
         id="circle4" />
      <path
         d="m12.75 12.75 2.55 2.55"
         stroke-width="1.4"
         id="path6" />
    </g>
  </g>
</svg>
