<?xml version="1.0" encoding="UTF-8" standalone="no"?>
<svg
   height="64"
   width="64"
   version="1.1"
   id="svg16"
   sodipodi:docname="Export_02_64.svg"
   inkscape:export-filename="Export_02_64.png"
   inkscape:export-xdpi="96"
   inkscape:export-ydpi="96"
   inkscape:version="1.2-beta (1b65182ce9, 2022-04-05)"
   xmlns:inkscape="http://www.inkscape.org/namespaces/inkscape"
   xmlns:sodipodi="http://sodipodi.sourceforge.net/DTD/sodipodi-0.dtd"
   xmlns="http://www.w3.org/2000/svg"
   xmlns:svg="http://www.w3.org/2000/svg">
  <defs
     id="defs20" />
  <sodipodi:namedview
     id="namedview18"
     pagecolor="#ffffff"
     bordercolor="#666666"
     borderopacity="1.0"
     inkscape:pageshadow="2"
     inkscape:pageopacity="0.0"
     inkscape:pagecheckerboard="0"
     inkscape:deskcolor="#d1d1d1"
     showgrid="true"
     inkscape:zoom="14.34375"
     inkscape:cx="29.455338"
     inkscape:cy="32"
     inkscape:current-layer="svg16">
    <inkscape:grid
       type="xygrid"
       id="grid1649" />
  </sodipodi:namedview>
  <g
     id="g2786"
     style="stroke-width:0.75;stroke-dasharray:none"
     transform="scale(4)">
    <circle
       style="fill:none;stroke:#00aad4;stroke-width:0.75;stroke-linecap:round;stroke-linejoin:round;stroke-dasharray:none;stroke-dashoffset:1.49998"
       id="path355"
       cx="8"
       cy="8"
       r="7" />
    <path
       style="fill:none;stroke:#00aad4;stroke-width:0.75;stroke-linecap:butt;stroke-linejoin:miter;stroke-dasharray:none;stroke-opacity:1"
       d="M 8,1 V 15"
       id="path966" />
    <path
       style="fill:none;stroke:#00aad4;stroke-width:0.75;stroke-linecap:butt;stroke-linejoin:miter;stroke-dasharray:none;stroke-opacity:1"
       d="m 8,1 c 5,2 5,11.968323 0,14"
       id="path968"
       sodipodi:nodetypes="cc" />
    <path
       style="fill:none;stroke:#00aad4;stroke-width:0.75;stroke-linecap:butt;stroke-linejoin:miter;stroke-dasharray:none;stroke-opacity:1"
       d="M 8,1 C 2.9999995,3 2.9999995,12.968323 8,15"
       id="path1068"
       sodipodi:nodetypes="cc" />
    <path
       style="fill:none;stroke:#00aad4;stroke-width:0.75;stroke-linecap:butt;stroke-linejoin:miter;stroke-dasharray:none;stroke-opacity:1"
       d="M 15,8 H 1"
       id="path2036" />
    <path
       style="fill:none;stroke:#00aad4;stroke-width:0.75;stroke-linecap:butt;stroke-linejoin:miter;stroke-dasharray:none;stroke-opacity:1"
       d="m 13.999656,4.5 c -4.0234734,0.6733929 -8.0230035,0.6599125 -12,0"
       id="path2764"
       sodipodi:nodetypes="cc" />
    <path
       style="fill:none;stroke:#00aad4;stroke-width:0.75;stroke-linecap:butt;stroke-linejoin:miter;stroke-dasharray:none;stroke-opacity:1"
       d="m 13.999656,11.499862 c -4.0234734,-0.673393 -8.0230035,-0.659912 -12,0"
       id="path2766"
       sodipodi:nodetypes="cc" />
  </g>
</svg>
