<?xml version="1.0" encoding="UTF-8" standalone="no"?>
<svg
   height="48"
   viewBox="0 0 12.7 12.700001"
   width="48"
   version="1.1"
   id="svg746"
   sodipodi:docname="Font_17_48.svg"
   inkscape:version="1.2 (dc2aedaf03, 2022-05-15)"
   inkscape:export-filename="Font_17_48.png"
   inkscape:export-xdpi="96"
   inkscape:export-ydpi="96"
   xmlns:inkscape="http://www.inkscape.org/namespaces/inkscape"
   xmlns:sodipodi="http://sodipodi.sourceforge.net/DTD/sodipodi-0.dtd"
   xmlns="http://www.w3.org/2000/svg"
   xmlns:svg="http://www.w3.org/2000/svg">
  <defs
     id="defs750">
    <filter
       inkscape:collect="always"
       style="color-interpolation-filters:sRGB"
       id="filter2725"
       x="-0.097517654"
       y="-0.060930609"
       width="1.1950353"
       height="1.1218612">
      <feGaussianBlur
         inkscape:collect="always"
         stdDeviation="0.32239824"
         id="feGaussianBlur2727" />
    </filter>
  </defs>
  <sodipodi:namedview
     id="namedview748"
     pagecolor="#ffffff"
     bordercolor="#666666"
     borderopacity="1.0"
     inkscape:showpageshadow="2"
     inkscape:pageopacity="0.0"
     inkscape:pagecheckerboard="0"
     inkscape:deskcolor="#d1d1d1"
     showgrid="true"
     inkscape:zoom="19.125"
     inkscape:cx="21.385621"
     inkscape:cy="24"
     inkscape:current-layer="svg746">
    <inkscape:grid
       type="xygrid"
       id="grid1256" />
  </sodipodi:namedview>
  <g
     id="g2731">
    <path
       id="path2358"
       style="fill:#ffffff;fill-opacity:1;stroke:none;stroke-width:1.02831;filter:url(#filter2725)"
       d="M 5.0255332 0 A 0.79304805 0.79304805 0 0 0 4.251937 0.62115074 L 3.9883872 1.8122926 A 0.79304805 0.79304805 0 0 0 4.7614667 2.7770916 L 5.4001874 2.7770916 L 4.0994915 9.9218754 L 3.4297649 9.9218754 A 0.79304805 0.79304805 0 0 0 2.6541017 10.548711 L 2.4003704 11.740369 A 0.79304805 0.79304805 0 0 0 3.1760337 12.698967 L 7.6739505 12.698967 A 0.79304805 0.79304805 0 0 0 8.44703 12.078333 L 8.7110965 10.886674 A 0.79304805 0.79304805 0 0 0 7.9375003 9.9218754 L 7.2987796 9.9218754 L 8.5994754 2.7770916 L 9.2619673 2.7770916 A 0.79304805 0.79304805 0 0 0 10.035047 2.1564576 L 10.298597 0.96479903 A 0.79304805 0.79304805 0 0 0 9.5255171 0 L 5.0255332 0 z " />
    <path
       d="M 6.3499998,1.9843753 H 4.7625 l 0.263571,-1.19062525 4.4989286,3e-7 -0.263571,1.19062495 H 7.9374996 L 6.3500001,10.715625 H 7.9374996 L 7.6739286,11.90625 H 3.1750008 l 0.255069,-1.190625 h 1.3324311 z"
       id="path2"
       style="fill:#000000;fill-opacity:1;stroke:none;stroke-width:1.02831" />
  </g>
</svg>
