<?xml version="1.0" encoding="UTF-8" standalone="no"?>
<svg
   width="32"
   height="32"
   version="1.1"
   id="svg5"
   sodipodi:docname="Folder_21_32.svg"
   inkscape:export-filename="Folder_21_32.png"
   inkscape:export-xdpi="96"
   inkscape:export-ydpi="96"
   inkscape:version="1.3.2 (091e20e, 2023-11-25, custom)"
   xmlns:inkscape="http://www.inkscape.org/namespaces/inkscape"
   xmlns:sodipodi="http://sodipodi.sourceforge.net/DTD/sodipodi-0.dtd"
   xmlns="http://www.w3.org/2000/svg"
   xmlns:svg="http://www.w3.org/2000/svg">
  <sodipodi:namedview
     id="namedview5"
     pagecolor="#ffffff"
     bordercolor="#000000"
     borderopacity="0.25"
     inkscape:showpageshadow="2"
     inkscape:pageopacity="0.0"
     inkscape:pagecheckerboard="0"
     inkscape:deskcolor="#d1d1d1"
     showgrid="true"
     inkscape:current-layer="svg5">
    <inkscape:grid
       id="grid5"
       units="px"
       originx="0"
       originy="0"
       spacingx="0.5"
       spacingy="0.5"
       empcolor="#0099e5"
       empopacity="0.30196078"
       color="#0099e5"
       opacity="0.14901961"
       empspacing="2"
       dotted="false"
       gridanglex="30"
       gridanglez="30"
       visible="true" />
  </sodipodi:namedview>
  <defs
     id="defs4">
    <linearGradient
       id="a"
       x1="-27.588779"
       x2="-6.4483247"
       y1="1038.0051"
       y2="1047.7192"
       gradientTransform="matrix(1.3717775,0,0,1.5441438,39.345667,-1591.3292)"
       gradientUnits="userSpaceOnUse">
      <stop
         stop-color="#ffe496"
         offset="0"
         id="stop1" />
      <stop
         stop-color="#ffcc40"
         offset="1"
         id="stop2" />
    </linearGradient>
    <linearGradient
       id="b"
       x1="-28.500042"
       x2="-13.000042"
       y1="1030.8622"
       y2="1034.3622"
       gradientTransform="matrix(2,0,0,2.019608,58.000084,-2078.9277)"
       gradientUnits="userSpaceOnUse">
      <stop
         stop-color="#fdbd17"
         offset="0"
         id="stop3" />
      <stop
         stop-color="#e3a726"
         offset="1"
         id="stop4" />
    </linearGradient>
  </defs>
  <path
     d="M 1.8600089e-4,16.137256 0,4.020012 c -4.5999114e-5,-1.11543 0.89543,-2.01981 2.000084,-2.01981 l 8,-2.02e-4 c 1.104598,0 2.000078,0.904179 2.000132,2.019608 L 12.000282,5.02921 30,5.029412 c 1.104564,1.4e-5 1.999986,0.904215 2,2.019608 v 9.088236 z"
     fill="url(#b)"
     id="path4"
     style="fill:url(#b)" />
  <path
     d="M 30.443544,10.249999 H 1.556454 c -0.72156339,0 -1.3064956,0.628537 -1.3064549,1.403847 v 14.692308 c -4.065e-5,0.775309 0.58489151,1.403847 1.3064549,1.403847 h 28.88709 c 0.721565,0 1.306497,-0.628536 1.306456,-1.403847 V 11.653846 c 4.1e-5,-0.775312 -0.584891,-1.403849 -1.306456,-1.403847 z"
     fill="url(#a)"
     stroke="#edb020"
     stroke-width="0.499999"
     id="path5"
     style="fill:url(#a)" />
</svg>
