<?xml version="1.0" encoding="UTF-8" standalone="no"?>
<svg
   width="24"
   height="24"
   version="1.1"
   viewBox="0 0 24 24"
   id="svg30"
   sodipodi:docname="tlistviewfilteredit.svg"
   inkscape:version="1.3.2 (091e20e, 2023-11-25, custom)"
   xmlns:inkscape="http://www.inkscape.org/namespaces/inkscape"
   xmlns:sodipodi="http://sodipodi.sourceforge.net/DTD/sodipodi-0.dtd"
   xmlns="http://www.w3.org/2000/svg"
   xmlns:svg="http://www.w3.org/2000/svg">
  <sodipodi:namedview
     id="namedview30"
     pagecolor="#ffffff"
     bordercolor="#000000"
     borderopacity="0.25"
     inkscape:showpageshadow="2"
     inkscape:pageopacity="0.0"
     inkscape:pagecheckerboard="0"
     inkscape:deskcolor="#d1d1d1"
     showgrid="true"
     inkscape:current-layer="svg30">
    <inkscape:grid
       id="grid30"
       units="px"
       originx="0"
       originy="0"
       spacingx="0.5"
       spacingy="0.5"
       empcolor="#0099e5"
       empopacity="0.30196078"
       color="#0099e5"
       opacity="0.14901961"
       empspacing="2"
       dotted="false"
       gridanglex="30"
       gridanglez="30"
       visible="true" />
  </sodipodi:namedview>
  <defs
     id="defs19">
    <linearGradient
       id="g"
       x1="-18"
       x2="-16"
       y1="1033.3622"
       y2="1035.3622"
       gradientTransform="matrix(1.5,0,0,1.4999913,31,-1547.0342)"
       gradientUnits="userSpaceOnUse">
      <stop
         stop-color="#2a7fff"
         offset="0"
         id="stop1" />
      <stop
         stop-color="#0055d4"
         offset="1"
         id="stop2" />
    </linearGradient>
    <linearGradient
       id="a"
       x1="16"
       x2="19"
       y1="1031.3622"
       y2="1034.3622"
       gradientUnits="userSpaceOnUse"
       gradientTransform="translate(0,-1028.3622)">
      <stop
         stop-color="#00d400"
         offset="0"
         id="stop3" />
      <stop
         stop-color="#008000"
         offset="1"
         id="stop4" />
    </linearGradient>
    <linearGradient
       id="b"
       x1="10"
       x2="13"
       y1="1031.3622"
       y2="1034.3622"
       gradientUnits="userSpaceOnUse"
       gradientTransform="translate(0,-1028.3622)">
      <stop
         stop-color="#d40000"
         offset="0"
         id="stop5" />
      <stop
         stop-color="#aa0000"
         offset="1"
         id="stop6" />
    </linearGradient>
    <linearGradient
       id="c"
       x1="-18"
       x2="-16"
       y1="1033.3622"
       y2="1035.3622"
       gradientTransform="matrix(1.5,0,0,1.4999913,31,-1535.0342)"
       gradientUnits="userSpaceOnUse">
      <stop
         stop-color="#00d4aa"
         offset="0"
         id="stop7" />
      <stop
         stop-color="#008066"
         offset="1"
         id="stop8" />
    </linearGradient>
    <linearGradient
       id="f"
       x1="-18"
       x2="-16"
       y1="1033.3622"
       y2="1035.3622"
       gradientTransform="matrix(1.5,0,0,1.4999913,31,-1541.0342)"
       gradientUnits="userSpaceOnUse">
      <stop
         stop-color="#ffcc00"
         offset="0"
         id="stop9" />
      <stop
         stop-color="#aa8800"
         offset="1"
         id="stop10" />
    </linearGradient>
    <linearGradient
       id="e"
       x1="11"
       x2="21"
       y1="1032.3622"
       y2="1030.3622"
       gradientTransform="matrix(1.0357143,0,0,1.0384615,-0.5535714,-1058.1838)"
       gradientUnits="userSpaceOnUse">
      <stop
         stop-color="#ffcc00"
         offset="0"
         id="stop11" />
      <stop
         stop-color="#fff6d5"
         offset=".33333102"
         id="stop12" />
      <stop
         stop-color="#ffcc00"
         offset="1"
         id="stop13" />
    </linearGradient>
    <linearGradient
       id="h"
       x1="13.775862"
       x2="17.224138"
       y1="1039.2141"
       y2="1039.2141"
       gradientTransform="matrix(1.0357143,0,0,1.0384615,-0.5535714,-1058.1838)"
       gradientUnits="userSpaceOnUse">
      <stop
         stop-color="#ffcc00"
         offset="0"
         id="stop14" />
      <stop
         stop-color="#fff6d5"
         offset=".38293254"
         id="stop15" />
      <stop
         stop-color="#ffcc00"
         offset="1"
         id="stop16" />
    </linearGradient>
    <linearGradient
       id="d"
       x1="12.8125"
       x2="19"
       y1="1039.6122"
       y2="1039.6122"
       gradientTransform="translate(-1,-1027.3622)"
       gradientUnits="userSpaceOnUse">
      <stop
         stop-color="#c88e2c"
         offset="0"
         id="stop17" />
      <stop
         stop-color="#e6c790"
         offset=".41"
         id="stop18" />
      <stop
         stop-color="#c88e2c"
         offset="1"
         id="stop19" />
    </linearGradient>
  </defs>
  <rect
     x="1.25"
     y="1.2499826"
     width="21.5"
     height="21.500017"
     fill="#ffffff"
     stroke="#2a7efe"
     stroke-linecap="round"
     stroke-linejoin="round"
     stroke-width="0.5"
     style="paint-order:normal"
     id="rect19" />
  <path
     d="m 9.25,12.3269 4.178572,5.9231 h 4.142856 L 21.75,12.3269 V 10.25 H 9.25 Z"
     fill="url(#e)"
     fill-rule="evenodd"
     stroke="#c88e2c"
     stroke-linecap="round"
     stroke-linejoin="round"
     stroke-width="0.5"
     id="path19"
     style="fill:url(#e)" />
  <rect
     x="4"
     y="2.9999826"
     width="3"
     height="2.9999826"
     fill="url(#g)"
     style="fill:url(#g);paint-order:normal"
     id="rect20" />
  <rect
     x="16"
     y="2.9999826"
     width="3"
     height="2.9999826"
     fill="url(#a)"
     style="fill:url(#a);paint-order:normal"
     id="rect21" />
  <rect
     x="10"
     y="2.9999826"
     width="3"
     height="2.9999826"
     fill="url(#b)"
     style="fill:url(#b);paint-order:normal"
     id="rect22" />
  <rect
     x="4"
     y="14.999983"
     width="3"
     height="2.9999826"
     fill="url(#c)"
     style="fill:url(#c);paint-order:normal"
     id="rect23" />
  <rect
     x="4"
     y="8.9999828"
     width="3"
     height="2.9999826"
     fill="url(#f)"
     style="fill:url(#f);paint-order:normal"
     id="rect24" />
  <path
     d="M 3,7.5 H 8"
     fill="none"
     stroke="#b3b3b3"
     stroke-linejoin="round"
     id="path24" />
  <path
     d="M 3,19.5 H 8"
     fill="none"
     stroke="#b3b3b3"
     stroke-linejoin="round"
     id="path25" />
  <path
     d="M 3,13.5 H 8"
     fill="none"
     stroke="#b3b3b3"
     stroke-linejoin="round"
     id="path26" />
  <path
     d="m 15,7.5 h 5"
     fill="none"
     stroke="#b3b3b3"
     stroke-linejoin="round"
     id="path27" />
  <path
     d="m 9,7.5 h 5"
     fill="none"
     stroke="#b3b3b3"
     stroke-linejoin="round"
     id="path28" />
  <path
     d="M 17.571428,18.25 17,23.75 h -3 l -0.571428,-5.5 z"
     fill="url(#h)"
     fill-rule="evenodd"
     stroke="#c88e2c"
     stroke-linecap="round"
     stroke-linejoin="round"
     stroke-width="0.5"
     id="path29"
     style="fill:url(#h)" />
  <path
     d="m 9.5,12.25 h 12"
     fill="none"
     stroke="url(#d)"
     stroke-linecap="round"
     stroke-linejoin="round"
     stroke-width="0.5"
     id="path30"
     style="stroke:url(#d)" />
</svg>
