<?xml version="1.0" encoding="UTF-8" standalone="no"?>
<svg
   width="24"
   height="24"
   version="1.1"
   viewBox="0 0 24 24"
   id="svg15"
   sodipodi:docname="menu_reset_debugger_150.svg"
   inkscape:version="1.3.2 (091e20e, 2023-11-25, custom)"
   inkscape:export-filename="menu_reset_debugger_150.png"
   inkscape:export-xdpi="96"
   inkscape:export-ydpi="96"
   xmlns:inkscape="http://www.inkscape.org/namespaces/inkscape"
   xmlns:sodipodi="http://sodipodi.sourceforge.net/DTD/sodipodi-0.dtd"
   xmlns="http://www.w3.org/2000/svg"
   xmlns:svg="http://www.w3.org/2000/svg">
  <sodipodi:namedview
     id="namedview15"
     pagecolor="#ffffff"
     bordercolor="#000000"
     borderopacity="0.25"
     inkscape:showpageshadow="2"
     inkscape:pageopacity="0.0"
     inkscape:pagecheckerboard="0"
     inkscape:deskcolor="#d1d1d1"
     showgrid="true"
     inkscape:current-layer="svg15">
    <inkscape:grid
       id="grid15"
       units="px"
       originx="0"
       originy="0"
       spacingx="0.5"
       spacingy="0.5"
       empcolor="#0099e5"
       empopacity="0.30196078"
       color="#0099e5"
       opacity="0.14901961"
       empspacing="2"
       dotted="false"
       gridanglex="30"
       gridanglez="30"
       visible="true" />
  </sodipodi:namedview>
  <defs
     id="defs6">
    <linearGradient
       id="a"
       x1="22.825163"
       x2="22.822721"
       y1="6.2446866"
       y2="15.028725"
       gradientTransform="matrix(1.3656766 .00037929207 .00037934511 1.3661144 -17.049158 -.2896131)"
       gradientUnits="userSpaceOnUse">
      <stop
         stop-color="#89a02c"
         offset="0"
         id="stop1" />
      <stop
         stop-color="#445016"
         offset="1"
         id="stop2" />
    </linearGradient>
    <radialGradient
       id="c"
       cx="-9"
       cy="10.699678"
       r="5.9492188"
       gradientTransform="matrix(.75 0 0 .53578463 19.75 1.7672769)"
       gradientUnits="userSpaceOnUse">
      <stop
         stop-color="#803300"
         offset="0"
         id="stop3" />
      <stop
         stop-color="#d45500"
         offset="1"
         id="stop4" />
    </radialGradient>
    <linearGradient
       id="b"
       x1="-3"
       x2="-3"
       y1="28"
       y2="4"
       gradientTransform="matrix(.75 0 0 .75 15.25 0)"
       gradientUnits="userSpaceOnUse">
      <stop
         stop-color="#668000"
         offset="0"
         id="stop5" />
      <stop
         stop-color="#aad400"
         offset="1"
         id="stop6" />
    </linearGradient>
  </defs>
  <path
     d="m14.5 4.875 1.875-3.75"
     fill="none"
     stroke="#d4aa00"
     stroke-linecap="round"
     stroke-linejoin="round"
     stroke-width="1.5"
     id="path6" />
  <path
     d="m11.5 4.875-1.875-3.75"
     fill="none"
     stroke="#d4aa00"
     stroke-linecap="round"
     stroke-linejoin="round"
     stroke-width="1.5"
     id="path7" />
  <path
     d="m5.5 5.25v2.25l2.25 2.25"
     fill="none"
     stroke="#aca793"
     stroke-linecap="round"
     stroke-linejoin="round"
     stroke-width="1.5"
     id="path8" />
  <path
     d="m20.5 5.25v2.25l-2.25 2.25"
     fill="none"
     stroke="#aca793"
     stroke-linecap="round"
     stroke-linejoin="round"
     stroke-width="1.5"
     id="path11" />
  <path
     d="m20.5 20.25v-2.25l-2.25-2.25"
     fill="none"
     stroke="#aca793"
     stroke-linecap="round"
     stroke-linejoin="round"
     stroke-width="1.5"
     id="path12" />
  <path
     d="m23.125 14.25-1.875-1.5-3.75-0.75"
     fill="none"
     stroke="#aca793"
     stroke-linecap="round"
     stroke-linejoin="round"
     stroke-width="1.5"
     id="path13" />
  <path
     d="m 13,3 a 6.75,9 0 0 0 -6.5605469,7.001953 c 0.022793,0.02081 0.046329,0.0405 0.068359,0.0625 0.6705491,0.669763 0.6493632,1.658776 0.2109375,2.457031 1.9870341,0.470603 3.689202,1.821188 4.492188,3.759766 0.595018,1.436501 0.632371,3.005699 0.177734,4.429687 A 6.75,9 0 0 0 13,21 6.75,9 0 0 0 19.75,12 6.75,9 0 0 0 13,3 Z"
     style="fill:url(#b);stroke-width:0.75"
     id="path4" />
  <path
     d="M 17.461915,5.25 A 6.75,9 0 0 0 13,3 6.75,9 0 0 0 8.538087,5.2529296 L 13,9.375 17.458985,5.25 Z"
     fill="url(#c)"
     stroke-linecap="round"
     stroke-linejoin="round"
     stroke-width="1.80001"
     id="path14" />
  <path
     d="m13 9v11.25"
     fill="#c83737"
     stroke="url(#a)"
     stroke-linecap="round"
     stroke-linejoin="round"
     stroke-width="1.5"
     id="path15" />
  <path
     style="color:#000000;fill:#fa0302;stroke-linecap:round;stroke-linejoin:round;-inkscape-stroke:none"
     d="m 4.3892171,10.913111 -2.999972,2.999972 c -0.352089,0.352089 -0.352089,0.922315 0,1.274402 l 2.999972,2.999972 c 0.350957,0.350957 0.92011,0.350554 1.271472,0 0.352507,-0.351698 0.352102,-0.9223 0,-1.274402 l -1.614243,-1.614243 h 1.203505 c 1.397964,0 2.652492,0.838311 3.18747,2.129863 0.534977,1.29155 0.241446,2.773174 -0.747064,3.761683 -0.988509,0.988509 -2.467204,1.282041 -3.758753,0.747063 -1.291551,-0.534977 -2.129626,-1.789507 -2.129863,-3.18747 -8.6e-5,-0.497739 -0.404597,-0.900215 -0.90233606,-0.899405 C 0.40281224,17.851355 6.1540333e-5,18.253357 4.0332928e-8,18.749951 -2.6245967e-4,20.870769 1.2808231,22.789866 3.2402031,23.601468 5.1995841,24.41307 7.4621851,23.961475 8.9618291,22.46183 10.461475,20.962186 10.913069,18.699585 10.101467,16.740204 9.2898661,14.780825 7.3707691,13.500001 5.2499511,13.500001 h -0.904679 l 1.315417,-1.312488 c 0.352495,-0.351709 0.352309,-0.922506 0,-1.274402 -0.350808,-0.350398 -0.920845,-0.350628 -1.271472,0 z"
     id="path1" />
</svg>
