<?xml version="1.0" encoding="UTF-8" standalone="no"?>
<svg
   width="36"
   height="36"
   version="1.1"
   viewBox="0 0 36 36"
   id="svg6"
   sodipodi:docname="tibconnection_150.svg"
   inkscape:version="1.3.2 (091e20e, 2023-11-25, custom)"
   inkscape:export-filename="tibconnection_150.png"
   inkscape:export-xdpi="96"
   inkscape:export-ydpi="96"
   xmlns:inkscape="http://www.inkscape.org/namespaces/inkscape"
   xmlns:sodipodi="http://sodipodi.sourceforge.net/DTD/sodipodi-0.dtd"
   xmlns="http://www.w3.org/2000/svg"
   xmlns:svg="http://www.w3.org/2000/svg">
  <defs
     id="defs6" />
  <sodipodi:namedview
     id="namedview6"
     pagecolor="#ffffff"
     bordercolor="#000000"
     borderopacity="0.25"
     inkscape:showpageshadow="2"
     inkscape:pageopacity="0.0"
     inkscape:pagecheckerboard="0"
     inkscape:deskcolor="#d1d1d1"
     showgrid="true"
     inkscape:current-layer="svg6">
    <inkscape:grid
       id="grid6"
       units="px"
       originx="0"
       originy="0"
       spacingx="0.5"
       spacingy="0.5"
       empcolor="#0099e5"
       empopacity="0.30196078"
       color="#0099e5"
       opacity="0.14901961"
       empspacing="2"
       dotted="false"
       gridanglex="30"
       gridanglez="30"
       visible="true" />
  </sodipodi:namedview>
  <linearGradient
     id="a"
     x1="16.499994"
     x2="16.499994"
     y1="1050.5722"
     y2="1024.3222"
     gradientUnits="userSpaceOnUse"
     gradientTransform="translate(0,-1016.3622)">
    <stop
       stop-color="#f00"
       offset="0"
       id="stop1" />
    <stop
       stop-color="#d4aa00"
       offset="1"
       id="stop2" />
  </linearGradient>
  <path
     d="m 18.749994,5.11 c 6.6132,2.0206 12.915,5.7795 10.5996,14.7071 -0.98946,3.8151 -4.3314,5.7596 -7.66695,5.7596 -1.87485,0 -2.58585,-1.7626 -1.46778,-3.1141 1.103505,-1.334 1.74285,-2.3091 2.0478,-3.1788 0.774315,-2.2083 0.2922,-2.9024 -0.0498,-3.3603 -0.76737,-1.0275 -1.91325,-1.5816 -3.0147,-2.171 0.500685,-0.4573 1.45776,-0.3233 2.49315,-0.2167 0.888,0.091 1.055715,-0.6995 0.720705,-1.4649 0.1164,0.7363 -0.427395,0.9342 -1.341795,0.8233 -1.8048,-0.2188 -5.02635,-1.5135 -5.2383,-1.5703 -1.258725,-0.338 -1.9668,0.2281 -1.5762,1.6875 l -0.99609,0.033 c -0.565395,0.019 -0.74763,0.117 -1.171875,0.375 -0.16521,0.1005 -0.493965,0.337 -0.79395,0.6621 -0.3678,0.3985 -0.568575,0.9561 -0.20508,1.4443 0.39543,0.5312 0.996495,0.8202 1.5,1.0664 0.561735,-1.4784 2.7051,-0.995 3.1875,-0.5654 2.0199,1.7988 -0.331515,2.6234 -1.99515,3.2724 -2.31165,0.9018 -3.9675,3.4314 -3.8847,6.1817 0.0908,3.0169 0.49824,3.5022 1.145505,4.9746 0.83949,1.9096 4.19505,4.5045 6.95805,4.5045 8.25,0 14.9997,-6.7145 15,-14.9987 3.03e-4,-7.9932 -6.26685,-14.6017 -14.25,-15.0015 z m -1.5,-0.15 c -7.96965,0.399 -14.24805,7.0205 -14.25,15 -0.00139,5.5998 3.1473,10.725 8.124,13.292 -1.21023,-1.5306 -2.5653,-3.8367 -2.83305,-6.1992 -8.73930004,-11.5388 1.8012,-20.439 8.95905,-21.9435 z m -1.136715,7.4942 c 0.69867,0.169 1.025385,0.5536 1.025385,0.5536 h -1.58205 c 0,0 -0.03703,-0.2599 -0.02929,-0.3633 0.02598,-0.3468 0.478695,-0.2163 0.58596,-0.1903 z"
     fill="url(#a)"
     stroke-linecap="round"
     stroke-width="1.2"
     id="path2"
     style="fill:url(#a)" />
  <path
     d="m 36,2.5 h -4.5 v 2 h -4 V 2"
     fill="none"
     stroke="#ff0000"
     stroke-linejoin="round"
     id="path2-7" />
  <path
     d="m 21,2.5 h 4.5 v -2 h 4 V 3"
     fill="none"
     stroke="#2a7efe"
     stroke-linejoin="round"
     id="path3" />
</svg>
