<?xml version="1.0" encoding="UTF-8" standalone="no"?>
<svg
   width="24"
   height="24"
   version="1.1"
   viewBox="0 0 24 24"
   id="svg14"
   sodipodi:docname="textjsjsondataset.svg"
   inkscape:export-filename="textjsjsondataset.png"
   inkscape:export-xdpi="96"
   inkscape:export-ydpi="96"
   inkscape:version="1.3.2 (091e20e, 2023-11-25, custom)"
   xmlns:inkscape="http://www.inkscape.org/namespaces/inkscape"
   xmlns:sodipodi="http://sodipodi.sourceforge.net/DTD/sodipodi-0.dtd"
   xmlns="http://www.w3.org/2000/svg"
   xmlns:svg="http://www.w3.org/2000/svg">
  <sodipodi:namedview
     id="namedview14"
     pagecolor="#ffffff"
     bordercolor="#000000"
     borderopacity="0.25"
     inkscape:showpageshadow="2"
     inkscape:pageopacity="0.0"
     inkscape:pagecheckerboard="0"
     inkscape:deskcolor="#d1d1d1"
     showgrid="true"
     inkscape:current-layer="svg14">
    <inkscape:grid
       id="grid14"
       units="px"
       originx="0"
       originy="0"
       spacingx="0.5"
       spacingy="0.5"
       empcolor="#0099e5"
       empopacity="0.30196078"
       color="#0099e5"
       opacity="0.14901961"
       empspacing="2"
       dotted="false"
       gridanglex="30"
       gridanglez="30"
       visible="true" />
  </sodipodi:namedview>
  <defs
     id="defs3">
    <linearGradient
       id="a"
       x1="3"
       x2="15"
       y1="2"
       y2="2"
       gradientUnits="userSpaceOnUse">
      <stop
         stop-color="#4276c4"
         offset="0"
         id="stop1" />
      <stop
         stop-color="#80b3ff"
         offset=".3333333"
         id="stop2" />
      <stop
         stop-color="#04a"
         offset="1"
         id="stop3" />
    </linearGradient>
  </defs>
  <ellipse
     cx="9"
     cy="12.5"
     rx="5.1"
     ry="1.6"
     fill="none"
     stroke="url(#a)"
     stroke-linecap="round"
     stroke-linejoin="round"
     stroke-width="1.8"
     id="ellipse3" />
  <ellipse
     cx="9"
     cy="11.2"
     rx="4.9"
     ry="1.4"
     fill="none"
     stroke="#ffffff"
     stroke-linecap="round"
     stroke-linejoin="round"
     stroke-width="1.2"
     id="ellipse4" />
  <ellipse
     cx="9"
     cy="9.5"
     rx="5.1"
     ry="1.6"
     fill="none"
     stroke="url(#a)"
     stroke-linecap="round"
     stroke-linejoin="round"
     stroke-width="1.8"
     id="ellipse5" />
  <ellipse
     cx="9"
     cy="8.2"
     rx="4.9"
     ry="1.4"
     fill="none"
     stroke="#ffffff"
     stroke-linecap="round"
     stroke-linejoin="round"
     stroke-width="1.2"
     id="ellipse6" />
  <ellipse
     cx="9"
     cy="6.5"
     rx="5.1"
     ry="1.6"
     fill="none"
     stroke="url(#a)"
     stroke-linecap="round"
     stroke-linejoin="round"
     stroke-width="1.8"
     id="ellipse7" />
  <ellipse
     cx="9"
     cy="5.2"
     rx="4.9"
     ry="1.4"
     fill="none"
     stroke="#ffffff"
     stroke-linecap="round"
     stroke-linejoin="round"
     stroke-width="1.2"
     id="ellipse8" />
  <ellipse
     cx="9"
     cy="3.5"
     rx="5.4"
     ry="1.9"
     fill="#80b3ff"
     fill-rule="evenodd"
     stroke="url(#a)"
     stroke-linecap="round"
     stroke-linejoin="round"
     stroke-width="1.2"
     id="ellipse9" />
  <path
     d="m16.25 5.25v5.5l5.5-2.75z"
     fill="#00d455"
     fill-rule="evenodd"
     stroke="#00b100"
     stroke-linejoin="round"
     stroke-width=".5"
     id="path9" />
  <rect
     x="1"
     y="14"
     width="22"
     height="9"
     ry="1.5"
     fill="#d45500"
     fill-rule="evenodd"
     id="rect9" />
  <path
     d="m13.015455 16.4c0.775852 0 1.400454 0.575494 1.400454 1.290344v1.619256c0 0.714851-0.624602 1.290345-1.400454 1.290345-0.775854 0-1.400455-0.575494-1.400455-1.290345v-1.619256c0-0.71485 0.624601-1.290344 1.400455-1.290344z"
     fill="none"
     stroke="#ffffff"
     stroke-linecap="round"
     stroke-linejoin="round"
     stroke-width=".8"
     id="path10" />
  <path
     d="m5.407539 16.4v2.814406c0 1.683053-1.525127 1.513251-1.907539 1.130863"
     fill="none"
     stroke="#ffffff"
     stroke-linecap="round"
     stroke-linejoin="round"
     stroke-width=".8"
     id="path11" />
  <path
     d="M 16.414,20.599945 V 16.4 l 3.006171,4.199945 V 16.4"
     fill="none"
     stroke="#ffffff"
     stroke-linecap="round"
     stroke-linejoin="round"
     stroke-width=".8"
     id="path12" />
  <path
     d="m9.817222 16.674104c-0.269083-0.184764-0.668634-0.274104-1.145965-0.274104-0.674552 0-1.288359 0.353341-1.288359 1.087938 0 0.575458 0.487318 0.812081 1.288359 0.950536 1.115397 0.19279 1.288359 0.567516 1.288359 1.073533 1e-6 0.914342-0.763884 1.087938-1.288359 1.087938-0.407156 0-0.825073-0.04936-1.349257-0.319804"
     fill="none"
     stroke="#ffffff"
     stroke-linecap="round"
     stroke-linejoin="round"
     stroke-width=".8"
     id="path13" />
  <path
     d="M 21.490447,5.5999441 V 1.4 M 20,1.4 h 2.980917"
     fill="none"
     stroke="#ff6600"
     stroke-linecap="round"
     stroke-linejoin="round"
     stroke-width=".8"
     id="path14" />
</svg>
