<?xml version="1.0" encoding="UTF-8" standalone="no"?>
<svg
   width="48"
   height="48"
   version="1.1"
   viewBox="0 0 48 48"
   id="svg14"
   sodipodi:docname="tlazcomponentqueue_200.svg"
   inkscape:export-filename="tlazcomponentqueue_200.png"
   inkscape:export-xdpi="96"
   inkscape:export-ydpi="96"
   inkscape:version="1.3.2 (091e20e, 2023-11-25, custom)"
   xmlns:inkscape="http://www.inkscape.org/namespaces/inkscape"
   xmlns:sodipodi="http://sodipodi.sourceforge.net/DTD/sodipodi-0.dtd"
   xmlns:xlink="http://www.w3.org/1999/xlink"
   xmlns="http://www.w3.org/2000/svg"
   xmlns:svg="http://www.w3.org/2000/svg">
  <sodipodi:namedview
     id="namedview14"
     pagecolor="#ffffff"
     bordercolor="#000000"
     borderopacity="0.25"
     inkscape:showpageshadow="2"
     inkscape:pageopacity="0.0"
     inkscape:pagecheckerboard="0"
     inkscape:deskcolor="#d1d1d1"
     showgrid="true"
     inkscape:current-layer="svg14">
    <inkscape:grid
       id="grid14"
       units="px"
       originx="0"
       originy="0"
       spacingx="0.5"
       spacingy="0.5"
       empcolor="#0099e5"
       empopacity="0.30196078"
       color="#0099e5"
       opacity="0.14901961"
       empspacing="2"
       dotted="false"
       gridanglex="30"
       gridanglez="30"
       visible="true" />
  </sodipodi:namedview>
  <defs
     id="defs6">
    <radialGradient
       id="i"
       cx="5.3999925"
       cy="1034.7039"
       r="4"
       gradientTransform="matrix(2.6785582,-2.6785884,1.6071659,1.6071479,-1635.262,-621.95238)"
       gradientUnits="userSpaceOnUse"
       xlink:href="#b" />
    <linearGradient
       id="b">
      <stop
         stop-color="#1a75ff"
         offset="0"
         id="stop1" />
      <stop
         stop-color="#ffffff"
         offset="1"
         id="stop2" />
    </linearGradient>
    <radialGradient
       id="h"
       cx="5.3999925"
       cy="1034.7039"
       r="4"
       gradientTransform="matrix(2.6785582,-2.6785884,1.6071659,1.6071479,-1637.262,-631.95244)"
       gradientUnits="userSpaceOnUse"
       xlink:href="#c" />
    <linearGradient
       id="c">
      <stop
         stop-color="#ff1919"
         offset="0"
         id="stop3" />
      <stop
         stop-color="#ffffff"
         offset="1"
         id="stop4" />
    </linearGradient>
    <radialGradient
       id="g"
       cx="5.3999925"
       cy="1034.7039"
       r="4"
       gradientTransform="matrix(2.6785582,-2.6785884,1.6071659,1.6071479,-1643.262,-625.9524)"
       gradientUnits="userSpaceOnUse"
       xlink:href="#a" />
    <linearGradient
       id="a">
      <stop
         stop-color="#198d19"
         offset="0"
         id="stop5" />
      <stop
         stop-color="#ffffff"
         offset="1"
         id="stop6" />
    </linearGradient>
    <radialGradient
       id="f"
       cx="5.3999925"
       cy="1034.7039"
       r="4"
       gradientTransform="matrix(2.6785582,-2.6785884,1.6071659,1.6071479,-1659.262,-621.95238)"
       gradientUnits="userSpaceOnUse"
       xlink:href="#b" />
    <radialGradient
       id="e"
       cx="5.3999925"
       cy="1034.7039"
       r="4"
       gradientTransform="matrix(2.6785582,-2.6785884,1.6071659,1.6071479,-1661.262,-631.95244)"
       gradientUnits="userSpaceOnUse"
       xlink:href="#c" />
    <radialGradient
       id="d"
       cx="5.3999925"
       cy="1034.7039"
       r="4"
       gradientTransform="matrix(2.6785582,-2.6785884,1.6071659,1.6071479,-1667.262,-625.9524)"
       gradientUnits="userSpaceOnUse"
       xlink:href="#a" />
  </defs>
  <g
     transform="translate(0,-1004.3622)"
     id="g14">
    <path
       d="m12 1036.3622-6 6 6 6"
       fill="none"
       stroke="#2a7efe"
       stroke-linecap="round"
       stroke-width="3"
       id="path6" />
    <path
       d="m22 1036.3622-6 6 6 6"
       fill="none"
       stroke="#2a7efe"
       stroke-linecap="round"
       stroke-width="3"
       id="path7" />
    <path
       d="m32 1036.3622-6 6 6 6"
       fill="none"
       stroke="#2a7efe"
       stroke-linecap="round"
       stroke-width="3"
       id="path8" />
    <path
       d="m42 1036.3622-6 6 6 6"
       fill="none"
       stroke="#2a7efe"
       stroke-linecap="round"
       stroke-width="3"
       id="path9" />
    <circle
       cx="8"
       cy="1020.3622"
       r="7.5"
       fill="url(#d)"
       fill-rule="evenodd"
       stroke="#198d19"
       stroke-linecap="square"
       stroke-linejoin="round"
       style="paint-order:normal"
       id="circle9" />
    <circle
       cx="14"
       cy="1014.3622"
       r="7.5"
       fill="url(#e)"
       fill-rule="evenodd"
       stroke="#ff1a1a"
       stroke-linecap="square"
       stroke-linejoin="round"
       stroke-opacity=".92549"
       style="paint-order:normal"
       id="circle10" />
    <circle
       cx="16"
       cy="1024.3622"
       r="7.5"
       fill="url(#f)"
       fill-rule="evenodd"
       stroke="#1a75ff"
       stroke-linecap="square"
       stroke-linejoin="round"
       style="paint-order:normal"
       id="circle11" />
    <circle
       cx="32"
       cy="1020.3622"
       r="7.5"
       fill="url(#g)"
       fill-rule="evenodd"
       stroke="#198d19"
       stroke-linecap="square"
       stroke-linejoin="round"
       style="paint-order:normal"
       id="circle12" />
    <circle
       cx="38"
       cy="1014.3622"
       r="7.5"
       fill="url(#h)"
       fill-rule="evenodd"
       stroke="#ff1a1a"
       stroke-linecap="square"
       stroke-linejoin="round"
       stroke-opacity=".92549"
       style="paint-order:normal"
       id="circle13" />
    <circle
       cx="40"
       cy="1024.3622"
       r="7.5"
       fill="url(#i)"
       fill-rule="evenodd"
       stroke="#1a75ff"
       stroke-linecap="square"
       stroke-linejoin="round"
       style="paint-order:normal"
       id="circle14" />
  </g>
</svg>
