<?xml version="1.0" encoding="UTF-8" standalone="no"?>
<svg
   height="16"
   width="16"
   version="1.1"
   id="svg4602"
   sodipodi:docname="bookmark3_150.svg"
   inkscape:export-filename="bookmark3_150.png"
   inkscape:export-xdpi="96"
   inkscape:export-ydpi="96"
   inkscape:version="1.2.2 (732a01da63, 2022-12-09)"
   xmlns:inkscape="http://www.inkscape.org/namespaces/inkscape"
   xmlns:sodipodi="http://sodipodi.sourceforge.net/DTD/sodipodi-0.dtd"
   xmlns="http://www.w3.org/2000/svg"
   xmlns:svg="http://www.w3.org/2000/svg">
  <defs
     id="defs4606" />
  <sodipodi:namedview
     id="namedview4604"
     pagecolor="#ffffff"
     bordercolor="#666666"
     borderopacity="1.0"
     inkscape:showpageshadow="2"
     inkscape:pageopacity="0.0"
     inkscape:pagecheckerboard="0"
     inkscape:deskcolor="#d1d1d1"
     showgrid="true"
     inkscape:zoom="57.375"
     inkscape:cx="6.6405229"
     inkscape:cy="8"
     inkscape:current-layer="svg4602">
    <inkscape:grid
       type="xygrid"
       id="grid5017" />
  </sodipodi:namedview>
  <radialGradient
     id="a"
     cx="8"
     cy="8.000001"
     gradientUnits="userSpaceOnUse"
     r="8">
    <stop
       offset="0"
       stop-color="#4881cc"
       id="stop4591" />
    <stop
       offset=".81818181"
       stop-color="#4781cc"
       id="stop4593" />
    <stop
       offset="1"
       stop-color="#569af2"
       id="stop4595" />
  </radialGradient>
  <circle
     cx="8"
     cy="8"
     fill="url(#a)"
     r="8"
     id="circle4598" />
  <path
     d="M 7.8651315,12.99905 C 6.8257444,13.023101 5.7226821,12.590527 5.2052179,11.687187 4.9811203,11.311305 4.8559442,10.887721 4.8,10.459933 h 1.4622653 c 0.055321,0.595543 0.5486124,1.124892 1.1810589,1.187049 0.6450708,0.111561 1.4556624,-0.02438 1.7654407,-0.646145 C 9.425449,10.555857 9.369221,10.042814 9.3261609,9.569268 9.2536767,8.9815317 8.7292181,8.4786588 8.1010776,8.4659286 7.8047619,8.4535212 7.5078948,8.4622099 7.2113285,8.4595684 V 7.1529887 C 7.7566686,7.1322747 8.390207,7.2565897 8.8210621,6.8510925 9.2596336,6.4386973 9.212752,5.8036074 9.1718669,5.2633822 9.111066,4.7172623 8.568149,4.3304685 8.0134349,4.3292383 7.3776144,4.2496562 6.7171726,4.6146709 6.5241174,5.2109261 6.4838843,5.4505141 6.4914622,5.5433356 6.4914622,5.5433356 H 4.9688402 C 5.120154,4.5589308 5.707482,3.566756 6.7176114,3.1998516 7.573191,2.8997801 8.571715,2.9360262 9.3930661,3.3193742 10.19773,3.6999912 10.622066,4.5669638 10.625262,5.4006652 10.673362,6.0653371 10.511314,6.7762314 9.984396,7.2456234 9.7913262,7.5035059 9.1969422,7.6959878 9.0911963,7.7974851 9.937111,7.9598196 10.588937,8.6677138 10.731563,9.4717724 c 0.145653,0.8945626 0.09697,1.9062566 -0.52542,2.6385906 -0.5613245,0.66068 -1.4842931,0.896114 -2.3408916,0.888687 z"
     fill="#ffffff"
     id="path11"
     style="fill:#ffffff;stroke-width:0.999999" />
</svg>
