<svg width="16" height="16" version="1.1" xmlns="http://www.w3.org/2000/svg">
 <g fill-rule="evenodd" stroke-width=".802638">
  <path d="m15.624781 5.4032217c-0.486992-0.5112861-1.361987-0.5381981-1.88724-0.070113a0.78976505 0.81490251 0.32849278 0 0-0.01308-1.356e-4l-4.9363081 4.4494767a0.78976505 0.81490251 0.32849278 0 0-0.033033 0.03117l-0.282073 0.2851872a0.78976505 0.81490251 0.32849278 0 0-0.1149109 0.147364l-0.8172345 1.336402-0.1608698 0.162644c-0.2885893-0.0056-0.5660703-0.0769-0.8619885 0.03612-0.396521 0.151506-0.6760667 0.451571-0.8644944 0.720327-0.1884303 0.268755-0.3236497 0.530256-0.4967227 0.807402-0.1194541 0.191238-0.1930773 0.226905-0.418404 0.284907-0.225327 0.058-0.5848457 0.07324-1.0220231 0.115498a0.78976505 0.81490251 0.32849278 0 0-0.1784082 1.583827c1.0286579 0.35481 1.9251584 0.60563 2.7437995 0.683281 0.8186411 0.07766 1.6032924-0.0265 2.2428973-0.483283 0.6041863-0.43146 0.8144779-1.100791 0.8268348-1.749316l0.1201017-0.12143 1.3211819-0.798896a0.78976505 0.81490251 0.32849278 0 0 0.152818-0.12109l0.282072-0.285188a0.78976505 0.81490251 0.32849278 0 0 0.03305-0.0357l4.352582-4.9686446c3.43e-4 -3.538e-4 7.59e-4 -7.608e-4 0.0011-0.00112 0.509392-0.5244008 0.514925-1.4773907 0.0114-2.0075662a0.78976505 0.81490251 0.32849278 0 0-0.0011-0.00116z" fill="#ffffff"/>
  <path d="m7.5376714 12.607676 0.5677304-0.5662 0.8341347 0.866456-0.5677305 0.5662z" fill="#ffffff"/>
  <path d="m3.7066011 14.447022c0.8013322-0.076388 1.5770591-0.028618 2.0435889-0.765364 0.3804376-0.600923 0.5660937-1.040008 0.978393-1.195404 1.5615591-0.588344 2.6164009 1.327377 1.2926942 2.259819-0.8836977 0.622519-2.2981813 0.387039-4.3146761-0.299051z" fill="#ff0000"/>
  <path d="m8.1054018 12.041476 0.8341347 0.866456 1.4135055-0.843582-1.3763219-1.429653z" fill="#b3b3b3"/>
  <path d="m15.05137 5.9633992c-0.222838-0.2307765-0.584487-0.2428143-0.82182-0.0273551l-4.9687472 4.4157789 1.3761052 1.429426 4.52343-5.0791754c0.117699-0.1192046 0.120112-0.5007319-0.108968-0.7386744z" fill="#c87137"/>
  <path d="m8.9767201 10.634697 0.2838653-0.2831 1.3763226 1.429652-0.283866 0.283101z" fill="#ffffff"/>
 </g>
</svg>
