<?xml version="1.0" encoding="UTF-8" standalone="no"?>
<svg
   height="24"
   viewBox="0 0 6.3499998 6.3500003"
   width="24"
   version="1.1"
   id="svg143"
   sodipodi:docname="Grid_15_24.svg"
   inkscape:export-filename="Grid_15_24.png"
   inkscape:export-xdpi="96"
   inkscape:export-ydpi="96"
   inkscape:version="1.2.1 (9c6d41e410, 2022-07-14)"
   xmlns:inkscape="http://www.inkscape.org/namespaces/inkscape"
   xmlns:sodipodi="http://sodipodi.sourceforge.net/DTD/sodipodi-0.dtd"
   xmlns="http://www.w3.org/2000/svg"
   xmlns:svg="http://www.w3.org/2000/svg">
  <defs
     id="defs147" />
  <sodipodi:namedview
     id="namedview145"
     pagecolor="#ffffff"
     bordercolor="#666666"
     borderopacity="1.0"
     inkscape:showpageshadow="2"
     inkscape:pageopacity="0.0"
     inkscape:pagecheckerboard="0"
     inkscape:deskcolor="#d1d1d1"
     showgrid="true"
     inkscape:zoom="38.25"
     inkscape:cx="11.986928"
     inkscape:cy="12"
     inkscape:current-layer="svg143">
    <inkscape:grid
       type="xygrid"
       id="grid922" />
  </sodipodi:namedview>
  <g
     stroke-linecap="round"
     stroke-linejoin="round"
     id="g141">
    <path
       d="m.19843751 0c-.1095891.00001095-.1984256.08884841-.19843751.19843751v4.76250009c.00001095.1095891.08884841.1984256.19843751.1984375h1.68592499c-.0953412-.1282819-.1782683-.2610286-.2488207-.396875h-.0480576v-.096893c-.2586554-.5487591-.3184525-1.1388726-.1705333-1.6665576.0611664-.2182058.1539637-.4255294.2705259-.6177756h-.099993v-.79375h.79375v.047284c.3911763-.2768802.8671326-.4441432 1.3890629-.4441432.5235575 0 .9990138.1695569 1.3890626.448826v-.051935h.79375v.79375h-.1085215c.1197292.1971596.214749.4097735.276729.6332935.1452999.5239941.085733 1.1097022-.1682075 1.6533813v.094567h-.045732c-.069874.1359776-.1518523.26876-.2464951.3968753h.4906565c.1095931 0 .1984375-.088844.1984375-.1984375v-4.76250017c-.000011-.1095891-.0888483-.1984256-.1984374-.1984375h-5.95312511zm.1984375.39687501h.79374999v.79374999h-.79374999zm1.19062499 0h.7937501v.79374999h-.7937501zm1.1906251 0h.79375v.79374999h-.79375zm1.190625 0h.79375v.79374999h-.79375zm1.190625 0h.79375v.79374999h-.79375zm-4.76250009 1.19062499h.79374999v.7937501h-.79374999zm3.37343759 1.0914063c-.1486376 0-.2875717.036596-.4115991.099219h.2131656v.79375h-.7573169c-.01719.1280716-.010827.2610445.034107.396875h.7232249v.7612061a.74422002.74422002 0 0 1 .2557979.2682002.74422002.74422002 0 0 1 .1410772-.2534722v-.7759303h.727075c.0416838-.1347431.0446444-.2675136.0255799-.396875h-.7526735v-.7937501h.2077403c-.1229479-.0628332-.2602667-.0992187-.4061619-.0992187zm-3.37343759.0992188h.79374999v.79375h-.79374999zm0 1.190625h.79374999v.79375h-.79374999z"
       fill="#d4aa00"
       stroke-dashoffset="1.5"
       stroke-width=".396875"
       id="path137" />
    <path
       d="m5.5569116 6.0027345h-1.190625v-.6449219c1.9752866-1.1538744.9921875-3.4230469-.5953125-3.4230469-1.5875001 0-2.5796876 2.2324219-.5931694 3.4230469l-.00214.6449219h-1.190625"
       fill="none"
       stroke="#2a7fff"
       stroke-width=".694531"
       id="path139" />
  </g>
</svg>
