<?xml version="1.0" encoding="UTF-8" standalone="no"?>
<svg
   height="24"
   width="24"
   version="1.1"
   id="svg181"
   sodipodi:docname="menu_project_options_150.svg"
   inkscape:export-filename="menu_project_options_150.png"
   inkscape:export-xdpi="96"
   inkscape:export-ydpi="96"
   inkscape:version="1.2.2 (732a01da63, 2022-12-09)"
   xmlns:inkscape="http://www.inkscape.org/namespaces/inkscape"
   xmlns:sodipodi="http://sodipodi.sourceforge.net/DTD/sodipodi-0.dtd"
   xmlns="http://www.w3.org/2000/svg"
   xmlns:svg="http://www.w3.org/2000/svg">
  <defs
     id="defs185" />
  <sodipodi:namedview
     id="namedview183"
     pagecolor="#ffffff"
     bordercolor="#666666"
     borderopacity="1.0"
     inkscape:showpageshadow="2"
     inkscape:pageopacity="0.0"
     inkscape:pagecheckerboard="0"
     inkscape:deskcolor="#d1d1d1"
     showgrid="true"
     inkscape:zoom="38.25"
     inkscape:cx="11.986928"
     inkscape:cy="12"
     inkscape:current-layer="svg181">
    <inkscape:grid
       type="xygrid"
       id="grid472" />
  </sodipodi:namedview>
  <radialGradient
     id="a"
     cx="7.388889"
     cy="3.048611"
     gradientTransform="matrix(-.00000006 .97959197 -.9795918 -.00000006 12.129253 -1.095239)"
     gradientUnits="userSpaceOnUse"
     r="3.5">
    <stop
       offset="0"
       stop-color="#ff8080"
       id="stop156" />
    <stop
       offset="1"
       stop-color="#e50000"
       id="stop158" />
  </radialGradient>
  <radialGradient
     id="b"
     cx="10.5"
     cy="9.5"
     gradientTransform="matrix(-.0000001 .9795918 -.9795918 -.00000011 21.448981 .857143)"
     gradientUnits="userSpaceOnUse"
     r="3.5">
    <stop
       offset="0"
       stop-color="#ffe680"
       id="stop161" />
    <stop
       offset="1"
       stop-color="#e5b800"
       id="stop163" />
  </radialGradient>
  <radialGradient
     id="c"
     cx="3"
     cy="10"
     gradientTransform="matrix(0 .9795918 -.9795918 0 15.938775 8.204081)"
     gradientUnits="userSpaceOnUse"
     r="3.5">
    <stop
       offset="0"
       stop-color="#80b2ff"
       id="stop166" />
    <stop
       offset="1"
       stop-color="#2672e5"
       id="stop168" />
  </radialGradient>
  <g
     stroke-width=".857143"
     transform="matrix(1.5 0 0 1.5 0 .5)"
     id="g177">
    <circle
       cx="10"
       cy="7"
       fill="url(#a)"
       r="3"
       id="circle171" />
    <circle
       cx="13"
       cy="12"
       fill="url(#b)"
       r="3"
       id="circle173" />
    <circle
       cx="7"
       cy="12"
       fill="url(#c)"
       r="3"
       id="circle175" />
  </g>
  <path
     d="m3.204214.605263.506806 1.988729-1.11579 1.116099-1.991351-.506359-.603879 1.457893 1.766147 1.05005-.000218 1.578183-1.76461 1.047879.603943 1.458049 1.98873-.506805 1.116099 1.115789-.506359 1.991352 1.457893.603878 1.050048-1.766147 1.578185.000219 1.047878 1.764609 1.458049-.603944-.506805-1.988728 1.115789-1.1161 1.991352.506359.603879-1.457893-1.766147-1.050048.000218-1.578185 1.76461-1.047878-.603944-1.458049-1.988729.506806-1.1161-1.115791.506359-1.991351-1.457893-.603879-1.050049 1.766147-1.578183-.000218-1.047879-1.764609zm2.38987 3.707664a2.3672715 2.3672715 0 0 1 3.092989 1.281158 2.3672715 2.3672715 0 0 1 -1.281158 3.092989 2.3672715 2.3672715 0 0 1 -3.092989-1.281159 2.3672715 2.3672715 0 0 1 1.281158-3.092988z"
     fill="#2a7fff"
     id="path179" />
</svg>
