<?xml version="1.0" encoding="UTF-8" standalone="no"?>
<svg
   height="24"
   width="24"
   version="1.1"
   id="svg6385"
   sodipodi:docname="menu_new_unit_150.svg"
   inkscape:export-filename="menu_new_unit_150.png"
   inkscape:export-xdpi="96"
   inkscape:export-ydpi="96"
   inkscape:version="1.2.2 (732a01da63, 2022-12-09)"
   xmlns:inkscape="http://www.inkscape.org/namespaces/inkscape"
   xmlns:sodipodi="http://sodipodi.sourceforge.net/DTD/sodipodi-0.dtd"
   xmlns="http://www.w3.org/2000/svg"
   xmlns:svg="http://www.w3.org/2000/svg">
  <defs
     id="defs6389" />
  <sodipodi:namedview
     id="namedview6387"
     pagecolor="#ffffff"
     bordercolor="#666666"
     borderopacity="1.0"
     inkscape:showpageshadow="2"
     inkscape:pageopacity="0.0"
     inkscape:pagecheckerboard="0"
     inkscape:deskcolor="#d1d1d1"
     showgrid="true"
     inkscape:zoom="38.25"
     inkscape:cx="11.986928"
     inkscape:cy="12"
     inkscape:current-layer="svg6385">
    <inkscape:grid
       type="xygrid"
       id="grid6666" />
  </sodipodi:namedview>
  <linearGradient
     id="a"
     gradientUnits="userSpaceOnUse"
     x1="6.5"
     x2="19.5"
     y1="5.5"
     y2="22.5">
    <stop
       offset="0"
       stop-color="#fff"
       id="stop6366" />
    <stop
       offset="1"
       stop-color="#d9e7ff"
       id="stop6368" />
  </linearGradient>
  <path
     d="m5.6 4.6h13.8v17.8h-13.8z"
     style="stroke:#d4aa00;stroke-width:1.2;stroke-linecap:round;stroke-linejoin:round;stroke-miterlimit:5.6;fill:url(#a)"
     id="path6371" />
  <g
     fill="none"
     stroke="#e4b600"
     stroke-linecap="round"
     stroke-width=".999999"
     transform="translate(1)"
     id="g6381">
    <path
       d="m4.499999.49999885v8.00000015"
       id="path6373" />
    <path
       d="m1.3448019 1.344802 6.3103937 6.3103938"
       id="path6375" />
    <path
       d="m8.4999988 4.4999987h-7.99999956"
       id="path6377" />
    <path
       d="m7.6551956 1.344802-6.3103937 6.3103938"
       id="path6379" />
  </g>
  <circle
     cx="5.5"
     cy="4.5"
     fill="#fff"
     r="1.300331"
     stroke="#ffe680"
     stroke-linejoin="round"
     stroke-miterlimit="5.6"
     id="circle6383" />
</svg>
