<?xml version="1.0" encoding="UTF-8" standalone="no"?>
<svg
   height="24"
   width="24"
   version="1.1"
   id="svg54"
   sodipodi:docname="Time_05_24.svg"
   inkscape:export-filename="Time_05_24.png"
   inkscape:export-xdpi="96"
   inkscape:export-ydpi="96"
   inkscape:version="1.2 (dc2aedaf03, 2022-05-15)"
   xmlns:inkscape="http://www.inkscape.org/namespaces/inkscape"
   xmlns:sodipodi="http://sodipodi.sourceforge.net/DTD/sodipodi-0.dtd"
   xmlns="http://www.w3.org/2000/svg"
   xmlns:svg="http://www.w3.org/2000/svg">
  <defs
     id="defs58" />
  <sodipodi:namedview
     id="namedview56"
     pagecolor="#ffffff"
     bordercolor="#666666"
     borderopacity="1.0"
     inkscape:showpageshadow="2"
     inkscape:pageopacity="0.0"
     inkscape:pagecheckerboard="0"
     inkscape:deskcolor="#d1d1d1"
     showgrid="false"
     inkscape:zoom="38.25"
     inkscape:cx="11.986928"
     inkscape:cy="12"
     inkscape:current-layer="svg54" />
  <linearGradient
     id="a"
     gradientUnits="userSpaceOnUse"
     x1="9"
     x2="14"
     y1="1030.3622"
     y2="1030.3622">
    <stop
       offset="0"
       stop-color="#808080"
       id="stop2" />
    <stop
       offset=".40312499"
       stop-color="#e6e6e6"
       id="stop4" />
    <stop
       offset="1"
       stop-color="#808080"
       id="stop6" />
  </linearGradient>
  <radialGradient
     id="b"
     cx="8.801107"
     cy="1036.9969"
     gradientTransform="matrix(.22221253 1.0000037 -.99999578 .22222055 1044.0368 800.11904)"
     gradientUnits="userSpaceOnUse"
     r="9">
    <stop
       offset="0"
       stop-color="#ccc"
       id="stop9" />
    <stop
       offset="1"
       stop-color="#fff"
       id="stop11" />
  </radialGradient>
  <g
     transform="translate(1 -1028.3622)"
     id="g52">
    <path
       d="m9 1031.3622v-2h5v2z"
       fill="url(#a)"
       fill-rule="evenodd"
       id="path14" />
    <circle
       cx="11.500001"
       cy="1041.8622"
       fill="#808080"
       r="10"
       id="circle16" />
    <circle
       cx="11.500001"
       cy="1041.8622"
       fill="url(#b)"
       r="9"
       id="circle18" />
    <path
       d="m9.0000015 1029.3622h4.9999955v2h-4.9999955z"
       fill="none"
       id="path20" />
    <g
       fill-rule="evenodd"
       id="g50">
      <path
         d="m11 1035.3622h1v6h3v1h-4z"
         id="path22" />
      <path
         d="m6 1038.3622h1v1h-1z"
         fill="#2a7fff"
         id="path24" />
      <path
         d="m8 1036.3622h1v1h-1z"
         fill="#2a7fff"
         id="path26" />
      <path
         d="m11 1034.3622h1v1h-1z"
         fill="#2a7fff"
         id="path28" />
      <path
         d="m14 1036.3622h1v1h-1z"
         fill="#2a7fff"
         id="path30" />
      <path
         d="m16 1038.3622h1v1h-1z"
         fill="#2a7fff"
         id="path32" />
      <path
         d="m16 1044.3622h1v1h-1z"
         fill="#2a7fff"
         id="path34" />
      <path
         d="m17 1041.3622h1.999999v1h-1.999999z"
         fill="#2a7fff"
         id="path36" />
      <path
         d="m14 1046.3622h1v1h-1z"
         fill="#2a7fff"
         id="path38" />
      <path
         d="m11 1047.3622h1v2h-1z"
         fill="#2a7fff"
         id="path40" />
      <path
         d="m8 1046.3622h1v1h-1z"
         fill="#2a7fff"
         id="path42" />
      <path
         d="m6 1044.3622h1v1h-1z"
         fill="#2a7fff"
         id="path44" />
      <path
         d="m4 1041.3622h1.999999v1h-1.999999z"
         fill="#2a7fff"
         id="path46" />
      <path
         d="m10 1031.3622h3v1h-3z"
         fill="#808080"
         id="path48" />
    </g>
  </g>
</svg>
