<svg width="32" height="32" version="1.1" viewBox="0 0 32 32" xmlns="http://www.w3.org/2000/svg">
 <defs>
  <linearGradient id="c" x1="22.825163" x2="22.822721" y1="6.2446866" y2="15.028725" gradientTransform="matrix(1.8209021 .00050572277 .00050579348 1.8214858 -25.065544 .61384909)" gradientUnits="userSpaceOnUse">
   <stop stop-color="#89a02c" offset="0"/>
   <stop stop-color="#445016" offset="1"/>
  </linearGradient>
  <linearGradient id="b" x1="-3" x2="-3" y1="28" y2="4" gradientTransform="translate(18,1)" gradientUnits="userSpaceOnUse">
   <stop stop-color="#668000" offset="0"/>
   <stop stop-color="#aad400" offset="1"/>
  </linearGradient>
  <radialGradient id="a" cx="-9" cy="10.699678" r="5.9492188" gradientTransform="matrix(1 0 0 .7143795 24 3.3563691)" gradientUnits="userSpaceOnUse">
   <stop stop-color="#803300" offset="0"/>
   <stop stop-color="#d45500" offset="1"/>
  </radialGradient>
  <linearGradient id="d" x1="33.5" x2="36.5" y1="11" y2="11" gradientTransform="matrix(1.1966091,1.1966091,-1.1966091,1.1966091,-7.4322506,-30.330392)" gradientUnits="userSpaceOnUse">
   <stop stop-color="#e60000" offset="0"/>
   <stop stop-color="#ff8989" offset=".28920922"/>
   <stop stop-color="#e60000" offset="1"/>
  </linearGradient>
  <radialGradient id="e" cx="14.847369" cy="1032.7991" r="3.4872861" gradientTransform="matrix(2.552968 -.1523493 9.2711717e-7 2.0418776 -13.503639 -2087.3637)" gradientUnits="userSpaceOnUse">
   <stop stop-color="#fff" offset="0"/>
   <stop stop-color="#ccc" offset="1"/>
  </radialGradient>
 </defs>
 <path d="m17 7.5 2.5-5" fill="none" stroke="#d4aa00" stroke-linecap="round" stroke-linejoin="round" stroke-width="2"/>
 <path d="m13 7.5-2.5-5" fill="none" stroke="#d4aa00" stroke-linecap="round" stroke-linejoin="round" stroke-width="2"/>
 <path d="m5 8v3l3 3" fill="none" stroke="#aca793" stroke-linecap="round" stroke-linejoin="round" stroke-width="2"/>
 <path d="m5 28v-3l3-3" fill="none" stroke="#aca793" stroke-linecap="round" stroke-linejoin="round" stroke-width="2"/>
 <path d="m1.5 20 2-2 5.5-1" fill="none" stroke="#aca793" stroke-linecap="round" stroke-linejoin="round" stroke-width="2"/>
 <path d="m25 8v3l-2.5 2" fill="none" stroke="#aca793" stroke-linecap="round" stroke-linejoin="round" stroke-width="2"/>
 <path d="m15 5a9 12 0 0 0-9 12 9 12 0 0 0 6.914063 11.634766c0.152491-0.642976 0.473202-1.252501 0.970703-1.75l6.43164-6.431641c-0.328519-1.600132-0.256359-3.845607 1.738281-5.839844 0.488655-0.488555 1.005567-0.875944 1.53711-1.169922a9 12 0 0 0-8.591797-8.443359z" fill="url(#b)"/>
 <path d="M 20.949219,8 A 9,12 0 0 0 15,5 9,12 0 0 0 9.050781,8.0039062 L 15,13.5 20.945313,8 Z" fill="url(#a)" stroke-linecap="round" stroke-linejoin="round" stroke-width="2.40001"/>
 <path d="m15 12a1 1 0 0 0-1 1v13.769531l1-1v0l1-1v-11.769531a1 1 0 0 0-1-1z" fill="url(#c)" stroke-linecap="round" stroke-linejoin="round"/>
 <path d="m24.000221 21.99978-7.500289 7.500288" fill="none" stroke="url(#d)" stroke-linecap="round" stroke-width="4.99986"/>
 <path d="m27.993893 15.178719c-1.224371-0.969108-2.951588-1.290798-4.808527 0.56576-2.400876 2.400394-1.383601 5.626124 0.03072 7.040157 1.414317 1.414031 4.635449 2.434953 7.040882 0.02999 1.852371-1.852007 1.535071-3.583885 0.565574-4.807869l-2.26295 2.262709-2.121262-0.707087-0.707087-2.121263z" fill="url(#e)" fill-rule="evenodd" stroke="#808080" stroke-width=".799978"/>
</svg>
