<?xml version="1.0" encoding="UTF-8" standalone="no"?>
<svg
   height="64"
   width="64"
   version="1.1"
   id="svg434"
   sodipodi:docname="Folder_10_64.svg"
   inkscape:export-filename="Folder_10_64.png"
   inkscape:export-xdpi="96"
   inkscape:export-ydpi="96"
   inkscape:version="1.2 (dc2aedaf03, 2022-05-15)"
   xml:space="preserve"
   xmlns:inkscape="http://www.inkscape.org/namespaces/inkscape"
   xmlns:sodipodi="http://sodipodi.sourceforge.net/DTD/sodipodi-0.dtd"
   xmlns="http://www.w3.org/2000/svg"
   xmlns:svg="http://www.w3.org/2000/svg"><defs
     id="defs436"><radialGradient
       id="a"
       cx="12.1"
       cy="10.900001"
       gradientTransform="matrix(0,2.0740741,-2.0740739,4e-8,43.307408,-4.396297)"
       gradientUnits="userSpaceOnUse"
       r="4.5"><stop
         offset="0"
         stop-color="#f55"
         id="stop788" /><stop
         offset="1"
         stop-color="#a00"
         id="stop790" /></radialGradient></defs><sodipodi:namedview
     id="namedview12"
     pagecolor="#ffffff"
     bordercolor="#666666"
     borderopacity="1.0"
     inkscape:pageshadow="2"
     inkscape:pageopacity="0.0"
     inkscape:pagecheckerboard="0"
     inkscape:deskcolor="#d1d1d1"
     showgrid="true"
     inkscape:zoom="14.34375"
     inkscape:cx="31.965142"
     inkscape:cy="32"
     inkscape:current-layer="g1302"
     inkscape:showpageshadow="2"><inkscape:grid
       type="xygrid"
       id="grid139" /></sodipodi:namedview><g
     id="g1157"
     transform="translate(0,3)"><g
       id="g1302"><g
         id="g1229"
         transform="translate(0,-3.0000449)"><path
           d="M 2,22 V 10 C 2,8 4,6 6,6 h 12 c 2,0 4.000007,2 4,4 v 2 h 40 v 10"
           stroke-linejoin="round"
           id="path145"
           style="fill:#fff3cc;fill-opacity:1;stroke:#f4c025;stroke-width:3.99991;stroke-linecap:round"
           sodipodi:nodetypes="cccccccc" /><path
           d="M 62,22 H 2 v 32 h 60 z"
           id="path428"
           style="fill:#f4c025;fill-opacity:1;stroke:#f4c025;stroke-width:4;stroke-linecap:round;stroke-linejoin:round;stroke-opacity:1"
           sodipodi:nodetypes="ccccc" /></g><g
         id="g1542"
         transform="matrix(2,0,0,2,3.5762787e-7,-2.9999996)"><circle
           cx="23.5"
           cy="23.5"
           style="fill:url(#a);stroke:#ffffff;stroke-width:1.6;stroke-linecap:round;stroke-linejoin:round;stroke-dashoffset:1.49998"
           transform="matrix(0,1,1,0,0,0)"
           id="ellipse793"
           r="7.6999998" /><g
           id="g4083"
           transform="matrix(2,0,0,2,0.5,0.5)"><path
             d="m 13,10 -3,3"
             id="path3550"
             style="fill:none;stroke:#ffffff;stroke-width:1.2;stroke-linecap:round;stroke-dasharray:none"
             sodipodi:nodetypes="cc" /><path
             d="M 13,13 10,10"
             id="path3552"
             style="fill:none;stroke:#ffffff;stroke-width:1.2;stroke-linecap:round;stroke-dasharray:none"
             sodipodi:nodetypes="cc" /></g></g></g></g></svg>
