<?xml version="1.0" encoding="UTF-8" standalone="no"?>
<svg
   height="16"
   width="16"
   version="1.1"
   id="svg16"
   sodipodi:docname="File_11_16.svg"
   inkscape:version="1.2 (dc2aedaf03, 2022-05-15)"
   inkscape:export-filename="File_11_16.png"
   inkscape:export-xdpi="96"
   inkscape:export-ydpi="96"
   xmlns:inkscape="http://www.inkscape.org/namespaces/inkscape"
   xmlns:sodipodi="http://sodipodi.sourceforge.net/DTD/sodipodi-0.dtd"
   xmlns:xlink="http://www.w3.org/1999/xlink"
   xmlns="http://www.w3.org/2000/svg"
   xmlns:svg="http://www.w3.org/2000/svg">
  <defs
     id="defs20">
    <radialGradient
       id="a"
       cx="9.1740294"
       cy="7.8253603"
       gradientTransform="matrix(0.66909781,-2.2758851e-8,4.5190518e-8,0.58542853,1.8616763,4.291566)"
       gradientUnits="userSpaceOnUse"
       r="7.5"
       fx="9.1740294"
       fy="7.8253603">
      <stop
         offset="0"
         stop-color="#fff"
         id="stop2"
         style="stop-color:#ccddff;stop-opacity:1;" />
      <stop
         offset="1"
         stop-color="#8fc1c7"
         id="stop4"
         style="stop-color:#ffffff;stop-opacity:1" />
    </radialGradient>
    <linearGradient
       inkscape:collect="always"
       xlink:href="#a"
       id="linearGradient2543"
       x1="13"
       y1="15"
       x2="3"
       y2="1"
       gradientUnits="userSpaceOnUse" />
    <linearGradient
       id="a-7"
       gradientUnits="userSpaceOnUse"
       x1="14.084459"
       x2="8.9155407"
       y1="14.084459"
       y2="8.9155407">
      <stop
         offset="0"
         stop-color="#009600"
         id="stop770" />
      <stop
         offset="1"
         stop-color="#6edb39"
         id="stop772" />
    </linearGradient>
  </defs>
  <sodipodi:namedview
     id="namedview18"
     pagecolor="#ffffff"
     bordercolor="#666666"
     borderopacity="1.0"
     inkscape:pageshadow="2"
     inkscape:pageopacity="0.0"
     inkscape:pagecheckerboard="0"
     inkscape:deskcolor="#d1d1d1"
     showgrid="true"
     showguides="true"
     inkscape:zoom="57.375"
     inkscape:cx="7.9912854"
     inkscape:cy="8"
     inkscape:current-layer="svg16"
     inkscape:showpageshadow="2">
    <inkscape:grid
       type="xygrid"
       id="grid249" />
  </sodipodi:namedview>
  <path
     d="m 2.5,15.5 v -15 h 7 l 4,4 v 11 z"
     id="path2"
     style="fill:url(#linearGradient2543);stroke:#b3b3b3;stroke-linecap:round;stroke-linejoin:round;fill-opacity:1.0"
     sodipodi:nodetypes="cccccc" />
  <path
     d="m 9.5,0.5 v 4 h 4"
     id="path6"
     style="fill:none;stroke:#b3b3b3;stroke-linecap:round;stroke-linejoin:round"
     sodipodi:nodetypes="ccc" />
  <g
     stroke="#ffffff"
     stroke-linecap="round"
     id="g783">
    <circle
       cx="11.5"
       cy="11.5"
       fill="url(#a)"
       r="4.1351352"
       stroke-dashoffset="1.49998"
       stroke-linejoin="round"
       stroke-width="0.72973"
       transform="matrix(0,1,1,0,0,0)"
       id="circle775"
       style="fill:url(#a-7)" />
    <g
       fill="none"
       transform="matrix(1,0,0,-1,15.75,22.75)"
       id="g781">
      <path
         d="m -4.25,13.25 v -4"
         id="path777" />
      <path
         d="m -2.25,11.25 h -4"
         id="path779" />
    </g>
  </g>
</svg>
