<?xml version="1.0" encoding="UTF-8" standalone="no"?>
<svg
   height="64"
   width="64"
   version="1.1"
   id="svg176"
   sodipodi:docname="Sort_01_64.svg"
   inkscape:export-filename="Sort_01_64.png"
   inkscape:export-xdpi="96"
   inkscape:export-ydpi="96"
   inkscape:version="1.2-beta (1b65182ce9, 2022-04-05)"
   xmlns:inkscape="http://www.inkscape.org/namespaces/inkscape"
   xmlns:sodipodi="http://sodipodi.sourceforge.net/DTD/sodipodi-0.dtd"
   xmlns="http://www.w3.org/2000/svg"
   xmlns:svg="http://www.w3.org/2000/svg">
  <defs
     id="defs180">
    <linearGradient
       id="a-2"
       gradientUnits="userSpaceOnUse"
       x1="12"
       x2="12"
       y1="11.999999"
       y2="1.499999"
       gradientTransform="matrix(2.0000001,0,0,2,-1e-6,0.99999907)">
      <stop
         offset="0"
         stop-color="#006cbd"
         id="stop278" />
      <stop
         offset="1"
         stop-color="#6bc0ff"
         id="stop280" />
    </linearGradient>
  </defs>
  <sodipodi:namedview
     id="namedview178"
     pagecolor="#ffffff"
     bordercolor="#666666"
     borderopacity="1.0"
     inkscape:pageshadow="2"
     inkscape:pageopacity="0.0"
     inkscape:pagecheckerboard="0"
     inkscape:deskcolor="#d1d1d1"
     showgrid="true"
     inkscape:zoom="14.34375"
     inkscape:cx="30.04793"
     inkscape:cy="32"
     inkscape:current-layer="svg176">
    <inkscape:grid
       type="xygrid"
       id="grid1029" />
  </sodipodi:namedview>
  <radialGradient
     id="a"
     cx="5.988626"
     cy="7.28811"
     gradientTransform="matrix(-.00000055 3.4666666 -3.2000002 -.0000005 31.296708 -14.760566)"
     gradientUnits="userSpaceOnUse"
     r="3.75">
    <stop
       offset="0"
       stop-color="#f8fbff"
       id="stop149" />
    <stop
       offset=".66666657"
       stop-color="#d1e3ff"
       id="stop151" />
    <stop
       offset="1"
       stop-color="#f8fbff"
       id="stop153" />
  </radialGradient>
  <g
     id="g1104"
     transform="scale(2.0000001)">
    <path
       d="M 16.5,15 H 13.654317 L 12.523113,11.819918 H 7.3443237 L 6.2749831,15 H 3.5 L 8.5462272,1 H 11.312373 Z M 11.683548,9.4611184 9.8983691,4.2660302 8.1485386,9.4611184 Z"
       fill="#177ecb"
       id="path283"
       style="stroke-width:0.969834" />
    <path
       d="m 4,30.999999 v -2.51337 l 8,-9.152113 H 4.5 V 17 h 11 v 2.165075 L 7.2840002,28.674897 H 16 v 2.325102 z"
       fill="#d40000"
       id="path285"
       sodipodi:nodetypes="ccccccccccc"
       style="stroke-width:1.0668" />
    <path
       d="M 22,2.9999974 V 20.999997 h -4 l 6,8 6,-8 H 26 V 2.9999974 Z"
       fill="url(#a)"
       fill-rule="evenodd"
       id="path287"
       style="fill:url(#a-2);stroke-width:1" />
  </g>
</svg>
