<?xml version="1.0" encoding="UTF-8" standalone="no"?>
<svg
   height="16"
   width="16"
   version="1.1"
   id="svg1383"
   sodipodi:docname="Help_02_16.svg"
   inkscape:export-filename="Help_02_16.png"
   inkscape:export-xdpi="96"
   inkscape:export-ydpi="96"
   inkscape:version="1.2-beta (1b65182ce9, 2022-04-05)"
   xmlns:inkscape="http://www.inkscape.org/namespaces/inkscape"
   xmlns:sodipodi="http://sodipodi.sourceforge.net/DTD/sodipodi-0.dtd"
   xmlns="http://www.w3.org/2000/svg"
   xmlns:svg="http://www.w3.org/2000/svg">
  <defs
     id="defs1387" />
  <sodipodi:namedview
     id="namedview1385"
     pagecolor="#ffffff"
     bordercolor="#666666"
     borderopacity="1.0"
     inkscape:pageshadow="2"
     inkscape:pageopacity="0.0"
     inkscape:pagecheckerboard="0"
     inkscape:deskcolor="#d1d1d1"
     showgrid="true"
     inkscape:zoom="57.375"
     inkscape:cx="7.9912854"
     inkscape:cy="8"
     inkscape:current-layer="svg1383">
    <inkscape:grid
       type="xygrid"
       id="grid2015" />
  </sodipodi:namedview>
  <circle
     cx="8"
     cy="8"
     r="7"
     style="fill:#59f;fill-rule:evenodd;stroke:#0055d4;stroke-linecap:round;stroke-linejoin:round;stroke-opacity:.954902"
     id="circle1375" />
  <g
     fill="#fff"
     stroke-width=".964597"
     transform="matrix(1.0367023 0 0 1.0367023 46.33854 -1066.545886)"
     id="g1381">
    <path
       d="m-36.161167 1037.9195h-1.328125q-.0052-.2865-.0052-.349 0-.6458.213541-1.0625.213542-.4166.854167-.9375.640625-.5208.765625-.6823.192708-.2552.192708-.5625 0-.427-.34375-.7291-.338541-.3073-.916666-.3073-.557292 0-.932292.3177-.375.3177-.515625.9687l-1.34375-.1666q.05729-.9323.791667-1.5834.739583-.651 1.9375-.651 1.260416 0 2.005208.6615.744792.6562.744792 1.5312 0 .4844-.276042.9167-.270833.4323-1.166667 1.1771-.463541.3854-.578125.6197-.109375.2344-.09896.8386z"
       id="path1377" />
    <path
       d="m-37.463542 1040.3622v-1.4635h1.463542v1.4635z"
       id="path1379" />
  </g>
</svg>
