<?xml version="1.0" encoding="UTF-8" standalone="no"?>
<svg
   height="32"
   viewBox="0 0 32 32"
   width="32"
   version="1.1"
   id="svg5"
   sodipodi:docname="generatesql_200.svg"
   inkscape:export-filename="generatesql_200.png"
   inkscape:export-xdpi="96"
   inkscape:export-ydpi="96"
   inkscape:version="1.3 (0e150ed6c4, 2023-07-21)"
   xmlns:inkscape="http://www.inkscape.org/namespaces/inkscape"
   xmlns:sodipodi="http://sodipodi.sourceforge.net/DTD/sodipodi-0.dtd"
   xmlns="http://www.w3.org/2000/svg"
   xmlns:svg="http://www.w3.org/2000/svg">
  <defs
     id="defs5" />
  <sodipodi:namedview
     id="namedview5"
     pagecolor="#ffffff"
     bordercolor="#000000"
     borderopacity="0.25"
     inkscape:showpageshadow="2"
     inkscape:pageopacity="0.0"
     inkscape:pagecheckerboard="0"
     inkscape:deskcolor="#d1d1d1"
     showgrid="true"
     inkscape:current-layer="svg5">
    <inkscape:grid
       id="grid5"
       units="px"
       originx="0"
       originy="0"
       spacingx="0.5"
       spacingy="0.5"
       empcolor="#0099e5"
       empopacity="0.30196078"
       color="#0099e5"
       opacity="0.14901961"
       empspacing="2"
       dotted="false"
       gridanglex="30"
       gridanglez="30"
       visible="true" />
  </sodipodi:namedview>
  <g
     fill-rule="evenodd"
     stroke-linejoin="round"
     transform="translate(0 -3)"
     id="g2">
    <path
       d="m14.5 4-.5 4-2.242188.9296875-3.1835932-2.4765625-2.1210938 2.1210938 2.4765625 3.1835932-.9296875 2.242188-4 .5v3l4 .5.9296875 2.242188-1.3671875 1.757812h16.875l-1.367188-1.757812.929688-2.242188 4-.5v-3l-4-.5-.929688-2.242188 2.476563-3.1835932-2.121094-2.1210938-3.183593 2.4765625-2.242188-.9296875-.5-4zm1.5 8a4 4 0 0 1 4 4 4 4 0 0 1 -4 4 4 4 0 0 1 -4-4 4 4 0 0 1 4-4z"
       fill="#c2f3ff"
       id="path1" />
    <path
       d="m14.5 3a1.0001 1.0001 0 0 0 -.992188.875l-.427734 3.4238281-1.167969.484375-2.724609-2.1191406a1.0001 1.0001 0 0 0 -1.3203125.0820313l-2.1210937 2.1210937a1.0001 1.0001 0 0 0 -.0820313 1.3203125l2.1191406 2.724609-.484375 1.167969-3.4238281.427734a1.0001 1.0001 0 0 0 -.875.992188v3a1.0001 1.0001 0 0 0 .875.992188l3.4238281.427734.484375 1.167969-1.4863281 1.912109h2.5332031l.8886719-1.144531a1.0001 1.0001 0 0 0 .1347656-.996094l-.9296875-2.242187a1.0001 1.0001 0 0 0 -.7988281-.609376l-3.125-.390624v-1.234376l3.125-.390624a1.0001 1.0001 0 0 0 .7988281-.609376l.9296875-2.242187a1.0001 1.0001 0 0 0 -.1347656-.996094l-1.9335938-2.488281.8710938-.8710938 2.488281 1.9335938a1.0001 1.0001 0 0 0 .996094.1347656l2.242187-.9296875a1.0001 1.0001 0 0 0 .609376-.7988281l.390624-3.125h1.234376l.390624 3.125a1.0001 1.0001 0 0 0 .609376.7988281l2.242187.9296875a1.0001 1.0001 0 0 0 .996094-.1347656l2.488281-1.9335938.871094.8710938-1.933594 2.488281a1.0001 1.0001 0 0 0 -.134766.996094l.929688 2.242187a1.0001 1.0001 0 0 0 .798828.609376l3.125.390624v1.234376l-3.125.390624a1.0001 1.0001 0 0 0 -.798828.609376l-.929688 2.242187a1.0001 1.0001 0 0 0 .134766.996094l.888672 1.144531h2.533203l-1.486328-1.912109.484375-1.167969 3.423828-.427734a1.0001 1.0001 0 0 0 .875-.992188v-3a1.0001 1.0001 0 0 0 -.875-.992188l-3.423828-.427734-.484375-1.167969 2.119141-2.724609a1.0001 1.0001 0 0 0 -.082032-1.3203125l-2.121094-2.1210937a1.0001 1.0001 0 0 0 -1.320312-.0820313l-2.724609 2.1191406-1.167969-.484375-.427734-3.4238281a1.0001 1.0001 0 0 0 -.992188-.875zm1.5 8c-2.749573 0-4.999999 2.250427-5 5 0 2.749573 2.250427 5 5 5 2.749574.000001 5-2.250426 5-5-.000001-2.749573-2.250427-5.000001-5-5zm0 2c1.668695 0 3 1.331305 3 3 0 1.668696-1.331304 3-3 3-1.668695 0-3-1.331305-3-3s1.331305-3 3-3z"
       fill="#00aad4"
       id="path2" />
  </g>
  <g
     fill="#00aad4"
     transform="translate(-23.47045 -1019.4001)"
     id="g5">
    <path
       d="m32.71967 1050.4256c-.47168 0-.91868-.045-1.34097-.1348-.42225-.09-.81802-.2237-1.18598-.4043-.36435-.1788-.70534-.4043-1.02427-.6739l.8558-1.0512c.37289.3235.78391.566 1.23316.7278.44923.1617.93663.2426 1.46226.2426.7098 0 1.26115-.1288 1.65095-.3909.39194-.2635.55083-.6392.58629-1.1186.0242-.3267-.15179-.6182-.26956-.8153-.1372-.2297-.40003-.3644-.68735-.4448-.91504-.2559-1.91201-.4151-2.87818-.6806-.41787-.1149-.76029-.4012-1.05122-.775-.29306-.3765-.43805-.9174-.43805-1.6037 0-.5918.16834-1.1641.40434-1.5566.23683-.394.67162-.7592 1.19273-.9839.52112-.2246 1.1478-.3369 1.88006-.3369.35036 0 .694.039 1.031.1146.34137.077.67487.1936 1.00404.3436.33116.151.65809.337.9771.5661l-.78168 1.0916c-.37289-.274-.74669-.4757-1.1186-.6132-.36933-.1365-.73898-.2089-1.11186-.2089-.66936 0-1.19019.1352-1.56335.4043-.36805.2655-.55257.6123-.55257 1.1321 0 .3304.13629.6357.28301.8019.17371.1968.42384.3633.71434.4313.964.2255 1.93279.4373 2.92541.7613.41159.1344.72733.4393.99731.8087.36608.5008.40433 1.0805.40433 1.5296 0 .5559-.14045 1.1103-.42452 1.5364-.28195.423-.69453.7446-1.23316.9704-.67139.2813-1.36998.3303-1.94081.3303z"
       id="path3" />
    <path
       d="m46.47045 1040.4255v10h5.5v-1.3359h-4.097656v-8.6641z"
       id="path4" />
    <path
       d="m40.84155 1040.4294c-.62711 0-1.18144.1703-1.66798.4492-.51704.2963-.92211.7126-1.20703 1.2578-.2821.5399-.42187 1.1684-.42187 1.8828v2.7618c0 .7144.13795 1.398.42187 1.9414.28309.5417.68826.9603 1.20703 1.2578.51697.2964 1.11816.4453 1.79688.4453.67873 0 1.27558-.2043 1.79298-.5.22314-.1275.42263-.2804.60155-.4531l1.21485.957.71094-.9102-1.25783-.9882c.24-.5118.35936-1.0956.35936-1.75v-2.7618c0-.7144-.14657-1.3411-.42966-1.8828-.284-.5434-.69581-.9389-1.19923-1.2578-.61584-.3902-1.32701-.4492-1.92186-.4492zm.0506 1.3476c.42165 0 .85849.099 1.13282.2735.29851.1893.54577.4346.71094.7695.1697.3304.2539.7148.2539 1.1524v2.8554c0 .2886-.0355.5538-.10938.7969l-1.22265-.9609-.71094.9062 1.30469 1.0274c-.0703.057-.14695.1089-.22654.1562-.30365.1786-.6528.3242-1.0547.3242-.40184 0-.75984-.088-1.0664-.2695-.30524-.1804-.54131-.4391-.71094-.7695-.16516-.3349-.24612-.7734-.24612-1.211v-2.8554c0-.4376.08-.8224.24612-1.1524.1688-.3353.41659-.576.71094-.7695.32065-.2109.70201-.2735.98826-.2735z"
       id="path5" />
  </g>
</svg>
