<?xml version="1.0" encoding="UTF-8" standalone="no"?>
<svg
   width="36"
   height="36"
   version="1.1"
   viewBox="0 0 36 36"
   id="svg16"
   sodipodi:docname="Bug_01_36.svg"
   inkscape:export-filename="Bug_01_36.png"
   inkscape:export-xdpi="96"
   inkscape:export-ydpi="96"
   inkscape:version="1.3.2 (091e20e, 2023-11-25, custom)"
   xmlns:inkscape="http://www.inkscape.org/namespaces/inkscape"
   xmlns:sodipodi="http://sodipodi.sourceforge.net/DTD/sodipodi-0.dtd"
   xmlns="http://www.w3.org/2000/svg"
   xmlns:svg="http://www.w3.org/2000/svg">
  <sodipodi:namedview
     id="namedview16"
     pagecolor="#ffffff"
     bordercolor="#000000"
     borderopacity="0.25"
     inkscape:showpageshadow="2"
     inkscape:pageopacity="0.0"
     inkscape:pagecheckerboard="0"
     inkscape:deskcolor="#d1d1d1"
     showgrid="true"
     inkscape:current-layer="svg16">
    <inkscape:grid
       id="grid16"
       units="px"
       originx="0"
       originy="0"
       spacingx="0.5"
       spacingy="0.5"
       empcolor="#0099e5"
       empopacity="0.30196078"
       color="#0099e5"
       opacity="0.14901961"
       empspacing="2"
       dotted="false"
       gridanglex="30"
       gridanglez="30"
       visible="true" />
  </sodipodi:namedview>
  <defs
     id="defs6">
    <linearGradient
       id="c"
       x1="23"
       x2="23"
       y1="6.5"
       y2="15"
       gradientTransform="matrix(1.4481164,1.4489211,-1.4485807,1.4493854,-1.1660936,-26.577842)"
       gradientUnits="userSpaceOnUse">
      <stop
         stop-color="#89a02c"
         offset="0"
         id="stop1" />
      <stop
         stop-color="#445016"
         offset="1"
         id="stop2" />
    </linearGradient>
    <linearGradient
       id="b"
       x1="25.714283"
       x2="25.714283"
       y1="15.5"
       y2="6.2142854"
       gradientTransform="matrix(1.4481164,1.4489211,-1.4485807,1.4493854,-1.1660936,-26.577842)"
       gradientUnits="userSpaceOnUse">
      <stop
         stop-color="#668000"
         offset="0"
         id="stop3" />
      <stop
         stop-color="#aad400"
         offset="1"
         id="stop4" />
    </linearGradient>
    <radialGradient
       id="a"
       cx="21.957434"
       cy="5.9936466"
       r="3.105469"
       gradientTransform="matrix(1.4485874,1.4495253,-1.0867925,1.0867925,-2.7934136,-24.841701)"
       gradientUnits="userSpaceOnUse">
      <stop
         stop-color="#803300"
         offset="0"
         id="stop5" />
      <stop
         stop-color="#d45500"
         offset="1"
         id="stop6" />
    </radialGradient>
  </defs>
  <path
     d="m26.999998 12.375002 5.624999-2.249999"
     fill="none"
     stroke="#d4aa00"
     stroke-linecap="round"
     stroke-linejoin="round"
     stroke-width="2.25"
     id="path6" />
  <path
     d="m23.624998 9.0000027 2.25-5.625"
     fill="none"
     stroke="#d4aa00"
     stroke-linecap="round"
     stroke-linejoin="round"
     stroke-width="2.25"
     id="path7" />
  <path
     d="m27.071017 8.9218867a10.26006 13.319619 44.937656 0 0-6.539809-2.444397l-0.0014 8.9892783 9.006918-0.0014a10.26006 13.319619 44.937656 0 0-2.465669-6.5434383z"
     fill="url(#a)"
     stroke-linejoin="round"
     stroke-width="7.02697"
     id="path8" />
  <g
     transform="matrix(2.1434578 .57433796 -.57433778 2.1434584 4.6386263 -3.7523153)"
     fill="none"
     stroke="#aca793"
     stroke-linecap="round"
     stroke-linejoin="round"
     stroke-width="1.01394"
     id="g14">
    <path
       d="m6.1575832 1.6752295-0.7169623 1.2418149 0.5248526 1.9587769"
       id="path9" />
    <path
       d="m1.1457046 10.393524 0.7101043-1.2674054 1.9587775-0.5248528"
       id="path10" />
    <path
       d="m1.5582243 6.0567401 1.4690831-0.3936396 2.617826 0.9355797"
       id="path11" />
    <path
       d="m14.850289 6.6939636-0.716963 1.2418148-1.958777 0.5248529"
       id="path12" />
    <path
       d="m9.8059587 15.393524 0.7425553-1.248671-0.524852-1.958777"
       id="path13" />
    <path
       d="m13.355467 12.867879-0.393639-1.469082-2.121016-1.7984674"
       id="path14" />
  </g>
  <path
     d="m29.536697 15.420042-8.961662 0.0014 0.0014-8.9383313a10.26006 13.319619 44.937656 0 0-10.173125 4.6038213 10.26006 13.319619 44.937656 0 0-2.1638787 16.676929 10.26006 13.319619 44.937656 0 0 16.667668-2.165085 10.26006 13.319619 44.937656 0 0 4.629564-10.178767z"
     fill="url(#b)"
     stroke-linejoin="round"
     stroke-width="7.02697"
     id="path15" />
  <path
     d="m21.276693 14.719428-12.312935 12.319777"
     fill="#c83737"
     stroke="url(#c)"
     stroke-linecap="round"
     stroke-linejoin="round"
     stroke-width="2.42302"
     id="path16" />
</svg>
