<?xml version="1.0" encoding="UTF-8" standalone="no"?>
<svg
   height="64"
   width="64"
   version="1.1"
   id="svg1175"
   sodipodi:docname="Window_01_64.svg"
   inkscape:export-filename="Window_01_64.png"
   inkscape:export-xdpi="96"
   inkscape:export-ydpi="96"
   inkscape:version="1.2-beta (1b65182ce9, 2022-04-05)"
   xmlns:inkscape="http://www.inkscape.org/namespaces/inkscape"
   xmlns:sodipodi="http://sodipodi.sourceforge.net/DTD/sodipodi-0.dtd"
   xmlns="http://www.w3.org/2000/svg"
   xmlns:svg="http://www.w3.org/2000/svg">
  <defs
     id="defs1177" />
  <sodipodi:namedview
     id="namedview12"
     pagecolor="#ffffff"
     bordercolor="#666666"
     borderopacity="1.0"
     inkscape:pageshadow="2"
     inkscape:pageopacity="0.0"
     inkscape:pagecheckerboard="0"
     inkscape:deskcolor="#d1d1d1"
     showgrid="true"
     inkscape:zoom="14.34375"
     inkscape:cx="32"
     inkscape:cy="32"
     inkscape:current-layer="svg1175">
    <inkscape:grid
       type="xygrid"
       id="grid139" />
  </sodipodi:namedview>
  <g
     stroke="#00aad4"
     transform="matrix(4,0,0,4,-30,-32)"
     id="g1173">
    <g
       fill="none"
       id="g1163">
      <path
         d="m 12,21.5 v -9 h 5 l 2,2 v 7 z"
         id="path1157" />
      <path
         d="m 13.5,15.5 h 4"
         id="path1159" />
      <path
         d="m 8,8.5 h 15 v 15 H 8 Z"
         stroke-dashoffset="1.49998"
         stroke-linecap="round"
         id="path1161" />
    </g>
    <path
       d="M 8,8.5 H 23 V 10 H 8 Z"
       fill="#00aad4"
       stroke-dashoffset="1.49998"
       stroke-linecap="round"
       id="path1165" />
    <g
       fill="none"
       id="g1171">
      <path
         d="m 13.5,19.5 h 4"
         id="path1167" />
      <path
         d="m 13.5,17.5 h 4"
         id="path1169" />
    </g>
  </g>
</svg>
