<?xml version="1.0" encoding="UTF-8" standalone="no"?>
<svg
   height="64"
   width="64"
   version="1.1"
   id="svg176"
   sodipodi:docname="Comment_02_64.svg"
   inkscape:export-filename="Comment_02_64.png"
   inkscape:export-xdpi="96"
   inkscape:export-ydpi="96"
   inkscape:version="1.2 (dc2aedaf03, 2022-05-15)"
   xmlns:inkscape="http://www.inkscape.org/namespaces/inkscape"
   xmlns:sodipodi="http://sodipodi.sourceforge.net/DTD/sodipodi-0.dtd"
   xmlns:xlink="http://www.w3.org/1999/xlink"
   xmlns="http://www.w3.org/2000/svg"
   xmlns:svg="http://www.w3.org/2000/svg">
  <defs
     id="defs180">
    <linearGradient
       gradientTransform="matrix(1.3636364,0,0,1.3666656,18.908537,-1.9161091)"
       gradientUnits="userSpaceOnUse"
       y2="10.5"
       x2="-7.5"
       y1="2.5"
       x1="-8.5"
       id="linearGradient881"
       xlink:href="#linearGradient903"
       inkscape:collect="always" />
    <linearGradient
       id="linearGradient903"
       inkscape:collect="always">
      <stop
         id="stop899"
         offset="0"
         style="stop-color:#5699ff;stop-opacity:1" />
      <stop
         id="stop901"
         offset="1"
         style="stop-color:#0d6dff;stop-opacity:1" />
    </linearGradient>
    <linearGradient
       gradientUnits="userSpaceOnUse"
       y2="8.5"
       x2="11"
       y1="4.5"
       x1="6.5"
       id="linearGradient920"
       xlink:href="#linearGradient918"
       inkscape:collect="always"
       gradientTransform="matrix(1.3636364,0,0,1.3666656,-2.9096455,-1.9161091)" />
    <linearGradient
       id="linearGradient918"
       inkscape:collect="always">
      <stop
         id="stop914"
         offset="0"
         style="stop-color:#d7e9ff;stop-opacity:1;" />
      <stop
         id="stop916"
         offset="1"
         style="stop-color:#a5cdff;stop-opacity:1" />
    </linearGradient>
  </defs>
  <sodipodi:namedview
     id="namedview178"
     pagecolor="#ffffff"
     bordercolor="#666666"
     borderopacity="1.0"
     inkscape:pageshadow="2"
     inkscape:pageopacity="0.0"
     inkscape:pagecheckerboard="0"
     inkscape:deskcolor="#d1d1d1"
     showgrid="true"
     inkscape:zoom="14.34375"
     inkscape:cx="31.965142"
     inkscape:cy="32"
     inkscape:current-layer="svg176"
     inkscape:showpageshadow="2">
    <inkscape:grid
       type="xygrid"
       id="grid5107" />
  </sodipodi:namedview>
  <g
     id="g1155"
     transform="matrix(4,0,0,4,0,4.0000874)">
    <path
       sodipodi:nodetypes="cccccccccc"
       inkscape:connector-curvature="0"
       id="path829"
       d="m 3.5,1.5 h 9 c 1.5,0 3,1.5 3,3 V 8 c 0,4.099997 -9.5,6.5 -9.5,6.5 l 1.5,-4 h -4 C 2.0143592,10.48257 0.5,9 0.5,7.5 v -3 c 0,-1.5 1.5,-3 3,-3 z"
       style="fill:#ffffff;fill-rule:evenodd;stroke:url(#linearGradient881);stroke-width:1px;stroke-linecap:butt;stroke-linejoin:round;stroke-opacity:1" />
    <path
       sodipodi:nodetypes="sssccsss"
       inkscape:connector-curvature="0"
       id="rect883"
       d="m 5,3 h 6 c 2,0 3,1 3,3 0,4.057734 -5,5.5 -5,5.5 L 10,9.0172157 H 5 C 2.9836443,9.0172157 2,8 2,6 2,4 3,3 5,3 Z"
       style="fill:url(#linearGradient920);fill-opacity:1;fill-rule:evenodd;stroke:none;stroke-width:1.5;stroke-linecap:round;stroke-linejoin:round;stroke-miterlimit:4;stroke-dasharray:none;stroke-dashoffset:0;stroke-opacity:1;paint-order:normal" />
  </g>
</svg>
