<?xml version="1.0" encoding="UTF-8" standalone="no"?>
<svg
   height="64"
   width="64"
   version="1.1"
   id="svg16"
   sodipodi:docname="File_12_64.svg"
   inkscape:export-filename="File_12_64.png"
   inkscape:export-xdpi="96"
   inkscape:export-ydpi="96"
   inkscape:version="1.2 (dc2aedaf03, 2022-05-15)"
   xmlns:inkscape="http://www.inkscape.org/namespaces/inkscape"
   xmlns:sodipodi="http://sodipodi.sourceforge.net/DTD/sodipodi-0.dtd"
   xmlns:xlink="http://www.w3.org/1999/xlink"
   xmlns="http://www.w3.org/2000/svg"
   xmlns:svg="http://www.w3.org/2000/svg">
  <defs
     id="defs20">
    <radialGradient
       id="a-9"
       cx="9.1740294"
       cy="7.8253603"
       gradientTransform="matrix(0.66909781,-2.2758851e-8,4.5190518e-8,0.58542853,1.8616763,4.291566)"
       gradientUnits="userSpaceOnUse"
       r="7.5"
       fx="9.1740294"
       fy="7.8253603">
      <stop
         offset="0"
         stop-color="#fff"
         id="stop2-5"
         style="stop-color:#ccddff;stop-opacity:1;" />
      <stop
         offset="1"
         stop-color="#8fc1c7"
         id="stop4-2"
         style="stop-color:#ffffff;stop-opacity:1" />
    </radialGradient>
    <linearGradient
       inkscape:collect="always"
       xlink:href="#a-9"
       id="linearGradient4344"
       x1="52"
       y1="60"
       x2="12"
       y2="4"
       gradientUnits="userSpaceOnUse" />
    <radialGradient
       id="a-8"
       cx="12.1"
       cy="10.900001"
       gradientTransform="matrix(0,2.0740741,-2.0740739,4e-8,43.307408,-4.396297)"
       gradientUnits="userSpaceOnUse"
       r="4.5">
      <stop
         offset="0"
         stop-color="#ff7f2a"
         id="stop788" />
      <stop
         offset="1"
         stop-color="#d45500"
         id="stop790" />
    </radialGradient>
  </defs>
  <sodipodi:namedview
     id="namedview18"
     pagecolor="#ffffff"
     bordercolor="#666666"
     borderopacity="1.0"
     inkscape:pageshadow="2"
     inkscape:pageopacity="0.0"
     inkscape:pagecheckerboard="0"
     inkscape:deskcolor="#d1d1d1"
     showgrid="true"
     inkscape:zoom="14.34375"
     inkscape:cx="28.583878"
     inkscape:cy="32"
     inkscape:current-layer="svg16"
     inkscape:showpageshadow="2">
    <inkscape:grid
       type="xygrid"
       id="grid1649" />
  </sodipodi:namedview>
  <path
     d="M 10,62 V 2 h 29 l 15,15 v 45 z"
     id="path2911"
     style="fill:url(#linearGradient4344);stroke:#b3b3b3;stroke-width:4;stroke-linecap:round;stroke-linejoin:round;stroke-opacity:1;fill-opacity:1"
     sodipodi:nodetypes="cccccc" />
  <path
     d="M 38,2 V 18 H 54"
     id="path2913"
     style="fill:none;stroke:#b3b3b3;stroke-width:4;stroke-linecap:round;stroke-linejoin:round;stroke-opacity:1" />
  <g
     id="g2338"
     transform="scale(2)">
    <circle
       cx="23.5"
       cy="23.5"
       style="fill:url(#a-8);stroke:#ffffff;stroke-width:1.6;stroke-linecap:round;stroke-linejoin:round;stroke-dashoffset:1.49998"
       transform="matrix(0,1,1,0,0,0)"
       id="ellipse793"
       r="7.6999998" />
    <g
       fill="none"
       stroke-width="1.25031"
       transform="matrix(1.8881996,0,0,1.8886627,0.91279074,2.6489683)"
       id="g847"
       style="fill:#ffffff;fill-opacity:1">
      <path
         d="M 11.28698,9.0599682 13.267602,11.040104 11.28698,13.02024"
         id="path843"
         style="fill:none;fill-opacity:1;stroke:#ffffff;stroke-width:1.25024;stroke-linecap:round;stroke-linejoin:round;stroke-dasharray:none"
         sodipodi:nodetypes="ccc" />
    </g>
  </g>
</svg>
