<?xml version="1.0" encoding="UTF-8" standalone="no"?>
<svg
   height="64"
   width="64"
   version="1.1"
   id="svg860"
   sodipodi:docname="Grid_05_64.svg"
   inkscape:export-filename="Grid_05_64.png"
   inkscape:export-xdpi="96"
   inkscape:export-ydpi="96"
   inkscape:version="1.2-beta (1b65182ce9, 2022-04-05)"
   xmlns:inkscape="http://www.inkscape.org/namespaces/inkscape"
   xmlns:sodipodi="http://sodipodi.sourceforge.net/DTD/sodipodi-0.dtd"
   xmlns="http://www.w3.org/2000/svg"
   xmlns:svg="http://www.w3.org/2000/svg">
  <defs
     id="defs864">
    <linearGradient
       id="a"
       gradientTransform="matrix(0,-0.9375,-1.0166667,0,84.133336,49.78125)"
       gradientUnits="userSpaceOnUse"
       x1="9"
       x2="6"
       y1="10"
       y2="10.5">
      <stop
         offset="0"
         stop-color="#72cef6"
         id="stop350" />
      <stop
         offset="1"
         stop-color="#d2f5f8"
         id="stop352" />
    </linearGradient>
    <linearGradient
       id="b"
       gradientTransform="matrix(0,-0.9375,-1.0166667,0,84.133336,49.78125)"
       gradientUnits="userSpaceOnUse"
       x1="10"
       x2="5"
       y1="12.5"
       y2="12.5">
      <stop
         offset="0"
         stop-color="#4674a8"
         id="stop355" />
      <stop
         offset="1"
         stop-color="#42a0ce"
         id="stop357" />
    </linearGradient>
    <linearGradient
       id="c"
       gradientUnits="userSpaceOnUse"
       x1="-8.75"
       x2="-13.75"
       y1="-1.75"
       y2="-6.75">
      <stop
         offset="0"
         stop-color="#a00"
         id="stop360" />
      <stop
         offset="1"
         stop-color="#f55"
         id="stop362" />
    </linearGradient>
  </defs>
  <sodipodi:namedview
     id="namedview862"
     pagecolor="#ffffff"
     bordercolor="#666666"
     borderopacity="1.0"
     inkscape:pageshadow="2"
     inkscape:pageopacity="0.0"
     inkscape:pagecheckerboard="0"
     inkscape:deskcolor="#d1d1d1"
     showgrid="true"
     inkscape:zoom="14.34375"
     inkscape:cx="32"
     inkscape:cy="32"
     inkscape:current-layer="svg860">
    <inkscape:grid
       type="xygrid"
       id="grid1428" />
  </sodipodi:namedview>
  <g
     transform="matrix(0,3.999999,-3.999999,0,199.99995,-271.99993)"
     id="g395">
    <g
       stroke-width="0.75"
       id="g383">
      <path
         d="m -83.625,-49.625 h 15.250001 v 15.250001 H -83.625 Z"
         fill="#ffffff"
         stroke="#999999"
         stroke-dashoffset="1.49998"
         stroke-linecap="round"
         stroke-linejoin="round"
         transform="scale(-1)"
         id="path365" />
      <g
         fill="none"
         stroke="#b3b3b3"
         transform="matrix(-1,0,0,1,152,0)"
         id="g377">
        <path
           d="m 68.75,46.625 h 14.5"
           id="path367" />
        <path
           d="M 72.125,49.25 V 34.75"
           id="path369" />
        <path
           d="M 83.25,37.375 H 68.75"
           id="path371" />
        <path
           d="M 80.125,49.25 V 34.75"
           id="path373" />
        <path
           d="M 76.125,49.25 V 34.75"
           id="path375" />
      </g>
      <path
         d="m 68.375,-45.375 h 15.25 v 5.25 h -15.25 z"
         fill="none"
         opacity="0.5"
         stroke="#ffffff"
         stroke-dashoffset="1.49998"
         stroke-linejoin="round"
         transform="scale(1,-1)"
         id="path379" />
      <path
         d="M 83.625003,44.625 H 68.375002 v -3.75 h 15.250001 z"
         fill="url(#a)"
         stroke="url(#b)"
         stroke-linecap="round"
         stroke-linejoin="round"
         id="path381"
         style="fill:url(#a);stroke:url(#b)" />
    </g>
    <circle
       cx="-11.25"
       cy="-4.25"
       r="4"
       style="fill:url(#c);stroke:#800000;stroke-width:0.5;stroke-linecap:round;stroke-linejoin:round;stroke-dashoffset:1.49998"
       transform="matrix(1,0,0,-1,89.25,34.25)"
       id="circle385" />
    <g
       fill="none"
       stroke="#ffffff"
       stroke-linecap="round"
       transform="matrix(0.70710678,-0.70710678,-0.70710678,-0.70710678,88.960155,43.449747)"
       id="g391">
      <path
         d="m -4.25,13.25 v -4"
         id="path387" />
      <path
         d="m -2.25,11.25 h -4"
         id="path389" />
    </g>
    <circle
       cx="-4.25"
       cy="-11.25"
       r="4.5"
       style="opacity:0.7;fill:none;stroke:#ffffff;stroke-width:0.5;stroke-linejoin:round;stroke-dashoffset:1.49998"
       transform="rotate(-90,61.75,-27.5)"
       id="circle393" />
  </g>
</svg>
