<?xml version="1.0" encoding="UTF-8" standalone="no"?>
<svg
   width="24"
   height="24"
   version="1.1"
   id="svg14"
   sodipodi:docname="delete_all_150.svg"
   inkscape:export-filename="delete_all_150.png"
   inkscape:export-xdpi="96"
   inkscape:export-ydpi="96"
   inkscape:version="1.3.2 (091e20e, 2023-11-25, custom)"
   xmlns:inkscape="http://www.inkscape.org/namespaces/inkscape"
   xmlns:sodipodi="http://sodipodi.sourceforge.net/DTD/sodipodi-0.dtd"
   xmlns="http://www.w3.org/2000/svg"
   xmlns:svg="http://www.w3.org/2000/svg">
  <defs
     id="defs14" />
  <sodipodi:namedview
     id="namedview14"
     pagecolor="#ffffff"
     bordercolor="#000000"
     borderopacity="0.25"
     inkscape:showpageshadow="2"
     inkscape:pageopacity="0.0"
     inkscape:pagecheckerboard="0"
     inkscape:deskcolor="#d1d1d1"
     showgrid="true"
     inkscape:current-layer="svg14">
    <inkscape:grid
       id="grid14"
       units="px"
       originx="0"
       originy="0"
       spacingx="0.5"
       spacingy="0.5"
       empcolor="#0099e5"
       empopacity="0.30196078"
       color="#0099e5"
       opacity="0.14901961"
       empspacing="2"
       dotted="false"
       gridanglex="30"
       gridanglez="30"
       visible="true" />
  </sodipodi:namedview>
  <rect
     x="1.7763568e-15"
     y=".5"
     width="22.5"
     height="22.500002"
     ry="3.2727275"
     fill="#dbe9ff"
     stroke="#00aad4"
     stroke-linejoin="round"
     stroke-width="1.5"
     id="rect1"
     style="stroke:none" />
  <path
     d="m6 4.25h13.5"
     fill="none"
     stroke="#808080"
     stroke-linejoin="round"
     stroke-width="1.5"
     id="path1" />
  <path
     d="m3 4.25h1.5"
     fill="none"
     stroke="#dc0000"
     stroke-linejoin="round"
     stroke-width="1.5"
     id="path2" />
  <path
     d="m6 7.2499998h13.5"
     fill="none"
     stroke="#808080"
     stroke-linejoin="round"
     stroke-width="1.5"
     id="path3" />
  <path
     d="m3 7.2499998h1.5"
     fill="none"
     stroke="#dc0000"
     stroke-linejoin="round"
     stroke-width="1.5"
     id="path4" />
  <path
     d="m6 10.25h13.5"
     fill="none"
     stroke="#808080"
     stroke-linejoin="round"
     stroke-width="1.5"
     id="path5" />
  <path
     d="m3 10.25h1.5"
     fill="none"
     stroke="#dc0000"
     stroke-linejoin="round"
     stroke-width="1.5"
     id="path6" />
  <path
     d="m6 13.25h13.5"
     fill="none"
     stroke="#808080"
     stroke-linejoin="round"
     stroke-width="1.5"
     id="path7" />
  <path
     d="m3 13.25h1.5"
     fill="none"
     stroke="#dc0000"
     stroke-linejoin="round"
     stroke-width="1.5"
     id="path8" />
  <path
     d="m6 16.25h13.5"
     fill="none"
     stroke="#808080"
     stroke-linejoin="round"
     stroke-width="1.5"
     id="path9" />
  <path
     d="m3 16.25h1.5"
     fill="none"
     stroke="#dc0000"
     stroke-linejoin="round"
     stroke-width="1.5"
     id="path10" />
  <path
     d="m6 19.25h13.5"
     fill="none"
     stroke="#808080"
     stroke-linejoin="round"
     stroke-width="1.5"
     id="path11" />
  <path
     d="m3 19.25h1.5"
     fill="none"
     stroke="#dc0000"
     stroke-linejoin="round"
     stroke-width="1.5"
     id="path12" />
  <g
     transform="matrix(2.0625,0,0,2.0625,-8.484375,-8.4843747)"
     fill="none"
     stroke-linecap="round"
     id="g14">
    <path
       d="m9.5 14 4.5-4.5m0 4.5-4.5-4.5"
       stroke="#ffffff"
       stroke-width="3.5"
       id="path13" />
    <path
       d="m9.5 14 4.5-4.5m0 4.5-4.5-4.5"
       stroke="#dc0000"
       stroke-width="1.5"
       id="path14" />
  </g>
</svg>
