<?xml version="1.0" encoding="UTF-8" standalone="no"?>
<svg
   width="24"
   height="24"
   version="1.1"
   viewBox="0 0 24 24"
   id="svg12"
   sodipodi:docname="tchartextentlink.svg"
   inkscape:version="1.3.2 (091e20e, 2023-11-25, custom)"
   xmlns:inkscape="http://www.inkscape.org/namespaces/inkscape"
   xmlns:sodipodi="http://sodipodi.sourceforge.net/DTD/sodipodi-0.dtd"
   xmlns="http://www.w3.org/2000/svg"
   xmlns:svg="http://www.w3.org/2000/svg">
  <defs
     id="defs12" />
  <sodipodi:namedview
     id="namedview12"
     pagecolor="#ffffff"
     bordercolor="#000000"
     borderopacity="0.25"
     inkscape:showpageshadow="2"
     inkscape:pageopacity="0.0"
     inkscape:pagecheckerboard="0"
     inkscape:deskcolor="#d1d1d1"
     showgrid="true"
     inkscape:current-layer="svg12">
    <inkscape:grid
       id="grid12"
       units="px"
       originx="0"
       originy="0"
       spacingx="0.5"
       spacingy="0.5"
       empcolor="#0099e5"
       empopacity="0.30196078"
       color="#0099e5"
       opacity="0.14901961"
       empspacing="2"
       dotted="false"
       gridanglex="30"
       gridanglez="30"
       visible="true" />
  </sodipodi:namedview>
  <rect
     x="1.25"
     y="1.25"
     width="21.5"
     height="21.5"
     fill="#ffffff"
     fill-rule="evenodd"
     stroke="#2a7efe"
     stroke-linecap="square"
     stroke-linejoin="round"
     stroke-width=".5"
     style="paint-order:normal"
     id="rect1" />
  <path
     d="m7.5 3.5v7"
     fill="#b3b3b3"
     stroke="#b3b3b3"
     stroke-linecap="round"
     stroke-linejoin="round"
     id="path1" />
  <path
     d="m15.5 3.5v7"
     fill="#b3b3b3"
     stroke="#b3b3b3"
     stroke-linecap="round"
     stroke-linejoin="round"
     id="path2" />
  <path
     d="m11.5 3.5v7"
     fill="#b3b3b3"
     stroke="#b3b3b3"
     stroke-linecap="round"
     stroke-linejoin="round"
     id="path3" />
  <path
     d="m4.6 3.6 2.9 3.9 2.5-2.5 4 3 5.4-2.5"
     fill="none"
     stroke="#5599ff"
     stroke-linecap="round"
     stroke-linejoin="round"
     stroke-width="1.1"
     id="path4" />
  <path
     d="m4.5 3.5h15v7"
     fill="none"
     stroke="#b3b3b3"
     stroke-linecap="round"
     stroke-linejoin="round"
     id="path5" />
  <path
     d="m4.5 3.5v7h15"
     fill="none"
     stroke="#4d4d4d"
     stroke-linecap="round"
     stroke-linejoin="round"
     id="path6" />
  <path
     d="m7.5 13.5v7"
     fill="#b3b3b3"
     stroke="#b3b3b3"
     stroke-linecap="round"
     stroke-linejoin="round"
     id="path7" />
  <path
     d="m15.5 13.5v7"
     fill="#b3b3b3"
     stroke="#b3b3b3"
     stroke-linecap="round"
     stroke-linejoin="round"
     id="path8" />
  <path
     d="m11.5 13.5v7"
     fill="#b3b3b3"
     stroke="#b3b3b3"
     stroke-linecap="round"
     stroke-linejoin="round"
     id="path9" />
  <path
     d="m4.6 17.5 2.9-2.5 3 2.5 4-2 4.9 4.9"
     fill="none"
     stroke="#5599ff"
     stroke-linecap="round"
     stroke-linejoin="round"
     stroke-width="1.1"
     id="path10" />
  <path
     d="m4.5 13.5h15v7"
     fill="none"
     stroke="#b3b3b3"
     stroke-linecap="round"
     stroke-linejoin="round"
     id="path11" />
  <path
     d="m4.5 13.5v7h15"
     fill="none"
     stroke="#4d4d4d"
     stroke-linecap="round"
     stroke-linejoin="round"
     id="path12" />
</svg>
