<svg width="32" height="32" version="1.1" xmlns="http://www.w3.org/2000/svg">
 <path d="M 23.300781,23.40625 V 21.433594 L 21.689453,20.896484 16,22.792969 10.310547,20.896484 1,24 l 15,5 3.603516,-1.201172 a 3.2,3.2 0 0 1 0.632812,-3.560547 3.2,3.2 0 0 1 2.263672,-0.9375 3.2,3.2 0 0 1 0.800781,0.105469 z" fill="#2a7efe" stroke-width="2.00003"/>
 <path d="M 10.310547,12.896484 1,16 16,21 23.300781,18.566406 V 18.5 A 3.2,3.2 0 0 1 26.5,15.300781 3.2,3.2 0 0 1 29.072266,16.642578 L 31,16 21.689453,12.896484 16,14.792969 Z" fill="#ff7f00" stroke-width="2.00003"/>
 <path d="m0.99979945 7.9998931 15.0002-5.0000669 15.000202 5.0000669-15.000202 5.0000669z" fill="#2a7efe" stroke-width="2.00003"/>
 <path d="m22.500017 26.500079 3.999963 3.999983 4.000004-3.999983" fill="none" stroke="#ff1a1a" stroke-linecap="round" stroke-linejoin="round" stroke-width="2.99999"/>
 <path d="M 26.500126,30.499938 26.5,18.499988" fill="none" stroke="#ff1a1a" stroke-linecap="round" stroke-width="2.99999"/>
</svg>
