<?xml version="1.0" encoding="UTF-8" standalone="no"?>
<svg
   height="48"
   width="48"
   version="1.1"
   id="svg625"
   sodipodi:docname="Book_01_48.svg"
   inkscape:export-filename="Book_01_48.png"
   inkscape:export-xdpi="96"
   inkscape:export-ydpi="96"
   inkscape:version="1.2-beta (1b65182ce9, 2022-04-05)"
   xmlns:inkscape="http://www.inkscape.org/namespaces/inkscape"
   xmlns:sodipodi="http://sodipodi.sourceforge.net/DTD/sodipodi-0.dtd"
   xmlns:xlink="http://www.w3.org/1999/xlink"
   xmlns="http://www.w3.org/2000/svg"
   xmlns:svg="http://www.w3.org/2000/svg">
  <defs
     id="defs629">
    <linearGradient
       id="d"
       gradientUnits="userSpaceOnUse"
       x1="12"
       x2="12"
       y1="33.254944"
       y2="44.504944">
      <stop
         offset="0"
         stop-color="#f2f2f2"
         id="stop179" />
      <stop
         offset="1"
         stop-color="#3771c8"
         id="stop181" />
    </linearGradient>
    <linearGradient
       id="e"
       gradientUnits="userSpaceOnUse"
       x1="15"
       x2="6"
       y1="43.454498"
       y2="26.2045">
      <stop
         offset="0"
         stop-color="#2c5aa0"
         id="stop184" />
      <stop
         offset="1"
         stop-color="#87aade"
         id="stop186" />
    </linearGradient>
    <linearGradient
       id="b"
       gradientUnits="userSpaceOnUse"
       x1="7.5"
       x2="12"
       xlink:href="#a"
       y1="35.504944"
       y2="35.496189" />
    <linearGradient
       id="a">
      <stop
         offset="0"
         stop-color="#fff"
         id="stop172" />
      <stop
         offset="1"
         stop-color="#ccc"
         id="stop174" />
    </linearGradient>
    <linearGradient
       id="c"
       gradientTransform="matrix(-1.5,0,0,1.5,24,23.504942)"
       gradientUnits="userSpaceOnUse"
       x1="5"
       x2="8"
       xlink:href="#a"
       y1="8"
       y2="7.9941649" />
  </defs>
  <sodipodi:namedview
     id="namedview627"
     pagecolor="#ffffff"
     bordercolor="#666666"
     borderopacity="1.0"
     inkscape:pageshadow="2"
     inkscape:pageopacity="0.0"
     inkscape:pagecheckerboard="0"
     inkscape:deskcolor="#d1d1d1"
     showgrid="true"
     inkscape:zoom="19.125"
     inkscape:cx="22.823529"
     inkscape:cy="24"
     inkscape:current-layer="svg625">
    <inkscape:grid
       type="xygrid"
       id="grid1285" />
  </sodipodi:namedview>
  <g
     transform="matrix(2.0000008,0,0,2.0000008,-9.6e-6,-47.600193)"
     id="g213">
    <g
       fill-rule="evenodd"
       id="g195">
      <path
         d="M 12,28.004942 C 9.3808221,26.229983 5.25,25.753328 1.5,28.003328 L 0.75,43.754941 c 3,-0.75 6,-1.5 9,0 1.183594,1.857422 3.357658,1.849398 4.5,0 3,-1.5 6,-0.75 9,0 L 22.5,28.003328 c -3.75,-2.25 -7.879112,-1.865626 -10.5,0.0016 z"
         fill="url(#d)"
         stroke="url(#e)"
         stroke-linejoin="round"
         stroke-width="1.5"
         id="path189"
         style="fill:url(#d);stroke:url(#e)" />
      <path
         d="m 12,43.004941 c -3.270399,-3.052605 -6.5124135,-2.553375 -9.75,-1.5 L 3,28.759187 c 3.252702,-0.912868 5.75436,-1.381258 9,0.745755"
         fill="url(#b)"
         id="path191"
         style="fill:url(#b)" />
      <path
         d="m 12,43.004941 c 3.270399,-3.052605 6.512413,-2.553375 9.75,-1.5 L 21,28.759187 c -3.252702,-0.912868 -5.75436,-1.381258 -9,0.745755"
         fill="url(#c)"
         id="path193"
         style="fill:url(#c)" />
    </g>
    <g
       fill="none"
       stroke="#808080"
       stroke-width="0.75"
       transform="matrix(1.5,0,0,1.5,0,24.219044)"
       id="g203">
      <path
         d="M 2.5,4.756932 C 4.0482745,4.2766132 5.5836558,4.1676461 7,5"
         id="path197" />
      <path
         d="M 2.5,8.756932 C 4.0482745,8.2766132 5.5836558,8.1676461 7,9"
         id="path199" />
      <path
         d="M 2.5,6.756932 C 4.0482745,6.2766132 5.5836558,6.1676461 7,7"
         id="path201" />
    </g>
    <g
       fill="none"
       stroke="#808080"
       stroke-width="0.75"
       transform="matrix(1.5,0,0,1.5,9.75,24.219044)"
       id="g211">
      <path
         d="M 2.5,4.756932 C 4.0482745,4.2766132 5.5836558,4.1676461 7,5"
         id="path205" />
      <path
         d="M 2.5,8.756932 C 4.0482745,8.2766132 5.5836558,8.1676461 7,9"
         id="path207" />
      <path
         d="M 2.5,6.756932 C 4.0482745,6.2766132 5.5836558,6.1676461 7,7"
         id="path209" />
    </g>
  </g>
</svg>
