<?xml version="1.0" encoding="UTF-8" standalone="no"?>
<svg
   width="36"
   height="36"
   version="1.1"
   viewBox="0 0 36 36"
   id="svg7"
   sodipodi:docname="tcolordialog_150.svg"
   inkscape:export-filename="tcolordialog_150.png"
   inkscape:export-xdpi="96"
   inkscape:export-ydpi="96"
   inkscape:version="1.3.2 (091e20e, 2023-11-25, custom)"
   xmlns:inkscape="http://www.inkscape.org/namespaces/inkscape"
   xmlns:sodipodi="http://sodipodi.sourceforge.net/DTD/sodipodi-0.dtd"
   xmlns="http://www.w3.org/2000/svg"
   xmlns:svg="http://www.w3.org/2000/svg">
  <defs
     id="defs7" />
  <sodipodi:namedview
     id="namedview7"
     pagecolor="#ffffff"
     bordercolor="#000000"
     borderopacity="0.25"
     inkscape:showpageshadow="2"
     inkscape:pageopacity="0.0"
     inkscape:pagecheckerboard="0"
     inkscape:deskcolor="#d1d1d1"
     showgrid="true"
     inkscape:current-layer="svg7">
    <inkscape:grid
       id="grid7"
       units="px"
       originx="0"
       originy="0"
       spacingx="0.5"
       spacingy="0.5"
       empcolor="#0099e5"
       empopacity="0.30196078"
       color="#0099e5"
       opacity="0.14901961"
       empspacing="2"
       dotted="false"
       gridanglex="30"
       gridanglez="30"
       visible="true" />
  </sodipodi:namedview>
  <rect
     x="2.5"
     y="6.5"
     width="31"
     height="27"
     fill="#f9f9f9"
     stroke="#2a7efe"
     style="paint-order:normal"
     id="rect1" />
  <path
     d="M 34,3.5 V 7 H 2 V 3.5 C 2,2.8 2.7,2 3.5,2 h 29 C 33.2,2 34,2.7 34,3.5 Z"
     fill="#2a7efe"
     id="path1" />
  <path
     d="m 13.100586,11 4.90039,8.4894 L 22.899414,11 Z"
     fill="#ff8080"
     stroke-linecap="round"
     stroke-linejoin="round"
     stroke-width="0.999999"
     id="path2" />
  <path
     d="m 23.768555,11.5039 -4.900391,8.4952 h 9.765625 z"
     fill="#00d400"
     stroke-linecap="round"
     stroke-linejoin="round"
     stroke-width="0.999999"
     id="path3" />
  <path
     d="m 12.231445,11.5039 -4.865234,8.4952 h 9.765625 z"
     fill="#ff0000"
     stroke-linecap="round"
     stroke-linejoin="round"
     stroke-width="0.999999"
     id="path4" />
  <path
     d="M 18.000976,21.5009 13.09668,30 h 9.80664 z"
     fill="#3385ff"
     stroke-linecap="round"
     stroke-linejoin="round"
     stroke-width="0.999999"
     id="path5" />
  <path
     d="m 18.870117,20.9951 4.902344,8.4971 4.865234,-8.4971 z"
     fill="#00ff00"
     stroke-linecap="round"
     stroke-linejoin="round"
     stroke-width="0.999999"
     id="path6" />
  <path
     d="m 7.362305,20.9951 4.865234,8.4971 4.902344,-8.4971 z"
     fill="#5599ff"
     stroke-linecap="round"
     stroke-linejoin="round"
     stroke-width="0.999999"
     id="path7" />
</svg>
