<svg width="16" height="16" version="1.1" xmlns="http://www.w3.org/2000/svg">
 <defs>
  <linearGradient id="a" x1="17.658785" x2="11.341217" y1="17.658785" y2="11.341217" gradientTransform="matrix(.98930497 0 0 .98930487 -3.844923 -3.844922)" gradientUnits="userSpaceOnUse">
   <stop stop-color="#009600" offset="0"/>
   <stop stop-color="#6edb39" offset="1"/>
  </linearGradient>
 </defs>
 <g stroke="#ffffff" stroke-linecap="round">
  <ellipse transform="matrix(0,1,1,0,0,0)" cx="10.5" cy="10.5" rx="5.0000005" ry="5" fill="url(#a)" stroke-dashoffset="1.49998" stroke-linejoin="round" stroke-width=".999999"/>
  <path d="m11.718029 8.6246227-3.0934527-6.43e-5 -6.38e-5 3.0935816" fill="none" stroke-linejoin="round" stroke-width="1.24997"/>
  <path d="M 9.0000001,8.9999999 12.5,12.5" fill="none" stroke-width="1.5"/>
 </g>
</svg>
