<?xml version="1.0" encoding="UTF-8" standalone="no"?>
<svg
   width="24"
   height="24"
   version="1.1"
   id="svg12"
   sodipodi:docname="Manometer_01_24.svg"
   inkscape:export-filename="Manometer_01_24.png"
   inkscape:export-xdpi="96"
   inkscape:export-ydpi="96"
   inkscape:version="1.3.2 (091e20e, 2023-11-25, custom)"
   xmlns:inkscape="http://www.inkscape.org/namespaces/inkscape"
   xmlns:sodipodi="http://sodipodi.sourceforge.net/DTD/sodipodi-0.dtd"
   xmlns="http://www.w3.org/2000/svg"
   xmlns:svg="http://www.w3.org/2000/svg">
  <sodipodi:namedview
     id="namedview12"
     pagecolor="#ffffff"
     bordercolor="#000000"
     borderopacity="0.25"
     inkscape:showpageshadow="2"
     inkscape:pageopacity="0.0"
     inkscape:pagecheckerboard="0"
     inkscape:deskcolor="#d1d1d1"
     showgrid="true"
     inkscape:current-layer="svg12">
    <inkscape:grid
       id="grid12"
       units="px"
       originx="0"
       originy="0"
       spacingx="0.5"
       spacingy="0.5"
       empcolor="#0099e5"
       empopacity="0.30196078"
       color="#0099e5"
       opacity="0.14901961"
       empspacing="2"
       dotted="false"
       gridanglex="30"
       gridanglez="30"
       visible="true" />
  </sodipodi:namedview>
  <defs
     id="defs2">
    <linearGradient
       id="a"
       x1="8"
       x2="8"
       y1="14.5"
       y2="9.5"
       gradientTransform="matrix(1.5693428 0 0 1.5693428 -.55474253 -.55474287)"
       gradientUnits="userSpaceOnUse">
      <stop
         stop-color="#808080"
         offset="0"
         id="stop1" />
      <stop
         stop-color="#cccccc"
         offset="1"
         id="stop2" />
    </linearGradient>
  </defs>
  <circle
     cx="12"
     cy="12"
     r="10.749999"
     fill="#ffffff"
     fill-rule="evenodd"
     id="circle2" />
  <path
     d="m15.138686 14.354013c0 1.733448-1.405237 3.138686-3.138687 3.138686-1.733447 0-3.1386849-1.405238-3.1386849-3.138686h-7.1294753c1.3792326 4.517086 5.5452047 8.390167 10.26816 8.395986 4.72296-0.0056 8.88893-3.8789 10.268163-8.395986z"
     fill="url(#a)"
     fill-rule="evenodd"
     stroke-linecap="round"
     stroke-linejoin="round"
     stroke-width=".799999"
     id="path2" />
  <path
     d="m11.999999 4.9379571-1.554017 9.4164389a1.5693428 1.373175 0 0 0-0.01532 0.195786 1.5693428 1.373175 0 0 0 1.569341 1.373175 1.5693428 1.373175 0 0 0 1.569345-1.373175 1.5693428 1.373175 0 0 0-0.0184-0.195786h3e-3z"
     fill="#d40000"
     id="path3" />
  <circle
     cx="9.6459837"
     cy="4.9379563"
     r=".78467143"
     fill="#4d4d4d"
     id="circle3" />
  <circle
     cx="14.354013"
     cy="4.9379563"
     r=".78467143"
     fill="#4d4d4d"
     id="circle4" />
  <circle
     cx="4.9379568"
     cy="9.6459837"
     r=".78467143"
     fill="#4d4d4d"
     id="circle5" />
  <circle
     cx="6.5072989"
     cy="6.5072985"
     r=".78467143"
     fill="#4d4d4d"
     id="circle6" />
  <circle
     cx="19.062042"
     cy="9.6459837"
     r=".78467143"
     fill="#4d4d4d"
     id="circle7" />
  <circle
     cx="17.492699"
     cy="6.5072985"
     r=".78467143"
     fill="#4d4d4d"
     id="circle8" />
  <circle
     cx="4.9379568"
     cy="12.78467"
     r=".78467143"
     fill="#4d4d4d"
     id="circle9" />
  <circle
     cx="19.062042"
     cy="12.78467"
     r=".78467143"
     fill="#4d4d4d"
     id="circle10" />
  <circle
     cx="12"
     cy="14.354013"
     r=".78467143"
     fill="#e6e6e6"
     id="circle11" />
  <path
     d="m22.457031 14.353516h-7.318359c0 1.733446-1.405224 3.138671-3.138672 3.138671-1.733445 0-3.1386719-1.405225-3.1386719-3.138671h-7.3183594a10.749999 10.749999 0 0 0 10.457031 8.396484 10.749999 10.749999 0 0 0 10.457031-8.396484z"
     fill="url(#a)"
     fill-rule="evenodd"
     stroke-linecap="round"
     stroke-linejoin="round"
     stroke-width=".799999"
     id="path11" />
  <circle
     cx="12"
     cy="12"
     r="10.299999"
     fill="none"
     stroke="#808080"
     stroke-linecap="round"
     stroke-linejoin="round"
     stroke-width="1.2"
     id="circle12" />
</svg>
