<?xml version="1.0" encoding="UTF-8" standalone="no"?>
<svg
   height="16"
   width="16"
   version="1.1"
   id="svg6"
   sodipodi:docname="menu_search_find_previous.svg"
   inkscape:export-filename="menu_search_find_previous.png"
   inkscape:export-xdpi="96"
   inkscape:export-ydpi="96"
   inkscape:version="1.3 (0e150ed6c4, 2023-07-21)"
   xmlns:inkscape="http://www.inkscape.org/namespaces/inkscape"
   xmlns:sodipodi="http://sodipodi.sourceforge.net/DTD/sodipodi-0.dtd"
   xmlns="http://www.w3.org/2000/svg"
   xmlns:svg="http://www.w3.org/2000/svg">
  <defs
     id="defs6" />
  <sodipodi:namedview
     id="namedview6"
     pagecolor="#ffffff"
     bordercolor="#000000"
     borderopacity="0.25"
     inkscape:showpageshadow="2"
     inkscape:pageopacity="0.0"
     inkscape:pagecheckerboard="0"
     inkscape:deskcolor="#d1d1d1"
     showgrid="true"
     inkscape:current-layer="svg6">
    <inkscape:grid
       id="grid6"
       units="px"
       originx="0"
       originy="0"
       spacingx="0.5"
       spacingy="0.5"
       empcolor="#0099e5"
       empopacity="0.30196078"
       color="#0099e5"
       opacity="0.14901961"
       empspacing="2"
       dotted="false"
       gridanglex="30"
       gridanglez="30"
       visible="true" />
  </sodipodi:namedview>
  <radialGradient
     id="a"
     cx="5.9886"
     cy="7.2881"
     gradientTransform="matrix(-.00000017 1.0569 -.97561 -.00000015 14.196 .14615)"
     gradientUnits="userSpaceOnUse"
     r="3.75">
    <stop
       offset="0"
       stop-color="#f8fbff"
       id="stop1" />
    <stop
       offset=".66667"
       stop-color="#d1e3ff"
       id="stop2" />
    <stop
       offset="1"
       stop-color="#f8fbff"
       id="stop3" />
  </radialGradient>
  <g
     stroke-linecap="round"
     id="g6">
    <g
       transform="translate(.5 .5)"
       id="g3">
      <path
         d="m11 11 3.5 3.5"
         fill="none"
         stroke="#d4aa00"
         stroke-width="2"
         id="path3" />
      <circle
         cx="8"
         cy="8"
         fill="url(#a)"
         fill-rule="evenodd"
         r="3.125"
         stroke="#2a7fff"
         stroke-linejoin="round"
         stroke-width=".75"
         id="circle3" />
    </g>
    <g
       fill="none"
       stroke="#f00"
       stroke-width=".264581"
       transform="matrix(3.7795573 0 0 3.7795573 5 0)"
       id="g5">
      <path
         d="m-.21166496 1.1112412-.44978813-.44978808-.44978811.44978808"
         stroke-linejoin="round"
         id="path4" />
      <path
         d="m-.66145309.66145312v2.64581248"
         id="path5" />
    </g>
  </g>
</svg>
