<?xml version="1.0" encoding="UTF-8" standalone="no"?>
<svg
   height="24"
   width="24"
   version="1.1"
   id="svg4"
   sodipodi:docname="ddconnections_150.svg"
   inkscape:export-filename="ddconnections_150.png"
   inkscape:export-xdpi="96"
   inkscape:export-ydpi="96"
   inkscape:version="1.3 (0e150ed6c4, 2023-07-21)"
   xmlns:inkscape="http://www.inkscape.org/namespaces/inkscape"
   xmlns:sodipodi="http://sodipodi.sourceforge.net/DTD/sodipodi-0.dtd"
   xmlns="http://www.w3.org/2000/svg"
   xmlns:svg="http://www.w3.org/2000/svg">
  <defs
     id="defs4" />
  <sodipodi:namedview
     id="namedview4"
     pagecolor="#ffffff"
     bordercolor="#000000"
     borderopacity="0.25"
     inkscape:showpageshadow="2"
     inkscape:pageopacity="0.0"
     inkscape:pagecheckerboard="0"
     inkscape:deskcolor="#d1d1d1"
     showgrid="true"
     inkscape:current-layer="svg4">
    <inkscape:grid
       id="grid4"
       units="px"
       originx="0"
       originy="0"
       spacingx="0.5"
       spacingy="0.5"
       empcolor="#0099e5"
       empopacity="0.30196078"
       color="#0099e5"
       opacity="0.14901961"
       empspacing="2"
       dotted="false"
       gridanglex="30"
       gridanglez="30"
       visible="true" />
  </sodipodi:namedview>
  <path
     d="m13.167063 10.833372-2.12127-2.1212688-4.8789177 4.8789178 2.1212686 2.12127-4.5375795 4.537579"
     fill="none"
     stroke="#00aad4"
     stroke-linecap="round"
     stroke-linejoin="round"
     stroke-width="1.79996"
     id="path1" />
  <path
     d="m10.833667 13.166769 2.121269 2.121268 4.878918-4.878919-2.121268-2.1212688 4.537578-4.5375788"
     fill="none"
     stroke="#00c1f0"
     stroke-linecap="round"
     stroke-linejoin="round"
     stroke-width="1.79996"
     id="path2" />
  <g
     fill="#cca300"
     id="g4">
    <path
       d="m20.89468 6.817579-.893533.8935329c1.519346 3.2103731.823705 7.3469971-2.05952 10.2302191-2.882887 2.882888-7.020006 3.581099-10.2302205 2.062452l-.8935331.893532c3.7269896 1.979034 8.6396406 1.221448 11.9704126-2.109325 3.331131-3.331131 4.086235-8.243275 2.106394-11.970411z"
       id="path3" />
    <path
       d="m12.841164 2.0217964c-2.70689-.0225013-5.4935429 1.0551745-7.6287207 3.1903523-3.3299029 3.3299035-4.0869011 8.2432893-2.1093238 11.9704123l.8935331-.893533c-1.5179721-3.210468-.819854-7.3479158 2.06245-10.2302202 2.8823033-2.8823038 7.0197534-3.5804219 10.2302214-2.0624498l.893533-.8935331c-1.337244-.7095288-2.827069-1.068438-4.341693-1.0810285z"
       id="path4" />
  </g>
</svg>
