<?xml version="1.0" encoding="UTF-8" standalone="no"?>
<svg
   height="64"
   viewBox="0 0 16.933 16.933"
   width="64"
   version="1.1"
   id="svg53"
   sodipodi:docname="Light_04_64.svg"
   inkscape:version="1.2.2 (732a01da63, 2022-12-09)"
   xmlns:inkscape="http://www.inkscape.org/namespaces/inkscape"
   xmlns:sodipodi="http://sodipodi.sourceforge.net/DTD/sodipodi-0.dtd"
   xmlns="http://www.w3.org/2000/svg"
   xmlns:svg="http://www.w3.org/2000/svg">
  <defs
     id="defs57" />
  <sodipodi:namedview
     id="namedview55"
     pagecolor="#ffffff"
     bordercolor="#000000"
     borderopacity="0.25"
     inkscape:showpageshadow="2"
     inkscape:pageopacity="0.0"
     inkscape:pagecheckerboard="0"
     inkscape:deskcolor="#d1d1d1"
     showgrid="true"
     inkscape:zoom="14.21875"
     inkscape:cx="31.964835"
     inkscape:cy="32"
     inkscape:current-layer="svg53">
    <inkscape:grid
       type="xygrid"
       id="grid1326" />
  </sodipodi:namedview>
  <radialGradient
     id="a"
     cx="6.497474"
     cy="3.206305"
     gradientTransform="matrix(-.00000004 1.8461535 -1.8461538 -.00000013 13.419332 -8.495334)"
     gradientUnits="userSpaceOnUse"
     r="3.25">
    <stop
       offset="0"
       stop-color="#fff"
       id="stop2" />
    <stop
       offset=".16666666"
       stop-color="#fff"
       id="stop4" />
    <stop
       offset="1"
       stop-color="#ff0"
       id="stop6" />
  </radialGradient>
  <filter
     id="b"
     color-interpolation-filters="sRGB"
     height="1.44376"
     width="1.44376"
     x="-0.22188001"
     y="-0.22188001">
    <feGaussianBlur
       stdDeviation=".600925"
       id="feGaussianBlur9" />
  </filter>
  <linearGradient
     id="c"
     gradientTransform="matrix(.75713298 0 0 .71055391 2.415042 3.213041)"
     gradientUnits="userSpaceOnUse"
     x1="6.221174"
     x2="9.764016"
     y1="11.861728"
     y2="11.861728">
    <stop
       offset="0"
       stop-color="#999"
       id="stop12" />
    <stop
       offset=".39922822"
       stop-color="#fff"
       id="stop14" />
    <stop
       offset="1"
       stop-color="#999"
       id="stop16" />
  </linearGradient>
  <radialGradient
     id="d"
     cx="31.5"
     cy="6.602212"
     gradientTransform="matrix(1.0979534 0 0 1.3208649 -26.668348 -1.647406)"
     gradientUnits="userSpaceOnUse"
     r="2.375222">
    <stop
       offset="0"
       stop-color="#fff"
       id="stop19" />
    <stop
       offset="1"
       stop-color="#fea"
       id="stop21" />
  </radialGradient>
  <radialGradient
     id="e"
     cx="5"
     cy="11"
     gradientTransform="matrix(0 1.4551793 -1.4551793 -.00000004 21.298535 -1.984334)"
     gradientUnits="userSpaceOnUse"
     r="8.000001">
    <stop
       offset="0"
       stop-color="#14ccfc"
       id="stop24" />
    <stop
       offset="1"
       stop-color="#0064e0"
       id="stop26" />
  </radialGradient>
  <g
     stroke-linejoin="round"
     id="g41">
    <path
       d="m16.667511 10.721582-1.586252-1.4014693-.000612-1.707136 1.58778-1.402061-.807348-1.949115-2.114107.131356-1.206695-1.2075619.13063-2.1126671-1.949324-.80743665-1.4014679 1.58625025-1.707137.0006128-1.402061-1.58778185-1.949116.80735025.131324 2.1141375-1.2075609 1.2066947-2.1126375-.13066-.80743505 1.949323 1.58624985 1.401514.0006128 1.707136-1.58778145 1.4020173.80734985 1.949116 2.1141391-.131326 1.2066943 1.207563-.130661 2.112638 1.949324.807432 1.401468-1.586248 1.707137-.000612 1.4020619 1.58778 1.949114-.807348-.131323-2.11414 1.207561-1.206696 2.112637.130662z"
       fill="url(#e)"
       stroke="#0068e0"
       stroke-width=".529156"
       id="path29" />
    <g
       fill="none"
       stroke="#fff"
       stroke-linecap="round"
       stroke-width="1.05831"
       id="g39">
      <path
         d="m12.69975 7.9373437h-8.4664989"
         id="path31" />
      <path
         d="m11.641437 11.112282-6.3498739-6.3498753"
         id="path33" />
      <path
         d="m8.4665001 5.8207197v-2.116625"
         id="path35" />
      <path
         d="m11.641437 4.7624067-6.3498739 6.3498753"
         id="path37" />
    </g>
  </g>
  <g
     fill-rule="evenodd"
     id="g51">
    <path
       d="m7.4081881 10.583125c0-1.1960403-.458126-.9137023-.933969-1.7000803-.504352-.833492-.377868-1.560263-.377868-1.560263 0-1.166579.81249-2.295797 2.36981-2.295797 1.5573209 0 2.3698109 1.129218 2.3698109 2.295797 0 0 .126484.726771-.377868 1.560263-.4758399.786378-.9332939.50404-.9332939 1.7000803"
       fill="url(#d)"
       stroke="#fcaf36"
       stroke-width=".529156"
       id="path43" />
    <path
       d="m7.2494411 10.688957h2.434079l-.000169 1.693299c-.000016.16402-.308252.423827-.476032.423827h-1.481637c-.16778 0-.476241-.259804-.476241-.423827z"
       fill="url(#c)"
       stroke="#999"
       stroke-width=".21166"
       id="path45" />
    <path
       d="m7.8310891 12.911413h1.270399l-.317492.529156h-.634989z"
       fill="#333"
       stroke-width=".463012"
       id="path47" />
    <circle
       cx="8.494"
       cy="4.75"
       fill="url(#a)"
       filter="url(#b)"
       r="3.25"
       stroke-width=".843532"
       transform="matrix(.55090524 0 0 .54689556 3.787286 5.189935)"
       id="circle49" />
  </g>
</svg>
