<?xml version="1.0" encoding="UTF-8" standalone="no"?>
<svg
   height="32"
   width="32"
   version="1.1"
   id="svg433"
   sodipodi:docname="Folder_12_32.svg"
   inkscape:export-filename="Folder_12_32.png"
   inkscape:export-xdpi="96"
   inkscape:export-ydpi="96"
   inkscape:version="1.2 (dc2aedaf03, 2022-05-15)"
   xml:space="preserve"
   xmlns:inkscape="http://www.inkscape.org/namespaces/inkscape"
   xmlns:sodipodi="http://sodipodi.sourceforge.net/DTD/sodipodi-0.dtd"
   xmlns="http://www.w3.org/2000/svg"
   xmlns:svg="http://www.w3.org/2000/svg"><defs
     id="defs437" /><sodipodi:namedview
     id="namedview435"
     pagecolor="#ffffff"
     bordercolor="#666666"
     borderopacity="1.0"
     inkscape:pageshadow="2"
     inkscape:pageopacity="0.0"
     inkscape:pagecheckerboard="0"
     inkscape:deskcolor="#d1d1d1"
     showgrid="true"
     inkscape:zoom="28.6875"
     inkscape:cx="15.982571"
     inkscape:cy="16"
     inkscape:current-layer="svg433"
     inkscape:showpageshadow="2"><inkscape:grid
       type="xygrid"
       id="grid810" /></sodipodi:namedview><g
     id="g929"
     transform="translate(0,-0.99999998)"><path
       d="M 1,28 0.99988002,5.99988 c 0,-1.0000001 0.99999998,-2 1.99999998,-2 h 5.9999995 c 1,0 2.0000015,0.9999999 2.0000015,2 V 6.9998799 H 27 V 11.99988"
       stroke-linejoin="round"
       id="path145-3"
       style="fill:#fff3cc;stroke:#f4c025;stroke-width:1.99976;stroke-linecap:round"
       sodipodi:nodetypes="cccccccc" /><path
       d="M 31.000027,11.999986 H 5.0000036 L 1,28 h 26.000023 z"
       stroke-linejoin="round"
       id="path147"
       style="fill:#f4c025;fill-opacity:1;stroke:#f4c025;stroke-width:2;stroke-linecap:round"
       sodipodi:nodetypes="ccccc" /></g></svg>
