<svg width="32" height="32" version="1.1" xmlns="http://www.w3.org/2000/svg">
 <path d="m16 2v12" fill="none" stroke="#2a7efe" stroke-linecap="round" stroke-width="4"/>
 <path d="M 22.350221,5.0120784 A 12.700436,12.694302 0 0 1 28.267678,19.291193 12.700436,12.694302 0 0 1 16,28.69997 12.700436,12.694302 0 0 1 3.7323213,19.291193 12.700436,12.694302 0 0 1 9.6497823,5.0120774" fill="none" stroke="#2a7efe" stroke-linecap="round" stroke-width="3.60006"/>
</svg>
