<?xml version="1.0" encoding="UTF-8" standalone="no"?>
<svg
   height="16"
   width="16"
   version="1.1"
   id="svg22"
   sodipodi:docname="filename.svg"
   inkscape:export-filename="filename.png"
   inkscape:export-xdpi="96"
   inkscape:export-ydpi="96"
   inkscape:version="1.1.2 (0a00cf5339, 2022-02-04, custom)"
   xmlns:inkscape="http://www.inkscape.org/namespaces/inkscape"
   xmlns:sodipodi="http://sodipodi.sourceforge.net/DTD/sodipodi-0.dtd"
   xmlns="http://www.w3.org/2000/svg"
   xmlns:svg="http://www.w3.org/2000/svg"
   xmlns:rdf="http://www.w3.org/1999/02/22-rdf-syntax-ns#"
   xmlns:cc="http://creativecommons.org/ns#"
   xmlns:dc="http://purl.org/dc/elements/1.1/">
  <metadata
     id="metadata28">
    <rdf:RDF>
      <cc:Work
         rdf:about="">
        <dc:format>image/svg+xml</dc:format>
        <dc:type
           rdf:resource="http://purl.org/dc/dcmitype/StillImage" />
      </cc:Work>
    </rdf:RDF>
  </metadata>
  <defs
     id="defs26" />
  <sodipodi:namedview
     pagecolor="#ffffff"
     bordercolor="#666666"
     borderopacity="1"
     objecttolerance="10"
     gridtolerance="10"
     guidetolerance="10"
     inkscape:pageopacity="0"
     inkscape:pageshadow="2"
     inkscape:window-width="640"
     inkscape:window-height="480"
     id="namedview24"
     showgrid="true"
     inkscape:zoom="57"
     inkscape:cx="7.9912281"
     inkscape:cy="8"
     inkscape:current-layer="svg22"
     inkscape:pagecheckerboard="0">
    <inkscape:grid
       type="xygrid"
       id="grid858" />
  </sodipodi:namedview>
  <path
     style="fill:none;fill-opacity:1;stroke:#00aad4;stroke-opacity:1"
     d="m 4.5,13.5 v -9 h 5 l 2,2 v 7 z"
     id="path1591"
     sodipodi:nodetypes="cccccc" />
  <path
     d="m 6,7.5 h 4"
     id="path2"
     style="fill:none;stroke:#00aad4;stroke-linecap:butt;stroke-opacity:1"
     sodipodi:nodetypes="cc" />
  <rect
     style="fill:none;stroke-linecap:round;stroke-dashoffset:1.49998;stroke:#00aad4;stroke-opacity:1"
     id="rect862"
     width="15"
     height="15"
     x="0.5"
     y="0.5" />
  <rect
     style="fill:#00aad4;fill-opacity:1;stroke:#00aad4;stroke-linecap:round;stroke-dashoffset:1.49998;stroke-opacity:1"
     id="rect1112"
     width="15"
     height="1.5"
     x="0.5"
     y="0.5" />
  <path
     d="m 6,11.5 h 4"
     id="path2772"
     style="fill:none;stroke:#00aad4;stroke-linecap:butt;stroke-opacity:1"
     sodipodi:nodetypes="cc" />
  <path
     d="m 6,9.5 h 4"
     id="path2774"
     style="fill:none;stroke:#00aad4;stroke-linecap:butt;stroke-opacity:1"
     sodipodi:nodetypes="cc" />
</svg>
