<?xml version="1.0" encoding="UTF-8" standalone="no"?>
<svg
   height="64"
   viewBox="0 0 16.933333 16.933335"
   width="64"
   version="1.1"
   id="svg647"
   sodipodi:docname="Database_13_64.svg"
   inkscape:export-filename="Database_13_64.png"
   inkscape:export-xdpi="96"
   inkscape:export-ydpi="96"
   inkscape:version="1.2.1 (9c6d41e410, 2022-07-14)"
   xmlns:inkscape="http://www.inkscape.org/namespaces/inkscape"
   xmlns:sodipodi="http://sodipodi.sourceforge.net/DTD/sodipodi-0.dtd"
   xmlns="http://www.w3.org/2000/svg"
   xmlns:svg="http://www.w3.org/2000/svg">
  <defs
     id="defs651" />
  <sodipodi:namedview
     id="namedview649"
     pagecolor="#ffffff"
     bordercolor="#666666"
     borderopacity="1.0"
     inkscape:showpageshadow="2"
     inkscape:pageopacity="0.0"
     inkscape:pagecheckerboard="0"
     inkscape:deskcolor="#d1d1d1"
     showgrid="true"
     inkscape:zoom="14.34375"
     inkscape:cx="31.965142"
     inkscape:cy="32"
     inkscape:current-layer="svg647">
    <inkscape:grid
       type="xygrid"
       id="grid770" />
  </sodipodi:namedview>
  <path
     d="m7.4083336 1.0583334c-3.506891 0-6.3500002 1.1058372-6.3500002 2.4696168v1.9755901c0 1.3637793 2.8431092 2.4691 6.3500002 2.4691.7700703 0 1.5081388-.0532678 2.1910808-.1508952.0749256-.0765883.1653059-.1401635.269751-.1834513l1.0040736-.4159953c.276036-.1142802.582511-.0650948.807702.1080037 1.276087-.4516041 2.076876-1.1028471 2.076876-1.8267619v-1.9502687-.0253214c0-1.3637796-2.842592-2.4696168-6.3494834-2.4696168zm0 1.4820801c2.9341414 0 4.8501454.9485556 5.7505534 1.6955038-.898372.6127572-2.809126 1.3100091-5.7505534 1.267623-2.9123781-.0421376-4.8232633-.7280752-5.7319501-1.3125815.9036681-.7496654 2.8031693-1.6505453 5.7319501-1.6505453zm-6.3500002 4.4446901v2.4691001c0 1.3637813 2.8431057 2.4696163 6.3500002 2.4696163.0710953 0 .1413423-.001165.2118734-.002067l-.0620117-.03669c-.3489384-.206883-.4929526-.639731-.3374471-1.014408l.4159953-1.0040734c.0800942-.1937652.2276305-.3409936.40566-.4247803-.2086401.0080459-.4199827.0124024-.6340699.0124024-3.5068945 0-6.3500002-1.1053192-6.3500002-2.4691001zm12.6994836 0c0 .0583448-.005785.1163005-.01602.1736328.005299.0001716.01071.0007602.01602.0010336zm-4.1847575 2.3218222c-.2952034.0416229-.6009266.0748558-.9146729.0992188l.8542114.2185913.1126547-.1121379zm-8.5147261 1.6288412v2.469617c0 1.36378 2.8431057 2.469617 6.3500002 2.469617.7467873 0 1.4630489-.050523 2.1285524-.142627l.0883667-.345199-.1126547-.112655-.920874.233578c-.3924765.099755-.7978721-.103378-.9529135-.47749l-.4159953-1.004073c-.0853193-.2061-.0802148-.428995-.0005167-.622701-3.420581-.038404-6.1639651-1.128561-6.1639651-2.468067zm12.0736816 1.070219c-.353133.285208-.843029.539393-1.436604.750859a.81496297.81499319 0 0 0 .754476.507979.81496297.81499319 0 0 0 .814937-.814937.81496297.81499319 0 0 0 -.132809-.443901z"
     fill="#00aad4"
     stroke-linecap="round"
     stroke-linejoin="round"
     stroke-miterlimit="5.6"
     stroke-width=".529168"
     id="path643" />
  <path
     d="m10.180735 8.3909446.348948 1.3693407-.7682492.7684907-1.3710949-.348653-.4157861 1.003833 1.216037.723012-.0001508 1.086659-1.2149776.721518.41583 1.00394 1.36929-.348961.7684626.768277-.348641 1.371147 1.003796.415801.722985-1.216082 1.08662.000151.72149 1.215023 1.003903-.415846-.348947-1.369341.768249-.768491 1.371095.348654.415786-1.003833-1.216037-.723012.000151-1.086659 1.214977-.721518-.41583-1.00394-1.36929.34896-.768462-.7682772.34864-1.3711462-1.003796-.4158015-.722984 1.216082-1.08662-.0001508-.721491-1.2150226zm1.645486 2.5529134a1.6299259 1.6299864 0 0 1 2.1296.882143 1.6299259 1.6299864 0 0 1 -.882109 2.12968 1.6299259 1.6299864 0 0 1 -2.129601-.882142 1.6299259 1.6299864 0 0 1 .88211-2.129681z"
     fill="#ff7f00"
     stroke-width=".529166"
     id="path645" />
</svg>
