<svg width="48" height="48" version="1.1" xmlns="http://www.w3.org/2000/svg">
 <defs>
  <radialGradient id="a" cx="12.1" cy="10.900001" r="4.5" gradientTransform="matrix(0,3.0437711,-3.0437707,5e-8,64.568011,-5.438724)" gradientUnits="userSpaceOnUse">
   <stop stop-color="#5599ff" offset="0"/>
   <stop stop-color="#0055d4" offset="1"/>
  </radialGradient>
 </defs>
 <g stroke="#ffffff" stroke-linecap="round">
  <circle transform="matrix(0,1,1,0,0,0)" cx="35.5" cy="35.5" r="11.3" fill="url(#a)" stroke-dashoffset="1.49998" stroke-linejoin="round" stroke-width="2.4"/>
  <path d="m36.249632 40.624761 5.249875-5.249657-5.249875-5.250089" fill="none" stroke-linejoin="round" stroke-width="2.99991"/>
  <path d="m41.499504 35.375076h-11.99971" fill="none" stroke-width="2.99991px"/>
 </g>
</svg>
