<?xml version="1.0" encoding="UTF-8" standalone="no"?>
<svg
   height="16"
   width="16"
   version="1.1"
   id="svg2"
   sodipodi:docname="qrybtn_import.svg"
   inkscape:export-filename="qrybtn_import.png"
   inkscape:export-xdpi="96"
   inkscape:export-ydpi="96"
   inkscape:version="1.3-beta (cedbd6c6ff, 2023-05-28)"
   xmlns:inkscape="http://www.inkscape.org/namespaces/inkscape"
   xmlns:sodipodi="http://sodipodi.sourceforge.net/DTD/sodipodi-0.dtd"
   xmlns="http://www.w3.org/2000/svg"
   xmlns:svg="http://www.w3.org/2000/svg">
  <defs
     id="defs2" />
  <sodipodi:namedview
     id="namedview2"
     pagecolor="#ffffff"
     bordercolor="#000000"
     borderopacity="0.25"
     inkscape:showpageshadow="2"
     inkscape:pageopacity="0.0"
     inkscape:pagecheckerboard="0"
     inkscape:deskcolor="#d1d1d1"
     showgrid="true"
     inkscape:current-layer="svg2">
    <inkscape:grid
       id="grid2"
       units="px"
       originx="0"
       originy="0"
       spacingx="0.5"
       spacingy="0.5"
       empcolor="#0099e5"
       empopacity="0.30196078"
       color="#0099e5"
       opacity="0.14901961"
       empspacing="2"
       dotted="false"
       gridanglex="30"
       gridanglez="30"
       visible="true" />
  </sodipodi:namedview>
  <rect
     fill="#ebfcff"
     height="13.000003"
     ry="1.7333338"
     width="11"
     x="-14.500002"
     y="1.5"
     id="rect2"
     style="stroke:#00aad4;stroke-width:0.999997;stroke-linejoin:round"
     transform="scale(-1,1)" />
  <path
     style="fill:none;stroke:#00aad4;stroke-linejoin:round;stroke-opacity:1"
     d="M 14.000001,2.5 H 4.0000015"
     id="path1"
     sodipodi:nodetypes="cc" />
  <g
     id="g12"
     transform="translate(-17,3)">
    <g
       id="g11">
      <path
         d="m 18.5,5.5 h 9"
         id="path10"
         style="fill:none;stroke:#ffffff;stroke-width:3;stroke-linecap:round;stroke-linejoin:round;stroke-dasharray:none" />
      <path
         d="m 25.000031,8 2.5,-2.5 -2.5,-2.5"
         id="path11"
         style="fill:none;stroke:#ffffff;stroke-width:3;stroke-linecap:round;stroke-linejoin:round;stroke-dasharray:none" />
    </g>
    <path
       d="m 18.5,5.5 h 9"
       id="path411"
       style="fill:none;stroke:#00aad4;stroke-linecap:round;stroke-linejoin:round" />
    <path
       d="m 25.000031,8 2.5,-2.5 -2.5,-2.5"
       id="path413"
       style="fill:none;stroke:#00aad4;stroke-linecap:round;stroke-linejoin:round" />
  </g>
</svg>
