<?xml version="1.0" encoding="UTF-8" standalone="no"?>
<svg
   height="64"
   width="64"
   version="1.1"
   id="svg723"
   sodipodi:docname="Font_03_64.svg"
   inkscape:export-filename="Font_03_64.png"
   inkscape:export-xdpi="96"
   inkscape:export-ydpi="96"
   inkscape:version="1.2 (dc2aedaf03, 2022-05-15)"
   xmlns:inkscape="http://www.inkscape.org/namespaces/inkscape"
   xmlns:sodipodi="http://sodipodi.sourceforge.net/DTD/sodipodi-0.dtd"
   xmlns="http://www.w3.org/2000/svg"
   xmlns:svg="http://www.w3.org/2000/svg">
  <defs
     id="defs727" />
  <sodipodi:namedview
     id="namedview725"
     pagecolor="#ffffff"
     bordercolor="#666666"
     borderopacity="1.0"
     inkscape:pageshadow="2"
     inkscape:pageopacity="0.0"
     inkscape:pagecheckerboard="0"
     inkscape:deskcolor="#d1d1d1"
     showgrid="true"
     inkscape:zoom="14.34375"
     inkscape:cx="28.583878"
     inkscape:cy="32"
     inkscape:current-layer="svg723"
     inkscape:showpageshadow="2">
    <inkscape:grid
       type="xygrid"
       id="grid846" />
  </sodipodi:namedview>
  <g
     id="g1131">
    <circle
       cx="46"
       cy="46"
       r="16"
       stroke-dashoffset="5.99992"
       stroke-linejoin="round"
       stroke-width="4"
       id="circle711"
       style="fill:none;stroke:#00aad4;stroke-linecap:round" />
    <path
       d="M 46.000001,37.999996 V 54.000001"
       id="path713"
       style="fill:none;stroke:#00aad4;stroke-width:4;stroke-linecap:round" />
    <path
       d="M 54.000003,45.999998 H 37.999998"
       id="path715"
       style="fill:none;stroke:#00aad4;stroke-width:4;stroke-linecap:round" />
  </g>
  <path
     id="path2-6"
     style="fill:#00aad4;stroke:none;stroke-width:15.0807"
     d="M 23.929877,2.9997385 3,61.000262 h 5.351612 l 5.820365,-16.054833 c 0.184281,-0.525616 0.681762,-0.879157 1.242195,-0.882817 h 9.647955 l 1.367292,-4.929736 h -8.296463 c -0.913784,-0.0036 -1.549545,-0.903232 -1.242207,-1.757828 l 8.867268,-24.773659 c 0.184322,-0.525621 0.68177,-0.879164 1.242207,-0.882824 0.560434,0.0037 1.057898,0.357203 1.242188,0.882824 L 34.02602,28.601221 38.48,26.307632 30.070556,2.9997385 Z"
     sodipodi:nodetypes="cccccccccccccccc" />
</svg>
