<?xml version="1.0" encoding="UTF-8" standalone="no"?>
<svg
   height="32"
   viewBox="0 0 8.4667 8.4667"
   width="32"
   version="1.1"
   id="svg449"
   sodipodi:docname="Window_16_32.svg"
   inkscape:version="1.2.2 (732a01da63, 2022-12-09)"
   xmlns:inkscape="http://www.inkscape.org/namespaces/inkscape"
   xmlns:sodipodi="http://sodipodi.sourceforge.net/DTD/sodipodi-0.dtd"
   xmlns="http://www.w3.org/2000/svg"
   xmlns:svg="http://www.w3.org/2000/svg">
  <defs
     id="defs453" />
  <sodipodi:namedview
     id="namedview451"
     pagecolor="#ffffff"
     bordercolor="#000000"
     borderopacity="0.25"
     inkscape:showpageshadow="2"
     inkscape:pageopacity="0.0"
     inkscape:pagecheckerboard="0"
     inkscape:deskcolor="#d1d1d1"
     showgrid="true"
     inkscape:zoom="28.4375"
     inkscape:cx="15.982418"
     inkscape:cy="16"
     inkscape:current-layer="svg449">
    <inkscape:grid
       type="xygrid"
       id="grid988" />
  </sodipodi:namedview>
  <rect
     fill="#f5f7ff"
     height="7.011486"
     rx=".582086"
     stroke="#00aad4"
     stroke-linejoin="round"
     stroke-width=".396877"
     width="7.011486"
     x=".727607"
     y=".727607"
     id="rect431" />
  <g
     fill="#00aad4"
     id="g447">
    <path
       d="m.79375312.79375312h6.87919378v1.05833748h-6.87919378z"
       fill-rule="evenodd"
       stroke-width=".529161"
       id="path433" />
    <g
       stroke-linecap="round"
       id="g445">
      <path
         d="m2.3812594 3.7041812.0000604.5291687c0 .2645842.6830626.5291687 1.8520303.5291687 1.1689682 0 1.8521207-.2645845 1.8520905-.5291687l-.0000602-.5291687c0 .2645843-.6830621.5291687-1.8520303.5291687-1.1689677 0-1.8520303-.2645844-1.8520907-.5291687z"
         stroke-linejoin="round"
         stroke-miterlimit="5.6"
         stroke-width=".352781"
         id="path435" />
      <ellipse
         cx="4.233349"
         cy="3.175013"
         rx="1.85203"
         ry=".529169"
         stroke-width=".211667"
         id="ellipse437" />
      <g
         stroke-linejoin="round"
         stroke-miterlimit="5.6"
         stroke-width=".352781"
         id="g443">
        <path
           d="m2.3812594 4.7625186.0000604.5291688c0 .2645844.6830626.5291689 1.8520303.5291689 1.1689682 0 1.8521207-.2645845 1.8520905-.5291689l-.0000602-.5291688c0 .2645844-.6830621.5291688-1.8520303.5291688-1.1689677 0-1.8520303-.2645844-1.8520907-.5291688z"
           id="path439" />
        <path
           d="m2.3812594 5.8208563.0000604.5291685c0 .2645844.6830626.5291689 1.8520303.5291689 1.1689682 0 1.8521207-.2645845 1.8520905-.5291689l-.0000602-.5291685c0 .2645843-.6830621.5291685-1.8520303.5291685-1.1689677 0-1.8520303-.2645842-1.8520907-.5291685z"
           id="path441" />
      </g>
    </g>
  </g>
</svg>
