<?xml version="1.0" encoding="UTF-8" standalone="no"?>
<svg
   height="64"
   viewBox="0 0 16.933333 16.933335"
   width="64"
   version="1.1"
   id="svg623"
   sodipodi:docname="Health_03_64.svg"
   inkscape:version="1.2.1 (9c6d41e410, 2022-07-14)"
   inkscape:export-filename="Health_03_64.png"
   inkscape:export-xdpi="96"
   inkscape:export-ydpi="96"
   xmlns:inkscape="http://www.inkscape.org/namespaces/inkscape"
   xmlns:sodipodi="http://sodipodi.sourceforge.net/DTD/sodipodi-0.dtd"
   xmlns:xlink="http://www.w3.org/1999/xlink"
   xmlns="http://www.w3.org/2000/svg"
   xmlns:svg="http://www.w3.org/2000/svg">
  <defs
     id="defs627">
    <radialGradient
       inkscape:collect="always"
       xlink:href="#linearGradient1041"
       id="radialGradient1043"
       cx="1.9253448"
       cy="1.5859377"
       fx="1.9253448"
       fy="1.5859377"
       r="1.8520745"
       gradientTransform="matrix(1.0708493,4.5255179,-6.3469145,1.5205618,14.232617,-4.3018883)"
       gradientUnits="userSpaceOnUse" />
    <linearGradient
       inkscape:collect="always"
       id="linearGradient1041">
      <stop
         style="stop-color:#ffaaaa;stop-opacity:1"
         offset="0"
         id="stop1037" />
      <stop
         style="stop-color:#ff0000;stop-opacity:1"
         offset="1"
         id="stop1039" />
    </linearGradient>
    <linearGradient
       id="a"
       gradientUnits="userSpaceOnUse"
       x1="28.381756"
       x2="18.618242"
       y1="28.381756"
       y2="18.618242"
       gradientTransform="matrix(0.98581312,0,0,0.98581312,0.33339172,0.33339172)">
      <stop
         offset="0"
         stop-color="#009600"
         id="stop698" />
      <stop
         offset="1"
         stop-color="#6edb39"
         id="stop700" />
    </linearGradient>
    <linearGradient
       id="a-2"
       gradientUnits="userSpaceOnUse"
       x1="28.381756"
       x2="18.618242"
       y1="28.381756"
       y2="18.618242"
       gradientTransform="matrix(0.94740493,0,0,0.94740493,1.5359826,1.5359831)">
      <stop
         offset="0"
         stop-color="#009600"
         id="stop698-0" />
      <stop
         offset="1"
         stop-color="#6edb39"
         id="stop700-9" />
    </linearGradient>
  </defs>
  <sodipodi:namedview
     id="namedview625"
     pagecolor="#ffffff"
     bordercolor="#666666"
     borderopacity="1.0"
     inkscape:showpageshadow="2"
     inkscape:pageopacity="0.0"
     inkscape:pagecheckerboard="0"
     inkscape:deskcolor="#d1d1d1"
     showgrid="true"
     inkscape:zoom="14.34375"
     inkscape:cx="28.583878"
     inkscape:cy="32"
     inkscape:current-layer="svg623">
    <inkscape:grid
       type="xygrid"
       id="grid1262" />
  </sodipodi:namedview>
  <path
     id="path353"
     style="fill:url(#radialGradient1043);fill-opacity:1;stroke:#d40000;stroke-width:0.264583px;stroke-linecap:butt;stroke-linejoin:miter;stroke-opacity:1"
     d="m 4.7668607,1.1905316 c -3.93952814,0.00975 -6.8187199,7.246451 3.699687,14.5237054 13.8799603,-9.6029754 4.4293523,-19.13347 0,-12.0834214 C 7.3938147,1.923382 6.0258857,1.1874147 4.7668607,1.1905316 Z" />
  <g
     id="g4611"
     transform="scale(0.52916669)">
    <circle
       cx="23.799999"
       cy="23.799999"
       fill="url(#a)"
       stroke-dashoffset="1.49998"
       stroke-linejoin="round"
       stroke-width="1.37838"
       transform="matrix(0,1,1,0,0,0)"
       id="circle703"
       style="fill:url(#a-2);stroke:#ffffff;stroke-width:1.6;stroke-linecap:round;stroke-dasharray:none"
       r="7.4000006" />
    <path
       d="m 23.799999,20.099998 v 7.4"
       id="path808"
       style="fill:none;stroke:#ffffff;stroke-width:1.6;stroke-linecap:round;stroke-dasharray:none" />
    <path
       d="m 27.499999,23.799998 h -7.4"
       id="path810"
       style="fill:none;stroke:#ffffff;stroke-width:1.6;stroke-linecap:round;stroke-dasharray:none" />
    <rect
       style="fill:none;stroke:none;stroke-width:1.5;stroke-linecap:round;stroke-linejoin:round;stroke-miterlimit:5.6"
       id="rect4236"
       width="17"
       height="17"
       x="15"
       y="15" />
  </g>
</svg>
