<?xml version="1.0" encoding="UTF-8" standalone="no"?>
<svg
   height="16"
   width="16"
   version="1.1"
   id="svg159"
   sodipodi:docname="Folder_13_16.svg"
   inkscape:export-filename="Folder_13_16.png"
   inkscape:export-xdpi="96"
   inkscape:export-ydpi="96"
   inkscape:version="1.2 (dc2aedaf03, 2022-05-15)"
   xml:space="preserve"
   xmlns:inkscape="http://www.inkscape.org/namespaces/inkscape"
   xmlns:sodipodi="http://sodipodi.sourceforge.net/DTD/sodipodi-0.dtd"
   xmlns="http://www.w3.org/2000/svg"
   xmlns:svg="http://www.w3.org/2000/svg"><defs
     id="defs163"><radialGradient
       id="a"
       cx="4.1671958"
       cy="1041.9056"
       gradientTransform="matrix(0.05663639,-0.5662834,0.5401235,0.05401522,-554.49376,-44.418944)"
       gradientUnits="userSpaceOnUse"
       r="9"><stop
         offset="0"
         stop-color="#acf"
         id="stop254" /><stop
         offset="1"
         stop-color="#fff"
         id="stop256" /></radialGradient><radialGradient
       id="a-9"
       cx="4.1671958"
       cy="1041.9056"
       gradientTransform="matrix(0.04530909,-0.45302663,0.43209871,0.04321216,-439.09492,-31.435145)"
       gradientUnits="userSpaceOnUse"
       r="9"><stop
         offset="0"
         stop-color="#acf"
         id="stop254-1" /><stop
         offset="1"
         stop-color="#fff"
         id="stop256-4" /></radialGradient></defs><sodipodi:namedview
     id="namedview161"
     pagecolor="#ffffff"
     bordercolor="#666666"
     borderopacity="1.0"
     inkscape:pageshadow="2"
     inkscape:pageopacity="0.0"
     inkscape:pagecheckerboard="0"
     inkscape:deskcolor="#d1d1d1"
     showgrid="true"
     inkscape:zoom="57.375"
     inkscape:cx="7.9912854"
     inkscape:cy="8"
     inkscape:current-layer="svg159"
     inkscape:showpageshadow="2"><inkscape:grid
       type="xygrid"
       id="grid836" /></sodipodi:namedview><g
     id="g907"
     transform="translate(0,-1)"><path
       d="m 0.5,14.5 -1e-7,-11 c 0,-0.5 0.5,-1 1.0000002,-1 h 3 c 0.5,0 1,0.5 1,1 H 13.5 v 3"
       stroke-linejoin="round"
       id="path145-8"
       style="fill:#fff3cc;stroke:#f4c025;stroke-linecap:round"
       sodipodi:nodetypes="ccccccc" /><path
       d="m 15.5,6.5 h -13 l -2,8 h 13 z"
       stroke-linejoin="round"
       id="path147"
       style="fill:#f4c025;fill-opacity:1;stroke:#f4c025;stroke-linecap:round"
       sodipodi:nodetypes="ccccc" /></g><g
     id="g3145"><circle
       cx="10.5"
       cy="10.5"
       fill="none"
       r="5.000001"
       stroke="#ffffff"
       stroke-linecap="round"
       stroke-linejoin="round"
       stroke-width="0.999998"
       id="circle265" /><circle
       cx="10.5"
       cy="10.5"
       fill="url(#a)"
       r="4"
       stroke="#4d4d4d"
       stroke-linecap="round"
       stroke-linejoin="round"
       stroke-width="1"
       id="circle259"
       style="fill:url(#a-9)" /><path
       d="m 10,8 h 1 v 2 h 1.5 v 1 H 10 Z"
       fill="#666666"
       fill-rule="evenodd"
       id="path261"
       style="stroke-width:1.01851"
       sodipodi:nodetypes="ccccccc" /></g></svg>
