<?xml version="1.0" encoding="UTF-8" standalone="no"?>
<svg
   height="16"
   viewBox="0 0 4.2333332 4.2333335"
   width="16"
   version="1.1"
   id="svg6"
   sodipodi:docname="Font_19_16.svg"
   inkscape:version="1.2 (dc2aedaf03, 2022-05-15)"
   inkscape:export-filename="Font_19_16.png"
   inkscape:export-xdpi="96"
   inkscape:export-ydpi="96"
   xmlns:inkscape="http://www.inkscape.org/namespaces/inkscape"
   xmlns:sodipodi="http://sodipodi.sourceforge.net/DTD/sodipodi-0.dtd"
   xmlns="http://www.w3.org/2000/svg"
   xmlns:svg="http://www.w3.org/2000/svg">
  <defs
     id="defs10" />
  <sodipodi:namedview
     id="namedview8"
     pagecolor="#ffffff"
     bordercolor="#666666"
     borderopacity="1.0"
     inkscape:showpageshadow="2"
     inkscape:pageopacity="0.0"
     inkscape:pagecheckerboard="0"
     inkscape:deskcolor="#d1d1d1"
     showgrid="true"
     inkscape:zoom="57.375"
     inkscape:cx="5.9520697"
     inkscape:cy="8"
     inkscape:current-layer="svg6">
    <inkscape:grid
       type="xygrid"
       id="grid135" />
  </sodipodi:namedview>
  <path
     id="path4"
     style="fill:#00aad4;fill-opacity:1;stroke:none"
     d="M 0.79375,3.7041667 V 3.96875 H 3.4394531 V 3.7041667 Z M 2.1166667,3.4395833 c -0.6614585,0 -1.0583334,-0.396875 -1.0583334,-1.0583333 V 0.26458333 h 0.396875 V 2.38125 c 0.00703,0.396875 0.2645832,0.6614583 0.6614584,0.6614583 0.3968749,0 0.6614587,-0.2645833 0.6614583,-0.6614583 l -2e-6,-2.11666667 H 3.175 V 2.38125 c 0,0.6614583 -0.396875,1.0583333 -1.0583333,1.0583333 z"
     sodipodi:nodetypes="cccccsscccssccss" />
</svg>
