<svg width="32" height="32" version="1.1" xmlns="http://www.w3.org/2000/svg">
 <path d="m13 4c-2.67111 0-5 1.0078088-5 4v5c0 1.229661-0.7011888 1.800781-2 1.800781v2.398438c1.2988112 0 2 0.57112 2 1.800781v5c0 2.992192 2.32889 4 5 4v-2.199218c-1.880018-0.0146-2.601562-0.693026-2.601562-1.800782v-5c0-1.737503-0.7514514-3-1.398438-3 0.6469866 0 1.398438-1.262497 1.398438-3v-5c0-1.107757 0.721544-1.7862266 2.601562-1.8007812z" fill="#00aad4" stroke-width=".991802"/>
 <path d="m19 4c2.67111 0 5 1.0078088 5 4v5c0 1.229661 0.701188 1.800781 2 1.800781v2.398438c-1.298812 0-2 0.57112-2 1.800781v5c0 2.992192-2.32889 4-5 4v-2.199218c1.880018-0.0146 2.601562-0.693026 2.601562-1.800782v-5c0-1.737503 0.751452-3 1.398438-3-0.646986 0-1.398438-1.262497-1.398438-3v-5c0-1.107757-0.721544-1.7862266-2.601562-1.8007812z" fill="#00aad4" stroke-width=".991802"/>
</svg>
