<?xml version="1.0" encoding="UTF-8" standalone="no"?>
<svg
   width="24"
   height="24"
   clip-rule="evenodd"
   fill-rule="evenodd"
   image-rendering="optimizeQuality"
   shape-rendering="geometricPrecision"
   text-rendering="geometricPrecision"
   version="1.1"
   viewBox="0 0 692.47 692.47"
   id="svg11"
   sodipodi:docname="tjsonrpcdispatcher.svg"
   inkscape:export-filename="tjsonrpcdispatcher.png"
   inkscape:export-xdpi="96"
   inkscape:export-ydpi="96"
   inkscape:version="1.3.2 (091e20e, 2023-11-25, custom)"
   xmlns:inkscape="http://www.inkscape.org/namespaces/inkscape"
   xmlns:sodipodi="http://sodipodi.sourceforge.net/DTD/sodipodi-0.dtd"
   xmlns="http://www.w3.org/2000/svg"
   xmlns:svg="http://www.w3.org/2000/svg">
  <defs
     id="defs11" />
  <sodipodi:namedview
     id="namedview11"
     pagecolor="#ffffff"
     bordercolor="#000000"
     borderopacity="0.25"
     inkscape:showpageshadow="2"
     inkscape:pageopacity="0.0"
     inkscape:pagecheckerboard="0"
     inkscape:deskcolor="#d1d1d1"
     showgrid="true"
     inkscape:current-layer="svg11">
    <inkscape:grid
       id="grid11"
       units="px"
       originx="0"
       originy="0"
       spacingx="14.426458"
       spacingy="14.426458"
       empcolor="#0099e5"
       empopacity="0.30196078"
       color="#0099e5"
       opacity="0.14901961"
       empspacing="2"
       dotted="false"
       gridanglex="30"
       gridanglez="30"
       visible="true" />
  </sodipodi:namedview>
  <rect
     x="14.426"
     y="14.426"
     width="663.62"
     height="663.62"
     rx="57.706"
     fill="#fff"
     stroke="#b3b3b3"
     stroke-dashoffset="1.5"
     stroke-linecap="round"
     stroke-linejoin="round"
     stroke-width="28.853"
     id="rect1" />
  <g
     transform="matrix(.80389521 0 0 .80389521 58.060556 -24.248845)"
     clip-rule="evenodd"
     fill="#e31e24"
     fill-rule="nonzero"
     image-rendering="optimizeQuality"
     shape-rendering="geometricPrecision"
     id="g4">
    <path
       d="m144.36 461.65h28.755v89.967c0 11.766-1.0247 20.823-3.1066 27.17-2.776 8.2625-7.7999 14.907-15.105 19.931-7.2717 4.9911-16.889 7.503-28.854 7.503-14.014 0-24.789-3.8999-32.324-11.734-7.5696-7.8325-11.37-19.335-11.437-34.473l27.17-3.1732c.33066 8.0977 1.4873 13.816 3.5365 17.155 3.0739 5.0893 7.7344 7.635 14.014 7.635 6.3124 0 10.808-1.8179 13.419-5.4865 2.6112-3.637 3.9326-11.205 3.9326-22.707v-91.785z"
       id="path1" />
    <path
       d="m199.03 557.63 27.962-2.776c1.6858 9.3537 5.0577 16.195 10.181 20.592 5.1231 4.3964 12.03 6.5777 20.724 6.5777 9.1889 0 16.13-1.95 20.789-5.8499 4.6605-3.8999 7.0077-8.4611 7.0077-13.684 0-3.3718-.99196-6.2144-2.9419-8.5942-1.95-2.346-5.3872-4.3953-10.279-6.115-3.3379-1.1905-10.94-3.2386-22.839-6.2143-15.303-3.8333-26.046-8.5277-32.225-14.113-8.6935-7.8325-13.023-17.385-13.023-28.657 0-7.2378 2.0503-14.047 6.115-20.359 4.0996-6.3125 9.9822-11.106 17.683-14.41 7.7017-3.3052 16.956-4.9584 27.862-4.9584 17.748 0 31.136 3.9338 40.093 11.833 8.9903 7.8991 13.683 18.409 14.147 31.598l-28.755.99189c-1.2232-7.3371-3.8344-12.593-7.8336-15.798-3.9992-3.207-10.015-4.8252-18.013-4.8252-8.2624 0-14.741 1.7186-19.401 5.1559-3.0072 2.2151-4.5284 5.157-4.5284 8.8583 0 3.3707 1.4218 6.2471 4.2632 8.627 3.6032 3.0739 12.362 6.2471 26.276 9.5512 13.915 3.2725 24.194 6.7097 30.838 10.214 6.677 3.5365 11.898 8.3279 15.667 14.443 3.7679 6.115 5.6524 13.651 5.6524 22.608 0 8.1304-2.2478 15.765-6.7752 22.871-4.5285 7.107-10.908 12.395-19.171 15.832-8.2624 3.47-18.575 5.1897-30.904 5.1897-17.947 0-31.73-4.1324-41.348-12.428-9.6178-8.2625-15.336-20.327-17.22-36.159z"
       id="path2" />
    <path
       d="m335.79 533.5c0-14.477 2.1814-26.64 6.5112-36.489 3.207-7.2378 7.635-13.749 13.221-19.501 5.5858-5.7505 11.701-10.015 18.343-12.824 8.8584-3.7352 19.072-5.6197 30.64-5.6197 20.955 0 37.679 6.5111 50.272 19.501 12.56 13.023 18.839 31.102 18.839 54.271 0 22.972-6.247 40.951-18.707 53.908-12.461 12.99-29.152 19.468-50.008 19.468-21.121 0-37.944-6.4457-50.405-19.369-12.46-12.89-18.707-30.672-18.707-53.346zm29.548-.95804c0 16.096 3.7352 28.292 11.173 36.623 7.4364 8.2952 16.889 12.46 28.325 12.46 11.47 0 20.856-4.1324 28.226-12.361 7.3372-8.2625 11.007-20.626 11.007-37.118 0-16.295-3.5704-28.458-10.742-36.457-7.1397-8.0323-16.625-12.031-28.491-12.031-11.833 0-21.385 4.0658-28.624 12.164-7.2378 8.1316-10.874 20.361-10.874 36.721z"
       id="path3" />
    <path
       transform="matrix(.11284 0 0 .11284 -37.154 -52.712)"
       d="m5444.4 5816.4-509.94-827.15v827.15h-235.49v-1258.3h246.63l517.84 843.25v-843.25h235.49v1258.3z"
       id="path4" />
  </g>
  <g
     fill="#04a"
     id="g7">
    <path
       d="m294.03014 605.91125h-22.37409l-18.43045-30.90521q-2.49496-4.26557-4.90943-7.24342-2.33398-3.05833-4.82893-4.9899-2.41447-1.93158-5.31184-2.81688-2.89737-0.88531-6.51907-0.88531h-7.7263v46.84072h-19.07432v-115.41167h37.98767q8.12871 0 14.96971 1.93158 6.84099 1.93157 11.91139 5.87521 5.07038 3.86315 7.88726 9.73836 2.89737 5.79473 2.89737 13.60151 0 6.11667-1.8511 11.26753-1.77061 5.0704-5.15087 9.09451-3.29978 3.94363-8.04823 6.76052-4.66798 2.81688-10.54319 4.34604v0.32192q3.13881 1.77062 5.4728 3.94364 2.33399 2.09254 4.42653 4.34605 2.09254 2.2535 4.1046 5.15087 2.09254 2.81688 4.58749 6.59955zm-70.10011-99.87858v37.50477h15.9355q4.42653 0 8.12871-1.36819 3.78267-1.3682 6.51907-3.94364t4.26557-6.27762q1.52916-3.7022 1.52916-8.28968 0-8.28969-5.23135-12.95766-5.23135-4.66798-15.05019-4.66798z"
       stroke-width="30.9052"
       id="path5" />
    <path
       d="m345.11228 564.06044v41.85081h-19.07432v-115.41167h35.00981q19.87913 0 30.82473 9.25547 10.94559 9.25548 10.94559 26.07627 0 16.82081-11.42849 27.52497-11.42848 10.70415-30.90521 10.70415zm0-57.78632v42.17275h12.39427q12.3138 0 18.75238-5.71425 6.43859-5.71425 6.43859-16.09647 0-20.36203-23.66181-20.36203z"
       stroke-width="30.9052"
       id="path6" />
    <path
       d="m512.01432 599.36987q-12.61585 6.54156-31.38387 6.54156-24.2972 0-38.93781-15.3415-14.64062-15.3415-14.64062-40.2617 0-26.78921 16.43175-43.29884 16.50964-16.50963 41.66346-16.50963 16.19813 0 26.86709 4.59466v18.37865q-11.29197-6.6973-24.9202-6.6973-18.14502 0-29.43699 11.60347-11.21408 11.60346-11.21408 30.99449 0 18.45651 10.51321 29.43698 10.5132 10.90259 27.64584 10.90259 15.80875 0 27.41222-7.47606z"
       stroke-width="29.9043"
       id="path7" />
  </g>
  <path
     d="m177.93594 178.93115c6.00851-.14296 10.90263-1.57843 14.68263-4.3783 3.78-2.76295 6.32624-6.56725 7.55999-11.37624 1.23372-4.84475 1.91005-13.09888 1.98965-24.79775.0401-11.69888.23886-19.41476.59677-23.14703.71579-5.88565 1.98966-10.58589 3.89971-14.17433 1.86987-3.552876 4.21746-6.42408 7.00332-8.576893 2.78513-2.117367 6.36566-3.768918 10.70264-4.88096 2.94433-.681862 7.71865-1.040897 14.40331-1.040897h6.48546v16.57978h-3.58133c-7.99733 0-13.2893 1.32745-15.91531 3.94748-2.58645 2.61933-3.89972 8.46871-3.89972 17.5846 0 18.33803-.43753 29.92937-1.3126 34.77399-1.39293 7.50016-3.81939 13.2777-7.20196 17.33259-3.42207 4.05554-8.75332 7.68026-16.07464 10.80225 8.63398 3.23005 14.88129 8.14607 18.78063 14.74896 3.85886 6.6029 5.80839 17.44077 5.80839 32.47737 0 13.63723.0796 21.7464.23885 24.3313.6362 4.77291 2.18834 8.07479 4.69444 9.97689 2.547 1.90195 7.48133 2.83542 14.84131 2.83542h3.62146v16.57978h-6.52565c-7.59932 0-13.13064-.57446-16.55197-1.68718-4.93404-1.61471-9.07197-4.19846-12.33397-7.82344-3.2628-3.58844-5.37159-8.14607-6.32698-13.67223-.99488-5.52655-1.512-14.60578-1.59087-27.20193-.0796-12.59615-.756-21.31622-1.98966-26.12584-1.23366-4.84476-3.70105-8.6488-7.44066-11.44752-3.77991-2.79923-8.59396-4.27024-14.56261-4.41387v-17.22567z"
     clip-rule="evenodd"
     fill="#1f1b20"
     fill-rule="nonzero"
     image-rendering="optimizeQuality"
     shape-rendering="geometricPrecision"
     stroke-width=".069367"
     id="path8" />
  <path
     d="m514.54367 178.93115c-6.00851-.14296-10.90264-1.57843-14.68263-4.37829-3.77998-2.76296-6.32624-6.56726-7.55998-11.37625-1.23374-4.84474-1.91007-13.09888-1.98965-24.79776-.0401-11.69888-.23887-19.41476-.59676-23.14703-.71582-5.88565-1.98968-10.58588-3.89974-14.17433-1.86992-3.552872-4.21745-6.424071-7.00332-8.576883-2.78512-2.117367-6.36572-3.768918-10.70263-4.88096-2.94433-.681862-7.71865-1.040897-14.4033-1.040897h-6.48545v16.57978h3.58126c7.99732 0 13.2893 1.32745 15.91529 3.94747 2.58646 2.61933 3.89973 8.46872 3.89973 17.58462 0 18.33803.43754 29.92935 1.31259 34.77398 1.39292 7.50016 3.81938 13.2777 7.20199 17.33259 3.42206 4.05553 8.75331 7.68025 16.07462 10.80225-8.63399 3.23004-14.8813 8.14607-18.78062 14.74896-3.85887 6.60289-5.80838 17.44077-5.80838 32.47737 0 13.63723-.0796 21.74639-.23885 24.33129-.6362 4.77291-2.1884 8.0748-4.69445 9.97689-2.547 1.90195-7.48132 2.83543-14.84131 2.83543h-3.62146v16.57978h6.52566c7.59931 0 13.13064-.57446 16.55196-1.68719 4.93405-1.61471 9.07198-4.19846 12.33397-7.82343 3.2628-3.58845 5.37159-8.14608 6.32699-13.67224.99486-5.52655 1.512-14.60577 1.59085-27.20192.0796-12.59615.75601-21.31623 1.98968-26.12585 1.23372-4.84476 3.70106-8.64879 7.44064-11.44752 3.78-2.79923 8.59398-4.27023 14.56264-4.41386v-17.22568z"
     clip-rule="evenodd"
     fill="#1f1b20"
     fill-rule="nonzero"
     image-rendering="optimizeQuality"
     shape-rendering="geometricPrecision"
     stroke-width=".069368"
     id="path9" />
  <g
     transform="translate(-158.69585)"
     fill="none"
     stroke="#0097bd"
     stroke-linecap="round"
     stroke-width="28.8529"
     id="g11">
    <path
       d="m504.92604 129.83813v144.26457"
       id="path10" />
    <path
       d="m504.92604 274.1027 57.70584-57.70583m-57.70584 57.70583-57.70583-57.70583"
       id="path11" />
  </g>
</svg>
