<?xml version="1.0" encoding="UTF-8" standalone="no"?>
<svg
   width="48"
   height="48"
   version="1.1"
   viewBox="0 0 48 48"
   id="svg40"
   sodipodi:docname="win_sourceeditor_ico_048.svg"
   inkscape:export-filename="win_sourceeditor_ico_048.png"
   inkscape:export-xdpi="96"
   inkscape:export-ydpi="96"
   inkscape:version="1.1.1 (3bf5ae0d25, 2021-09-20)"
   xmlns:inkscape="http://www.inkscape.org/namespaces/inkscape"
   xmlns:sodipodi="http://sodipodi.sourceforge.net/DTD/sodipodi-0.dtd"
   xmlns:xlink="http://www.w3.org/1999/xlink"
   xmlns="http://www.w3.org/2000/svg"
   xmlns:svg="http://www.w3.org/2000/svg">
  <defs
     id="defs44">
    <linearGradient
       y2="1029.3622"
       x2="37"
       y1="1029.3622"
       x1="34"
       gradientTransform="matrix(1.1614663,0,0,0.92373427,-36.282499,-935.7373)"
       gradientUnits="userSpaceOnUse"
       id="linearGradient894"
       xlink:href="#linearGradient1149"
       inkscape:collect="always" />
    <linearGradient
       id="linearGradient1149"
       inkscape:collect="always">
      <stop
         id="stop1145"
         offset="0"
         style="stop-color:#999999;stop-opacity:1" />
      <stop
         style="stop-color:#ffffff;stop-opacity:1"
         offset="0.49999997"
         id="stop1153" />
      <stop
         id="stop1147"
         offset="1"
         style="stop-color:#999999;stop-opacity:1" />
    </linearGradient>
    <linearGradient
       y2="1027.3622"
       x2="37"
       y1="1027.3622"
       x1="34"
       gradientTransform="matrix(1.1614663,0,0,0.92373427,-36.282499,-935.7373)"
       gradientUnits="userSpaceOnUse"
       id="linearGradient896"
       xlink:href="#linearGradient1169"
       inkscape:collect="always" />
    <linearGradient
       id="linearGradient1169"
       inkscape:collect="always">
      <stop
         id="stop1165"
         offset="0"
         style="stop-color:#aa0000;stop-opacity:1" />
      <stop
         style="stop-color:#ff0000;stop-opacity:1"
         offset="0.51070523"
         id="stop1173" />
      <stop
         id="stop1167"
         offset="1"
         style="stop-color:#aa0000;stop-opacity:1" />
    </linearGradient>
    <linearGradient
       y2="1033.8622"
       x2="37"
       y1="1033.8622"
       x1="34"
       gradientTransform="matrix(1.1614663,0,0,0.92373427,-36.282499,-936.9316)"
       gradientUnits="userSpaceOnUse"
       id="linearGradient898"
       xlink:href="#linearGradient1207"
       inkscape:collect="always" />
    <linearGradient
       id="linearGradient1207"
       inkscape:collect="always">
      <stop
         id="stop1203"
         offset="0"
         style="stop-color:#a05a2c;stop-opacity:1" />
      <stop
         style="stop-color:#ffff00;stop-opacity:1;"
         offset="0.26457807"
         id="stop1211" />
      <stop
         id="stop1213"
         offset="0.75078517"
         style="stop-color:#ffff00;stop-opacity:1;" />
      <stop
         id="stop1205"
         offset="1"
         style="stop-color:#a05a2c;stop-opacity:1" />
    </linearGradient>
  </defs>
  <sodipodi:namedview
     id="namedview42"
     pagecolor="#ffffff"
     bordercolor="#666666"
     borderopacity="1.0"
     inkscape:pageshadow="2"
     inkscape:pageopacity="0.0"
     inkscape:pagecheckerboard="0"
     showgrid="false"
     inkscape:zoom="15.520833"
     inkscape:cx="8.5691277"
     inkscape:cy="24.000001"
     inkscape:current-layer="svg40" />
  <radialGradient
     id="a"
     cx="128"
     cy="126"
     r="141.76"
     gradientTransform="matrix(.19048 0 0 .19048 -.35853 -.00016)"
     gradientUnits="userSpaceOnUse">
    <stop
       stop-color="#f9c12c"
       offset="0"
       id="stop2" />
    <stop
       stop-color="#fff"
       offset="1"
       id="stop4" />
  </radialGradient>
  <radialGradient
     id="b"
     cx="127.99"
     cy="125.99"
     r="120.74"
     gradientTransform="matrix(.19048 0 0 .19048 -.35853 -.00016)"
     gradientUnits="userSpaceOnUse">
    <stop
       stop-color="#dca104"
       offset="0"
       id="stop7" />
    <stop
       stop-color="#f9c12c"
       offset=".56522"
       id="stop9" />
    <stop
       stop-color="#fff"
       offset="1"
       id="stop11" />
  </radialGradient>
  <path
     d="m39.354 38.623c0.68787 0.22257 1.969 0.05216 2.6857-0.52135 0.71667-0.57354 1.4012-1.7378 1.9012-2.6036 0.50004-0.86596 1.166-2.0408 1.3044-2.9484 0.13835-0.9075-0.35463-2.1021-0.89137-2.5865-2.1678-1.9566-2.8968-2.4204-2.8962-5.9646-5.72e-4 -3.5444 0.7283-4.008 2.8962-5.9646 0.53674-0.4844 1.0297-1.679 0.89137-2.5865-0.13842-0.90741-0.80448-2.0823-1.3044-2.9484-0.49996-0.86596-1.1845-2.0303-1.9012-2.6036-0.71672-0.57354-1.9977-0.74391-2.6857-0.52135-2.7785 0.89897-3.5446 1.2984-6.6139-0.47432-3.0699-1.7717-3.107-2.6347-3.7177-5.4903-0.15113-0.70697-0.93922-1.7312-1.7944-2.065-0.85509-0.33387-2.2055-0.34453-3.2055-0.34453s-2.3507 0.010658-3.2055 0.34453c-0.85509 0.33387-1.6433 1.3581-1.7944 2.065-0.61065 2.8556-0.64777 3.7187-3.7177 5.4903-3.0693 1.7727-3.8354 1.3733-6.6139 0.47432-0.68787-0.22257-1.969-0.052234-2.6857 0.52135-0.71674 0.57354-1.4012 1.7377-1.9012 2.6036-0.50004 0.86596-1.166 2.0408-1.3044 2.9484-0.13842 0.9075 0.35463 2.1019 0.8913 2.5865 2.1678 1.9566 2.8968 2.4204 2.8962 5.9646 5.714e-4 3.5444-0.72831 4.008-2.8962 5.9646-0.53667 0.4844-1.0296 1.679-0.8913 2.5865 0.13842 0.90741 0.8044 2.0823 1.3044 2.9484 0.49996 0.86596 1.1844 2.0303 1.9012 2.6036 0.71667 0.57354 1.9977 0.7439 2.6857 0.52135 2.7785-0.89897 3.5446-1.2984 6.6139 0.47432 3.0701 1.7717 3.107 2.6347 3.7177 5.4903 0.1512 0.70697 0.9393 1.7312 1.7944 2.065 0.85509 0.33387 2.2055 0.34453 3.2055 0.34453s2.3507-0.01067 3.2055-0.34453c0.85509-0.33387 1.6432-1.3581 1.7944-2.065 0.6107-2.8556 0.64777-3.7187 3.7177-5.4903 3.0695-1.7727 3.8354-1.3733 6.6139-0.47432z"
     fill="url(#a)"
     id="path14" />
  <path
     d="m40.045 18.001c-2.2232 1.7357-11.024 1.9989-15.024 3.9989-3.199 1.5996-3.5575 2.9912-6 8-1.3094 2.685-6.8535 3.8756-7.5442 4.2791-0.72507 0.42349-3.3566 2.976-4.5857 4.476 0.94994-0.01192 6.8299-0.56983 8.4131 0.34457 3.0701 1.7717 3.1061 2.6347 3.7168 5.4901 0.1512 0.70697 0.93985 1.7306 1.7949 2.0646 0.85509 0.33387 2.2051 0.34375 3.2051 0.34375s2.3501-0.0099 3.2051-0.34375c0.85509-0.33387 1.6437-1.3575 1.7949-2.0646 0.61065-2.8556 0.64678-3.7187 3.7168-5.4901 3.0693-1.7727 3.8368-1.3736 6.6152-0.47461 0.68787 0.22257 1.969 0.05209 2.6855-0.52149 0.71672-0.57354 1.4004-1.7375 1.9004-2.6034 0.50004-0.86596 1.1663-2.0417 1.3047-2.9491 0.13835-0.90741-0.35392-2.1015-0.89067-2.5859-2.1678-1.9566-2.8971-2.4206-2.8964-5.9648-5.71e-4 -3.5444 0.72859-4.0082 2.8964-5.9648 0.53674-0.4844 1.029-1.6785 0.89067-2.5859-0.06565-0.43177-0.67-2.2415-0.90004-2.7324-0.86179 1.4231-2.7994 4.1139-4.2985 5.2844z"
     fill="url(#b)"
     id="path16" />
  <path
     d="m39.514 38.777c0.69501 0.22488 1.9893 0.05272 2.7135-0.52676 0.7241-0.5795 1.4157-1.7558 1.921-2.6307 0.50518-0.87497 1.1782-2.0621 1.318-2.9789 0.13981-0.91684-0.3583-2.1238-0.90061-2.6133-2.1903-1.977-2.9269-2.4453-2.9263-6.0265-5.71e-4 -3.5811 0.73594-4.0497 2.9263-6.0265 0.54229-0.48945 1.0404-1.6964 0.90053-2.6133-0.13981-0.91684-0.81274-2.104-1.318-2.9789-0.50518-0.87497-1.1967-2.0512-1.921-2.6307-0.7241-0.57951-2.0185-0.75164-2.7135-0.52676-2.8072 0.90832-3.5813 1.3119-6.6827-0.47926-3.1019-1.7901-3.1394-2.6621-3.7564-5.5474-0.15272-0.71431-0.94901-1.7492-1.813-2.0865-0.8639-0.33733-2.2284-0.34811-3.2389-0.34811-1.0104 0-2.375 0.010798-3.2389 0.34811-0.86391 0.33733-1.6602 1.3722-1.813 2.0865-0.61697 2.8851-0.65452 3.7573-3.7564 5.5474-3.1013 1.7911-3.8752 1.3876-6.6827 0.47926-0.69509-0.22488-1.9895-0.05272-2.7135 0.52676-0.7241 0.57951-1.4157 1.7558-1.921 2.6307-0.50518 0.87497-1.1781 2.0621-1.318 2.9789-0.13981 0.91684 0.3583 2.1238 0.90061 2.6133 2.1903 1.977 2.9269 2.4453 2.9261 6.0265 6.286e-4 3.5811-0.73589 4.0497-2.9261 6.0265-0.54229 0.48945-1.0404 1.6964-0.90061 2.6133 0.13988 0.91684 0.8128 2.104 1.318 2.9789 0.50524 0.87497 1.1968 2.0512 1.921 2.6307 0.72417 0.5795 2.0185 0.75164 2.7135 0.52676 2.8072-0.90832 3.5813-1.3119 6.6827 0.47924 3.1019 1.7901 3.1394 2.6621 3.7564 5.5474 0.15279 0.71432 0.94909 1.7492 1.813 2.0865 0.86396 0.33733 2.2286 0.34811 3.2389 0.34811 1.0105 6e-6 2.375-0.0108 3.2389-0.34811 0.86398-0.33733 1.6603-1.3722 1.813-2.0865 0.61703-2.8851 0.65452-3.7573 3.7564-5.5474 3.1013-1.7911 3.8752-1.3876 6.6827-0.47926z"
     fill="none"
     stroke="#b26b00"
     stroke-linejoin="round"
     stroke-width="1.5238"
     id="path18" />
  <path
     d="m14.844 13.205c1.9794 0 3.492 0.52107 3.6619 2.5034 0.28724 3.3535 0.48781 5.5143-0.07589 7.1779-0.28208 0.8324-1.0867 2.7493-2.555 4.477-0.9204 1.083-1.5478 2.2219-1.3333 3.7602 0.1871 1.3415 0.30368 3.208 1.391 3.5286-0.11332 0.60777-0.23564 0.66457-0.76972 1.106-1.3015-0.50659-1.626-2.8225-1.7884-4.6231-0.14172-1.5709 0.27608-3.2368 1.6337-4.689 2.625-2.8078 3.317-5.2537 2.4749-7.7459-0.27821-0.82333-0.13992-0.76112-2.4983-0.64642-2.3584 0.1147-3.6413-1.694-4.1853-3.2425-0.58669-0.32478-1.8843 0.09666-2.7823 0.32105 0.76711-1.3125 4.6918-1.927 6.8271-1.927z"
     fill="#333"
     id="path20" />
  <ellipse
     transform="matrix(.99248 .12237 -.12137 .99261 0 0)"
     cx="16.66"
     cy="13.77"
     rx="2.6596"
     ry="1.5473"
     fill="#fff"
     id="ellipse22" />
  <path
     d="m24.022 8.7-0.49996 4.5 0.49996 3.5 0.50004-3.5z"
     fill="#333"
     id="path24" />
  <path
     d="m33.201 13.205c-1.9794 0-3.492 0.52107-3.6619 2.5034-0.28724 3.3535-0.48781 5.5143 0.07589 7.1779 0.28208 0.8324 1.0867 2.7493 2.555 4.477 0.9204 1.083 1.5478 2.2219 1.3333 3.7602-0.1871 1.3415-0.30368 3.208-1.391 3.5286 0.11332 0.60777 0.23564 0.66457 0.76972 1.106 1.3015-0.50659 1.626-2.8225 1.7884-4.6231 0.14172-1.5709-0.27608-3.2368-1.6337-4.689-2.625-2.8078-3.317-5.2537-2.4749-7.7459 0.27821-0.82333 0.13992-0.76112 2.4983-0.64642 2.3584 0.1147 3.6413-1.694 4.1853-3.2425 0.58669-0.32478 1.8843 0.09666 2.7823 0.32105-0.7671-1.3125-4.6918-1.927-6.8271-1.927z"
     fill="#333"
     id="path26" />
  <ellipse
     transform="matrix(-.99248 .12237 .12137 .99261 0 0)"
     cx="-31.028"
     cy="19.649"
     rx="2.6596"
     ry="1.5473"
     fill="#fff"
     id="ellipse28" />
  <ellipse
     cx="15.198"
     cy="15.047"
     rx="1.4117"
     ry="1.0588"
     fill="#500"
     fill-opacity=".97647"
     id="ellipse30" />
  <ellipse
     transform="scale(-1,1)"
     cx="-32.845"
     cy="15.047"
     rx="1.4117"
     ry="1.0588"
     fill="#500"
     fill-opacity=".97647"
     id="ellipse32" />
  <circle
     cx="14.563"
     cy="14.764"
     r=".42352"
     fill="#fff"
     stroke-width=".19048"
     id="circle34" />
  <circle
     cx="32.209"
     cy="14.764"
     r=".42352"
     fill="#fff"
     stroke-width=".19048"
     id="circle36" />
  <path
     d="m20.417 27.4c-1.5923-0.02712-1.8618 2.6555-0.31578 3.3421 2.2487 0.99863 2.8633 2.222 3.4438 2.9603l0.09547 1.4324c-0.69919 0.228-4.4144 1.11-4.0108 1.8143 1.6916-0.14038 2.6273-0.57275 4.3923-0.57281v0.0034c1.765 6.4e-5 2.7007 0.43243 4.3923 0.57281 0.40363-0.70424-3.3116-1.5863-4.0108-1.8143l0.09547-1.4324c0.5805-0.73829 1.1951-1.9616 3.4438-2.9603 1.5461-0.68659 1.2765-3.3693-0.31578-3.3421-1.5921 0.02712-2.4593 0.1909-3.605 0.19094v-0.0034c-1.1457-3.6e-5 -2.0129-0.16382-3.605-0.19093z"
     fill="#333"
     stroke-width="1.0027"
     id="path38" />
  <g
     id="g899"
     transform="translate(-1)">
    <rect
       style="opacity:1;fill:#548cc2;fill-opacity:1;stroke:none;stroke-width:0;stroke-linecap:round;stroke-linejoin:round;stroke-miterlimit:4;stroke-dasharray:none;stroke-dashoffset:0;stroke-opacity:1;paint-order:normal"
       id="rect1056"
       width="22"
       height="24.000002"
       x="25"
       y="21.999996" />
    <rect
       style="opacity:1;fill:#ffffff;fill-opacity:1;stroke:none;stroke-width:0;stroke-linecap:round;stroke-linejoin:round;stroke-miterlimit:4;stroke-dasharray:none;stroke-dashoffset:0;stroke-opacity:1;paint-order:normal"
       id="rect1058"
       width="19"
       height="21"
       x="26.5"
       y="23.5" />
    <rect
       style="opacity:1;fill:#a2c9f8;fill-opacity:1;stroke:none;stroke-width:0;stroke-linecap:butt;stroke-linejoin:round;stroke-miterlimit:4;stroke-dasharray:none;stroke-dashoffset:0;stroke-opacity:1;paint-order:normal"
       id="rect1060"
       width="14"
       height="2"
       x="29"
       y="27" />
    <rect
       y="31"
       x="29"
       height="1.9999993"
       width="12.099722"
       id="rect1062"
       style="opacity:1;fill:#a2c9f8;fill-opacity:1;stroke:none;stroke-width:0;stroke-linecap:butt;stroke-linejoin:round;stroke-miterlimit:4;stroke-dasharray:none;stroke-dashoffset:0;stroke-opacity:1;paint-order:normal" />
    <rect
       style="opacity:1;fill:#63bdfc;fill-opacity:1;stroke:none;stroke-width:0;stroke-linecap:butt;stroke-linejoin:round;stroke-miterlimit:4;stroke-dasharray:none;stroke-dashoffset:0;stroke-opacity:1;paint-order:normal"
       id="rect1064"
       width="14"
       height="2"
       x="29"
       y="35" />
    <rect
       y="39"
       x="29"
       height="2"
       width="14"
       id="rect1066"
       style="opacity:1;fill:#63bdfc;fill-opacity:1;stroke:none;stroke-width:0;stroke-linecap:butt;stroke-linejoin:round;stroke-miterlimit:4;stroke-dasharray:none;stroke-dashoffset:0;stroke-opacity:1;paint-order:normal" />
    <g
       transform="matrix(1.9999539,0,0,1.9999539,56.999262,0.0010568)"
       id="g920">
      <rect
         style="opacity:1;fill:url(#linearGradient894);fill-opacity:1;fill-rule:evenodd;stroke:none;stroke-width:0.149331;stroke-linecap:round;stroke-linejoin:miter;stroke-miterlimit:4;stroke-dasharray:none;stroke-dashoffset:0;stroke-opacity:1;paint-order:normal"
         id="rect882"
         width="3.4843988"
         height="1.8474847"
         x="3.2073538"
         y="14.196074"
         transform="rotate(45)" />
      <rect
         style="opacity:1;fill:url(#linearGradient896);fill-opacity:1;fill-rule:evenodd;stroke:none;stroke-width:0.0995542;stroke-linecap:round;stroke-linejoin:miter;stroke-miterlimit:4;stroke-dasharray:none;stroke-dashoffset:0;stroke-opacity:1;paint-order:normal"
         id="rect884"
         width="3.4843988"
         height="1.8474847"
         x="3.2073538"
         y="12.348605"
         transform="rotate(45)" />
      <rect
         style="opacity:1;fill:url(#linearGradient898);fill-opacity:1;fill-rule:evenodd;stroke:none;stroke-width:0.149331;stroke-linecap:round;stroke-linejoin:miter;stroke-miterlimit:4;stroke-dasharray:none;stroke-dashoffset:0;stroke-opacity:1;paint-order:normal"
         id="rect886"
         width="3.4843986"
         height="5.271841"
         x="3.2073538"
         y="16.043558"
         transform="rotate(45)" />
      <path
         sodipodi:nodetypes="ccccc"
         style="fill:#d38d5f;fill-opacity:1;fill-rule:evenodd;stroke:none;stroke-width:0.497771px;stroke-linecap:butt;stroke-linejoin:miter;stroke-opacity:1"
         d="m -12.804322,17.340203 -1.140561,2.783344 0.82128,0.821281 2.783123,-1.140783 z"
         id="path888"
         inkscape:connector-curvature="0" />
      <path
         sodipodi:nodetypes="ccccc"
         style="fill:#333333;fill-rule:evenodd;stroke:none;stroke-width:0.497771px;stroke-linecap:butt;stroke-linejoin:miter;stroke-opacity:1"
         d="m -13.563575,19.193012 1.369607,1.369607 -0.929635,0.382209 c -1.046755,0.429058 -1.250255,0.225559 -0.82128,-0.821281 z"
         id="path890"
         inkscape:connector-curvature="0" />
    </g>
  </g>
</svg>
