<?xml version="1.0" encoding="UTF-8" standalone="no"?>
<svg
   height="64"
   width="64"
   version="1.1"
   id="svg1022"
   sodipodi:docname="Book_02_64.svg"
   inkscape:export-filename="Book_02_64.png"
   inkscape:export-xdpi="96"
   inkscape:export-ydpi="96"
   inkscape:version="1.2-beta (1b65182ce9, 2022-04-05)"
   xmlns:inkscape="http://www.inkscape.org/namespaces/inkscape"
   xmlns:sodipodi="http://sodipodi.sourceforge.net/DTD/sodipodi-0.dtd"
   xmlns="http://www.w3.org/2000/svg"
   xmlns:svg="http://www.w3.org/2000/svg">
  <defs
     id="defs1026" />
  <sodipodi:namedview
     id="namedview1024"
     pagecolor="#ffffff"
     bordercolor="#666666"
     borderopacity="1.0"
     inkscape:pageshadow="2"
     inkscape:pageopacity="0.0"
     inkscape:pagecheckerboard="0"
     inkscape:deskcolor="#d1d1d1"
     showgrid="true"
     inkscape:zoom="14.34375"
     inkscape:cx="32"
     inkscape:cy="32"
     inkscape:current-layer="svg1022">
    <inkscape:grid
       type="xygrid"
       id="grid1301" />
  </sodipodi:namedview>
  <linearGradient
     id="a"
     gradientUnits="userSpaceOnUse"
     x1="15"
     x2="15"
     y1=".5"
     y2="14">
    <stop
       offset="0"
       stop-color="#496b9c"
       id="stop957" />
    <stop
       offset="1"
       stop-color="#4d4d4d"
       id="stop959" />
  </linearGradient>
  <linearGradient
     id="b"
     gradientTransform="matrix(1.0198104 0 0 1.0276596 .220419 -.513893)"
     gradientUnits="userSpaceOnUse"
     x1="2"
     x2="3.280105"
     y1="9"
     y2="9">
    <stop
       offset="0"
       stop-color="#a05a2c"
       id="stop962" />
    <stop
       offset="1"
       stop-color="#deaa87"
       id="stop964" />
  </linearGradient>
  <linearGradient
     id="c"
     gradientTransform="matrix(.67093145 0 0 .67021275 .099632 -16.420279)"
     gradientUnits="userSpaceOnUse"
     x1="20.75276"
     x2="21"
     y1="26.427753"
     y2="46">
    <stop
       offset="0"
       stop-color="#e6e6e6"
       id="stop967" />
    <stop
       offset="1"
       stop-color="#808080"
       id="stop969" />
  </linearGradient>
  <linearGradient
     id="d"
     gradientTransform="matrix(1.0198104 0 0 1.0276596 .470419 -1.263896)"
     gradientUnits="userSpaceOnUse"
     x1="7.5"
     x2="5.5"
     y1="14.5"
     y2="3.5">
    <stop
       offset="0"
       stop-color="#2c89a0"
       id="stop972" />
    <stop
       offset="1"
       stop-color="#d7eef4"
       id="stop974" />
  </linearGradient>
  <linearGradient
     id="e"
     gradientTransform="matrix(1.0198104 0 0 1.0276596 .470419 -1.263896)"
     gradientUnits="userSpaceOnUse"
     x1="11"
     x2="11"
     y1="15.5"
     y2="4">
    <stop
       offset="0"
       stop-color="#355a8e"
       id="stop977" />
    <stop
       offset="1"
       stop-color="#5b7ca8"
       id="stop979" />
  </linearGradient>
  <linearGradient
     id="f"
     gradientTransform="matrix(1.0198105 0 0 1.0276596 1.74023 -1.263897)"
     gradientUnits="userSpaceOnUse"
     x1="7.118746"
     x2="7.118746"
     y1="6.095303"
     y2="8.041472">
    <stop
       offset="0"
       stop-color="#fff"
       id="stop982" />
    <stop
       offset="1"
       stop-color="#d6dde8"
       id="stop984" />
  </linearGradient>
  <linearGradient
     id="g"
     gradientTransform="matrix(1.0198104 0 0 1.0276596 .200541 -.646842)"
     gradientUnits="userSpaceOnUse"
     x1="3.461017"
     x2="3.461017"
     y1="14.853066"
     y2="4.149133">
    <stop
       offset="0"
       stop-color="#355a8e"
       id="stop987" />
    <stop
       offset="1"
       stop-color="#5fbcd3"
       id="stop989" />
  </linearGradient>
  <linearGradient
     id="h"
     gradientTransform="matrix(1.0198104 0 0 1.0276596 .471591 -.263896)"
     gradientUnits="userSpaceOnUse"
     x1="8.126243"
     x2="8.206011"
     y1=".852316"
     y2="1.717481">
    <stop
       offset="0"
       stop-color="#ccc"
       id="stop992" />
    <stop
       offset="1"
       stop-color="#fff"
       id="stop994" />
  </linearGradient>
  <linearGradient
     id="i"
     gradientUnits="userSpaceOnUse"
     x1="4.250001"
     x2="4.250001"
     y1="1.75"
     y2=".25">
    <stop
       offset="0"
       stop-color="#5b7ca8"
       id="stop997" />
    <stop
       offset="1"
       stop-color="#486a9b"
       id="stop999" />
  </linearGradient>
  <g
     transform="scale(4)"
     id="g1020">
    <path
       d="m14.25 13.5v-13.25"
       fill="none"
       stroke="url(#a)"
       stroke-linecap="round"
       stroke-width=".5"
       id="path1002" />
    <path
       d="m1.5 1.25c0 .75 1.25 1 2 1v13.75c-1.2559913 0-2-.5-2-1.25z"
       fill="url(#b)"
       fill-rule="evenodd"
       id="path1004" />
    <g
       stroke-width=".5"
       id="g1014">
      <path
         d="m13.5.25h.75v13.5c-.75.5-.706429 1.229302-.75 2z"
         fill="url(#c)"
         fill-rule="evenodd"
         opacity=".984"
         id="path1006" />
      <path
         d="m13.75 2.25v13.5h-10v-13.5z"
         fill="url(#d)"
         fill-rule="evenodd"
         stroke="url(#e)"
         stroke-linejoin="round"
         id="path1008" />
      <path
         d="m6 5v2h5v-2z"
         fill="url(#f)"
         fill-rule="evenodd"
         id="path1010" />
      <path
         d="m3.75 2.5v13.5"
         fill="none"
         stroke="url(#g)"
         id="path1012" />
    </g>
    <path
       d="m13.75 2.25h-9.7437106c-3 0-3-2-.05-2h10.2937106c-.458969.3744116-.721194.7841337-.5 2z"
       fill="url(#h)"
       fill-rule="evenodd"
       id="path1016" />
    <path
       d="m13.75 2.25h-9.7437099c-3 0-3-2-.05-2h10.2937099"
       fill="none"
       stroke="url(#i)"
       stroke-linecap="round"
       stroke-linejoin="round"
       stroke-width=".5"
       id="path1018" />
  </g>
</svg>
