<?xml version="1.0" encoding="UTF-8" standalone="no"?>
<svg
   width="64"
   height="64"
   version="1.1"
   id="svg6"
   sodipodi:docname="Folder_21_64.svg"
   inkscape:export-filename="Folder_21_64.png"
   inkscape:export-xdpi="96"
   inkscape:export-ydpi="96"
   inkscape:version="1.3.2 (091e20e, 2023-11-25, custom)"
   xmlns:inkscape="http://www.inkscape.org/namespaces/inkscape"
   xmlns:sodipodi="http://sodipodi.sourceforge.net/DTD/sodipodi-0.dtd"
   xmlns="http://www.w3.org/2000/svg"
   xmlns:svg="http://www.w3.org/2000/svg">
  <sodipodi:namedview
     id="namedview6"
     pagecolor="#ffffff"
     bordercolor="#000000"
     borderopacity="0.25"
     inkscape:showpageshadow="2"
     inkscape:pageopacity="0.0"
     inkscape:pagecheckerboard="0"
     inkscape:deskcolor="#d1d1d1"
     showgrid="true"
     inkscape:current-layer="svg6">
    <inkscape:grid
       id="grid6"
       units="px"
       originx="0"
       originy="0"
       spacingx="0.5"
       spacingy="0.5"
       empcolor="#0099e5"
       empopacity="0.30196078"
       color="#0099e5"
       opacity="0.14901961"
       empspacing="2"
       dotted="false"
       gridanglex="30"
       gridanglez="30"
       visible="true" />
  </sodipodi:namedview>
  <defs
     id="defs4">
    <linearGradient
       id="a"
       x1="-27.588779"
       x2="-6.4483247"
       y1="1038.0051"
       y2="1047.7192"
       gradientTransform="matrix(2.7653292,0,0,3.1324056,79.0619,-3228.6675)"
       gradientUnits="userSpaceOnUse">
      <stop
         stop-color="#ffe496"
         offset="0"
         id="stop1" />
      <stop
         stop-color="#ffcc40"
         offset="1"
         id="stop2" />
    </linearGradient>
    <linearGradient
       id="b"
       x1="-28.500042"
       x2="-13.000042"
       y1="1030.8622"
       y2="1034.3622"
       gradientTransform="matrix(4,0,0,4.0588238,116.00017,-4178.0585)"
       gradientUnits="userSpaceOnUse">
      <stop
         stop-color="#fdbd17"
         offset="0"
         id="stop3" />
      <stop
         stop-color="#e3a726"
         offset="1"
         id="stop4" />
    </linearGradient>
  </defs>
  <path
     d="M 0,30 V 8.059636 C -9.1998228e-5,5.817947 1.79086,4.000406 4.000168,4.000406 l 16,-4.06e-4 c 2.209196,0 4.000156,1.817137 4.000264,4.058824 L 24,10 l 35.999436,4.06e-4 c 2.209128,2.8e-5 3.999972,1.817209 4,4.058824 L 63.999628,30 Z"
     fill="url(#b)"
     id="path4"
     style="fill:url(#b)" />
  <path
     d="M 61.11635,20.249999 H 2.883645 c -1.4545793,0 -2.633728,1.275033 -2.6336453,2.847804 v 29.804393 c -8.265e-5,1.57277 1.179066,2.847803 2.6336453,2.847803 H 61.11635 c 1.454584,0 2.633732,-1.275029 2.633649,-2.847803 V 23.097803 c 8.3e-5,-1.572775 -1.179065,-2.847808 -2.633649,-2.847804 z"
     fill="url(#a)"
     stroke="#edb020"
     stroke-width="0.499999"
     id="path5"
     style="fill:url(#a)" />
</svg>
