<svg width="24" height="24" version="1.1" xmlns="http://www.w3.org/2000/svg">
 <circle cx="12" cy="12" r="10.875" fill="#ffe5e5" fill-rule="evenodd" stroke="#fa0302" stroke-linecap="round" stroke-linejoin="round" stroke-width=".75"/>
 <path d="m8.25 8.25 7.5 7.5" fill="none" stroke="#fa0302" stroke-linecap="round" stroke-width="2"/>
 <path d="m15.75 8.25-7.5 7.5" fill="none" stroke="#fa0302" stroke-linecap="round" stroke-width="2"/>
</svg>
