<?xml version="1.0" encoding="UTF-8" standalone="no"?>
<svg
   height="48"
   width="48"
   version="1.1"
   id="svg401"
   sodipodi:docname="Arrow_48_48.svg"
   inkscape:export-filename="Arrow_48_48.png"
   inkscape:export-xdpi="96"
   inkscape:export-ydpi="96"
   inkscape:version="1.2.2 (732a01da63, 2022-12-09)"
   xmlns:inkscape="http://www.inkscape.org/namespaces/inkscape"
   xmlns:sodipodi="http://sodipodi.sourceforge.net/DTD/sodipodi-0.dtd"
   xmlns="http://www.w3.org/2000/svg"
   xmlns:svg="http://www.w3.org/2000/svg">
  <defs
     id="defs405" />
  <sodipodi:namedview
     id="namedview403"
     pagecolor="#ffffff"
     bordercolor="#666666"
     borderopacity="1.0"
     inkscape:showpageshadow="2"
     inkscape:pageopacity="0.0"
     inkscape:pagecheckerboard="0"
     inkscape:deskcolor="#d1d1d1"
     showgrid="true"
     inkscape:zoom="19.125"
     inkscape:cx="24"
     inkscape:cy="24"
     inkscape:current-layer="g399"
     showguides="true">
    <inkscape:grid
       type="xygrid"
       id="grid904" />
  </sodipodi:namedview>
  <g
     stroke="#2a7efe"
     stroke-linecap="round"
     stroke-linejoin="round"
     stroke-width="4"
     id="g399">
    <circle
       cx="24"
       cy="24"
       fill="#e0edff"
       fill-rule="evenodd"
       r="20.5"
       stroke-opacity=".954902"
       id="circle395"
       style="stroke:#2a7efe;stroke-opacity:1" />
    <path
       d="m 27,33 9,-9 -9,-9"
       stroke-linejoin="round"
       id="path1020"
       style="fill:none;stroke:#2a7efe;stroke-width:4"
       sodipodi:nodetypes="ccc" />
    <path
       d="M 36,24.000001 H 12"
       id="path1022"
       style="fill:none;stroke:#2a7efe;stroke-width:4"
       sodipodi:nodetypes="cc" />
  </g>
</svg>
