<?xml version="1.0" encoding="UTF-8" standalone="no"?>
<svg
   height="24"
   width="24"
   version="1.1"
   id="svg147"
   sodipodi:docname="menu_source_encloseinifdef_150.svg"
   inkscape:export-filename="menu_source_encloseinifdef_150.png"
   inkscape:export-xdpi="96"
   inkscape:export-ydpi="96"
   inkscape:version="1.2.2 (732a01da63, 2022-12-09)"
   xmlns:inkscape="http://www.inkscape.org/namespaces/inkscape"
   xmlns:sodipodi="http://sodipodi.sourceforge.net/DTD/sodipodi-0.dtd"
   xmlns="http://www.w3.org/2000/svg"
   xmlns:svg="http://www.w3.org/2000/svg">
  <defs
     id="defs151" />
  <sodipodi:namedview
     id="namedview149"
     pagecolor="#ffffff"
     bordercolor="#666666"
     borderopacity="1.0"
     inkscape:showpageshadow="2"
     inkscape:pageopacity="0.0"
     inkscape:pagecheckerboard="0"
     inkscape:deskcolor="#d1d1d1"
     showgrid="true"
     inkscape:zoom="38.25"
     inkscape:cx="11.986928"
     inkscape:cy="12"
     inkscape:current-layer="svg147">
    <inkscape:grid
       type="xygrid"
       id="grid411" />
  </sodipodi:namedview>
  <g
     fill="#2a7fff"
     id="g145">
    <path
       d="m7.25 3c-2.0033325 0-3.75.7558566-3.75 3v3.75c0 .922246-.5258916 1.350586-1.5 1.350586v1.798828c.9741084 0 1.5.42834 1.5 1.350586v3.75c0 2.244144 1.7466675 3 3.75 3v-1.649413c-1.4100135-.010951-1.9511715-.51977-1.9511715-1.350587v-3.75c0-1.303127-.5635885-2.25-1.0488285-2.25.48524 0 1.0488285-.946873 1.0488285-2.25v-3.75c0-.8308178.541158-1.33967 1.9511715-1.3505859z"
       stroke-width=".991802"
       id="path139" />
    <path
       d="m16.75 3c2.003332 0 3.75.7558566 3.75 3v3.75c0 .922246.525891 1.350586 1.5 1.350586v1.798828c-.974109 0-1.5.42834-1.5 1.350586v3.75c0 2.244144-1.746668 3-3.75 3v-1.649413c1.410013-.010951 1.951171-.51977 1.951171-1.350587v-3.75c0-1.303127.56359-2.25 1.048829-2.25-.485239 0-1.048829-.946873-1.048829-2.25v-3.75c0-.8308178-.541158-1.33967-1.951171-1.3505859z"
       stroke-width=".991802"
       id="path141" />
    <path
       d="m11.378019 6v1.4444444c-1.465262.1898908-2.8743706 1.1635436-2.8888901 2.8888886-.00889 1.055772.440668 1.939505 1.7832681 2.453863 1.685337.645664 3.994511.184063 3.994511 1.879472 0 .831513-.786367 1.444443-2.166668 1.444443-.936806 0-1.791702-.219089-2.6259768-1.248598l-.9851343 1.248598c.6336858.791328 1.6612251 1.284549 2.8888901 1.444445v1.444444h1.444444v-1.444444c1.46703-.187027 2.888889-.92969 2.888889-2.888888 0-.869446-.546314-1.8797-1.650672-2.382205-1.909317-.868777-4.127106-.150809-4.127106-1.95113 0-1.3770146 2.21182-2.1130069 4.333334-.7222223l.850022-1.229865c-.752011-.4848202-1.47255-.8241782-2.294467-.9368013v-1.4444444z"
       fill="#f00"
       stroke-width=".999997"
       id="path143" />
  </g>
</svg>
