<?xml version="1.0" encoding="UTF-8" standalone="no"?>
<svg
   height="24"
   width="24"
   version="1.1"
   id="svg155"
   sodipodi:docname="menu_goto_bookmark6_150.svg"
   inkscape:export-filename="menu_goto_bookmark6_150.png"
   inkscape:export-xdpi="96"
   inkscape:export-ydpi="96"
   inkscape:version="1.2.2 (732a01da63, 2022-12-09)"
   xmlns:inkscape="http://www.inkscape.org/namespaces/inkscape"
   xmlns:sodipodi="http://sodipodi.sourceforge.net/DTD/sodipodi-0.dtd"
   xmlns="http://www.w3.org/2000/svg"
   xmlns:svg="http://www.w3.org/2000/svg">
  <defs
     id="defs159" />
  <sodipodi:namedview
     id="namedview157"
     pagecolor="#ffffff"
     bordercolor="#666666"
     borderopacity="1.0"
     inkscape:showpageshadow="2"
     inkscape:pageopacity="0.0"
     inkscape:pagecheckerboard="0"
     inkscape:deskcolor="#d1d1d1"
     showgrid="true"
     inkscape:zoom="38.25"
     inkscape:cx="11.986928"
     inkscape:cy="12"
     inkscape:current-layer="svg155">
    <inkscape:grid
       type="xygrid"
       id="grid1520" />
  </sodipodi:namedview>
  <radialGradient
     id="a"
     cx="10.5"
     cy="12"
     gradientUnits="userSpaceOnUse"
     r="6">
    <stop
       offset="0"
       stop-color="#2a7fff"
       id="stop142" />
    <stop
       offset=".69999999"
       stop-color="#4d94ff"
       id="stop144" />
    <stop
       offset="1"
       stop-color="#96bdff"
       id="stop146" />
  </radialGradient>
  <g
     stroke-width=".666667"
     transform="matrix(1.5 0 0 1.5 -3.75 -6.5)"
     id="g153">
    <circle
       cx="10.5"
       cy="12"
       fill="url(#a)"
       r="6"
       id="circle149" />
    <path
       d="m10.490206 15.306185c-.7081939.027763-1.4738123-.323952-1.7557978-1.005407-.3503346-.784572-.2448106-1.69123.0110454-2.487077.2466197-.686379.625939-1.31348.9397765-1.9696355.2878566-.5702441.5757129-1.1404882.8635699-1.7107323h1.074218c-.603841 1.1800129-1.207682 2.3600258-1.8115232 3.5400388-.031671-.342027.3297412-.558864.6207512-.626182.648588-.133688 1.402374.133851 1.727993.734063.345381.61473.373906 1.362472.242773 2.042347-.11681.598982-.52164 1.159485-1.116089 1.35424-.254656.09176-.526698.12971-.796717.128345zm0-.957031c.458046.03718.908036-.32252.951036-.784928.09453-.502868.02458-1.128598-.429968-1.440396-.448151-.300395-1.1850246-.166569-1.3722575.379646-.1802709.44876-.1848642.983633.024093 1.42275.1659457.284295.504006.438827.827096.422928z"
       fill="#fff"
       id="path151" />
  </g>
</svg>
