<svg width="24" height="24" version="1.1" xmlns="http://www.w3.org/2000/svg">
 <g stroke="#ff2828" stroke-linecap="round" stroke-width="1.2">
  <circle cx="17.5" cy="17.5" r="5.9000001" fill="#ffffff" stroke-dashoffset="1.49998" stroke-linejoin="round"/>
  <path d="m15.35 15.35 4.3 4.3" fill="none"/>
  <path d="m19.65 15.35-4.3 4.3" fill="none"/>
 </g>
</svg>
