<?xml version="1.0" encoding="UTF-8" standalone="no"?>
<svg
   height="32"
   width="32"
   version="1.1"
   id="svg17"
   sodipodi:docname="pg_open_200.svg"
   inkscape:export-filename="pg_open_200.png"
   inkscape:export-xdpi="96"
   inkscape:export-ydpi="96"
   inkscape:version="1.3-beta (cedbd6c6ff, 2023-05-28)"
   xmlns:inkscape="http://www.inkscape.org/namespaces/inkscape"
   xmlns:sodipodi="http://sodipodi.sourceforge.net/DTD/sodipodi-0.dtd"
   xmlns="http://www.w3.org/2000/svg"
   xmlns:svg="http://www.w3.org/2000/svg">
  <defs
     id="defs17" />
  <sodipodi:namedview
     id="namedview17"
     pagecolor="#ffffff"
     bordercolor="#000000"
     borderopacity="0.25"
     inkscape:showpageshadow="2"
     inkscape:pageopacity="0.0"
     inkscape:pagecheckerboard="0"
     inkscape:deskcolor="#d1d1d1"
     showgrid="true"
     inkscape:current-layer="g14">
    <inkscape:grid
       id="grid17"
       units="px"
       originx="0"
       originy="0"
       spacingx="0.5"
       spacingy="0.5"
       empcolor="#0099e5"
       empopacity="0.30196078"
       color="#0099e5"
       opacity="0.14901961"
       empspacing="2"
       dotted="false"
       gridanglex="30"
       gridanglez="30"
       visible="true" />
  </sodipodi:namedview>
  <linearGradient
     id="a"
     gradientTransform="matrix(1,0,0,0.83333346,0,2.0833319)"
     gradientUnits="userSpaceOnUse"
     x1="-11"
     x2="-5"
     y1="14.5"
     y2="18.5">
    <stop
       offset="0"
       stop-color="#f00"
       id="stop1" />
    <stop
       offset="1"
       stop-color="#fff"
       id="stop2" />
  </linearGradient>
  <linearGradient
     id="b"
     gradientTransform="matrix(1,0,0,0.83333339,-1.0000003,3.7499988)"
     gradientUnits="userSpaceOnUse"
     x1="-3"
     x2="-9"
     y1="26.5"
     y2="22.5">
    <stop
       offset="0"
       stop-color="#06f"
       id="stop3" />
    <stop
       offset="1"
       stop-color="#fff"
       id="stop4" />
  </linearGradient>
  <linearGradient
     id="c"
     gradientTransform="matrix(0.83333334,0,0,1,-2.5000002,-0.99999918)"
     gradientUnits="userSpaceOnUse"
     x1="-13"
     x2="-9"
     y1="24.5"
     y2="18.5">
    <stop
       offset="0"
       stop-color="#0c0"
       id="stop5" />
    <stop
       offset="1"
       stop-color="#fff"
       id="stop6" />
  </linearGradient>
  <linearGradient
     id="d"
     gradientTransform="matrix(0.83333332,0,0,1,-0.83333345,6e-7)"
     gradientUnits="userSpaceOnUse"
     x1="-1"
     x2="-5"
     y1="16.5"
     y2="22.5">
    <stop
       offset="0"
       stop-color="#fc0"
       id="stop7" />
    <stop
       offset="1"
       stop-color="#fff"
       id="stop8" />
  </linearGradient>
  <linearGradient
     id="e"
     gradientUnits="userSpaceOnUse"
     x1="14"
     x2="15.5"
     y1="18"
     y2="26">
    <stop
       offset="0"
       stop-color="#f4e1a6"
       id="stop9" />
    <stop
       offset="1"
       stop-color="#f4c731"
       id="stop10" />
  </linearGradient>
  <path
     d="M 0.999977,27 0.99988002,6.99988 c 0,-1.0000001 0.99999998,-2 1.99999998,-2 h 5.9999995 c 1,0 2.0000015,0.9999999 2.0000015,2 V 7.9998799 H 27 V 15"
     fill="#fff3cc"
     stroke="#d4aa00"
     stroke-width="1.99976"
     id="path10"
     style="stroke-linecap:round;stroke-linejoin:round" />
  <g
     transform="translate(29,-12.5)"
     id="g16"
     style="stroke-linecap:round;stroke-linejoin:round">
    <g
       stroke-width="1.77051"
       id="g15">
      <path
         d="m -15,12.5 h 10 v 5 h -10 z"
         fill="url(#a)"
         stroke-width="1.61626"
         id="path11"
         style="fill:url(#a)" />
      <g
         stroke-width="1.724"
         id="g14">
        <path
           d="M -10,22.5 H 0 v 5 h -10 z"
           fill="url(#b)"
           id="path12"
           style="fill:url(#b);stroke-width:1.61625" />
        <path
           d="m -15,27.5 v -10 h 5 v 10 z"
           fill="url(#c)"
           id="path13"
           style="fill:url(#c);stroke-width:1.61625" />
        <path
           d="m -5,22.5 v -10 h 5 v 10 z"
           fill="url(#d)"
           id="path14"
           style="fill:url(#d);stroke-width:1.61625" />
      </g>
    </g>
    <path
       d="m -10,17.5 h 5 v 5 h -5 z"
       stroke-width="4"
       id="path15" />
  </g>
  <path
     d="M 31,15 H 4.9999766 L 0.999977,27 H 27 Z"
     fill="url(#e)"
     stroke="#d4aa00"
     stroke-width="2"
     id="path16"
     style="fill:url(#e);stroke-linecap:round;stroke-linejoin:round" />
</svg>
