<?xml version="1.0" encoding="UTF-8" standalone="no"?>
<svg
   height="36"
   width="36"
   version="1.1"
   id="svg18"
   sodipodi:docname="Mail_01_36.svg"
   inkscape:version="1.2-beta (1b65182ce9, 2022-04-05)"
   inkscape:export-filename="Mail_01_36.png"
   inkscape:export-xdpi="96"
   inkscape:export-ydpi="96"
   xmlns:inkscape="http://www.inkscape.org/namespaces/inkscape"
   xmlns:sodipodi="http://sodipodi.sourceforge.net/DTD/sodipodi-0.dtd"
   xmlns="http://www.w3.org/2000/svg"
   xmlns:svg="http://www.w3.org/2000/svg">
  <defs
     id="defs22" />
  <sodipodi:namedview
     id="namedview20"
     pagecolor="#ffffff"
     bordercolor="#666666"
     borderopacity="1.0"
     inkscape:pageshadow="2"
     inkscape:pageopacity="0.0"
     inkscape:pagecheckerboard="0"
     inkscape:deskcolor="#d1d1d1"
     showgrid="true"
     inkscape:zoom="25.5"
     inkscape:cx="17.980392"
     inkscape:cy="18"
     inkscape:current-layer="svg18">
    <inkscape:grid
       type="xygrid"
       id="grid147"
       originx="0"
       originy="0" />
  </sodipodi:namedview>
  <g
     id="g2042">
    <rect
       style="fill:none;stroke:#00aad4;stroke-width:2.25;stroke-linecap:round;stroke-linejoin:round;stroke-dasharray:none;stroke-dashoffset:1.49998"
       id="rect355"
       width="33.75"
       height="22.75"
       x="1.125"
       y="7.12535" />
    <path
       style="fill:none;stroke:#00aad4;stroke-width:2.25px;stroke-linecap:round;stroke-linejoin:round;stroke-opacity:1"
       d="M 1.125,7.125 18,22.875349 34.875,7.125"
       id="path966"
       sodipodi:nodetypes="ccc" />
    <path
       style="fill:none;stroke:#00aad4;stroke-width:2.25px;stroke-linecap:round;stroke-linejoin:round;stroke-opacity:1"
       d="M 1.5,29.5 11.25,18.375349"
       id="path968"
       sodipodi:nodetypes="cc" />
    <path
       style="fill:none;stroke:#00aad4;stroke-width:2.25px;stroke-linecap:round;stroke-linejoin:round;stroke-opacity:1"
       d="M 34.5,29.5 24.75,18.375349"
       id="path970"
       sodipodi:nodetypes="cc" />
  </g>
</svg>
