<?xml version="1.0" encoding="UTF-8" standalone="no"?>
<svg
   height="48"
   width="48"
   version="1.1"
   id="svg1336"
   sodipodi:docname="Sort_04_48.svg"
   inkscape:export-filename="Sort_04_48.png"
   inkscape:export-xdpi="96"
   inkscape:export-ydpi="96"
   inkscape:version="1.2-beta (1b65182ce9, 2022-04-05)"
   xmlns:inkscape="http://www.inkscape.org/namespaces/inkscape"
   xmlns:sodipodi="http://sodipodi.sourceforge.net/DTD/sodipodi-0.dtd"
   xmlns="http://www.w3.org/2000/svg"
   xmlns:svg="http://www.w3.org/2000/svg">
  <defs
     id="defs1340" />
  <sodipodi:namedview
     id="namedview1338"
     pagecolor="#ffffff"
     bordercolor="#666666"
     borderopacity="1.0"
     inkscape:pageshadow="2"
     inkscape:pageopacity="0.0"
     inkscape:pagecheckerboard="0"
     inkscape:deskcolor="#d1d1d1"
     showgrid="true"
     inkscape:zoom="19.125"
     inkscape:cx="23.215686"
     inkscape:cy="24"
     inkscape:current-layer="svg1336">
    <inkscape:grid
       type="xygrid"
       id="grid4785" />
  </sodipodi:namedview>
  <g
     id="g2160"
     transform="matrix(3,0,0,-3,-1,49.5)">
    <path
       d="M 4.375,14.5 V 2.5"
       stroke="#00aad4"
       stroke-linecap="round"
       id="path397"
       style="fill:none;stroke-width:1.25;stroke-dasharray:none" />
    <path
       d="M 1.875,5.046841 4.375,2.5 l 2.5,2.546841"
       stroke="#00aad4"
       stroke-linecap="round"
       stroke-linejoin="round"
       id="path399"
       style="fill:none;stroke-width:1.25;stroke-dasharray:none" />
  </g>
  <g
     stroke="#00aad4"
     id="g1332"
     style="fill:none;stroke-width:3"
     transform="matrix(1,0,0,-1,0,49)">
    <path
       d="M 20,44.5 H 45"
       id="path1320" />
    <path
       d="M 23,36.5 H 45"
       id="path1322" />
    <path
       d="M 26,28.5 H 45"
       id="path1324" />
    <path
       d="M 32,12.5 H 45"
       id="path1326" />
    <path
       d="M 35,4.5 H 45"
       id="path1328" />
    <path
       d="M 29,20.5 H 45"
       id="path1330" />
  </g>
</svg>
