<?xml version="1.0" encoding="UTF-8" standalone="no"?>
<svg
   height="48"
   viewBox="0 0 12.7 12.700001"
   width="48"
   version="1.1"
   id="svg296"
   sodipodi:docname="Chart_10_48.svg"
   inkscape:export-filename="Chart_10_48.png"
   inkscape:export-xdpi="96"
   inkscape:export-ydpi="96"
   inkscape:version="1.2 (dc2aedaf03, 2022-05-15)"
   xmlns:inkscape="http://www.inkscape.org/namespaces/inkscape"
   xmlns:sodipodi="http://sodipodi.sourceforge.net/DTD/sodipodi-0.dtd"
   xmlns:xlink="http://www.w3.org/1999/xlink"
   xmlns="http://www.w3.org/2000/svg"
   xmlns:svg="http://www.w3.org/2000/svg">
  <defs
     id="defs300">
    <linearGradient
       inkscape:collect="always"
       id="linearGradient3918">
      <stop
         style="stop-color:#ffffff;stop-opacity:1"
         offset="0"
         id="stop3916" />
      <stop
         style="stop-color:#ffd42a;stop-opacity:1;"
         offset="1"
         id="stop3914" />
    </linearGradient>
    <linearGradient
       inkscape:collect="always"
       id="linearGradient3908">
      <stop
         style="stop-color:#ffffff;stop-opacity:1"
         offset="0"
         id="stop3906" />
      <stop
         style="stop-color:#ff5555;stop-opacity:1;"
         offset="1"
         id="stop3904" />
    </linearGradient>
    <linearGradient
       inkscape:collect="always"
       id="linearGradient3898">
      <stop
         style="stop-color:#ffffff;stop-opacity:1"
         offset="0"
         id="stop3896" />
      <stop
         style="stop-color:#87decd;stop-opacity:1;"
         offset="1"
         id="stop3894" />
    </linearGradient>
    <linearGradient
       inkscape:collect="always"
       xlink:href="#linearGradient3898"
       id="linearGradient3900"
       x1="1.5874996"
       y1="8.73125"
       x2="4.7624994"
       y2="8.73125"
       gradientUnits="userSpaceOnUse" />
    <linearGradient
       inkscape:collect="always"
       xlink:href="#linearGradient3908"
       id="linearGradient3910"
       x1="4.7624994"
       y1="7.540625"
       x2="7.9374996"
       y2="7.540625"
       gradientUnits="userSpaceOnUse" />
    <linearGradient
       inkscape:collect="always"
       xlink:href="#linearGradient3918"
       id="linearGradient3920"
       x1="7.9375002"
       y1="6.35"
       x2="11.1125"
       y2="6.35"
       gradientUnits="userSpaceOnUse" />
  </defs>
  <sodipodi:namedview
     id="namedview298"
     pagecolor="#ffffff"
     bordercolor="#666666"
     borderopacity="1.0"
     inkscape:showpageshadow="2"
     inkscape:pageopacity="0.0"
     inkscape:pagecheckerboard="0"
     inkscape:deskcolor="#d1d1d1"
     showgrid="true"
     inkscape:zoom="19.125"
     inkscape:cx="23.973856"
     inkscape:cy="24"
     inkscape:current-layer="svg296">
    <inkscape:grid
       type="xygrid"
       id="grid4287" />
  </sodipodi:namedview>
  <path
     d="M 4.5640614,4.960938 H 1.7859376 v 7.540624 h 2.7781238 z"
     fill="#87decd"
     stroke="#5fd3bc"
     id="path282"
     style="stroke-width:0.396876;stroke-linecap:round;stroke-dashoffset:1.49998;fill-opacity:1;fill:url(#linearGradient3900)" />
  <path
     d="M 10.914062,0.19843797 H 8.1359382 V 12.501562 h 2.7781238 z"
     fill="#ffd42a"
     stroke="#ffcc00"
     id="path284"
     style="stroke-width:0.396876;stroke-linecap:round;stroke-dashoffset:1.49998;fill-opacity:1;fill:url(#linearGradient3920)" />
  <path
     d="M 7.7390616,2.579688 H 4.9609374 v 9.921874 h 2.7781242 z"
     fill="#ff5555"
     stroke="#ff5252"
     id="path286"
     style="stroke-width:0.396876;stroke-linecap:round;stroke-dashoffset:1.49998;fill-opacity:1;fill:url(#linearGradient3910)" />
  <g
     id="g1173"
     transform="matrix(0.79375005,0,0,0.79375005,9.6012594e-7,-2.4653563e-6)"
     style="stroke-width:0.333333">
    <path
       d="M 15.624781,5.4032217 C 15.137789,4.8919356 14.262794,4.8650236 13.737541,5.3331087 a 0.78976505,0.81490251 0.32849278 0 0 -0.01308,-1.356e-4 L 8.7881529,9.7824498 a 0.78976505,0.81490251 0.32849278 0 0 -0.033033,0.03117 L 8.4730469,10.098807 A 0.78976505,0.81490251 0.32849278 0 0 8.358136,10.246171 l -0.8172345,1.336402 -0.1608698,0.162644 c -0.2885893,-0.0056 -0.5660703,-0.0769 -0.8619885,0.03612 -0.396521,0.151506 -0.6760667,0.451571 -0.8644944,0.720327 -0.1884303,0.268755 -0.3236497,0.530256 -0.4967227,0.807402 -0.1194541,0.191238 -0.1930773,0.226905 -0.418404,0.284907 -0.225327,0.058 -0.5848457,0.07324 -1.0220231,0.115498 a 0.78976505,0.81490251 0.32849278 0 0 -0.1784082,1.583827 c 1.0286579,0.35481 1.9251584,0.60563 2.7437995,0.683281 0.8186411,0.07766 1.6032924,-0.0265 2.2428973,-0.483283 0.6041863,-0.43146 0.8144779,-1.100791 0.8268348,-1.749316 l 0.1201017,-0.12143 1.3211819,-0.798896 a 0.78976505,0.81490251 0.32849278 0 0 0.152818,-0.12109 l 0.282072,-0.285188 a 0.78976505,0.81490251 0.32849278 0 0 0.03305,-0.0357 l 4.352582,-4.9686446 c 3.43e-4,-3.538e-4 7.59e-4,-7.608e-4 0.0011,-0.00112 0.509392,-0.5244008 0.514925,-1.4773907 0.0114,-2.0075662 a 0.78976505,0.81490251 0.32849278 0 0 -0.0011,-0.00116 z"
       fill="#ffffff"
       id="path2"
       style="fill-rule:evenodd;stroke-width:0.267546" />
    <g
       transform="matrix(0.55608977,0.57763738,-0.56773047,0.5662004,0.04276614,-10.204729)"
       id="g14"
       style="fill-rule:evenodd;stroke-width:0.3326">
      <path
         d="m 26.75,13 v -1 h 1.5 v 1 z"
         fill="#ffffff"
         id="path4"
         style="stroke-width:0.333703" />
      <path
         d="m 25,18.033926 c 0.638374,-0.786181 1.363851,-1.441944 1.124082,-2.498542 -0.195641,-0.861732 -0.419915,-1.408422 -0.193996,-1.913359 0.85584,-1.912237 3.476972,-1.202846 3.134552,0.793331 C 28.836065,15.748014 27.382161,16.815391 25,18.033926 Z"
         fill="#ff0000"
         id="path6"
         style="stroke-width:0.333703" />
      <path
         d="m 26.75,12 h 1.5 l 0.5,-2 h -2.475 z"
         fill="#b3b3b3"
         id="path8"
         style="stroke-width:0.333703" />
      <path
         d="m 27.5,0.5 c -0.400108,6.0209e-4 -0.729292,0.31517483 -0.748047,0.7148438 L 26.275391,9.5 H 28.75 L 28.248391,1.0411084 C 28.246781,0.83221673 27.911936,0.49998743 27.5,0.5 Z"
         fill="#c87137"
         id="path10"
         style="stroke-width:0.333703"
         sodipodi:nodetypes="cccccc" />
      <path
         d="M 26.275,10 V 9.5 H 28.75 V 10 Z"
         fill="#ffffff"
         id="path12"
         style="stroke-width:0.333703" />
    </g>
  </g>
</svg>
