<?xml version="1.0" encoding="UTF-8" standalone="no"?>
<svg
   width="36"
   height="36"
   version="1.1"
   viewBox="0 0 36 36"
   id="svg18"
   sodipodi:docname="tcoolbar_150.svg"
   inkscape:export-filename="tcoolbar_150.png"
   inkscape:export-xdpi="96"
   inkscape:export-ydpi="96"
   inkscape:version="1.3.2 (091e20e, 2023-11-25, custom)"
   xmlns:inkscape="http://www.inkscape.org/namespaces/inkscape"
   xmlns:sodipodi="http://sodipodi.sourceforge.net/DTD/sodipodi-0.dtd"
   xmlns="http://www.w3.org/2000/svg"
   xmlns:svg="http://www.w3.org/2000/svg">
  <sodipodi:namedview
     id="namedview18"
     pagecolor="#ffffff"
     bordercolor="#000000"
     borderopacity="0.25"
     inkscape:showpageshadow="2"
     inkscape:pageopacity="0.0"
     inkscape:pagecheckerboard="0"
     inkscape:deskcolor="#d1d1d1"
     showgrid="true"
     inkscape:current-layer="svg18">
    <inkscape:grid
       id="grid18"
       units="px"
       originx="0"
       originy="0"
       spacingx="0.5"
       spacingy="0.5"
       empcolor="#0099e5"
       empopacity="0.30196078"
       color="#0099e5"
       opacity="0.14901961"
       empspacing="2"
       dotted="false"
       gridanglex="30"
       gridanglez="30"
       visible="true" />
  </sodipodi:namedview>
  <defs
     id="defs6">
    <linearGradient
       id="b"
       x1="9"
       x2="9"
       y1="1031.3622"
       y2="1034.3622"
       gradientTransform="matrix(1.4285714,0,0,1.500011,1.28572,-1543.0547)"
       gradientUnits="userSpaceOnUse">
      <stop
         stop-color="#cccccc"
         offset="0"
         id="stop1" />
      <stop
         stop-color="#ececec"
         offset="1"
         id="stop2" />
    </linearGradient>
    <linearGradient
       id="a"
       x1="-26.250042"
       x2="-23.500042"
       y1="1031.0497"
       y2="1034.4872"
       gradientTransform="translate(52.000043,-1025.3622)"
       gradientUnits="userSpaceOnUse">
      <stop
         stop-color="#fdbd17"
         offset="0"
         id="stop3" />
      <stop
         stop-color="#e3a726"
         offset="1"
         id="stop4" />
    </linearGradient>
    <linearGradient
       id="c"
       x1="-27.517921"
       x2="-13.767918"
       y1="1037.0229"
       y2="1044.88"
       gradientTransform="matrix(.67083556 0 0 .65 42.368816 -664.06042)"
       gradientUnits="userSpaceOnUse">
      <stop
         stop-color="#ffe496"
         offset="0"
         id="stop5" />
      <stop
         stop-color="#ffcc40"
         offset="1"
         id="stop6" />
    </linearGradient>
  </defs>
  <path
     d="M 35,1.5 H 1.500005 v 33 H 35"
     fill="#f2f2f2"
     stroke="#2a7efe"
     stroke-linejoin="round"
     stroke-width="1.00001"
     id="path6" />
  <path
     d="m4.500005 21v11"
     fill="none"
     stroke="#cccccc"
     stroke-width="1px"
     id="path7" />
  <path
     d="m5.500005 21v11"
     fill="none"
     stroke="#ffffff"
     stroke-width="1px"
     id="path8" />
  <path
     d="m4.500005 4v12"
     fill="none"
     stroke="#cccccc"
     stroke-width="1px"
     id="path9" />
  <path
     d="m5.500005 4v12"
     fill="none"
     stroke="#ffffff"
     stroke-width="1px"
     id="path10" />
  <rect
     x="9.5"
     y="4.4999828"
     width="10"
     height="11.000017"
     fill="#2a7efe"
     stroke="#2a7efe"
     stroke-linecap="round"
     stroke-linejoin="round"
     style="paint-order:normal"
     id="rect10" />
  <rect
     x="10.500005"
     y="9.9999828"
     width="8"
     height="4.5000172"
     fill="#ffffff"
     style="paint-order:normal"
     id="rect11" />
  <path
     d="m10.500005 4v5h8v-5zm4.5 1h2v3h-2z"
     fill="url(#b)"
     stroke-linecap="round"
     stroke-linejoin="round"
     id="path11" />
  <path
     d="M 1.500005,18.5 H 35"
     fill="none"
     stroke="#2a7efe"
     stroke-linejoin="round"
     id="path12" />
  <path
     d="m10.5 31.5v-10h5.5l2.5 2.5v7.5z"
     fill="#ffffff"
     fill-rule="evenodd"
     stroke="#999999"
     stroke-linejoin="round"
     stroke-width="1px"
     id="path13" />
  <path
     d="m15.5 21.5v3h3"
     fill="#ffffff"
     fill-rule="evenodd"
     stroke="#999999"
     stroke-linejoin="round"
     stroke-width="1px"
     id="path14" />
  <path
     d="m23 11v-4.9998001c-2.3e-5 -0.5523 0.447715-1.0000999 1.000042-1.0000999l3.499859-1e-4c0.552299 0 1.000018 0.4477 1.000066 1l3.3e-5 0.5h6.5v4.5z"
     fill="url(#a)"
     id="path15" />
  <path
     d="m34.75 9.25h-10.861109c-0.352865 0-0.638911 0.2645797-0.638891 0.5909429v5.3181141c-2e-5 0.326363 0.286026 0.590943 0.638891 0.590943h10.861109z"
     fill="url(#c)"
     stroke="#edb020"
     stroke-width=".5"
     id="path16" />
  <path
     d="m25.5 23 7 7"
     fill="none"
     stroke="#d40000"
     stroke-linecap="round"
     stroke-width="1.5"
     id="path17" />
  <path
     d="m25.5 30 7-7"
     fill="#ff0000"
     fill-rule="evenodd"
     stroke="#d40000"
     stroke-linecap="round"
     stroke-width="1.5"
     id="path18" />
</svg>
