<?xml version="1.0" encoding="UTF-8" standalone="no"?>
<svg
   width="16"
   height="16"
   version="1.1"
   id="svg143"
   sodipodi:docname="menu_jumpto_interfaceuses.svg"
   inkscape:export-filename="menu_jumpto_interfaceuses.png"
   inkscape:export-xdpi="96"
   inkscape:export-ydpi="96"
   inkscape:version="1.2.2 (732a01da63, 2022-12-09)"
   xml:space="preserve"
   xmlns:inkscape="http://www.inkscape.org/namespaces/inkscape"
   xmlns:sodipodi="http://sodipodi.sourceforge.net/DTD/sodipodi-0.dtd"
   xmlns="http://www.w3.org/2000/svg"
   xmlns:svg="http://www.w3.org/2000/svg"><defs
     id="defs147" /><sodipodi:namedview
     id="namedview145"
     pagecolor="#ffffff"
     bordercolor="#666666"
     borderopacity="1.0"
     inkscape:showpageshadow="2"
     inkscape:pageopacity="0.0"
     inkscape:pagecheckerboard="0"
     inkscape:deskcolor="#d1d1d1"
     showgrid="true"
     inkscape:zoom="57.375"
     inkscape:cx="7.7298475"
     inkscape:cy="8"
     inkscape:current-layer="svg143"><inkscape:grid
       type="xygrid"
       id="grid508" /></sodipodi:namedview><path
     d="m14.5 0.5v14h-10v-14z"
     fill="#fff"
     stroke="#d4aa00"
     stroke-linecap="round"
     stroke-linejoin="round"
     stroke-miterlimit="5.6"
     id="path137" /><path
     d="m 1,3.5 3,2 -3,2 z"
     fill="#ff0000"
     id="path139"
     style="fill:#2a7fff;fill-opacity:1" /><path
     style="fill:none;stroke:#2a7fff;stroke-width:1px;stroke-linecap:butt;stroke-linejoin:miter;stroke-opacity:1"
     d="M 13,7.5 H 6"
     id="path608" /><path
     style="fill:none;stroke:#2a7fff;stroke-width:0.999997px;stroke-linecap:butt;stroke-linejoin:miter;stroke-opacity:1"
     d="M 9,9.5 H 6"
     id="path1440" /><path
     style="fill:none;stroke:#2a7fff;stroke-width:1px;stroke-linecap:butt;stroke-linejoin:miter;stroke-opacity:1"
     d="M 12,3.5 H 6"
     id="path1442"
     sodipodi:nodetypes="cc" /><path
     style="fill:none;stroke:#ff0000;stroke-width:0.999997px;stroke-linecap:butt;stroke-linejoin:miter;stroke-opacity:1"
     d="M 8.999998,5.5 H 5.999999"
     id="path1444"
     sodipodi:nodetypes="cc" /><path
     style="fill:none;stroke:#2a7fff;stroke-width:1px;stroke-linecap:butt;stroke-linejoin:miter;stroke-opacity:1"
     d="M 13,11.5 H 6"
     id="path2162"
     sodipodi:nodetypes="cc" /></svg>
