<?xml version="1.0" encoding="UTF-8" standalone="no"?>
<svg
   width="36"
   height="36"
   version="1.1"
   viewBox="0 0 36 36"
   id="svg18"
   sodipodi:docname="tlazvtheaderpopupmenu_150.svg"
   inkscape:export-filename="tlazvtheaderpopupmenu_150.png"
   inkscape:export-xdpi="96"
   inkscape:export-ydpi="96"
   inkscape:version="1.3.2 (091e20e, 2023-11-25, custom)"
   xmlns:inkscape="http://www.inkscape.org/namespaces/inkscape"
   xmlns:sodipodi="http://sodipodi.sourceforge.net/DTD/sodipodi-0.dtd"
   xmlns="http://www.w3.org/2000/svg"
   xmlns:svg="http://www.w3.org/2000/svg">
  <sodipodi:namedview
     id="namedview18"
     pagecolor="#ffffff"
     bordercolor="#000000"
     borderopacity="0.25"
     inkscape:showpageshadow="2"
     inkscape:pageopacity="0.0"
     inkscape:pagecheckerboard="0"
     inkscape:deskcolor="#d1d1d1"
     showgrid="true"
     inkscape:current-layer="svg18">
    <inkscape:grid
       id="grid18"
       units="px"
       originx="0"
       originy="0"
       spacingx="0.5"
       spacingy="0.5"
       empcolor="#0099e5"
       empopacity="0.30196078"
       color="#0099e5"
       opacity="0.14901961"
       empspacing="2"
       dotted="false"
       gridanglex="30"
       gridanglez="30"
       visible="true" />
  </sodipodi:namedview>
  <defs
     id="defs9">
    <linearGradient
       id="b"
       x1="10.5"
       x2="10.5"
       y1="1029.8622"
       y2="1033.8622"
       gradientTransform="matrix(1.5 0 0 1.5 .09844316 -526.1811)"
       gradientUnits="userSpaceOnUse">
      <stop
         stop-color="#b3b3b3"
         offset="0"
         id="stop1" />
      <stop
         stop-color="#ffffff"
         offset=".40000346"
         id="stop2" />
      <stop
         stop-color="#e6e6e6"
         offset="1"
         id="stop3" />
    </linearGradient>
    <linearGradient
       id="c"
       x1="15.5"
       x2="15.5"
       y1="1030.8622"
       y2="1050.3622"
       gradientTransform="matrix(1.5 0 0 1.5 .09844316 -526.1811)"
       gradientUnits="userSpaceOnUse">
      <stop
         stop-color="#808080"
         offset="0"
         id="stop4" />
      <stop
         stop-color="#ffffff"
         offset=".33333424"
         id="stop5" />
      <stop
         stop-color="#ffffff"
         offset=".7948727"
         id="stop6" />
      <stop
         stop-color="#b3b3b3"
         offset="1"
         id="stop7" />
    </linearGradient>
    <linearGradient
       id="a"
       x1="7"
       x2="7"
       y1="1046.8622"
       y2="1050.3622"
       gradientTransform="matrix(1.5 0 0 1.5 .09844316 -526.1811)"
       gradientUnits="userSpaceOnUse">
      <stop
         stop-color="#f9f9f9"
         offset="0"
         id="stop8" />
      <stop
         stop-color="#b3b3b3"
         offset="1"
         id="stop9" />
    </linearGradient>
  </defs>
  <g
     transform="translate(0,-1016.3622)"
     id="g18">
    <path
       d="m11.504298 1018.8622h18.005862c3.509733 0 4.598656 2.8361 3.675496 5.4805-2.161113 6.1905-3.201529 12.489-2.870137 20.0908 0.1008 2.3123-1.315511 5.9287-4.315519 5.9287l-18.245698-0.25s-0.7292325-0.1455-0.6875055-0.4377l1.4332033-7.3123c-0.5347305-4.7977-0.4536259-10.675 2.0000002-16z"
       fill="url(#c)"
       fill-rule="evenodd"
       stroke="#2a7efe"
       stroke-linecap="round"
       stroke-linejoin="round"
       style="paint-order:normal"
       id="path9" />
    <path
       transform="matrix(1 0 -.20238685 .97930565 0 0)"
       d="m226.5084 1047.5404h13.5c-0.81007 7.5296 0.21772 13.2485 1.32327 18.8909h-13.5c-2.3281-7.7143-2.98662-14.1746-1.32327-18.8909z"
       fill="#ffffff"
       stroke="#4d4d4d"
       stroke-linejoin="round"
       stroke-width="1.01051"
       id="path10" />
    <path
       d="m12 1037.8622h12.75"
       fill="#4d4d4d"
       fill-rule="evenodd"
       stroke="#4d4d4d"
       id="path11" />
    <path
       d="m15 1034.6122h6.5"
       fill="none"
       stroke="#808080"
       stroke-width="1.5px"
       id="path12" />
    <path
       d="m15.5 1031.6122h7.5"
       fill="none"
       stroke="#808080"
       stroke-width="1.5px"
       id="path13" />
    <path
       d="m16.5 1028.6122h7.5"
       fill="none"
       stroke="#808080"
       stroke-width="1.5px"
       id="path14" />
    <path
       d="m14.5 1040.6122h7"
       fill="none"
       stroke="#808080"
       stroke-width="1.5px"
       id="path15" />
    <path
       d="m23.5 1034.8622 9.3909 7.0443-3.68955 1.0061 2.3475 4.6958-2.68335 1.3415-2.3475-4.6959-3.0189 2.3477z"
       fill="#ffffff"
       fill-rule="evenodd"
       stroke="#000080"
       stroke-linejoin="round"
       id="path16" />
    <path
       d="m11.504299 1018.8622c-2.2092088 0.1913-5.0042989 2.3887-5.0042989 7h18c0-4.6178 2.804797-6.8159 5.010158-7z"
       fill="url(#b)"
       fill-rule="evenodd"
       stroke="#2a7efe"
       stroke-linejoin="round"
       id="path17" />
    <path
       d="m8 1050.3622c-2.2484432 0-5.5015568-2.8887-5.5015568-7.5h18c0 4.6178 3.253114 7.5 5.507416 7.5z"
       fill="url(#a)"
       fill-rule="evenodd"
       stroke="#2a7efe"
       stroke-linejoin="round"
       id="path18" />
  </g>
</svg>
