<?xml version="1.0" encoding="UTF-8" standalone="no"?>
<svg
   width="32"
   height="32"
   version="1.1"
   viewBox="0 0 32 32"
   id="svg8"
   sodipodi:docname="select_200.svg"
   inkscape:export-filename="select_200.png"
   inkscape:export-xdpi="96"
   inkscape:export-ydpi="96"
   inkscape:version="1.3.2 (091e20e, 2023-11-25, custom)"
   xmlns:inkscape="http://www.inkscape.org/namespaces/inkscape"
   xmlns:sodipodi="http://sodipodi.sourceforge.net/DTD/sodipodi-0.dtd"
   xmlns="http://www.w3.org/2000/svg"
   xmlns:svg="http://www.w3.org/2000/svg">
  <defs
     id="defs8" />
  <sodipodi:namedview
     id="namedview8"
     pagecolor="#ffffff"
     bordercolor="#000000"
     borderopacity="0.25"
     inkscape:showpageshadow="2"
     inkscape:pageopacity="0.0"
     inkscape:pagecheckerboard="0"
     inkscape:deskcolor="#d1d1d1"
     showgrid="true"
     inkscape:current-layer="svg8">
    <inkscape:grid
       id="grid8"
       units="px"
       originx="0"
       originy="0"
       spacingx="0.5"
       spacingy="0.5"
       empcolor="#0099e5"
       empopacity="0.30196078"
       color="#0099e5"
       opacity="0.14901961"
       empspacing="2"
       dotted="false"
       gridanglex="30"
       gridanglez="30"
       visible="true" />
  </sodipodi:namedview>
  <rect
     x=".5"
     y="2.4999995"
     width="31"
     height="27.000002"
     fill="#ffffff"
     fill-opacity=".917647"
     stroke="#b3b3b3"
     stroke-linecap="round"
     stroke-linejoin="round"
     id="rect1" />
  <path
     d="M 0.9999991,8.5 H 31"
     fill="#008dd2"
     stroke="#cccccc"
     stroke-linejoin="round"
     stroke-width=".999999"
     id="path1" />
  <path
     d="m4 13h10.333334"
     fill="#008dd2"
     stroke="#008dd2"
     stroke-linejoin="round"
     stroke-width="2"
     id="path2" />
  <path
     d="m23.5 29v-26"
     fill="#008dd2"
     stroke="#cccccc"
     stroke-linejoin="round"
     stroke-width=".999999"
     id="path3" />
  <path
     d="m4 17h14.466667"
     fill="#008dd2"
     stroke="#008dd2"
     stroke-linejoin="round"
     stroke-width="2"
     id="path4" />
  <path
     d="m4 21h12.4"
     fill="#008dd2"
     stroke="#008dd2"
     stroke-linejoin="round"
     stroke-width="2"
     id="path6" />
  <path
     d="m27.5 12v10.357143"
     fill="none"
     stroke="#008dd2"
     stroke-linecap="round"
     stroke-linejoin="round"
     stroke-width="2"
     id="path7" />
  <path
     d="m4 25h16.533334"
     fill="#008dd2"
     stroke="#008dd2"
     stroke-linejoin="round"
     stroke-width="2"
     id="path8" />
  <path
     style="fill:#ffffff;stroke:#008dd2;stroke-width:1.2;stroke-linecap:round;stroke-linejoin:round;stroke-dasharray:none;stroke-opacity:1"
     d="m 25.9,4.5 1.6,2 1.6,-2"
     id="path9"
     sodipodi:nodetypes="ccc" />
</svg>
