<?xml version="1.0" encoding="UTF-8" standalone="no"?>
<svg
   height="48"
   width="48"
   version="1.1"
   id="svg510"
   sodipodi:docname="Remove_08_48.svg"
   inkscape:export-filename="Remove_08_48.png"
   inkscape:export-xdpi="96"
   inkscape:export-ydpi="96"
   inkscape:version="1.2.2 (732a01da63, 2022-12-09)"
   xmlns:inkscape="http://www.inkscape.org/namespaces/inkscape"
   xmlns:sodipodi="http://sodipodi.sourceforge.net/DTD/sodipodi-0.dtd"
   xmlns="http://www.w3.org/2000/svg"
   xmlns:svg="http://www.w3.org/2000/svg">
  <defs
     id="defs514" />
  <sodipodi:namedview
     id="namedview512"
     pagecolor="#ffffff"
     bordercolor="#666666"
     borderopacity="1.0"
     inkscape:showpageshadow="2"
     inkscape:pageopacity="0.0"
     inkscape:pagecheckerboard="0"
     inkscape:deskcolor="#d1d1d1"
     showgrid="true"
     inkscape:zoom="19.125"
     inkscape:cx="24.104575"
     inkscape:cy="24"
     inkscape:current-layer="svg510">
    <inkscape:grid
       type="xygrid"
       id="grid869" />
  </sodipodi:namedview>
  <circle
     cx="24"
     cy="24"
     r="19.875"
     style="fill:#ffe5e5;fill-rule:evenodd;stroke:#fa0302;stroke-width:3.75;stroke-linecap:round;stroke-linejoin:round;stroke-dasharray:none"
     id="circle508" />
  <path
     d="m 33.5,24 h -19"
     id="path707"
     style="fill:none;stroke:#fa0302;stroke-width:4.5;stroke-linecap:round;stroke-dasharray:none;stroke-opacity:1"
     sodipodi:nodetypes="cc" />
</svg>
