<?xml version="1.0" encoding="UTF-8" standalone="no"?>
<svg
   height="48"
   width="48"
   version="1.1"
   id="svg580"
   sodipodi:docname="Time_09_48.svg"
   inkscape:export-filename="Time_09_48.png"
   inkscape:export-xdpi="96"
   inkscape:export-ydpi="96"
   inkscape:version="1.2.1 (9c6d41e410, 2022-07-14)"
   xmlns:inkscape="http://www.inkscape.org/namespaces/inkscape"
   xmlns:sodipodi="http://sodipodi.sourceforge.net/DTD/sodipodi-0.dtd"
   xmlns="http://www.w3.org/2000/svg"
   xmlns:svg="http://www.w3.org/2000/svg">
  <defs
     id="defs584" />
  <sodipodi:namedview
     id="namedview582"
     pagecolor="#ffffff"
     bordercolor="#666666"
     borderopacity="1.0"
     inkscape:pageshadow="2"
     inkscape:pageopacity="0.0"
     inkscape:pagecheckerboard="0"
     inkscape:deskcolor="#d1d1d1"
     showgrid="true"
     inkscape:zoom="19.125"
     inkscape:cx="22.065359"
     inkscape:cy="24"
     inkscape:current-layer="svg580"
     inkscape:showpageshadow="2">
    <inkscape:grid
       type="xygrid"
       id="grid703" />
  </sodipodi:namedview>
  <path
     id="path377"
     style="color:#000000;fill:#00aad4;stroke-width:1.90909;stroke-linecap:round;stroke-dashoffset:1.49998"
     d="M 27.642578 5 A 16.5 16.5 0 0 1 29.925781 12 L 44 12 L 44 42 L 8 42 L 8 29.027344 A 16.5 16.5 0 0 1 5 27.583984 L 5 45 L 47 45 L 47 5 L 27.642578 5 z " />
  <path
     style="fill:none;stroke:#00aad4;stroke-width:2;stroke-linecap:butt;stroke-linejoin:round;stroke-dasharray:none;stroke-opacity:1"
     d="M 23.5,27.5 22,28 h 1.863774 z"
     id="path488"
     sodipodi:nodetypes="cccc" />
  <path
     style="fill:none;stroke:#00aad4;stroke-width:2;stroke-linecap:butt;stroke-linejoin:round;stroke-dasharray:none;stroke-opacity:1"
     d="m 30,18 -0.5,2 h 2.363774 z"
     id="path2184"
     sodipodi:nodetypes="cccc" />
  <path
     style="fill:none;stroke:#00aad4;stroke-width:2;stroke-linecap:butt;stroke-linejoin:round;stroke-dasharray:none;stroke-opacity:1"
     d="M 29,25.136226 V 28 h 2.863774 z"
     id="path2186" />
  <path
     style="fill:none;stroke:#00aad4;stroke-width:2;stroke-linecap:butt;stroke-linejoin:round;stroke-dasharray:none;stroke-opacity:1"
     d="M 37,17.136226 V 20 h 2.863774 z"
     id="path2188" />
  <path
     style="fill:none;stroke:#00aad4;stroke-width:2;stroke-linecap:butt;stroke-linejoin:round;stroke-dasharray:none;stroke-opacity:1"
     d="M 37,25.136226 V 28 h 2.863774 z"
     id="path2190" />
  <path
     style="fill:none;stroke:#00aad4;stroke-width:2;stroke-linecap:butt;stroke-linejoin:round;stroke-dasharray:none;stroke-opacity:1"
     d="M 13,33.136226 V 36 h 2.863774 z"
     id="path2194" />
  <path
     style="fill:none;stroke:#00aad4;stroke-width:2;stroke-linecap:butt;stroke-linejoin:round;stroke-dasharray:none;stroke-opacity:1"
     d="M 21,33.136226 V 36 h 2.863774 z"
     id="path2196" />
  <path
     style="fill:none;stroke:#00aad4;stroke-width:2;stroke-linecap:butt;stroke-linejoin:round;stroke-dasharray:none;stroke-opacity:1"
     d="M 29,33.136226 V 36 h 2.863774 z"
     id="path2198" />
  <path
     style="fill:none;stroke:#00aad4;stroke-width:2;stroke-linecap:butt;stroke-linejoin:round;stroke-dasharray:none;stroke-opacity:1"
     d="M 37,33.136226 V 36 h 2.863774 z"
     id="path2200" />
  <g
     fill="none"
     stroke="#00aad4"
     id="g270"
     transform="matrix(1.6831169,0,0,1.6831169,0.035064,0.035064)"
     style="stroke-width:1.78241;stroke:#ff7f00;stroke-opacity:1">
    <circle
       cx="8"
       cy="8"
       r="7.1296282"
       stroke-width="2.5463"
       id="circle266"
       style="stroke-width:1.78241;stroke-dasharray:none;stroke:#ff7f00;stroke-opacity:1" />
    <path
       d="M 8,2.6527779 8.0000016,8 h 4.4560164"
       id="path268"
       style="stroke-width:1.78241;stroke:#ff7f00;stroke-opacity:1"
       sodipodi:nodetypes="ccc" />
  </g>
</svg>
