<?xml version="1.0" encoding="UTF-8" standalone="no"?>
<svg
   height="24"
   width="24"
   version="1.1"
   id="svg2"
   sodipodi:docname="ddsequences_150.svg"
   inkscape:export-filename="ddsequences_150.png"
   inkscape:export-xdpi="96"
   inkscape:export-ydpi="96"
   inkscape:version="1.3-beta (cedbd6c6ff, 2023-05-28)"
   xmlns:inkscape="http://www.inkscape.org/namespaces/inkscape"
   xmlns:sodipodi="http://sodipodi.sourceforge.net/DTD/sodipodi-0.dtd"
   xmlns="http://www.w3.org/2000/svg"
   xmlns:svg="http://www.w3.org/2000/svg">
  <defs
     id="defs2" />
  <sodipodi:namedview
     id="namedview2"
     pagecolor="#ffffff"
     bordercolor="#000000"
     borderopacity="0.25"
     inkscape:showpageshadow="2"
     inkscape:pageopacity="0.0"
     inkscape:pagecheckerboard="0"
     inkscape:deskcolor="#d1d1d1"
     showgrid="true"
     inkscape:current-layer="svg2">
    <inkscape:grid
       id="grid2"
       units="px"
       originx="0"
       originy="0"
       spacingx="0.5"
       spacingy="0.5"
       empcolor="#0099e5"
       empopacity="0.30196078"
       color="#0099e5"
       opacity="0.14901961"
       empspacing="2"
       dotted="false"
       gridanglex="30"
       gridanglez="30"
       visible="true" />
  </sodipodi:namedview>
  <rect
     fill="#c2f3ff"
     height="18.800011"
     ry="2.4000001"
     width="18.800009"
     x="0.59999502"
     y="0.59999502"
     id="rect1"
     style="stroke:#00aad4;stroke-width:1.19999;stroke-linejoin:round" />
  <rect
     fill="#ebfcff"
     height="18.800011"
     ry="2.400001"
     width="18.800009"
     x="3.5999951"
     y="3.5999947"
     id="rect2"
     style="stroke:#00aad4;stroke-width:1.19999;stroke-linejoin:round" />
  <path
     d="m 10.403997,16.156729 2.605001,-3.360001 c 0.31076,-0.400828 0.496726,-1.00538 0.229806,-1.481413 -0.236023,-0.420929 -0.832743,-0.473171 -1.247068,-0.309864 -0.353754,0.139433 -0.548117,0.518815 -0.580584,0.88249 -0.334105,-0.0032 -0.681008,0.0064 -1.007155,-0.0048 0.08722,-0.703365 0.46218,-1.422559 1.14282,-1.710448 0.568953,-0.240649 1.23331,-0.217312 1.808987,-0.0073 0.582157,0.21238 0.94463,0.794172 0.999027,1.399369 0.06635,0.73821 -0.286332,1.423413 -0.719725,1.993421 l -1.856413,2.441605 h 2.625287 v 1.000175 h -3.999983 z"
     fill="#ffffff"
     id="path829"
     style="fill:#00aad4;fill-opacity:1;stroke-width:0.264582"
     sodipodi:nodetypes="csssccssssccccc" />
  <path
     d="M 15.674159,16.081749 C 15.527923,15.816922 15.441296,15.522234 15.404,15.222844 h 0.974842 c 0.03685,0.416795 0.367758,0.770865 0.787371,0.830768 0.432689,0.06177 0.972031,-0.01633 1.176955,-0.45221 0.146059,-0.310672 0.112561,-0.671014 0.07825,-1.001895 -0.04272,-0.411953 -0.398036,-0.760231 -0.816719,-0.772183 -0.197641,-0.0056 -0.395454,-0.0026 -0.593163,-0.0044 v -0.91446 c 0.363555,-0.01447 0.785849,0.07245 1.073151,-0.211278 0.292327,-0.288687 0.267516,-0.733608 0.233846,-1.111176 -0.03414,-0.382852 -0.403413,-0.627507 -0.772288,-0.653792 -0.42644,-0.03039 -0.880661,0.19503 -0.992872,0.617058 -0.04363,0.164113 -0.03046,0.232643 -0.03046,0.232643 h -1.006344 c 0.10089,-0.688947 0.491083,-1.386881 1.165843,-1.640112 0.569064,-0.213564 1.236773,-0.186082 1.783631,0.08365 0.537151,0.264942 0.802514,0.873443 0.821461,1.456613 0.01516,0.466026 -0.09728,0.94131 -0.427244,1.291212 -0.152092,0.16128 -0.524965,0.315193 -0.595463,0.386225 0.563941,0.113612 1.002505,0.608375 1.093575,1.171766 0.101098,0.625432 0.06463,1.334095 -0.350293,1.846645 -0.374293,0.462363 -0.989582,0.616687 -1.560647,0.621954 -0.693102,0.0064 -1.425128,-0.287646 -1.773271,-0.91812 z"
     fill="#ffffff"
     id="path153-3"
     style="fill:#00aad4;fill-opacity:1;stroke-width:0.264583"
     sodipodi:nodetypes="sccssssccssssccsssscssss" />
  <path
     d="m 8.8999964,17 h -0.99609 v -5.915991 l -1.493027,0.916012 -0.01088,-0.999996 1.5039,-0.999995 h 0.996089 z"
     fill="#ffffff"
     id="path153-7"
     sodipodi:nodetypes="cccccccc"
     style="fill:#00aad4;fill-opacity:1;stroke-width:0.264583" />
</svg>
