<svg width="32" height="32" version="1.1" xmlns="http://www.w3.org/2000/svg">
 <defs>
  <linearGradient id="a" x1="28.381756" x2="18.618242" y1="28.381756" y2="18.618242" gradientTransform="matrix(1.049827,0,0,1.049827,-1.1375999,-1.6709347)" gradientUnits="userSpaceOnUse">
   <stop stop-color="#009600" offset="0"/>
   <stop stop-color="#6edb39" offset="1"/>
  </linearGradient>
 </defs>
 <g transform="translate(0 -.533335)" fill="none" stroke="#00aad4" stroke-width="1.6">
  <path d="M 6.0000007,28.332666 H 26"/>
  <path d="m6 24.333336h20"/>
  <path d="M 6.0000007,20.332667 H 26"/>
  <path d="m6 16.333336h20"/>
  <path d="M 6.0000007,12.332668 H 26"/>
  <path d="m6 8.3333354h20"/>
  <path d="m6 4.333335h20"/>
  <circle transform="matrix(0,1,1,0,0,0)" cx="23.533335" cy="23" r="8.1999998" fill="url(#a)" stroke="#ffffff" stroke-dashoffset="1.49998" stroke-linecap="round" stroke-linejoin="round" stroke-width="1.6"/>
  <path d="M 26.210407,20.533268 22,27.033335 19.710407,23.627511" fill="none" stroke="#ffffff" stroke-linecap="round" stroke-linejoin="round" stroke-width="2"/>
 </g>
</svg>
