<?xml version="1.0" encoding="UTF-8" standalone="no"?>
<svg
   height="16"
   width="16"
   version="1.1"
   id="svg27"
   sodipodi:docname="menu_new_search.svg"
   inkscape:export-filename="menu_new_search.png"
   inkscape:export-xdpi="96"
   inkscape:export-ydpi="96"
   inkscape:version="1.2.2 (732a01da63, 2022-12-09)"
   xmlns:inkscape="http://www.inkscape.org/namespaces/inkscape"
   xmlns:sodipodi="http://sodipodi.sourceforge.net/DTD/sodipodi-0.dtd"
   xmlns="http://www.w3.org/2000/svg"
   xmlns:svg="http://www.w3.org/2000/svg">
  <defs
     id="defs31" />
  <sodipodi:namedview
     id="namedview29"
     pagecolor="#ffffff"
     bordercolor="#666666"
     borderopacity="1.0"
     inkscape:showpageshadow="2"
     inkscape:pageopacity="0.0"
     inkscape:pagecheckerboard="0"
     inkscape:deskcolor="#d1d1d1"
     showgrid="true"
     inkscape:zoom="57.375"
     inkscape:cx="7.9912854"
     inkscape:cy="8"
     inkscape:current-layer="svg27">
    <inkscape:grid
       type="xygrid"
       id="grid594" />
  </sodipodi:namedview>
  <radialGradient
     id="a"
     cx="5.9886"
     cy="7.2881"
     gradientTransform="matrix(-.00000025 1.5642 -1.4439 -.00000023 15.17 -5.6237)"
     gradientUnits="userSpaceOnUse"
     r="3.75">
    <stop
       offset="0"
       stop-color="#f8fbff"
       id="stop2" />
    <stop
       offset=".66667"
       stop-color="#d1e3ff"
       id="stop4" />
    <stop
       offset="1"
       stop-color="#f8fbff"
       id="stop6" />
  </radialGradient>
  <g
     stroke-linecap="round"
     id="g13">
    <path
       d="m10 10 4.75 4.75"
       fill="none"
       stroke="#d4aa00"
       stroke-width="2.5"
       id="path9" />
    <circle
       cx="6"
       cy="6"
       fill="url(#a)"
       fill-rule="evenodd"
       r="4.625"
       stroke="#2a7fff"
       stroke-linejoin="round"
       stroke-width=".75"
       id="circle11" />
  </g>
  <g
     fill="none"
     stroke="#e4b600"
     stroke-linecap="round"
     transform="translate(9)"
     id="g23">
    <path
       d="m3.4996.5.000353 6"
       id="path15" />
    <path
       d="m1.4374 1.4374 4.125 4.125"
       id="path17" />
    <path
       d="m6.5 3.4999h-6"
       id="path19" />
    <path
       d="m5.5624 1.4374-4.125 4.125"
       id="path21" />
  </g>
  <circle
     cx="12.5"
     cy="3.5"
     fill="#fff"
     r=".85"
     stroke="#ffe680"
     stroke-linejoin="round"
     stroke-miterlimit="5.6"
     stroke-width=".5"
     id="circle25" />
</svg>
