<?xml version="1.0" encoding="UTF-8" standalone="no"?>
<svg
   height="24"
   width="24"
   version="1.1"
   id="svg1019"
   sodipodi:docname="Setup_02_24.svg"
   inkscape:export-filename="Setup_02_24.png"
   inkscape:export-xdpi="96"
   inkscape:export-ydpi="96"
   inkscape:version="1.2-beta (1b65182ce9, 2022-04-05)"
   xmlns:inkscape="http://www.inkscape.org/namespaces/inkscape"
   xmlns:sodipodi="http://sodipodi.sourceforge.net/DTD/sodipodi-0.dtd"
   xmlns="http://www.w3.org/2000/svg"
   xmlns:svg="http://www.w3.org/2000/svg">
  <defs
     id="defs1023" />
  <sodipodi:namedview
     id="namedview1021"
     pagecolor="#ffffff"
     bordercolor="#666666"
     borderopacity="1.0"
     inkscape:pageshadow="2"
     inkscape:pageopacity="0.0"
     inkscape:pagecheckerboard="0"
     inkscape:deskcolor="#d1d1d1"
     showgrid="true"
     inkscape:zoom="27.812867"
     inkscape:cx="11.721194"
     inkscape:cy="10.642556"
     inkscape:current-layer="svg1019">
    <inkscape:grid
       type="xygrid"
       id="grid1142" />
  </sodipodi:namedview>
  <linearGradient
     id="a"
     gradientUnits="userSpaceOnUse"
     x1="42.812499"
     x2="34.687499"
     y1="20.812498"
     y2="12.687498">
    <stop
       offset="0"
       stop-color="#009600"
       id="stop1000" />
    <stop
       offset="1"
       stop-color="#6edb39"
       id="stop1002" />
  </linearGradient>
  <path
     d="M 13.611985,1.5010542 11.988712,4.3556269 10.011394,4.3563366 8.3874327,1.4999869 6.1298399,2.4351127 7.00127,5.60317 5.6025936,7.0008428 2.4362773,6.1301818 1.5010521,8.3880152 l 2.8545744,1.6232728 7.089e-4,1.977319 -2.8563485,1.62396 0.9351256,2.257592 3.1680571,-0.87143 1.3976741,1.398677 -0.8706609,3.166316 2.2578314,0.935224 1.6232728,-2.854574 1.977319,-7.08e-4 1.623961,2.856349 2.257592,-0.935125 -0.871431,-3.168057 1.398676,-1.397675 3.166316,0.870662 0.935225,-2.257834 -2.854574,-1.623273 -7.09e-4,-1.977317 L 20.500013,8.3874331 19.564887,6.1298398 16.39683,7.0012708 14.999155,5.6025931 15.869817,2.4362786 Z M 12.246968,7.9895545 A 3.2584818,3.2584818 0 0 1 14.010445,12.246967 3.2584818,3.2584818 0 0 1 9.7530335,14.010446 3.2584818,3.2584818 0 0 1 7.989554,9.7530325 3.2584818,3.2584818 0 0 1 12.246968,7.9895545 Z"
     fill="#aaccff"
     fill-rule="evenodd"
     stroke="#457abe"
     stroke-linejoin="round"
     id="path1005"
     style="stroke-width:1" />
  <g
     stroke="#ffffff"
     stroke-linecap="round"
     id="g1015"
     transform="translate(0,-24)">
    <circle
       cx="38.75"
       cy="16.75"
       fill="url(#a)"
       r="6.5"
       stroke-dashoffset="1.49998"
       stroke-linejoin="round"
       transform="matrix(0,1,1,0,0,2)"
       id="circle1007"
       style="fill:url(#a)" />
    <g
       fill="none"
       transform="matrix(1.5,0,0,-1.5,23.125,57.625)"
       id="g1013">
      <path
         d="m -4.25,13.25 v -4"
         id="path1009" />
      <path
         d="m -2.25,11.25 h -4"
         id="path1011" />
    </g>
  </g>
</svg>
