<?xml version="1.0" encoding="UTF-8" standalone="no"?>
<svg
   height="48"
   width="48"
   version="1.1"
   id="svg465"
   sodipodi:docname="Refresh_02_48.svg"
   inkscape:export-filename="Refresh_02_48.png"
   inkscape:export-xdpi="96"
   inkscape:export-ydpi="96"
   inkscape:version="1.2-beta (1b65182ce9, 2022-04-05)"
   xmlns:inkscape="http://www.inkscape.org/namespaces/inkscape"
   xmlns:sodipodi="http://sodipodi.sourceforge.net/DTD/sodipodi-0.dtd"
   xmlns:xlink="http://www.w3.org/1999/xlink"
   xmlns="http://www.w3.org/2000/svg"
   xmlns:svg="http://www.w3.org/2000/svg">
  <defs
     id="defs469" />
  <sodipodi:namedview
     id="namedview467"
     pagecolor="#ffffff"
     bordercolor="#666666"
     borderopacity="1.0"
     inkscape:pageshadow="2"
     inkscape:pageopacity="0.0"
     inkscape:pagecheckerboard="0"
     inkscape:deskcolor="#d1d1d1"
     showgrid="true"
     inkscape:zoom="19.125"
     inkscape:cx="24"
     inkscape:cy="24"
     inkscape:current-layer="svg465">
    <inkscape:grid
       type="xygrid"
       id="grid1490" />
  </sodipodi:namedview>
  <linearGradient
     id="a"
     gradientUnits="userSpaceOnUse"
     x1="18"
     x2="18"
     xlink:href="#c"
     y1="26.25"
     y2="34.5"
     gradientTransform="matrix(2.0000135,0,0,2.0000135,-1.62e-4,-48.375459)" />
  <linearGradient
     id="b"
     gradientTransform="matrix(-3.0000203,0,0,-3.0000203,48.000162,48.375228)"
     gradientUnits="userSpaceOnUse"
     x1="12"
     x2="12"
     xlink:href="#c"
     y1="1.5"
     y2="7" />
  <linearGradient
     id="c">
    <stop
       offset="0"
       stop-color="#21b2fc"
       id="stop454" />
    <stop
       offset="1"
       stop-color="#97edff"
       id="stop456" />
  </linearGradient>
  <g
     id="g1454">
    <path
       d="m 24,3.37501 c -3.565298,0 -6.831367,1.2480464 -9.480533,3.2695541 l 5.355505,5.3555049 C 21.088484,11.303098 22.482776,10.875061 24,10.875061 c 4.600797,0 8.250056,3.649259 8.250056,8.250056 l -6.750046,-5.8e-5 10.500071,10.500071 10.500071,-10.500071 -6.750046,5.8e-5 C 39.750106,10.470992 32.654124,3.37501 24,3.37501 Z"
       fill="url(#a)"
       id="path459"
       style="fill:url(#a);fill-rule:evenodd;stroke:#2c5aa0;stroke-width:2.25002;stroke-linejoin:round" />
    <path
       d="m 24,44.625083 c 3.565298,0 6.831368,-1.248049 9.480532,-3.269554 L 28.125028,36.000024 C 26.911516,36.696995 25.517224,37.125032 24,37.125032 c -4.600798,0 -8.250056,-3.649257 -8.250056,-8.250056 l 6.750046,5.8e-5 -10.500071,-10.500071 -10.5000709,10.500071 6.7500456,-5.8e-5 c 0,8.654125 7.0959813,15.750107 15.7501063,15.750107 z"
       fill="url(#b)"
       id="path461"
       style="fill:url(#b);fill-rule:evenodd;stroke:#2c5aa0;stroke-width:2.25002;stroke-linejoin:round" />
  </g>
</svg>
