<?xml version="1.0" encoding="UTF-8" standalone="no"?>
<svg
   height="36"
   width="36"
   version="1.1"
   id="svg18"
   sodipodi:docname="File_12_36.svg"
   inkscape:version="1.2 (dc2aedaf03, 2022-05-15)"
   inkscape:export-filename="File_12_36.png"
   inkscape:export-xdpi="96"
   inkscape:export-ydpi="96"
   xmlns:inkscape="http://www.inkscape.org/namespaces/inkscape"
   xmlns:sodipodi="http://sodipodi.sourceforge.net/DTD/sodipodi-0.dtd"
   xmlns:xlink="http://www.w3.org/1999/xlink"
   xmlns="http://www.w3.org/2000/svg"
   xmlns:svg="http://www.w3.org/2000/svg">
  <defs
     id="defs22">
    <radialGradient
       id="a-8"
       cx="9.1740294"
       cy="7.8253603"
       gradientTransform="matrix(0.66909781,-2.2758851e-8,4.5190518e-8,0.58542853,1.8616763,4.291566)"
       gradientUnits="userSpaceOnUse"
       r="7.5"
       fx="9.1740294"
       fy="7.8253603">
      <stop
         offset="0"
         stop-color="#fff"
         id="stop2-7"
         style="stop-color:#ccddff;stop-opacity:1;" />
      <stop
         offset="1"
         stop-color="#8fc1c7"
         id="stop4-2"
         style="stop-color:#ffffff;stop-opacity:1" />
    </radialGradient>
    <linearGradient
       inkscape:collect="always"
       xlink:href="#a-8"
       id="linearGradient5209"
       x1="29.5"
       y1="33.5"
       x2="7.5"
       y2="2.5"
       gradientUnits="userSpaceOnUse" />
    <radialGradient
       id="a-8-6"
       cx="12.1"
       cy="10.900001"
       gradientTransform="matrix(0,2.3164984,-2.3164981,4e-8,48.622559,-4.656904)"
       gradientUnits="userSpaceOnUse"
       r="4.5">
      <stop
         offset="0"
         stop-color="#ff7f2a"
         id="stop918" />
      <stop
         offset="1"
         stop-color="#d45500"
         id="stop920" />
    </radialGradient>
  </defs>
  <sodipodi:namedview
     id="namedview20"
     pagecolor="#ffffff"
     bordercolor="#666666"
     borderopacity="1.0"
     inkscape:pageshadow="2"
     inkscape:pageopacity="0.0"
     inkscape:pagecheckerboard="0"
     inkscape:deskcolor="#d1d1d1"
     showgrid="true"
     inkscape:zoom="25.5"
     inkscape:cx="16.882353"
     inkscape:cy="18"
     inkscape:current-layer="svg18"
     showguides="true"
     inkscape:showpageshadow="2">
    <inkscape:grid
       type="xygrid"
       id="grid147"
       originx="0"
       originy="0" />
  </sodipodi:namedview>
  <path
     d="M 6.125,34.875 V 1.125 H 23 L 30.875,9 v 25.875 z"
     id="path2"
     style="fill:url(#linearGradient5209);stroke:#b3b3b3;stroke-width:2.25;stroke-linecap:round;stroke-linejoin:round;stroke-opacity:1;fill-opacity:1"
     sodipodi:nodetypes="cccccc" />
  <path
     d="m 22.125,1.125 v 8.75 h 8.75"
     id="path6"
     style="fill:none;stroke:#b3b3b3;stroke-width:2.25;stroke-linecap:round;stroke-linejoin:round;stroke-opacity:1"
     sodipodi:nodetypes="ccc" />
  <g
     fill="none"
     stroke-width="1.25031"
     transform="matrix(2.1103407,0,0,2.1108583,1.2554715,3.1959053)"
     id="g1123">
    <g
       id="g5457">
      <circle
         cx="26.5"
         cy="26.5"
         r="8.6000004"
         style="fill:url(#a-8-6);stroke:#ffffff;stroke-width:1.8;stroke-linecap:round;stroke-linejoin:round;stroke-dashoffset:1.49998"
         transform="matrix(0,0.47374095,0.47385714,0,-0.59491416,-1.5140312)"
         id="circle923" />
      <path
         d="M 11.28698,9.0599682 13.267602,11.040104 11.28698,13.02024"
         id="path1119"
         sodipodi:nodetypes="ccc"
         style="fill:none;stroke:#ffffff;stroke-linecap:round;stroke-linejoin:round;stroke-opacity:1" />
    </g>
  </g>
</svg>
