<?xml version="1.0" encoding="UTF-8" standalone="no"?>
<svg
   width="48"
   height="48"
   version="1.1"
   viewBox="0 0 48 48"
   id="svg13"
   sodipodi:docname="tactionlist_200.svg"
   inkscape:export-filename="tactionlist_200.png"
   inkscape:export-xdpi="96"
   inkscape:export-ydpi="96"
   inkscape:version="1.3.2 (091e20e, 2023-11-25, custom)"
   xmlns:inkscape="http://www.inkscape.org/namespaces/inkscape"
   xmlns:sodipodi="http://sodipodi.sourceforge.net/DTD/sodipodi-0.dtd"
   xmlns="http://www.w3.org/2000/svg"
   xmlns:svg="http://www.w3.org/2000/svg">
  <defs
     id="defs13" />
  <sodipodi:namedview
     id="namedview13"
     pagecolor="#ffffff"
     bordercolor="#000000"
     borderopacity="0.25"
     inkscape:showpageshadow="2"
     inkscape:pageopacity="0.0"
     inkscape:pagecheckerboard="0"
     inkscape:deskcolor="#d1d1d1"
     showgrid="true"
     inkscape:current-layer="svg13">
    <inkscape:grid
       id="grid13"
       units="px"
       originx="0"
       originy="0"
       spacingx="0.5"
       spacingy="0.5"
       empcolor="#0099e5"
       empopacity="0.30196078"
       color="#0099e5"
       opacity="0.14901961"
       empspacing="2"
       dotted="false"
       gridanglex="30"
       gridanglez="30"
       visible="true" />
  </sodipodi:namedview>
  <path
     d="m2.5201492 3.5000086h44.979849v7.0000004h-44.979849z"
     fill="#f9f9f9"
     fill-rule="evenodd"
     stroke="#2a7efe"
     id="path1" />
  <rect
     x="2.5"
     y="10.499991"
     width="20"
     height="34"
     fill="#f9f9f9"
     stroke="#2a7efe"
     style="paint-order:normal"
     id="rect1" />
  <path
     d="m3.0000001 30.500009h19"
     fill="#4d4d4d"
     fill-rule="evenodd"
     stroke="#cccccc"
     stroke-width="1.05409px"
     id="path2" />
  <path
     d="m5 26.000009h10"
     fill="none"
     stroke="#b3b3b3"
     stroke-width="2"
     id="path3" />
  <path
     d="m5 22.000009h8"
     fill="none"
     stroke="#b3b3b3"
     stroke-width="2"
     id="path4" />
  <path
     d="m5 18.000009h12"
     fill="none"
     stroke="#b3b3b3"
     stroke-width="2"
     id="path5" />
  <path
     d="m5 39.000009h12"
     fill="none"
     stroke="#b3b3b3"
     stroke-width="2"
     id="path6" />
  <path
     d="m5 14.000009h10"
     fill="none"
     stroke="#b3b3b3"
     stroke-width="2"
     id="path7" />
  <path
     d="m5 35.000009h10"
     fill="none"
     stroke="#b3b3b3"
     stroke-width="2"
     id="path8" />
  <path
     d="m23 7.0000086h6"
     fill="none"
     stroke="#b3b3b3"
     stroke-width="2"
     id="path9" />
  <path
     d="m13 7.0000086h8"
     fill="none"
     stroke="#b3b3b3"
     stroke-width="2"
     id="path10" />
  <path
     d="m5 7.0000086h6"
     fill="none"
     stroke="#b3b3b3"
     stroke-width="2"
     id="path11" />
  <rect
     x="26.374998"
     y="28.375"
     width="21.250002"
     height="12.25"
     rx="2.125"
     ry="2.125"
     fill="#ececec"
     stroke="#2a7efe"
     stroke-linecap="round"
     stroke-linejoin="round"
     stroke-width=".749998"
     style="paint-order:normal"
     id="rect11" />
  <path
     d="m34.462174 31.400038c1.14245 0 2.062185 0.84954 2.062185 1.904797v2.390332c0 1.055257-0.919735 1.904795-2.062185 1.904795-1.14244 0-2.062174-0.849538-2.062174-1.904795v-2.390332c0-1.055257 0.919734-1.904797 2.062174-1.904797z"
     fill="none"
     stroke="#4d4d4d"
     stroke-linecap="round"
     stroke-linejoin="round"
     stroke-width=".8"
     id="path12" />
  <path
     d="m41.931176 37.6-1.716028-2.774339m1.394506-1.654233-2.746155 3.257626m-0.108614-5.029054v6.2"
     fill="none"
     stroke="#4d4d4d"
     stroke-linecap="round"
     stroke-linejoin="round"
     stroke-width=".8"
     id="path13" />
</svg>
