<?xml version="1.0" encoding="UTF-8" standalone="no"?>
<svg
   height="16"
   width="16"
   version="1.1"
   id="svg171"
   sodipodi:docname="Window_14_16.svg"
   inkscape:version="1.2.2 (732a01da63, 2022-12-09)"
   xmlns:inkscape="http://www.inkscape.org/namespaces/inkscape"
   xmlns:sodipodi="http://sodipodi.sourceforge.net/DTD/sodipodi-0.dtd"
   xmlns="http://www.w3.org/2000/svg"
   xmlns:svg="http://www.w3.org/2000/svg">
  <defs
     id="defs175" />
  <sodipodi:namedview
     id="namedview173"
     pagecolor="#ffffff"
     bordercolor="#000000"
     borderopacity="0.25"
     inkscape:showpageshadow="2"
     inkscape:pageopacity="0.0"
     inkscape:pagecheckerboard="0"
     inkscape:deskcolor="#d1d1d1"
     showgrid="true"
     inkscape:zoom="56.875"
     inkscape:cx="7.9912088"
     inkscape:cy="8"
     inkscape:current-layer="svg171">
    <inkscape:grid
       type="xygrid"
       id="grid1034" />
  </sodipodi:namedview>
  <rect
     fill="#f5f7ff"
     height="13"
     rx="1.1"
     stroke="#00aad4"
     stroke-linejoin="round"
     width="13"
     x="1.5"
     y="1.5"
     id="rect151" />
  <g
     fill="#00aad4"
     id="g169">
    <path
       d="m1.5 1.5h13v2h-13z"
       fill-rule="evenodd"
       stroke-width=".999991"
       id="path153" />
    <g
       stroke-width=".999996"
       id="g167">
      <path
         d="m3.5 5.5v2h2v-2z"
         id="path155" />
      <path
         d="m10.5 5.5v2h2v-2z"
         id="path157" />
      <path
         d="m7 5.5v2h2v-2z"
         id="path159" />
      <path
         d="m3.5 9v2h2v-2z"
         id="path161" />
      <path
         d="m10.5 9v2h2v-2z"
         id="path163" />
      <path
         d="m7 9v2h2v-2z"
         id="path165" />
    </g>
  </g>
</svg>
