<?xml version="1.0" encoding="UTF-8" standalone="no"?>
<svg
   height="32"
   width="32"
   version="1.1"
   id="svg275"
   sodipodi:docname="Cloud_10_32.svg"
   inkscape:export-filename="Cloud_10_32.png"
   inkscape:export-xdpi="96"
   inkscape:export-ydpi="96"
   inkscape:version="1.2.1 (9c6d41e410, 2022-07-14)"
   xmlns:inkscape="http://www.inkscape.org/namespaces/inkscape"
   xmlns:sodipodi="http://sodipodi.sourceforge.net/DTD/sodipodi-0.dtd"
   xmlns="http://www.w3.org/2000/svg"
   xmlns:svg="http://www.w3.org/2000/svg">
  <defs
     id="defs279" />
  <sodipodi:namedview
     id="namedview277"
     pagecolor="#ffffff"
     bordercolor="#666666"
     borderopacity="1.0"
     inkscape:showpageshadow="2"
     inkscape:pageopacity="0.0"
     inkscape:pagecheckerboard="0"
     inkscape:deskcolor="#d1d1d1"
     showgrid="true"
     inkscape:zoom="28.6875"
     inkscape:cx="15.494553"
     inkscape:cy="16"
     inkscape:current-layer="svg275">
    <inkscape:grid
       type="xygrid"
       id="grid818" />
  </sodipodi:namedview>
  <linearGradient
     id="a"
     gradientTransform="matrix(1.0000001 0 0 .96627923 -.000186 .08837)"
     gradientUnits="userSpaceOnUse"
     x1="7.5"
     x2="9"
     y1="2"
     y2="13">
    <stop
       offset="0"
       stop-color="#5ab4f2"
       id="stop268" />
    <stop
       offset="1"
       stop-color="#0090ff"
       id="stop270" />
  </linearGradient>
  <path
     d="m3.2916409 12.65c-4.3402418 0-4.3402418-5.8903515-.2858606-5.8903515-.5693968-6.06642832 9.1223577-5.7049987 9.1223577-1.4725881 4.918072-.3594726 5.574822 7.3629396-.506799 7.3629396z"
     fill="url(#a)"
     transform="matrix(1.9999999 0 0 1.9999999 .000372 0)"
     id="path273" />
  <g
     id="g4096"
     transform="matrix(2.0497851,0,0,2.0446436,-10.771523,-10.71419)"
     style="stroke-width:0.488469">
    <path
       style="fill:#ff5555;fill-opacity:1;stroke:#ffffff;stroke-width:0.781551;stroke-linecap:round;stroke-linejoin:bevel;stroke-dasharray:none;stroke-opacity:1"
       d="M 15.5,20.5 C 18,20 19.5,18 19.5,13 18,13 16.430732,12.433884 15.5,11.499999"
       id="path1107"
       sodipodi:nodetypes="ccc" />
    <path
       style="fill:#ffdd55;fill-opacity:1;stroke:#ffffff;stroke-width:0.781551;stroke-linecap:round;stroke-linejoin:bevel;stroke-dasharray:none;stroke-opacity:1"
       d="m 15.5,11.5 c -1,1.000002 -2.5,1.5 -4,1.5 0,5 1.476228,7.019274 4,7.5"
       id="path2905"
       sodipodi:nodetypes="ccc" />
  </g>
</svg>
