<?xml version="1.0" encoding="UTF-8" standalone="no"?>
<svg
   width="16"
   height="16"
   viewBox="0 0 16 16"
   version="1.1"
   id="svg1"
   sodipodi:docname="color-picker.svg"
   inkscape:version="1.3.2 (091e20e, 2023-11-25, custom)"
   inkscape:export-filename="color-picker.png"
   inkscape:export-xdpi="96"
   inkscape:export-ydpi="96"
   xmlns:inkscape="http://www.inkscape.org/namespaces/inkscape"
   xmlns:sodipodi="http://sodipodi.sourceforge.net/DTD/sodipodi-0.dtd"
   xmlns="http://www.w3.org/2000/svg"
   xmlns:svg="http://www.w3.org/2000/svg">
  <defs
     id="defs1" />
  <sodipodi:namedview
     id="namedview1"
     pagecolor="#ffffff"
     bordercolor="#000000"
     borderopacity="0.25"
     inkscape:showpageshadow="2"
     inkscape:pageopacity="0.0"
     inkscape:pagecheckerboard="0"
     inkscape:deskcolor="#d1d1d1"
     showgrid="true"
     inkscape:current-layer="svg1">
    <inkscape:grid
       id="grid1"
       units="px"
       originx="0"
       originy="0"
       spacingx="0.5"
       spacingy="0.5"
       empcolor="#0099e5"
       empopacity="0.30196078"
       color="#0099e5"
       opacity="0.14901961"
       empspacing="2"
       dotted="false"
       gridanglex="30"
       gridanglez="30"
       visible="true" />
  </sodipodi:namedview>
  <path
     d="M 1.3613282,8.4999997 4.2480468,13.498047 7.1347656,8.4999997 Z"
     fill="#5599ff"
     id="path1"
     style="stroke-width:3.77953" />
  <path
     d="M 7.9951172,8.9979997 5.1103517,13.99214 10.881836,13.99994 Z"
     fill="#3385ff"
     id="path2"
     style="stroke-width:3.77953" />
  <path
     d="M 8.8632811,8.4999997 11.753906,13.501953 14.638672,8.4999997 Z"
     fill="#00ff00"
     id="path3"
     style="stroke-width:3.77953" />
  <path
     d="M 11.751953,2.4999999 8.8652344,7.498047 h 5.7695316 z"
     fill="#00d400"
     id="path4"
     style="stroke-width:3.77953" />
  <path
     d="M 5.1074218,2 7.9980467,7.0000001 10.886719,2 Z"
     fill="#ff8080"
     id="path5"
     style="stroke-width:3.77953" />
  <path
     d="M 4.2460939,2.4960937 1.3652344,7.498047 h 5.767578 z"
     fill="#ff0000"
     id="path6"
     style="stroke-width:3.77953" />
</svg>
