<?xml version="1.0" encoding="UTF-8" standalone="no"?>
<svg
   width="24"
   height="24"
   version="1.1"
   viewBox="0 0 24 24"
   id="svg4"
   sodipodi:docname="Secure_10_24.svg"
   inkscape:export-filename="Secure_10_24.png"
   inkscape:export-xdpi="96"
   inkscape:export-ydpi="96"
   inkscape:version="1.3.2 (091e20e, 2023-11-25, custom)"
   xmlns:inkscape="http://www.inkscape.org/namespaces/inkscape"
   xmlns:sodipodi="http://sodipodi.sourceforge.net/DTD/sodipodi-0.dtd"
   xmlns="http://www.w3.org/2000/svg"
   xmlns:svg="http://www.w3.org/2000/svg">
  <defs
     id="defs4" />
  <sodipodi:namedview
     id="namedview4"
     pagecolor="#ffffff"
     bordercolor="#000000"
     borderopacity="0.25"
     inkscape:showpageshadow="2"
     inkscape:pageopacity="0.0"
     inkscape:pagecheckerboard="0"
     inkscape:deskcolor="#d1d1d1"
     showgrid="true"
     inkscape:current-layer="svg4">
    <inkscape:grid
       id="grid4"
       units="px"
       originx="0"
       originy="0"
       spacingx="0.5"
       spacingy="0.5"
       empcolor="#0099e5"
       empopacity="0.30196078"
       color="#0099e5"
       opacity="0.14901961"
       empspacing="2"
       dotted="false"
       gridanglex="30"
       gridanglez="30"
       visible="true" />
  </sodipodi:namedview>
  <path
     d="m11.75 2.2500002v19.499784c0 2.015625-3 1.98489-3 0"
     fill="none"
     stroke="#cd804b"
     stroke-linecap="round"
     stroke-width="1.5"
     id="path1" />
  <path
     d="m11.733934 2.9997844c-4.02631 2.2683382-5.210533 5.9598358-4.919146 10.2 1.305224-1.264863 3.423268-1.854214 4.919146-1.854214 1.495879 0 3.646054 0.589351 4.951278 1.854214 0.291385-4.2401638-0.924968-7.9316614-4.951278-10.2z"
     fill="#2a7efe"
     stroke-width="1.5"
     id="path2" />
  <path
     d="m11.733934 2.9997844c4.026306 2.2683361 5.242663 5.9598398 4.951278 10.2 1.645068-1.339819 3.290544-1.341502 6.014788-0.921643-1.20234-5.4373958-5.742325-9.2772718-10.966066-9.2783566z"
     fill="#67a3fe"
     stroke-width="1.5"
     id="path3" />
  <path
     d="m11.733934 2.9997844c-5.206355 0.0137647-9.7262223 3.8395638-10.933934 9.2564996 2.7232871-0.398128 4.3697193-0.396319 6.014788 0.9435-0.291386-4.2401598 0.89284-7.9316635 4.919146-10.2z"
     fill="#67a3fe"
     stroke-width="1.5"
     id="path4" />
</svg>
