<?xml version="1.0" encoding="UTF-8" standalone="no"?>
<svg
   width="16"
   height="16"
   version="1.1"
   id="svg37"
   sodipodi:docname="Grid_18_16.svg"
   inkscape:export-filename="Grid_18_16.png"
   inkscape:export-xdpi="96"
   inkscape:export-ydpi="96"
   inkscape:version="1.3.2 (091e20e, 2023-11-25, custom)"
   xmlns:inkscape="http://www.inkscape.org/namespaces/inkscape"
   xmlns:sodipodi="http://sodipodi.sourceforge.net/DTD/sodipodi-0.dtd"
   xmlns="http://www.w3.org/2000/svg"
   xmlns:svg="http://www.w3.org/2000/svg">
  <sodipodi:namedview
     id="namedview37"
     pagecolor="#ffffff"
     bordercolor="#000000"
     borderopacity="0.25"
     inkscape:showpageshadow="2"
     inkscape:pageopacity="0.0"
     inkscape:pagecheckerboard="0"
     inkscape:deskcolor="#d1d1d1"
     showgrid="true"
     inkscape:current-layer="svg37">
    <inkscape:grid
       id="grid37"
       units="px"
       originx="0"
       originy="0"
       spacingx="0.5"
       spacingy="0.5"
       empcolor="#0099e5"
       empopacity="0.30196078"
       color="#0099e5"
       opacity="0.14901961"
       empspacing="2"
       dotted="false"
       gridanglex="30"
       gridanglez="30"
       visible="true" />
  </sodipodi:namedview>
  <defs
     id="defs24">
    <linearGradient
       id="g"
       x1="3"
       x2="1.5"
       y1="3.5"
       y2="1.5"
       gradientTransform="translate(8.5e-6)"
       gradientUnits="userSpaceOnUse">
      <stop
         stop-color="#0000ff"
         offset="0"
         id="stop1" />
      <stop
         stop-color="#ff7171"
         offset="1"
         id="stop2" />
    </linearGradient>
    <linearGradient
       id="c"
       x1="5.5"
       x2="7.5"
       y1="3.5"
       y2="1.5"
       gradientTransform="translate(8.5e-6)"
       gradientUnits="userSpaceOnUse">
      <stop
         stop-color="#aaccff"
         offset="0"
         id="stop3" />
      <stop
         stop-color="#ffc9c9"
         offset="1"
         id="stop4" />
    </linearGradient>
    <linearGradient
       id="b"
       x1="11.5"
       x2="9.5"
       y1="3.5"
       y2="1.5"
       gradientTransform="translate(8.5e-6)"
       gradientUnits="userSpaceOnUse">
      <stop
         stop-color="#ff0000"
         offset="0"
         id="stop5" />
      <stop
         stop-color="#ffff51"
         offset="1"
         id="stop6" />
    </linearGradient>
    <linearGradient
       id="a"
       x1="2.5"
       x2="3"
       y1="7"
       y2="5.5"
       gradientTransform="translate(8.5e-6)"
       gradientUnits="userSpaceOnUse">
      <stop
         stop-color="#efef00"
         offset="0"
         id="stop7" />
      <stop
         stop-color="#00ff00"
         offset="1"
         id="stop8" />
    </linearGradient>
    <linearGradient
       id="l"
       x1="5.5"
       x2="7.5"
       y1="5.5"
       y2="7.5"
       gradientTransform="translate(8.5e-6)"
       gradientUnits="userSpaceOnUse">
      <stop
         stop-color="#d45500"
         offset="0"
         id="stop9" />
      <stop
         stop-color="#aaffaa"
         offset="1"
         id="stop10" />
    </linearGradient>
    <linearGradient
       id="k"
       x1="1.5"
       x2="3.5"
       y1="11.5"
       y2="9.5"
       gradientTransform="translate(8.5e-6)"
       gradientUnits="userSpaceOnUse">
      <stop
         stop-color="#6868ff"
         offset="0"
         id="stop11" />
      <stop
         stop-color="#aaccff"
         offset="1"
         id="stop12" />
    </linearGradient>
    <linearGradient
       id="j"
       x1="5.5"
       x2="7.5"
       y1="11.5"
       y2="9.5"
       gradientTransform="translate(8.5e-6)"
       gradientUnits="userSpaceOnUse">
      <stop
         stop-color="#ffcc00"
         offset="0"
         id="stop13" />
      <stop
         stop-color="#aaaaff"
         offset="1"
         id="stop14" />
    </linearGradient>
    <linearGradient
       id="i"
       x1="1.5"
       x2="3.5"
       y1="15.5"
       y2="13.5"
       gradientTransform="translate(8.5e-6)"
       gradientUnits="userSpaceOnUse">
      <stop
         stop-color="#008000"
         offset="0"
         id="stop15" />
      <stop
         stop-color="#6868ff"
         offset="1"
         id="stop16" />
    </linearGradient>
    <linearGradient
       id="h"
       x1="5.5"
       x2="7.5"
       y1="15.5"
       y2="13.5"
       gradientTransform="translate(8.5e-6)"
       gradientUnits="userSpaceOnUse">
      <stop
         stop-color="#00d400"
         offset="0"
         id="stop17" />
      <stop
         stop-color="#ffc9c9"
         offset="1"
         id="stop18" />
    </linearGradient>
    <linearGradient
       id="e"
       x1="1.5"
       x2="3.5"
       y1="15.5"
       y2="13.5"
       gradientTransform="translate(8,-7.999999)"
       gradientUnits="userSpaceOnUse">
      <stop
         stop-color="#d42aff"
         offset="0"
         id="stop19" />
      <stop
         stop-color="#00aad4"
         offset="1"
         id="stop20" />
    </linearGradient>
    <linearGradient
       id="d"
       x1="1.5"
       x2="3.5"
       y1="15.5"
       y2="13.5"
       gradientTransform="translate(7.9999998,-3.999999)"
       gradientUnits="userSpaceOnUse">
      <stop
         stop-color="#55ffdd"
         offset="0"
         id="stop21" />
      <stop
         stop-color="#8787de"
         offset="1"
         id="stop22" />
    </linearGradient>
    <linearGradient
       id="f"
       x1="14.156251"
       x2="8.843751"
       y1="14.15625"
       y2="8.84375"
       gradientUnits="userSpaceOnUse">
      <stop
         stop-color="#009600"
         offset="0"
         id="stop23" />
      <stop
         stop-color="#6edb39"
         offset="1"
         id="stop24" />
    </linearGradient>
  </defs>
  <path
     d="m1.0000085 15.999999v-3h3.000017v3z"
     fill="url(#i)"
     fill-rule="evenodd"
     id="path24" />
  <path
     d="m1.0000085 3.999999v-2.999999h3.000017v2.999999z"
     fill="url(#g)"
     fill-rule="evenodd"
     id="path25" />
  <path
     d="m1.0000085 7.999999v-3h3.000017v3z"
     fill="url(#a)"
     fill-rule="evenodd"
     id="path26" />
  <path
     d="m9.000009 1v3l3-4e-7v-2.9999996z"
     fill="url(#b)"
     fill-rule="evenodd"
     id="path27" />
  <path
     d="M 8,15.982422 A 5.6999998,5.6999998 0 0 1 6.0078125,13 H 5 v 3 h 3 z"
     fill="url(#h)"
     fill-rule="evenodd"
     id="path28" />
  <path
     d="m1 12v-2.9999995h3.000017v2.9999995z"
     fill="url(#k)"
     fill-rule="evenodd"
     id="path29" />
  <path
     d="M 5,5 V 8 H 7.0175781 A 5.6999998,5.6999998 0 0 1 8,7.0175781 V 5 Z"
     fill="url(#l)"
     fill-rule="evenodd"
     id="path30" />
  <path
     d="m5.0000005 3.9999998v-2.9999995h3.000016v2.9999995z"
     fill="url(#c)"
     fill-rule="evenodd"
     id="path31" />
  <path
     d="M 5.8359375,12 A 5.6999998,5.6999998 0 0 1 5.8007812,11.5 5.6999998,5.6999998 0 0 1 6.3867187,9 H 5 v 3 z"
     fill="url(#j)"
     fill-rule="evenodd"
     id="path32" />
  <path
     d="M 9,6.3867187 A 5.6999998,5.6999998 0 0 1 11.5,5.8007812 5.6999998,5.6999998 0 0 1 12,5.8242187 V 5 H 9 Z"
     fill="url(#e)"
     fill-rule="evenodd"
     id="path33" />
  <g
     stroke-linecap="round"
     id="g37">
    <circle
       transform="matrix(0,1,1,0,0,0)"
       cx="11.5"
       cy="11.5"
       r="4.25"
       fill="url(#f)"
       stroke="#90e467"
       stroke-dashoffset="1.49998"
       stroke-linejoin="round"
       stroke-width=".5"
       id="circle34" />
    <g
       fill="none"
       stroke="#ffffff"
       id="g36">
      <path
         d="m11.5 9.5v4"
         id="path35" />
      <path
         d="m13.5 11.5h-4"
         id="path36" />
    </g>
  </g>
</svg>
