<?xml version="1.0" encoding="UTF-8" standalone="no"?>
<svg
   height="24"
   width="24"
   version="1.1"
   id="svg155"
   sodipodi:docname="menu_goto_bookmark9_150.svg"
   inkscape:export-filename="menu_goto_bookmark9_150.png"
   inkscape:export-xdpi="96"
   inkscape:export-ydpi="96"
   inkscape:version="1.2.2 (732a01da63, 2022-12-09)"
   xmlns:inkscape="http://www.inkscape.org/namespaces/inkscape"
   xmlns:sodipodi="http://sodipodi.sourceforge.net/DTD/sodipodi-0.dtd"
   xmlns="http://www.w3.org/2000/svg"
   xmlns:svg="http://www.w3.org/2000/svg">
  <defs
     id="defs159" />
  <sodipodi:namedview
     id="namedview157"
     pagecolor="#ffffff"
     bordercolor="#666666"
     borderopacity="1.0"
     inkscape:showpageshadow="2"
     inkscape:pageopacity="0.0"
     inkscape:pagecheckerboard="0"
     inkscape:deskcolor="#d1d1d1"
     showgrid="true"
     inkscape:zoom="38.25"
     inkscape:cx="11.986928"
     inkscape:cy="12"
     inkscape:current-layer="svg155">
    <inkscape:grid
       type="xygrid"
       id="grid427" />
  </sodipodi:namedview>
  <radialGradient
     id="a"
     cx="10.5"
     cy="12"
     gradientUnits="userSpaceOnUse"
     r="6">
    <stop
       offset="0"
       stop-color="#2a7fff"
       id="stop142" />
    <stop
       offset=".69999999"
       stop-color="#4d94ff"
       id="stop144" />
    <stop
       offset="1"
       stop-color="#96bdff"
       id="stop146" />
  </radialGradient>
  <g
     stroke-width=".666667"
     transform="matrix(1.5 0 0 1.5 -3.75 -6.5)"
     id="g153">
    <circle
       cx="10.5"
       cy="12"
       fill="url(#a)"
       r="6"
       id="circle149" />
    <path
       d="m11.248257 11.952963c.03794.229395-.15485.406444-.347404.49689-.667883.280353-1.5229303.059465-1.9321968-.551154-.4364278-.629405-.4686469-1.452764-.3161084-2.1806524.1299889-.626367.5978883-1.1838107 1.228627-1.3443687.7141172-.1882914 1.5704742-.1084602 2.1098092.443222.553349.5902497.634093 1.4683121.51746 2.2344411-.09284.647185-.370296 1.24268-.668254 1.817305-.436365.876953-.872731 1.753907-1.309096 2.63086-.360223 0-.720446 0-1.080669 0 .599277-1.182181 1.198555-2.364362 1.797832-3.546543zm-.682783-.299639c.431113.02867.825776-.288451.922248-.703659.115393-.487949.112326-1.0868984-.262491-1.46633-.427497-.3919598-1.2485498-.3040731-1.5083241.2435332-.1941225.4307658-.1886494.9483698-.0229488 1.3871028.1356616.35114.5034239.554846.8715159.539353z"
       fill="#fff"
       transform="scale(.9940341 1.0060017)"
       id="path151" />
  </g>
</svg>
