<?xml version="1.0" encoding="UTF-8" standalone="no"?>
<svg
   height="24"
   viewBox="0 0 6.35 6.35"
   width="24"
   version="1.1"
   id="svg344"
   sodipodi:docname="Setup_08_24.svg"
   inkscape:version="1.2.2 (732a01da63, 2022-12-09)"
   xmlns:inkscape="http://www.inkscape.org/namespaces/inkscape"
   xmlns:sodipodi="http://sodipodi.sourceforge.net/DTD/sodipodi-0.dtd"
   xmlns="http://www.w3.org/2000/svg"
   xmlns:svg="http://www.w3.org/2000/svg">
  <defs
     id="defs348" />
  <sodipodi:namedview
     id="namedview346"
     pagecolor="#ffffff"
     bordercolor="#000000"
     borderopacity="0.25"
     inkscape:showpageshadow="2"
     inkscape:pageopacity="0.0"
     inkscape:pagecheckerboard="0"
     inkscape:deskcolor="#d1d1d1"
     showgrid="true"
     inkscape:zoom="37.916667"
     inkscape:cx="11.986813"
     inkscape:cy="12"
     inkscape:current-layer="svg344">
    <inkscape:grid
       type="xygrid"
       id="grid1099" />
  </sodipodi:namedview>
  <radialGradient
     id="a"
     cx="7.487501"
     cy="6.25"
     gradientTransform="matrix(-.00000005 .47624997 -.47624989 -.00000013 6.766718 .025797)"
     gradientUnits="userSpaceOnUse"
     r="2.25">
    <stop
       offset="0"
       stop-color="#fce99c"
       id="stop314" />
    <stop
       offset="1"
       stop-color="#fc0"
       id="stop316" />
  </radialGradient>
  <radialGradient
     id="b"
     cx="7.487501"
     cy="6.25"
     gradientTransform="matrix(-.00000004 .47624997 -.47624997 -.00000005 5.179218 .025796)"
     gradientUnits="userSpaceOnUse"
     r="2.25">
    <stop
       offset="0"
       stop-color="#a0c2f8"
       id="stop319" />
    <stop
       offset="1"
       stop-color="#2672e5"
       id="stop321" />
  </radialGradient>
  <radialGradient
     id="c"
     cx="7.487501"
     cy="6.25"
     gradientTransform="matrix(-.00000003 .47624997 -.47624997 -.00000008 5.972968 -1.561704)"
     gradientUnits="userSpaceOnUse"
     r="2.25">
    <stop
       offset="0"
       stop-color="#f99"
       id="stop324" />
    <stop
       offset="1"
       stop-color="#d40000"
       id="stop326" />
  </radialGradient>
  <radialGradient
     id="d"
     cx="5"
     cy="11"
     gradientTransform="matrix(-.00000001 .54570296 -.54570296 -.00000002 7.987108 -.74414)"
     gradientUnits="userSpaceOnUse"
     r="8.000001">
    <stop
       offset="0"
       stop-color="#e5e5e5"
       id="stop329" />
    <stop
       offset="1"
       stop-color="#b3b3b3"
       id="stop331" />
  </radialGradient>
  <g
     stroke-width=".198437"
     id="g342">
    <path
       d="m6.2504385 4.0206723-.594855-.5255612-.0002299-.6401887.5954294-.5257834-.3027614-.7309324-.7928059.0492596-.4525195-.4528447.048987-.79226571-.7310106-.30279467-.5255609.59485561-.640189.00022971-.5257829-.59542981-.730933.30276231.0492475.79281716-.4528443.4525193-.79225456-.0489985-.30279412.7310104.59485538.5255779.00022977.6401887-.59542964.5257668.30276206.7309329.79281771-.0492482.4525193.4528452-.0489988.792254.7310108.3027942.5255609-.5948553.6401887-.0002302.5257835.59543.7309323-.3027617-.0492471-.7928181.4528441-.45252.7922543.0489995z"
       fill="url(#d)"
       stroke="#b3b3b3"
       stroke-linejoin="round"
       id="path334" />
    <circle
       cx="3.174999"
       cy="2.182813"
       fill="url(#c)"
       r=".892969"
       stroke="#a00"
       id="circle336" />
    <circle
       cx="2.38125"
       cy="3.770313"
       fill="url(#b)"
       r=".892969"
       stroke="#0055d4"
       id="circle338" />
    <circle
       cx="3.96875"
       cy="3.770313"
       fill="url(#a)"
       r=".892969"
       stroke="#d4aa00"
       id="circle340" />
  </g>
</svg>
