<?xml version="1.0" encoding="UTF-8" standalone="no"?>
<svg
   height="24"
   viewBox="0 0 24 24"
   width="24"
   version="1.1"
   id="svg364"
   sodipodi:docname="table_close_150.svg"
   inkscape:version="1.2.2 (732a01da63, 2022-12-09)"
   xmlns:inkscape="http://www.inkscape.org/namespaces/inkscape"
   xmlns:sodipodi="http://sodipodi.sourceforge.net/DTD/sodipodi-0.dtd"
   xmlns="http://www.w3.org/2000/svg"
   xmlns:svg="http://www.w3.org/2000/svg">
  <defs
     id="defs368" />
  <sodipodi:namedview
     id="namedview366"
     pagecolor="#ffffff"
     bordercolor="#000000"
     borderopacity="0.25"
     inkscape:showpageshadow="2"
     inkscape:pageopacity="0.0"
     inkscape:pagecheckerboard="0"
     inkscape:deskcolor="#d1d1d1"
     showgrid="true"
     inkscape:zoom="37.916667"
     inkscape:cx="11.986813"
     inkscape:cy="12"
     inkscape:current-layer="svg364">
    <inkscape:grid
       type="xygrid"
       id="grid1039" />
  </sodipodi:namedview>
  <linearGradient
     id="a"
     gradientTransform="matrix(.75369591 0 0 .73237584 58.509953 16.160845)"
     gradientUnits="userSpaceOnUse"
     x1="-49.009357"
     x2="-49.633709"
     y1="6.522097"
     y2="3.715767">
    <stop
       offset="0"
       stop-color="#e6e6e6"
       id="stop328" />
    <stop
       offset="1"
       stop-color="#999"
       id="stop330" />
  </linearGradient>
  <linearGradient
     id="b"
     gradientTransform="matrix(.75369591 0 0 .73237584 95.941304 48.019193)"
     gradientUnits="userSpaceOnUse"
     x1="-124.5"
     x2="-122"
     y1="-45"
     y2="-45">
    <stop
       offset="0"
       stop-color="#de7900"
       id="stop333" />
    <stop
       offset="1"
       stop-color="#ffa73e"
       id="stop335" />
  </linearGradient>
  <filter
     id="c"
     color-interpolation-filters="sRGB"
     height="1.1080598"
     width="1.0607311"
     x="-0.030365546"
     y="-0.054029903">
    <feGaussianBlur
       stdDeviation=".3602005"
       id="feGaussianBlur338" />
  </filter>
  <linearGradient
     id="d"
     gradientTransform="matrix(.75369591 0 0 .73237584 .17389 .048576)"
     gradientUnits="userSpaceOnUse"
     x1="14"
     x2="14"
     y1="25.5"
     y2="28">
    <stop
       offset="0"
       stop-color="#ccc"
       id="stop341" />
    <stop
       offset="1"
       stop-color="#fff"
       id="stop343" />
  </linearGradient>
  <path
     d="m-154.30078-29.5c-1.70899-.0016-3 .5-3.44985 1.972448l-1.02085 11.191661c-.0293 1.835891 1.57019 2.814254 3.11132 2.835938h24.85938l.49805-.548828-.30608-4.470403.30607-.53741-1.13672-10-.49609-.443406z"
     fill="#999"
     fill-opacity=".994638"
     filter="url(#c)"
     transform="matrix(.76162991 0 0 .73237584 121.98383 30.921001)"
     id="path346" />
  <g
     stroke-linecap="round"
     transform="translate(0 -1.999887)"
     id="g360">
    <path
       d="m1.7566511 20.555099.4522175-13.8404614c.120614-1.2157636 1.1305439-1.4647516 2.2610877-1.4647516h17.2323017l.856401 13.530115"
       fill="url(#b)"
       stroke="#b26f25"
       stroke-linejoin="round"
       stroke-opacity=".994638"
       stroke-width=".499999"
       id="path348" />
    <path
       d="m4.6664484 18.580108.4211031-13.257108"
       fill="none"
       stroke="#b26f24"
       stroke-width=".5"
       id="path350" />
    <g
       stroke-linejoin="round"
       stroke-width=".499999"
       id="g358">
      <path
         d="m22.407918 22.186-.452217-3.362h-2.788675v3.362z"
         fill="url(#a)"
         stroke="#b26f24"
         id="path352" />
      <path
         d="m22.407918 22.186h-18.6916576c-2.6379356 0-2.6379356-3.405999 0-3.405999h18.8423986c-1.884239 0-2.03498 3.405999-.150741 3.405999z"
         fill="url(#d)"
         stroke="#b16e24"
         id="path354" />
      <path
         d="m13.131621 7.008795c-3.5526625-.024124-6.2488503 1.5423634-6.1276937 3.345937.098729 1.469666 3.4024227 1.756315 4.5116887.591463.268835-.282306.430122-.343413.598825-.392036.160211-.04617.426017-.072.82851-.08522-.04039.08559-.03851.186718-.16953.289766-.22357.175833-.700053.436196-1.296086.828387-.831015.546812-1.353506 1.311992-1.353506 2.128924 0 .292103.255075.555166.492184.813047-.7084303.351386-1.2401252.823413-1.2413982 1.394283-.00253 1.001353 1.4786652 1.885334 3.0597452 1.885179 1.580226.000155 3.060672-.88279 3.059746-1.883475-.000342-.543866-.470301-1.014243-1.123821-1.365306.222749-.228254.496769-.446821.511325-.712482l-.02187.132951c-.00083.003.05296-.09509.366404-.271016.31344-.175926.815424-.390109 1.356241-.637483a1.5920576.99243276 0 0 0 .0957-.04602c1.042479-.558433 2.482492-1.443419 2.471857-2.786862-.008072-1.0198651-.883559-1.8926523-2.031628-2.425512-1.14807-.5328598-2.55666-.7948153-3.986693-.804525z"
         fill="#ff0"
         id="path356" />
    </g>
  </g>
  <path
     d="m13.902483 13.925834a1.4681127.89008977 0 0 1 -1.468113.89009 1.4681127.89008977 0 0 1 -1.468112-.89009 1.4681127.89008977 0 0 1 1.468112-.89009 1.4681127.89008977 0 0 1 1.468113.89009zm-.786351-7.9255177c2.22796.015128 4.432528.857355 4.443494 2.2430292.0073.9196385-.934794 1.5025465-1.918338 2.0294065-.993388.454384-2.175589.896197-2.35204 1.540414-.04105.749186-1.574859.772646-1.574859-.09698 0-.586424.329058-1.059027.920018-1.447881 1.053568-.693252 1.968847-1.031484 2.019882-1.9693265.033473-.6151245-1.071752-.8445122-1.738194-.8262948-1.017553.0278153-1.975619.1330218-2.769836.9670378-.4735429.497272-1.5252667.271593-1.5519203-.125169-.0707851-1.0537284 1.7662913-2.3329471 4.5217933-2.3142362z"
     fill="#f50"
     stroke-width="1.22476"
     id="path362" />
</svg>
