<?xml version="1.0" encoding="UTF-8" standalone="no"?>
<svg
   height="16"
   width="16"
   version="1.1"
   id="svg17"
   sodipodi:docname="Search_01_16.svg"
   inkscape:version="1.2-beta (1b65182ce9, 2022-04-05)"
   inkscape:export-filename="Search_01_16.png"
   inkscape:export-xdpi="96"
   inkscape:export-ydpi="96"
   xmlns:inkscape="http://www.inkscape.org/namespaces/inkscape"
   xmlns:sodipodi="http://sodipodi.sourceforge.net/DTD/sodipodi-0.dtd"
   xmlns="http://www.w3.org/2000/svg"
   xmlns:svg="http://www.w3.org/2000/svg">
  <defs
     id="defs21" />
  <sodipodi:namedview
     id="namedview19"
     pagecolor="#ffffff"
     bordercolor="#666666"
     borderopacity="1.0"
     inkscape:pageshadow="2"
     inkscape:pageopacity="0.0"
     inkscape:pagecheckerboard="0"
     inkscape:deskcolor="#d1d1d1"
     showgrid="true"
     inkscape:zoom="57.375"
     inkscape:cx="7.7472767"
     inkscape:cy="8"
     inkscape:current-layer="svg17">
    <inkscape:grid
       type="xygrid"
       id="grid333" />
  </sodipodi:namedview>
  <radialGradient
     id="a"
     cx="5.988626"
     cy="7.28811"
     gradientTransform="matrix(-2.8e-7,1.7333333,-1.6000001,-2.5e-7,15.660979,-7.380283)"
     gradientUnits="userSpaceOnUse"
     r="3.75">
    <stop
       offset="0"
       stop-color="#f8fbff"
       id="stop2" />
    <stop
       offset=".66666657"
       stop-color="#d1e3ff"
       id="stop4" />
    <stop
       offset="1"
       stop-color="#f8fbff"
       id="stop6" />
  </radialGradient>
  <g
     id="g331">
    <circle
       cx="5.5"
       cy="5.5"
       fill="url(#a)"
       fill-rule="evenodd"
       r="5.125"
       stroke="#dd8703"
       stroke-linejoin="round"
       stroke-width="0.75"
       id="circle11"
       style="fill:url(#a);stroke-linecap:round" />
    <path
       d="M 9.7626253,9.7373747 14.762625,14.737375"
       fill="none"
       stroke="#a05a2c"
       stroke-width="2.5"
       id="path13"
       style="stroke-linecap:round" />
  </g>
</svg>
