<?xml version="1.0" encoding="UTF-8" standalone="no"?>
<svg
   width="48"
   height="48"
   version="1.1"
   id="svg4"
   sodipodi:docname="Manometer_02_48.svg"
   inkscape:export-filename="Manometer_02_48.png"
   inkscape:export-xdpi="96"
   inkscape:export-ydpi="96"
   inkscape:version="1.3.2 (091e20e, 2023-11-25, custom)"
   xmlns:inkscape="http://www.inkscape.org/namespaces/inkscape"
   xmlns:sodipodi="http://sodipodi.sourceforge.net/DTD/sodipodi-0.dtd"
   xmlns="http://www.w3.org/2000/svg"
   xmlns:svg="http://www.w3.org/2000/svg">
  <defs
     id="defs4" />
  <sodipodi:namedview
     id="namedview4"
     pagecolor="#ffffff"
     bordercolor="#000000"
     borderopacity="0.25"
     inkscape:showpageshadow="2"
     inkscape:pageopacity="0.0"
     inkscape:pagecheckerboard="0"
     inkscape:deskcolor="#d1d1d1"
     showgrid="true"
     inkscape:current-layer="svg4">
    <inkscape:grid
       id="grid4"
       units="px"
       originx="0"
       originy="0"
       spacingx="0.5"
       spacingy="0.5"
       empcolor="#0099e5"
       empopacity="0.30196078"
       color="#0099e5"
       opacity="0.14901961"
       empspacing="2"
       dotted="false"
       gridanglex="30"
       gridanglez="30"
       visible="true" />
  </sodipodi:namedview>
  <path
     d="m42.111326 19.954673-4.476561 5.800782a15 15 0 0 1 1.365234 6.246093 15 15 0 0 1-0.498048 3.626955l6.556641 1.634766a21.75 21.75 0 0 0 0.691407-5.261721 21.75 21.75 0 0 0-3.638673-12.046875z"
     fill="#fa0302"
     stroke-linecap="round"
     stroke-linejoin="round"
     stroke-width=".800001"
     id="path1" />
  <path
     d="m23.999999 10.251548a21.75 21.75 0 0 0-21.75 21.75 21.75 21.75 0 0 0 0.691407 5.261721l6.556641-1.634766a15 15 0 0 1-0.498048-3.626955 15 15 0 0 1 15-15 15 15 0 0 1 6.246093 1.365234l5.800782-4.476561a21.75 21.75 0 0 0-12.046875-3.638673z"
     fill="#2a7efe"
     stroke-linecap="round"
     stroke-linejoin="round"
     stroke-width=".800001"
     id="path2" />
  <g
     transform="matrix(3.4615389,0,0,3.4615389,-3.6923112,4.3071606)"
     stroke-width=".288889"
     id="g3">
    <path
       d="m12.56102 3.030383-5.2618949 4.0570559c-0.2835446 0.2186203-0.4525373 0.5546745-0.4529711 0.9127141-7.72e-4 0.6372507 0.516595 1.1546179 1.153846 1.153846 0.3580399-4.338e-4 0.6940895-0.1694296 0.9127102-0.4529746l4.0570588-5.2618926c0.208567-0.2705061-0.138243-0.6173161-0.408749-0.4087488z"
       fill="#ff7f00"
       id="path3" />
    <circle
       cx="8"
       cy="8.0001526"
       r=".57692301"
       fill="#008080"
       id="circle3" />
  </g>
  <g
     transform="matrix(3.4615389,0,0,3.4615389,-3.6923112,4.3071606)"
     fill="#f2f2f2"
     stroke-width=".288889"
     id="g4">
    <circle
       cx="8"
       cy="8.0001526"
       r=".57692301"
       fill="#f2f2f2"
       stroke-width=".288889"
       id="circle4" />
  </g>
</svg>
