<?xml version="1.0" encoding="UTF-8" standalone="no"?>
<svg
   height="24"
   width="24"
   version="1.1"
   id="svg530"
   sodipodi:docname="Arrow_48_24.svg"
   inkscape:export-filename="Arrow_48_24.png"
   inkscape:export-xdpi="96"
   inkscape:export-ydpi="96"
   inkscape:version="1.2.2 (732a01da63, 2022-12-09)"
   xmlns:inkscape="http://www.inkscape.org/namespaces/inkscape"
   xmlns:sodipodi="http://sodipodi.sourceforge.net/DTD/sodipodi-0.dtd"
   xmlns="http://www.w3.org/2000/svg"
   xmlns:svg="http://www.w3.org/2000/svg">
  <defs
     id="defs534" />
  <sodipodi:namedview
     id="namedview532"
     pagecolor="#ffffff"
     bordercolor="#666666"
     borderopacity="1.0"
     inkscape:showpageshadow="2"
     inkscape:pageopacity="0.0"
     inkscape:pagecheckerboard="0"
     inkscape:deskcolor="#d1d1d1"
     showgrid="true"
     inkscape:zoom="38.25"
     inkscape:cx="10.69281"
     inkscape:cy="12"
     inkscape:current-layer="g528">
    <inkscape:grid
       type="xygrid"
       id="grid895" />
  </sodipodi:namedview>
  <g
     stroke="#2a7efe"
     stroke-linecap="round"
     stroke-linejoin="round"
     stroke-width="2"
     id="g528">
    <circle
       cx="12"
       cy="12"
       fill="#e0edff"
       fill-rule="evenodd"
       r="10.25"
       stroke-opacity=".954902"
       id="circle524"
       style="stroke:#2a7efe" />
    <path
       d="M 13.5,16.5 18,12 13.5,7.5"
       stroke-linejoin="round"
       id="path1020"
       style="fill:none;stroke:#2a7efe"
       sodipodi:nodetypes="ccc" />
    <path
       d="M 18,12 H 6"
       id="path1022"
       style="fill:none;stroke:#2a7efe"
       sodipodi:nodetypes="cc" />
  </g>
</svg>
