<?xml version="1.0" encoding="UTF-8" standalone="no"?>
<svg
   width="16"
   height="16"
   version="1.1"
   viewBox="0 0 4.2333 4.2333"
   id="svg12"
   sodipodi:docname="menu_manage_desktops.svg"
   inkscape:export-filename="menu_manage_desktops.png"
   inkscape:export-xdpi="96"
   inkscape:export-ydpi="96"
   inkscape:version="1.2.1 (9c6d41e410, 2022-07-14)"
   xmlns:inkscape="http://www.inkscape.org/namespaces/inkscape"
   xmlns:sodipodi="http://sodipodi.sourceforge.net/DTD/sodipodi-0.dtd"
   xmlns="http://www.w3.org/2000/svg"
   xmlns:svg="http://www.w3.org/2000/svg">
  <defs
     id="defs16" />
  <sodipodi:namedview
     id="namedview14"
     pagecolor="#ffffff"
     bordercolor="#666666"
     borderopacity="1.0"
     inkscape:showpageshadow="2"
     inkscape:pageopacity="0.0"
     inkscape:pagecheckerboard="0"
     inkscape:deskcolor="#d1d1d1"
     showgrid="true"
     inkscape:zoom="57.375"
     inkscape:cx="7.372549"
     inkscape:cy="8"
     inkscape:current-layer="svg12">
    <inkscape:grid
       type="xygrid"
       id="grid245" />
  </sodipodi:namedview>
  <path
     d="M 0.79375,3.7041494 0.79374375,3.5718057 1.85205,3.3072694 H 2.38122 L 3.4395563,3.5718057 3.43952,3.7041494 H 0.79375"
     fill="#808080"
     stroke="#ffffff"
     stroke-width="0.52917"
     style="stroke:#ffffff;stroke-linecap:round;stroke-linejoin:round;paint-order:stroke fill markers"
     id="path2"
     sodipodi:nodetypes="ccccccc" />
  <path
     id="rect4"
     style="fill:#ffffff;stroke:#ffffff;stroke-width:0.264581;stroke-linecap:round;stroke-linejoin:round;stroke-miterlimit:5.6;stroke-dasharray:none"
     d="M 0.13229001,0.39686999 H 4.1010901 V 2.77817 H 0.13229001 V 0.39686999"
     sodipodi:nodetypes="ccccc" />
  <path
     id="rect6"
     style="fill:#aaccff;stroke:#483e37;stroke-width:0.26378;stroke-linecap:round;stroke-linejoin:round;stroke-miterlimit:5.6;stroke-dasharray:none"
     d="M 0.39647125,0.6610525 H 3.8368283 v 1.85287 H 0.39647125 v -1.85287"
     sodipodi:nodetypes="ccccc" />
  <path
     d="m 2.1167,2.6458 1e-7,0.6614656"
     fill="none"
     stroke="#666666"
     stroke-width="0.52917"
     id="path10"
     sodipodi:nodetypes="cc" />
</svg>
