<?xml version="1.0" encoding="UTF-8" standalone="no"?>
<svg
   width="36"
   height="36"
   version="1.1"
   viewBox="0 0 36 36"
   id="svg14"
   sodipodi:docname="tvaluelisteditor_150.svg"
   inkscape:export-filename="tvaluelisteditor_150.png"
   inkscape:export-xdpi="96"
   inkscape:export-ydpi="96"
   inkscape:version="1.3.2 (091e20e, 2023-11-25, custom)"
   xmlns:inkscape="http://www.inkscape.org/namespaces/inkscape"
   xmlns:sodipodi="http://sodipodi.sourceforge.net/DTD/sodipodi-0.dtd"
   xmlns="http://www.w3.org/2000/svg"
   xmlns:svg="http://www.w3.org/2000/svg">
  <defs
     id="defs14" />
  <sodipodi:namedview
     id="namedview14"
     pagecolor="#ffffff"
     bordercolor="#000000"
     borderopacity="0.25"
     inkscape:showpageshadow="2"
     inkscape:pageopacity="0.0"
     inkscape:pagecheckerboard="0"
     inkscape:deskcolor="#d1d1d1"
     showgrid="true"
     inkscape:current-layer="svg14">
    <inkscape:grid
       id="grid14"
       units="px"
       originx="0"
       originy="0"
       spacingx="0.5"
       spacingy="0.5"
       empcolor="#0099e5"
       empopacity="0.30196078"
       color="#0099e5"
       opacity="0.14901961"
       empspacing="2"
       dotted="false"
       gridanglex="30"
       gridanglez="30"
       visible="true" />
  </sodipodi:namedview>
  <rect
     x="4.5"
     y="4.5"
     width="27.000002"
     height="27.000004"
     fill="#ffffff"
     stroke="#2a7efe"
     stroke-width=".999996"
     style="paint-order:normal"
     id="rect1" />
  <rect
     transform="rotate(-90)"
     x="-31.500004"
     y="4.500001"
     width="23.000004"
     height="10.999998"
     fill="#ffffff"
     stroke="#2a7efe"
     stroke-width=".999998"
     style="paint-order:normal"
     id="rect2" />
  <rect
     transform="rotate(-90)"
     x="-8.500001"
     y="4.5"
     width="4.0000019"
     height="27.000004"
     fill="#ececec"
     stroke="#2a7efe"
     stroke-width=".999998"
     style="paint-order:normal"
     id="rect3" />
  <path
     d="M 6.9999998,12.249995 H 13"
     fill="none"
     stroke="#b3b3b3"
     stroke-width="1.49999"
     id="path3" />
  <path
     d="M 6.9999998,21.249995 H 13"
     fill="none"
     stroke="#b3b3b3"
     stroke-width="1.49999"
     id="path4" />
  <path
     d="M 6.9999998,18.249995 H 13"
     fill="none"
     stroke="#b3b3b3"
     stroke-width="1.49999"
     id="path5" />
  <path
     d="M 6.9999998,15.249995 H 13"
     fill="none"
     stroke="#b3b3b3"
     stroke-width="1.49999"
     id="path6" />
  <path
     d="m18 12.25h10.5"
     fill="none"
     stroke="#b3b3b3"
     stroke-width="1.5"
     id="path7" />
  <path
     d="m18 21.25h9"
     fill="none"
     stroke="#b3b3b3"
     stroke-width="1.5"
     id="path8" />
  <path
     d="m18 18.25h10.5"
     fill="none"
     stroke="#b3b3b3"
     stroke-width="1.5"
     id="path9" />
  <path
     d="m18 15.25h9"
     fill="none"
     stroke="#b3b3b3"
     stroke-width="1.5"
     id="path10" />
  <path
     d="m7 24.24999h6"
     fill="none"
     stroke="#b3b3b3"
     stroke-width="1.49999"
     id="path11" />
  <path
     d="m7 27.24999h6"
     fill="none"
     stroke="#b3b3b3"
     stroke-width="1.49999"
     id="path12" />
  <path
     d="m18 24.25h10.5"
     fill="none"
     stroke="#b3b3b3"
     stroke-width="1.5"
     id="path13" />
  <path
     d="m18 27.25h9"
     fill="none"
     stroke="#b3b3b3"
     stroke-width="1.5"
     id="path14" />
</svg>
