<?xml version="1.0" encoding="UTF-8" standalone="no"?>
<svg
   height="16"
   width="16"
   version="1.1"
   id="svg155"
   sodipodi:docname="Search_03_16.svg"
   inkscape:export-filename="Search_03_16.png"
   inkscape:export-xdpi="96"
   inkscape:export-ydpi="96"
   inkscape:version="1.2.1 (9c6d41e410, 2022-07-14)"
   xmlns:inkscape="http://www.inkscape.org/namespaces/inkscape"
   xmlns:sodipodi="http://sodipodi.sourceforge.net/DTD/sodipodi-0.dtd"
   xmlns="http://www.w3.org/2000/svg"
   xmlns:svg="http://www.w3.org/2000/svg">
  <defs
     id="defs159" />
  <sodipodi:namedview
     id="namedview157"
     pagecolor="#ffffff"
     bordercolor="#666666"
     borderopacity="1.0"
     inkscape:showpageshadow="2"
     inkscape:pageopacity="0.0"
     inkscape:pagecheckerboard="0"
     inkscape:deskcolor="#d1d1d1"
     showgrid="true"
     inkscape:zoom="57.375"
     inkscape:cx="7.4858388"
     inkscape:cy="8"
     inkscape:current-layer="g151">
    <inkscape:grid
       type="xygrid"
       id="grid970" />
  </sodipodi:namedview>
  <g
     fill="none"
     stroke="#00aad4"
     stroke-linecap="round"
     id="g153">
    <path
       d="m12.000001 6.4999114a5.5000013 5.4987197 0 1 1 -11.00000234 0 5.5000013 5.4987197 0 1 1 11.00000234 0z"
       stroke="#00aad4"
       stroke-linejoin="round"
       stroke-width=".999997"
       id="path143" />
    <path
       d="m11 11 3.5 3.5"
       stroke-width="2.5"
       id="path145" />
    <g
       stroke="#00aad4"
       stroke-linecap="round"
       id="g151" />
  </g>
</svg>
