<?xml version="1.0" encoding="UTF-8" standalone="no"?>
<svg
   height="24"
   width="24"
   version="1.1"
   id="svg135"
   sodipodi:docname="Cancel_07_24.svg"
   inkscape:export-filename="Cancel_07_24.png"
   inkscape:export-xdpi="96"
   inkscape:export-ydpi="96"
   inkscape:version="1.2.2 (732a01da63, 2022-12-09)"
   xmlns:inkscape="http://www.inkscape.org/namespaces/inkscape"
   xmlns:sodipodi="http://sodipodi.sourceforge.net/DTD/sodipodi-0.dtd"
   xmlns="http://www.w3.org/2000/svg"
   xmlns:svg="http://www.w3.org/2000/svg">
  <defs
     id="defs139" />
  <sodipodi:namedview
     id="namedview137"
     pagecolor="#ffffff"
     bordercolor="#666666"
     borderopacity="1.0"
     inkscape:showpageshadow="2"
     inkscape:pageopacity="0.0"
     inkscape:pagecheckerboard="0"
     inkscape:deskcolor="#d1d1d1"
     showgrid="true"
     inkscape:zoom="38.25"
     inkscape:cx="11.03268"
     inkscape:cy="12"
     inkscape:current-layer="svg135">
    <inkscape:grid
       type="xygrid"
       id="grid890" />
  </sodipodi:namedview>
  <circle
     cx="12"
     cy="12"
     r="10.25"
     style="fill:#e0edff;fill-rule:evenodd;stroke:#2a7efe;stroke-linecap:round;stroke-linejoin:round;stroke-width:2"
     id="circle133" />
  <path
     d="m 8.25,8.25 7.5,7.5"
     stroke-width="2.4"
     id="path291"
     style="fill:none;stroke:#2a7efe;stroke-linecap:round;stroke-width:2;stroke-dasharray:none" />
  <path
     d="m 15.75,8.25 -7.5,7.5"
     stroke-width="2.4"
     id="path293"
     style="fill:none;stroke:#2a7efe;stroke-linecap:round;stroke-width:2;stroke-dasharray:none" />
</svg>
