<?xml version="1.0" encoding="UTF-8" standalone="no"?>
<svg
   width="36"
   height="36"
   version="1.1"
   viewBox="0 0 36 36"
   id="svg14"
   sodipodi:docname="tdblookupcombobox_150.svg"
   inkscape:export-filename="tdblookupcombobox_150.png"
   inkscape:export-xdpi="96"
   inkscape:export-ydpi="96"
   inkscape:version="1.3.2 (091e20e, 2023-11-25, custom)"
   xmlns:inkscape="http://www.inkscape.org/namespaces/inkscape"
   xmlns:sodipodi="http://sodipodi.sourceforge.net/DTD/sodipodi-0.dtd"
   xmlns="http://www.w3.org/2000/svg"
   xmlns:svg="http://www.w3.org/2000/svg">
  <sodipodi:namedview
     id="namedview14"
     pagecolor="#ffffff"
     bordercolor="#000000"
     borderopacity="0.25"
     inkscape:showpageshadow="2"
     inkscape:pageopacity="0.0"
     inkscape:pagecheckerboard="0"
     inkscape:deskcolor="#d1d1d1"
     showgrid="true"
     inkscape:current-layer="svg14">
    <inkscape:grid
       id="grid14"
       units="px"
       originx="0"
       originy="0"
       spacingx="0.5"
       spacingy="0.5"
       empcolor="#0099e5"
       empopacity="0.30196078"
       color="#0099e5"
       opacity="0.14901961"
       empspacing="2"
       dotted="false"
       gridanglex="30"
       gridanglez="30"
       visible="true" />
  </sodipodi:namedview>
  <defs
     id="defs3">
    <linearGradient
       id="a"
       x1="3"
       x2="21"
       y1="3"
       y2="3"
       gradientUnits="userSpaceOnUse">
      <stop
         stop-color="#4276c4"
         offset="0"
         id="stop1" />
      <stop
         stop-color="#80b3ff"
         offset=".3333333"
         id="stop2" />
      <stop
         stop-color="#04a"
         offset="1"
         id="stop3" />
    </linearGradient>
  </defs>
  <ellipse
     cx="12"
     cy="20.25"
     rx="7.65"
     ry="2.4"
     fill="none"
     fill-rule="evenodd"
     stroke="url(#a)"
     stroke-linecap="round"
     stroke-linejoin="round"
     stroke-width="2.7"
     id="ellipse3" />
  <ellipse
     cx="12"
     cy="18.3"
     rx="7.35"
     ry="2.1"
     fill="none"
     fill-rule="evenodd"
     stroke="#ffffff"
     stroke-linecap="round"
     stroke-linejoin="round"
     stroke-width="1.8"
     id="ellipse4" />
  <ellipse
     cx="12"
     cy="15.75"
     rx="7.65"
     ry="2.4"
     fill="none"
     fill-rule="evenodd"
     stroke="url(#a)"
     stroke-linecap="round"
     stroke-linejoin="round"
     stroke-width="2.7"
     id="ellipse5" />
  <ellipse
     cx="12"
     cy="13.8"
     rx="7.35"
     ry="2.1"
     fill="none"
     fill-rule="evenodd"
     stroke="#ffffff"
     stroke-linecap="round"
     stroke-linejoin="round"
     stroke-width="1.8"
     id="ellipse6" />
  <ellipse
     cx="12"
     cy="11.25"
     rx="7.65"
     ry="2.4"
     fill="none"
     fill-rule="evenodd"
     stroke="url(#a)"
     stroke-linecap="round"
     stroke-linejoin="round"
     stroke-width="2.7"
     id="ellipse7" />
  <ellipse
     cx="12"
     cy="9.3"
     rx="7.35"
     ry="2.1"
     fill="none"
     fill-rule="evenodd"
     stroke="#ffffff"
     stroke-linecap="round"
     stroke-linejoin="round"
     stroke-width="1.8"
     id="ellipse8" />
  <ellipse
     cx="12"
     cy="6.75"
     rx="8.1"
     ry="2.85"
     fill="#80b3ff"
     fill-rule="evenodd"
     stroke="url(#a)"
     stroke-linecap="round"
     stroke-linejoin="round"
     stroke-width="1.8"
     id="ellipse9" />
  <rect
     x="12.5"
     y="14.499998"
     width="21"
     height="21.000002"
     fill="#f9f9f9"
     stroke="#2a7efe"
     style="paint-order:normal"
     id="rect9" />
  <path
     d="m16.5 26.249999 12.000001 1e-6"
     fill="none"
     stroke="#b3b3b3"
     stroke-width="1.5px"
     id="path9" />
  <path
     d="m16.5 23.249999 13.500001 1e-6"
     fill="none"
     stroke="#b3b3b3"
     stroke-width="1.5px"
     id="path10" />
  <path
     d="m16.5 29.25h12.5"
     fill="none"
     stroke="#b3b3b3"
     stroke-width="1.5px"
     id="path11" />
  <path
     d="m16.5 32.25h13.500001"
     fill="none"
     stroke="#b3b3b3"
     stroke-width="1.5px"
     id="path12" />
  <rect
     transform="rotate(90)"
     x="14.499998"
     y="-28.5"
     width="5"
     height="16"
     fill="#f9f9f9"
     stroke="#2a7efe"
     style="paint-order:normal"
     id="rect12" />
  <path
     d="m15.5 17.25h10.5"
     fill="none"
     stroke="#b3b3b3"
     stroke-width="1.5px"
     id="path13" />
  <rect
     x="28.500002"
     y="14.499998"
     width="5"
     height="5.0000038"
     fill="#ffffff"
     stroke="#2a7efe"
     stroke-width=".999997"
     style="paint-order:normal"
     id="rect13" />
  <path
     d="M 29.75302,16.010633 31,17.257555 32.246981,16.010633"
     fill="none"
     stroke="#808080"
     stroke-width="1.05"
     id="path14" />
  <path
     d="m 23.75,2.75 6,6 H 26"
     fill="none"
     stroke="#ff6600"
     stroke-linecap="round"
     stroke-linejoin="round"
     stroke-width="1.5px"
     id="path16" />
  <path
     d="m 31.5,2.25 h -3.75 l 6,6"
     fill="none"
     stroke="#ff6600"
     stroke-linecap="round"
     stroke-linejoin="round"
     stroke-width="1.5"
     id="path17" />
</svg>
