<?xml version="1.0" encoding="UTF-8" standalone="no"?>
<svg
   height="16"
   viewBox="0 0 16 16"
   width="16"
   version="1.1"
   id="svg680"
   sodipodi:docname="table_open.svg"
   inkscape:version="1.2.2 (732a01da63, 2022-12-09)"
   xmlns:inkscape="http://www.inkscape.org/namespaces/inkscape"
   xmlns:sodipodi="http://sodipodi.sourceforge.net/DTD/sodipodi-0.dtd"
   xmlns="http://www.w3.org/2000/svg"
   xmlns:svg="http://www.w3.org/2000/svg">
  <defs
     id="defs684" />
  <sodipodi:namedview
     id="namedview682"
     pagecolor="#ffffff"
     bordercolor="#000000"
     borderopacity="0.25"
     inkscape:showpageshadow="2"
     inkscape:pageopacity="0.0"
     inkscape:pagecheckerboard="0"
     inkscape:deskcolor="#d1d1d1"
     showgrid="true"
     inkscape:zoom="56.875"
     inkscape:cx="7.9912088"
     inkscape:cy="8"
     inkscape:current-layer="svg680">
    <inkscape:grid
       type="xygrid"
       id="grid988" />
  </sodipodi:namedview>
  <linearGradient
     id="a"
     gradientTransform="matrix(.52432942 0 0 .50996025 66.465952 33.020714)"
     gradientUnits="userSpaceOnUse"
     x1="-124.5"
     x2="-122"
     y1="-45"
     y2="-45">
    <stop
       offset="0"
       stop-color="#de7900"
       id="stop644" />
    <stop
       offset="1"
       stop-color="#ffa73e"
       id="stop646" />
  </linearGradient>
  <filter
     id="b"
     color-interpolation-filters="sRGB"
     height="1.1072208"
     width="1.0606769"
     x="-0.030338468"
     y="-0.053610379">
    <feGaussianBlur
       stdDeviation=".3602005"
       id="feGaussianBlur649" />
  </filter>
  <linearGradient
     id="c"
     gradientTransform="matrix(.52432942 0 0 .50996025 -.1573 -.381682)"
     gradientUnits="userSpaceOnUse"
     x1="14"
     x2="14"
     y1="25.5"
     y2="28">
    <stop
       offset="0"
       stop-color="#ececec"
       id="stop652" />
    <stop
       offset="1"
       stop-color="#fff"
       id="stop654" />
  </linearGradient>
  <linearGradient
     id="d"
     gradientUnits="userSpaceOnUse"
     x1="3"
     x2="15"
     y1="9.989"
     y2="9.989">
    <stop
       offset="0"
       stop-color="#ccc"
       id="stop657" />
    <stop
       offset="1"
       stop-color="#f2f2f2"
       id="stop659" />
  </linearGradient>
  <path
     d="m-154.30078-29.5c-1.70899-.0016-3 .5-3.44985 1.972448l-1.02085 11.191661c-.0293 1.835891 1.57019 2.814254 3.11132 2.835938h25.38284l-2.93641-6.320572h1.88733l-2.831-9.804686z"
     fill="#999"
     fill-opacity=".994638"
     filter="url(#b)"
     transform="matrix(.52984893 0 0 .50996025 84.583153 22.60768)"
     id="path662" />
  <path
     d="m15 12.5-1.5-5h-10.5v5z"
     fill="url(#d)"
     id="path664" />
  <path
     d="m15 12.5c-1 0-1.000406 2.672106.310417 2.672106h-13.003369c-1.83515295 0-1.83515295-2.650106 0-2.650106l.692952-.022"
     fill="url(#c)"
     id="path666" />
  <path
     d="m.93 13.897205.3283892-8.6372448c.0839084-.8465477.7864941-1.0199204 1.5729882-1.0199204h.6009086l7.067714-3.7400398 1 8.2819602-8.392476 3.7400398c-1.5970886 0-2.177524.282401-2.177524 1.375205z"
     style="stroke:#b26f25;stroke-width:.499999;stroke-linecap:round;stroke-linejoin:round;stroke-opacity:.994638;fill:url(#a)"
     id="path668" />
  <path
     d="m3.107524 12.522.292952-8.022"
     fill="none"
     stroke="#b26f24"
     stroke-linecap="round"
     stroke-width=".499999"
     id="path670" />
  <g
     transform="matrix(.99979615 -.02019059 .02019059 .99979615 -.126171 .137167)"
     id="g676">
    <path
       d="m8.6640625 2.7890625c-.5968154-.1093558-1.3076697.0378628-2.0351563.3554687-.935291.4083011-1.7376306 1.0323797-2.2890624 1.7011719-.5514319.6687922-.8690827 1.385923-.7539063 2.0117188.0497188.2702128.2598149.4615618.4960937.5175781.2362789.0560163.497109.0152332.7617188-.0761719.2486155-.0858801.498393-.2273732.7265625-.3984375-.1851401.3624395-.3146559.7260339-.2890625 1.0683594.00959.1278241.075234.2362632.1445312.3066406.012383.012576.022693.016328.035156.027344-.2546549.3091809-.4599011.6285727-.4316403.9667966.0138023.1662531.0892016.3178846.2050781.4199219.1158765.1020374.2639337.1577413.421875.1796875.3158826.0438924.686564-.0386184 1.0527344-.2324218.3593004-.1900922.6908075-.4782665.9414062-.7890626.2505987-.310796.4292424-.6392014.4277344-.9648437-.0008619-.1839478-.0811377-.3524212-.2070312-.4589844-.0536039-.0453732-.1280527-.0488903-.1914063-.0761719.0371267-.0625342.0555709-.1364892.0800781-.2109374.0002425.000169.00391.00391.00391.00391s.00586-.00781.00586-.00781.00391-.00586.00391-.00586c.0000377-.0000729.00745-.016769.00781-.017578h.00195v-.00195c.00142-.00275.00515-.010007.013672-.023437.01704-.026862.052158-.077269.1152344-.1523438.126227-.150168.3440652-.3724857.5800755-.6230562h-.00195c.016326-.017113.031996-.033826.046875-.050781a.19569864.19569864 0 0 0 .00195-.00195c.4585566-.5310612 1.1289875-1.3380416 1.1582031-2.2109409.0115209-.3447329-.0933071-.6404555-.2832031-.8554688-.189896-.2150132-.4558192-.346477-.75-.4003906z"
       fill="#ff0"
       transform="translate(.099541)"
       id="path672" />
    <path
       d="m7.209626 8.2304718c.0028264.1164027-.0601323.261383-.1748854.4035021-.1144705.1418882-.2719733.2701907-.4384501.3571845-.1671834.0873918-.3306924.1263982-.4547021.108007-.1250695-.0185416-.1998286-.0939099-.2071773-.210041-.0154041-.244475.2653312-.595026.6239346-.7780424.3552117-.1812324.6454154-.1256161.6512803.1193898zm-.4886192-4.2641811c1.0731251-.4781819 2.0931133-.4225865 2.080677.4076575-.007914.5313568-.4268617 1.0614753-.8614961 1.5662972-.4378141.4654985-.9594319.9653534-1.0275489 1.3473994-.0055822.3994235-.6847029.756033-.7086569.302805-.016464-.3125361.1213952-.6431702.383052-.9899156.4695409-.6222738.882977-1.0159049.8983811-1.5701728.0103165-.3724198-.5118666-.2674133-.8287802-.1081686-.4889725.2456565-.9519419.5274112-1.306023 1.205861-.2082373.3991018-.7363559.5156233-.771969.2900447-.0970879-.6141447.7692132-1.8399297 2.142364-2.4518078z"
       fill="#f50"
       stroke-width="1.01083"
       id="path674" />
  </g>
  <path
     d="m15 15.25h-12.692952c-1.83515295 0-1.83515295-2.728 0-2.728l.692952-.022"
     fill="none"
     stroke="#b16e24"
     stroke-linecap="round"
     stroke-linejoin="round"
     stroke-width=".499999"
     id="path678" />
</svg>
