<?xml version="1.0" encoding="UTF-8" standalone="no"?>
<svg
   height="32"
   width="32"
   version="1.1"
   id="svg260"
   sodipodi:docname="btn_all_200.svg"
   inkscape:export-filename="btn_all_200.png"
   inkscape:export-xdpi="96"
   inkscape:export-ydpi="96"
   inkscape:version="1.2.2 (732a01da63, 2022-12-09)"
   xmlns:inkscape="http://www.inkscape.org/namespaces/inkscape"
   xmlns:sodipodi="http://sodipodi.sourceforge.net/DTD/sodipodi-0.dtd"
   xmlns="http://www.w3.org/2000/svg"
   xmlns:svg="http://www.w3.org/2000/svg">
  <defs
     id="defs264" />
  <sodipodi:namedview
     id="namedview262"
     pagecolor="#ffffff"
     bordercolor="#666666"
     borderopacity="1.0"
     inkscape:showpageshadow="2"
     inkscape:pageopacity="0.0"
     inkscape:pagecheckerboard="0"
     inkscape:deskcolor="#d1d1d1"
     showgrid="true"
     inkscape:zoom="28.6875"
     inkscape:cx="13.786492"
     inkscape:cy="16"
     inkscape:current-layer="svg260">
    <inkscape:grid
       type="xygrid"
       id="grid383" />
  </sodipodi:namedview>
  <path
     d="m 6,21 6,6 14,-14"
     fill="none"
     stroke="#00cc00"
     stroke-linecap="round"
     stroke-linejoin="round"
     stroke-width="4"
     id="path258"
     style="stroke:#01a901" />
  <path
     d="M 6,11 12,17 26,3"
     fill="none"
     stroke="#00cc00"
     stroke-linecap="round"
     stroke-linejoin="round"
     stroke-width="4"
     id="path548"
     style="stroke:#01a901" />
</svg>
