<svg width="32" height="32" version="1.1" xmlns="http://www.w3.org/2000/svg">
 <g fill-rule="evenodd" stroke-width=".802638">
  <path d="m31.249565 10.806438c-0.973984-1.0225723-2.723974-1.0763963-3.77448-0.140226a1.5795301 1.629805 0.32849278 0 0-0.02616-2.71e-4l-9.872616 8.898953a1.5795301 1.629805 0.32849278 0 0-0.06607 0.06234l-0.564146 0.570375a1.5795301 1.629805 0.32849278 0 0-0.229822 0.294728l-1.634469 2.672804-0.321739 0.325288c-0.577179-0.0112-1.132141-0.1538-1.723977 0.07224-0.793042 0.303012-1.352134 0.903142-1.728989 1.440654-0.376861 0.53751-0.6473 1.060512-0.993446 1.614804-0.238908 0.382476-0.3861542 0.45381-0.8368076 0.569814-0.450654 0.116-1.1696914 0.14648-2.0440462 0.230996a1.5795301 1.629805 0.32849278 0 0-0.3568164 3.167654c2.0573158 0.70962 3.8503172 1.21126 5.4875992 1.366562 1.637282 0.15532 3.206585-0.053 4.485794-0.966566 1.208373-0.86292 1.628956-2.201582 1.65367-3.498632l0.240203-0.24286 2.642364-1.597792a1.5795301 1.629805 0.32849278 0 0 0.305636-0.24218l0.564144-0.570376a1.5795301 1.629805 0.32849278 0 0 0.0661-0.0714l8.705164-9.93729c6.86e-4 -7.07e-4 0.0015-0.0015 0.0022-0.0022 1.018784-1.048801 1.02985-2.954781 0.0228-4.015132a1.5795301 1.629805 0.32849278 0 0-0.0022-0.0023z" fill="#ffffff"/>
  <path d="m15.075345 25.215348 1.135461-1.132401 1.66827 1.732913-1.135461 1.1324z" fill="#ffffff"/>
  <path d="m7.4132051 28.894039c1.6026643-0.152774 3.1541179-0.05724 4.0871779-1.530727 0.760875-1.201845 1.132187-2.080016 1.956786-2.390808 3.123118-1.176688 5.232801 2.654754 2.585388 4.519638-1.767395 1.245038-4.596362 0.774078-8.6293519-0.598103z" fill="#ff0000"/>
  <path d="m16.210806 24.082947 1.66827 1.732913 2.827011-1.687165-2.752644-2.859305z" fill="#b3b3b3"/>
  <path d="m30.102741 11.926794c-0.445675-0.461552-1.168972-0.485628-1.643639-0.05471l-9.937494 8.831558 2.75221 2.858853 9.046861-10.158352c0.235398-0.238409 0.240223-1.001464-0.217938-1.477349z" fill="#c87137"/>
  <path d="m17.953443 21.26939 0.56773-0.5662 2.752645 2.859305-0.567731 0.5662z" fill="#ffffff"/>
 </g>
</svg>
