<?xml version="1.0" encoding="UTF-8" standalone="no"?>
<svg
   height="36"
   viewBox="0 0 36 36"
   width="36"
   version="1.1"
   id="svg38"
   sodipodi:docname="Money_01_36.svg"
   inkscape:export-filename="Money_01_36.png"
   inkscape:export-xdpi="96"
   inkscape:export-ydpi="96"
   inkscape:version="1.3.2 (091e20e, 2023-11-25, custom)"
   xmlns:inkscape="http://www.inkscape.org/namespaces/inkscape"
   xmlns:sodipodi="http://sodipodi.sourceforge.net/DTD/sodipodi-0.dtd"
   xmlns="http://www.w3.org/2000/svg"
   xmlns:svg="http://www.w3.org/2000/svg">
  <defs
     id="defs38" />
  <sodipodi:namedview
     id="namedview38"
     pagecolor="#ffffff"
     bordercolor="#000000"
     borderopacity="0.25"
     inkscape:showpageshadow="2"
     inkscape:pageopacity="0.0"
     inkscape:pagecheckerboard="0"
     inkscape:deskcolor="#d1d1d1"
     showgrid="true"
     inkscape:current-layer="svg38">
    <inkscape:grid
       id="grid38"
       units="px"
       originx="0"
       originy="0"
       spacingx="0.5"
       spacingy="0.5"
       empcolor="#0099e5"
       empopacity="0.30196078"
       color="#0099e5"
       opacity="0.14901961"
       empspacing="2"
       dotted="false"
       gridanglex="30"
       gridanglez="30"
       visible="true" />
  </sodipodi:namedview>
  <linearGradient
     id="a"
     gradientTransform="matrix(.09838648 0 0 .1140263 -68.554319 -11.841396)"
     gradientUnits="userSpaceOnUse"
     spreadMethod="pad"
     x1="493.51001"
     x2="554.48999"
     y1="105.46"
     y2="105.46">
    <stop
       offset="0"
       stop-color="#623116"
       id="stop1" />
    <stop
       offset=".21342"
       stop-color="#cda355"
       id="stop2" />
    <stop
       offset=".42393"
       stop-color="#fef8d3"
       id="stop3" />
    <stop
       offset=".60341"
       stop-color="#ae7f43"
       id="stop4" />
    <stop
       offset=".78558"
       stop-color="#ddb86c"
       id="stop5" />
    <stop
       offset="1"
       stop-color="#603014"
       id="stop6" />
  </linearGradient>
  <linearGradient
     id="b"
     gradientTransform="matrix(.09838648 0 0 .1140263 -68.554319 -12.709174)"
     gradientUnits="userSpaceOnUse"
     x1="493.51001"
     x2="554.48999"
     y1="105.46"
     y2="105.46">
    <stop
       offset="0"
       stop-color="#ba902c"
       id="stop7" />
    <stop
       offset="1"
       stop-color="#dbb66a"
       id="stop8" />
  </linearGradient>
  <path
     d="m1.112169 5.112169h33.775669v19.775667h-33.775669z"
     fill="#f2f2f2"
     stroke="#37c837"
     stroke-linecap="round"
     stroke-width="2.22433"
     id="path8" />
  <g
     fill="#37c837"
     id="g11">
    <path
       d="m1.75 22h2.25v2.25h-2.25z"
       id="path9" />
    <path
       d="m1.75 5.75h2.25v2.25h-2.25z"
       id="path10" />
    <path
       d="m32 5.75h2.25v2.25h-2.25z"
       id="path11" />
    <ellipse
       cx="18"
       cy="15.25"
       rx="9"
       ry="5.625"
       id="ellipse11" />
  </g>
  <g
     transform="matrix(2.25 0 0 2.25 52.275 33)"
     id="g13">
    <path
       d="m-20-.68359375v.8671875c0 .08480241 1.307164.31640625 3 .31640625s3-.23160383 3-.31640625v-.8671875z"
       fill="url(#a)"
       id="path12" />
    <path
       d="m-14-.6839613c0 .0848026-1.307162.31618351-3 .31618351s-3-.23138101-3-.31618351 1.307162-.3160387 3-.3160387 3 .23123735 3 .3160387z"
       fill="url(#b)"
       stroke-width=".306336"
       id="path13" />
  </g>
  <g
     transform="matrix(2.25 0 0 2.25 51.75 30.75)"
     id="g15">
    <path
       d="m-20-.68359375v.8671875c0 .08480241 1.307164.31640625 3 .31640625s3-.23160383 3-.31640625v-.8671875z"
       fill="url(#a)"
       id="path14" />
    <path
       d="m-14-.6839613c0 .0848026-1.307162.31618351-3 .31618351s-3-.23138101-3-.31618351 1.307162-.3160387 3-.3160387 3 .23123735 3 .3160387z"
       fill="url(#b)"
       stroke-width=".306336"
       id="path15" />
  </g>
  <g
     transform="matrix(2.25 0 0 2.25 52.275 28.5)"
     id="g17">
    <path
       d="m-20-.68359375v.8671875c0 .08480241 1.307164.31640625 3 .31640625s3-.23160383 3-.31640625v-.8671875z"
       fill="url(#a)"
       id="path16" />
    <path
       d="m-14-.6839613c0 .0848026-1.307162.31618351-3 .31618351s-3-.23138101-3-.31618351 1.307162-.3160387 3-.3160387 3 .23123735 3 .3160387z"
       fill="url(#b)"
       stroke-width=".306336"
       id="path17" />
  </g>
  <g
     transform="matrix(2.25 0 0 2.25 67.5 33)"
     id="g19">
    <path
       d="m-20-.68359375v.8671875c0 .08480241 1.307164.31640625 3 .31640625s3-.23160383 3-.31640625v-.8671875z"
       fill="url(#a)"
       id="path18" />
    <path
       d="m-14-.6839613c0 .0848026-1.307162.31618351-3 .31618351s-3-.23138101-3-.31618351 1.307162-.3160387 3-.3160387 3 .23123735 3 .3160387z"
       fill="url(#b)"
       stroke-width=".306336"
       id="path19" />
  </g>
  <g
     transform="matrix(2.25 0 0 2.25 66.975 30.75)"
     id="g21">
    <path
       d="m-20-.68359375v.8671875c0 .08480241 1.307164.31640625 3 .31640625s3-.23160383 3-.31640625v-.8671875z"
       fill="url(#a)"
       id="path20" />
    <path
       d="m-14-.6839613c0 .0848026-1.307162.31618351-3 .31618351s-3-.23138101-3-.31618351 1.307162-.3160387 3-.3160387 3 .23123735 3 .3160387z"
       fill="url(#b)"
       stroke-width=".306336"
       id="path21" />
  </g>
  <g
     transform="matrix(2.25 0 0 2.25 67.5 28.5)"
     id="g23">
    <path
       d="m-20-.68359375v.8671875c0 .08480241 1.307164.31640625 3 .31640625s3-.23160383 3-.31640625v-.8671875z"
       fill="url(#a)"
       id="path22" />
    <path
       d="m-14-.6839613c0 .0848026-1.307162.31618351-3 .31618351s-3-.23138101-3-.31618351 1.307162-.3160387 3-.3160387 3 .23123735 3 .3160387z"
       fill="url(#b)"
       stroke-width=".306336"
       id="path23" />
  </g>
  <g
     transform="matrix(2.25 0 0 2.25 67.5 26.25)"
     id="g25">
    <path
       d="m-20-.68359375v.8671875c0 .08480241 1.307164.31640625 3 .31640625s3-.23160383 3-.31640625v-.8671875z"
       fill="url(#a)"
       id="path24" />
    <path
       d="m-14-.6839613c0 .0848026-1.307162.31618351-3 .31618351s-3-.23138101-3-.31618351 1.307162-.3160387 3-.3160387 3 .23123735 3 .3160387z"
       fill="url(#b)"
       stroke-width=".306336"
       id="path25" />
  </g>
  <g
     transform="matrix(2.25 0 0 2.25 66.975 24)"
     id="g27">
    <path
       d="m-20-.68359375v.8671875c0 .08480241 1.307164.31640625 3 .31640625s3-.23160383 3-.31640625v-.8671875z"
       fill="url(#a)"
       id="path26" />
    <path
       d="m-14-.6839613c0 .0848026-1.307162.31618351-3 .31618351s-3-.23138101-3-.31618351 1.307162-.3160387 3-.3160387 3 .23123735 3 .3160387z"
       fill="url(#b)"
       stroke-width=".306336"
       id="path27" />
  </g>
  <g
     transform="matrix(2.25 0 0 2.25 67.5 21.75)"
     id="g29">
    <path
       d="m-20-.68359375v.8671875c0 .08480241 1.307164.31640625 3 .31640625s3-.23160383 3-.31640625v-.8671875z"
       fill="url(#a)"
       id="path28" />
    <path
       d="m-14-.6839613c0 .0848026-1.307162.31618351-3 .31618351s-3-.23138101-3-.31618351 1.307162-.3160387 3-.3160387 3 .23123735 3 .3160387z"
       fill="url(#b)"
       stroke-width=".306336"
       id="path29" />
  </g>
  <path
     d="m16.975992 17.581279c.0061-1.676815.01845-3.344977-.0065-5.030502-.0049-.340478-.743713-.413155-1.485003-.322529-.625517.07646-1.374084.290698-1.906139.156654-.602012-.151681.305468-.310312.794843-.382053 1.777414-.26056 3.483296-.636797 5.271443-.846922.436077-.05124.452494.194343.380532.324312-.302347.54609-.224652 1.352165-.234298 2.029853-.02183 1.53752-.01688 3.075588.005 4.613066.0061.435937.455601.495797 1.334499.523422.567918.01778 1.46248-.04012 1.262955.267594-.153189.236254-1.22558.09876-1.778044.08481-1.863229-.04703-3.73543-.109851-5.592892.0207-.911325.06404-.91441-.38039-.03884-.345331.652253.02612 1.758785-.02633 1.867295-.317792.09997-.268512.12414-.516624.125085-.77524z"
     fill="#fff"
     stroke-linecap="round"
     stroke-width="3.56289"
     id="path30" />
  <g
     transform="matrix(2.25 0 0 2.25 66.975 19.5)"
     id="g32">
    <path
       d="m-20-.68359375v.8671875c0 .08480241 1.307164.31640625 3 .31640625s3-.23160383 3-.31640625v-.8671875z"
       fill="url(#a)"
       id="path31" />
    <path
       d="m-14-.6839613c0 .0848026-1.307162.31618351-3 .31618351s-3-.23138101-3-.31618351 1.307162-.3160387 3-.3160387 3 .23123735 3 .3160387z"
       fill="url(#b)"
       stroke-width=".306336"
       id="path32" />
  </g>
  <g
     transform="matrix(2.25 0 0 2.25 67.5 17.25)"
     id="g34">
    <path
       d="m-20-.68359375v.8671875c0 .08480241 1.307164.31640625 3 .31640625s3-.23160383 3-.31640625v-.8671875z"
       fill="url(#a)"
       id="path33" />
    <path
       d="m-14-.6839613c0 .0848026-1.307162.31618351-3 .31618351s-3-.23138101-3-.31618351 1.307162-.3160387 3-.3160387 3 .23123735 3 .3160387z"
       fill="url(#b)"
       stroke-width=".306336"
       id="path34" />
  </g>
  <g
     transform="matrix(2.25 0 0 2.25 51.75 26.25)"
     id="g36">
    <path
       d="m-20-.68359375v.8671875c0 .08480241 1.307164.31640625 3 .31640625s3-.23160383 3-.31640625v-.8671875z"
       fill="url(#a)"
       id="path35" />
    <path
       d="m-14-.6839613c0 .0848026-1.307162.31618351-3 .31618351s-3-.23138101-3-.31618351 1.307162-.3160387 3-.3160387 3 .23123735 3 .3160387z"
       fill="url(#b)"
       stroke-width=".306336"
       id="path36" />
  </g>
  <g
     transform="matrix(2.25 0 0 2.25 51.75 24)"
     id="g38">
    <path
       d="m-20-.68359375v.8671875c0 .08480241 1.307164.31640625 3 .31640625s3-.23160383 3-.31640625v-.8671875z"
       fill="url(#a)"
       id="path37" />
    <path
       d="m-14-.6839613c0 .0848026-1.307162.31618351-3 .31618351s-3-.23138101-3-.31618351 1.307162-.3160387 3-.3160387 3 .23123735 3 .3160387z"
       fill="url(#b)"
       stroke-width=".306336"
       id="path38" />
  </g>
</svg>
