<?xml version="1.0" encoding="UTF-8" standalone="no"?>
<svg
   width="24"
   height="24"
   version="1.1"
   viewBox="0 0 24 24"
   id="svg2"
   sodipodi:docname="tcolorbutton.svg"
   inkscape:export-filename="tcolorbutton.png"
   inkscape:export-xdpi="96"
   inkscape:export-ydpi="96"
   inkscape:version="1.3.2 (091e20e, 2023-11-25, custom)"
   xmlns:inkscape="http://www.inkscape.org/namespaces/inkscape"
   xmlns:sodipodi="http://sodipodi.sourceforge.net/DTD/sodipodi-0.dtd"
   xmlns="http://www.w3.org/2000/svg"
   xmlns:svg="http://www.w3.org/2000/svg">
  <defs
     id="defs2" />
  <sodipodi:namedview
     id="namedview2"
     pagecolor="#ffffff"
     bordercolor="#000000"
     borderopacity="0.25"
     inkscape:showpageshadow="2"
     inkscape:pageopacity="0.0"
     inkscape:pagecheckerboard="0"
     inkscape:deskcolor="#d1d1d1"
     showgrid="true"
     inkscape:current-layer="svg2">
    <inkscape:grid
       id="grid2"
       units="px"
       originx="0"
       originy="0"
       spacingx="0.5"
       spacingy="0.5"
       empcolor="#0099e5"
       empopacity="0.30196078"
       color="#0099e5"
       opacity="0.14901961"
       empspacing="2"
       dotted="false"
       gridanglex="30"
       gridanglez="30"
       visible="true" />
  </sodipodi:namedview>
  <g
     transform="translate(0,-1028.3622)"
     id="g2">
    <rect
       x=".375"
       y="1034.7372"
       width="23.25"
       height="12.25"
       rx="2.625"
       ry="2.625"
       fill="#ececec"
       stroke="#2a7efe"
       stroke-linecap="round"
       stroke-linejoin="round"
       stroke-width=".75"
       style="paint-order:normal"
       id="rect1" />
    <rect
       x="2.5"
       y="1036.8622"
       width="19"
       height="8.0000172"
       fill="#ffaa73"
       fill-rule="evenodd"
       style="paint-order:normal"
       id="rect2" />
  </g>
</svg>
