<?xml version="1.0" encoding="UTF-8" standalone="no"?>
<svg
   width="24"
   height="24"
   version="1.1"
   viewBox="0 0 24 24"
   id="svg3"
   sodipodi:docname="tiphtmlpanel.svg"
   inkscape:version="1.3.2 (091e20e, 2023-11-25, custom)"
   xmlns:inkscape="http://www.inkscape.org/namespaces/inkscape"
   xmlns:sodipodi="http://sodipodi.sourceforge.net/DTD/sodipodi-0.dtd"
   xmlns="http://www.w3.org/2000/svg"
   xmlns:svg="http://www.w3.org/2000/svg">
  <sodipodi:namedview
     id="namedview3"
     pagecolor="#ffffff"
     bordercolor="#000000"
     borderopacity="0.25"
     inkscape:showpageshadow="2"
     inkscape:pageopacity="0.0"
     inkscape:pagecheckerboard="0"
     inkscape:deskcolor="#d1d1d1"
     showgrid="true"
     inkscape:current-layer="svg3">
    <inkscape:grid
       id="grid3"
       units="px"
       originx="0"
       originy="0"
       spacingx="0.5"
       spacingy="0.5"
       empcolor="#0099e5"
       empopacity="0.30196078"
       color="#0099e5"
       opacity="0.14901961"
       empspacing="2"
       dotted="false"
       gridanglex="30"
       gridanglez="30"
       visible="true" />
  </sodipodi:namedview>
  <defs
     id="defs2">
    <radialGradient
       id="b"
       cx="-4.3552999"
       cy="-7.9933"
       r="6.1504998"
       gradientTransform="matrix(.22132169 1.357038 -1.2791148 .20861584 .1173652 17.479508)"
       gradientUnits="userSpaceOnUse">
      <stop
         stop-color="#fff"
         offset="0"
         id="stop1" />
      <stop
         stop-color="#99c1ff"
         offset="1"
         id="stop2" />
    </radialGradient>
  </defs>
  <path
     d="m2.2499999 21.75v-19.5h19.5v19.5z"
     fill="#f9f9f9"
     fill-rule="evenodd"
     stroke="#2a7efe"
     stroke-linejoin="round"
     stroke-width=".5"
     id="path2" />
  <circle
     cx="12"
     cy="12"
     r="6.7083335"
     fill="url(#b)"
     stroke-width=".619937"
     id="circle2" />
  <path
     d="m9.9432679 5.7522732c0.5795711-0.2719265-0.595693-0.00966-0.4379935 0.3754943-0.4601648 0.0916184 0.1867064-0.4380674-0.2802275-0.1996193-0.101535 0.1872205-0.5114689 0.3067877-0.0177333 0.267377 0.4920592 0.310996 0.8980134-0.4739392 1.4341224-0.4649072 0.373488-0.019679-0.345127 0.3135177 0.106622 0.3030873-0.22531 0.568736-0.359267 1.62279 0.591482 1.490672 0.04309-0.5095051 0.42819-0.880953 0.835619-1.2184461 0.410975-0.3574313-0.395661-8.762e-4 -0.165258-0.5096363-0.162229-0.5468723-0.928785 0.094696-1.184778-0.116165-0.255993-0.2108611-0.78212 0.3089139-0.8818551 0.0721433zm3.5186471-0.1599342c-0.659579 0.034386-0.05189 0.1860236 0.181535 0.3884764 0.103153-0.1411853 0.03911-0.4295641-0.181535-0.3884764zm1.104325 0.6940538c-0.389548 0.1157835-0.885782 1.0915034-0.336647 1.1864543 0.312502-0.1381297 0.39019 0.7084705 0.527177 0.049834-0.05955-0.200778-0.183299-1.1207235 0.07598-0.5321485 0.07383 0.2853495 0.680521 0.5722089 0.239646 0.6229654 0.09197 0.466422-0.742249 0.3270613-0.762806-0.032796 0.126324 0.3916556-0.360645 0.7603849-0.745331 0.8595585 0.371645 0.1395054 0.40276 0.6763115-0.122772 0.4808785-0.567319 0.4297769 0.484858 1.0328766 0.62786 0.3243287 0.240371-0.5545849 1.063796-0.2970518 1.187076 0.1918241-0.479389 0.2171751 0.370488 0.106764 0.06633-0.2517229-0.298431-0.101038-0.632695-0.6557482-0.09603-0.2744907 0.303483 0.093845 0.614241 1.0904158 0.58978 0.3443773 0.402309-0.018297 0.129046-0.8915224 0.485988-0.5212572 0.202061-0.4342328 0.929673 0.7270585 0.275898 0.4222086-0.543039-0.2915928-0.731199 0.5744069-0.09249 0.4650429 0.653233-0.014673-0.08535 0.8950772-0.427987 0.4124102-0.461965 0.202493-1.200262-0.02313-1.183373-0.6712921-0.278633-0.5569002 0.06373 0.5628041-0.489088 0.2747987-0.809498-0.042146-1.256267 0.6085274-1.542668 1.2606874-0.228883 0.557469-0.19968 1.132992 0.306797 1.5019 0.304177 0.629486 1.08126 0.0037 1.471926 0.183933 0.663974 0.106911 0.317851 0.887404 0.598101 1.368422-0.28278 0.539895-0.269952 1.086428-0.123315 1.66423-0.05233 0.835405 1.025567 0.160692 1.135592-0.268802 0.279092-0.491708 0.829096-0.879389 0.819555-1.521785 0.105047-0.653403 0.700057-1.096484 0.808534-1.753232-0.66472-0.08808-0.704141-0.980932-1.016073-1.459325-0.245509-0.629885 0.37897 0.3359 0.397593 0.55295 0.330562 0.08117 0.232668 0.979525 0.515459 0.595217 0.328737-0.260471 0.718909-0.786114 0.185998-1.068904-0.389855 0.0045-0.45976-0.8287071-0.08715-0.246252 0.782097 0.05659 1.151924 1.992219 0.552301-0.319512-0.428314-1.4618916-1.430587-2.9590139-2.73226-3.6357472-0.09478 0.2434984-0.331666 0.52305-0.546524 0.1687886 0.69447 0.1294067-0.468209-0.4276755-0.563077-0.3735426zm-6.6270685 0.7023347c-0.4687842-0.1254062-2.2522718 1.5013178-2.2421991 3.7420715-0.074678 0.208709 0.1077533 1.073522 0.2586652 0.829011-0.1402637-0.239978-0.08778-1.233345 0.026892-0.499388 0.1544748 0.524999 0.269619 1.367968 0.917518 1.232632 0.4207315 0.184601 0.6732623 0.973731 1.1091208 0.688463-0.2611642 0.467635-0.3600543 1.054541-0.2869382 1.529912 0.1968027 0.64835 0.919464 0.90498 1.1775388 1.499189 0.292005 0.658302 0.4127422 1.455829 0.9795555 1.94418 0.2763269 0.188076 0.8397149 0.290115 0.2759889-0.0012-0.4844979-0.500563-0.05357-0.971762 0.285552-1.359793 0.075-0.329492 0.119988-0.64436 0.54816-0.700681 0.07294-0.444661 0.416536-0.952129 0.375365-1.344579-0.368361-0.331683-1.167447-0.186235-1.362128-0.474911 0.0162-0.629691-0.8101699-0.312093-1.0258562-0.794102-0.3115245-0.0511-0.8290345-0.336662-0.8296622 0.0076 0.1291699-0.411557-0.2200181-0.510407-0.5171541-0.518855-0.050143-0.309166-0.011877-0.586315-0.4105407-0.51513 0.018037-0.254582-0.00198-0.962869-0.175105-0.331551-0.5386429 0.376613-0.6987049-1.259374 0.060247-0.929321 0.3392702-0.418053 0.6286175 0.194184 0.6992708 0.397633-0.1637295-0.696799 0.5076078-1.129246 0.8429183-1.6548517 0.1443388-0.6574862 0.92792-0.0579635 1.0640151-0.547753-0.2327476 0.460176-0.7322186-0.5733848-0.1710298-0.3382581 0.4934654 0.0774095 0.7847594-0.3401617 0.3107872-0.6348746 0.017185-0.4479594-0.2890114-0.2576413-0.51891-0.3182606-0.0295634-0.6740661-0.7483502-0.0731349-0.6391105 0.3392728-0.2098997 0.1006413-0.3913012 0.8236187-0.4567395 0.2012521-0.1378323-0.2563295-0.6782486-0.4109041-0.2154635-0.7684646 0.1866433-0.2777153 0.4751985-0.4992481 0.6830833-0.2019323 0.3637247-0.0326643-0.2701253-0.4201569 0.2397162-0.402253 0.039375-0.1799428 0.3014211-0.4871099 0.4273278-0.2352285-0.273 0.2679062 0.4507883 0.026621 4.06e-4 0.3137385-0.6125606 0.1823879 0.0594417 0.3521431 0.2708312 0.4951373 0.307923-0.1249199-0.1010684-0.7470064 0.3566056-0.4035678 0.2009376-0.2293473-0.47145-0.8669666-0.7041405-0.8016997-0.1337501 0.2126108 0.1234071-0.1119989-0.2719581-0.1544778-0.3953653-0.0424783-0.4041928 0.7881558-1.0826293 0.7110405zm1.085497-0.5565381c0.2464116 0.0440148-0.514416 0.9820932-0.3001554 0.2259864 0.02919-0.1346592 0.1624549-0.2357678 0.3001554-0.2259864zm-0.75621 0.031047-0.4244753 0.3165865c-0.1771724 0.4565268 0.9873499-0.3566107 0.4244753-0.3165865zm3.7853325 0.2825498c-0.531714 0.1853118 0.660307 0.5387304 0.520524 0.078936-0.165611-0.062254-0.34593-0.068613-0.520524-0.078936zm1.355539 0.7246204c-0.239316 0.2000988 0.225957 0.5601262 0.208393 0.8053873 0.700587 0.00802-0.07219-0.6202082-0.208393-0.8053873zm-0.112933 0.2910631c-0.437724 0.11032-0.120415 0.6438943 0.0564 0.1452368 0.01031-0.03708 0.01205-0.1454776-0.0564-0.1452368zm3.863126 0.8241442c0.132285 0.2587393 0.597445 0.7850785 0.474007 1.0321257-0.216741-0.1801683-0.682332-0.7871365-0.474007-1.0321257zm-7.13764 0.3813478c-0.2263034 0.2523931 0.481859 0.4160126 0.240872 0.029463 0.01406 0.049045-0.250381-0.1106583-0.240872-0.029463zm-2.4485012 2.6211343c-0.3996976 0.287214 0.661927 0.08808 0.2811807 0.604643 0.2578076 0.01711 0.3486641-0.524034 0.4339545-0.108651 0.2818981 0.04124 0.9743684 0.04861 0.3359731-0.19284-0.3339513-0.142152-0.6877336-0.273955-1.0511083-0.303152zm10.028431 2.524196c-0.285838 0.27435-0.966348 0.87633-0.551429 1.254983 0.316072-0.286109 0.456029-0.833958 0.691441-1.191916-0.02365-0.0526-0.08985-0.06317-0.140012-0.06307z"
     fill="#2ba12b"
     stroke-width=".965519"
     id="path3" />
  <circle
     cx="12"
     cy="12"
     r="6.7666669"
     fill="none"
     stroke="#2a7efe"
     stroke-width=".466667"
     id="circle3" />
</svg>
