<?xml version="1.0" encoding="UTF-8" standalone="no"?>
<svg
   width="36"
   height="36"
   version="1.1"
   viewBox="0 0 36 36"
   id="svg6"
   sodipodi:docname="timage_150.svg"
   inkscape:export-filename="timage_150.png"
   inkscape:export-xdpi="96"
   inkscape:export-ydpi="96"
   inkscape:version="1.3.2 (091e20e, 2023-11-25, custom)"
   xmlns:inkscape="http://www.inkscape.org/namespaces/inkscape"
   xmlns:sodipodi="http://sodipodi.sourceforge.net/DTD/sodipodi-0.dtd"
   xmlns="http://www.w3.org/2000/svg"
   xmlns:svg="http://www.w3.org/2000/svg">
  <sodipodi:namedview
     id="namedview6"
     pagecolor="#ffffff"
     bordercolor="#000000"
     borderopacity="0.25"
     inkscape:showpageshadow="2"
     inkscape:pageopacity="0.0"
     inkscape:pagecheckerboard="0"
     inkscape:deskcolor="#d1d1d1"
     showgrid="true"
     inkscape:current-layer="svg6">
    <inkscape:grid
       id="grid6"
       units="px"
       originx="0"
       originy="0"
       spacingx="0.5"
       spacingy="0.5"
       empcolor="#0099e5"
       empopacity="0.30196078"
       color="#0099e5"
       opacity="0.14901961"
       empspacing="2"
       dotted="false"
       gridanglex="30"
       gridanglez="30"
       visible="true" />
  </sodipodi:namedview>
  <defs
     id="defs5">
    <linearGradient
       id="b"
       x1="7.9999995"
       x2="7.9999995"
       y1="1.4999998"
       y2="11.238683"
       gradientTransform="matrix(1.8666667,0,0,1.5384616,3.066667,5.6923082)"
       gradientUnits="userSpaceOnUse">
      <stop
         stop-color="#80b4fe"
         offset="0"
         id="stop1" />
      <stop
         stop-color="#e7f6fe"
         offset="1"
         id="stop2" />
    </linearGradient>
    <radialGradient
       id="a"
       cx="16"
       cy="10"
       r="2.5999999"
       gradientTransform="matrix(1.6,0,0,1.5999999,-1.0999999,-1.4999994)"
       gradientUnits="userSpaceOnUse">
      <stop
         stop-color="#ffffff"
         offset="0"
         id="stop3" />
      <stop
         stop-color="#ffe680"
         offset=".57692301"
         id="stop4" />
      <stop
         stop-color="#ffcc00"
         offset="1"
         id="stop5" />
    </radialGradient>
  </defs>
  <rect
     x="2.5"
     y="6.5"
     width="31"
     height="23"
     fill="#f9f9f9"
     stroke="#2a7efe"
     stroke-width=".999998"
     style="paint-order:normal"
     id="rect5" />
  <rect
     x="4"
     y="7.9999995"
     width="28"
     height="20"
     fill="url(#b)"
     id="rect6" />
  <path
     d="m3.9999999 28 6.5560311-8.333334c1.910855-2.428878 5.117633-2.102563 7.058697 0l5.385272 5.833335 3.523414-2.5c1.07378-0.761889 1.790354-0.665855 2.842647 0l2.633939 1.666666v3.333333z"
     fill="#01a901"
     id="path6" />
  <circle
     cx="24.5"
     cy="14.5"
     r="4"
     fill="url(#a)"
     id="circle6" />
</svg>
