<?xml version="1.0" encoding="UTF-8" standalone="no"?>
<svg
   width="48"
   height="48"
   version="1.1"
   viewBox="0 0 48 48"
   id="svg8"
   sodipodi:docname="tprintdialog_200.svg"
   inkscape:export-filename="tprintdialog_200.png"
   inkscape:export-xdpi="96"
   inkscape:export-ydpi="96"
   inkscape:version="1.3.2 (091e20e, 2023-11-25, custom)"
   xmlns:inkscape="http://www.inkscape.org/namespaces/inkscape"
   xmlns:sodipodi="http://sodipodi.sourceforge.net/DTD/sodipodi-0.dtd"
   xmlns="http://www.w3.org/2000/svg"
   xmlns:svg="http://www.w3.org/2000/svg">
  <sodipodi:namedview
     id="namedview8"
     pagecolor="#ffffff"
     bordercolor="#000000"
     borderopacity="0.25"
     inkscape:showpageshadow="2"
     inkscape:pageopacity="0.0"
     inkscape:pagecheckerboard="0"
     inkscape:deskcolor="#d1d1d1"
     showgrid="true"
     inkscape:current-layer="svg8">
    <inkscape:grid
       id="grid8"
       units="px"
       originx="0"
       originy="0"
       spacingx="0.5"
       spacingy="0.5"
       empcolor="#0099e5"
       empopacity="0.30196078"
       color="#0099e5"
       opacity="0.14901961"
       empspacing="2"
       dotted="false"
       gridanglex="30"
       gridanglez="30"
       visible="true" />
  </sodipodi:namedview>
  <defs
     id="defs3">
    <linearGradient
       id="a"
       x1="12"
       x2="12"
       y1="1046.3622"
       y2="1041.3622"
       gradientTransform="matrix(2.0769202,0,0,2.1666641,-0.92304305,-2230.6986)"
       gradientUnits="userSpaceOnUse">
      <stop
         stop-color="#cccccc"
         offset="0"
         id="stop1" />
      <stop
         stop-color="#ffffff"
         offset=".59999651"
         id="stop2" />
      <stop
         stop-color="#cccccc"
         offset="1"
         id="stop3" />
    </linearGradient>
  </defs>
  <rect
     x="2.5"
     y="8.4999828"
     width="43"
     height="37"
     fill="#f9f9f9"
     stroke="#2a7efe"
     style="paint-order:normal"
     id="rect3" />
  <path
     d="m 5,2 h 38 c 1.8,0 3,1.2 3,3 V 8 H 2 V 5 C 2,3.2 3.2,2 5,2 Z"
     fill="#2a7efe"
     id="path3" />
  <path
     d="m 14,24.5 -3.5,5.5 1.8e-5,7.5 H 37.499982 L 37.5,30 34,24.5 Z"
     fill="url(#a)"
     fill-rule="evenodd"
     stroke="#784421"
     stroke-linecap="round"
     stroke-linejoin="round"
     stroke-width="0.999999"
     id="path4"
     style="fill:url(#a)" />
  <rect
     x="16.500011"
     y="14.499983"
     width="14.999982"
     height="14.000017"
     fill="#ffffff"
     fill-rule="evenodd"
     stroke="#808080"
     stroke-linecap="round"
     stroke-linejoin="round"
     stroke-width="0.999999"
     style="paint-order:normal"
     id="rect4" />
  <path
     d="M 15,33 H 33"
     fill="none"
     stroke="#999999"
     stroke-linecap="round"
     stroke-width="2px"
     id="path5" />
  <path
     d="m 16.000012,28 h 15.99998"
     fill="none"
     stroke="#483e37"
     stroke-linecap="round"
     stroke-width="2"
     id="path6" />
  <path
     d="m 20.000007,19 h 7.999988"
     fill="none"
     stroke="#808080"
     stroke-width="2px"
     id="path7" />
  <path
     d="m 20.000007,23 h 7.999988"
     fill="none"
     stroke="#808080"
     stroke-width="2px"
     id="path8" />
</svg>
