<?xml version="1.0" encoding="UTF-8" standalone="no"?>
<svg
   height="48"
   viewBox="0 0 12.7 12.700001"
   width="48"
   version="1.1"
   id="svg29"
   sodipodi:docname="Delete_02_48.svg"
   inkscape:export-filename="Delete_02_48.png"
   inkscape:export-xdpi="96"
   inkscape:export-ydpi="96"
   inkscape:version="1.2 (dc2aedaf03, 2022-05-15)"
   xmlns:inkscape="http://www.inkscape.org/namespaces/inkscape"
   xmlns:sodipodi="http://sodipodi.sourceforge.net/DTD/sodipodi-0.dtd"
   xmlns="http://www.w3.org/2000/svg"
   xmlns:svg="http://www.w3.org/2000/svg">
  <sodipodi:namedview
     id="namedview592"
     pagecolor="#ffffff"
     bordercolor="#666666"
     borderopacity="1.0"
     inkscape:showpageshadow="2"
     inkscape:pageopacity="0.0"
     inkscape:pagecheckerboard="0"
     inkscape:deskcolor="#d1d1d1"
     showgrid="true"
     inkscape:zoom="19.125"
     inkscape:cx="23.973856"
     inkscape:cy="24"
     inkscape:current-layer="svg29">
    <inkscape:grid
       type="xygrid"
       id="grid1051" />
  </sodipodi:namedview>
  <defs
     id="defs33" />
  <linearGradient
     id="a"
     gradientUnits="userSpaceOnUse"
     x1="1"
     x2="15"
     y1="9"
     y2="9">
    <stop
       offset="0"
       stop-color="#999"
       id="stop2" />
    <stop
       offset=".42857143"
       stop-color="#ccc"
       id="stop4" />
    <stop
       offset="1"
       stop-color="#666"
       id="stop6" />
  </linearGradient>
  <g
     fill="none"
     stroke="url(#a)"
     stroke-width=".64934"
     transform="matrix(.81720929 0 0 .81264145 -.187674 -.159782)"
     id="g27">
    <path
       d="m1.5247692 1.8235035 12.9505208.0010391-1.942587 13.6745434h-9.0654057z"
       id="path9" />
    <path
       d="m3.1435769 12.895349h9.7128461"
       id="path11" />
    <path
       d="m2.8198154 10.290698h10.3603696"
       id="path13" />
    <path
       d="m2.4960538 7.6860468h11.0078922"
       id="path15" />
    <path
       d="m1.8485308 2.4767445h12.3029382"
       id="path17" />
    <path
       d="m6.0574308 15.5-1.6188077-13.6744182"
       id="path19" />
    <path
       d="m9.9425692 15.5 1.6188078-13.6744182"
       id="path21" />
    <path
       d="m8 15.5v-13.6744182"
       id="path23" />
    <path
       d="m2.1722923 5.0813957h11.6554157"
       id="path25" />
  </g>
</svg>
