<?xml version="1.0" encoding="UTF-8" standalone="no"?>
<svg
   height="32"
   width="32"
   version="1.1"
   id="svg417"
   sodipodi:docname="Save_04_32.svg"
   inkscape:export-filename="Save_04_32.png"
   inkscape:export-xdpi="96"
   inkscape:export-ydpi="96"
   inkscape:version="1.2.2 (732a01da63, 2022-12-09)"
   xml:space="preserve"
   xmlns:inkscape="http://www.inkscape.org/namespaces/inkscape"
   xmlns:sodipodi="http://sodipodi.sourceforge.net/DTD/sodipodi-0.dtd"
   xmlns="http://www.w3.org/2000/svg"
   xmlns:svg="http://www.w3.org/2000/svg"><defs
     id="defs421" /><sodipodi:namedview
     id="namedview419"
     pagecolor="#ffffff"
     bordercolor="#000000"
     borderopacity="0.25"
     inkscape:showpageshadow="2"
     inkscape:pageopacity="0.0"
     inkscape:pagecheckerboard="0"
     inkscape:deskcolor="#d1d1d1"
     showgrid="true"
     inkscape:zoom="28.4375"
     inkscape:cx="13.432967"
     inkscape:cy="16"
     inkscape:current-layer="svg417"
     showguides="true"><inkscape:grid
       type="xygrid"
       id="grid1028" /></sodipodi:namedview><path
     d="M 29.249786,28.75 V 4.8000001 L 26.196214,1.75 H 3.25 c -0.8284271,0 -1.5,0.6715729 -1.5,1.5 v 25.500001 c 0,0.828427 0.6715729,1.5 1.5,1.5 l 24.499786,-1e-6 c 0.828427,-1e-6 1.5,-0.671573 1.5,-1.5 z"
     fill="#c2f3ff"
     fill-rule="evenodd"
     stroke-linejoin="round"
     stroke-width="1.5"
     id="path407"
     style="stroke:#00aad4"
     sodipodi:nodetypes="sccssssss" /><rect
     fill="#ebfcff"
     height="8.5"
     ry="1.5"
     stroke-linejoin="round"
     stroke-width="1.5"
     width="13.5"
     x="8.75"
     y="1.75"
     id="rect409"
     rx="1.4999999"
     style="stroke:#00aad4" /><path
     d="m 18,3.5 v 5"
     fill="none"
     stroke-width="3"
     id="path411"
     style="stroke:#00aad4" /><rect
     fill="#ebfcff"
     height="16.5"
     ry="1.5"
     stroke-linejoin="round"
     stroke-width="1.5"
     width="19.5"
     x="5.75"
     y="13.75"
     id="rect413"
     rx="1.5"
     style="stroke:#00aad4" /></svg>
