<?xml version="1.0" encoding="UTF-8" standalone="no"?>
<svg
   width="36"
   height="36"
   version="1.1"
   viewBox="0 0 9.5249997 9.5250005"
   id="svg3"
   sodipodi:docname="Sound_07_36.svg"
   inkscape:export-filename="Sound_07_36.png"
   inkscape:export-xdpi="96"
   inkscape:export-ydpi="96"
   inkscape:version="1.3.2 (091e20e, 2023-11-25, custom)"
   xmlns:inkscape="http://www.inkscape.org/namespaces/inkscape"
   xmlns:sodipodi="http://sodipodi.sourceforge.net/DTD/sodipodi-0.dtd"
   xmlns="http://www.w3.org/2000/svg"
   xmlns:svg="http://www.w3.org/2000/svg">
  <defs
     id="defs3" />
  <sodipodi:namedview
     id="namedview3"
     pagecolor="#ffffff"
     bordercolor="#000000"
     borderopacity="0.25"
     inkscape:showpageshadow="2"
     inkscape:pageopacity="0.0"
     inkscape:pagecheckerboard="0"
     inkscape:deskcolor="#d1d1d1"
     showgrid="true"
     inkscape:current-layer="svg3">
    <inkscape:grid
       id="grid3"
       units="px"
       originx="0"
       originy="0"
       spacingx="0.13229166"
       spacingy="0.13229167"
       empcolor="#0099e5"
       empopacity="0.30196078"
       color="#0099e5"
       opacity="0.14901961"
       empspacing="2"
       dotted="false"
       gridanglex="30"
       gridanglez="30"
       visible="true" />
  </sodipodi:namedview>
  <g
     stroke-linecap="round"
     stroke-linejoin="round"
     id="g3">
    <path
       d="m8.0163241 0.97470006c0.4608164 0.46982544 0.6854674 1.5587196 0.0929929 1.9910439-0.7942702 0.6647735-1.6396887 1.2336683-2.5140703 0.4773634s-0.141851-1.8129528 0.4682103-2.5632192c0.464998-0.5718643 1.4920503-0.3750137 1.9528671 0.09481181z"
       fill="#00aad4"
       id="path1" />
    <path
       d="m1.5109597 7.4847573c-0.4464703 0.4464701 0.2414111 1.9738151 1.8955941 1.3785221 1.322047-0.475768 1.4882342-2.0835281 2.6788215-2.3811753s2.0835281 0.5952941 1.7858814 1.7858813"
       fill="none"
       stroke="#ff7f2a"
       stroke-linejoin="round"
       stroke-width=".595293"
       id="path2" />
    <path
       d="m4.6484734 2.9977751c0.1483183 0.7189102 0.5623903 1.2006992 1.3494683 1.3494685l-3.6610715 3.350811c-0.1788964 0.1637364-0.4549829 0.1576301-0.6264662-0.0138595l-0.3988888-0.3988823c-0.1714831-0.1714831-0.1775882-0.4475703-0.013853-0.6264662z"
       fill="#00aad4"
       id="path3" />
  </g>
</svg>
