<?xml version="1.0" encoding="UTF-8" standalone="no"?>
<svg
   height="24"
   width="24"
   version="1.1"
   id="svg3508"
   sodipodi:docname="menu_source_useunit_150.svg"
   inkscape:export-filename="menu_source_useunit_150.png"
   inkscape:export-xdpi="96"
   inkscape:export-ydpi="96"
   inkscape:version="1.2.2 (732a01da63, 2022-12-09)"
   xmlns:inkscape="http://www.inkscape.org/namespaces/inkscape"
   xmlns:sodipodi="http://sodipodi.sourceforge.net/DTD/sodipodi-0.dtd"
   xmlns="http://www.w3.org/2000/svg"
   xmlns:svg="http://www.w3.org/2000/svg">
  <defs
     id="defs3512" />
  <sodipodi:namedview
     id="namedview3510"
     pagecolor="#ffffff"
     bordercolor="#666666"
     borderopacity="1.0"
     inkscape:showpageshadow="2"
     inkscape:pageopacity="0.0"
     inkscape:pagecheckerboard="0"
     inkscape:deskcolor="#d1d1d1"
     showgrid="true"
     inkscape:zoom="38.25"
     inkscape:cx="11.03268"
     inkscape:cy="12"
     inkscape:current-layer="svg3508">
    <inkscape:grid
       type="xygrid"
       id="grid3804" />
  </sodipodi:namedview>
  <linearGradient
     id="a"
     gradientUnits="userSpaceOnUse"
     x1="21.1875"
     x2="13.8125"
     y1="21.1875"
     y2="13.812501">
    <stop
       offset="0"
       stop-color="#009600"
       id="stop3475" />
    <stop
       offset="1"
       stop-color="#6edb39"
       id="stop3477" />
  </linearGradient>
  <path
     d="m4.6 1.6h15.8v19.799999h-15.8z"
     style="fill:#fff;stroke:#d4aa00;stroke-width:1.2;stroke-linecap:round;stroke-linejoin:round;stroke-miterlimit:5.6;stroke-opacity:1"
     id="path3480" />
  <g
     fill="none"
     stroke="#d4aa00"
     id="g3496">
    <path
       d="m8 5.5h9"
       id="path3482"
       style="stroke:#2a7fff;stroke-opacity:1" />
    <path
       d="m8 15.5h9"
       id="path3484"
       style="stroke:#2a7fff;stroke-opacity:1" />
    <path
       d="m8 13.5h9"
       id="path3486"
       style="stroke:#2a7fff;stroke-opacity:1" />
    <path
       d="m8 11.5h9"
       id="path3488"
       style="stroke:#2a7fff;stroke-opacity:1" />
    <path
       d="m8 9.5h9"
       id="path3490"
       style="stroke:#2a7fff;stroke-opacity:1" />
    <path
       d="m8 7.5h9"
       id="path3492"
       style="stroke:#2a7fff;stroke-opacity:1" />
    <path
       d="m8 17.5h9"
       id="path3494"
       style="stroke:#2a7fff;stroke-opacity:1" />
  </g>
  <g
     stroke="#fff"
     stroke-linecap="round"
     stroke-width="1.2"
     id="g3506">
    <circle
       cx="17.5"
       cy="17.5"
       fill="url(#a)"
       r="5.9"
       stroke-dashoffset="1.49998"
       stroke-linejoin="round"
       transform="matrix(0 1 1 0 0 0)"
       id="circle3498" />
    <g
       fill="none"
       id="g3504">
      <path
         d="m17.5 15v5"
         id="path3500" />
      <path
         d="m20 17.5h-5"
         id="path3502" />
    </g>
  </g>
</svg>
