<?xml version="1.0" encoding="UTF-8" standalone="no"?>
<svg
   width="36"
   height="36"
   version="1.1"
   viewBox="0 0 36 36"
   id="svg8"
   sodipodi:docname="tchartimagelist_150.svg"
   inkscape:version="1.3.2 (091e20e, 2023-11-25, custom)"
   xmlns:inkscape="http://www.inkscape.org/namespaces/inkscape"
   xmlns:sodipodi="http://sodipodi.sourceforge.net/DTD/sodipodi-0.dtd"
   xmlns="http://www.w3.org/2000/svg"
   xmlns:svg="http://www.w3.org/2000/svg">
  <sodipodi:namedview
     id="namedview8"
     pagecolor="#ffffff"
     bordercolor="#000000"
     borderopacity="0.25"
     inkscape:showpageshadow="2"
     inkscape:pageopacity="0.0"
     inkscape:pagecheckerboard="0"
     inkscape:deskcolor="#d1d1d1"
     showgrid="true"
     inkscape:current-layer="svg8">
    <inkscape:grid
       id="grid8"
       units="px"
       originx="0"
       originy="0"
       spacingx="0.5"
       spacingy="0.5"
       empcolor="#0099e5"
       empopacity="0.30196078"
       color="#0099e5"
       opacity="0.14901961"
       empspacing="2"
       dotted="false"
       gridanglex="30"
       gridanglez="30"
       visible="true" />
  </sodipodi:namedview>
  <defs
     id="defs5">
    <linearGradient
       id="b"
       x1="7.9999995"
       x2="7.9999995"
       y1="1.4999998"
       y2="11.238683"
       gradientTransform="matrix(.99999989 0 0 .76922838 15.5 6.8462215)"
       gradientUnits="userSpaceOnUse">
      <stop
         stop-color="#80b4fe"
         offset="0"
         id="stop1" />
      <stop
         stop-color="#e7f6fe"
         offset="1"
         id="stop2" />
    </linearGradient>
    <radialGradient
       id="a"
       cx="16"
       cy="10"
       r="2.5999999"
       gradientTransform="matrix(.89999985 0 0 .89999995 12.100001 2.5001033)"
       gradientUnits="userSpaceOnUse">
      <stop
         stop-color="#ffffff"
         offset="0"
         id="stop3" />
      <stop
         stop-color="#ffe680"
         offset=".57692301"
         id="stop4" />
      <stop
         stop-color="#ffcc00"
         offset="1"
         id="stop5" />
    </radialGradient>
  </defs>
  <rect
     x="1.5"
     y="2.5"
     width="32"
     height="32"
     fill="#ffffff"
     fill-rule="evenodd"
     stroke="#2a7efe"
     stroke-linecap="square"
     stroke-linejoin="round"
     style="paint-order:normal"
     id="rect5" />
  <path
     d="m4.825 20.3 4.425-7.8 3 12.75 5.25-3.75 5.175 9.675"
     fill="none"
     stroke="#2a7efe"
     stroke-linecap="round"
     stroke-linejoin="round"
     stroke-width="1.65"
     id="path5" />
  <path
     d="m4.75 8v23.25h23.25"
     fill="none"
     stroke="#4d4d4d"
     stroke-linecap="round"
     stroke-linejoin="round"
     stroke-width="1.5"
     id="path6" />
  <rect
     x="16"
     y="8"
     width="15"
     height="9.9999685"
     fill="url(#b)"
     stroke-width="1.46385"
     id="rect6" />
  <path
     d="m16 18 3.512158-4.166586c1.02367-1.214397 2.741589-1.051197 3.781449 0l2.884964 2.91659 1.887542-1.249994c0.575238-0.380901 0.959119-0.332901 1.522845 0l1.411039 0.833396v1.666594z"
     fill="#01a901"
     stroke-width="1.46385"
     id="path7" />
  <circle
     cx="26.5"
     cy="11.5"
     r="2.2499998"
     fill="url(#a)"
     stroke-width="1.5"
     id="circle7" />
  <path
     d="M 13.75,16 V 5.7500171 L 29,5.75"
     fill="none"
     stroke="#83b6fe"
     stroke-width="1.5"
     id="path8" />
</svg>
