<?xml version="1.0" encoding="UTF-8" standalone="no"?>
<svg
   height="32"
   width="32"
   version="1.1"
   id="svg732"
   sodipodi:docname="SaveAs_02_32.svg"
   inkscape:export-filename="SaveAs_02_32.png"
   inkscape:export-xdpi="96"
   inkscape:export-ydpi="96"
   inkscape:version="1.2-beta (1b65182ce9, 2022-04-05)"
   xml:space="preserve"
   xmlns:inkscape="http://www.inkscape.org/namespaces/inkscape"
   xmlns:sodipodi="http://sodipodi.sourceforge.net/DTD/sodipodi-0.dtd"
   xmlns="http://www.w3.org/2000/svg"
   xmlns:svg="http://www.w3.org/2000/svg"><defs
     id="defs736" /><sodipodi:namedview
     id="namedview734"
     pagecolor="#ffffff"
     bordercolor="#666666"
     borderopacity="1.0"
     inkscape:pageshadow="2"
     inkscape:pageopacity="0.0"
     inkscape:pagecheckerboard="0"
     inkscape:deskcolor="#d1d1d1"
     showgrid="true"
     inkscape:zoom="28.6875"
     inkscape:cx="15.982571"
     inkscape:cy="16"
     inkscape:current-layer="svg732"><inkscape:grid
       type="xygrid"
       id="grid1467" /></sodipodi:namedview><linearGradient
     id="a"
     gradientUnits="userSpaceOnUse"
     x1="14"
     x2="15.5"
     y1="9"
     y2="14"><stop
       offset="0"
       stop-color="#ccc"
       id="stop717" /><stop
       offset="1"
       stop-color="#f2f2f2"
       id="stop719" /></linearGradient><g
     id="g1028"
     transform="scale(2)"><path
       d="M 14.5,6.75 V 2 L 13,0.5 H 0.5 v 15 h 7.05"
       fill="#0062f5"
       id="path722-7"
       style="fill:none;fill-rule:evenodd;stroke:#00aad4;stroke-width:1;stroke-linecap:round;stroke-linejoin:round;stroke-opacity:1"
       sodipodi:nodetypes="cccccc" /><path
       style="fill:none;stroke:#00aad4;stroke-width:1px;stroke-linecap:round;stroke-linejoin:round;stroke-opacity:1"
       d="m 4.5,1 v 4.5 h 7 V 1"
       id="path1004"
       sodipodi:nodetypes="cccc" /><path
       style="fill:none;stroke:#00aad4;stroke-width:1.5;stroke-linecap:butt;stroke-linejoin:miter;stroke-dasharray:none;stroke-opacity:1"
       d="m 9.5,1.5 v 3"
       id="path1006"
       sodipodi:nodetypes="cc" /><path
       style="fill:none;stroke:#00aad4;stroke-width:1;stroke-linecap:round;stroke-linejoin:round;stroke-dasharray:none;stroke-opacity:1"
       d="M 2.5,15 V 7.5 h 5"
       id="path1008"
       sodipodi:nodetypes="ccc" /></g><g
     id="g1474"
     transform="matrix(2,0,0,2,0,-2)"
     style="fill:none;stroke:#00aad4;stroke-linecap:round"><circle
       style="fill:none;stroke-width:1;stroke-linecap:round;stroke-linejoin:round;stroke-dasharray:none;stroke-dashoffset:1.49998"
       id="path346"
       cx="11.5"
       cy="12.5"
       r="4" /><g
       id="g394"><g
         id="g530"
         transform="rotate(45,11.5,12.5)"><path
           style="fill:none;stroke:#00aad4;stroke-width:1px;stroke-linecap:round;stroke-linejoin:miter;stroke-opacity:1"
           d="m 10.085786,11.085786 2.828428,2.828428"
           id="path1469"
           sodipodi:nodetypes="cc" /><path
           style="fill:none;stroke:#00aad4;stroke-width:1px;stroke-linecap:round;stroke-linejoin:miter;stroke-opacity:1"
           d="m 12.914214,11.085786 -2.828428,2.828428"
           id="path522"
           sodipodi:nodetypes="cc" /></g></g></g></svg>
