<?xml version="1.0" encoding="UTF-8" standalone="no"?>
<svg
   height="16"
   viewBox="0 0 16 16"
   width="16"
   version="1.1"
   id="svg5"
   sodipodi:docname="WiFi_02_16.svg"
   inkscape:export-filename="WiFi_02_16.png"
   inkscape:export-xdpi="96"
   inkscape:export-ydpi="96"
   inkscape:version="1.3.2 (091e20e, 2023-11-25, custom)"
   xmlns:inkscape="http://www.inkscape.org/namespaces/inkscape"
   xmlns:sodipodi="http://sodipodi.sourceforge.net/DTD/sodipodi-0.dtd"
   xmlns="http://www.w3.org/2000/svg"
   xmlns:svg="http://www.w3.org/2000/svg">
  <defs
     id="defs5" />
  <sodipodi:namedview
     id="namedview5"
     pagecolor="#ffffff"
     bordercolor="#000000"
     borderopacity="0.25"
     inkscape:showpageshadow="2"
     inkscape:pageopacity="0.0"
     inkscape:pagecheckerboard="0"
     inkscape:deskcolor="#d1d1d1"
     showgrid="true"
     inkscape:current-layer="svg5">
    <inkscape:grid
       id="grid5"
       units="px"
       originx="0"
       originy="0"
       spacingx="0.5"
       spacingy="0.5"
       empcolor="#0099e5"
       empopacity="0.30196078"
       color="#0099e5"
       opacity="0.14901961"
       empspacing="2"
       dotted="false"
       gridanglex="30"
       gridanglez="30"
       visible="true" />
  </sodipodi:namedview>
  <path
     d="m7.5 5.5h1l.5 7.5 3 .869356v1.130644h-8v-1l3-1z"
     fill="#ff7f00"
     id="path1" />
  <path
     d="m10.716797 3.5742188-.675781.7285156c.588861.5469655.958984 1.3259048.958984 2.1972656s-.370123 1.6503001-.958984 2.1972656l.675781.7285157c.786801-.7312615 1.283203-1.7711849 1.283203-2.9257813s-.496402-2.1945198-1.283203-2.9257812z"
     fill="#2a7efe"
     stroke-linecap="round"
     stroke-linejoin="round"
     id="path2" />
  <path
     d="m5.9589844 8.6972656c-.5888618-.5469655-.9589844-1.3259048-.9589844-2.1972656s.3701226-1.6503001.9589844-2.1972656l-.6757813-.7285156c-.7868007.7312614-1.2832031 1.7711848-1.2832031 2.9257812s.4964024 2.1945198 1.2832031 2.9257813z"
     fill="#2a7efe"
     stroke-linecap="round"
     stroke-linejoin="round"
     id="path3" />
  <path
     d="m12.419922 1.7402344-.675781.7265625c1.080784 1.0035214 1.755859 2.4377674 1.755859 4.0332031s-.675075 3.0296817-1.755859 4.033203l.675781.726563c1.278142-1.187774 2.080078-2.8815852 2.080078-4.759766 0-1.8781806-.801936-3.5719919-2.080078-4.7597656z"
     fill="#2a7efe"
     stroke-linecap="round"
     stroke-linejoin="round"
     id="path4" />
  <path
     d="m4.2558594 10.533203c-1.0807847-1.0035213-1.7558594-2.4377673-1.7558594-4.033203s.6750747-3.0296817 1.7558594-4.0332031l-.6757813-.7265625c-1.2781422 1.1877737-2.0800781 2.881585-2.0800781 4.7597656 0 1.8781808.8019359 3.571992 2.0800781 4.759766z"
     fill="#2a7efe"
     stroke-linecap="round"
     stroke-linejoin="round"
     id="path5" />
</svg>
