<?xml version="1.0" encoding="UTF-8" standalone="no"?>
<svg
   height="64"
   width="64"
   version="1.1"
   id="svg176"
   sodipodi:docname="Barcode_01_64.svg"
   inkscape:export-filename="Barcode_01_64.png"
   inkscape:export-xdpi="96"
   inkscape:export-ydpi="96"
   inkscape:version="1.2-beta (1b65182ce9, 2022-04-05)"
   xmlns:inkscape="http://www.inkscape.org/namespaces/inkscape"
   xmlns:sodipodi="http://sodipodi.sourceforge.net/DTD/sodipodi-0.dtd"
   xmlns="http://www.w3.org/2000/svg"
   xmlns:svg="http://www.w3.org/2000/svg">
  <defs
     id="defs180" />
  <sodipodi:namedview
     id="namedview178"
     pagecolor="#ffffff"
     bordercolor="#666666"
     borderopacity="1.0"
     inkscape:pageshadow="2"
     inkscape:pageopacity="0.0"
     inkscape:pagecheckerboard="0"
     inkscape:deskcolor="#d1d1d1"
     showgrid="true"
     inkscape:zoom="14.34375"
     inkscape:cx="28.479303"
     inkscape:cy="32"
     inkscape:current-layer="svg176">
    <inkscape:grid
       type="xygrid"
       id="grid1029" />
  </sodipodi:namedview>
  <radialGradient
     id="a"
     cx="5.988626"
     cy="7.28811"
     gradientTransform="matrix(-.00000055 3.4666666 -3.2000002 -.0000005 31.296708 -14.760566)"
     gradientUnits="userSpaceOnUse"
     r="3.75">
    <stop
       offset="0"
       stop-color="#f8fbff"
       id="stop149" />
    <stop
       offset=".66666657"
       stop-color="#d1e3ff"
       id="stop151" />
    <stop
       offset="1"
       stop-color="#f8fbff"
       id="stop153" />
  </radialGradient>
  <g
     id="g3390"
     transform="matrix(2.0000001,0,0,2.0000001,-5.9999994e-7,-1.6e-6)">
    <path
       d="M 0,5 H 31.999999 V 27 H 0 Z"
       fill="#ffffff"
       id="path2"
       style="stroke:none;stroke-width:0;stroke-dasharray:none" />
    <path
       d="M 2,6 V 25.999999"
       id="path8"
       style="fill:none;stroke:#000000;stroke-width:2;stroke-dasharray:none"
       sodipodi:nodetypes="cc" />
    <path
       d="M 20,6 V 25.999999"
       id="path12"
       style="fill:none;stroke:#000000;stroke-width:2;stroke-dasharray:none"
       sodipodi:nodetypes="cc" />
    <path
       d="M 15,6 V 25.999999"
       stroke-width="2.0081"
       id="path14"
       style="fill:none;stroke:#000000;stroke-width:4;stroke-dasharray:none"
       sodipodi:nodetypes="cc" />
    <path
       d="M 10,6 V 25.999999"
       id="path20"
       style="fill:none;stroke:#000000;stroke-width:2;stroke-dasharray:none"
       sodipodi:nodetypes="cc" />
    <path
       d="M 6,6 V 25.999999"
       id="path2225"
       style="fill:none;stroke:#000000;stroke-width:2;stroke-dasharray:none"
       sodipodi:nodetypes="cc" />
    <path
       d="M 25,6 V 25.999999"
       stroke-width="2.0081"
       id="path2229"
       style="fill:none;stroke:#000000;stroke-width:4;stroke-dasharray:none"
       sodipodi:nodetypes="cc" />
    <path
       d="M 30,6 V 25.999999"
       id="path2231"
       style="fill:none;stroke:#000000;stroke-width:2;stroke-dasharray:none"
       sodipodi:nodetypes="cc" />
  </g>
</svg>
