<?xml version="1.0" encoding="UTF-8" standalone="no"?>
<svg
   height="16"
   width="16"
   version="1.1"
   id="svg10"
   sodipodi:docname="Align_05_16.svg"
   inkscape:export-filename="Align_05_16.png"
   inkscape:export-xdpi="96"
   inkscape:export-ydpi="96"
   inkscape:version="1.3-beta (cedbd6c6ff, 2023-05-28)"
   xmlns:inkscape="http://www.inkscape.org/namespaces/inkscape"
   xmlns:sodipodi="http://sodipodi.sourceforge.net/DTD/sodipodi-0.dtd"
   xmlns="http://www.w3.org/2000/svg"
   xmlns:svg="http://www.w3.org/2000/svg">
  <defs
     id="defs10" />
  <sodipodi:namedview
     id="namedview10"
     pagecolor="#ffffff"
     bordercolor="#000000"
     borderopacity="0.25"
     inkscape:showpageshadow="2"
     inkscape:pageopacity="0.0"
     inkscape:pagecheckerboard="0"
     inkscape:deskcolor="#d1d1d1"
     showgrid="true"
     inkscape:zoom="56.8125"
     inkscape:cx="8"
     inkscape:cy="8"
     inkscape:current-layer="svg10">
    <inkscape:grid
       id="grid10"
       units="px"
       originx="0"
       originy="0"
       spacingx="0.5"
       spacingy="0.5"
       empcolor="#0099e5"
       empopacity="0.30196078"
       color="#0099e5"
       opacity="0.14901961"
       empspacing="2"
       dotted="false"
       gridanglex="30"
       gridanglez="30"
       visible="true" />
  </sodipodi:namedview>
  <g
     fill="none"
     stroke="#00aad4"
     id="g10">
    <path
       d="m4 13.5h10"
       id="path1" />
    <path
       d="m4 11.5h10"
       id="path2" />
    <path
       d="m7 9.5h7"
       id="path3" />
    <path
       d="m7 7.5h7"
       id="path4" />
    <path
       d="m7 5.5h7"
       id="path5" />
    <path
       d="m4 3.5h10"
       id="path6" />
    <path
       d="m4 1.5h10"
       id="path7" />
    <g
       stroke-linecap="round"
       id="g9">
      <path
         d="m.5 7.5h5"
         id="path8" />
      <path
         d="m3.5 5.5 2 2-2 2"
         fill="none"
         stroke="#00aad4"
         stroke-linejoin="round"
         id="path9" />
    </g>
  </g>
</svg>
