<?xml version="1.0" encoding="UTF-8" standalone="no"?>
<svg
   height="64"
   width="64"
   version="1.1"
   id="svg555"
   sodipodi:docname="Arrow_02_64.svg"
   inkscape:export-filename="Arrow_02_64.png"
   inkscape:export-xdpi="96"
   inkscape:export-ydpi="96"
   inkscape:version="1.2 (dc2aedaf03, 2022-05-15)"
   xmlns:inkscape="http://www.inkscape.org/namespaces/inkscape"
   xmlns:sodipodi="http://sodipodi.sourceforge.net/DTD/sodipodi-0.dtd"
   xmlns="http://www.w3.org/2000/svg"
   xmlns:svg="http://www.w3.org/2000/svg">
  <defs
     id="defs559" />
  <sodipodi:namedview
     id="namedview557"
     pagecolor="#ffffff"
     bordercolor="#666666"
     borderopacity="1.0"
     inkscape:pageshadow="2"
     inkscape:pageopacity="0.0"
     inkscape:pagecheckerboard="0"
     inkscape:deskcolor="#d1d1d1"
     showgrid="true"
     inkscape:zoom="14.34375"
     inkscape:cx="29.455338"
     inkscape:cy="32"
     inkscape:current-layer="svg555"
     inkscape:showpageshadow="2">
    <inkscape:grid
       type="xygrid"
       id="grid1581" />
  </sodipodi:namedview>
  <g
     fill="none"
     stroke="#00aad4"
     stroke-linecap="round"
     stroke-linejoin="round"
     stroke-width="3.2"
     transform="matrix(-2.0000044,0,0,2.0000044,62.000033,-7.04e-5)"
     id="g553">
    <path
       d="M 1.6000166,16 H 27.000017"
       id="path549" />
    <path
       d="m 19.400017,7 9,9 -9,9"
       id="path551" />
  </g>
</svg>
