<svg width="24" height="24" version="1.1" viewBox="0 0 24 24" xmlns="http://www.w3.org/2000/svg">
 <path d="m0.5 10.5v-3h23v3" fill="#e5e5e5" stroke="#2a7fff" stroke-linejoin="round"/>
 <path d="m7.5 6.5h9v4h7v12h-23v-12h7z" fill="#ffffff" stroke="#2a7fff" stroke-linejoin="round"/>
 <path d="m3 13.25h2.0206438" fill="none" stroke="#b3b3b3" stroke-linejoin="round" stroke-width="1.5"/>
 <path d="m8 13.25h9" fill="none" stroke="#b3b3b3" stroke-linejoin="round" stroke-width="1.5"/>
 <path d="m3 16.25h2.0206438" fill="none" stroke="#b3b3b3" stroke-linejoin="round" stroke-width="1.5"/>
 <path d="m8 16.25h12" fill="none" stroke="#b3b3b3" stroke-linejoin="round" stroke-width="1.5"/>
 <path d="m3 19.25h2.0206438" fill="none" stroke="#b3b3b3" stroke-linejoin="round" stroke-width="1.5"/>
 <path d="m8 19.25h11" fill="none" stroke="#b3b3b3" stroke-linejoin="round" stroke-width="1.5"/>
 <circle cx="4" cy="3" r="1.75" fill="#ff0000"/>
</svg>
