<?xml version="1.0" encoding="UTF-8" standalone="no"?>
<svg
   width="64"
   height="64"
   version="1.1"
   viewBox="0 0 64 64"
   id="svg5"
   sodipodi:docname="Random_01_64.svg"
   inkscape:version="1.3.2 (091e20e, 2023-11-25, custom)"
   xmlns:inkscape="http://www.inkscape.org/namespaces/inkscape"
   xmlns:sodipodi="http://sodipodi.sourceforge.net/DTD/sodipodi-0.dtd"
   xmlns="http://www.w3.org/2000/svg"
   xmlns:svg="http://www.w3.org/2000/svg">
  <defs
     id="defs5" />
  <sodipodi:namedview
     id="namedview5"
     pagecolor="#ffffff"
     bordercolor="#000000"
     borderopacity="0.25"
     inkscape:showpageshadow="2"
     inkscape:pageopacity="0.0"
     inkscape:pagecheckerboard="0"
     inkscape:deskcolor="#d1d1d1"
     showgrid="true"
     inkscape:current-layer="svg5">
    <inkscape:grid
       id="grid5"
       units="px"
       originx="0"
       originy="0"
       spacingx="0.5"
       spacingy="0.5"
       empcolor="#0099e5"
       empopacity="0.30196078"
       color="#0099e5"
       opacity="0.14901961"
       empspacing="2"
       dotted="false"
       gridanglex="30"
       gridanglez="30"
       visible="true" />
  </sodipodi:namedview>
  <path
     d="M 50.000201,15.999982 58.000237,20 50.000201,24.000016 Z"
     fill="#ff1a1a"
     stroke="#ff1a1a"
     stroke-linecap="round"
     stroke-linejoin="round"
     stroke-width="4.00002"
     id="path1" />
  <path
     d="m50.000201 40.00009 8.000036 4.000018-8.000036 4.000018z"
     fill="#2a7efe"
     stroke="#2a7efe"
     stroke-linecap="round"
     stroke-linejoin="round"
     stroke-width="4.00002"
     id="path2" />
  <path
     d="m48.000191 20c-4.000018 0-8.000036 2.000006-10.000046 4.000016l-16.000071 16.000074c-2.00001 2.000008-6.000028 4.000018-10.000046 4.000018h-6.000028"
     fill="none"
     stroke="#ff1a1a"
     stroke-linejoin="round"
     stroke-width="4.00002"
     id="path3" />
  <path
     d="m 26.000092,28.000034 -3.78657,-3.78657 C 20.000064,22.000006 16.000046,20 12.000028,20 H 6"
     fill="none"
     stroke="#2a7efe"
     stroke-linejoin="round"
     stroke-width="4.00002"
     id="path4" />
  <path
     d="m48.000191 44.000108c-4.000018 0-8.000036-2.00001-10.000046-4.000018l-4.000017-4.00002"
     fill="none"
     stroke="#2a7efe"
     stroke-linejoin="round"
     stroke-width="4.00002"
     id="path5" />
</svg>
