<?xml version="1.0" encoding="UTF-8" standalone="no"?>
<svg
   height="32"
   width="32"
   version="1.1"
   id="svg151"
   sodipodi:docname="btn_retry_200.svg"
   inkscape:export-filename="btn_retry_200.png"
   inkscape:export-xdpi="96"
   inkscape:export-ydpi="96"
   inkscape:version="1.2.2 (732a01da63, 2022-12-09)"
   xmlns:inkscape="http://www.inkscape.org/namespaces/inkscape"
   xmlns:sodipodi="http://sodipodi.sourceforge.net/DTD/sodipodi-0.dtd"
   xmlns="http://www.w3.org/2000/svg"
   xmlns:svg="http://www.w3.org/2000/svg">
  <defs
     id="defs155" />
  <sodipodi:namedview
     id="namedview153"
     pagecolor="#ffffff"
     bordercolor="#666666"
     borderopacity="1.0"
     inkscape:showpageshadow="2"
     inkscape:pageopacity="0.0"
     inkscape:pagecheckerboard="0"
     inkscape:deskcolor="#d1d1d1"
     showgrid="true"
     inkscape:zoom="28.6875"
     inkscape:cx="13.978214"
     inkscape:cy="16"
     inkscape:current-layer="svg151">
    <inkscape:grid
       type="xygrid"
       id="grid3829" />
  </sodipodi:namedview>
  <g
     id="g3837">
    <path
       d="M 19.87931,14.499962 H 28.5 V 5.8809541"
       id="path141"
       style="fill:none;stroke:#fa0302;stroke-width:3;stroke-linecap:round" />
    <path
       d="M 26.689656,14.069006 C 22.034482,4.5655161 11.689656,-2.3461139 3.5,10.613192"
       id="path143"
       style="fill:none;stroke:#fa0302;stroke-width:3;stroke-linecap:round" />
  </g>
  <g
     id="g4204"
     style="stroke:#2a7efe;stroke-opacity:1">
    <path
       d="M 12.12069,17.499962 H 3.5 v 8.619008"
       id="path145"
       style="fill:none;stroke:#2a7efe;stroke-width:3;stroke-linecap:round;stroke-opacity:1" />
    <path
       d="M 5.3103448,17.930918 C 9.965518,27.434474 20.310344,34.346156 28.5,21.386758"
       id="path147"
       style="fill:none;stroke:#2a7efe;stroke-width:3;stroke-linecap:round;stroke-opacity:1" />
  </g>
</svg>
