<?xml version="1.0" encoding="UTF-8" standalone="no"?>
<svg
   width="32"
   height="32"
   version="1.1"
   id="svg359"
   sodipodi:docname="menu_delunit_to_lazunit_200.svg"
   inkscape:export-filename="menu_delunit_to_lazunit_200.png"
   inkscape:export-xdpi="96"
   inkscape:export-ydpi="96"
   inkscape:version="1.2.1 (9c6d41e410, 2022-07-14)"
   xmlns:inkscape="http://www.inkscape.org/namespaces/inkscape"
   xmlns:sodipodi="http://sodipodi.sourceforge.net/DTD/sodipodi-0.dtd"
   xmlns="http://www.w3.org/2000/svg"
   xmlns:svg="http://www.w3.org/2000/svg">
  <defs
     id="defs363" />
  <sodipodi:namedview
     id="namedview361"
     pagecolor="#ffffff"
     bordercolor="#666666"
     borderopacity="1.0"
     inkscape:showpageshadow="2"
     inkscape:pageopacity="0.0"
     inkscape:pagecheckerboard="0"
     inkscape:deskcolor="#d1d1d1"
     showgrid="true"
     inkscape:zoom="28.6875"
     inkscape:cx="15.982571"
     inkscape:cy="16"
     inkscape:current-layer="svg359">
    <inkscape:grid
       type="xygrid"
       id="grid586" />
  </sodipodi:namedview>
  <linearGradient
     id="a"
     x1="3"
     x2="13"
     y1="2"
     y2="14"
     gradientTransform="matrix(1.7331 0 0 1.6284 8.0705 7.9189)"
     gradientUnits="userSpaceOnUse">
    <stop
       stop-color="#fff"
       offset="0"
       id="stop322" />
    <stop
       stop-color="#dfeaf4"
       offset="1"
       id="stop324" />
  </linearGradient>
  <g
     transform="translate(23)"
     id="g345">
    <rect
       x="-23"
       width="20"
       height="18"
       fill="#e60000"
       stroke-linejoin="round"
       stroke-miterlimit="5.6"
       stroke-width="3.3541"
       id="rect327" />
    <g
       transform="matrix(2,0,0,2,-22,0)"
       stroke="#fff"
       id="g343">
      <path
         d="m7.5001 3.5-3.0001-2-3.0001 2z"
         fill="#fff"
         fill-rule="evenodd"
         stroke-linejoin="round"
         id="path329" />
      <g
         fill="none"
         id="g341">
        <g
           stroke-width="1px"
           id="g337">
          <path
             d="m2.5 4v3.5"
             id="path331" />
          <path
             d="m4.5 4v3.5"
             id="path333" />
          <path
             d="m6.5 4v3.5"
             id="path335" />
        </g>
        <path
           d="m0.5 7.5h8"
           id="path339" />
      </g>
    </g>
  </g>
  <g
     fill-rule="evenodd"
     id="g357">
    <path
       d="m13.5 11.5h15l3 3-0.0016 17.002-17.998-0.0016z"
       fill="url(#a)"
       stroke="#75a4d3"
       stroke-linecap="square"
       id="path347" />
    <path
       d="m17 15v2h11v-2z"
       fill="#c8ab37"
       id="path349" />
    <path
       d="m17 19v2h11v-2z"
       fill="#d3bc5f"
       id="path351" />
    <path
       d="m17 23v2h11v-2z"
       fill="#decd87"
       id="path353" />
    <path
       d="m17 27v2h11v-2z"
       fill="#e9ddaf"
       id="path355" />
  </g>
</svg>
