<?xml version="1.0" encoding="UTF-8" standalone="no"?>
<svg
   height="11"
   width="11"
   version="1.1"
   id="svg4548"
   sodipodi:docname="PendingBreakPoint.svg"
   inkscape:export-filename="PendingBreakPoint.png"
   inkscape:export-xdpi="96"
   inkscape:export-ydpi="96"
   inkscape:version="1.2.2 (732a01da63, 2022-12-09)"
   xmlns:inkscape="http://www.inkscape.org/namespaces/inkscape"
   xmlns:sodipodi="http://sodipodi.sourceforge.net/DTD/sodipodi-0.dtd"
   xmlns="http://www.w3.org/2000/svg"
   xmlns:svg="http://www.w3.org/2000/svg">
  <defs
     id="defs4552" />
  <sodipodi:namedview
     id="namedview4550"
     pagecolor="#ffffff"
     bordercolor="#666666"
     borderopacity="1.0"
     inkscape:showpageshadow="2"
     inkscape:pageopacity="0.0"
     inkscape:pagecheckerboard="0"
     inkscape:deskcolor="#d1d1d1"
     showgrid="true"
     inkscape:zoom="83.454545"
     inkscape:cx="5.4940087"
     inkscape:cy="5.5"
     inkscape:current-layer="svg4548">
    <inkscape:grid
       type="xygrid"
       id="grid5127" />
  </sodipodi:namedview>
  <radialGradient
     id="a"
     cx="4"
     cy="4"
     gradientTransform="matrix(.00000004 1.2727273 -1.2727273 .00000002 9.090909 -1.090909)"
     gradientUnits="userSpaceOnUse"
     r="5.5">
    <stop
       offset="0"
       stop-color="#ff8080"
       id="stop4535" />
    <stop
       offset="1"
       stop-color="#f00"
       id="stop4537" />
  </radialGradient>
  <circle
     cx="5.5"
     cy="5.5"
     fill="url(#a)"
     r="5.5"
     id="circle4540" />
  <g
     fill="none"
     stroke="#fff"
     id="g4546">
    <path
       d="m6.5 3v5"
       id="path4542" />
    <path
       d="m4.5 3v5"
       id="path4544" />
  </g>
</svg>
