<?xml version="1.0" encoding="UTF-8" standalone="no"?>
<svg
   width="48"
   height="48"
   version="1.1"
   viewBox="0 0 48 48"
   id="svg5"
   sodipodi:docname="tmysql50connection_200.svg"
   inkscape:version="1.3.2 (091e20e, 2023-11-25, custom)"
   inkscape:export-filename="tmysql50connection_200.png"
   inkscape:export-xdpi="96"
   inkscape:export-ydpi="96"
   xmlns:inkscape="http://www.inkscape.org/namespaces/inkscape"
   xmlns:sodipodi="http://sodipodi.sourceforge.net/DTD/sodipodi-0.dtd"
   xmlns="http://www.w3.org/2000/svg"
   xmlns:svg="http://www.w3.org/2000/svg">
  <defs
     id="defs5" />
  <sodipodi:namedview
     id="namedview5"
     pagecolor="#ffffff"
     bordercolor="#000000"
     borderopacity="0.25"
     inkscape:showpageshadow="2"
     inkscape:pageopacity="0.0"
     inkscape:pagecheckerboard="0"
     inkscape:deskcolor="#d1d1d1"
     showgrid="true"
     inkscape:current-layer="svg5">
    <inkscape:grid
       id="grid5"
       units="px"
       originx="0"
       originy="0"
       spacingx="0.5"
       spacingy="0.5"
       empcolor="#0099e5"
       empopacity="0.30196078"
       color="#0099e5"
       opacity="0.14901961"
       empspacing="2"
       dotted="false"
       gridanglex="30"
       gridanglez="30"
       visible="true" />
  </sodipodi:namedview>
  <path
     d="m 26,5 h 5 V 1 h 8 v 5"
     fill="none"
     stroke="#2a7efe"
     stroke-linejoin="round"
     stroke-width="2"
     id="path1" />
  <path
     d="M 48,5 H 43 V 9 H 35 V 4"
     fill="none"
     stroke="#ff0000"
     stroke-linejoin="round"
     stroke-width="2"
     id="path2" />
  <path
     d="m 14.5,36.8 c 1.366667,0 2.466907,1.1044 2.466907,2.4762 v 5.4476 c 0,1.3718 -1.10024,2.4762 -2.466907,2.4762 -1.366666,0 -2.466907,-1.1044 -2.466907,-2.4762 V 39.2762 C 12.033093,37.9044 13.133334,36.8 14.5,36.8 Z"
     fill="none"
     stroke="#ff0000"
     stroke-linecap="round"
     stroke-linejoin="round"
     stroke-width="1.6"
     id="path3" />
  <path
     d="m 2.3528693,2.011 c -0.569458,0.066 -1.18344,0.284 -1.540928,0.5886 -0.56274,0.479 -0.874148,1.3112 -0.801526,2.1414 0.08182,0.9356 0.577244,1.717 2.303592,3.6332 1.609873,1.787 1.781941,2.033 2.227287,3.182 1.009104,2.6036 2.637306,5.495 3.607954,6.4068 0.655695,0.6162 0.758413,0.8016 0.604383,1.0942 -0.16638,0.3156 -0.645459,3.4018 -0.696437,4.4866 -0.051,1.0858 0.246856,3.5226 0.550143,4.5004 0.59195,1.9088 1.386786,3.2572 2.4458437,4.15 1.02476,0.8636 1.805548,0.9712 2.640789,0.3632 0.454984,-0.331 0.622766,-0.9324 0.760492,-2.7262 0.06864,-0.8942 0.14682,-1.6692 0.17362,-1.7224 0.02672,-0.052 0.425796,0.5084 0.886762,1.2472 0.460948,0.7386 0.986446,1.5084 1.167802,1.7106 0.533526,0.595 2.251065,2.044 3.182801,2.6854 0.47484,0.3268 1.20678,0.8682 1.626528,1.2028 1.18495,0.945 1.356124,0.911 0.223596,-0.044 -2.088292,-1.7612 -5.082915,-5.8392 -6.800509,-9.2602 -0.293212,-0.5842 -0.575704,-1.0706 -0.627792,-1.081 -0.12906,-0.026 -0.941547,1.241 -1.190893,1.8572 -0.292486,0.7226 -0.431686,1.6696 -0.488136,3.3218 -0.02736,0.799 -0.09322,1.4876 -0.14628,1.5296 -0.13018,0.102 -0.569366,-0.09 -0.932122,-0.4112 -0.3221,-0.2848 -0.859528,-1.1828 -1.272208,-2.1254 C 9.6300173,27.3082 9.2208593,24.5562 9.3729273,22.7918 9.4143273,22.311 9.6160773,21.2262 9.8212213,20.38 10.341949,18.233 10.319371,18.1146 9.1931453,17.0832 8.2380583,16.2088 7.5075843,14.9842 6.4033363,12.405 5.9206683,11.2776 5.3642463,10.0958 5.1667283,9.7786 4.7695883,9.1408 3.4054173,7.485 2.5814113,6.641 1.8252833,5.8658 1.3361233,4.9942 1.3607253,4.4658 c 0.02588,-0.556 0.19924,-0.729 0.83922,-0.8364 0.451858,-0.076 0.69914,-0.04 1.518889,0.2034 1.401332,0.4208 2.737386,1.0012 3.44839,1.4982 0.646182,0.4516 0.780854,0.5546 0.975188,0.679 0.24283,0 0.594925,-0.02 1.816779,-0.034 1.9255337,-0.032 2.5501057,0.086 4.5083467,0.8484 5.290957,2.0606 10.544656,6.7238 13.030158,11.566 0.281916,0.5494 0.986802,1.8236 1.566506,2.8312 0.579722,1.0084 1.375663,2.4046 1.768741,3.103 1.259344,2.2386 1.981904,3.1772 2.655538,3.4512 0.231624,0.094 1.117424,0.3376 1.968561,0.541 0.851148,0.2036 1.851946,0.4778 2.223944,0.6096 0.831772,0.2946 5.501979,2.8918 5.833367,3.2442 l 0.240242,0.2558 -1.28667,0.182 c -0.70765,0.1 -1.711326,0.2864 -2.229885,0.4162 -1.15607,0.2856 -3.3115,1.1902 -3.415332,1.432 -0.11872,0.277 0.626506,1.4388 1.36076,2.1212 1.060914,0.986 2.658203,1.8984 4.731617,2.703 1.803458,0.6998 3.339575,1.5082 4.485763,2.3608 0.299156,0.2228 0.563256,0.3822 0.5868,0.3542 0.11476,-0.136 -0.58356,-0.979 -1.537468,-1.8562 -1.995991,-1.8358 -2.752773,-2.3704 -4.628033,-3.2694 -1.136826,-0.545 -2.388255,-1.4322 -2.410241,-1.709 -0.0142,-0.176 2.224035,-0.9324 3.594513,-1.2134 1.182036,-0.2422 2.718245,-0.8098 2.701849,-0.997 -0.0215,-0.2462 -1.416979,-1.6122 -2.255389,-2.2078 -1.078818,-0.767 -3.031306,-1.9776 -4.168375,-2.5846 -0.785872,-0.4196 -3.869432,-1.5992 -4.550807,-1.7412 -0.11782,-0.026 -0.34757,-0.16 -0.510558,-0.3046 C 33.730531,25.6808 31.026353,21.1456 29.30968,17.8722 28.333542,16.0112 27.66299,15.029 26.20853,13.3304 23.693866,10.394 21.094225,8.3412 17.258214,6.2626 15.245252,5.1718 14.508056,4.891 12.864065,4.5868 11.854115,4.4008 11.257559,4.3516 10.314995,4.3798 9.6382433,4.4018 9.0570733,4.3478 8.8742173,4.3318 8.5735473,4.1398 8.4208603,4.0764 8.1238063,3.869 6.6996103,2.8744 4.4194223,2.083 2.7371853,2 c -0.1236,0 -0.252822,0 -0.38429,0.02 z m 7.7656717,6.9038 c -0.8353297,0.088 -0.8647757,0.156 -0.2825837,0.73 0.2839757,0.2788 0.7100397,0.8398 0.9467037,1.246 0.25875,0.445 0.47723,0.717 0.548004,0.683 0.19656,-0.094 0.486554,-0.8442 0.457092,-1.1808 -0.07002,-0.8008 -0.919956,-1.5534 -1.669216,-1.4782 z"
     fill="#2a7efe"
     id="path4" />
  <path
     d="m 8.183814,42.9905 c 0,-1.3676 -1.104471,-2.4762 -2.466907,-2.4762 C 4.565419,40.5143 3.576421,41.1754 3.25,42 M 8.183814,36.8 H 3.25 V 42 m 4.933814,1.2381 v 1.2381 m 0,0.2476 C 8.183814,46.0914 7.079343,47.2 5.716907,47.2 4.565419,47.2 3.7127,46.7851 3.25,45.7143"
     fill="none"
     stroke="#ff0000"
     stroke-linecap="round"
     stroke-linejoin="round"
     stroke-width="1.6"
     id="path5" />
</svg>
