<?xml version="1.0" encoding="UTF-8" standalone="no"?>
<svg
   width="32"
   height="32"
   version="1.1"
   viewBox="0 0 32 32"
   id="svg6"
   sodipodi:docname="Temperature_01_32.svg"
   inkscape:export-filename="Temperature_01_32.png"
   inkscape:export-xdpi="96"
   inkscape:export-ydpi="96"
   inkscape:version="1.3.2 (091e20e, 2023-11-25, custom)"
   xmlns:inkscape="http://www.inkscape.org/namespaces/inkscape"
   xmlns:sodipodi="http://sodipodi.sourceforge.net/DTD/sodipodi-0.dtd"
   xmlns="http://www.w3.org/2000/svg"
   xmlns:svg="http://www.w3.org/2000/svg">
  <defs
     id="defs6" />
  <sodipodi:namedview
     id="namedview6"
     pagecolor="#ffffff"
     bordercolor="#000000"
     borderopacity="0.25"
     inkscape:showpageshadow="2"
     inkscape:pageopacity="0.0"
     inkscape:pagecheckerboard="0"
     inkscape:deskcolor="#d1d1d1"
     showgrid="true"
     inkscape:current-layer="svg6">
    <inkscape:grid
       id="grid6"
       units="px"
       originx="0"
       originy="0"
       spacingx="0.5"
       spacingy="0.5"
       empcolor="#0099e5"
       empopacity="0.30196078"
       color="#0099e5"
       opacity="0.14901961"
       empspacing="2"
       dotted="false"
       gridanglex="30"
       gridanglez="30"
       visible="true" />
  </sodipodi:namedview>
  <path
     d="m20.499987 23.971018c0 3.313699-2.686285 5.999983-5.999983 5.999983s-5.9999825-2.686284-5.9999825-5.999983c0.01-2.133512 1.152282-4.10121 2.9999905-5.167953v-13.831993c0-3.9227646 5.999983-3.9227646 5.999983 0v13.804649c1.856141 1.071643 2.999692 3.052009 2.999992 5.195297z"
     fill="#ebfcff"
     stroke="#00aad4"
     stroke-linecap="round"
     stroke-linejoin="round"
     stroke-width=".999997"
     id="path1" />
  <circle
     cx="14.500004"
     cy="23.971018"
     r="2.9999914"
     fill="#ff7f00"
     id="circle1" />
  <path
     d="m20.5 8.5000232h2.999991"
     fill="none"
     stroke="#ff7f00"
     stroke-linecap="round"
     stroke-linejoin="round"
     stroke-width=".999997"
     id="path2" />
  <path
     d="m20.5 4.5000342h2.999991"
     fill="none"
     stroke="#ff7f00"
     stroke-linecap="round"
     stroke-linejoin="round"
     stroke-width=".999997"
     id="path3" />
  <path
     d="m20.5 16.5h2.999991"
     fill="none"
     stroke="#ff7f00"
     stroke-linecap="round"
     stroke-linejoin="round"
     stroke-width=".999997"
     id="path4" />
  <path
     d="m20.5 12.500012h2.999991"
     fill="none"
     stroke="#ff7f00"
     stroke-linecap="round"
     stroke-linejoin="round"
     stroke-width=".999997"
     id="path5" />
  <path
     d="m14.500004 4.9710722v18.999946"
     fill="none"
     stroke="#ff7f00"
     stroke-linecap="round"
     stroke-linejoin="round"
     stroke-width=".999997"
     id="path6" />
</svg>
