<svg width="16" height="16" version="1.1" xmlns="http://www.w3.org/2000/svg">
 <path d="m6.5 2c-1.335555 0-2.5 0.5039044-2.5 2v2.5c0 0.6148307-0.3505944 0.9003906-1 0.9003906v1.1992188c0.6494056 0 1 0.2855599 1 0.9003906v2.5c0 1.496096 1.164445 2 2.5 2v-1.099609c-0.940009-0.0073-1.300781-0.346513-1.300781-0.900391v-2.5c0-0.8687515-0.3757257-1.5-0.699219-1.5 0.3234933 0 0.699219-0.6312485 0.699219-1.5v-2.5c0-0.5538785 0.360772-0.8931133 1.300781-0.9003906z" fill="#00aad4" stroke-width=".991801"/>
 <path d="m9.5 2c1.335555 0 2.5 0.5039044 2.5 2v2.5c0 0.6148307 0.350594 0.9003906 1 0.9003906v1.1992188c-0.649406 0-1 0.2855599-1 0.9003906v2.5c0 1.496096-1.164445 2-2.5 2v-1.099609c0.940009-0.0073 1.300781-0.346513 1.300781-0.900391v-2.5c0-0.8687515 0.375726-1.5 0.699219-1.5-0.323493 0-0.699219-0.6312485-0.699219-1.5v-2.5c0-0.5538785-0.360772-0.8931133-1.300781-0.9003906z" fill="#00aad4" stroke-width=".991801"/>
</svg>
