<?xml version="1.0" encoding="UTF-8" standalone="no"?>
<svg
   width="24"
   height="24"
   version="1.1"
   viewBox="0 0 24 24"
   id="svg8"
   sodipodi:docname="tfilelistbox.svg"
   inkscape:export-filename="tfilelistbox.png"
   inkscape:export-xdpi="96"
   inkscape:export-ydpi="96"
   inkscape:version="1.3.2 (091e20e, 2023-11-25, custom)"
   xmlns:inkscape="http://www.inkscape.org/namespaces/inkscape"
   xmlns:sodipodi="http://sodipodi.sourceforge.net/DTD/sodipodi-0.dtd"
   xmlns="http://www.w3.org/2000/svg"
   xmlns:svg="http://www.w3.org/2000/svg">
  <defs
     id="defs8" />
  <sodipodi:namedview
     id="namedview8"
     pagecolor="#ffffff"
     bordercolor="#000000"
     borderopacity="0.25"
     inkscape:showpageshadow="2"
     inkscape:pageopacity="0.0"
     inkscape:pagecheckerboard="0"
     inkscape:deskcolor="#d1d1d1"
     showgrid="true"
     inkscape:current-layer="svg8">
    <inkscape:grid
       id="grid8"
       units="px"
       originx="0"
       originy="0"
       spacingx="0.5"
       spacingy="0.5"
       empcolor="#0099e5"
       empopacity="0.30196078"
       color="#0099e5"
       opacity="0.14901961"
       empspacing="2"
       dotted="false"
       gridanglex="30"
       gridanglez="30"
       visible="true" />
  </sodipodi:namedview>
  <rect
     x="2.25"
     y="3.2499826"
     width="18.5"
     height="18.5"
     fill="#f9f9f9"
     stroke="#2a7efe"
     stroke-width="0.5"
     style="paint-order:normal"
     id="rect1" />
  <rect
     x="17.25"
     y="3.2499826"
     width="3.5"
     height="18.5"
     fill="#e6e6e6"
     stroke="#2a7efe"
     stroke-width="0.5"
     style="paint-order:normal"
     id="rect2" />
  <path
     d="m 19,6.5 v 6"
     fill="#e6e6e6"
     stroke="#2a7efe"
     stroke-linecap="round"
     stroke-linejoin="round"
     id="path2" />
  <path
     d="M 9.5,19.25 H 15"
     fill="#b3b3b3"
     stroke="#b3b3b3"
     stroke-width="1.5"
     id="path3" />
  <path
     d="M 9.5,13.25 H 15"
     fill="#b3b3b3"
     stroke="#b3b3b3"
     stroke-width="1.5"
     id="path4" />
  <path
     d="M 9.5,7.25 H 15"
     fill="#b3b3b3"
     stroke="#b3b3b3"
     stroke-width="1.5"
     id="path5" />
  <path
     d="M 4.25,9.75 V 5.25 H 6.5 L 7.75,6.5 v 3.25 z"
     fill="none"
     stroke="#666666"
     stroke-linejoin="round"
     stroke-width="0.5"
     id="path6"
     style="fill:#ffffff" />
  <path
     d="M 4.25,21 V 17.25 H 6.5 L 7.75,18.5 V 21"
     fill="none"
     stroke="#666666"
     stroke-linejoin="round"
     stroke-width="0.5"
     id="path7"
     style="fill:#ffffff"
     sodipodi:nodetypes="ccccc" />
  <path
     d="m 4.25,15.75 v -4.5 H 6.5 l 1.25,1.25 v 3.25 z"
     fill="none"
     stroke="#666666"
     stroke-linejoin="round"
     stroke-width="0.5"
     id="path8"
     style="fill:#ffffff" />
</svg>
