<?xml version="1.0" encoding="UTF-8" standalone="no"?>
<svg
   height="24"
   viewBox="0 0 24 24"
   width="24"
   version="1.1"
   id="svg839"
   sodipodi:docname="table_open_150.svg"
   inkscape:version="1.2.2 (732a01da63, 2022-12-09)"
   xmlns:inkscape="http://www.inkscape.org/namespaces/inkscape"
   xmlns:sodipodi="http://sodipodi.sourceforge.net/DTD/sodipodi-0.dtd"
   xmlns="http://www.w3.org/2000/svg"
   xmlns:svg="http://www.w3.org/2000/svg">
  <defs
     id="defs843" />
  <sodipodi:namedview
     id="namedview841"
     pagecolor="#ffffff"
     bordercolor="#000000"
     borderopacity="0.25"
     inkscape:showpageshadow="2"
     inkscape:pageopacity="0.0"
     inkscape:pagecheckerboard="0"
     inkscape:deskcolor="#d1d1d1"
     showgrid="true"
     inkscape:zoom="37.916667"
     inkscape:cx="11.986813"
     inkscape:cy="12"
     inkscape:current-layer="svg839">
    <inkscape:grid
       type="xygrid"
       id="grid962" />
  </sodipodi:namedview>
  <linearGradient
     id="a"
     gradientTransform="matrix(.75301989 0 0 .72970743 96.156196 46.684115)"
     gradientUnits="userSpaceOnUse"
     x1="-124.5"
     x2="-122"
     y1="-45"
     y2="-45">
    <stop
       offset="0"
       stop-color="#de7900"
       id="stop803" />
    <stop
       offset="1"
       stop-color="#ffa73e"
       id="stop805" />
  </linearGradient>
  <filter
     id="b"
     color-interpolation-filters="sRGB"
     height="1.1072208"
     width="1.0606769"
     x="-0.030338468"
     y="-0.053610379">
    <feGaussianBlur
       stdDeviation=".3602005"
       id="feGaussianBlur808" />
  </filter>
  <linearGradient
     id="c"
     gradientTransform="matrix(.75301989 0 0 .72970743 .47468 -1.111721)"
     gradientUnits="userSpaceOnUse"
     x1="14"
     x2="14.362571"
     y1="25.5"
     y2="27.893099">
    <stop
       offset="0"
       stop-color="#ececec"
       id="stop811" />
    <stop
       offset="1"
       stop-color="#fff"
       id="stop813" />
  </linearGradient>
  <linearGradient
     id="d"
     gradientTransform="matrix(1.436158 0 0 1.4309104 .700588 -.565568)"
     gradientUnits="userSpaceOnUse"
     x1="3"
     x2="15"
     y1="9.989"
     y2="9.989">
    <stop
       offset="0"
       stop-color="#ccc"
       id="stop816" />
    <stop
       offset="1"
       stop-color="#f2f2f2"
       id="stop818" />
  </linearGradient>
  <path
     d="m-154.30078-29.5c-1.70899-.0016-3 .5-3.44985 1.972448l-1.02085 11.191661c-.0293 1.835891 1.57019 2.814254 3.11132 2.835938h25.38284l-2.93641-6.320572h1.88733l-3.59212-9.804686z"
     fill="#999"
     fill-opacity=".994638"
     filter="url(#b)"
     transform="matrix(.76094678 0 0 .72970743 122.17536 31.783996)"
     id="path821" />
  <path
     d="m22.242958 17.320812-2.7426-7.154552h-14.4912964v7.154552z"
     fill="url(#d)"
     id="path823" />
  <path
     d="m22.242958 17.320812c-1.436158 0-1.678684 3.823544.203865 3.823544h-18.4329499c-2.6355696 0-2.6355696-3.792064 0-3.792064l.9951885-.03148"
     fill="url(#c)"
     id="path825" />
  <path
     d="m2.0362146 19.320087.4716187-12.3591237c.1205058-1.2113339 1.1295298-1.4594147 2.2590596-1.4594147h.8629997l10.1503544-5.25156234 1.436158 11.85074374-12.0529219 5.251562c-2.2936716 0-3.1272685.40409-3.1272685 1.967795z"
     style="stroke:#b26f25;stroke-width:.5;stroke-linecap:round;stroke-linejoin:round;stroke-opacity:.994638;fill:url(#a)"
     id="path827" />
  <path
     d="m5.1634831 17.152122.4207253-11.4787641"
     fill="none"
     stroke="#b26f24"
     stroke-linecap="round"
     stroke-width=".5"
     id="path829" />
  <g
     stroke-width=".666667"
     transform="matrix(1.4970813 -.09352825 .09352825 1.4970813 .28586 -.271837)"
     id="g835">
    <path
       d="m6.7069453 3.3235822c-1.8111769.790669-3.1232768 2.4355217-2.9276171 3.498613.1506488.81875 1.7654594.1987848 2.2496976-.7145131.1190634-.2245292.1939638-.2966626.2726799-.3631784.0747591-.0631298.1998994-.1380685.3892702-.2360233-.0170999.0590303-.0140615.1175079-.0732752.206662-.1007622.1518013-.3177615.408672-.5864137.7667785-.3723823.4963849-.588039 1.0364164-.5553937 1.4730645.0115177.1534522.1384245.231567.2556507.3102624-.3087876.3433524-.531157.7053878-.507415.9895308.040418.4868455.7186907.5641774 1.3925118.2075434.6612435-.3498388 1.2682902-1.09148 1.266029-1.5797848-.0012719-.2714359-.2025844-.4076996-.4862874-.4447981.0945441-.1668841.211841-.3406031.2165046-.483107l-.00869.074638c-.0003533.00177.02247-.0615.1577855-.2225565.1355968-.1613015.3529493-.3839489.5874017-.6328655.0142028-.014887.0280524-.0299908.0414779-.0452906.4535715-.5252844 1.0857734-1.3184579 1.1115646-2.0890421.0202796-.6068131-.3542225-.9623382-.8742857-1.0576486-.5373045-.0984515-1.2171318.0343353-1.9211957.3417154z"
       fill="#ff0"
       stroke-linecap="round"
       stroke-linejoin="round"
       stroke-width=".333333"
       id="path831" />
    <path
       d="m7.209626 8.2304718c.0028264.1164027-.0601323.261383-.1748854.4035021-.1144705.1418882-.2719733.2701907-.4384501.3571845-.1671834.0873918-.3306924.1263982-.4547021.108007-.1250695-.0185416-.1998286-.0939099-.2071773-.210041-.0154041-.244475.2653312-.595026.6239346-.7780424.3552117-.1812324.6454154-.1256161.6512803.1193898zm-.4886192-4.2641811c1.0731251-.4781819 2.0931133-.4225865 2.080677.4076575-.007914.5313568-.4268617 1.0614753-.8614961 1.5662972-.4378141.4654985-.9594319.9653534-1.0275489 1.3473994-.0055822.3994235-.6847029.756033-.7086569.302805-.016464-.3125361.1213952-.6431702.383052-.9899156.4695409-.6222738.882977-1.0159049.8983811-1.5701728.0103165-.3724198-.5118666-.2674133-.8287802-.1081686-.4889725.2456565-.9519419.5274112-1.306023 1.205861-.2082373.3991018-.7363559.5156233-.771969.2900447-.0970879-.6141447.7692132-1.8399297 2.142364-2.4518078z"
       fill="#f50"
       stroke-width=".673887"
       id="path833" />
  </g>
  <path
     d="m22.242958 21.255815h-18.2290849c-2.6355696 0-2.6355696-3.903523 0-3.903523l.9951885-.03148"
     fill="none"
     stroke="#b16e24"
     stroke-linecap="round"
     stroke-linejoin="round"
     stroke-width=".5"
     id="path837" />
</svg>
