<?xml version="1.0" encoding="UTF-8" standalone="no"?>
<svg
   width="16"
   height="16"
   version="1.1"
   id="svg4"
   sodipodi:docname="Manometer_02_16.svg"
   inkscape:export-filename="Manometer_02_16.png"
   inkscape:export-xdpi="96"
   inkscape:export-ydpi="96"
   inkscape:version="1.3.2 (091e20e, 2023-11-25, custom)"
   xmlns:inkscape="http://www.inkscape.org/namespaces/inkscape"
   xmlns:sodipodi="http://sodipodi.sourceforge.net/DTD/sodipodi-0.dtd"
   xmlns="http://www.w3.org/2000/svg"
   xmlns:svg="http://www.w3.org/2000/svg">
  <defs
     id="defs4" />
  <sodipodi:namedview
     id="namedview4"
     pagecolor="#ffffff"
     bordercolor="#000000"
     borderopacity="0.25"
     inkscape:showpageshadow="2"
     inkscape:pageopacity="0.0"
     inkscape:pagecheckerboard="0"
     inkscape:deskcolor="#d1d1d1"
     showgrid="true"
     inkscape:current-layer="svg4">
    <inkscape:grid
       id="grid4"
       units="px"
       originx="0"
       originy="0"
       spacingx="0.5"
       spacingy="0.5"
       empcolor="#0099e5"
       empopacity="0.30196078"
       color="#0099e5"
       opacity="0.14901961"
       empspacing="2"
       dotted="false"
       gridanglex="30"
       gridanglez="30"
       visible="true" />
  </sodipodi:namedview>
  <path
     d="m14.537109 6.4848903-1.492187 1.9335937a5 5 0 0 1 0.455078 2.082031 5 5 0 0 1-0.166016 1.208985l2.185547 0.544922a7.25 7.25 0 0 0 0.230469-1.753907 7.25 7.25 0 0 0-1.212891-4.0156247z"
     fill="#fa0302"
     stroke-linecap="round"
     stroke-linejoin="round"
     stroke-width=".8"
     id="path1" />
  <path
     d="m8.5 3.2505153a7.25 7.25 0 0 0-7.25 7.2499997 7.25 7.25 0 0 0 0.2304687 1.753907l2.1855469-0.544922a5 5 0 0 1-0.1660156-1.208985 5 5 0 0 1 5-4.9999997 5 5 0 0 1 2.082031 0.4550781l1.933594-1.4921875a7.25 7.25 0 0 0-4.015625-1.2128906z"
     fill="#2a7efe"
     stroke-linecap="round"
     stroke-linejoin="round"
     stroke-width=".8"
     id="path2" />
  <g
     transform="matrix(1.1538463 0 0 1.1538463 -.7307704 1.2690535)"
     stroke-width=".866667"
     id="g3">
    <path
       d="m12.56102 3.030383-5.2618949 4.0570559c-0.2835446 0.2186203-0.4525373 0.5546745-0.4529711 0.9127141-7.72e-4 0.6372507 0.516595 1.1546179 1.153846 1.153846 0.3580399-4.338e-4 0.6940895-0.1694296 0.9127102-0.4529746l4.0570588-5.2618926c0.208567-0.2705061-0.138243-0.6173161-0.408749-0.4087488z"
       fill="#ff7f00"
       id="path3" />
    <circle
       cx="8"
       cy="8.0001526"
       r=".57692301"
       fill="#008080"
       id="circle3" />
  </g>
  <g
     transform="matrix(1.1538463 0 0 1.1538463 -.7307704 1.2690535)"
     fill="#f2f2f2"
     stroke-width=".866667"
     id="g4">
    <circle
       cx="8"
       cy="8.0001526"
       r=".57692301"
       fill="#f2f2f2"
       id="circle4" />
  </g>
</svg>
