<?xml version="1.0" encoding="UTF-8" standalone="no"?>
<svg
   width="48"
   height="48"
   version="1.1"
   viewBox="0 0 48 48"
   id="svg3"
   sodipodi:docname="tstatictext_200.svg"
   inkscape:export-filename="tstatictext_200.png"
   inkscape:export-xdpi="96"
   inkscape:export-ydpi="96"
   inkscape:version="1.3.2 (091e20e, 2023-11-25, custom)"
   xmlns:inkscape="http://www.inkscape.org/namespaces/inkscape"
   xmlns:sodipodi="http://sodipodi.sourceforge.net/DTD/sodipodi-0.dtd"
   xmlns="http://www.w3.org/2000/svg"
   xmlns:svg="http://www.w3.org/2000/svg">
  <defs
     id="defs3" />
  <sodipodi:namedview
     id="namedview3"
     pagecolor="#ffffff"
     bordercolor="#000000"
     borderopacity="0.25"
     inkscape:showpageshadow="2"
     inkscape:pageopacity="0.0"
     inkscape:pagecheckerboard="0"
     inkscape:deskcolor="#d1d1d1"
     showgrid="true"
     inkscape:current-layer="svg3">
    <inkscape:grid
       id="grid3"
       units="px"
       originx="0"
       originy="0"
       spacingx="0.5"
       spacingy="0.5"
       empcolor="#0099e5"
       empopacity="0.30196078"
       color="#0099e5"
       opacity="0.14901961"
       empspacing="2"
       dotted="false"
       gridanglex="30"
       gridanglez="30"
       visible="true" />
  </sodipodi:namedview>
  <rect
     x="3.5"
     y="12.5"
     width="41"
     height="23"
     fill="none"
     stroke="#2a7efe"
     stroke-linecap="round"
     stroke-linejoin="round"
     stroke-width="1.5"
     style="stroke-width:1;stroke-dasharray:none;paint-order:normal"
     id="rect1" />
  <path
     d="m17.2 24.794417h-3.36c-1.64904 0-2.24 1.1592-2.24 1.9922 0 1.3918 0.91902 2.4134 2.24 2.4134 1.094842 0 2.22986-0.6932 3.36-1.0042m0 1.0042v-5.488c0-2.428-1.240922-2.912-2.8-2.912-0.381972 0-1.14901 0.022-1.907506 0.5192"
     fill="none"
     stroke="#2a7efe"
     stroke-linecap="round"
     stroke-linejoin="round"
     stroke-width="1.6"
     id="path1" />
  <path
     d="m24.187924 20.800017h2e-6c1.5512 0 2.8 1.2488 2.8 2.8v2.8c0 1.5512-1.2488 2.8-2.8 2.8h-2e-6c-1.5512 0-2.8-1.2488-2.8-2.8v-2.8c0-1.5512 1.2488-2.8 2.8-2.8zm-2.8-3.36v11.76"
     fill="none"
     stroke="#2a7efe"
     stroke-linecap="round"
     stroke-linejoin="round"
     stroke-width="1.6"
     id="path2" />
  <path
     d="m 35.854212,21.934817 c -0.509086,-0.6892 -1.327708,-1.1348 -2.254208,-1.1348 h -2e-6 c -1.5512,0 -2.800002,1.2488 -2.800002,2.8 l 0.0013,2.8 c 0,1.5512 1.2488,2.8 2.8,2.8 h 4e-6 c 0.9265,0 1.745122,-0.4456 2.25421,-1.1348"
     fill="none"
     stroke="#2a7efe"
     stroke-linecap="round"
     stroke-linejoin="round"
     stroke-width="1.6"
     id="path3" />
</svg>
