<?xml version="1.0" encoding="UTF-8" standalone="no"?>
<svg
   width="32"
   height="32"
   viewBox="0 0 32 32"
   version="1.1"
   id="svg1"
   sodipodi:docname="tag_nbsp_200.svg"
   inkscape:version="1.3.2 (091e20e, 2023-11-25, custom)"
   inkscape:export-filename="tag_nbsp_200.png"
   inkscape:export-xdpi="96"
   inkscape:export-ydpi="96"
   xmlns:inkscape="http://www.inkscape.org/namespaces/inkscape"
   xmlns:sodipodi="http://sodipodi.sourceforge.net/DTD/sodipodi-0.dtd"
   xmlns="http://www.w3.org/2000/svg"
   xmlns:svg="http://www.w3.org/2000/svg">
  <defs
     id="defs1" />
  <sodipodi:namedview
     id="namedview1"
     pagecolor="#ffffff"
     bordercolor="#000000"
     borderopacity="0.25"
     inkscape:showpageshadow="2"
     inkscape:pageopacity="0.0"
     inkscape:pagecheckerboard="0"
     inkscape:deskcolor="#d1d1d1"
     showgrid="true"
     inkscape:current-layer="svg1">
    <inkscape:grid
       id="grid1"
       units="px"
       originx="0"
       originy="0"
       spacingx="0.5"
       spacingy="0.5"
       empcolor="#0099e5"
       empopacity="0.30196078"
       color="#0099e5"
       opacity="0.14901961"
       empspacing="2"
       dotted="false"
       gridanglex="30"
       gridanglez="30"
       visible="true" />
  </sodipodi:namedview>
  <path
     d="m 5.5000024,12.399985 v 11.999997 m 0,-7.699997 c 0,-2.3822 1.8401805,-4.3 4.1259685,-4.3 2.2858031,0 3.8740321,1.9178 3.8740321,4.3 v 7.699997"
     fill="none"
     stroke="#008dd2"
     stroke-linecap="round"
     stroke-linejoin="round"
     stroke-width="3.20001"
     id="path1" />
  <path
     d="m 23.600005,12.4 v 0 c 2.216002,0 4.000004,1.784001 4.000004,3.999999 v 4 c 0,2.216001 -1.784002,3.999999 -4.000004,3.999999 v 0 c -2.216002,0 -4.000003,-1.783998 -4.000003,-3.999999 v -4 C 19.600002,14.184001 21.384003,12.4 23.600005,12.4 Z M 19.600002,7.6000024 V 24.399998"
     fill="none"
     stroke="#008dd2"
     stroke-linecap="round"
     stroke-linejoin="round"
     stroke-width="3.20001"
     id="path2" />
</svg>
