<?xml version="1.0" encoding="UTF-8" standalone="no"?>
<svg
   height="24"
   width="24"
   version="1.1"
   id="svg291"
   sodipodi:docname="menu_goto_bookmark0_150.svg"
   inkscape:export-filename="menu_goto_bookmark0_150.png"
   inkscape:export-xdpi="96"
   inkscape:export-ydpi="96"
   inkscape:version="1.2.2 (732a01da63, 2022-12-09)"
   xmlns:inkscape="http://www.inkscape.org/namespaces/inkscape"
   xmlns:sodipodi="http://sodipodi.sourceforge.net/DTD/sodipodi-0.dtd"
   xmlns="http://www.w3.org/2000/svg"
   xmlns:svg="http://www.w3.org/2000/svg">
  <defs
     id="defs295" />
  <sodipodi:namedview
     id="namedview293"
     pagecolor="#ffffff"
     bordercolor="#666666"
     borderopacity="1.0"
     inkscape:showpageshadow="2"
     inkscape:pageopacity="0.0"
     inkscape:pagecheckerboard="0"
     inkscape:deskcolor="#d1d1d1"
     showgrid="true"
     inkscape:zoom="38.25"
     inkscape:cx="11.986928"
     inkscape:cy="12"
     inkscape:current-layer="svg291">
    <inkscape:grid
       type="xygrid"
       id="grid1406" />
  </sodipodi:namedview>
  <radialGradient
     id="a"
     cx="10.5"
     cy="12"
     gradientUnits="userSpaceOnUse"
     r="6">
    <stop
       offset="0"
       stop-color="#2a7fff"
       id="stop278" />
    <stop
       offset=".69999999"
       stop-color="#4d94ff"
       id="stop280" />
    <stop
       offset="1"
       stop-color="#96bdff"
       id="stop282" />
  </radialGradient>
  <g
     stroke-width=".666667"
     transform="matrix(1.5 0 0 1.5 -3.75 -6.5)"
     id="g289">
    <circle
       cx="10.5"
       cy="12"
       fill="url(#a)"
       r="6"
       id="circle285" />
    <path
       d="m10.5 15.630371c-.6461484.015039-1.3604355-.205579-1.7134428-.785169-.3501991-.526979-.3144669-1.175455-.3129244-1.780237.0028154-.951445-.0057697-1.903084.004549-2.854402.0136248-.6603567.3435728-1.3513565.9678173-1.6330331.6010259-.2661684 1.3066899-.2690366 1.9292449-.0760651.641547.2008802 1.064643.8317812 1.126356 1.4847228.04646.5640884.01601 1.1315294.02477 1.6972184-.0044.720953.0095 1.442334-.0081 2.162984-.02622.65799-.376001 1.339501-1.008191 1.598072-.316668.139298-.666501.185629-1.010079.185909zm0-.947266c.390968.02238.826272-.163903.949936-.562762.129116-.39417.0645-.814121.08034-1.221683-.0025-.879313.005-1.758823-.0039-2.63801-.0032-.4017219-.24727-.8282575-.667037-.9046167-.436176-.094981-1.0140364-.047501-1.2495427.391159-.208128.3976457-.1212801.8569867-.1400757 1.2876257.00249.901513-.00504 1.803222.00389 2.704608.00661.382962.2185622.79859.6172944.891341.132583.03875.271355.05221.409088.05234z"
       fill="#fff"
       id="path287" />
  </g>
</svg>
