<?xml version="1.0" encoding="UTF-8" standalone="no"?>
<svg
   width="48"
   height="48"
   version="1.1"
   viewBox="0 0 48 48"
   id="svg6"
   sodipodi:docname="tfloatspinedit_200.svg"
   inkscape:export-filename="tfloatspinedit_200.png"
   inkscape:export-xdpi="96"
   inkscape:export-ydpi="96"
   inkscape:version="1.3.2 (091e20e, 2023-11-25, custom)"
   xmlns:inkscape="http://www.inkscape.org/namespaces/inkscape"
   xmlns:sodipodi="http://sodipodi.sourceforge.net/DTD/sodipodi-0.dtd"
   xmlns="http://www.w3.org/2000/svg"
   xmlns:svg="http://www.w3.org/2000/svg">
  <defs
     id="defs6" />
  <sodipodi:namedview
     id="namedview6"
     pagecolor="#ffffff"
     bordercolor="#000000"
     borderopacity="0.25"
     inkscape:showpageshadow="2"
     inkscape:pageopacity="0.0"
     inkscape:pagecheckerboard="0"
     inkscape:deskcolor="#d1d1d1"
     showgrid="true"
     inkscape:current-layer="svg6">
    <inkscape:grid
       id="grid6"
       units="px"
       originx="0"
       originy="0"
       spacingx="0.5"
       spacingy="0.5"
       empcolor="#0099e5"
       empopacity="0.30196078"
       color="#0099e5"
       opacity="0.14901961"
       empspacing="2"
       dotted="false"
       gridanglex="30"
       gridanglez="30"
       visible="true" />
  </sodipodi:namedview>
  <rect
     x="1.4999999"
     y="11.499983"
     width="27"
     height="23.000019"
     fill="#ffffff"
     stroke="#2a7efe"
     stroke-linecap="round"
     stroke-linejoin="round"
     stroke-width="0.999994"
     style="paint-order:normal"
     id="rect1" />
  <rect
     x="31.5"
     y="11.499983"
     width="15"
     height="10.000017"
     fill="#ffffff"
     stroke="#2a7efe"
     stroke-linecap="round"
     stroke-linejoin="round"
     style="paint-order:normal"
     id="rect2" />
  <path
     d="m 39,15 -3,3 h 6 z"
     fill="#666666"
     fill-rule="evenodd"
     stroke="#666666"
     stroke-linejoin="round"
     stroke-width="2px"
     id="path2" />
  <rect
     transform="scale(1,-1)"
     x="31.5"
     y="-34.499737"
     width="15"
     height="9.9997387"
     fill="#ffffff"
     stroke="#2a7efe"
     stroke-linecap="round"
     stroke-linejoin="round"
     stroke-width="0.999998"
     style="paint-order:normal"
     id="rect3" />
  <path
     d="m 39,31 -3,-3 h 6 z"
     fill="#666666"
     fill-rule="evenodd"
     stroke="#666666"
     stroke-linejoin="round"
     stroke-width="2px"
     id="path3" />
  <path
     d="M 11.210634,28.2 V 17.8 L 8.127,19.7811"
     fill="none"
     stroke="#4d4d4d"
     stroke-linecap="round"
     stroke-linejoin="round"
     stroke-width="1.6"
     id="path4" />
  <path
     d="m 20.699994,17.8 -3.39954,6.2426 m -0.30082,1.186 c 0,-1.3676 1.104471,-2.4762 2.466907,-2.4762 1.362436,0 2.466907,1.1086 2.466907,2.4762 v 0.4952 c 0,1.3676 -1.104471,2.4762 -2.466907,2.4762 -1.362436,0 -2.466907,-1.1086 -2.466907,-2.4762 z"
     fill="none"
     stroke="#4d4d4d"
     stroke-linecap="round"
     stroke-linejoin="round"
     stroke-width="1.6"
     id="path5" />
  <path
     d="m 14.5,27.5 v 1.3"
     fill="#4d4d4d"
     stroke="#4d4d4d"
     stroke-linecap="round"
     stroke-width="1.8"
     id="path6" />
</svg>
