<?xml version="1.0" encoding="UTF-8" standalone="no"?>
<svg
   width="32"
   height="32"
   version="1.1"
   id="svg333"
   sodipodi:docname="menu_search_replace_200.svg"
   inkscape:export-filename="menu_search_replace_200.png"
   inkscape:export-xdpi="96"
   inkscape:export-ydpi="96"
   inkscape:version="1.2.2 (732a01da63, 2022-12-09)"
   xmlns:inkscape="http://www.inkscape.org/namespaces/inkscape"
   xmlns:sodipodi="http://sodipodi.sourceforge.net/DTD/sodipodi-0.dtd"
   xmlns="http://www.w3.org/2000/svg"
   xmlns:svg="http://www.w3.org/2000/svg">
  <sodipodi:namedview
     id="namedview335"
     pagecolor="#ffffff"
     bordercolor="#666666"
     borderopacity="1.0"
     inkscape:showpageshadow="2"
     inkscape:pageopacity="0.0"
     inkscape:pagecheckerboard="0"
     inkscape:deskcolor="#d1d1d1"
     showgrid="true"
     inkscape:zoom="28.6875"
     inkscape:cx="15.982571"
     inkscape:cy="16"
     inkscape:current-layer="svg333">
    <inkscape:grid
       type="xygrid"
       id="grid558" />
  </sodipodi:namedview>
  <defs
     id="defs311">
    <radialGradient
       id="a-9-2"
       cx="5.9886"
       cy="7.2881"
       r="3.75"
       gradientTransform="matrix(-1.7073e-7 1.0569 -.97561 -1.5244e-7 14.196 .14615)"
       gradientUnits="userSpaceOnUse">
      <stop
         stop-color="#f8fbff"
         offset="0"
         id="stop304" />
      <stop
         stop-color="#d1e3ff"
         offset=".66667"
         id="stop306" />
      <stop
         stop-color="#f8fbff"
         offset="1"
         id="stop308" />
    </radialGradient>
  </defs>
  <g
     transform="matrix(2,0,0,2,-10,-17)"
     stroke-linecap="round"
     id="g331">
    <g
       transform="translate(5.5,8)"
       id="g317">
      <path
         d="m11 11 3.5 3.5"
         fill="none"
         stroke="#d4aa00"
         stroke-width="2"
         id="path313" />
      <circle
         cx="8"
         cy="8"
         r="3.125"
         fill="url(#a-9-2)"
         fill-rule="evenodd"
         stroke="#2a7fff"
         stroke-linejoin="round"
         stroke-width=".75"
         id="circle315" />
    </g>
    <g
       transform="matrix(0,1,1,0,7,8.3)"
       fill="none"
       stroke="#00cc00"
       id="g323">
      <path
         d="m1 11.8 1.7 1.7 1.7-1.7"
         stroke-linejoin="round"
         id="path319" />
      <path
         d="m2.7 13.5v-6.5"
         id="path321" />
    </g>
    <g
       transform="rotate(90 .85 19.15)"
       fill="none"
       stroke="#f00"
       id="g329">
      <path
         d="m1 11.8 1.7 1.7 1.7-1.7"
         stroke-linejoin="round"
         id="path325" />
      <path
         d="m2.7 13.5v-6.5"
         id="path327" />
    </g>
  </g>
</svg>
