<?xml version="1.0" encoding="UTF-8" standalone="no"?>
<svg
   height="36"
   width="36"
   version="1.1"
   id="svg18"
   sodipodi:docname="Forward_02_36.svg"
   inkscape:version="1.2-beta (1b65182ce9, 2022-04-05)"
   inkscape:export-filename="Forward_02_36.png"
   inkscape:export-xdpi="96"
   inkscape:export-ydpi="96"
   xmlns:inkscape="http://www.inkscape.org/namespaces/inkscape"
   xmlns:sodipodi="http://sodipodi.sourceforge.net/DTD/sodipodi-0.dtd"
   xmlns="http://www.w3.org/2000/svg"
   xmlns:svg="http://www.w3.org/2000/svg">
  <defs
     id="defs22" />
  <sodipodi:namedview
     id="namedview20"
     pagecolor="#ffffff"
     bordercolor="#666666"
     borderopacity="1.0"
     inkscape:pageshadow="2"
     inkscape:pageopacity="0.0"
     inkscape:pagecheckerboard="0"
     inkscape:deskcolor="#d1d1d1"
     showgrid="true"
     inkscape:zoom="25.5"
     inkscape:cx="17.411765"
     inkscape:cy="18"
     inkscape:current-layer="g1349">
    <inkscape:grid
       type="xygrid"
       id="grid147"
       originx="0"
       originy="0" />
  </sodipodi:namedview>
  <g
     id="g1349"
     transform="matrix(2.25,0,0,2.25,0.225,0)">
    <g
       id="g1977"
       transform="matrix(-1,0,0,1,16,0)">
      <circle
         style="fill:none;stroke:#00aad4;stroke-linecap:round;stroke-linejoin:round;stroke-dashoffset:1.49998"
         id="path355"
         cx="-8"
         cy="8"
         r="7"
         transform="scale(-1,1)" />
      <path
         style="fill:#00aad4;fill-opacity:1;stroke:#00aad4;stroke-width:1px;stroke-linecap:round;stroke-linejoin:round;stroke-opacity:1"
         d="M 10.499993,5.5 7.5,8 l 2.999993,2.5 z"
         id="path966"
         sodipodi:nodetypes="cccc" />
      <path
         style="fill:none;stroke:#00aad4;stroke-width:1px;stroke-linecap:round;stroke-linejoin:miter;stroke-opacity:1"
         d="m 5.6222222,5.5 v 5"
         id="path444" />
    </g>
  </g>
</svg>
