<?xml version="1.0" encoding="UTF-8" standalone="no"?>
<svg
   height="32"
   viewBox="0 0 8.4666664 8.4666671"
   width="32"
   version="1.1"
   id="svg159"
   sodipodi:docname="Chart_09_32.svg"
   inkscape:export-filename="Chart_09_32.png"
   inkscape:export-xdpi="96"
   inkscape:export-ydpi="96"
   inkscape:version="1.2 (dc2aedaf03, 2022-05-15)"
   xmlns:inkscape="http://www.inkscape.org/namespaces/inkscape"
   xmlns:sodipodi="http://sodipodi.sourceforge.net/DTD/sodipodi-0.dtd"
   xmlns:xlink="http://www.w3.org/1999/xlink"
   xmlns="http://www.w3.org/2000/svg"
   xmlns:svg="http://www.w3.org/2000/svg">
  <defs
     id="defs163">
    <linearGradient
       inkscape:collect="always"
       id="linearGradient5087">
      <stop
         style="stop-color:#ffffff;stop-opacity:1"
         offset="0"
         id="stop5085" />
      <stop
         style="stop-color:#ffd42a;stop-opacity:1;"
         offset="1"
         id="stop5083" />
    </linearGradient>
    <linearGradient
       inkscape:collect="always"
       id="linearGradient5077">
      <stop
         style="stop-color:#ffffff;stop-opacity:1"
         offset="0"
         id="stop5075" />
      <stop
         style="stop-color:#ff5555;stop-opacity:1;"
         offset="1"
         id="stop5073" />
    </linearGradient>
    <linearGradient
       inkscape:collect="always"
       id="linearGradient5067">
      <stop
         style="stop-color:#ffffff;stop-opacity:1"
         offset="0"
         id="stop5065" />
      <stop
         style="stop-color:#87decd;stop-opacity:1;"
         offset="1"
         id="stop5063" />
    </linearGradient>
    <linearGradient
       inkscape:collect="always"
       xlink:href="#linearGradient5067"
       id="linearGradient5069"
       x1="1.058334"
       y1="5.8208331"
       x2="3.1750004"
       y2="5.8208331"
       gradientUnits="userSpaceOnUse" />
    <linearGradient
       inkscape:collect="always"
       xlink:href="#linearGradient5077"
       id="linearGradient5079"
       x1="3.1750004"
       y1="5.0270832"
       x2="5.2916671"
       y2="5.0270832"
       gradientUnits="userSpaceOnUse" />
    <linearGradient
       inkscape:collect="always"
       xlink:href="#linearGradient5087"
       id="linearGradient5089"
       x1="5.2916675"
       y1="4.2333333"
       x2="7.4083342"
       y2="4.2333333"
       gradientUnits="userSpaceOnUse" />
    <radialGradient
       id="a"
       cx="-11.5"
       cy="8.5"
       gradientTransform="rotate(90,-11.5,8.5)"
       gradientUnits="userSpaceOnUse"
       r="3.5">
      <stop
         offset="0"
         stop-color="#fff"
         id="stop1104" />
      <stop
         offset="1"
         stop-color="#d5e5ff"
         id="stop1106" />
    </radialGradient>
  </defs>
  <sodipodi:namedview
     id="namedview161"
     pagecolor="#ffffff"
     bordercolor="#666666"
     borderopacity="1.0"
     inkscape:showpageshadow="2"
     inkscape:pageopacity="0.0"
     inkscape:pagecheckerboard="0"
     inkscape:deskcolor="#d1d1d1"
     showgrid="true"
     inkscape:zoom="28.6875"
     inkscape:cx="14.239651"
     inkscape:cy="16"
     inkscape:current-layer="svg159">
    <inkscape:grid
       type="xygrid"
       id="grid5456" />
  </sodipodi:namedview>
  <path
     d="M 3.0427084,3.3072918 H 1.190626 v 5.0270826 h 1.8520824 z"
     fill="#87decd"
     stroke="#5fd3bc"
     id="path145"
     style="stroke-width:0.264584;stroke-linecap:round;stroke-dashoffset:1.49998;fill-opacity:1;fill:url(#linearGradient5069)" />
  <path
     d="M 7.2760422,0.13229197 H 5.4239595 V 8.3343746 h 1.8520827 z"
     fill="#ffd42a"
     stroke="#ffcc00"
     id="path147"
     style="stroke-width:0.264584;stroke-linecap:round;stroke-dashoffset:1.49998;fill-opacity:1;fill:url(#linearGradient5089)" />
  <path
     d="M 5.1593751,1.7197919 H 3.3072924 v 6.6145825 h 1.8520827 z"
     fill="#ff5555"
     stroke="#ff5252"
     id="path149"
     style="stroke-width:0.264584;stroke-linecap:round;stroke-dashoffset:1.49998;fill-opacity:1;fill:url(#linearGradient5079)" />
  <g
     stroke-linecap="round"
     transform="matrix(0.48106061,0,0,0.48106061,10.39091,0.76969701)"
     id="g1119">
    <g
       fill="none"
       id="g1115">
      <circle
         cx="-10.75"
         cy="9.25"
         r="3.875"
         stroke="#ffffff"
         stroke-linejoin="round"
         stroke-width="0.75"
         id="circle1109" />
      <path
         d="M -8.8692311,11.130769 -5.5000004,14.5"
         stroke="#ffffff"
         stroke-width="3"
         id="path1111" />
      <path
         d="M -8.8692311,11.130769 -5.5000004,14.5"
         stroke="#a05a2c"
         stroke-width="1.5"
         id="path1113" />
    </g>
    <circle
       cx="-10.75"
       cy="9.25"
       fill="url(#a)"
       fill-rule="evenodd"
       r="3.125"
       stroke="#dd8703"
       stroke-linejoin="round"
       stroke-width="0.75"
       id="circle1117"
       style="fill:url(#a)" />
  </g>
</svg>
