<svg width="24" height="24" version="1.0" xmlns="http://www.w3.org/2000/svg">
 <defs>
  <linearGradient id="b" x1="11" x2="21" y1="25.75" y2="25.75" gradientTransform="scale(.75)" gradientUnits="userSpaceOnUse">
   <stop stop-color="#999999" offset="0"/>
   <stop stop-color="#ffffff" offset=".4"/>
   <stop stop-color="#999999" offset="1"/>
  </linearGradient>
  <radialGradient id="a" cx="8.25" cy="3.675" r="4.5" gradientTransform="matrix(-1.6666665,1.6666666,-1.6666665,-1.6666665,31.125,-1.625)" gradientUnits="userSpaceOnUse">
   <stop stop-color="#ffffff" offset="0"/>
   <stop stop-color="#ffffff" offset=".2"/>
   <stop stop-color="#9fc0df" offset="1"/>
  </radialGradient>
 </defs>
 <path d="m12 0.375c-3.520812 3e-7 -6.375 2.8541882-6.375 6.375 0 2.115325 0.4499713 2.946011 1.2978516 4.356223 1.6957674 2.820437 1.7021484 2.018555 1.7021484 5.018555h6.75c0-3 0.02691-2.198122 1.722657-5.018555 0.847873-1.410217 1.277343-2.240898 1.277343-4.356223 0-3.5208118-2.854188-6.3749997-6.375-6.375z" fill="url(#a)" fill-rule="evenodd" stroke="#9fc0df" stroke-width=".75px"/>
 <path d="m9.75 22.125h4.5l-1.5 1.875h-1.5z" fill="#333333" fill-rule="evenodd" stroke-width="1.5" style="paint-order:normal"/>
 <path d="m8.625 16.125h6.75v4.5c0 0.828428-0.671573 1.5-1.5 1.5h-3.75c-0.828428 0-1.5-0.671572-1.5-1.5z" fill="url(#b)" stroke="#999999" stroke-width=".75"/>
</svg>
