<?xml version="1.0" encoding="UTF-8" standalone="no"?>
<svg
   width="32"
   height="32"
   version="1.0"
   id="svg237"
   sodipodi:docname="menu_delpkg_to_lazpkg_200.svg"
   inkscape:export-filename="menu_delpkg_to_lazpkg_200.png"
   inkscape:export-xdpi="96"
   inkscape:export-ydpi="96"
   inkscape:version="1.2.1 (9c6d41e410, 2022-07-14)"
   xmlns:inkscape="http://www.inkscape.org/namespaces/inkscape"
   xmlns:sodipodi="http://sodipodi.sourceforge.net/DTD/sodipodi-0.dtd"
   xmlns:xlink="http://www.w3.org/1999/xlink"
   xmlns="http://www.w3.org/2000/svg"
   xmlns:svg="http://www.w3.org/2000/svg">
  <sodipodi:namedview
     id="namedview239"
     pagecolor="#ffffff"
     bordercolor="#666666"
     borderopacity="1.0"
     inkscape:showpageshadow="2"
     inkscape:pageopacity="0.0"
     inkscape:pagecheckerboard="0"
     inkscape:deskcolor="#d1d1d1"
     showgrid="true"
     inkscape:zoom="28.6875"
     inkscape:cx="16"
     inkscape:cy="16"
     inkscape:current-layer="svg237">
    <inkscape:grid
       type="xygrid"
       id="grid671" />
  </sodipodi:namedview>
  <defs
     id="defs195">
    <linearGradient
       id="linearGradient1347"
       x1="8.837"
       x2="15.576"
       y1="7.8054"
       y2="10.838"
       gradientTransform="matrix(1.4839 0 0 1.4839 -.1129 24.918)"
       gradientUnits="userSpaceOnUse"
       xlink:href="#linearGradient933-3" />
    <linearGradient
       id="linearGradient933-3">
      <stop
         stop-color="#ffe991"
         offset="0"
         id="stop184" />
      <stop
         stop-color="#f5c400"
         offset="1"
         id="stop186" />
    </linearGradient>
    <linearGradient
       id="linearGradient1351"
       x1="8.837"
       x2="15.576"
       y1="7.8013"
       y2="10.834"
       gradientTransform="matrix(-1.4839,0,0,1.4839,25.113,24.924)"
       gradientUnits="userSpaceOnUse"
       xlink:href="#linearGradient933-3" />
    <linearGradient
       id="linearGradient1355"
       x1="1.4239"
       x2="15.576"
       y1="4.4317"
       y2="4.4317"
       gradientTransform="matrix(-1.4839,0,0,1.4839,25.113,24.924)"
       gradientUnits="userSpaceOnUse">
      <stop
         stop-color="#ffe478"
         offset="0"
         id="stop190" />
      <stop
         stop-color="#fff2c0"
         offset="1"
         id="stop192" />
    </linearGradient>
  </defs>
  <path
     id="rect197"
     d="M 0,0 V 18 H 8 V 14.988281 L 20,9.5332031 V 0 Z"
     style="fill:#e60000;fill-opacity:1"
     sodipodi:nodetypes="ccccccc" />
  <g
     transform="matrix(2,0,0,2,1,0)"
     stroke="#ffffff"
     id="g213">
    <path
       d="M 7.5001,3.5 4.5,1.5 1.4999,3.5 Z"
       fill="#ffffff"
       fill-rule="evenodd"
       stroke-linejoin="round"
       id="path199" />
    <g
       fill="none"
       id="g211">
      <g
         stroke-width="1px"
         id="g207">
        <path
           d="M 2.5,4 V 7.5"
           id="path201" />
        <path
           d="M 4.5,4 V 7.5"
           id="path203" />
        <path
           d="M 6.5,4 V 7.5"
           id="path205" />
      </g>
      <path
         d="m 0.5,7.5 h 8"
         id="path209" />
    </g>
  </g>
  <g
     transform="translate(8 -15.5)"
     id="g235">
    <g
       stroke="#ca0"
       stroke-linejoin="round"
       id="g223">
      <path
         d="m12.5 36.789 11-5.2887v9.5l-11 6z"
         fill="url(#linearGradient1347)"
         id="path217" />
      <path
         d="m12.5 36.5-11-5v9.5l11 6z"
         fill="url(#linearGradient1351)"
         id="path219" />
      <path
         d="m12.5 26.5-11 5 11 5 11-5z"
         fill="url(#linearGradient1355)"
         id="path221" />
    </g>
    <g
       fill="none"
       stroke="#5f8dd3"
       stroke-linecap="round"
       id="g233">
      <path
         d="m7.4 28.9 11.1 5.1"
         id="path225" />
      <path
         d="m6.5 34 11.1-5.1"
         id="path227" />
      <path
         d="m6.5 34v9.7"
         id="path229" />
      <path
         d="m18.5 34v9.7"
         id="path231" />
    </g>
  </g>
</svg>
