<?xml version="1.0" encoding="UTF-8" standalone="no"?>
<svg
   height="48"
   width="48"
   version="1.1"
   id="svg14"
   sodipodi:docname="Time_11_48.svg"
   inkscape:export-filename="Time_11_48.png"
   inkscape:export-xdpi="96"
   inkscape:export-ydpi="96"
   inkscape:version="1.2.1 (9c6d41e410, 2022-07-14)"
   xmlns:inkscape="http://www.inkscape.org/namespaces/inkscape"
   xmlns:sodipodi="http://sodipodi.sourceforge.net/DTD/sodipodi-0.dtd"
   xmlns="http://www.w3.org/2000/svg"
   xmlns:svg="http://www.w3.org/2000/svg">
  <defs
     id="defs18" />
  <sodipodi:namedview
     id="namedview16"
     pagecolor="#ffffff"
     bordercolor="#666666"
     borderopacity="1.0"
     inkscape:pageshadow="2"
     inkscape:pageopacity="0.0"
     inkscape:pagecheckerboard="0"
     inkscape:deskcolor="#d1d1d1"
     showgrid="true"
     inkscape:zoom="19.125"
     inkscape:cx="22.117647"
     inkscape:cy="24"
     inkscape:current-layer="svg14"
     inkscape:showpageshadow="2">
    <inkscape:grid
       type="xygrid"
       id="grid143" />
  </sodipodi:namedview>
  <path
     d="M 5,1 H 43 V 46.999999 H 5 Z"
     fill="#ffffff"
     stroke="#3771c8"
     stroke-linecap="round"
     id="path2"
     style="fill:none;stroke:#00aad4;stroke-width:2;stroke-dasharray:none;stroke-opacity:1" />
  <path
     d="M 4,0 H 44 V 12 H 4 Z"
     fill="#d40000"
     id="path4"
     style="stroke-width:2;fill:#00aad4;fill-opacity:1;stroke:none" />
  <g
     id="g1583"
     transform="translate(0,0.999594)"
     style="fill:#ff7f2a;fill-opacity:1;stroke:none">
    <path
       d="M 12.339844,33.932983 H 16.20703 V 20.44183 L 12,21.294578 v -2.179424 l 4.183594,-0.852748 h 2.367187 v 15.670577 h 3.867186 v 2.013539 H 12.339844 Z"
       id="path6"
       style="stroke-width:2;fill:#ff7f2a;fill-opacity:1;stroke:none" />
    <path
       d="m 26.034279,18.262406 h 9.292969 v 2.013539 h -7.124999 v 4.335121 q 0.515625,-0.176944 1.03125,-0.26059 0.515625,-0.0945 1.031251,-0.0945 2.929687,0 4.640625,1.622855 1.710936,1.622654 1.710936,4.394236 0,2.854625 -1.757813,4.441891 -1.757813,1.575402 -4.95703,1.575402 -1.101562,0 -2.25,-0.189008 Q 26.514749,35.912344 25.296,35.532719 v -2.404423 q 1.054687,0.580496 2.179687,0.864611 1.124999,0.284316 2.378906,0.284316 2.027343,0 3.210937,-1.077748 1.183593,-1.077949 1.183593,-2.925804 0,-1.847655 -1.183593,-2.925604 -1.183594,-1.077949 -3.210937,-1.077949 -0.949218,0 -1.898439,0.213338 -0.937499,0.213137 -1.921875,0.663338 z"
       id="path8"
       style="stroke-width:2;fill:#ff7f2a;fill-opacity:1;stroke:none" />
  </g>
</svg>
