<?xml version="1.0" encoding="UTF-8" standalone="no"?>
<svg
   width="36"
   height="36"
   viewBox="0 0 36 36"
   version="1.1"
   id="svg1"
   sodipodi:docname="Bug_03_36.svg"
   inkscape:version="1.3.2 (091e20e, 2023-11-25, custom)"
   inkscape:export-filename="Bug_03_36.png"
   inkscape:export-xdpi="96"
   inkscape:export-ydpi="96"
   xmlns:inkscape="http://www.inkscape.org/namespaces/inkscape"
   xmlns:sodipodi="http://sodipodi.sourceforge.net/DTD/sodipodi-0.dtd"
   xmlns="http://www.w3.org/2000/svg"
   xmlns:svg="http://www.w3.org/2000/svg">
  <defs
     id="defs1">
    <linearGradient
       id="a"
       x1="22.825163"
       x2="22.822721"
       y1="6.2446866"
       y2="15.028725"
       gradientTransform="matrix(2.0485149,5.689381e-4,5.6901766e-4,2.0491715,-27.073737,0.565081)"
       gradientUnits="userSpaceOnUse">
      <stop
         stop-color="#89a02c"
         offset="0"
         id="stop1" />
      <stop
         stop-color="#445016"
         offset="1"
         id="stop2" />
    </linearGradient>
    <radialGradient
       id="c"
       cx="-9"
       cy="10.699678"
       r="5.9492188"
       gradientTransform="matrix(1.125,0,0,0.80367694,28.125,3.650416)"
       gradientUnits="userSpaceOnUse">
      <stop
         stop-color="#803300"
         offset="0"
         id="stop3" />
      <stop
         stop-color="#d45500"
         offset="1"
         id="stop4" />
    </radialGradient>
    <linearGradient
       id="b"
       x1="-3"
       x2="-3"
       y1="28"
       y2="4"
       gradientTransform="matrix(1.125,0,0,1.125,21.375,0.9995)"
       gradientUnits="userSpaceOnUse">
      <stop
         stop-color="#668000"
         offset="0"
         id="stop5" />
      <stop
         stop-color="#aad400"
         offset="1"
         id="stop6" />
    </linearGradient>
  </defs>
  <sodipodi:namedview
     id="namedview1"
     pagecolor="#ffffff"
     bordercolor="#000000"
     borderopacity="0.25"
     inkscape:showpageshadow="2"
     inkscape:pageopacity="0.0"
     inkscape:pagecheckerboard="0"
     inkscape:deskcolor="#d1d1d1"
     showgrid="true"
     inkscape:current-layer="svg1">
    <inkscape:grid
       id="grid1"
       units="px"
       originx="0"
       originy="0"
       spacingx="0.5"
       spacingy="0.5"
       empcolor="#0099e5"
       empopacity="0.30196078"
       color="#0099e5"
       opacity="0.14901961"
       empspacing="2"
       dotted="false"
       gridanglex="30"
       gridanglez="30"
       visible="true" />
  </sodipodi:namedview>
  <path
     d="M 20.25,8.312 23.0625,2.687"
     fill="none"
     stroke="#d4aa00"
     stroke-linecap="round"
     stroke-linejoin="round"
     id="path6"
     style="stroke-width:2.25" />
  <path
     d="M 15.75,8.312 12.9375,2.687"
     fill="none"
     stroke="#d4aa00"
     stroke-linecap="round"
     stroke-linejoin="round"
     id="path7"
     style="stroke-width:2.25" />
  <path
     d="m 6.75,8.8745 v 3.375 l 3.375,3.375"
     fill="none"
     stroke="#aca793"
     stroke-linecap="round"
     stroke-linejoin="round"
     id="path8"
     style="stroke-width:2.25" />
  <path
     d="m 6.75,31.3745 v -3.375 l 3.375,-3.375"
     fill="none"
     stroke="#aca793"
     stroke-linecap="round"
     stroke-linejoin="round"
     id="path9"
     style="stroke-width:2.25" />
  <path
     d="m 2.8125,22.3745 2.25,-2.25 6.1875,-1.125"
     fill="none"
     stroke="#aca793"
     stroke-linecap="round"
     stroke-linejoin="round"
     id="path10"
     style="stroke-width:2.25" />
  <path
     d="m 29.25,8.8745 v 3.375 l -3.375,3.375"
     fill="none"
     stroke="#aca793"
     stroke-linecap="round"
     stroke-linejoin="round"
     id="path11"
     style="stroke-width:2.25" />
  <path
     d="m 29.25,31.3745 v -3.375 l -3.375,-3.375"
     fill="none"
     stroke="#aca793"
     stroke-linecap="round"
     stroke-linejoin="round"
     id="path12"
     style="stroke-width:2.25" />
  <path
     d="m 33.1875,22.3745 -2.8125,-2.25 -5.625,-1.125"
     fill="none"
     stroke="#aca793"
     stroke-linecap="round"
     stroke-linejoin="round"
     id="path13"
     style="stroke-width:2.25" />
  <ellipse
     cx="18"
     cy="18.9995"
     rx="10.125"
     ry="13.5"
     fill="url(#b)"
     stroke-width="1.125"
     id="ellipse13"
     style="fill:url(#b)" />
  <path
     d="M 24.692872,8.8745 A 10.125,13.5 0 0 0 18,5.4995 10.125,13.5 0 0 0 11.30713,8.878894 L 18,15.062 24.688478,8.8745 Z"
     fill="url(#c)"
     stroke-linecap="round"
     stroke-linejoin="round"
     stroke-width="2.70002"
     id="path14"
     style="fill:url(#c)" />
  <path
     d="m 18,14.4995 v 16.875"
     fill="#c83737"
     stroke="url(#a)"
     stroke-linecap="round"
     stroke-linejoin="round"
     id="path15"
     style="stroke:url(#a);stroke-width:2.25" />
</svg>
