<?xml version="1.0" encoding="UTF-8" standalone="no"?>
<svg
   height="24"
   width="24"
   version="1.1"
   id="svg183"
   sodipodi:docname="menu_edit_breaklines_150.svg"
   inkscape:export-filename="menu_edit_breaklines_150.png"
   inkscape:export-xdpi="96"
   inkscape:export-ydpi="96"
   inkscape:version="1.2.1 (9c6d41e410, 2022-07-14)"
   xmlns:inkscape="http://www.inkscape.org/namespaces/inkscape"
   xmlns:sodipodi="http://sodipodi.sourceforge.net/DTD/sodipodi-0.dtd"
   xmlns="http://www.w3.org/2000/svg"
   xmlns:svg="http://www.w3.org/2000/svg">
  <defs
     id="defs187" />
  <sodipodi:namedview
     id="namedview185"
     pagecolor="#ffffff"
     bordercolor="#666666"
     borderopacity="1.0"
     inkscape:showpageshadow="2"
     inkscape:pageopacity="0.0"
     inkscape:pagecheckerboard="0"
     inkscape:deskcolor="#d1d1d1"
     showgrid="true"
     inkscape:zoom="38.25"
     inkscape:cx="11.986928"
     inkscape:cy="12"
     inkscape:current-layer="svg183">
    <inkscape:grid
       type="xygrid"
       id="grid578" />
  </sodipodi:namedview>
  <g
     fill="none"
     id="g181">
    <path
       d="m6.6 7.4h10.8"
       stroke="#2a7fff"
       stroke-linecap="round"
       stroke-linejoin="round"
       stroke-width="1.2"
       id="path157" />
    <path
       d="m17.5 3.6-11 3.6"
       stroke="#2a7fff"
       stroke-linecap="round"
       stroke-linejoin="round"
       stroke-width=".75"
       id="path159" />
    <path
       d="m6.6 3.4h10.8"
       stroke="#2a7fff"
       stroke-linecap="round"
       stroke-linejoin="round"
       stroke-width="1.2"
       id="path161" />
    <path
       d="m20.25 1v21"
       stroke="#d4aa00"
       stroke-width="1.5"
       id="path163" />
    <path
       d="m3.75 1v21"
       stroke="#d4aa00"
       stroke-width="1.5"
       id="path165" />
    <g
       stroke="#2a7fff"
       stroke-linecap="round"
       stroke-linejoin="round"
       id="g179">
      <path
         d="m6.6 15.4h10.8"
         stroke-width="1.2"
         id="path167" />
      <path
         d="m17.5 11.6-11 3.6"
         stroke-width=".75"
         id="path169" />
      <path
         d="m6.6 11.4h10.8"
         stroke-width="1.2"
         id="path171" />
      <path
         d="m6.6 19.4h10.8"
         stroke-width="1.2"
         id="path173" />
      <path
         d="m17.5 15.6-11 3.6"
         stroke-width=".75"
         id="path175" />
      <path
         d="m17.5 7.6-11 3.6"
         stroke-width=".75"
         id="path177" />
    </g>
  </g>
</svg>
