<?xml version="1.0" encoding="UTF-8" standalone="no"?>
<svg
   height="24"
   width="24"
   version="1.1"
   id="svg294"
   sodipodi:docname="next_word_150.svg"
   inkscape:export-filename="next_word_150.png"
   inkscape:export-xdpi="96"
   inkscape:export-ydpi="96"
   inkscape:version="1.2.2 (732a01da63, 2022-12-09)"
   xmlns:inkscape="http://www.inkscape.org/namespaces/inkscape"
   xmlns:sodipodi="http://sodipodi.sourceforge.net/DTD/sodipodi-0.dtd"
   xmlns="http://www.w3.org/2000/svg"
   xmlns:svg="http://www.w3.org/2000/svg">
  <defs
     id="defs298" />
  <sodipodi:namedview
     id="namedview296"
     pagecolor="#ffffff"
     bordercolor="#666666"
     borderopacity="1.0"
     inkscape:showpageshadow="2"
     inkscape:pageopacity="0.0"
     inkscape:pagecheckerboard="0"
     inkscape:deskcolor="#d1d1d1"
     showgrid="true"
     inkscape:zoom="38.25"
     inkscape:cx="11.986928"
     inkscape:cy="12"
     inkscape:current-layer="svg294">
    <inkscape:grid
       type="xygrid"
       id="grid417" />
  </sodipodi:namedview>
  <g
     stroke-linecap="round"
     id="g292">
    <g
       fill="none"
       stroke="#00cc00"
       stroke-width="2"
       transform="translate(15.5 -7)"
       id="g284">
      <path
         d="m1.5 23.000067 3 3.999933 3-3.999933"
         stroke-linejoin="round"
         id="path280" />
      <path
         d="m4.5 27v-16"
         id="path282" />
    </g>
    <g
       fill="#fff"
       stroke-miterlimit="5.6"
       stroke-width="1.28208"
       id="g290">
      <path
         d="m2.64104 4.64104h9.717917v3.717915h-9.717917z"
         stroke="#2a7fff"
         id="path286" />
      <path
         d="m2.64104 13.64104h9.717917v3.717915h-9.717917z"
         stroke="#f00"
         id="path288" />
    </g>
  </g>
</svg>
