<svg width="32" height="32" version="1.1" viewBox="0 0 32 32" xmlns="http://www.w3.org/2000/svg">
 <defs>
  <radialGradient id="c" cx="21.957434" cy="5.9936466" r="3.105469" gradientTransform="matrix(1.5869996,5.6098036e-4,4.4478607e-8,1.3000663,-15.84541,1.1344985)" gradientUnits="userSpaceOnUse">
   <stop stop-color="#803300" offset="0"/>
   <stop stop-color="#d45500" offset="1"/>
  </radialGradient>
  <linearGradient id="a" x1="25.714283" x2="25.714283" y1="15.5" y2="6.2142854" gradientTransform="matrix(1.5864108 .00048128105 .00044062735 1.7333336 -15.905002 -.87725783)" gradientUnits="userSpaceOnUse">
   <stop stop-color="#668000" offset="0"/>
   <stop stop-color="#aad400" offset="1"/>
  </linearGradient>
  <linearGradient id="b" x1="23" x2="23" y1="6.5" y2="15" gradientTransform="matrix(1.6338155 .00047656261 .00045379407 1.7163401 -16.949079 -.33336575)" gradientUnits="userSpaceOnUse">
   <stop stop-color="#89a02c" offset="0"/>
   <stop stop-color="#445016" offset="1"/>
  </linearGradient>
  <radialGradient id="d" cx="-11.5" cy="8.5" r="3.5" gradientTransform="matrix(0,1.872,-1.872,0,21.007217,39.623997)" gradientUnits="userSpaceOnUse">
   <stop stop-color="#fff" offset="0"/>
   <stop stop-color="#d5e5ff" offset="1"/>
  </radialGradient>
 </defs>
 <path d="m20.903371 5.6903152 1.903366-4.6792047" fill="none" stroke="#d4aa00" stroke-linecap="round" stroke-linejoin="round" stroke-width="2.02222"/>
 <path d="m17.096636 5.6903152-1.903368-4.6792047" fill="none" stroke="#d4aa00" stroke-linecap="round" stroke-linejoin="round" stroke-width="2.02222"/>
 <path d="m18.99714 3.4666648a11.266671 7.945596 89.953824 0 0-4.91973 2.4495504l4.921718 5.3775368 4.931377-5.3880888a11.266671 7.945596 89.953824 0 0-4.933365-2.4389984z" fill="url(#c)" stroke-linejoin="round" stroke-width="5.67204"/>
 <path d="m9.8999989 6.7888873v2.0970603l2.5378241 2.6738324" fill="none" stroke="#aca793" stroke-linecap="round" stroke-linejoin="round" stroke-width="2.02222"/>
 <path d="m28.10138 6.7888893 6e-6 2.0970583-2.537829 2.6738344" fill="none" stroke="#aca793" stroke-linecap="round" stroke-linejoin="round" stroke-width="2.02222"/>
 <path d="m28.068222 24.98889 0.03316-2.708762-2.537823-2.673833" fill="none" stroke="#aca793" stroke-linecap="round" stroke-linejoin="round" stroke-width="2.02222"/>
 <path d="m30.98889 17.656791-1.903364-2.00537-4.842449-0.92678" fill="none" stroke="#aca793" stroke-linecap="round" stroke-linejoin="round" stroke-width="2.02222"/>
 <path d="m23.90625 5.8789062-4.90625 5.3613278-4.894531-5.3476559a11.266671 7.945596 89.953824 0 0-2.97461 7.4804689c1.85702 1.409803 3.06836 3.63239 3.06836 6.126953 0 1.095661-0.234078 2.13952-0.652344 3.085937l2.662109 2.66211a11.266671 7.945596 89.953824 0 0 2.792969 0.751953 11.266671 7.945596 89.953824 0 0 7.943359-11.263672 11.266671 7.945596 89.953824 0 0-3.039062-8.8574218z" fill="url(#a)" stroke-linejoin="round" stroke-width="5.67204"/>
 <path d="m19 10.544444v14.444446" fill="none" stroke="url(#b)" stroke-linecap="round" stroke-linejoin="round" stroke-width="2.02222"/>
 <path d="m8.861219 21.862 8.538 8.538" fill="none" stroke="#ff7f00" stroke-linecap="round" stroke-width="3.2"/>
 <circle cx="6.4992189" cy="19.5" r="5.8499999" fill="url(#d)" fill-rule="evenodd" stroke="#b3b3b3" stroke-linecap="round" stroke-linejoin="round" stroke-width="1.3"/>
</svg>
