<?xml version="1.0" encoding="UTF-8" standalone="no"?>
<svg
   height="32"
   viewBox="0 0 32 32"
   width="32"
   version="1.1"
   id="svg521"
   sodipodi:docname="table_close_200.svg"
   inkscape:version="1.2.2 (732a01da63, 2022-12-09)"
   xmlns:inkscape="http://www.inkscape.org/namespaces/inkscape"
   xmlns:sodipodi="http://sodipodi.sourceforge.net/DTD/sodipodi-0.dtd"
   xmlns="http://www.w3.org/2000/svg"
   xmlns:svg="http://www.w3.org/2000/svg">
  <defs
     id="defs525" />
  <sodipodi:namedview
     id="namedview523"
     pagecolor="#ffffff"
     bordercolor="#000000"
     borderopacity="0.25"
     inkscape:showpageshadow="2"
     inkscape:pageopacity="0.0"
     inkscape:pagecheckerboard="0"
     inkscape:deskcolor="#d1d1d1"
     showgrid="true"
     inkscape:zoom="28.4375"
     inkscape:cx="15.982418"
     inkscape:cy="16"
     inkscape:current-layer="svg521">
    <inkscape:grid
       type="xygrid"
       id="grid1014" />
  </sodipodi:namedview>
  <linearGradient
     id="a"
     gradientTransform="matrix(1.0486588 0 0 1.0199205 80.85116 18.566742)"
     gradientUnits="userSpaceOnUse"
     x1="-49.009357"
     x2="-49.633709"
     y1="6.522097"
     y2="3.715767">
    <stop
       offset="0"
       stop-color="#e6e6e6"
       id="stop487" />
    <stop
       offset="1"
       stop-color="#999"
       id="stop489" />
  </linearGradient>
  <linearGradient
     id="b"
     gradientTransform="matrix(1.0486588 0 0 1.0199205 132.93147 62.933282)"
     gradientUnits="userSpaceOnUse"
     x1="-124.5"
     x2="-122"
     y1="-45"
     y2="-45">
    <stop
       offset="0"
       stop-color="#de7900"
       id="stop492" />
    <stop
       offset="1"
       stop-color="#ffa73e"
       id="stop494" />
  </linearGradient>
  <filter
     id="c"
     color-interpolation-filters="sRGB"
     height="1.0731148"
     width="1.0609014"
     x="-0.030450687"
     y="-0.036557391">
    <feGaussianBlur
       stdDeviation=".3602005"
       id="feGaussianBlur497" />
  </filter>
  <linearGradient
     id="d"
     gradientTransform="matrix(1.0486588 0 0 1.0199205 -.315035 -3.871509)"
     gradientUnits="userSpaceOnUse"
     x1="14"
     x2="14"
     y1="25.5"
     y2="28">
    <stop
       offset="0"
       stop-color="#ccc"
       id="stop500" />
    <stop
       offset="1"
       stop-color="#fff"
       id="stop502" />
  </linearGradient>
  <path
     d="m-157.26136-35.656953-1.51012 19.321062c-.0293 1.835891 1.57019 2.814254 3.11132 2.835938l25.27783-.115988-2.35916-23.531246z"
     fill="#999"
     fill-opacity=".994638"
     filter="url(#c)"
     transform="matrix(1.0596979 0 0 1.0199205 169.16587 41.907096)"
     id="path505" />
  <path
     d="m1.8871486 24.686264.6291954-19.1464242c.1678168-1.6930954 1.5729882-2.0398408 3.1459764-2.0398408l22.3376796.01992 2 18.499999"
     style="stroke:#b26f25;stroke-width:.999998;stroke-linecap:round;stroke-linejoin:round;stroke-opacity:.994638;fill:url(#b)"
     id="path507" />
  <path
     d="m6.2146136 21.935854.585904-18.0439992"
     fill="none"
     stroke="#b26f24"
     stroke-linecap="round"
     stroke-width=".999998"
     id="path509" />
  <path
     d="m30.6204 27.019918-.629194-5h-3.880038v5z"
     fill="url(#a)"
     id="path511" />
  <path
     d="m30.6204 27.019918h-26.0067384c-3.67030592 0-3.67030592-5 0-5h25.3863384c-2.621646 0-2.001246 5 .6204 5z"
     fill="url(#d)"
     stroke="#b16e24"
     stroke-linecap="round"
     stroke-linejoin="round"
     stroke-width=".999998"
     id="path513" />
  <g
     stroke-width=".678535"
     transform="matrix(1.8666544 0 0 1.1636067 2.412576 5.519919)"
     id="g519">
    <path
       d="m8.3105469.00031511c-2.537633-.0276428-4.4634941 1.76733639-4.3769531 3.83398429.0705211 1.6840343 2.4303181 2.0124947 3.2226562.6777344.1920257-.3234833.3072321-.3935037.4277344-.4492187.1144373-.0529109.3043005-.0825054.5917968-.0976563-.0288471.0980763-.0275045.2139528-.1210937.3320313-.1596939.2014806-.5000412.4998214-.9257813.9492187-.5935864.6265705-.9667968 1.5033623-.9667968 2.4394532 0 .3347102.1821977.6361439.3515625.9316406-.5060249.4026403-.8858095.9435185-.8867188 1.5976564-.0018085 1.147413 1.0561962 2.160334 2.1855469 2.160156 1.1287398.000178 2.1862081-1.011556 2.1855469-2.158203-.0002444-.6231958-.3359313-1.162183-.8027344-1.5644532.1591075-.2615472.3548374-.511996.3652344-.8164062l-.015625.1523437c-.0005927.003471.0378318-.1089589.2617187-.3105469.2238874-.2015879.5824494-.4470116.9687504-.7304687a1.1371915 1.1371915 0 0 0 .06836-.052734c.744633-.6398864 1.77322-1.6539589 1.765624-3.1933597-.005765-1.1686188-.631117-2.1687129-1.451172-2.77929688-.820055-.61058399-1.8261975-.91074905-2.8476561-.92187501z"
       fill="#ff0"
       stroke-linecap="round"
       stroke-linejoin="round"
       stroke-width=".339261"
       id="path515" />
    <path
       d="m8.861166 10.217886a1.0486588 1.0199205 0 0 1 -1.0486588 1.019921 1.0486588 1.0199205 0 0 1 -1.0486588-1.019921 1.0486588 1.0199205 0 0 1 1.0486588-1.0199201 1.0486588 1.0199205 0 0 1 1.0486588 1.0199201zm-.5616831-9.0815538c1.5914105.017334 3.1661121.9824109 3.1739451 2.5702028.0052 1.0537798-.667714 1.721712-1.37025 2.3254218-.7095675.5206617-1.5540027 1.0269181-1.6800399 1.7651019-.0293205.8584646-1.1249068.8853466-1.1249068-.1111285 0-.6719613.2350432-1.2134999.6571604-1.659073.7525532-.7943707 1.4063286-1.181938 1.442782-2.2565772.0239095-.7048451-.7655424-.9676919-1.2415753-.9468172-.7268286.0318725-1.4111655.1524246-1.9784674 1.1080921-.338247.5698056-1.0894832.3112079-1.1085216-.1434263-.0505611-1.2074278 1.2616452-2.6732366 3.2298735-2.6517964z"
       fill="#f50"
       stroke-width=".83103"
       id="path517" />
  </g>
</svg>
