<?xml version="1.0" encoding="UTF-8" standalone="no"?>
<svg
   height="32"
   width="32"
   version="1.1"
   id="svg338"
   sodipodi:docname="Database_02_32.svg"
   inkscape:export-filename="Database_02_32.png"
   inkscape:export-xdpi="96"
   inkscape:export-ydpi="96"
   inkscape:version="1.2-beta (1b65182ce9, 2022-04-05)"
   xmlns:inkscape="http://www.inkscape.org/namespaces/inkscape"
   xmlns:sodipodi="http://sodipodi.sourceforge.net/DTD/sodipodi-0.dtd"
   xmlns:xlink="http://www.w3.org/1999/xlink"
   xmlns="http://www.w3.org/2000/svg"
   xmlns:svg="http://www.w3.org/2000/svg">
  <defs
     id="defs342">
    <linearGradient
       inkscape:collect="always"
       xlink:href="#b"
       id="linearGradient1716"
       gradientUnits="userSpaceOnUse"
       x1="-48.585566"
       y1="2.2479"
       x2="-30.585566"
       y2="2.2479"
       gradientTransform="translate(54.585567,11.752117)" />
    <linearGradient
       id="a-0"
       gradientUnits="userSpaceOnUse"
       x1="14.15625"
       x2="8.84375"
       y1="14.15625"
       y2="8.84375"
       gradientTransform="matrix(1.8378377,0,0,1.8378377,2.3648655,2.3648649)">
      <stop
         offset="0"
         stop-color="#009600"
         id="stop2" />
      <stop
         offset="1"
         stop-color="#6edb39"
         id="stop4" />
    </linearGradient>
  </defs>
  <sodipodi:namedview
     id="namedview340"
     pagecolor="#ffffff"
     bordercolor="#666666"
     borderopacity="1.0"
     inkscape:pageshadow="2"
     inkscape:pageopacity="0.0"
     inkscape:pagecheckerboard="0"
     inkscape:deskcolor="#d1d1d1"
     showgrid="true"
     inkscape:zoom="28.6875"
     inkscape:cx="14.291939"
     inkscape:cy="16"
     inkscape:current-layer="svg338">
    <inkscape:grid
       type="xygrid"
       id="grid1714" />
  </sodipodi:namedview>
  <linearGradient
     id="a"
     gradientUnits="userSpaceOnUse"
     x1="-48.585566"
     x2="-30.585566"
     xlink:href="#b"
     y1="2.2479"
     y2="2.2479"
     gradientTransform="translate(54.585567,11.752117)" />
  <linearGradient
     id="b">
    <stop
       offset="0"
       stop-color="#4276c4"
       id="stop311" />
    <stop
       offset=".34375"
       stop-color="#80b3ff"
       id="stop313" />
    <stop
       offset="1"
       stop-color="#04a"
       id="stop315" />
  </linearGradient>
  <linearGradient
     id="c"
     gradientUnits="userSpaceOnUse"
     x1="-48.585566"
     x2="-30.585566"
     xlink:href="#b"
     y1="-9.7519"
     y2="-9.7519"
     gradientTransform="translate(54.585567,11.752117)" />
  <linearGradient
     id="d"
     gradientUnits="userSpaceOnUse"
     x1="-48.585566"
     x2="-30.585566"
     xlink:href="#b"
     y1="-3.7521"
     y2="-3.7521"
     gradientTransform="translate(54.585567,11.752117)" />
  <g
     id="g2125"
     transform="translate(-2)">
    <ellipse
       cx="16"
       cy="25"
       rx="10"
       ry="3"
       stroke="url(#a)"
       stroke-width="4"
       id="ellipse320"
       style="fill:none;fill-rule:evenodd;stroke:url(#linearGradient1716);stroke-linecap:round;stroke-linejoin:round" />
    <ellipse
       cx="16"
       cy="21.083008"
       rx="10.988618"
       ry="3.9169631"
       stroke="#ffffff"
       stroke-width="2"
       id="ellipse322"
       style="fill:none;fill-rule:evenodd;stroke-linecap:round;stroke-linejoin:round" />
    <ellipse
       cx="16"
       cy="19"
       rx="10"
       ry="3"
       stroke="url(#d)"
       stroke-width="4"
       id="ellipse324"
       style="fill:none;fill-rule:evenodd;stroke:url(#d);stroke-linecap:round;stroke-linejoin:round" />
    <ellipse
       cx="16"
       cy="15.083007"
       rx="10.988618"
       ry="3.9169631"
       stroke="#ffffff"
       stroke-width="2"
       id="ellipse326"
       style="fill:none;fill-rule:evenodd;stroke-linecap:round;stroke-linejoin:round" />
    <ellipse
       cx="16"
       cy="13"
       rx="10"
       ry="3"
       stroke="url(#c)"
       stroke-width="4"
       id="ellipse328"
       style="fill:none;fill-rule:evenodd;stroke:url(#c);stroke-linecap:round;stroke-linejoin:round" />
    <ellipse
       cx="16"
       cy="9.0830069"
       rx="10.988618"
       ry="3.9169631"
       stroke="#ffffff"
       stroke-width="2"
       id="ellipse330"
       style="fill:none;fill-rule:evenodd;stroke-linecap:round;stroke-linejoin:round" />
    <ellipse
       cx="16"
       cy="7"
       fill="#80b3ff"
       rx="11"
       ry="4"
       stroke="url(#a)"
       stroke-width="2"
       id="ellipse334"
       style="fill-rule:evenodd;stroke:url(#a);stroke-linecap:round;stroke-linejoin:round" />
  </g>
  <g
     id="g4219">
    <circle
       cx="23.5"
       cy="23.5"
       fill="url(#a)"
       r="7.8108106"
       stroke-dashoffset="1.49998"
       stroke-linejoin="round"
       stroke-width="0.5"
       transform="matrix(0,1,1,0,0,0)"
       id="circle7"
       style="fill:url(#a-0);stroke:#ffffff;stroke-width:1.37838;stroke-linecap:round;stroke-dasharray:none" />
    <g
       id="g4213">
      <path
         style="fill:none;stroke:#ffffff;stroke-width:2.25;stroke-linecap:round;stroke-linejoin:miter;stroke-miterlimit:4;stroke-dasharray:none;stroke-opacity:1"
         d="m 23.5,19.5 v 8"
         id="path1522"
         sodipodi:nodetypes="cc" />
      <path
         style="fill:none;stroke:#ffffff;stroke-width:2.25;stroke-linecap:round;stroke-linejoin:miter;stroke-miterlimit:4;stroke-dasharray:none;stroke-opacity:1"
         d="m 27.5,23.5 h -8"
         id="path1215"
         sodipodi:nodetypes="cc" />
    </g>
  </g>
</svg>
