<?xml version="1.0" encoding="UTF-8" standalone="no"?>
<svg
   width="24"
   height="24"
   version="1.1"
   id="svg43"
   sodipodi:docname="menu_delpro_to_lazpro_150.svg"
   inkscape:export-filename="menu_delpro_to_lazpro_150.png"
   inkscape:export-xdpi="96"
   inkscape:export-ydpi="96"
   inkscape:version="1.2.1 (9c6d41e410, 2022-07-14)"
   xmlns:inkscape="http://www.inkscape.org/namespaces/inkscape"
   xmlns:sodipodi="http://sodipodi.sourceforge.net/DTD/sodipodi-0.dtd"
   xmlns="http://www.w3.org/2000/svg"
   xmlns:svg="http://www.w3.org/2000/svg">
  <defs
     id="defs47" />
  <sodipodi:namedview
     id="namedview45"
     pagecolor="#ffffff"
     bordercolor="#666666"
     borderopacity="1.0"
     inkscape:showpageshadow="2"
     inkscape:pageopacity="0.0"
     inkscape:pagecheckerboard="0"
     inkscape:deskcolor="#d1d1d1"
     showgrid="true"
     inkscape:zoom="38.25"
     inkscape:cx="11.986928"
     inkscape:cy="12"
     inkscape:current-layer="svg43">
    <inkscape:grid
       type="xygrid"
       id="grid663" />
  </sodipodi:namedview>
  <radialGradient
     id="a"
     cx="5.4"
     cy="1034.7"
     r="4"
     gradientTransform="matrix(1.7411 -1.7411 1.0447 1.0446 -1078.8 -1051.4)"
     gradientUnits="userSpaceOnUse">
    <stop
       stop-color="#0057dc"
       offset="0"
       id="stop2" />
    <stop
       stop-color="#fff"
       offset="1"
       id="stop4" />
  </radialGradient>
  <radialGradient
     id="b"
     cx="5.4"
     cy="1034.7"
     r="4"
     gradientTransform="matrix(1.7411 -1.7411 1.0447 1.0446 -1070.2 -1051.4)"
     gradientUnits="userSpaceOnUse">
    <stop
       stop-color="#dc0000"
       offset="0"
       id="stop7" />
    <stop
       stop-color="#fff"
       offset="1"
       id="stop9" />
  </radialGradient>
  <radialGradient
     id="c"
     cx="5.4"
     cy="1034.7"
     r="4"
     gradientTransform="matrix(1.7411 -1.7411 1.0447 1.0446 -1074.7 -1058.9)"
     gradientUnits="userSpaceOnUse">
    <stop
       stop-color="#dcb000"
       offset="0"
       id="stop12" />
    <stop
       stop-color="#fff"
       offset="1"
       id="stop14" />
  </radialGradient>
  <rect
     width="13.5"
     height="13"
     fill="#e60000"
     stroke-linejoin="round"
     stroke-miterlimit="5.6"
     stroke-width="3.0662"
     id="rect17" />
  <g
     transform="matrix(1.5 0 0 1.5 0 -.5)"
     stroke="#fff"
     id="g33">
    <path
       d="m7.5001 3.5-3.0001-2-3.0001 2z"
       fill="#fff"
       fill-rule="evenodd"
       stroke-linejoin="round"
       id="path19" />
    <g
       fill="none"
       id="g31">
      <g
         stroke-width="1px"
         id="g27">
        <path
           d="m2.5 4v3.5"
           id="path21" />
        <path
           d="m4.5 4v3.5"
           id="path23" />
        <path
           d="m6.5 4v3.5"
           id="path25" />
      </g>
      <path
         d="m0.5 7.5h8"
         id="path29" />
    </g>
  </g>
  <g
     fill-rule="evenodd"
     stroke-linecap="square"
     stroke-linejoin="round"
     stroke-width=".75"
     id="g41">
    <circle
       cx="14.25"
       cy="11.25"
       r="4.875"
       fill="url(#c)"
       stroke="#ffe680"
       id="circle35" />
    <circle
       cx="10.125"
       cy="18.75"
       r="4.875"
       fill="url(#a)"
       stroke="#80b3ff"
       id="circle37" />
    <circle
       cx="18.75"
       cy="18.75"
       r="4.875"
       fill="url(#b)"
       stroke="#faa"
       id="circle39" />
  </g>
</svg>
