<?xml version="1.0" encoding="UTF-8" standalone="no"?>
<svg
   height="36"
   width="36"
   version="1.1"
   id="svg193"
   sodipodi:docname="Grid_02_36.svg"
   inkscape:export-filename="Grid_02_36.png"
   inkscape:export-xdpi="96"
   inkscape:export-ydpi="96"
   inkscape:version="1.2-beta (1b65182ce9, 2022-04-05)"
   xmlns:inkscape="http://www.inkscape.org/namespaces/inkscape"
   xmlns:sodipodi="http://sodipodi.sourceforge.net/DTD/sodipodi-0.dtd"
   xmlns="http://www.w3.org/2000/svg"
   xmlns:svg="http://www.w3.org/2000/svg">
  <defs
     id="defs197" />
  <sodipodi:namedview
     id="namedview195"
     pagecolor="#ffffff"
     bordercolor="#666666"
     borderopacity="1.0"
     inkscape:pageshadow="2"
     inkscape:pageopacity="0.0"
     inkscape:pagecheckerboard="0"
     inkscape:deskcolor="#d1d1d1"
     showgrid="true"
     inkscape:zoom="25.499996"
     inkscape:cx="18.000003"
     inkscape:cy="18.000003"
     inkscape:current-layer="svg193">
    <inkscape:grid
       type="xygrid"
       id="grid1154" />
  </sodipodi:namedview>
  <linearGradient
     id="a"
     gradientTransform="matrix(0 -1.4166667 -1.5 0 24 23.527778)"
     gradientUnits="userSpaceOnUse"
     x1="9"
     x2="6"
     y1="10"
     y2="10.5">
    <stop
       offset="0"
       stop-color="#72cef6"
       id="stop163" />
    <stop
       offset="1"
       stop-color="#d2f5f8"
       id="stop165" />
  </linearGradient>
  <linearGradient
     id="b"
     gradientTransform="matrix(0 -1.4166667 -1.5 0 24 23.527778)"
     gradientUnits="userSpaceOnUse"
     x1="10"
     x2="5"
     y1="12.5"
     y2="12.5">
    <stop
       offset="0"
       stop-color="#4674a8"
       id="stop168" />
    <stop
       offset="1"
       stop-color="#42a0ce"
       id="stop170" />
  </linearGradient>
  <path
     d="m-29.489361 6.510639h22.978724v22.978724h-22.978724z"
     style="fill:#fff;stroke:#999;stroke-width:1.02128;stroke-linecap:round;stroke-linejoin:round;stroke-dashoffset:1.49998"
     transform="matrix(0 -1.5 1.5 0 -9.000001 -9)"
     id="path173" />
  <g
     fill="none"
     stroke="#b3b3b3"
     transform="matrix(0 -1.5 -1.5 0 35.999999 36)"
     id="g185">
    <path
       d="m1 18.5h22"
       id="path175" />
    <path
       d="m6.5 23v-22"
       id="path177" />
    <path
       d="m23 5.5h-22"
       id="path179" />
    <path
       d="m18.5 23v-22"
       id="path181" />
    <path
       d="m12.5 23v-22"
       id="path183" />
  </g>
  <g
     stroke-linejoin="round"
     transform="matrix(0 1.5 -1.5 0 35.999999 0)"
     id="g191">
    <path
       d="m.5-16.5h23v7.666667h-23z"
       fill="none"
       opacity=".5"
       stroke="#fff"
       stroke-dashoffset="1.49998"
       transform="scale(1 -1)"
       id="path187" />
    <path
       d="m23.5 15.5h-23v-5.6666667h23z"
       fill="url(#a)"
       stroke="url(#b)"
       stroke-linecap="round"
       stroke-width=".999999"
       id="path189" />
  </g>
</svg>
