<svg width="64" height="64" version="1.1" xmlns="http://www.w3.org/2000/svg">
 <defs>
  <radialGradient id="a" cx="12.1" cy="10.900001" r="4.5" gradientTransform="matrix(0,2.0740741,-2.0740739,4e-8,43.307408,-4.396297)" gradientUnits="userSpaceOnUse">
   <stop stop-color="#ff7f2a" offset="0"/>
   <stop stop-color="#d45500" offset="1"/>
  </radialGradient>
 </defs>
 <g stroke="#ffffff" stroke-linecap="round">
  <g>
   <g transform="matrix(2.1298701,0,0,2.1298701,-4.0519477,-4.0519477)">
    <circle transform="matrix(0,1,1,0,0,0)" cx="23.5" cy="23.5" r="7.6999998" fill="url(#a)" stroke="#ffffff" stroke-dashoffset="1.49998" stroke-linecap="round" stroke-linejoin="round" stroke-width="1.50244"/>
    <g transform="matrix(1.8881996 0 0 1.8886627 .91279074 2.6489683)" fill="#ffffff" stroke-width="1.17407">
     <path d="m11.28698 9.0599682 1.980622 1.9801358-1.980622 1.980136" fill="none" stroke="#ffffff" stroke-linecap="round" stroke-linejoin="round" stroke-width="1.17401"/>
    </g>
   </g>
  </g>
 </g>
</svg>
