<?xml version="1.0" encoding="UTF-8" standalone="no"?>
<svg
   height="24"
   width="24"
   version="1.1"
   id="svg5"
   sodipodi:docname="issue_fpgui_150.svg"
   inkscape:export-filename="issue_fpgui_150.png"
   inkscape:export-xdpi="96"
   inkscape:export-ydpi="96"
   inkscape:version="1.3-alpha (2a5ddc9d23, 2023-03-29)"
   xmlns:inkscape="http://www.inkscape.org/namespaces/inkscape"
   xmlns:sodipodi="http://sodipodi.sourceforge.net/DTD/sodipodi-0.dtd"
   xmlns="http://www.w3.org/2000/svg"
   xmlns:svg="http://www.w3.org/2000/svg">
  <defs
     id="defs5" />
  <sodipodi:namedview
     id="namedview5"
     pagecolor="#ffffff"
     bordercolor="#000000"
     borderopacity="0.25"
     inkscape:showpageshadow="2"
     inkscape:pageopacity="0.0"
     inkscape:pagecheckerboard="0"
     inkscape:deskcolor="#d1d1d1"
     showgrid="true"
     inkscape:zoom="37.875"
     inkscape:cx="12"
     inkscape:cy="12"
     inkscape:current-layer="svg5">
    <inkscape:grid
       id="grid5"
       units="px"
       originx="0"
       originy="0"
       spacingx="0.5"
       spacingy="0.5"
       empcolor="#0099e5"
       empopacity="0.30196078"
       color="#0099e5"
       opacity="0.14901961"
       empspacing="2"
       dotted="false"
       gridanglex="30"
       gridanglez="30"
       visible="true" />
  </sodipodi:namedview>
  <rect
     fill="#fc0"
     height="24"
     rx="4.5"
     width="24"
     id="rect1" />
  <g
     fill="#333"
     stroke-width=".999999"
     id="g5">
    <path
       d="m7 3.999973v7.000027h.981644v-2.947668h2.895714v-.932425h-2.895714v-2.184774h3.423452v-.93516z"
       id="path1" />
    <path
       d="m13 3.999973v7.000027h.984378v-2.715244h1.728132c.417275 0 .784233-.08871 1.101956-.265236.317744-.176527.561679-.425843.735552-.746487.175937-.324473.265248-.699698.265248-1.126567 0-.426871-.08995-.801736-.265248-1.126567-.174576-.323498-.418492-.571476-.735552-.749222-.318426-.178516-.684711-.270704-1.101956-.270704zm.984378.93516h1.760942c.211805 0 .396643.05156.557817.153128.159761.100648.28388.241511.371868.423829.08859.183576.133984.39366.133984.634378 0 .237509-.04551.448066-.133984.631643-.08799.182324-.211389.324332-.371868.423832-.160479.09949-.346016.147655-.557817.147655h-1.760942z"
       id="path2" />
    <path
       d="m9.830198 16.235861v1.198118c0 .509436-.09842.959447-.297184 1.349062-.19748.387121-.479274.687597-.844343.900947-.36136.211177-.781451.316036-1.259436.316036-.484279 0-.911399-.09719-1.278308-.297172-.365821-.199386-.6478-.484275-.849056-.849056-.20126-.364781-.301871-.787739-.301871-1.268873v-2.023592c0-.509436.09906-.957551.297184-1.344344.198123-.386794.478277-.68505.839626-.89623.365065-.213352.786168-.320757 1.264158-.320757.393082 0 .753754.08679 1.084909.254721.332372.168555.611637.404089.834909.712267.223257.308175.374211.665095.452833 1.070759h-1.042458c-.05662-.229562-.153298-.425469-.287736-.589625-.135987-.16604-.294614-.291169-.47642-.377361-.183005-.08677-.371074-.132079-.566037-.132079-.283012 0-.531451.06761-.745286.202829-.213845.135224-.378319.325765-.495284.570757-.115729.242434-.174539.52516-.174539.84906v2.023593c0 .295601.05911.555388.179263.778305.118829.220479.287358.39218.504715.514151.219742.123314.473268.183964.759439.183964.283011 0 .532135-.06173.745285-.188677.214526-.127771.378928-.314472.495281-.556607.116334-.242139.174538-.529876.174538-.86321v-.29717h-1.39155v-.919815z"
       id="path3" />
    <path
       d="m18.982126 20.000027h-.982126v-7.000027h.982126z"
       id="path4" />
    <path
       d="m13.560201 20.000027c-.511464 0-.950899-.09818-1.315185-.300204-.363212-.201426-.639167-.496849-.829137-.881556-.191244-.387253-.285884-.852964-.285884-1.396193v-4.422074h.972099v4.455429c0 .505108.12703.895851.381188 1.172231.254135.276378.613107.414567 1.076931.414567.46696 0 .826684-.138985 1.081689-.414567.256479-.277176.386007-.667123.386007-1.172231v-4.455429h.972091v4.422073c0 .54323-.09468 1.008938-.285884 1.396194-.189959.384702-.469398.676747-.833903.881555-.444367.249682-.802341.300204-1.319993.300204z"
       id="path5" />
  </g>
</svg>
