<svg width="24" height="24" version="1.1" xmlns="http://www.w3.org/2000/svg">
 <defs>
  <radialGradient id="c" cx="21.957434" cy="5.9936466" r="3.105469" gradientTransform="matrix(.79349967 .00028049014 2.22393e-8 .65003304 -10.922703 .567249)" gradientUnits="userSpaceOnUse">
   <stop stop-color="#803300" offset="0"/>
   <stop stop-color="#d45500" offset="1"/>
  </radialGradient>
  <linearGradient id="a" x1="25.714283" x2="25.714283" y1="15.5" y2="6.2142854" gradientTransform="matrix(.79320529 .00024064049 .00022031364 .86666668 -10.9525 -.438629)" gradientUnits="userSpaceOnUse">
   <stop stop-color="#668000" offset="0"/>
   <stop stop-color="#aad400" offset="1"/>
  </linearGradient>
  <linearGradient id="b" x1="23" x2="23" y1="6.5" y2="15" gradientTransform="matrix(.81690765 .00023828127 .000226897 .85816993 -11.474538 -.166683)" gradientUnits="userSpaceOnUse">
   <stop stop-color="#89a02c" offset="0"/>
   <stop stop-color="#445016" offset="1"/>
  </linearGradient>
  <radialGradient id="d" cx="-11.5" cy="8.5" r="3.5" gradientTransform="matrix(0,1.4457832,-1.4457832,0,24.705037,30.042168)" gradientUnits="userSpaceOnUse">
   <stop stop-color="#fff" offset="0"/>
   <stop stop-color="#d5e5ff" offset="1"/>
  </radialGradient>
 </defs>
 <path d="m13 0v8.3222656c0.165235-0.01343 0.331517-0.021484 0.5-0.021484 3.40402 0 6.199219 2.7951987 6.199219 6.1992187 0 0.826643-0.166475 1.61632-0.464844 2.339844l0.160156 0.1601557h4.605469v-17z" fill="#d5f6ff" stroke-linecap="round" stroke-linejoin="round" stroke-width="5.6"/>
 <path d="m7.451684 2.845157 0.951683-2.339602" fill="none" stroke="#d4aa00" stroke-linecap="round" stroke-linejoin="round" stroke-width="1.01111"/>
 <path d="m5.548317 2.845157-0.951684-2.339602" fill="none" stroke="#d4aa00" stroke-linecap="round" stroke-linejoin="round" stroke-width="1.01111"/>
 <path d="m6.498569 1.733332a5.6333349 3.9727974 89.953824 0 0-2.459865 1.224775l2.460859 2.688768 2.465688-2.694044a5.6333349 3.9727974 89.953824 0 0-2.466682-1.219499z" fill="url(#c)" stroke-linejoin="round" stroke-width="2.83602"/>
 <path d="m1.949999 3.394443v1.04853l1.268912 1.336916" fill="none" stroke="#aca793" stroke-linecap="round" stroke-linejoin="round" stroke-width="1.01111"/>
 <path d="m1.966577 12.494442-0.01658-1.354382 1.268911-1.336917" fill="none" stroke="#aca793" stroke-linecap="round" stroke-linejoin="round" stroke-width="1.01111"/>
 <path d="m0.505555 8.828394 0.951683-1.002685 2.420168-0.464942" fill="none" stroke="#aca793" stroke-linecap="round" stroke-linejoin="round" stroke-width="1.01111"/>
 <path d="m11.050688 3.394444 3e-6 1.048529-1.268914 1.336917" fill="none" stroke="#aca793" stroke-linecap="round" stroke-linejoin="round" stroke-width="1.01111"/>
 <path d="m9.2167969 6.8652344a0.50555497 0.50555497 0 0 0-0.5917969 0.4023437 0.50555497 0.50555497 0 0 0 0.4023438 0.5917969l2.2597652 0.4316406 0.300782 0.3164063c0.369282-0.1211017 0.753142-0.2084482 1.148437-0.2578125l-0.826172-0.8710938a0.50560553 0.50560553 0 0 0-0.271484-0.1484375z" fill="#aca793" stroke-linecap="round" stroke-linejoin="round"/>
 <path d="m8.953125 2.9394531-2.453125 2.6796875-2.4472656-2.6738281a5.6333349 3.9727974 89.953824 0 0-1.5253906 4.4199219 5.6333349 3.9727974 89.953824 0 0 3.9746093 5.6347656 5.6333349 3.9727974 89.953824 0 0 1.0449219-0.199219c0.4302462-1.491831 1.4085565-2.75512 2.701172-3.5605466a5.6333349 3.9727974 89.953824 0 0 0.224609-1.8730469 5.6333349 3.9727974 89.953824 0 0-1.519531-4.4277344z" fill="url(#a)" stroke-linejoin="round" stroke-width="2.83602"/>
 <path d="m6.499999 5.272221v7.222222" fill="none" stroke="url(#b)" stroke-linecap="round" stroke-linejoin="round" stroke-width="1.01111"/>
 <path d="m19.677734 14c0.01343 0.165235 0.02148 0.331517 0.02148 0.5 0 0.168266-0.0099 0.335043-0.02344 0.5h2.324226v-1z" fill="#b3b3b3"/>
 <path d="m15 5.5h7" fill="none" stroke="#b3b3b3"/>
 <path d="M 15,8 V 8.4882813 C 15.471063,8.6069164 15.921441,8.7796762 16.34375,9 H 22 V 8 Z" fill="#b3b3b3"/>
 <path d="m18.605469 11c0.216525 0.313877 0.403934 0.648649 0.560547 1h2.833984v-1z" fill="#b3b3b3"/>
 <path d="m15 2.5h7" fill="none" stroke="#b3b3b3"/>
 <path d="m11.6035 16.396719-6.4035 6.4035" fill="none" stroke="#ff7f00" stroke-linecap="round" stroke-width="2.4"/>
 <circle cx="13.500219" cy="14.5" r="4.5180726" fill="url(#d)" fill-rule="evenodd" stroke="#b3b3b3" stroke-linecap="round" stroke-linejoin="round" stroke-width=".963855"/>
</svg>
