<?xml version="1.0" encoding="UTF-8" standalone="no"?>
<svg
   height="64"
   viewBox="0 0 16.933333 16.933335"
   width="64"
   version="1.1"
   id="svg871"
   sodipodi:docname="Cube_04_64.svg"
   inkscape:export-filename="Cube_04_64.png"
   inkscape:export-xdpi="96"
   inkscape:export-ydpi="96"
   inkscape:version="1.2.1 (9c6d41e410, 2022-07-14)"
   xmlns:inkscape="http://www.inkscape.org/namespaces/inkscape"
   xmlns:sodipodi="http://sodipodi.sourceforge.net/DTD/sodipodi-0.dtd"
   xmlns="http://www.w3.org/2000/svg"
   xmlns:svg="http://www.w3.org/2000/svg">
  <defs
     id="defs875" />
  <sodipodi:namedview
     id="namedview873"
     pagecolor="#ffffff"
     bordercolor="#666666"
     borderopacity="1.0"
     inkscape:showpageshadow="2"
     inkscape:pageopacity="0.0"
     inkscape:pagecheckerboard="0"
     inkscape:deskcolor="#d1d1d1"
     showgrid="true"
     inkscape:zoom="14.34375"
     inkscape:cx="31.965142"
     inkscape:cy="32"
     inkscape:current-layer="svg871">
    <inkscape:grid
       type="xygrid"
       id="grid1098" />
  </sodipodi:namedview>
  <linearGradient
     id="a"
     gradientUnits="userSpaceOnUse"
     x1="7.276042"
     x2="8.012002"
     y1="5.688541"
     y2="7.538461">
    <stop
       offset="0"
       stop-color="#aeefff"
       id="stop830" />
    <stop
       offset="1"
       stop-color="#0cf"
       id="stop832" />
  </linearGradient>
  <g
     stroke="#165044"
     stroke-linejoin="round"
     stroke-width=".185208"
     transform="matrix(1.999999 0 0 1.999999 -7.937492 -8.466658)"
     id="g869">
    <g
       fill-rule="evenodd"
       id="g841">
      <path
         d="m8.0120012 7.5162568-3.4214824-1.5206588 3.8016472-1.1404942 3.421482 1.5206589z"
         fill="url(#a)"
         id="path835" />
      <path
         d="m4.5905188 5.995598v4.561977l3.4214824 1.520658v-4.5619762z"
         fill="#f0f000"
         id="path837" />
      <path
         d="m11.813648 6.3757627v4.3718923l-3.8016468 1.330578v-4.5619762z"
         fill="#00d455"
         id="path839" />
    </g>
    <g
       fill="none"
       id="g867">
      <path
         d="m8.0120012 9.0369137 3.8016468-1.3115683"
         id="path843" />
      <path
         d="m8.0120012 10.472183 3.8016468-1.3160233"
         id="path845" />
      <path
         d="m9.3425777 7.1170818v4.4954482"
         id="path847" />
      <path
         d="m10.483072 6.7749336v4.4384234"
         id="path849" />
      <path
         d="m8.0120012 9.0369137-3.4214781-1.5206588"
         id="path851" />
      <path
         d="m8.0120012 10.472183-3.4214824-1.5206589"
         id="path853" />
      <path
         d="m6.7910289 6.9736024v4.5619776"
         id="path855" />
      <path
         d="m5.7310129 6.5024829v4.5619781"
         id="path857" />
      <path
         d="m9.3425776 7.1170819-3.4214823-1.5206607"
         id="path859" />
      <path
         d="m10.483072 6.7749356-3.4214783-1.5206589"
         id="path861" />
      <path
         d="m10.673154 5.8688744-3.8821251 1.1047281"
         id="path863" />
      <path
         d="m9.53266 5.3619882-3.8016471 1.140496"
         id="path865" />
    </g>
  </g>
</svg>
