<?xml version="1.0" encoding="UTF-8" standalone="no"?>
<svg
   height="36"
   viewBox="0 0 9.5249997 9.5250005"
   width="36"
   version="1.1"
   id="svg425"
   sodipodi:docname="Font_22_36.svg"
   inkscape:export-filename="Font_22_36.png"
   inkscape:export-xdpi="96"
   inkscape:export-ydpi="96"
   inkscape:version="1.2.1 (9c6d41e410, 2022-07-14)"
   xmlns:inkscape="http://www.inkscape.org/namespaces/inkscape"
   xmlns:sodipodi="http://sodipodi.sourceforge.net/DTD/sodipodi-0.dtd"
   xmlns="http://www.w3.org/2000/svg"
   xmlns:svg="http://www.w3.org/2000/svg">
  <defs
     id="defs429" />
  <sodipodi:namedview
     id="namedview427"
     pagecolor="#ffffff"
     bordercolor="#666666"
     borderopacity="1.0"
     inkscape:showpageshadow="2"
     inkscape:pageopacity="0.0"
     inkscape:pagecheckerboard="0"
     inkscape:deskcolor="#d1d1d1"
     showgrid="true"
     inkscape:zoom="25.5"
     inkscape:cx="17.980392"
     inkscape:cy="18"
     inkscape:current-layer="svg425">
    <inkscape:grid
       type="xygrid"
       id="grid946" />
  </sodipodi:namedview>
  <g
     fill="none"
     stroke="#2a7fff"
     stroke-linecap="round"
     stroke-linejoin="round"
     stroke-width=".686431"
     transform="matrix(1.0666018 0 0 1.0670861 -.037208 .361864)"
     id="g423">
    <path
       d="m.5 7.5h2.5"
       id="path413" />
    <path
       d="m6 7.5h2.5"
       id="path415" />
    <path
       d="m1.5 7.5 3-7 3 7"
       id="path417" />
    <path
       d="m2.5.5h2"
       id="path419" />
    <path
       d="m2.5775588 5.4412547h3.8448824"
       id="path421" />
  </g>
</svg>
