<?xml version="1.0" encoding="UTF-8" standalone="no"?>
<svg
   width="24"
   height="24"
   version="1.1"
   viewBox="0 0 24 24"
   id="svg37"
   sodipodi:docname="Grid_18_24.svg"
   inkscape:export-filename="Grid_18_24.png"
   inkscape:export-xdpi="96"
   inkscape:export-ydpi="96"
   inkscape:version="1.3.2 (091e20e, 2023-11-25, custom)"
   xmlns:inkscape="http://www.inkscape.org/namespaces/inkscape"
   xmlns:sodipodi="http://sodipodi.sourceforge.net/DTD/sodipodi-0.dtd"
   xmlns="http://www.w3.org/2000/svg"
   xmlns:svg="http://www.w3.org/2000/svg">
  <sodipodi:namedview
     id="namedview37"
     pagecolor="#ffffff"
     bordercolor="#000000"
     borderopacity="0.25"
     inkscape:showpageshadow="2"
     inkscape:pageopacity="0.0"
     inkscape:pagecheckerboard="0"
     inkscape:deskcolor="#d1d1d1"
     showgrid="true"
     inkscape:current-layer="svg37">
    <inkscape:grid
       id="grid37"
       units="px"
       originx="0"
       originy="0"
       spacingx="0.5"
       spacingy="0.5"
       empcolor="#0099e5"
       empopacity="0.30196078"
       color="#0099e5"
       opacity="0.14901961"
       empspacing="2"
       dotted="false"
       gridanglex="30"
       gridanglez="30"
       visible="true" />
  </sodipodi:namedview>
  <defs
     id="defs24">
    <linearGradient
       id="d"
       x1="1.5"
       x2="3.5"
       y1="15.5"
       y2="13.5"
       gradientTransform="matrix(1.4999977,0,0,1.4999977,11.999984,-5.9999885)"
       gradientUnits="userSpaceOnUse">
      <stop
         stop-color="#55ffdd"
         offset="0"
         id="stop1" />
      <stop
         stop-color="#8787de"
         offset="1"
         id="stop2" />
    </linearGradient>
    <linearGradient
       id="e"
       x1="1.5"
       x2="3.5"
       y1="15.5"
       y2="13.5"
       gradientTransform="matrix(1.4999977,0,0,1.4999977,11.999984,-11.999978)"
       gradientUnits="userSpaceOnUse">
      <stop
         stop-color="#d42aff"
         offset="0"
         id="stop3" />
      <stop
         stop-color="#00aad4"
         offset="1"
         id="stop4" />
    </linearGradient>
    <linearGradient
       id="j"
       x1="5.5"
       x2="7.5"
       y1="11.5"
       y2="9.5"
       gradientTransform="matrix(1.4999977,0,0,1.4999977,1.5e-5,2.3e-6)"
       gradientUnits="userSpaceOnUse">
      <stop
         stop-color="#ffcc00"
         offset="0"
         id="stop5" />
      <stop
         stop-color="#aaaaff"
         offset="1"
         id="stop6" />
    </linearGradient>
    <linearGradient
       id="c"
       x1="5.5"
       x2="7.5"
       y1="3.5"
       y2="1.5"
       gradientTransform="matrix(1.4999977,0,0,1.4999977,1.5e-5,2.3e-6)"
       gradientUnits="userSpaceOnUse">
      <stop
         stop-color="#aaccff"
         offset="0"
         id="stop7" />
      <stop
         stop-color="#ffc9c9"
         offset="1"
         id="stop8" />
    </linearGradient>
    <linearGradient
       id="l"
       x1="5.5"
       x2="7.5"
       y1="5.5"
       y2="7.5"
       gradientTransform="matrix(1.4999977,0,0,1.4999977,1.5e-5,2.3e-6)"
       gradientUnits="userSpaceOnUse">
      <stop
         stop-color="#d45500"
         offset="0"
         id="stop9" />
      <stop
         stop-color="#aaffaa"
         offset="1"
         id="stop10" />
    </linearGradient>
    <linearGradient
       id="k"
       x1="1.5"
       x2="3.5"
       y1="11.5"
       y2="9.5"
       gradientTransform="matrix(1.4999977,0,0,1.4999977,1.5e-5,2.3e-6)"
       gradientUnits="userSpaceOnUse">
      <stop
         stop-color="#6868ff"
         offset="0"
         id="stop11" />
      <stop
         stop-color="#aaccff"
         offset="1"
         id="stop12" />
    </linearGradient>
    <linearGradient
       id="h"
       x1="5.5"
       x2="7.5"
       y1="15.5"
       y2="13.5"
       gradientTransform="matrix(1.4999977,0,0,1.4999977,1.5e-5,2.3e-6)"
       gradientUnits="userSpaceOnUse">
      <stop
         stop-color="#00d400"
         offset="0"
         id="stop13" />
      <stop
         stop-color="#ffc9c9"
         offset="1"
         id="stop14" />
    </linearGradient>
    <linearGradient
       id="b"
       x1="11.5"
       x2="9.5"
       y1="3.5"
       y2="1.5"
       gradientTransform="matrix(1.4999977,0,0,1.4999977,1.5e-5,2.3e-6)"
       gradientUnits="userSpaceOnUse">
      <stop
         stop-color="#ff0000"
         offset="0"
         id="stop15" />
      <stop
         stop-color="#ffff51"
         offset="1"
         id="stop16" />
    </linearGradient>
    <linearGradient
       id="a"
       x1="2.5"
       x2="3"
       y1="7"
       y2="5.5"
       gradientTransform="matrix(1.4999977,0,0,1.4999977,1.5e-5,2.3e-6)"
       gradientUnits="userSpaceOnUse">
      <stop
         stop-color="#efef00"
         offset="0"
         id="stop17" />
      <stop
         stop-color="#00ff00"
         offset="1"
         id="stop18" />
    </linearGradient>
    <linearGradient
       id="g"
       x1="3"
       x2="1.5"
       y1="3.5"
       y2="1.5"
       gradientTransform="matrix(1.4999977,0,0,1.4999977,1.5e-5,2.3e-6)"
       gradientUnits="userSpaceOnUse">
      <stop
         stop-color="#0000ff"
         offset="0"
         id="stop19" />
      <stop
         stop-color="#ff7171"
         offset="1"
         id="stop20" />
    </linearGradient>
    <linearGradient
       id="i"
       x1="1.5"
       x2="3.5"
       y1="15.5"
       y2="13.5"
       gradientTransform="matrix(1.4999977,0,0,1.4999977,1.5e-5,2.3e-6)"
       gradientUnits="userSpaceOnUse">
      <stop
         stop-color="#008000"
         offset="0"
         id="stop21" />
      <stop
         stop-color="#6868ff"
         offset="1"
         id="stop22" />
    </linearGradient>
    <linearGradient
       id="f"
       x1="21.343754"
       x2="13.656252"
       y1="21.343752"
       y2="13.65625"
       gradientUnits="userSpaceOnUse">
      <stop
         stop-color="#009600"
         offset="0"
         id="stop23" />
      <stop
         stop-color="#6edb39"
         offset="1"
         id="stop24" />
    </linearGradient>
  </defs>
  <path
     d="m1.5000127 23.999964v-4.499993h4.5000182v4.499993z"
     fill="url(#i)"
     fill-rule="evenodd"
     id="path24" />
  <path
     d="m1.5000127 5.9999916v-4.4999916h4.5000182v4.4999916z"
     fill="url(#g)"
     fill-rule="evenodd"
     id="path25" />
  <path
     d="m1.5000127 11.999983v-4.4999941h4.5000182v4.4999941z"
     fill="url(#a)"
     fill-rule="evenodd"
     id="path26" />
  <path
     d="m13.499995 1.5v4.4999931l4.499992-6e-7v-4.4999925z"
     fill="url(#b)"
     fill-rule="evenodd"
     id="path27" />
  <path
     d="M 12,23.160156 A 7.9000001,7.9000001 0 0 1 9.8808594,19.5 H 7.5 V 24 H 12 Z"
     fill="url(#h)"
     fill-rule="evenodd"
     id="path28" />
  <path
     d="m1.5 17.999975v-4.499992h4.5000189v4.499992z"
     fill="url(#k)"
     fill-rule="evenodd"
     id="path29" />
  <path
     d="M 7.5,7.5 V 12 h 4.339844 A 7.9000001,7.9000001 0 0 1 12,11.839844 V 7.5 Z"
     fill="url(#l)"
     fill-rule="evenodd"
     id="path30" />
  <path
     d="m7.4999909 5.9999928v-4.4999924h4.5000171v4.4999924z"
     fill="url(#c)"
     fill-rule="evenodd"
     id="path31" />
  <path
     d="m9.6386719 18a7.9000001 7.9000001 0 0 1-0.039063-0.5 7.9000001 7.9000001 0 0 1 1.1152346-4h-3.2148435v4.5z"
     fill="url(#j)"
     fill-rule="evenodd"
     id="path32" />
  <path
     d="m13.5 10.714844a7.9000001 7.9000001 0 0 1 4-1.1152346 7.9000001 7.9000001 0 0 1 0.5 0.017578v-2.1171874h-4.5z"
     fill="url(#e)"
     fill-rule="evenodd"
     id="path33" />
  <g
     stroke-linecap="round"
     id="g37">
    <circle
       transform="matrix(0,1,1,0,0,0)"
       cx="17.5"
       cy="17.5"
       r="6.1500001"
       fill="url(#f)"
       stroke="#90e467"
       stroke-dashoffset="1.49998"
       stroke-linejoin="round"
       stroke-width=".7"
       id="circle34" />
    <g
       fill="none"
       stroke="#ffffff"
       stroke-width="1.2"
       id="g36">
      <path
         d="m17.4 14.4v6"
         id="path35" />
      <path
         d="m20.4 17.4h-6"
         id="path36" />
    </g>
  </g>
</svg>
