<?xml version="1.0" encoding="UTF-8" standalone="no"?>
<svg
   height="16"
   width="16"
   version="1.1"
   id="svg16"
   sodipodi:docname="File_23_16.svg"
   inkscape:version="1.2.2 (732a01da63, 2022-12-09)"
   inkscape:export-filename="File_23_16.png"
   inkscape:export-xdpi="96"
   inkscape:export-ydpi="96"
   xmlns:inkscape="http://www.inkscape.org/namespaces/inkscape"
   xmlns:sodipodi="http://sodipodi.sourceforge.net/DTD/sodipodi-0.dtd"
   xmlns="http://www.w3.org/2000/svg"
   xmlns:svg="http://www.w3.org/2000/svg">
  <defs
     id="defs20">
    <radialGradient
       id="a"
       cx="9.1740294"
       cy="7.8253603"
       gradientTransform="matrix(0.66909781,-2.2758851e-8,4.5190518e-8,0.58542853,1.8616763,4.291566)"
       gradientUnits="userSpaceOnUse"
       r="7.5"
       fx="9.1740294"
       fy="7.8253603">
      <stop
         offset="0"
         stop-color="#fff"
         id="stop2" />
      <stop
         offset="1"
         stop-color="#8fc1c7"
         id="stop4" />
    </radialGradient>
  </defs>
  <sodipodi:namedview
     id="namedview18"
     pagecolor="#ffffff"
     bordercolor="#666666"
     borderopacity="1.0"
     inkscape:pageshadow="2"
     inkscape:pageopacity="0.0"
     inkscape:pagecheckerboard="0"
     inkscape:deskcolor="#d1d1d1"
     showgrid="true"
     showguides="true"
     inkscape:zoom="56.875"
     inkscape:cx="7.9912088"
     inkscape:cy="8"
     inkscape:current-layer="svg16"
     inkscape:showpageshadow="2">
    <inkscape:grid
       type="xygrid"
       id="grid249" />
  </sodipodi:namedview>
  <rect
     style="fill:#ebfcff;fill-opacity:1;stroke:#00aad4;stroke-width:0.999995;stroke-linejoin:round;stroke-dasharray:none;stroke-opacity:1"
     id="rect979"
     width="10.000001"
     height="13.000001"
     x="2.4999976"
     y="1.4999995"
     ry="1.5" />
  <g
     id="g975">
    <circle
       cx="11.5"
       cy="11.5"
       r="4"
       stroke-dashoffset="1.49998"
       stroke-linejoin="round"
       id="circle2-5"
       style="fill:#ffffff;stroke:#00aad4;stroke-linecap:round" />
    <path
       d="m 10,10 3,3"
       id="path4"
       style="fill:none;stroke:#00aad4;stroke-linecap:round" />
    <path
       d="m 13,10 -3,3"
       id="path6"
       style="fill:none;stroke:#00aad4;stroke-linecap:round" />
  </g>
</svg>
