<?xml version="1.0" encoding="UTF-8" standalone="no"?>
<svg
   height="36"
   width="36"
   version="1.1"
   id="svg509"
   sodipodi:docname="Grid_06_36.svg"
   inkscape:export-filename="Grid_06_36.png"
   inkscape:export-xdpi="96"
   inkscape:export-ydpi="96"
   inkscape:version="1.2-beta (1b65182ce9, 2022-04-05)"
   xmlns:inkscape="http://www.inkscape.org/namespaces/inkscape"
   xmlns:sodipodi="http://sodipodi.sourceforge.net/DTD/sodipodi-0.dtd"
   xmlns="http://www.w3.org/2000/svg"
   xmlns:svg="http://www.w3.org/2000/svg">
  <defs
     id="defs513" />
  <sodipodi:namedview
     id="namedview511"
     pagecolor="#ffffff"
     bordercolor="#666666"
     borderopacity="1.0"
     inkscape:pageshadow="2"
     inkscape:pageopacity="0.0"
     inkscape:pagecheckerboard="0"
     inkscape:deskcolor="#d1d1d1"
     showgrid="true"
     inkscape:zoom="25.5"
     inkscape:cx="17.117647"
     inkscape:cy="18"
     inkscape:current-layer="svg509">
    <inkscape:grid
       type="xygrid"
       id="grid1392" />
  </sodipodi:namedview>
  <linearGradient
     id="a"
     gradientTransform="matrix(0 -1.4166667 -1.5 0 24 23.527778)"
     gradientUnits="userSpaceOnUse"
     x1="9"
     x2="6"
     y1="10"
     y2="10.5">
    <stop
       offset="0"
       stop-color="#72cef6"
       id="stop465" />
    <stop
       offset="1"
       stop-color="#d2f5f8"
       id="stop467" />
  </linearGradient>
  <linearGradient
     id="b"
     gradientTransform="matrix(0 -1.4166667 -1.5 0 24 23.527778)"
     gradientUnits="userSpaceOnUse"
     x1="10"
     x2="5"
     y1="12.5"
     y2="12.5">
    <stop
       offset="0"
       stop-color="#4674a8"
       id="stop470" />
    <stop
       offset="1"
       stop-color="#42a0ce"
       id="stop472" />
  </linearGradient>
  <path
     d="m-29.489361 6.510639h22.978724v22.978724h-22.978724z"
     style="fill:#fff;stroke:#999;stroke-width:1.02128;stroke-linecap:round;stroke-linejoin:round;stroke-dashoffset:1.49998"
     transform="matrix(0 -1.5 -1.5 0 44.999998 -8.999999)"
     id="path475" />
  <g
     fill="none"
     stroke="#b3b3b3"
     transform="matrix(0 -1.5 1.5 0 -.000002 36.000001)"
     id="g487">
    <path
       d="m1 18.5h22"
       id="path477" />
    <path
       d="m6.5 23v-22"
       id="path479" />
    <path
       d="m23 5.5h-22"
       id="path481" />
    <path
       d="m18.5 23v-22"
       id="path483" />
    <path
       d="m12.5 23v-22"
       id="path485" />
  </g>
  <g
     stroke-linejoin="round"
     transform="matrix(0 1.5 -1.5 0 38.999998 .000001)"
     id="g493">
    <path
       d="m.5-16.5h23v7.666667h-23z"
       fill="none"
       opacity=".5"
       stroke="#fff"
       stroke-dashoffset="1.49998"
       transform="scale(1 -1)"
       id="path489" />
    <path
       d="m23.5 15.5h-23v-5.6666667h23z"
       fill="url(#a)"
       stroke="url(#b)"
       stroke-linecap="round"
       stroke-width=".999999"
       id="path491" />
  </g>
  <g
     fill="none"
     stroke-linecap="round"
     stroke-opacity=".996078"
     transform="matrix(-2.25 0 0 2.25 36.349998 -4.5)"
     id="g507">
    <g
       stroke="#fff"
       stroke-width="3"
       transform="translate(-19.5 11)"
       id="g499">
      <path
         d="m27.5-1h3.5"
         opacity=".7"
         id="path495" />
      <path
         d="m31.5-4 3 3-3 3"
         opacity=".7"
         stroke-linejoin="round"
         id="path497" />
    </g>
    <g
       stroke="#3771c8"
       stroke-width="2"
       id="g505">
      <path
         d="m8 10h7"
         id="path501" />
      <path
         d="m12 7 3 3-3 3"
         stroke-linejoin="round"
         id="path503" />
    </g>
  </g>
</svg>
