<?xml version="1.0" encoding="UTF-8" standalone="no"?>
<svg
   height="36"
   viewBox="0 0 9.525 9.525"
   width="36"
   version="1.1"
   id="svg605"
   sodipodi:docname="Secure_09_36.svg"
   inkscape:version="1.2.2 (732a01da63, 2022-12-09)"
   xmlns:inkscape="http://www.inkscape.org/namespaces/inkscape"
   xmlns:sodipodi="http://sodipodi.sourceforge.net/DTD/sodipodi-0.dtd"
   xmlns="http://www.w3.org/2000/svg"
   xmlns:svg="http://www.w3.org/2000/svg">
  <defs
     id="defs609" />
  <sodipodi:namedview
     id="namedview607"
     pagecolor="#ffffff"
     bordercolor="#000000"
     borderopacity="0.25"
     inkscape:showpageshadow="2"
     inkscape:pageopacity="0.0"
     inkscape:pagecheckerboard="0"
     inkscape:deskcolor="#d1d1d1"
     showgrid="true"
     inkscape:zoom="25.277778"
     inkscape:cx="17.98022"
     inkscape:cy="18"
     inkscape:current-layer="svg605">
    <inkscape:grid
       type="xygrid"
       id="grid890" />
  </sodipodi:namedview>
  <linearGradient
     id="a"
     gradientUnits="userSpaceOnUse"
     x1="5.291667"
     x2="4.233333"
     y1="4.7625"
     y2="2.910416">
    <stop
       offset="0"
       stop-color="#f2f2f2"
       id="stop584" />
    <stop
       offset="1"
       stop-color="#d4d4d4"
       id="stop586" />
  </linearGradient>
  <linearGradient
     id="b"
     gradientTransform="matrix(2.2359079 0 0 2.3215553 .029829 -.25391)"
     gradientUnits="userSpaceOnUse"
     x1="1.499774"
     x2="3.614834"
     y1="1.322335"
     y2="2.204926">
    <stop
       offset="0"
       stop-color="#80b5fe"
       id="stop589" />
    <stop
       offset="1"
       stop-color="#2a7efe"
       id="stop591" />
  </linearGradient>
  <linearGradient
     id="c"
     gradientTransform="matrix(2.2359079 0 0 2.3215553 .029829 -.25391)"
     gradientUnits="userSpaceOnUse"
     x1=".530372"
     x2="3.879216"
     y1="1.145817"
     y2="2.557962">
    <stop
       offset="0"
       stop-color="#e7c962"
       id="stop594" />
    <stop
       offset="1"
       stop-color="#d4a41c"
       id="stop596" />
  </linearGradient>
  <g
     stroke-linecap="round"
     stroke-linejoin="round"
     id="g603">
    <path
       d="m1.0186466 5.2747436-.0000001-3.6881694c1.1822695 0 2.7586291-.61469507 3.7438538-1.22939005.9852247.61469498 2.5615841 1.22939005 3.7438536 1.22939005v3.6881694c0 1.4384023-1.9704493 3.6881696-3.7438536 3.8930683-1.7734042-.2048987-3.7438536-2.454666-3.7438537-3.8930683z"
       fill="url(#b)"
       stroke="url(#c)"
       stroke-width=".449793"
       id="path599" />
    <path
       d="m4.7625001 2.8277961c-.5919141-.0002569-1.0718195.4796485-1.0715625 1.0715623.00135.3814144.205416.733338.5357812.9239612v1.3381031c-.0001285.2959573.2398241.5359099.5357813.5357812.2959569.0001287.5359095-.2398239.535781-.5357812v-1.3381031c.3303657-.1906232.5344373-.5425468.5357813-.9239612.0002569-.5919138-.4796483-1.0718192-1.0715623-1.0715623z"
       fill="url(#a)"
       stroke-linecap="round"
       stroke-linejoin="round"
       stroke-width=".343809"
       id="path601" />
  </g>
</svg>
