<?xml version="1.0" encoding="UTF-8" standalone="no"?>
<svg
   width="24"
   height="24"
   version="1.1"
   viewBox="0 0 24 24"
   id="svg7"
   sodipodi:docname="tcolorbox.svg"
   inkscape:export-filename="tcolorbox.png"
   inkscape:export-xdpi="96"
   inkscape:export-ydpi="96"
   inkscape:version="1.3.2 (091e20e, 2023-11-25, custom)"
   xmlns:inkscape="http://www.inkscape.org/namespaces/inkscape"
   xmlns:sodipodi="http://sodipodi.sourceforge.net/DTD/sodipodi-0.dtd"
   xmlns="http://www.w3.org/2000/svg"
   xmlns:svg="http://www.w3.org/2000/svg">
  <defs
     id="defs7" />
  <sodipodi:namedview
     id="namedview7"
     pagecolor="#ffffff"
     bordercolor="#000000"
     borderopacity="0.25"
     inkscape:showpageshadow="2"
     inkscape:pageopacity="0.0"
     inkscape:pagecheckerboard="0"
     inkscape:deskcolor="#d1d1d1"
     showgrid="true"
     inkscape:current-layer="svg7">
    <inkscape:grid
       id="grid7"
       units="px"
       originx="0"
       originy="0"
       spacingx="0.5"
       spacingy="0.5"
       empcolor="#0099e5"
       empopacity="0.30196078"
       color="#0099e5"
       opacity="0.14901961"
       empspacing="2"
       dotted="false"
       gridanglex="30"
       gridanglez="30"
       visible="true" />
  </sodipodi:namedview>
  <rect
     x="2.25"
     y="3.25"
     width="18.5"
     height="18.5"
     fill="#f9f9f9"
     stroke="#2a7efe"
     stroke-width=".5"
     style="paint-order:normal"
     id="rect1" />
  <rect
     transform="rotate(90)"
     x="3.25"
     y="-16.25"
     width="4.5000005"
     height="14.000001"
     fill="#ffffff"
     stroke="#2a7efe"
     stroke-width=".499999"
     style="paint-order:normal"
     id="rect2" />
  <rect
     x="16.25"
     y="3.25"
     width="4.5"
     height="4.5"
     fill="#ffffff"
     stroke="#2a7efe"
     stroke-width=".499999"
     style="paint-order:normal"
     id="rect3" />
  <path
     d="m17.43935 4.8474883 1.06065 1.06065 1.06065-1.060651"
     fill="none"
     stroke="#808080"
     stroke-width=".7"
     id="path3" />
  <path
     d="m4.9999998 19h12.999999"
     fill="none"
     stroke="#37c837"
     stroke-width="2"
     id="path4" />
  <path
     d="m4.9999998 15h12.999999"
     fill="none"
     stroke="#ff0000"
     stroke-width="2"
     id="path5" />
  <path
     d="m4.9999998 11h12.999999"
     fill="#000000"
     fill-rule="evenodd"
     stroke="#0066ff"
     stroke-width="2"
     id="path6" />
  <path
     d="m3.5 5.5h11.5"
     fill="none"
     stroke="#ff6600"
     stroke-width="2"
     id="path7" />
</svg>
