<?xml version="1.0" encoding="UTF-8" standalone="no"?>
<svg
   height="64"
   viewBox="0 0 16.933 16.933"
   width="64"
   version="1.1"
   id="svg20"
   sodipodi:docname="Window_16_64.svg"
   inkscape:version="1.2.2 (732a01da63, 2022-12-09)"
   xmlns:inkscape="http://www.inkscape.org/namespaces/inkscape"
   xmlns:sodipodi="http://sodipodi.sourceforge.net/DTD/sodipodi-0.dtd"
   xmlns="http://www.w3.org/2000/svg"
   xmlns:svg="http://www.w3.org/2000/svg">
  <defs
     id="defs24" />
  <sodipodi:namedview
     id="namedview22"
     pagecolor="#ffffff"
     bordercolor="#000000"
     borderopacity="0.25"
     inkscape:showpageshadow="2"
     inkscape:pageopacity="0.0"
     inkscape:pagecheckerboard="0"
     inkscape:deskcolor="#d1d1d1"
     showgrid="true"
     inkscape:zoom="14.21875"
     inkscape:cx="31.964835"
     inkscape:cy="32"
     inkscape:current-layer="svg20">
    <inkscape:grid
       type="xygrid"
       id="grid1033" />
  </sodipodi:namedview>
  <rect
     fill="#f5f7ff"
     height="14.049098"
     rx="1.164144"
     stroke="#00aad4"
     stroke-linejoin="round"
     stroke-width=".767277"
     width="14.049099"
     x="1.441951"
     y="1.441951"
     id="rect2" />
  <g
     fill="#00aad4"
     id="g18">
    <path
       d="m1.7197578 1.5874687h13.4934842v2.0901672h-13.4934842z"
       fill-rule="evenodd"
       stroke-width="1.05228"
       id="path4" />
    <g
       stroke-linecap="round"
       id="g16">
      <path
         d="m4.7624063 7.4081888.0001204 1.0583133c0 .529156 1.3660932 1.058312 3.703974 1.058312 2.3378813 0 3.7041533-.529156 3.7040933-1.058312l-.00012-1.0583133c0 .5291563-1.366092 1.0583133-3.7039733 1.0583133-2.3378808 0-3.703974-.529157-3.7040944-1.0583133z"
         stroke-linejoin="round"
         stroke-miterlimit="5.6"
         stroke-width=".352773"
         id="path6" />
      <ellipse
         cx="8.466497"
         cy="6.349875"
         rx="3.703973"
         ry="1.058313"
         stroke-width=".211663"
         id="ellipse8" />
      <g
         stroke-linejoin="round"
         stroke-miterlimit="5.6"
         stroke-width=".352773"
         id="g14">
        <path
           d="m4.7624063 9.5248141.0001204 1.0583119c0 .529157 1.3660932 1.058313 3.703974 1.058313 2.3378813 0 3.7041533-.529156 3.7040933-1.058313l-.00012-1.0583119c0 .5291559-1.366092 1.0583119-3.7039733 1.0583119-2.3378808 0-3.703974-.529156-3.7040944-1.0583119z"
           id="path10" />
        <path
           d="m4.7624063 11.641439.0001204 1.058312c0 .529156 1.3660932 1.058313 3.703974 1.058313 2.3378813 0 3.7041533-.529157 3.7040933-1.058313l-.00012-1.058312c0 .529156-1.366092 1.058312-3.7039733 1.058312-2.3378808 0-3.703974-.529156-3.7040944-1.058312z"
           id="path12" />
      </g>
    </g>
  </g>
</svg>
