<?xml version="1.0" encoding="UTF-8" standalone="no"?>
<svg
   height="36"
   viewBox="0 0 9.5249997 9.5250005"
   width="36"
   version="1.1"
   id="svg2"
   sodipodi:docname="Font_25_36.svg"
   inkscape:export-filename="Font_25_36.png"
   inkscape:export-xdpi="96"
   inkscape:export-ydpi="96"
   inkscape:version="1.3-alpha (2a5ddc9d23, 2023-03-29)"
   xmlns:inkscape="http://www.inkscape.org/namespaces/inkscape"
   xmlns:sodipodi="http://sodipodi.sourceforge.net/DTD/sodipodi-0.dtd"
   xmlns="http://www.w3.org/2000/svg"
   xmlns:svg="http://www.w3.org/2000/svg">
  <defs
     id="defs2" />
  <sodipodi:namedview
     id="namedview2"
     pagecolor="#ffffff"
     bordercolor="#000000"
     borderopacity="0.25"
     inkscape:showpageshadow="2"
     inkscape:pageopacity="0.0"
     inkscape:pagecheckerboard="0"
     inkscape:deskcolor="#d1d1d1"
     showgrid="true"
     inkscape:zoom="25.25"
     inkscape:cx="17.980198"
     inkscape:cy="18"
     inkscape:current-layer="svg2">
    <inkscape:grid
       id="grid2"
       units="px"
       originx="0"
       originy="0"
       spacingx="0.13229166"
       spacingy="0.13229167"
       empcolor="#0099e5"
       empopacity="0.30196078"
       color="#0099e5"
       opacity="0.14901961"
       empspacing="2"
       dotted="false"
       gridanglex="30"
       gridanglez="30"
       visible="true" />
  </sodipodi:namedview>
  <g
     fill="#00aad4"
     id="g2">
    <path
       d="m7.6687642 9.1903207 1.0340698-1.3335247c.1233577-.1590793.1971788-.399017.0912227-.5879463-.0936887-.167059-.3305617-.1877942-.4950306-.1229795-.1404259.0553391-.2175782.2059081-.2304661.3502443-.1326242-.00127-.27033.00255-.399796-.00189.03462-.279153.1834652-.5645885.453649-.6788463.2258493-.095511.4895696-.086248.7180874-.0029.2310916.084288.3749764.3151927.3965695.5553852.026339.292982-.1136625.5649268-.2856988.7911526l-.7369131.9690309h1.0421224v.3969532h-1.5878158z"
       stroke-width=".264582"
       id="path1" />
    <text
       stroke-linejoin="round"
       stroke-width=".396875"
       x="-6.870345"
       y="4.06802"
       id="text1"><tspan
         stroke-width=".396875"
         x="-6.870345"
         y="4.06802"
         id="tspan1" /></text>
    <path
       d="m1.8010838 1.6787963 2.0490916 3.0314412-2.1436129 3.136091h1.3435578l1.4617044-2.136863 1.4009471 2.136863h1.3435512l-2.1166061-3.08883 2.0220937-3.0787022h-1.3503125l-1.3030507 2.1166073-1.357058-2.1166073z"
       stroke-width=".264582"
       id="path2" />
  </g>
</svg>
