<?xml version="1.0" encoding="UTF-8" standalone="no"?>
<svg
   height="48"
   viewBox="0 0 12.7 12.7"
   width="48"
   version="1.1"
   id="svg803"
   sodipodi:docname="Setup_08_48.svg"
   inkscape:version="1.2.2 (732a01da63, 2022-12-09)"
   xmlns:inkscape="http://www.inkscape.org/namespaces/inkscape"
   xmlns:sodipodi="http://sodipodi.sourceforge.net/DTD/sodipodi-0.dtd"
   xmlns="http://www.w3.org/2000/svg"
   xmlns:svg="http://www.w3.org/2000/svg">
  <defs
     id="defs807" />
  <sodipodi:namedview
     id="namedview805"
     pagecolor="#ffffff"
     bordercolor="#000000"
     borderopacity="0.25"
     inkscape:showpageshadow="2"
     inkscape:pageopacity="0.0"
     inkscape:pagecheckerboard="0"
     inkscape:deskcolor="#d1d1d1"
     showgrid="true"
     inkscape:zoom="18.958333"
     inkscape:cx="23.973626"
     inkscape:cy="24"
     inkscape:current-layer="svg803">
    <inkscape:grid
       type="xygrid"
       id="grid1030" />
  </sodipodi:namedview>
  <radialGradient
     id="a"
     cx="7.487501"
     cy="6.25"
     gradientTransform="matrix(-.00000011 .95250004 -.95249988 -.00000027 13.533438 .051595)"
     gradientUnits="userSpaceOnUse"
     r="2.25">
    <stop
       offset="0"
       stop-color="#fce99c"
       id="stop773" />
    <stop
       offset="1"
       stop-color="#fc0"
       id="stop775" />
  </radialGradient>
  <radialGradient
     id="b"
     cx="7.487501"
     cy="6.25"
     gradientTransform="matrix(-.00000007 .95250004 -.95250004 -.00000011 10.358438 .051594)"
     gradientUnits="userSpaceOnUse"
     r="2.25">
    <stop
       offset="0"
       stop-color="#a0c2f8"
       id="stop778" />
    <stop
       offset="1"
       stop-color="#2672e5"
       id="stop780" />
  </radialGradient>
  <radialGradient
     id="c"
     cx="7.487501"
     cy="6.25"
     gradientTransform="matrix(-.00000006 .95250004 -.95250004 -.00000016 11.945937 -3.123406)"
     gradientUnits="userSpaceOnUse"
     r="2.25">
    <stop
       offset="0"
       stop-color="#f99"
       id="stop783" />
    <stop
       offset="1"
       stop-color="#d40000"
       id="stop785" />
  </radialGradient>
  <radialGradient
     id="d"
     cx="5"
     cy="11"
     gradientTransform="matrix(-.00000002 1.091406 -1.091406 -.00000003 15.974217 -1.488278)"
     gradientUnits="userSpaceOnUse"
     r="8.000001">
    <stop
       offset="0"
       stop-color="#e5e5e5"
       id="stop788" />
    <stop
       offset="1"
       stop-color="#b3b3b3"
       id="stop790" />
  </radialGradient>
  <g
     stroke-width=".396874"
     id="g801">
    <path
       d="m12.500878 8.0413464-1.18971-1.051122-.000459-1.2803777 1.190858-1.0515669-.605522-1.461865-1.585612.098519-.9050404-.9056895.09797-1.58453155-1.462017-.6055892-1.0511218 1.18971125-1.2803781.0004594-1.0515659-1.19085965-1.4618662.6055246.098495 1.58563455-.9056887.9050387-1.58450935-.097997-.6055882 1.462021 1.18971085 1.0511559.0004596 1.2803771-1.19085945 1.051534.6055242 1.461866 1.58563555-.0985.9050387.9056906-.097998 1.584508 1.4620218.605588 1.0511219-1.18971 1.2803775-.000461 1.0515676 1.19086 1.461864-.605523-.09849-1.585637.9056894-.9050396 1.584508.098z"
       fill="url(#d)"
       stroke="#b3b3b3"
       stroke-linejoin="round"
       id="path793" />
    <circle
       cx="6.349999"
       cy="4.365627"
       fill="url(#c)"
       r="1.785938"
       stroke="#a00"
       id="circle795" />
    <circle
       cx="4.762499"
       cy="7.540627"
       fill="url(#b)"
       r="1.785938"
       stroke="#0055d4"
       id="circle797" />
    <circle
       cx="7.9375"
       cy="7.540627"
       fill="url(#a)"
       r="1.785938"
       stroke="#d4aa00"
       id="circle799" />
  </g>
</svg>
