<?xml version="1.0" encoding="UTF-8" standalone="no"?>
<svg
   height="32"
   width="32"
   version="1.1"
   id="svg39"
   sodipodi:docname="pkg_open_200.svg"
   inkscape:export-filename="pkg_open_200.png"
   inkscape:export-xdpi="96"
   inkscape:export-ydpi="96"
   inkscape:version="1.2.1 (9c6d41e410, 2022-07-14)"
   xmlns:inkscape="http://www.inkscape.org/namespaces/inkscape"
   xmlns:sodipodi="http://sodipodi.sourceforge.net/DTD/sodipodi-0.dtd"
   xmlns:xlink="http://www.w3.org/1999/xlink"
   xmlns="http://www.w3.org/2000/svg"
   xmlns:svg="http://www.w3.org/2000/svg">
  <defs
     id="defs43">
    <linearGradient
       id="e-8"
       gradientUnits="userSpaceOnUse"
       x1="35.5"
       x2="39.5"
       y1="4.5"
       y2="7.5"
       gradientTransform="matrix(-0.82015188,-0.57214587,-0.57214587,0.82015188,49.884694,31.634929)">
      <stop
         offset="0"
         stop-color="#fff2c0"
         id="stop180" />
      <stop
         offset="1"
         stop-color="#ffe88c"
         id="stop182" />
    </linearGradient>
    <linearGradient
       id="f-8"
       gradientTransform="rotate(34.9,12.978842,-24.130702)"
       gradientUnits="userSpaceOnUse"
       x1="33.5"
       x2="34.5"
       xlink:href="#a"
       y1="10"
       y2="9" />
    <linearGradient
       id="linearGradient1804">
      <stop
         offset="0"
         stop-color="#e6b900"
         id="stop168" />
      <stop
         offset="1"
         stop-color="#ffea91"
         id="stop170" />
    </linearGradient>
    <linearGradient
       id="g-9"
       gradientUnits="userSpaceOnUse"
       x1="33.5"
       x2="34.5"
       xlink:href="#a"
       y1="10"
       y2="9"
       gradientTransform="matrix(-0.82015188,-0.57214587,-0.57214587,0.82015188,49.941081,30.914027)" />
  </defs>
  <sodipodi:namedview
     id="namedview41"
     pagecolor="#ffffff"
     bordercolor="#666666"
     borderopacity="1.0"
     inkscape:showpageshadow="2"
     inkscape:pageopacity="0.0"
     inkscape:pagecheckerboard="0"
     inkscape:deskcolor="#d1d1d1"
     showgrid="true"
     inkscape:zoom="28.6875"
     inkscape:cx="16"
     inkscape:cy="16"
     inkscape:current-layer="svg39">
    <inkscape:grid
       type="xygrid"
       id="grid1752" />
  </sodipodi:namedview>
  <linearGradient
     id="a">
    <stop
       offset="0"
       stop-color="#e6b900"
       id="stop2" />
    <stop
       offset="1"
       stop-color="#ffea91"
       id="stop4" />
  </linearGradient>
  <linearGradient
     id="b">
    <stop
       offset="0"
       stop-color="#ffe9c7"
       id="stop7" />
    <stop
       offset="1"
       stop-color="#d9c19d"
       id="stop9" />
  </linearGradient>
  <linearGradient
     id="c"
     gradientUnits="userSpaceOnUse"
     x1="12"
     x2="13"
     xlink:href="#b"
     y1="17"
     y2="26" />
  <linearGradient
     id="d"
     gradientUnits="userSpaceOnUse"
     x1="13"
     x2="14"
     xlink:href="#b"
     y1="21"
     y2="26" />
  <linearGradient
     id="e"
     gradientUnits="userSpaceOnUse"
     x1="35.5"
     x2="39.5"
     y1="4.5"
     y2="7.5">
    <stop
       offset="0"
       stop-color="#fff2c0"
       id="stop14" />
    <stop
       offset="1"
       stop-color="#ffe88c"
       id="stop16" />
  </linearGradient>
  <linearGradient
     id="f"
     gradientTransform="matrix(-1,0,0,1,75,0)"
     gradientUnits="userSpaceOnUse"
     x1="33.5"
     x2="34.5"
     xlink:href="#a"
     y1="10"
     y2="9" />
  <linearGradient
     id="g"
     gradientUnits="userSpaceOnUse"
     x1="33.5"
     x2="34.5"
     xlink:href="#a"
     y1="10"
     y2="9" />
  <path
     d="m2.5 27.5v-19h8l1 4h16.5l-.5 15z"
     fill="url(#c)"
     stroke="#e4a060"
     stroke-linejoin="round"
     id="path21" />
  <g
     id="g1829"
     transform="matrix(2.0000029,0,0,2.0000029,-10.000034,-22.000033)">
    <path
       d="m 17.5,11.75 2.25,5.5 h -6 l -2,-5.5 z"
       fill="url(#e)"
       fill-rule="evenodd"
       stroke="#c49d00"
       stroke-linejoin="round"
       stroke-width="0.5"
       id="path189"
       style="fill:url(#e-8)"
       sodipodi:nodetypes="ccccc" />
    <path
       d="m 11.75,11.75 -2,3 2,5.5 2,-3 z"
       fill="url(#f)"
       fill-rule="evenodd"
       stroke="#c49d00"
       stroke-linejoin="round"
       stroke-width="0.5"
       id="path191"
       style="fill:url(#f-8);stroke-linecap:round"
       sodipodi:nodetypes="ccccc" />
    <path
       d="M 18.3,14.15 H 12.75"
       fill="none"
       stroke="#5f8dd3"
       stroke-width="0.75"
       id="path193"
       style="stroke-linecap:round"
       sodipodi:nodetypes="cc" />
    <path
       d="m 19.75,17.25 -2,3 h -6 l 2,-3 z"
       fill="url(#g)"
       fill-rule="evenodd"
       stroke="#c49d00"
       stroke-linejoin="round"
       stroke-width="0.5"
       id="path195"
       style="fill:url(#g-9);stroke-linecap:round"
       sodipodi:nodetypes="ccccc" />
    <path
       d="m 15.075,11.95 1.875,5.18"
       fill="none"
       stroke="#5f8dd3"
       stroke-width="0.75"
       id="path197"
       style="stroke-linecap:round"
       sodipodi:nodetypes="cc" />
    <path
       d="M 10.805,17 12.75,14.15"
       fill="none"
       stroke="#5f8dd3"
       stroke-width="0.75"
       id="path1550"
       style="stroke-linecap:round"
       sodipodi:nodetypes="cc" />
    <path
       d="M 14.955,20.05 16.95,17.13"
       fill="none"
       stroke="#5f8dd3"
       stroke-width="0.75"
       id="path1552"
       style="stroke-linecap:round"
       sodipodi:nodetypes="cc" />
  </g>
  <path
     d="m31.5 15.5h-25l-4 12h25z"
     fill="url(#d)"
     stroke="#e4a060"
     stroke-linejoin="round"
     id="path37" />
</svg>
