<?xml version="1.0" encoding="UTF-8" standalone="no"?>
<svg
   height="16"
   width="16"
   version="1.1"
   id="svg16"
   sodipodi:docname="Forward_02_16.svg"
   xml:space="preserve"
   inkscape:version="1.2-beta (1b65182ce9, 2022-04-05)"
   inkscape:export-filename="Forward_02_16.png"
   inkscape:export-xdpi="96"
   inkscape:export-ydpi="96"
   xmlns:inkscape="http://www.inkscape.org/namespaces/inkscape"
   xmlns:sodipodi="http://sodipodi.sourceforge.net/DTD/sodipodi-0.dtd"
   xmlns="http://www.w3.org/2000/svg"
   xmlns:svg="http://www.w3.org/2000/svg"><defs
     id="defs20" /><sodipodi:namedview
     id="namedview18"
     pagecolor="#ffffff"
     bordercolor="#666666"
     borderopacity="1.0"
     inkscape:pageshadow="2"
     inkscape:pageopacity="0.0"
     inkscape:pagecheckerboard="0"
     inkscape:deskcolor="#d1d1d1"
     showgrid="true"
     inkscape:zoom="57.375"
     inkscape:cx="6.5185185"
     inkscape:cy="8"
     inkscape:current-layer="svg16"
     showguides="true"><inkscape:grid
       type="xygrid"
       id="grid294" /></sodipodi:namedview><g
     id="g1349"
     transform="matrix(-1,0,0,1,16,0)"><circle
       style="fill:none;stroke:#00aad4;stroke-linecap:round;stroke-linejoin:round;stroke-dashoffset:1.49998"
       id="path355"
       cx="-8"
       cy="8"
       r="7"
       transform="scale(-1,1)" /><path
       style="fill:#00aad4;fill-opacity:1;stroke:#00aad4;stroke-width:1px;stroke-linecap:round;stroke-linejoin:round;stroke-opacity:1"
       d="M 10.499993,5.5 7.5,8 l 2.999993,2.5 z"
       id="path966"
       sodipodi:nodetypes="cccc" /><path
       style="fill:none;stroke:#00aad4;stroke-width:1px;stroke-linecap:round;stroke-linejoin:miter;stroke-opacity:1"
       d="m 5.5,5.5 v 5"
       id="path444" /></g></svg>
