<?xml version="1.0" encoding="UTF-8" standalone="no"?>
<svg
   width="24"
   height="24"
   version="1.1"
   viewBox="0 0 24 24"
   id="svg23"
   sodipodi:docname="tsynautocomplete.svg"
   inkscape:version="1.3.2 (091e20e, 2023-11-25, custom)"
   xmlns:inkscape="http://www.inkscape.org/namespaces/inkscape"
   xmlns:sodipodi="http://sodipodi.sourceforge.net/DTD/sodipodi-0.dtd"
   xmlns="http://www.w3.org/2000/svg"
   xmlns:svg="http://www.w3.org/2000/svg">
  <sodipodi:namedview
     id="namedview23"
     pagecolor="#ffffff"
     bordercolor="#000000"
     borderopacity="0.25"
     inkscape:showpageshadow="2"
     inkscape:pageopacity="0.0"
     inkscape:pagecheckerboard="0"
     inkscape:deskcolor="#d1d1d1"
     showgrid="true"
     inkscape:current-layer="svg23">
    <inkscape:grid
       id="grid23"
       units="px"
       originx="0"
       originy="0"
       spacingx="0.5"
       spacingy="0.5"
       empcolor="#0099e5"
       empopacity="0.30196078"
       color="#0099e5"
       opacity="0.14901961"
       empspacing="2"
       dotted="false"
       gridanglex="30"
       gridanglez="30"
       visible="true" />
  </sodipodi:namedview>
  <defs
     id="defs10">
    <linearGradient
       id="c"
       x1="34"
       x2="37"
       y1="1029.3622"
       y2="1029.3622"
       gradientTransform="matrix(1.1666668,0,0,0.92787041,-24.446139,-967.55166)"
       gradientUnits="userSpaceOnUse">
      <stop
         stop-color="#999999"
         offset="0"
         id="stop1" />
      <stop
         stop-color="#ffffff"
         offset=".49999997"
         id="stop2" />
      <stop
         stop-color="#999999"
         offset="1"
         id="stop3" />
    </linearGradient>
    <linearGradient
       id="b"
       x1="34"
       x2="37"
       y1="1027.3622"
       y2="1027.3622"
       gradientTransform="matrix(1.1666668,0,0,0.92787041,-24.446139,-967.55166)"
       gradientUnits="userSpaceOnUse">
      <stop
         stop-color="#aa0000"
         offset="0"
         id="stop4" />
      <stop
         stop-color="#ff0000"
         offset=".51070523"
         id="stop5" />
      <stop
         stop-color="#aa0000"
         offset="1"
         id="stop6" />
    </linearGradient>
    <linearGradient
       id="a"
       x1="34"
       x2="37"
       y1="1033.8622"
       y2="1033.8622"
       gradientTransform="matrix(1.1666668,0,0,0.92787041,-24.446139,-967.55166)"
       gradientUnits="userSpaceOnUse">
      <stop
         stop-color="#a05a2c"
         offset="0"
         id="stop7" />
      <stop
         stop-color="#ffff00"
         offset=".26457807"
         id="stop8" />
      <stop
         stop-color="#ffff00"
         offset=".75078517"
         id="stop9" />
      <stop
         stop-color="#a05a2c"
         offset="1"
         id="stop10" />
    </linearGradient>
  </defs>
  <rect
     x="1.25"
     y="1.2499826"
     width="20.5"
     height="21.5"
     fill="#ffffff"
     fill-rule="evenodd"
     stroke="#2a7efe"
     stroke-linecap="square"
     stroke-linejoin="round"
     stroke-width="0.5"
     style="paint-order:normal"
     id="rect10" />
  <rect
     x="13.25"
     y="9.2499828"
     width="9.5"
     height="10.5"
     fill="#ffffff"
     stroke="#808080"
     stroke-linejoin="round"
     stroke-width="0.5"
     id="rect11" />
  <rect
     x="1.5"
     y="1.4999826"
     width="3.5"
     height="21.000017"
     fill="#b3b3b3"
     fill-rule="evenodd"
     style="paint-order:normal"
     id="rect12" />
  <rect
     transform="rotate(45)"
     x="15.220557"
     y="-13.364777"
     width="3.5000005"
     height="1.855757"
     fill="url(#c)"
     fill-rule="evenodd"
     style="fill:url(#c);paint-order:normal"
     id="rect13" />
  <rect
     transform="rotate(45)"
     x="15.220557"
     y="-15.220551"
     width="3.5000005"
     height="1.855757"
     fill="url(#b)"
     fill-rule="evenodd"
     style="fill:url(#b);paint-order:normal"
     id="rect14" />
  <rect
     transform="rotate(45)"
     x="15.220557"
     y="-11.509064"
     width="3.5000005"
     height="6.4951086"
     fill="url(#a)"
     fill-rule="evenodd"
     style="fill:url(#a);paint-order:normal"
     id="rect15" />
  <path
     d="m 14.307958,7.2172 -0.762652,1.8611 1.375739,1.3757 1.861787,-0.762 z"
     fill="#d38d5f"
     fill-rule="evenodd"
     id="path15" />
  <path
     d="M 13.545306,9.0783 14.921045,10.454 13.5,11 13,10.5 Z"
     fill="#333333"
     fill-rule="evenodd"
     id="path16" />
  <path
     d="m 15,11.5 h 6"
     fill="#ffffff"
     stroke="#808080"
     stroke-linejoin="round"
     id="path17" />
  <path
     d="m 15,13.5 h 5"
     fill="#ffffff"
     stroke="#808080"
     stroke-linejoin="round"
     id="path18" />
  <path
     d="m 15,15.5 h 6"
     fill="#ffffff"
     stroke="#808080"
     stroke-linejoin="round"
     id="path19" />
  <path
     d="m 15,17.5 h 5"
     fill="#ffffff"
     stroke="#808080"
     stroke-linejoin="round"
     id="path20" />
  <path
     d="M 11.5997,7.358 H 6.4 L 11.5997,3.65 H 6.4"
     fill="none"
     stroke="#2c5aa0"
     stroke-linecap="round"
     stroke-linejoin="round"
     stroke-width="0.8"
     id="path21" />
  <path
     d="M 6.7394,13.5536 C 6.5106,13.8855 6.4,14.3784 6.4,14.9671 c 0,0.8321 0.4375,1.5892 1.3469,1.5892 0.7125,0 1.0054,-0.6011 1.1768,-1.5892 0.2387,-1.3758 0.7026,-1.5891 1.3291,-1.5891 1.132,0 1.3469,0.9422 1.3469,1.5891 0,0.5023 -0.061,1.0177 -0.3959,1.6643"
     fill="none"
     stroke="#2c5aa0"
     stroke-linecap="round"
     stroke-linejoin="round"
     stroke-width="0.8"
     id="path22" />
  <path
     d="M 11.5998,10.4929 H 9.5049 M 6.4001,12.082 9.5049,10.4929 6.4001,8.9037"
     fill="none"
     stroke="#2c5aa0"
     stroke-linecap="round"
     stroke-linejoin="round"
     stroke-width="0.8"
     id="path23" />
</svg>
