<?xml version="1.0" encoding="UTF-8" standalone="no"?>
<svg
   height="24"
   width="24"
   version="1.1"
   id="svg16"
   sodipodi:docname="Folder_06_24.svg"
   inkscape:export-filename="Folder_06_24.png"
   inkscape:export-xdpi="96"
   inkscape:export-ydpi="96"
   inkscape:version="1.2-beta (1b65182ce9, 2022-04-05)"
   xml:space="preserve"
   xmlns:inkscape="http://www.inkscape.org/namespaces/inkscape"
   xmlns:sodipodi="http://sodipodi.sourceforge.net/DTD/sodipodi-0.dtd"
   xmlns="http://www.w3.org/2000/svg"
   xmlns:svg="http://www.w3.org/2000/svg"><defs
     id="defs20" /><sodipodi:namedview
     id="namedview18"
     pagecolor="#ffffff"
     bordercolor="#666666"
     borderopacity="1.0"
     inkscape:pageshadow="2"
     inkscape:pageopacity="0.0"
     inkscape:pagecheckerboard="0"
     inkscape:deskcolor="#d1d1d1"
     showgrid="true"
     inkscape:zoom="38.25"
     inkscape:cx="11.607843"
     inkscape:cy="12"
     inkscape:current-layer="svg16"
     showguides="true"><inkscape:grid
       type="xygrid"
       id="grid849" /></sodipodi:namedview><path
     d="M 23.25,8.75 H 3.75 l -3,12.5 h 19.5 z"
     stroke-linecap="round"
     id="path10"
     style="fill:none;stroke:#00aad4;stroke-width:1.5;stroke-linejoin:round"
     sodipodi:nodetypes="ccccc" /><path
     d="M 0.750267,21.248887 0.75,4.75 c 0,-1.25 0.750133,-2 2.000133,-2 h 3.7499338 c 1.5000004,0 2.0000004,0.75 2.0000004,2 H 20.25 v 4"
     id="path8-5"
     style="fill:none;stroke:#00aad4;stroke-width:1.5;stroke-linecap:round;stroke-linejoin:round"
     sodipodi:nodetypes="ccccccc" /></svg>
