<?xml version="1.0" encoding="UTF-8" standalone="no"?>
<svg
   height="24"
   width="24"
   version="1.1"
   id="svg966"
   sodipodi:docname="Help_03_24.svg"
   inkscape:export-filename="Help_03_24.png"
   inkscape:export-xdpi="96"
   inkscape:export-ydpi="96"
   inkscape:version="1.2-beta (1b65182ce9, 2022-04-05)"
   xmlns:inkscape="http://www.inkscape.org/namespaces/inkscape"
   xmlns:sodipodi="http://sodipodi.sourceforge.net/DTD/sodipodi-0.dtd"
   xmlns="http://www.w3.org/2000/svg"
   xmlns:svg="http://www.w3.org/2000/svg">
  <defs
     id="defs970" />
  <sodipodi:namedview
     id="namedview968"
     pagecolor="#ffffff"
     bordercolor="#666666"
     borderopacity="1.0"
     inkscape:pageshadow="2"
     inkscape:pageopacity="0.0"
     inkscape:pagecheckerboard="0"
     inkscape:deskcolor="#d1d1d1"
     showgrid="true"
     inkscape:zoom="38.25"
     inkscape:cx="12"
     inkscape:cy="12"
     inkscape:current-layer="svg966">
    <inkscape:grid
       type="xygrid"
       id="grid1089" />
  </sodipodi:namedview>
  <path
     d="m13.005354 14.568516h-2.154329c-.0057-.309771-.0084-.498452-.0084-.566039 0-.698395.115454-1.272882.346383-1.723459.23092-.450579.692762-.957479 1.385527-1.520702.692762-.563223 1.106732-.932133 1.241906-1.106732.208391-.27598.312588-.58012.312588-.912421 0-.461842-.185864-.856098-.557591-1.182767-.366094-.332301-.861729-.498452-1.486905-.498452-.602649 0-1.106733.171784-1.512255.515349-.405568.343565-.6843635.867362-.8364335 1.571391l-2.179671-.270346c.06195-1.008169.490003-1.864268 1.284147-2.568296.799777-.704028 1.8473705-1.056042 3.1427825-1.056042 1.362997 0 2.447201.3576464 3.25261 1.072939.805405.70966 1.208113 1.537597 1.208113 2.483811 0 .523798-.149249 1.019434-.447763 1.486907-.292874.467475-.923681 1.103916-1.892426 1.909325-.501267.416785-.813857.751901-.937765 1.005352-.118275.253451-.171784.706843-.160518 1.360182zm-2.154329 4.181484v-2.373982h2.373984v2.373982z"
     fill="#00aad4"
     stroke-width="1.49999"
     id="path962" />
  <circle
     cx="12"
     cy="12"
     fill="none"
     r="10.5"
     stroke="#00aad4"
     stroke-linecap="round"
     stroke-linejoin="round"
     stroke-width="1.5"
     id="circle964" />
</svg>
