<?xml version="1.0" encoding="UTF-8" standalone="no"?>
<svg
   width="48"
   height="48"
   version="1.1"
   viewBox="0 0 48 48"
   id="svg9"
   sodipodi:docname="tdbcalendar_200.svg"
   inkscape:export-filename="tdbcalendar_200.png"
   inkscape:export-xdpi="96"
   inkscape:export-ydpi="96"
   inkscape:version="1.3.2 (091e20e, 2023-11-25, custom)"
   xmlns:inkscape="http://www.inkscape.org/namespaces/inkscape"
   xmlns:sodipodi="http://sodipodi.sourceforge.net/DTD/sodipodi-0.dtd"
   xmlns="http://www.w3.org/2000/svg"
   xmlns:svg="http://www.w3.org/2000/svg">
  <sodipodi:namedview
     id="namedview9"
     pagecolor="#ffffff"
     bordercolor="#000000"
     borderopacity="0.25"
     inkscape:showpageshadow="2"
     inkscape:pageopacity="0.0"
     inkscape:pagecheckerboard="0"
     inkscape:deskcolor="#d1d1d1"
     showgrid="true"
     inkscape:current-layer="svg9">
    <inkscape:grid
       id="grid9"
       units="px"
       originx="0"
       originy="0"
       spacingx="0.5"
       spacingy="0.5"
       empcolor="#0099e5"
       empopacity="0.30196078"
       color="#0099e5"
       opacity="0.14901961"
       empspacing="2"
       dotted="false"
       gridanglex="30"
       gridanglez="30"
       visible="true" />
  </sodipodi:namedview>
  <defs
     id="defs3">
    <linearGradient
       id="a"
       x1="4"
       x2="28"
       y1="4"
       y2="4"
       gradientUnits="userSpaceOnUse">
      <stop
         stop-color="#4276c4"
         offset="0"
         id="stop1" />
      <stop
         stop-color="#80b3ff"
         offset=".3333333"
         id="stop2" />
      <stop
         stop-color="#04a"
         offset="1"
         id="stop3" />
    </linearGradient>
  </defs>
  <ellipse
     cx="16"
     cy="27"
     rx="10.2"
     ry="3.2"
     fill="none"
     stroke="url(#a)"
     stroke-linecap="round"
     stroke-linejoin="round"
     stroke-width="3.6"
     id="ellipse3" />
  <ellipse
     cx="16"
     cy="24.4"
     rx="9.8"
     ry="2.8"
     fill="none"
     stroke="#ffffff"
     stroke-linecap="round"
     stroke-linejoin="round"
     stroke-width="2.4"
     id="ellipse4" />
  <ellipse
     cx="16"
     cy="21"
     rx="10.2"
     ry="3.2"
     fill="none"
     stroke="url(#a)"
     stroke-linecap="round"
     stroke-linejoin="round"
     stroke-width="3.6"
     id="ellipse5" />
  <ellipse
     cx="16"
     cy="18.4"
     rx="9.8"
     ry="2.8"
     fill="none"
     stroke="#ffffff"
     stroke-linecap="round"
     stroke-linejoin="round"
     stroke-width="2.4"
     id="ellipse6" />
  <ellipse
     cx="16"
     cy="15"
     rx="10.2"
     ry="3.2"
     fill="none"
     stroke="url(#a)"
     stroke-linecap="round"
     stroke-linejoin="round"
     stroke-width="3.6"
     id="ellipse7" />
  <ellipse
     cx="16"
     cy="12.4"
     rx="9.8"
     ry="2.8"
     fill="none"
     stroke="#ffffff"
     stroke-linecap="round"
     stroke-linejoin="round"
     stroke-width="2.4"
     id="ellipse8" />
  <ellipse
     cx="16"
     cy="9"
     rx="10.8"
     ry="3.8"
     fill="#80b3ff"
     fill-rule="evenodd"
     stroke="url(#a)"
     stroke-linecap="round"
     stroke-linejoin="round"
     stroke-width="2.4"
     id="ellipse9" />
  <rect
     x="21.489468"
     y="25.489468"
     width="23.021063"
     height="22.021097"
     fill="#ffffff"
     stroke="#999999"
     stroke-linecap="round"
     stroke-width="0.978936"
     style="paint-order:normal"
     id="rect2" />
  <path
     d="M 23,21 H 42.999966 A 2.0000348,2.0000348 0 0 1 45,23 v 4 H 21 v -4 a 2,2 0 0 1 2,-2 z"
     fill="#d40000"
     style="paint-order:normal"
     id="path2" />
  <path
     d="m 29.793603,42.178052 v -10.3562 l -3.08221,1.9726"
     fill="none"
     stroke="#4d4d4d"
     stroke-linecap="round"
     stroke-linejoin="round"
     stroke-width="1.64384"
     id="path3" />
  <path
     d="m 37.310019,31.822052 -3.397952,6.2162 m -0.300678,1.181 c 0,-1.3618 1.103954,-2.4658 2.465754,-2.4658 1.361798,0 2.465752,1.104 2.465752,2.4658 v 0.4932 c 0,1.3616 -1.103954,2.4656 -2.465752,2.4656 -1.3618,0 -2.465754,-1.104 -2.465754,-2.4656 z"
     fill="none"
     stroke="#4d4d4d"
     stroke-linecap="round"
     stroke-linejoin="round"
     stroke-width="1.64384"
     id="path4" />
</svg>
