<?xml version="1.0" encoding="UTF-8" standalone="no"?>
<svg
   width="24"
   height="24"
   version="1.1"
   viewBox="0 0 24 24"
   id="svg13"
   sodipodi:docname="tcodytreeview.svg"
   inkscape:version="1.3.2 (091e20e, 2023-11-25, custom)"
   xmlns:inkscape="http://www.inkscape.org/namespaces/inkscape"
   xmlns:sodipodi="http://sodipodi.sourceforge.net/DTD/sodipodi-0.dtd"
   xmlns="http://www.w3.org/2000/svg"
   xmlns:svg="http://www.w3.org/2000/svg">
  <defs
     id="defs13" />
  <sodipodi:namedview
     id="namedview13"
     pagecolor="#ffffff"
     bordercolor="#000000"
     borderopacity="0.25"
     inkscape:showpageshadow="2"
     inkscape:pageopacity="0.0"
     inkscape:pagecheckerboard="0"
     inkscape:deskcolor="#d1d1d1"
     showgrid="true"
     inkscape:current-layer="svg13">
    <inkscape:grid
       id="grid13"
       units="px"
       originx="0"
       originy="0"
       spacingx="0.5"
       spacingy="0.5"
       empcolor="#0099e5"
       empopacity="0.30196078"
       color="#0099e5"
       opacity="0.14901961"
       empspacing="2"
       dotted="false"
       gridanglex="30"
       gridanglez="30"
       visible="true" />
  </sodipodi:namedview>
  <rect
     x="1.25"
     y="1.2499826"
     width="21.5"
     height="21.500017"
     fill="#ffffff"
     stroke="#2a7efe"
     stroke-linecap="round"
     stroke-linejoin="round"
     stroke-width=".5"
     style="paint-order:normal"
     id="rect1" />
  <path
     d="m4.5 4v16"
     fill="none"
     stroke="#666666"
     stroke-linejoin="round"
     stroke-width=".5"
     id="path1" />
  <path
     d="M 7.500001,8.999998 7.5,17"
     fill="none"
     stroke="#666666"
     stroke-linejoin="round"
     stroke-width=".5"
     id="path2" />
  <path
     d="M 7.500001,4.499998 H 19"
     fill="none"
     stroke="#b3b3b3"
     stroke-linejoin="round"
     stroke-width=".999996"
     id="path3" />
  <path
     d="M 7.500001,19.499998 H 18"
     fill="none"
     stroke="#b3b3b3"
     stroke-linejoin="round"
     id="path4" />
  <path
     d="m10.5 10.5h7.5"
     fill="none"
     stroke="#b3b3b3"
     stroke-linejoin="round"
     id="path5" />
  <path
     d="m10.5 13.5h9.5"
     fill="none"
     stroke="#b3b3b3"
     stroke-linejoin="round"
     id="path6" />
  <path
     d="m10.5 16.5h6.5"
     fill="none"
     stroke="#b3b3b3"
     stroke-linejoin="round"
     stroke-width=".999997"
     id="path7" />
  <path
     d="m7.500001 7.499998h9.5"
     fill="none"
     stroke="#b3b3b3"
     stroke-linejoin="round"
     id="path8" />
  <rect
     x="4"
     y="3"
     width="2"
     height="1.9999957"
     fill="#ff6600"
     stroke-width=".666667"
     style="paint-order:normal"
     id="rect8" />
  <rect
     x="4"
     y="6"
     width="2"
     height="1.9999957"
     fill="#0000ff"
     stroke-width=".666667"
     style="paint-order:normal"
     id="rect9" />
  <rect
     x="7"
     y="9"
     width="2"
     height="1.9999952"
     fill="#00aa00"
     stroke-width=".666667"
     style="paint-order:normal"
     id="rect10" />
  <rect
     x="7"
     y="12"
     width="2"
     height="2"
     fill="#ffcc00"
     stroke-width=".666667"
     style="paint-order:normal"
     id="rect11" />
  <rect
     x="7"
     y="15"
     width="2"
     height="2"
     fill="#c83737"
     stroke-width=".666667"
     style="paint-order:normal"
     id="rect12" />
  <rect
     x="4"
     y="18"
     width="2"
     height="2"
     fill="#00ccff"
     stroke-width=".666667"
     style="paint-order:normal"
     id="rect13" />
</svg>
