<svg width="24" height="24" version="1.1" xmlns="http://www.w3.org/2000/svg">
 <defs>
  <radialGradient id="a" cx="12.1" cy="10.900001" r="4.5" gradientTransform="matrix(0,1.5892258,-1.5892254,2.9972889e-8,32.677102,-3.875085)" gradientUnits="userSpaceOnUse">
   <stop stop-color="#5599ff" offset="0"/>
   <stop stop-color="#0055d4" offset="1"/>
  </radialGradient>
 </defs>
 <g stroke="#ffffff" stroke-linecap="round">
  <circle transform="matrix(0,1,1,0,0,0)" cx="17.5" cy="17.5" r="5.9000001" fill="url(#a)" stroke-dashoffset="1.49998" stroke-linejoin="round" stroke-width="1.2"/>
  <path d="m14.875065 17.874991 2.624826 2.624938 2.625046-2.624938" fill="none" stroke-linejoin="round" stroke-width="1.49997"/>
  <path d="m17.499907 20.499927v-5.999855" fill="none" stroke-width="1.49997px"/>
 </g>
</svg>
