<?xml version="1.0" encoding="UTF-8" standalone="no"?>
<svg
   width="32"
   height="32"
   version="1.1"
   id="svg311"
   sodipodi:docname="menu_search_find_previous_200.svg"
   inkscape:export-filename="menu_search_find_previous_200.png"
   inkscape:export-xdpi="96"
   inkscape:export-ydpi="96"
   inkscape:version="1.2.2 (732a01da63, 2022-12-09)"
   xmlns:inkscape="http://www.inkscape.org/namespaces/inkscape"
   xmlns:sodipodi="http://sodipodi.sourceforge.net/DTD/sodipodi-0.dtd"
   xmlns="http://www.w3.org/2000/svg"
   xmlns:svg="http://www.w3.org/2000/svg">
  <sodipodi:namedview
     id="namedview313"
     pagecolor="#ffffff"
     bordercolor="#666666"
     borderopacity="1.0"
     inkscape:showpageshadow="2"
     inkscape:pageopacity="0.0"
     inkscape:pagecheckerboard="0"
     inkscape:deskcolor="#d1d1d1"
     showgrid="true"
     inkscape:zoom="28.6875"
     inkscape:cx="12.061002"
     inkscape:cy="16"
     inkscape:current-layer="svg311">
    <inkscape:grid
       type="xygrid"
       id="grid432" />
  </sodipodi:namedview>
  <defs
     id="defs299">
    <radialGradient
       id="a-9"
       cx="5.9886"
       cy="7.2881"
       r="3.75"
       gradientTransform="matrix(-1.7073e-7,1.0569,-0.97561,-1.5244e-7,14.196,0.14615)"
       gradientUnits="userSpaceOnUse">
      <stop
         stop-color="#f8fbff"
         offset="0"
         id="stop292" />
      <stop
         stop-color="#d1e3ff"
         offset=".66667"
         id="stop294" />
      <stop
         stop-color="#f8fbff"
         offset="1"
         id="stop296" />
    </radialGradient>
  </defs>
  <g
     transform="matrix(2,0,0,2,1,1)"
     stroke-linecap="round"
     id="g305">
    <path
       d="m 11,11 3.5,3.5"
       fill="none"
       stroke="#d4aa00"
       stroke-width="2"
       id="path301" />
    <circle
       cx="8"
       cy="8"
       r="3.125"
       fill="url(#a-9)"
       fill-rule="evenodd"
       stroke="#2a7fff"
       stroke-linejoin="round"
       stroke-width="0.75"
       id="circle303"
       style="fill:url(#a-9)" />
  </g>
  <g
     id="g969"
     transform="matrix(1,0,0,-1,10,29.5)"
     style="stroke:#ff0000">
    <path
       d="m -8.5,21.00009 4,5 4,-5"
       stroke-linejoin="round"
       id="path147"
       style="fill:none;stroke:#ff0000;stroke-width:3;stroke-linecap:round" />
    <path
       d="M -4.5,25.20009 V 5.0000001"
       id="path149"
       style="fill:none;stroke:#ff0000;stroke-width:3;stroke-linecap:round" />
  </g>
</svg>
