<?xml version="1.0" encoding="UTF-8" standalone="no"?>
<svg
   height="32"
   width="32"
   version="1.1"
   id="svg51"
   sodipodi:docname="Grid_04_32.svg"
   inkscape:export-filename="Grid_04_32.png"
   inkscape:export-xdpi="96"
   inkscape:export-ydpi="96"
   inkscape:version="1.2-beta (1b65182ce9, 2022-04-05)"
   xmlns:inkscape="http://www.inkscape.org/namespaces/inkscape"
   xmlns:sodipodi="http://sodipodi.sourceforge.net/DTD/sodipodi-0.dtd"
   xmlns="http://www.w3.org/2000/svg"
   xmlns:svg="http://www.w3.org/2000/svg">
  <defs
     id="defs55" />
  <sodipodi:namedview
     id="namedview53"
     pagecolor="#ffffff"
     bordercolor="#666666"
     borderopacity="1.0"
     inkscape:pageshadow="2"
     inkscape:pageopacity="0.0"
     inkscape:pagecheckerboard="0"
     inkscape:deskcolor="#d1d1d1"
     showgrid="true"
     inkscape:zoom="28.6875"
     inkscape:cx="16"
     inkscape:cy="16"
     inkscape:current-layer="svg51">
    <inkscape:grid
       type="xygrid"
       id="grid1152" />
  </sodipodi:namedview>
  <linearGradient
     id="a"
     gradientUnits="userSpaceOnUse"
     x1="-8.75"
     x2="-13.75"
     y1="-1.75"
     y2="-6.75">
    <stop
       offset="0"
       stop-color="#009600"
       id="stop2" />
    <stop
       offset="1"
       stop-color="#6edb39"
       id="stop4" />
  </linearGradient>
  <linearGradient
     id="b"
     gradientTransform="matrix(0 -.9375 -1.0166667 0 84.133336 49.78125)"
     gradientUnits="userSpaceOnUse"
     x1="9"
     x2="6"
     y1="10"
     y2="10.5">
    <stop
       offset="0"
       stop-color="#72cef6"
       id="stop7" />
    <stop
       offset="1"
       stop-color="#d2f5f8"
       id="stop9" />
  </linearGradient>
  <linearGradient
     id="c"
     gradientTransform="matrix(0 -.9375 -1.0166667 0 84.133336 49.78125)"
     gradientUnits="userSpaceOnUse"
     x1="10"
     x2="5"
     y1="12.5"
     y2="12.5">
    <stop
       offset="0"
       stop-color="#4674a8"
       id="stop12" />
    <stop
       offset="1"
       stop-color="#42a0ce"
       id="stop14" />
  </linearGradient>
  <g
     transform="matrix(0 2 -2 0 100 -136)"
     id="g49">
    <g
       stroke-width=".75"
       id="g35">
      <path
         d="m-83.625-49.625h15.250001v15.250001h-15.250001z"
         fill="#fff"
         stroke="#999"
         stroke-dashoffset="1.49998"
         stroke-linecap="round"
         stroke-linejoin="round"
         transform="scale(-1)"
         id="path17" />
      <g
         fill="none"
         stroke="#b3b3b3"
         transform="matrix(-1 0 0 1 152 0)"
         id="g29">
        <path
           d="m68.75 46.625h14.5"
           id="path19" />
        <path
           d="m72.125 49.25v-14.5"
           id="path21" />
        <path
           d="m83.25 37.375h-14.5"
           id="path23" />
        <path
           d="m80.125 49.25v-14.5"
           id="path25" />
        <path
           d="m76.125 49.25v-14.5"
           id="path27" />
      </g>
      <path
         d="m68.375-45.375h15.25v5.25h-15.25z"
         fill="none"
         opacity=".5"
         stroke="#fff"
         stroke-dashoffset="1.49998"
         stroke-linejoin="round"
         transform="scale(1 -1)"
         id="path31" />
      <path
         d="m83.625003 44.625h-15.250001v-3.75h15.250001z"
         fill="url(#b)"
         stroke="url(#c)"
         stroke-linecap="round"
         stroke-linejoin="round"
         id="path33" />
    </g>
    <g
       transform="matrix(0 -1 -1 0 89.25 34.25)"
       id="g47">
      <g
         stroke-linecap="round"
         id="g43">
        <circle
           cx="-11.25"
           cy="-4.25"
           fill="url(#a)"
           r="4"
           stroke="#008080"
           stroke-dashoffset="1.49998"
           stroke-linejoin="round"
           stroke-width=".5"
           transform="rotate(-90)"
           id="circle37" />
        <path
           d="m-4.25 13.25v-4"
           fill="none"
           stroke="#fff"
           id="path39" />
        <path
           d="m-2.25 11.25h-4"
           fill="none"
           stroke="#fff"
           id="path41" />
      </g>
      <circle
         cx="-4.25"
         cy="-11.25"
         r="4.5"
         style="opacity:.7;fill:none;stroke:#fff;stroke-width:.5;stroke-linejoin:round;stroke-dashoffset:1.49998"
         transform="scale(1 -1)"
         id="circle45" />
    </g>
  </g>
</svg>
