<?xml version="1.0" encoding="UTF-8" standalone="no"?>
<svg
   height="16"
   width="16"
   version="1.1"
   id="svg425"
   sodipodi:docname="menu_toggle_bookmark0.svg"
   inkscape:export-filename="menu_toggle_bookmark0.png"
   inkscape:export-xdpi="96"
   inkscape:export-ydpi="96"
   inkscape:version="1.2.2 (732a01da63, 2022-12-09)"
   xmlns:inkscape="http://www.inkscape.org/namespaces/inkscape"
   xmlns:sodipodi="http://sodipodi.sourceforge.net/DTD/sodipodi-0.dtd"
   xmlns="http://www.w3.org/2000/svg"
   xmlns:svg="http://www.w3.org/2000/svg">
  <defs
     id="defs429" />
  <sodipodi:namedview
     id="namedview427"
     pagecolor="#ffffff"
     bordercolor="#666666"
     borderopacity="1.0"
     inkscape:showpageshadow="2"
     inkscape:pageopacity="0.0"
     inkscape:pagecheckerboard="0"
     inkscape:deskcolor="#d1d1d1"
     showgrid="true"
     inkscape:zoom="57.375"
     inkscape:cx="7.7298475"
     inkscape:cy="8"
     inkscape:current-layer="svg425">
    <inkscape:grid
       type="xygrid"
       id="grid1394" />
  </sodipodi:namedview>
  <radialGradient
     id="a"
     cx="8"
     cy="7.5"
     gradientUnits="userSpaceOnUse"
     r="6">
    <stop
       offset="0"
       stop-color="#2a7fff"
       id="stop414" />
    <stop
       offset=".69999999"
       stop-color="#4d94ff"
       id="stop416" />
    <stop
       offset="1"
       stop-color="#96bdff"
       id="stop418" />
  </radialGradient>
  <circle
     cx="8"
     cy="7.5"
     fill="url(#a)"
     r="6"
     id="circle421" />
  <path
     d="m8 11.130371c-.6461484.015039-1.3604355-.205579-1.7134428-.785169-.3501991-.5269789-.3144669-1.1754554-.3129244-1.7802376.0028154-.9514447-.0057697-1.9030832.004549-2.8544007.0136248-.6603571.3435726-1.3513571.9678173-1.6330338.6010254-.2661684 1.3066898-.2690366 1.9292451-.0760651.6415472.2008801 1.0646429.8317813 1.1263558 1.4847232.04646.5640886.01601 1.1315299.02477 1.6972183-.0044.7209532.0095 1.4423337-.0081 2.1629835-.026206.6579902-.3759912 1.3395012-1.0081811 1.5980722-.3166782.139298-.6665108.185629-1.0100889.185909zm0-.947266c.3909684.02238.8262719-.163903.9499359-.5627627.129117-.3941698.064503-.8141208.080338-1.2216825-.00248-.8793131.00504-1.7588224-.00389-2.6380092-.0032-.4017224-.24727-.828258-.6670379-.9046173-.4361754-.094981-1.014036-.047501-1.2495422.391159-.208128.3976461-.1212802.856987-.1400757 1.2876261.00249.9015123-.00504 1.8032211.00389 2.7046072.00661.3829625.218562.7985904.6172942.8913414.1325836.03875.2713548.05221.4090882.05234z"
     fill="#fff"
     id="path423" />
  <g
     id="g1569">
    <path
       d="M 3.85,0.60000002 H 0.60000002 V 3.85"
       stroke="#00cc00"
       id="path11"
       style="fill:none;stroke-width:1.2;stroke-linecap:round" />
    <path
       d="M 12.15,14.4 H 15.4 V 11.15"
       stroke="#ff0000"
       id="path13"
       style="fill:none;stroke-width:1.2;stroke-linecap:round" />
  </g>
</svg>
