<?xml version="1.0" encoding="UTF-8" standalone="no"?>
<svg
   height="36"
   viewBox="0 0 9.5249997 9.5250005"
   width="36"
   version="1.1"
   id="svg500"
   sodipodi:docname="Health_05_36.svg"
   inkscape:version="1.2.1 (9c6d41e410, 2022-07-14)"
   inkscape:export-filename="Health_05_36.png"
   inkscape:export-xdpi="96"
   inkscape:export-ydpi="96"
   xmlns:inkscape="http://www.inkscape.org/namespaces/inkscape"
   xmlns:sodipodi="http://sodipodi.sourceforge.net/DTD/sodipodi-0.dtd"
   xmlns:xlink="http://www.w3.org/1999/xlink"
   xmlns="http://www.w3.org/2000/svg"
   xmlns:svg="http://www.w3.org/2000/svg">
  <defs
     id="defs504">
    <radialGradient
       inkscape:collect="always"
       xlink:href="#linearGradient1041"
       id="radialGradient1043"
       cx="1.9253448"
       cy="1.5859377"
       fx="1.9253448"
       fy="1.5859377"
       r="1.8520745"
       gradientTransform="matrix(0.58408303,2.4644621,-3.4618551,0.82805261,7.7750525,-2.3295452)"
       gradientUnits="userSpaceOnUse" />
    <linearGradient
       inkscape:collect="always"
       id="linearGradient1041">
      <stop
         style="stop-color:#ffaaaa;stop-opacity:1"
         offset="0"
         id="stop1037" />
      <stop
         style="stop-color:#ff0000;stop-opacity:1"
         offset="1"
         id="stop1039" />
    </linearGradient>
    <linearGradient
       id="a"
       gradientUnits="userSpaceOnUse"
       x1="31.956079"
       x2="21.043919"
       y1="31.956081"
       y2="21.043919"
       gradientTransform="matrix(0.98513933,0,0,0.98513933,0.3938087,0.3938087)">
      <stop
         offset="0"
         stop-color="#009600"
         id="stop974" />
      <stop
         offset="1"
         stop-color="#6edb39"
         id="stop976" />
    </linearGradient>
    <radialGradient
       id="a-2"
       cx="-11.5"
       cy="8.5"
       gradientTransform="matrix(0,1.12,-1.12,0,20.679997,24.039997)"
       gradientUnits="userSpaceOnUse"
       r="3.5">
      <stop
         offset="0"
         stop-color="#fff"
         id="stop2-4" />
      <stop
         offset="1"
         stop-color="#d5e5ff"
         id="stop4-8" />
    </radialGradient>
  </defs>
  <sodipodi:namedview
     id="namedview502"
     pagecolor="#ffffff"
     bordercolor="#666666"
     borderopacity="1.0"
     inkscape:showpageshadow="2"
     inkscape:pageopacity="0.0"
     inkscape:pagecheckerboard="0"
     inkscape:deskcolor="#d1d1d1"
     showgrid="true"
     inkscape:zoom="25.5"
     inkscape:cx="16.882353"
     inkscape:cy="18"
     inkscape:current-layer="svg500">
    <inkscape:grid
       type="xygrid"
       id="grid1268" />
  </sodipodi:namedview>
  <path
     id="path353"
     style="fill:url(#radialGradient1043);fill-opacity:1;stroke:#d40000;stroke-width:0.264582px;stroke-linecap:butt;stroke-linejoin:miter;stroke-opacity:1"
     d="m 2.6120593,0.661463 c -2.1487726,0.00531 -3.7191963,3.946201 2.017954,7.9091762 7.5706717,-5.2294932 2.4159413,-10.4195166 0,-6.5802703 C 4.0449026,1.0605514 3.2987805,0.6597656 2.6120593,0.661463 Z" />
  <g
     id="g5565"
     transform="scale(0.26458334)">
    <path
       style="fill:none;stroke:#ffffff;stroke-width:5.50008;stroke-linecap:butt;stroke-linejoin:round;stroke-dasharray:none;stroke-opacity:1"
       d="M 16.749873,33.249957 25,16.749702 33.250127,33.249957 Z"
       id="path4329" />
    <path
       id="path1369"
       style="fill:#ffd42a;fill-opacity:1;stroke:#806600;stroke-width:1.88037;stroke-linejoin:round;stroke-dasharray:none;stroke-opacity:1"
       d="M 25.000002,16.796589 16.773315,33.249957 H 33.226684 Z" />
    <path
       d="m 25,24.31668 v 2.750042"
       id="path1519"
       style="fill:none;stroke:#000000;stroke-width:1.83336;stroke-linecap:round;stroke-dasharray:none"
       sodipodi:nodetypes="cc" />
    <circle
       style="fill:#000000;stroke:none;stroke-width:1.83336;stroke-linecap:round;stroke-linejoin:round;stroke-miterlimit:5.6;stroke-dasharray:none"
       id="path4081"
       cx="24.999998"
       cy="29.983681"
       r="0.91668087" />
  </g>
</svg>
