<?xml version="1.0" encoding="UTF-8" standalone="no"?>
<svg
   height="24"
   width="24"
   version="1.1"
   id="svg151"
   sodipodi:docname="Comment_01_24.svg"
   inkscape:version="1.2-beta (1b65182ce9, 2022-04-05)"
   xmlns:inkscape="http://www.inkscape.org/namespaces/inkscape"
   xmlns:sodipodi="http://sodipodi.sourceforge.net/DTD/sodipodi-0.dtd"
   xmlns="http://www.w3.org/2000/svg"
   xmlns:svg="http://www.w3.org/2000/svg">
  <defs
     id="defs155" />
  <sodipodi:namedview
     id="namedview153"
     pagecolor="#ffffff"
     bordercolor="#666666"
     borderopacity="1.0"
     inkscape:pageshadow="2"
     inkscape:pageopacity="0.0"
     inkscape:pagecheckerboard="0"
     inkscape:deskcolor="#d1d1d1"
     showgrid="true"
     inkscape:zoom="38.25"
     inkscape:cx="12"
     inkscape:cy="12"
     inkscape:current-layer="svg151">
    <inkscape:grid
       type="xygrid"
       id="grid954" />
  </sodipodi:namedview>
  <g
     fill="none"
     stroke="#00aad4"
     id="g149">
    <path
       d="m7 11.5h11"
       id="path141" />
    <path
       d="m7 14.5h11"
       id="path143" />
    <path
       d="m6.5 4.75h12c2.0775 0 3.75 1.6725 3.75 3.75v6c0 2.0775-1.6725 3.75-3.75 3.75h-6.92575l-3.82425 3.75-.0579045-3.75h-1.1920955c-2.0775 0-3.75-1.6725-3.75-3.75v-6c0-2.0775 1.6725-3.75 3.75-3.75z"
       stroke-dashoffset="1.49998"
       stroke-linecap="round"
       stroke-linejoin="round"
       stroke-width="1.5"
       id="path145" />
    <path
       d="m7 8.5h11"
       id="path147" />
  </g>
</svg>
