<?xml version="1.0" encoding="UTF-8" standalone="no"?>
<svg
   height="64"
   width="64"
   version="1.1"
   id="svg748"
   sodipodi:docname="Book_01_64.svg"
   inkscape:export-filename="Book_01_64.png"
   inkscape:export-xdpi="96"
   inkscape:export-ydpi="96"
   inkscape:version="1.2-beta (1b65182ce9, 2022-04-05)"
   xmlns:inkscape="http://www.inkscape.org/namespaces/inkscape"
   xmlns:sodipodi="http://sodipodi.sourceforge.net/DTD/sodipodi-0.dtd"
   xmlns:xlink="http://www.w3.org/1999/xlink"
   xmlns="http://www.w3.org/2000/svg"
   xmlns:svg="http://www.w3.org/2000/svg">
  <defs
     id="defs752">
    <linearGradient
       id="d"
       gradientUnits="userSpaceOnUse"
       x1="16"
       x2="16"
       y1="12.606477"
       y2="27.606478">
      <stop
         offset="0"
         stop-color="#f2f2f2"
         id="stop345" />
      <stop
         offset="1"
         stop-color="#3771c8"
         id="stop347" />
    </linearGradient>
    <linearGradient
       id="e"
       gradientUnits="userSpaceOnUse"
       x1="20"
       x2="8"
       y1="26.205889"
       y2="3.205889">
      <stop
         offset="0"
         stop-color="#2c5aa0"
         id="stop350" />
      <stop
         offset="1"
         stop-color="#87aade"
         id="stop352" />
    </linearGradient>
    <linearGradient
       id="b"
       gradientUnits="userSpaceOnUse"
       x1="10"
       x2="16"
       xlink:href="#a"
       y1="15.606477"
       y2="15.594807" />
    <linearGradient
       id="a">
      <stop
         offset="0"
         stop-color="#fff"
         id="stop338" />
      <stop
         offset="1"
         stop-color="#ccc"
         id="stop340" />
    </linearGradient>
    <linearGradient
       id="c"
       gradientTransform="matrix(-2,0,0,2,32,-0.393523)"
       gradientUnits="userSpaceOnUse"
       x1="5"
       x2="8"
       xlink:href="#a"
       y1="8"
       y2="7.9941649" />
  </defs>
  <sodipodi:namedview
     id="namedview750"
     pagecolor="#ffffff"
     bordercolor="#666666"
     borderopacity="1.0"
     inkscape:pageshadow="2"
     inkscape:pageopacity="0.0"
     inkscape:pagecheckerboard="0"
     inkscape:deskcolor="#d1d1d1"
     showgrid="true"
     inkscape:zoom="14.34375"
     inkscape:cx="30.431373"
     inkscape:cy="32"
     inkscape:current-layer="svg748">
    <inkscape:grid
       type="xygrid"
       id="grid1444" />
  </sodipodi:namedview>
  <g
     id="g1571"
     transform="matrix(2.0000008,0,0,2.0000008,-1.28e-5,-1.3253806e-5)">
    <g
       fill-rule="evenodd"
       id="g361">
      <path
         d="M 16,5.6064778 C 12.507763,3.2398658 7,2.6043266 2,5.6043266 L 1,26.606477 c 4,-1 8,-2 12,0 1.578125,2.476562 4.476878,2.465864 6,0 4,-2 8,-1 12,0 L 30,5.6043266 c -5,-3 -10.505482,-2.4875018 -14,0.00216 z"
         fill="url(#d)"
         stroke="url(#e)"
         stroke-linejoin="round"
         stroke-width="2"
         id="path355"
         style="fill:url(#d);stroke:url(#e)" />
      <path
         d="m 16,25.606477 c -4.360532,-4.07014 -8.683218,-3.4045 -13,-2 L 4,6.6121386 C 8.336936,5.3949808 11.67248,4.7704608 16,7.6064778"
         fill="url(#b)"
         id="path357"
         style="fill:url(#b)" />
      <path
         d="m 16,25.606477 c 4.360532,-4.07014 8.683218,-3.4045 13,-2 L 28,6.6121386 C 23.663064,5.3949808 20.32752,4.7704608 16,7.6064778"
         fill="url(#c)"
         id="path359"
         style="fill:url(#c)" />
    </g>
    <g
       fill="none"
       stroke="#808080"
       stroke-width="0.75"
       transform="matrix(2,0,0,2,0,0.392392)"
       id="g369">
      <path
         d="M 2.5,4.756932 C 4.0482745,4.2766132 5.5836558,4.1676461 7,5"
         id="path363" />
      <path
         d="M 2.5,8.756932 C 4.0482745,8.2766132 5.5836558,8.1676461 7,9"
         id="path365" />
      <path
         d="M 2.5,6.756932 C 4.0482745,6.2766132 5.5836558,6.1676461 7,7"
         id="path367" />
    </g>
    <g
       fill="none"
       stroke="#808080"
       stroke-width="0.75"
       transform="matrix(2,0,0,2,13,0.392392)"
       id="g377">
      <path
         d="M 2.5,4.756932 C 4.0482745,4.2766132 5.5836558,4.1676461 7,5"
         id="path371" />
      <path
         d="M 2.5,8.756932 C 4.0482745,8.2766132 5.5836558,8.1676461 7,9"
         id="path373" />
      <path
         d="M 2.5,6.756932 C 4.0482745,6.2766132 5.5836558,6.1676461 7,7"
         id="path375" />
    </g>
  </g>
</svg>
