<?xml version="1.0" encoding="UTF-8" standalone="no"?>
<svg
   height="48"
   width="48"
   version="1.1"
   id="svg756"
   sodipodi:docname="02 Install_150.svg"
   inkscape:export-filename="02 Install_150.png"
   inkscape:export-xdpi="96"
   inkscape:export-ydpi="96"
   inkscape:version="1.2.1 (9c6d41e410, 2022-07-14)"
   xmlns:inkscape="http://www.inkscape.org/namespaces/inkscape"
   xmlns:sodipodi="http://sodipodi.sourceforge.net/DTD/sodipodi-0.dtd"
   xmlns:xlink="http://www.w3.org/1999/xlink"
   xmlns="http://www.w3.org/2000/svg"
   xmlns:svg="http://www.w3.org/2000/svg">
  <defs
     id="defs760">
    <linearGradient
       id="linearGradient1347"
       x1="8.8369999"
       x2="15.576"
       y1="7.8053999"
       y2="10.838"
       gradientTransform="matrix(0.39262,0,0,0.39262,2.7483,3.1533)"
       gradientUnits="userSpaceOnUse"
       xlink:href="#linearGradient933-3" />
    <linearGradient
       id="linearGradient933-3">
      <stop
         stop-color="#ffe991"
         offset="0"
         id="stop472"
         style="stop-color:#e6e6e6" />
      <stop
         stop-color="#f5c400"
         offset="1"
         id="stop474"
         style="stop-color:#bcbcbc" />
    </linearGradient>
    <linearGradient
       id="linearGradient1351"
       x1="8.8369999"
       x2="15.576"
       y1="7.8013"
       y2="10.834"
       gradientTransform="matrix(-0.39262,0,0,0.39262,9.4226,3.1549)"
       gradientUnits="userSpaceOnUse"
       xlink:href="#linearGradient933-3" />
    <linearGradient
       id="linearGradient1355"
       x1="1.4239"
       x2="15.576"
       y1="4.4317002"
       y2="4.4317002"
       gradientTransform="matrix(-0.39262,0,0,0.39262,9.4226,3.1549)"
       gradientUnits="userSpaceOnUse">
      <stop
         stop-color="#ffe478"
         offset="0"
         id="stop478"
         style="stop-color:#e0e0e0" />
      <stop
         stop-color="#fff2c0"
         offset="1"
         id="stop480"
         style="stop-color:#f0f0f0" />
    </linearGradient>
  </defs>
  <sodipodi:namedview
     id="namedview758"
     pagecolor="#ffffff"
     bordercolor="#666666"
     borderopacity="1.0"
     inkscape:showpageshadow="2"
     inkscape:pageopacity="0.0"
     inkscape:pagecheckerboard="0"
     inkscape:deskcolor="#d1d1d1"
     showgrid="true"
     inkscape:zoom="19.125"
     inkscape:cx="23.189542"
     inkscape:cy="24"
     inkscape:current-layer="svg756">
    <inkscape:grid
       type="xygrid"
       id="grid3665" />
  </sodipodi:namedview>
  <linearGradient
     id="a"
     gradientUnits="userSpaceOnUse"
     x1="22"
     x2="28"
     y1="18.02074"
     y2="23.02074">
    <stop
       offset="0"
       stop-color="#ffe991"
       id="stop699" />
    <stop
       offset="1"
       stop-color="#e6b800"
       id="stop701" />
  </linearGradient>
  <linearGradient
     id="b"
     gradientUnits="userSpaceOnUse"
     x1="8"
     x2="2"
     y1="14.02074"
     y2="20.02074">
    <stop
       offset="0"
       stop-color="#ffea91"
       id="stop704" />
    <stop
       offset="1"
       stop-color="#e6b900"
       id="stop706" />
  </linearGradient>
  <linearGradient
     id="c"
     gradientUnits="userSpaceOnUse"
     x1="9"
     x2="27"
     y1="6.02074"
     y2="9.02074">
    <stop
       offset="0"
       stop-color="#fff2c0"
       id="stop709" />
    <stop
       offset="1"
       stop-color="#ffe478"
       id="stop711" />
  </linearGradient>
  <linearGradient
     id="d"
     gradientUnits="userSpaceOnUse"
     x1="10.5"
     x2="21.5"
     y1="10.5"
     y2="21.5">
    <stop
       offset="0"
       stop-color="#b9b9b9"
       id="stop714" />
    <stop
       offset=".30717328"
       stop-color="#f9f9f9"
       id="stop716" />
    <stop
       offset=".45454547"
       stop-color="#fff"
       id="stop718" />
    <stop
       offset=".54545456"
       stop-color="#f2f2f2"
       id="stop720" />
    <stop
       offset="1"
       stop-color="#ccc"
       id="stop722" />
  </linearGradient>
  <filter
     id="e"
     color-interpolation-filters="sRGB"
     height="1.1825"
     width="1.1825"
     x="-0.091250001"
     y="-0.091250001">
    <feGaussianBlur
       stdDeviation=".4"
       id="feGaussianBlur725" />
  </filter>
  <g
     transform="matrix(7.4902678,0,0,7.5171024,-21.581859,-24.248215)"
     stroke-width="0.31984"
     id="g503">
    <g
       stroke="#ccaa00"
       stroke-linejoin="round"
       id="g491"
       style="stroke:#a1a1a1">
      <path
         d="M 6.0854,6.2942 8.9958,4.8949 V 7.4084 L 6.0854,8.9959 Z"
         fill="url(#linearGradient1347)"
         id="path485"
         style="fill:url(#linearGradient1347);stroke:#a1a1a1" />
      <path
         d="M 6.0854,6.2177 3.175,4.8948 v 2.5135 l 2.9104,1.5875 z"
         fill="url(#linearGradient1351)"
         id="path487"
         style="fill:url(#linearGradient1351);stroke:#a1a1a1" />
      <path
         d="M 6.0854,3.5719 3.175,4.8948 6.0854,6.2177 8.9958,4.8948 Z"
         fill="url(#linearGradient1355)"
         id="path489"
         style="fill:url(#linearGradient1355);stroke:#a1a1a1" />
    </g>
    <g
       fill="none"
       stroke="#5f8dd3"
       stroke-linecap="round"
       id="g501"
       style="stroke:#878787">
      <path
         d="M 4.736,4.2069 7.6729,5.5563"
         id="path493"
         style="stroke:#878787" />
      <path
         d="M 4.4979,5.5563 7.4348,4.2069"
         id="path495"
         style="stroke:#878787" />
      <path
         d="M 4.4979,5.5563 V 8.1228"
         id="path497"
         style="stroke:#878787" />
      <path
         d="M 7.6729,5.5563 V 8.1228"
         id="path499"
         style="stroke:#878787" />
    </g>
  </g>
  <g
     stroke-linecap="round"
     stroke-linejoin="round"
     transform="matrix(1.5 0 0 1.5 8.2500005 8.25)"
     id="g754">
    <path
       d="m-24-10c-2.617994 0-5.219111 1.0784863-7.070312 2.9296875-1.851202 1.8512012-2.929688 4.4523186-2.929688 7.0703125s1.078486 5.2191113 2.929688 7.0703125c1.851201 1.8512012 4.452318 2.9296875 7.070312 2.9296875s5.219111-1.0784863 7.070312-2.9296875c1.851202-1.8512012 2.929688-4.4523186 2.929688-7.0703125s-1.078486-5.2191113-2.929688-7.0703125c-1.851201-1.8512012-4.452318-2.9296875-7.070312-2.9296875zm0 7c-.19635 0 .778514.0969.585938.058594-.192577-.038306.743903.2450615.5625.1699218-.181404-.07514.680836.3864297.517578.2773438-.163259-.109086.593918.5118869.455078.3730468-.13884-.13884.482133.6183369.373047.4550782s.352483.69898142.277343.5175781c-.07514-.1814033.208228.75507674.169922.5625-.038306-.19257694.058594.78228684.058594.5859373s-.0969.77851424-.05859.5859375-.245061.7439033-.169922.5625c.07514-.18140332-.386429.6808368-.277343.5175781s-.511887.5939182-.373047.4550782c.13884-.1388401-.618337.4821328-.455078.3730468.163258-.1090859-.698982.3524835-.517578.2773438.181403-.07514-.755077.2082277-.5625.1699218.192572-.0383058-.782292.0585938-.585942.0585938s-.778514-.0969-.585938-.058594c.192577.038306-.743903-.2450615-.5625-.1699218.181404.07514-.680836-.3864297-.517578-.2773438.163259.109086-.593918-.5118869-.455078-.3730468.13884.13884-.482133-.6183369-.373047-.4550782s-.352483-.69898142-.277343-.5175781c.07514.1814033-.208228-.75507674-.169922-.5625.038306.19257694-.058594-.78228684-.058594-.5859373s.0969-.77851424.05859-.5859375.245061-.7439033.169922-.5625c-.07514.18140332.386429-.6808368.277343-.5175781s.511887-.5939182.373047-.4550782c-.13884.1388401.618337-.4821328.455078-.3730468-.163258.1090859.698982-.3524835.517578-.2773438-.181403.07514.755077-.2082277.5625-.1699218-.192572.0383058.782292-.0585938.585942-.0585938z"
       fill="#fff"
       fill-rule="evenodd"
       stroke="#fff"
       transform="translate(40 16)"
       id="path748"
       style="stroke:#ffffff;fill:#ffffff" />
    <path
       d="m16 7a9 9 0 0 0 -9 9 9 9 0 0 0 9 9 9 9 0 0 0 9-9 9 9 0 0 0 -9-9zm0 7a2 2 0 0 1 2 2 2 2 0 0 1 -2 2 2 2 0 0 1 -2-2 2 2 0 0 1 2-2z"
       fill="url(#d)"
       fill-rule="evenodd"
       stroke="#939dac"
       id="path750"
       style="stroke:#9c9c9c" />
    <circle
       cx="16"
       cy="16"
       fill="none"
       filter="url(#e)"
       r="8"
       stroke="#fff"
       id="circle752"
       style="stroke:#ffffff" />
  </g>
  <linearGradient
     gradientUnits="userSpaceOnUse"
     x1="10.5"
     x2="21.5"
     y1="10.5"
     y2="21.5"
     id="linearGradient8416">
    <stop
       offset="0"
       stop-color="#b9b9b9"
       id="stop2742"
       style="stop-color:#b9b9b9" />
    <stop
       offset=".30717328"
       stop-color="#f9f9f9"
       id="stop2744"
       style="stop-color:#f9f9f9" />
    <stop
       offset=".45454547"
       stop-color="#fff"
       id="stop2746"
       style="stop-color:#ffffff" />
    <stop
       offset=".54545456"
       stop-color="#f2f2f2"
       id="stop2748"
       style="stop-color:#f2f2f2" />
    <stop
       offset="1"
       stop-color="#ccc"
       id="stop2750"
       style="stop-color:#cccccc" />
  </linearGradient>
</svg>
