<?xml version="1.0" encoding="UTF-8" standalone="no"?>
<svg
   width="36"
   height="36"
   version="1.1"
   viewBox="0 0 9.525 9.525"
   id="svg401"
   sodipodi:docname="Health_11_36.svg"
   inkscape:export-filename="Health_11_36.png"
   inkscape:export-xdpi="96"
   inkscape:export-ydpi="96"
   inkscape:version="1.2.1 (9c6d41e410, 2022-07-14)"
   xmlns:inkscape="http://www.inkscape.org/namespaces/inkscape"
   xmlns:sodipodi="http://sodipodi.sourceforge.net/DTD/sodipodi-0.dtd"
   xmlns="http://www.w3.org/2000/svg"
   xmlns:svg="http://www.w3.org/2000/svg">
  <defs
     id="defs405" />
  <sodipodi:namedview
     id="namedview403"
     pagecolor="#ffffff"
     bordercolor="#666666"
     borderopacity="1.0"
     inkscape:showpageshadow="2"
     inkscape:pageopacity="0.0"
     inkscape:pagecheckerboard="0"
     inkscape:deskcolor="#d1d1d1"
     showgrid="true"
     inkscape:zoom="25.5"
     inkscape:cx="17.980392"
     inkscape:cy="18"
     inkscape:current-layer="svg401">
    <inkscape:grid
       type="xygrid"
       id="grid955" />
  </sodipodi:namedview>
  <g
     fill="none"
     stroke="#00aad4"
     stroke-width=".47625"
     id="g399">
    <path
       d="m2.7706 6.7532c0.52001 0.55321 1.1763 1.12 1.9914 1.6873 0.7775-0.54116 1.4106-1.0819 1.9187-1.6108m1.2829-1.7538c1.7065-3.3623-1.4884-5.5413-3.2016-2.7981-0.54383-0.8708-1.2373-1.2461-1.8756-1.2446-1.2902 0.0032136-2.356 1.5446-1.5114 3.636"
       id="path395" />
    <path
       d="m0.78969 6.1183h0.57921l0.83964-0.86176 0.56754 0.57451 1.1351-2.2856 1.7026 2.8601 1.1351-1.4363 0.85132 1.149 1.1351-1.172e-4"
       stroke-linecap="round"
       stroke-linejoin="round"
       id="path397" />
  </g>
</svg>
