<svg width="32" height="32" version="1.1" xmlns="http://www.w3.org/2000/svg">
 <linearGradient id="a" x1="52.5" x2="61.5" y1="7" y2="7" gradientTransform="matrix(2.2754208,0,0,1.9723765,-114.18418,10.290048)" gradientUnits="userSpaceOnUse">
  <stop stop-color="#fc0" offset="0"/>
  <stop stop-color="#f9f9f9" offset=".37840304"/>
  <stop stop-color="#ffd42a" offset="1"/>
 </linearGradient>
 <radialGradient id="b" cx="33.463123" cy="-1.059664" r="5.5" gradientTransform="matrix(1.6363626,-1.2727274,1.2727278,1.6363632,-37.409136,57.323424)" gradientUnits="userSpaceOnUse">
  <stop offset="0"/>
  <stop stop-color="#e6e6e6" offset="1"/>
 </radialGradient>
 <path d="m5 17h22v14h-22z" fill="url(#a)" stroke="#d4aa00" stroke-linejoin="round" stroke-width="2"/>
 <path d="m16 1c-5.501311 0-10 4.4986882-10 10v5h3.6363638v-5c0-3.5360748 2.8275622-6.3636364 6.3636362-6.3636364 3.536073 0 6.363636 2.8275616 6.363636 6.3636364v5h3.636364v-5c0-5.5013118-4.498688-10-10-10z" fill="url(#b)"/>
</svg>
