<?xml version="1.0" encoding="UTF-8" standalone="no"?>
<svg
   height="16"
   viewBox="0 0 4.2333332 4.2333335"
   width="16"
   version="1.1"
   id="svg16"
   sodipodi:docname="Color_02_16.svg"
   inkscape:export-filename="Color_02_16.png"
   inkscape:export-xdpi="96"
   inkscape:export-ydpi="96"
   inkscape:version="1.2 (dc2aedaf03, 2022-05-15)"
   xmlns:inkscape="http://www.inkscape.org/namespaces/inkscape"
   xmlns:sodipodi="http://sodipodi.sourceforge.net/DTD/sodipodi-0.dtd"
   xmlns="http://www.w3.org/2000/svg"
   xmlns:svg="http://www.w3.org/2000/svg">
  <defs
     id="defs20" />
  <sodipodi:namedview
     id="namedview18"
     pagecolor="#ffffff"
     bordercolor="#666666"
     borderopacity="1.0"
     inkscape:showpageshadow="2"
     inkscape:pageopacity="0.0"
     inkscape:pagecheckerboard="0"
     inkscape:deskcolor="#d1d1d1"
     showgrid="false"
     inkscape:zoom="14.75"
     inkscape:cx="7.0169492"
     inkscape:cy="8"
     inkscape:current-layer="svg16" />
  <g
     stroke="#fff"
     stroke-linecap="round"
     stroke-linejoin="round"
     stroke-width=".264583"
     transform="translate(.000035)"
     id="g14">
    <path
       d="m2.1166667 2.1166667.9921827-1.7194734.0000048-.0003183h-1.984375z"
       fill="#ff8080"
       id="path2" />
    <path
       d="m2.1166667 2.1166667 1.9844108-.0004813-.000824.0004813-.9921923-1.7197917z"
       fill="#00d400"
       id="path4" />
    <path
       d="m2.1166667 2.1166667-1.98441084-.0004813.00003581.0004813.99218753-1.71979167z"
       fill="#f00"
       id="path6" />
    <path
       d="m2.1166667 2.1166665.9921827 1.7194734.0000048.0003183h-1.984375z"
       fill="#06f"
       id="path8" />
    <path
       d="m2.1166667 2.1166665 1.9844108.0004813-.000824-.0004813-.9921923 1.7197917z"
       fill="#0f0"
       id="path10" />
    <path
       d="m2.1166667 2.1166665-1.98441084.0004813.00003581-.0004813.99218753 1.7197917z"
       fill="#59f"
       id="path12" />
  </g>
</svg>
