<?xml version="1.0" encoding="UTF-8" standalone="no"?>
<svg
   height="24"
   width="24"
   version="1.1"
   id="svg709"
   sodipodi:docname="File_20_24.svg"
   inkscape:export-filename="File_20_24.png"
   inkscape:export-xdpi="96"
   inkscape:export-ydpi="96"
   inkscape:version="1.2.1 (9c6d41e410, 2022-07-14)"
   xmlns:inkscape="http://www.inkscape.org/namespaces/inkscape"
   xmlns:sodipodi="http://sodipodi.sourceforge.net/DTD/sodipodi-0.dtd"
   xmlns="http://www.w3.org/2000/svg"
   xmlns:svg="http://www.w3.org/2000/svg">
  <defs
     id="defs713" />
  <sodipodi:namedview
     id="namedview711"
     pagecolor="#ffffff"
     bordercolor="#666666"
     borderopacity="1.0"
     inkscape:showpageshadow="2"
     inkscape:pageopacity="0.0"
     inkscape:pagecheckerboard="0"
     inkscape:deskcolor="#d1d1d1"
     showgrid="true"
     inkscape:zoom="38.25"
     inkscape:cx="11.986928"
     inkscape:cy="12"
     inkscape:current-layer="svg709">
    <inkscape:grid
       type="xygrid"
       id="grid832" />
  </sodipodi:namedview>
  <g
     fill="none"
     stroke="#00aad4"
     stroke-linecap="round"
     stroke-linejoin="round"
     id="g707">
    <path
       d="m3.75 23.25v-22.5h11.25l5.25 5.25v17.25z"
       stroke-width="1.5"
       id="path695" />
    <path
       d="m14.75 1v5.249999h5.25"
       stroke-width="1.5"
       id="path697" />
    <g
       stroke-width="1.2"
       id="g705">
      <path
         d="m11.691429 3.6v16.8"
         id="path699" />
      <path
         d="m6.6 12.6h10.8"
         id="path701" />
      <path
         d="m11.691429 3.6h-5.091429v16.8h10.8v-11.4"
         id="path703" />
    </g>
  </g>
</svg>
