<?xml version="1.0" encoding="UTF-8" standalone="no"?>
<svg
   height="32"
   width="32"
   version="1.1"
   id="svg12"
   sodipodi:docname="Setup_01_32.svg"
   inkscape:export-filename="Setup_01_32.png"
   inkscape:export-xdpi="96"
   inkscape:export-ydpi="96"
   inkscape:version="1.2-beta (1b65182ce9, 2022-04-05)"
   xmlns:inkscape="http://www.inkscape.org/namespaces/inkscape"
   xmlns:sodipodi="http://sodipodi.sourceforge.net/DTD/sodipodi-0.dtd"
   xmlns="http://www.w3.org/2000/svg"
   xmlns:svg="http://www.w3.org/2000/svg">
  <defs
     id="defs16" />
  <sodipodi:namedview
     id="namedview14"
     pagecolor="#ffffff"
     bordercolor="#666666"
     borderopacity="1.0"
     inkscape:pageshadow="2"
     inkscape:pageopacity="0.0"
     inkscape:pagecheckerboard="0"
     inkscape:deskcolor="#d1d1d1"
     showgrid="true"
     inkscape:zoom="28.6875"
     inkscape:cx="15.023965"
     inkscape:cy="16"
     inkscape:current-layer="svg12">
    <inkscape:grid
       type="xygrid"
       id="grid303" />
  </sodipodi:namedview>
  <path
     d="M 18.505559,2.2514097 16.326956,6.0825492 13.673187,6.0835029 11.49366,2.2499804 8.463732,3.5050178 9.6332818,7.7568849 7.7561102,9.63271 3.5065804,8.4641897 2.2514092,11.49444 l 3.8311391,2.178605 9.529e-4,2.653769 -3.8335208,2.179527 1.2550368,3.029928 4.2518688,-1.169551 1.8758238,1.877172 -1.1685193,4.24953 3.0302515,1.25517 2.178603,-3.831138 2.65377,-9.54e-4 2.179526,3.833523 3.029928,-1.255037 -1.169551,-4.251868 1.877172,-1.875823 4.249529,1.168518 L 27.74859,18.50556 23.917451,16.326957 23.916498,13.673186 27.750019,11.49366 26.494983,8.4637319 22.243115,9.633283 20.367291,7.756111 21.535809,3.5065801 Z m -1.831998,8.7082563 a 4.373227,4.373227 0 0 1 2.366775,5.713896 4.373227,4.373227 0 0 1 -5.713898,2.366774 4.373227,4.373227 0 0 1 -2.366773,-5.713897 4.373227,4.373227 0 0 1 5.713896,-2.366773 z"
     fill="#ffd81c"
     fill-rule="evenodd"
     stroke="#b48b18"
     stroke-width="1.5"
     id="path2"
     style="stroke-linejoin:round" />
  <g
     transform="matrix(2,0,0,2,87.417023,1.731915)"
     id="g8"
     style="stroke-linejoin:round">
    <path
       d="m -36.208511,6.634043 h 8 v 8 h -8 z"
       fill="#ffffff"
       fill-rule="evenodd"
       stroke="#3566a5"
       stroke-linecap="square"
       stroke-opacity="0.996078"
       id="path4" />
    <path
       d="m -34.45346,11.134043 1.5,1.5 3,-3.8063829"
       fill="none"
       stroke="#000000"
       stroke-linecap="round"
       id="path6" />
  </g>
</svg>
