<?xml version="1.0" encoding="UTF-8" standalone="no"?>
<svg
   height="40"
   viewBox="0 0 40 40"
   width="40"
   version="1.1"
   id="svg44"
   sodipodi:docname="lazarusicon 40.svg"
   inkscape:export-filename="lazarusicon 40.png"
   inkscape:export-xdpi="96"
   inkscape:export-ydpi="96"
   inkscape:version="1.1.1 (3bf5ae0d25, 2021-09-20)"
   xmlns:inkscape="http://www.inkscape.org/namespaces/inkscape"
   xmlns:sodipodi="http://sodipodi.sourceforge.net/DTD/sodipodi-0.dtd"
   xmlns="http://www.w3.org/2000/svg"
   xmlns:svg="http://www.w3.org/2000/svg">
  <defs
     id="defs48" />
  <sodipodi:namedview
     id="namedview46"
     pagecolor="#ffffff"
     bordercolor="#666666"
     borderopacity="1.0"
     inkscape:pageshadow="2"
     inkscape:pageopacity="0.0"
     inkscape:pagecheckerboard="0"
     showgrid="false"
     inkscape:zoom="22.825"
     inkscape:cx="18.707558"
     inkscape:cy="20"
     inkscape:current-layer="svg44" />
  <radialGradient
     id="a"
     cx="19.999605"
     cy="19.999768"
     gradientUnits="userSpaceOnUse"
     r="22.50074333">
    <stop
       offset="0"
       stop-color="#b3c9ec"
       id="stop2" />
    <stop
       offset="1"
       stop-color="#fff"
       id="stop4" />
  </radialGradient>
  <radialGradient
     id="b"
     cx="19.99877167"
     cy="19.99893467"
     gradientUnits="userSpaceOnUse"
     r="19.16575667">
    <stop
       offset="0"
       stop-color="#598bd4"
       id="stop7" />
    <stop
       offset=".56522"
       stop-color="#9ab8e5"
       id="stop9" />
    <stop
       offset="1"
       stop-color="#fff"
       id="stop11" />
  </radialGradient>
  <path
     d="m32.776 32.186c.57322.18548 1.6408.04347 2.2381-.43445.59722-.47796 1.1677-1.4482 1.5843-2.1698.41669-.72164.97168-1.7007 1.087-2.4569.11529-.75625-.29552-1.7517-.7428-2.1553-1.8065-1.6305-2.414-2.0169-2.4135-4.9705-.000476-2.9537.60693-3.34 2.4135-4.9705.44728-.40367.8581-1.3992.7428-2.1553-.11535-.75617-.6704-1.7352-1.087-2.4569-.41664-.72164-.98709-1.6918-1.5843-2.1697-.59728-.47795-1.6648-.61992-2.2381-.43446-2.3154.74915-2.9537 1.082-5.5116-.39527-2.5583-1.4764-2.5892-2.1956-3.0982-4.5752-.12594-.58914-.78268-1.4427-1.4953-1.7208-.71257-.27823-1.838-.28712-2.6713-.28712-.83333 0-1.9588.008882-2.6713.28712-.71257.27822-1.3694 1.1317-1.4954 1.7208-.50887 2.3797-.53981 3.0988-3.0982 4.5752-2.5578 1.4772-3.1962 1.1444-5.5116.39527-.57322-.18547-1.6408-.043528-2.2381.43446-.59728.47795-1.1677 1.4481-1.5843 2.1697-.4167.72164-.97168 1.7007-1.087 2.4569-.11535.75625.29552 1.7517.74275 2.1553 1.8065 1.6305 2.414 2.0169 2.4135 4.9705.0004761 2.9537-.60693 3.34-2.4135 4.9705-.44722.40367-.85804 1.3992-.74275 2.1553.11535.75617.67034 1.7352 1.087 2.4569.41664.72164.98703 1.6918 1.5843 2.1698.59722.47795 1.6648.61992 2.2381.43445 2.3154-.74915 2.9537-1.082 5.5116.39526 2.5583 1.4764 2.5893 2.1956 3.0982 4.5752.126.58914.78274 1.4427 1.4954 1.7208.71257.27822 1.838.28712 2.6713.28712.83333 0 1.9588-.0089 2.6713-.28712.71257-.27823 1.3693-1.1317 1.4953-1.7208.50893-2.3797.53981-3.0988 3.0982-4.5752 2.5579-1.4772 3.1962-1.1444 5.5116-.39527z"
     fill="url(#a)"
     stroke-width=".83333"
     id="path14" />
  <path
     d="m33.353 15.001c-1.8527 1.4464-9.1866 1.6657-12.52 3.3324-2.6659 1.333-2.9646 2.4927-5 6.6667-1.0911 2.2375-5.7113 3.2297-6.2868 3.5658-.60422.35291-2.7972 2.48-3.8215 3.73.79163-.0099 5.6916-.47486 7.011.28715 2.5583 1.4764 2.5884 2.1955 3.0973 4.5752.126.58914.78321 1.4422 1.4957 1.7204.71257.27822 1.8376.28646 2.6709.28646.83333 0 1.9584-.0082 2.6709-.28646.71257-.27822 1.3697-1.1312 1.4957-1.7204.50887-2.3797.53899-3.0988 3.0973-4.5752 2.5578-1.4773 3.1973-1.1447 5.5127-.39551.57322.18547 1.6407.04341 2.2379-.43456.59728-.47796 1.167-1.4479 1.5837-2.1696.4167-.72164.97192-1.7015 1.0873-2.4577.11529-.75617-.29493-1.7512-.74222-2.1549-1.8065-1.6305-2.4142-2.0171-2.4137-4.9707-.000476-2.9537.60716-3.3402 2.4137-4.9707.44728-.40367.85751-1.3987.74222-2.1549-.0547-.35981-.55834-1.868-.75004-2.277-.71816 1.1859-2.3328 3.4283-3.582 4.4036z"
     fill="url(#b)"
     stroke-width=".83333"
     id="path16" />
  <path
     d="m32.909 32.314c.57918.1874 1.6579.04393 2.2613-.43897.60341-.48292 1.1798-1.4632 1.6008-2.1923.42098-.72914.98181-1.7184 1.0983-2.4824.11651-.76403-.29859-1.7699-.7505-2.1777-1.8252-1.6475-2.4391-2.0378-2.4386-5.0221-.000476-2.9843.61329-3.3748 2.4385-5.0221.45191-.40787.86701-1.4137.75044-2.1777-.1165-.76404-.67728-1.7533-1.0983-2.4824-.42098-.72914-.99728-1.7094-1.6008-2.1923-.60341-.48292-1.6821-.62637-2.2613-.43897-2.3394.75694-2.9845 1.0932-5.5689-.39938-2.5849-1.4917-2.6161-2.2185-3.1303-4.6228-.12727-.59526-.79085-1.4577-1.5108-1.7388-.71992-.28111-1.857-.29009-2.6991-.29009-.84202 0-1.9791.008998-2.6991.29009-.71992.28111-1.3835 1.1435-1.5108 1.7388-.51414 2.4043-.54542 3.131-3.1303 4.6228-2.5844 1.4926-3.2294 1.1563-5.5689.39938-.57924-.1874-1.6579-.043933-2.2613.43897-.60341.48292-1.1798 1.4632-1.6008 2.1923-.42098.72914-.98175 1.7184-1.0983 2.4824-.11651.76403.29859 1.7699.7505 2.1777 1.8252 1.6475 2.4391 2.0378 2.4385 5.0221.0005238 2.9843-.61323 3.3748-2.4385 5.0221-.45191.40787-.86701 1.4137-.7505 2.1777.11657.76403.67734 1.7533 1.0983 2.4824.42104.72914.99734 1.7094 1.6008 2.1923.60347.48292 1.6821.62637 2.2613.43897 2.3394-.75694 2.9845-1.0932 5.5689.39937 2.5849 1.4917 2.6161 2.2185 3.1303 4.6228.12733.59527.7909 1.4577 1.5108 1.7388.71998.28111 1.8571.29009 2.6991.29009.84207.000004 1.9792-.009 2.6991-.29009.71998-.28111 1.3836-1.1435 1.5108-1.7388.51419-2.4043.54542-3.131 3.1303-4.6228 2.5844-1.4926 3.2294-1.1563 5.5689-.39938z"
     fill="none"
     stroke="#2e4f72"
     stroke-linejoin="round"
     stroke-width="1.2698"
     id="path18" />
  <path
     d="m 12.351,11.0175 c 1.6495,0 2.91,0.43422 3.0515,2.0861 0.23936,2.7945 0.4065,4.5953 -0.06325,5.9815 -0.23506,0.69367 -0.90559,2.291 -2.1292,3.7308 -0.76699,0.90246 -1.2899,1.8516 -1.1111,3.1335 0.15592,1.1179 0.25306,2.6734 1.1591,2.9405 -0.09443,0.50647 -0.19636,0.5538 -0.64143,0.92169 -1.0846,-0.42216 -1.355,-2.352 -1.4903,-3.8525 -0.1181,-1.309 0.23006,-2.6974 1.3614,-3.9075 2.1874,-2.3398 2.7641,-4.378 2.0623,-6.4549 -0.23185,-0.6861 -0.1166,-0.63427 -2.0819,-0.53868 -1.9653,0.09558 -3.0345,-1.4116 -3.4877,-2.7021 -0.4889,-0.27065 -1.5702,0.08056 -2.3186,0.26755 0.63926,-1.0938 3.9098,-1.6059 5.6892,-1.6059 z"
     fill="#333333"
     id="path22"
     style="stroke-width:0.83333" />
  <ellipse
     cx="13.866686"
     cy="11.49077"
     fill="#ffffff"
     rx="2.2163899"
     ry="1.2894034"
     transform="matrix(0.99248448,0.12237055,-0.12136968,0.99260738,0,0)"
     id="ellipse24"
     style="stroke-width:0.83333" />
  <path
     d="M 20,7.564 19.58336,11.314 20,14.2307 20.4167,11.314 Z"
     fill="#333333"
     id="path26"
     style="stroke-width:0.83333" />
  <path
     d="m 27.649,11.0175 c -1.6495,0 -2.91,0.43422 -3.0515,2.0861 -0.23936,2.7945 -0.4065,4.5953 0.06324,5.9815 0.23506,0.69367 0.90559,2.291 2.1292,3.7308 0.76699,0.90246 1.2899,1.8516 1.1111,3.1335 -0.15592,1.1179 -0.25306,2.6734 -1.1591,2.9405 0.09443,0.50647 0.19636,0.5538 0.64143,0.92169 1.0846,-0.42216 1.355,-2.352 1.4903,-3.8525 0.1181,-1.309 -0.23006,-2.6974 -1.3614,-3.9075 -2.1874,-2.3398 -2.7641,-4.378 -2.0623,-6.4549 0.23185,-0.6861 0.1166,-0.63427 2.0819,-0.53868 1.9653,0.09558 3.0345,-1.4116 3.4877,-2.7021 0.4889,-0.27065 1.5702,0.08056 2.3186,0.26755 -0.63926,-1.0938 -3.9098,-1.6059 -5.6892,-1.6059 z"
     fill="#333333"
     id="path28"
     style="stroke-width:0.83333" />
  <ellipse
     cx="-25.837141"
     cy="16.384781"
     fill="#ffffff"
     rx="2.2163899"
     ry="1.2894034"
     transform="matrix(-0.99248448,0.12237055,0.12136968,0.99260738,0,0)"
     id="ellipse30"
     style="stroke-width:0.83333" />
  <ellipse
     cx="12.646"
     cy="12.552502"
     fill="#550000"
     fill-opacity="0.97647"
     rx="1.1763999"
     ry="0.88233"
     stroke-width="0.83334"
     id="ellipse34" />
  <ellipse
     cx="-27.351999"
     cy="12.552502"
     fill="#550000"
     fill-opacity="0.97647"
     rx="1.1763999"
     ry="0.88233"
     stroke-width="0.83333"
     transform="scale(-1,1)"
     id="ellipse36" />
  <g
     fill="#ffffff"
     id="g42"
     transform="translate(0,0.5005)">
    <circle
       cx="12.117"
       cy="11.817"
       r="0.35293001"
       id="circle38" />
    <circle
       cx="26.823"
       cy="11.817"
       r="0.35293001"
       id="circle40" />
  </g>
  <path
     id="path25"
     style="fill:#333333;fill-opacity:1;stroke-width:0.834849"
     d="m 16.998001,22.886239 c -1.325802,-0.02257 -1.550213,2.211069 -0.262927,2.782743 1.872322,0.831484 2.384089,1.850065 2.86743,2.464785 l 0.0795,1.192648 c -0.582165,0.189836 -3.675544,0.92424 -3.339474,1.510605 1.408487,-0.116884 2.187523,-0.476884 3.657128,-0.476936 v 0.0027 c 1.469605,5.1e-5 2.248641,0.360051 3.657127,0.476936 0.336069,-0.586367 -2.757307,-1.32077 -3.339475,-1.510608 l 0.07949,-1.192647 c 0.483342,-0.614721 0.995107,-1.6333 2.867431,-2.464786 1.287287,-0.571675 1.062874,-2.805326 -0.262928,-2.782745 -1.325655,0.02257 -2.047688,0.158951 -3.001644,0.158981 v -0.0027 c -0.953957,-3e-5 -1.675989,-0.136402 -3.001645,-0.158978 z" />
</svg>
