<svg width="16" height="16" version="1.1" xmlns="http://www.w3.org/2000/svg">
 <radialGradient id="a" cx="4" cy="4" r="5.5" gradientTransform="matrix(6e-8 1.8512398 -1.8512398 4e-8 13.223141 -1.586777)" gradientUnits="userSpaceOnUse">
  <stop stop-color="#ff8080" offset="0"/>
  <stop stop-color="#f00" offset="1"/>
 </radialGradient>
 <circle cx="8" cy="8" r="8" fill="url(#a)"/>
 <path d="M 9,11.5 12.5,8 9,4.5" fill="none" stroke="#e5ff80" stroke-linecap="round" stroke-linejoin="round" stroke-width="2"/>
 <path d="m12.5 8-9 2e-7" fill="none" stroke="#e5ff80" stroke-linecap="round" stroke-width="2"/>
</svg>
