<?xml version="1.0" encoding="UTF-8" standalone="no"?>
<svg
   height="24"
   width="24"
   version="1.1"
   id="svg15"
   sodipodi:docname="Sort_01_24.svg"
   inkscape:export-filename="Sort_01_24.png"
   inkscape:export-xdpi="96"
   inkscape:export-ydpi="96"
   inkscape:version="1.2-beta (1b65182ce9, 2022-04-05)"
   xmlns:inkscape="http://www.inkscape.org/namespaces/inkscape"
   xmlns:sodipodi="http://sodipodi.sourceforge.net/DTD/sodipodi-0.dtd"
   xmlns="http://www.w3.org/2000/svg"
   xmlns:svg="http://www.w3.org/2000/svg">
  <defs
     id="defs19" />
  <sodipodi:namedview
     id="namedview17"
     pagecolor="#ffffff"
     bordercolor="#666666"
     borderopacity="1.0"
     inkscape:pageshadow="2"
     inkscape:pageopacity="0.0"
     inkscape:pagecheckerboard="0"
     inkscape:deskcolor="#d1d1d1"
     showgrid="true"
     inkscape:zoom="38.25"
     inkscape:cx="11.045752"
     inkscape:cy="11.607843"
     inkscape:current-layer="svg15">
    <inkscape:grid
       type="xygrid"
       id="grid1053" />
  </sodipodi:namedview>
  <linearGradient
     id="a"
     gradientUnits="userSpaceOnUse"
     x1="18"
     x2="18"
     y1="42"
     y2="26.25"
     gradientTransform="translate(0,-24)">
    <stop
       offset="0"
       stop-color="#006cbd"
       id="stop2" />
    <stop
       offset="1"
       stop-color="#6bc0ff"
       id="stop4" />
  </linearGradient>
  <g
     id="g1202">
    <path
       d="M 12.5,11 H 10.311013 L 9.4408566,8.6149387 H 5.457172 L 4.6346024,11 H 2.5 L 6.3817132,0.50000019 H 8.5095173 Z M 8.7950374,6.8458392 7.4218219,2.9495229 6.0757989,6.8458392 Z"
       fill="#177ecb"
       id="path7"
       style="stroke-width:1.47329" />
    <path
       d="M 3,23 V 21.114972 L 9.0576513,14.26354 H 3.5 V 12.5 h 8 v 1.63646 L 5.4630001,21.256173 H 12 V 23 Z"
       fill="#d40000"
       id="path9"
       style="stroke-width:1.6002"
       sodipodi:nodetypes="ccccccccccc" />
    <path
       d="M 16.5,1.5 V 15 h -3 l 4.5,6 4.5,-6 h -3 V 1.5 Z"
       fill="url(#a)"
       fill-rule="evenodd"
       id="path11"
       style="fill:url(#a)" />
  </g>
</svg>
