<?xml version="1.0" encoding="UTF-8" standalone="no"?>
<svg
   height="36"
   width="36"
   version="1.1"
   id="svg18"
   sodipodi:docname="File_17_36.svg"
   inkscape:version="1.2.1 (9c6d41e410, 2022-07-14)"
   inkscape:export-filename="File_17_36.png"
   inkscape:export-xdpi="96"
   inkscape:export-ydpi="96"
   xmlns:inkscape="http://www.inkscape.org/namespaces/inkscape"
   xmlns:sodipodi="http://sodipodi.sourceforge.net/DTD/sodipodi-0.dtd"
   xmlns:xlink="http://www.w3.org/1999/xlink"
   xmlns="http://www.w3.org/2000/svg"
   xmlns:svg="http://www.w3.org/2000/svg">
  <defs
     id="defs22">
    <radialGradient
       id="a-8"
       cx="9.1740294"
       cy="7.8253603"
       gradientTransform="matrix(0.66909781,-2.2758851e-8,4.5190518e-8,0.58542853,1.8616763,4.291566)"
       gradientUnits="userSpaceOnUse"
       r="7.5"
       fx="9.1740294"
       fy="7.8253603">
      <stop
         offset="0"
         stop-color="#fff"
         id="stop2-7"
         style="stop-color:#ccddff;stop-opacity:1;" />
      <stop
         offset="1"
         stop-color="#8fc1c7"
         id="stop4-2"
         style="stop-color:#ffffff;stop-opacity:1" />
    </radialGradient>
    <linearGradient
       inkscape:collect="always"
       xlink:href="#a-8"
       id="linearGradient5209"
       x1="29.5"
       y1="33.5"
       x2="7.5"
       y2="2.5"
       gradientUnits="userSpaceOnUse" />
  </defs>
  <sodipodi:namedview
     id="namedview20"
     pagecolor="#ffffff"
     bordercolor="#666666"
     borderopacity="1.0"
     inkscape:pageshadow="2"
     inkscape:pageopacity="0.0"
     inkscape:pagecheckerboard="0"
     inkscape:deskcolor="#d1d1d1"
     showgrid="true"
     inkscape:zoom="25.5"
     inkscape:cx="17.980392"
     inkscape:cy="18"
     inkscape:current-layer="svg18"
     showguides="true"
     inkscape:showpageshadow="2">
    <inkscape:grid
       type="xygrid"
       id="grid147"
       originx="0"
       originy="0" />
  </sodipodi:namedview>
  <path
     d="M 6.125,34.875 V 1.125 H 23 L 30.875,9 v 25.875 z"
     id="path2"
     style="fill:url(#linearGradient5209);stroke:#b3b3b3;stroke-width:2.25;stroke-linecap:round;stroke-linejoin:round;stroke-opacity:1;fill-opacity:1"
     sodipodi:nodetypes="cccccc" />
  <path
     d="m 22.125,1.125 v 8.75 h 8.75"
     id="path6"
     style="fill:none;stroke:#b3b3b3;stroke-width:2.25;stroke-linecap:round;stroke-linejoin:round;stroke-opacity:1"
     sodipodi:nodetypes="ccc" />
  <g
     id="g4890"
     transform="matrix(9.0634555,0,0,8.9093282,-15.266571,-17.930655)"
     style="stroke-width:0.420599">
    <path
       style="fill:#ff5555;fill-opacity:1;stroke:#ffffff;stroke-width:0.200309;stroke-linecap:round;stroke-linejoin:bevel;stroke-dasharray:none;stroke-opacity:1"
       d="M 4.4979167,5.9531251 C 5.159375,5.8208334 5.55625,5.2916668 5.55625,3.9687501 c -0.396875,0 -0.8120771,-0.149785 -1.0583333,-0.3968753"
       id="path1107"
       sodipodi:nodetypes="ccc" />
    <path
       style="fill:#ffdd55;fill-opacity:1;stroke:#ffffff;stroke-width:0.200309;stroke-linecap:round;stroke-linejoin:bevel;stroke-dasharray:none;stroke-opacity:1"
       d="m 4.4979167,3.5718751 c -0.2645833,0.2645837 -0.6614583,0.396875 -1.0583333,0.396875 0,1.3229167 0.3905853,1.8571829 1.0583333,1.984375"
       id="path2905"
       sodipodi:nodetypes="ccc" />
  </g>
</svg>
