<?xml version="1.0" encoding="UTF-8" standalone="no"?>
<svg
   height="16"
   width="16"
   version="1.1"
   id="svg34"
   sodipodi:docname="laz_wand.svg"
   inkscape:export-filename="laz_wand.png"
   inkscape:export-xdpi="96"
   inkscape:export-ydpi="96"
   inkscape:version="1.2.2 (732a01da63, 2022-12-09)"
   xmlns:inkscape="http://www.inkscape.org/namespaces/inkscape"
   xmlns:sodipodi="http://sodipodi.sourceforge.net/DTD/sodipodi-0.dtd"
   xmlns:xlink="http://www.w3.org/1999/xlink"
   xmlns="http://www.w3.org/2000/svg"
   xmlns:svg="http://www.w3.org/2000/svg">
  <defs
     id="defs38" />
  <sodipodi:namedview
     id="namedview36"
     pagecolor="#ffffff"
     bordercolor="#666666"
     borderopacity="1.0"
     inkscape:showpageshadow="2"
     inkscape:pageopacity="0.0"
     inkscape:pagecheckerboard="0"
     inkscape:deskcolor="#d1d1d1"
     showgrid="true"
     inkscape:zoom="57.375"
     inkscape:cx="7.9912854"
     inkscape:cy="8"
     inkscape:current-layer="svg34">
    <inkscape:grid
       type="xygrid"
       id="grid631" />
  </sodipodi:namedview>
  <linearGradient
     id="a">
    <stop
       offset="0"
       stop-color="#fff"
       id="stop2" />
    <stop
       offset="1"
       stop-color="#ccc"
       id="stop4" />
  </linearGradient>
  <linearGradient
     id="b"
     gradientTransform="matrix(-.05439307 .81587279 .81587279 -.05439307 -9.092613 12.909273)"
     gradientUnits="userSpaceOnUse"
     x1="1.9975"
     x2="2.8346"
     xlink:href="#a"
     y1="13.588"
     y2="14.458" />
  <linearGradient
     id="c"
     gradientTransform="matrix(.81587279 -.05439307 -.05439307 .81587279 8.936388 -5.119845)"
     gradientUnits="userSpaceOnUse"
     x1="1.9975"
     x2="2.8346"
     xlink:href="#a"
     y1="13.588"
     y2="14.458" />
  <linearGradient
     id="d"
     gradientTransform="matrix(.81805913 .05221604 .05221604 .81805913 -.968773 3.044279)"
     gradientUnits="userSpaceOnUse"
     x1="4.75"
     x2="6.75"
     y1="9.25"
     y2="11.25">
    <stop
       offset="0"
       stop-color="#333"
       id="stop9" />
    <stop
       offset=".3"
       stop-color="#e6e6e6"
       id="stop11" />
    <stop
       offset="1"
       stop-color="#1a1a1a"
       id="stop13" />
  </linearGradient>
  <path
     d="m1.8943872 12.58272-1.74055036 1.74055 1.52298746 1.522988 1.7405502-1.740551z"
     fill="url(#b)"
     fill-rule="evenodd"
     stroke="#666"
     stroke-linejoin="round"
     stroke-width=".307686"
     id="path16" />
  <g
     fill="none"
     stroke="#e4b600"
     stroke-linecap="round"
     stroke-width=".214972"
     transform="matrix(-3.2892935 -3.2892935 -3.2892935 3.2892935 44.005987 26.821992)"
     id="g26">
    <path
       d="m8.3343094.94001874v1.82409996"
       id="path18" />
    <path
       d="m9.094351 1.0920271-1.5200833 1.5200833"
       id="path20" />
    <path
       d="m7.4222594 1.8520687h1.8240999"
       id="path22" />
    <path
       d="m7.5742677 1.0920271 1.5200833 1.5200832"
       id="path24" />
  </g>
  <g
     fill-rule="evenodd"
     id="g32">
    <path
       d="m8.6098366 5.8673868 1.7405514-1.7405502 1.522987 1.5229873-1.740551 1.7405502z"
       fill="url(#c)"
       stroke="#666"
       stroke-linejoin="round"
       stroke-width=".307686"
       id="path28" />
    <path
       d="m1.6766847 12.58272 6.93304-6.9329951 1.7405503 1.7405502-6.93304 6.9329949z"
       fill="url(#d)"
       stroke-width="2.32583"
       id="path30" />
  </g>
</svg>
