<svg width="32" height="32" version="1.1" viewBox="0 0 32 32" xmlns="http://www.w3.org/2000/svg">
 <path d="m15.150391 29v-1.984375c-0.03633 9.8e-4 -0.06895 0.01563-0.105469 0.01563-2.216643 0-4.03125-1.814604-4.03125-4.03125s1.814609-4.03125 4.03125-4.03125c0.03651 0 0.06915 0.01465 0.105469 0.01563v-2.134766h-4.273438l0.347656-1.105468c0.06925-0.219392 0.107422-0.453506 0.107422-0.699219 0-1.297897-1.034137-2.332031-2.332031-2.332031-1.2978992 0-2.3320313 1.034135-2.3320313 2.332031 0 0.245658 0.038158 0.479748 0.1074219 0.699219l0.3476563 1.105468h-4.1230469v12.150381z" fill="#ff8200" stop-color="#000000" style="paint-order:fill markers stroke"/>
 <path d="m16.849609 16.849609v4.273438l-1.105468-0.347656c-0.219558-0.06927-0.4536-0.107422-0.699219-0.107422-1.297893 0-2.332031 1.034131-2.332031 2.332031s1.034139 2.332031 2.332031 2.332031c0.245678 0 0.479763-0.03816 0.699219-0.107422l1.105468-0.347656v4.123047h12.150391v-12.150391h-1.984375c9.8e-4 0.03632 0.01563 0.06896 0.01563 0.105469 0 2.216646-1.814607 4.03125-4.03125 4.03125s-4.03125-1.814606-4.03125-4.03125c0-0.03653 0.01465-0.06914 0.01563-0.105469z" fill="#ff2c1a" stop-color="#000000" style="paint-order:fill markers stroke"/>
 <path d="m16.849609 3v1.984375c0.03632-9.73e-4 0.06896-0.015625 0.105469-0.015625 2.216644 0 4.03125 1.8146076 4.03125 4.03125 0 2.216642-1.814607 4.03125-4.03125 4.03125-0.03652 0-0.06914-0.01465-0.105469-0.01563v2.134766h4.273438l-0.347656 1.105468c-0.06927 0.219488-0.107422 0.453573-0.107422 0.699219 0 1.297899 1.034136 2.332031 2.332031 2.332031 1.297897 0 2.332031-1.034135 2.332031-2.332031 0-0.245617-0.03815-0.47968-0.107422-0.699219l-0.347656-1.105463h4.123047v-12.150391z" fill="#00bd9f" stop-color="#000000" style="paint-order:fill markers stroke"/>
 <path d="m3 15.150391h1.984375c-9.73e-4 -0.03632-0.015625-0.06896-0.015625-0.105469 0-2.216644 1.8146054-4.03125 4.03125-4.03125 2.216641 0 4.03125 1.814607 4.03125 4.03125 0 0.03652-0.01465 0.06914-0.01563 0.105469h2.134766v-4.273438l1.105468 0.347656c0.219426 0.06926 0.453537 0.107422 0.699219 0.107422 1.297897 0 2.332031-1.034136 2.332031-2.332031 0-1.2978962-1.034135-2.3320313-2.332031-2.3320313-0.245619 0-0.479712 0.038149-0.699219 0.1074219l-1.105463 0.3476563v-4.1230469h-12.150391z" fill="#1a8cff" stop-color="#000000" style="paint-order:fill markers stroke"/>
</svg>
