<?xml version="1.0" encoding="UTF-8" standalone="no"?>
<svg
   width="48"
   height="48"
   version="1.1"
   id="svg3"
   sodipodi:docname="File_27_48.svg"
   inkscape:export-filename="File_27_48.png"
   inkscape:export-xdpi="96"
   inkscape:export-ydpi="96"
   inkscape:version="1.3.2 (091e20e, 2023-11-25, custom)"
   xmlns:inkscape="http://www.inkscape.org/namespaces/inkscape"
   xmlns:sodipodi="http://sodipodi.sourceforge.net/DTD/sodipodi-0.dtd"
   xmlns="http://www.w3.org/2000/svg"
   xmlns:svg="http://www.w3.org/2000/svg">
  <defs
     id="defs3" />
  <sodipodi:namedview
     id="namedview3"
     pagecolor="#ffffff"
     bordercolor="#000000"
     borderopacity="0.25"
     inkscape:showpageshadow="2"
     inkscape:pageopacity="0.0"
     inkscape:pagecheckerboard="0"
     inkscape:deskcolor="#d1d1d1"
     showgrid="true"
     inkscape:current-layer="svg3">
    <inkscape:grid
       id="grid3"
       units="px"
       originx="0"
       originy="0"
       spacingx="0.5"
       spacingy="0.5"
       empcolor="#0099e5"
       empopacity="0.30196078"
       color="#0099e5"
       opacity="0.14901961"
       empspacing="2"
       dotted="false"
       gridanglex="30"
       gridanglez="30"
       visible="true" />
  </sodipodi:namedview>
  <path
     d="m38.8 40.200002c0 1.9944-1.6056 3.6-3.6 3.6h-24.4c-1.9944002 0-3.6000002-1.6056-3.6000002-3.6v-33.400002c0-1.9944 1.6056-3.6 3.6000002-3.6h24.4c1.9944 0 3.6 1.6056 3.6 3.6v19.172252"
     fill="#ebfcff"
     stroke="#00aad4"
     stroke-linejoin="round"
     stroke-width="2.4"
     id="path1" />
  <g
     transform="translate(2,2)"
     fill="none"
     stroke="#ff7f2a"
     stroke-linecap="round"
     id="g3">
    <path
       d="m38.06512 28.500001a9.5651194 9.5631798 0 1 1-19.130238 0 9.5651194 9.5631798 0 1 1 19.130238 0z"
       stroke-linejoin="round"
       stroke-width="2.86976"
       id="path2" />
    <path
       d="m36.5 36.5 7 7"
       stroke-width="5"
       id="path3" />
  </g>
</svg>
