<?xml version="1.0" encoding="UTF-8" standalone="no"?>
<svg
   height="32"
   viewBox="0 0 8.4666664 8.4666671"
   width="32"
   version="1.1"
   id="svg155"
   sodipodi:docname="Font_22_32.svg"
   inkscape:export-filename="Font_22_32.png"
   inkscape:export-xdpi="96"
   inkscape:export-ydpi="96"
   inkscape:version="1.2.1 (9c6d41e410, 2022-07-14)"
   xmlns:inkscape="http://www.inkscape.org/namespaces/inkscape"
   xmlns:sodipodi="http://sodipodi.sourceforge.net/DTD/sodipodi-0.dtd"
   xmlns="http://www.w3.org/2000/svg"
   xmlns:svg="http://www.w3.org/2000/svg">
  <defs
     id="defs159" />
  <sodipodi:namedview
     id="namedview157"
     pagecolor="#ffffff"
     bordercolor="#666666"
     borderopacity="1.0"
     inkscape:showpageshadow="2"
     inkscape:pageopacity="0.0"
     inkscape:pagecheckerboard="0"
     inkscape:deskcolor="#d1d1d1"
     showgrid="true"
     inkscape:zoom="28.6875"
     inkscape:cx="15.982571"
     inkscape:cy="16"
     inkscape:current-layer="svg155">
    <inkscape:grid
       type="xygrid"
       id="grid970" />
  </sodipodi:namedview>
  <g
     fill="none"
     stroke="#2a7fff"
     stroke-linecap="round"
     stroke-linejoin="round"
     stroke-width=".686431"
     transform="matrix(.96338218 0 0 .96381969 -.101886 .378055)"
     id="g153">
    <path
       d="m.5 7.5h2.5"
       id="path143" />
    <path
       d="m6 7.5h2.5"
       id="path145" />
    <path
       d="m1.5 7.5 3-7 3 7"
       id="path147" />
    <path
       d="m2.5.5h2"
       id="path149" />
    <path
       d="m2.5775588 5.4412547h3.8448824"
       id="path151" />
  </g>
</svg>
