<svg width="48" height="48" version="1.1" viewBox="0 0 48 48" xmlns="http://www.w3.org/2000/svg">
 <defs>
  <linearGradient id="a" x1="112.7" x2="144.74001" y1="19.466999" y2="232.78999" gradientTransform="matrix(.95614 0 0 .95614 -323.17 -186.01)" gradientUnits="userSpaceOnUse">
   <stop stop-color="#fcfcfd" offset="0"/>
   <stop stop-color="#a6b6d9" offset=".49645"/>
   <stop stop-color="#47d2f9" offset="1"/>
  </linearGradient>
  <filter id="b" x="-.036" y="-.036" width="1.072" height="1.072" color-interpolation-filters="sRGB">
   <feGaussianBlur stdDeviation="3.27"/>
  </filter>
 </defs>
 <circle cx="24" cy="24" r="21.5" fill="#20345e"/>
 <circle cx="24" cy="24" r="20.017241" fill="#3371b4" stroke-width=".999982"/>
 <circle transform="matrix(.17765254 0 0 .17765527 59.670852 35.303671)" cx="-200.78999" cy="-63.626999" r="109" fill="url(#a)" filter="url(#b)" stroke-width=".349254"/>
 <path d="m24.591683 12.286963c-0.09107 0.200944-0.07606 0.02432-0.638414 0.222533-0.699251 0.246286-1.194246 0.758042-1.22848 1.271035-0.01216 0.181935 0.13072 0.735635 0.314383 1.231452 0.262389 0.708406 0.314867 1.16584 0.246672 2.126614-0.112185 1.580202 0.142938 2.290708 0.991485 2.764621 1.193559 0.666604 2.717147 0.523773 3.811067-0.351126 0.890814-0.71246 1.18618-1.236238 1.2575-2.240356 0.07648-1.076783-0.425373-2.311746-1.325206-3.27392-0.373735-0.399624-1.28237-1.455532-2.021653-2.344223-0.739288-0.888706-1.390634-1.617841-1.562652-1.630907-0.172-0.01305-0.502208 0.187598-0.514319 0.355527-0.01216 0.167907 0.137215 0.634297 0.30587 1.025307 0.168655 0.391009 0.483106 0.580076 0.363747 0.843443zm-9.053878 2.017803c5e-3 0.710135-0.10492 1.389805-0.324066 1.98319-0.896271 2.426692-0.07476 4.863917 1.895905 5.618199 1.387708 0.53116 3.479365-0.01127 4.222342-1.097941 0.638325-0.933495 0.458327-1.76921-0.735166-3.447114-0.297599-0.418385-0.593299-1.041632-0.65777-1.384764-0.287981-1.532709-0.871604-2.061503-2.166761-1.963415-0.756029 0.05726-0.688175 0.144094-1.03501-1.374891-0.07663-0.335611-0.199638-0.447322-0.590233-0.444267-0.390632 3e-3 -0.619271 0.674326-0.609241 2.111003zm15.00767 10.098728c0.24682 0.264198 0.813649 0.621104 1.257489 0.796245 1.509837 0.59579 2.78855 0.340213 3.927267-0.791289 1.374233-1.365517 1.182767-3.104508 0.47246-5.652766-0.239732-0.860097-0.614784-1.667729-0.976304-2.166179-0.537061-0.740481-0.92216-1.205068-1.303894-1.102956-0.381724 0.102102-0.404304 0.18914-0.34771 0.754857 0.05658 0.565702 0.277929 0.853449 0.130691 1.064579-0.147238 0.211116 0.547378-0.130364-0.44188 0.148958s-1.156733 0.517655-2.239497 2.960304c-1.082763 2.442649-1.165101 3.253434-0.478622 3.988247zm-20.777695-1.359971c-0.050177 0.711881 0.746661 3.945134 1.194614 4.841841 0.387116 0.774923 1.521948 1.92939 2.20058 2.240354 2.221146 1.01778 5.006739-0.51404 5.015541-2.754726 0.0024-0.596238-0.08386-0.778949-0.594889-1.271032-0.328733-0.316542-1.453821-1.124296-2.500477-1.795277-2.035092-1.304632-2.794662-1.513357-3.545041-0.974276-0.323506 0.232408-0.356699 0.210255-0.633592-0.370915-0.221494-0.464904-0.389369-0.613257-0.717993-0.613287-0.3286388-2.9e-5 -0.3751114 0.07847-0.418743 0.697318zm10.645359 5.707253c0 1.304315-0.304479 2.023394-1.1559 2.725041-1.100251 0.906704-1.319047 1.751188-0.773842 2.982305 0.649928 1.467608 1.7344 2.297102 3.274198 2.512383 0.444774 0.06219 1.02353 0.09421 1.2865 0.06919 4.468403-0.425543 9.662471-2.167055 10.886915-3.64992 0.838838-1.015868 1.043165-2.622612 0.498169-3.921882-0.376247-0.896968-0.849731-1.210506-2.224773-1.478678-1.167616-0.227722-1.776606-0.631792-2.384389-1.582599-0.816644-1.277548-2.069465-2.020748-3.175458-2.013417-1.605267 0.01068-3.103138 0.522065-4.191358 0.985836-1.088217 0.463774-1.66832 1.293725-1.816175 1.695188-0.147855 0.401464-0.223887 1.08912-0.223887 1.676553z" fill="#000000" stroke-width=".999992"/>
</svg>
