<?xml version="1.0" encoding="UTF-8" standalone="no"?>
<svg
   height="48"
   width="48"
   version="1.1"
   id="svg787"
   sodipodi:docname="Refresh_03_48.svg"
   inkscape:export-filename="Refresh_03_48.png"
   inkscape:export-xdpi="96"
   inkscape:export-ydpi="96"
   inkscape:version="1.2-beta (1b65182ce9, 2022-04-05)"
   xmlns:inkscape="http://www.inkscape.org/namespaces/inkscape"
   xmlns:sodipodi="http://sodipodi.sourceforge.net/DTD/sodipodi-0.dtd"
   xmlns="http://www.w3.org/2000/svg"
   xmlns:svg="http://www.w3.org/2000/svg">
  <defs
     id="defs791" />
  <sodipodi:namedview
     id="namedview789"
     pagecolor="#ffffff"
     bordercolor="#666666"
     borderopacity="1.0"
     inkscape:pageshadow="2"
     inkscape:pageopacity="0.0"
     inkscape:pagecheckerboard="0"
     inkscape:deskcolor="#d1d1d1"
     showgrid="true"
     inkscape:zoom="19.125"
     inkscape:cx="22.823529"
     inkscape:cy="24"
     inkscape:current-layer="svg787">
    <inkscape:grid
       type="xygrid"
       id="grid910" />
  </sodipodi:namedview>
  <g
     fill="none"
     stroke="#00aad4"
     stroke-linecap="round"
     stroke-width="2.25"
     transform="matrix(2,0,0,2,2,-3.7966974e-5)"
     id="g785">
    <path
       d="M 13.909482,10.874991 H 20.375 V 4.4107338"
       id="path777" />
    <path
       d="M 19.017242,10.551774 C 15.525862,3.4241561 7.7672414,-1.7595664 1.625,7.9599131"
       id="path779" />
    <path
       d="M 8.0905173,13.124991 H 1.625 v 6.464256"
       id="path781" />
    <path
       d="M 2.9827586,13.448208 C 6.4741379,20.575875 14.232758,25.759636 20.375,16.040088"
       id="path783" />
  </g>
</svg>
