<?xml version="1.0" encoding="UTF-8" standalone="no"?>
<svg
   width="32"
   height="32"
   version="1.1"
   id="svg14"
   sodipodi:docname="delete_all_200.svg"
   inkscape:export-filename="delete_all_200.png"
   inkscape:export-xdpi="96"
   inkscape:export-ydpi="96"
   inkscape:version="1.3.2 (091e20e, 2023-11-25, custom)"
   xmlns:inkscape="http://www.inkscape.org/namespaces/inkscape"
   xmlns:sodipodi="http://sodipodi.sourceforge.net/DTD/sodipodi-0.dtd"
   xmlns="http://www.w3.org/2000/svg"
   xmlns:svg="http://www.w3.org/2000/svg">
  <defs
     id="defs14" />
  <sodipodi:namedview
     id="namedview14"
     pagecolor="#ffffff"
     bordercolor="#000000"
     borderopacity="0.25"
     inkscape:showpageshadow="2"
     inkscape:pageopacity="0.0"
     inkscape:pagecheckerboard="0"
     inkscape:deskcolor="#d1d1d1"
     showgrid="true"
     inkscape:current-layer="svg14">
    <inkscape:grid
       id="grid14"
       units="px"
       originx="0"
       originy="0"
       spacingx="0.5"
       spacingy="0.5"
       empcolor="#0099e5"
       empopacity="0.30196078"
       color="#0099e5"
       opacity="0.14901961"
       empspacing="2"
       dotted="false"
       gridanglex="30"
       gridanglez="30"
       visible="true" />
  </sodipodi:namedview>
  <rect
     x="3.5527137e-15"
     y="-4.8841855e-7"
     width="30"
     height="30.000002"
     ry="4.3636365"
     fill="#dbe9ff"
     stroke="#00aad4"
     stroke-linejoin="round"
     stroke-width="1.99999"
     id="rect1"
     style="stroke:none;stroke-width:2;stroke-dasharray:none" />
  <path
     d="m8 5h18"
     fill="none"
     stroke="#808080"
     stroke-linejoin="round"
     stroke-width="2"
     id="path1" />
  <path
     d="m4 5h2"
     fill="none"
     stroke="#dc0000"
     stroke-linejoin="round"
     stroke-width="2"
     id="path2" />
  <path
     d="m8 9h18"
     fill="none"
     stroke="#808080"
     stroke-linejoin="round"
     stroke-width="2"
     id="path3" />
  <path
     d="m4 9h2"
     fill="none"
     stroke="#dc0000"
     stroke-linejoin="round"
     stroke-width="2"
     id="path4" />
  <path
     d="m8 13h18"
     fill="none"
     stroke="#808080"
     stroke-linejoin="round"
     stroke-width="2"
     id="path5" />
  <path
     d="m4 13h2"
     fill="none"
     stroke="#dc0000"
     stroke-linejoin="round"
     stroke-width="2"
     id="path6" />
  <path
     d="m8 17h18"
     fill="none"
     stroke="#808080"
     stroke-linejoin="round"
     stroke-width="2"
     id="path7" />
  <path
     d="m4 17h2"
     fill="none"
     stroke="#dc0000"
     stroke-linejoin="round"
     stroke-width="2"
     id="path8" />
  <path
     d="m8 21h18"
     fill="none"
     stroke="#808080"
     stroke-linejoin="round"
     stroke-width="2"
     id="path9" />
  <path
     d="m4 21h2"
     fill="none"
     stroke="#dc0000"
     stroke-linejoin="round"
     stroke-width="2"
     id="path10" />
  <path
     d="m8 25h18"
     fill="none"
     stroke="#808080"
     stroke-linejoin="round"
     stroke-width="2"
     id="path11" />
  <path
     d="m4 25h2"
     fill="none"
     stroke="#dc0000"
     stroke-linejoin="round"
     stroke-width="2"
     id="path12" />
  <g
     transform="matrix(2.75,0,0,2.75,-11.3125,-11.3125)"
     fill="none"
     stroke-linecap="round"
     id="g14">
    <path
       d="m9.5 14 4.5-4.5m0 4.5-4.5-4.5"
       stroke="#ffffff"
       stroke-width="3.5"
       id="path13" />
    <path
       d="m9.5 14 4.5-4.5m0 4.5-4.5-4.5"
       stroke="#dc0000"
       stroke-width="1.5"
       id="path14" />
  </g>
</svg>
