<?xml version="1.0" encoding="UTF-8" standalone="no"?>
<svg
   height="64"
   viewBox="0 0 16.933333 16.933335"
   width="64"
   version="1.1"
   id="svg623"
   sodipodi:docname="Secure_01_64.svg"
   inkscape:version="1.2 (dc2aedaf03, 2022-05-15)"
   inkscape:export-filename="Secure_01_64.png"
   inkscape:export-xdpi="96"
   inkscape:export-ydpi="96"
   xmlns:inkscape="http://www.inkscape.org/namespaces/inkscape"
   xmlns:sodipodi="http://sodipodi.sourceforge.net/DTD/sodipodi-0.dtd"
   xmlns="http://www.w3.org/2000/svg"
   xmlns:svg="http://www.w3.org/2000/svg">
  <defs
     id="defs627" />
  <sodipodi:namedview
     id="namedview625"
     pagecolor="#ffffff"
     bordercolor="#666666"
     borderopacity="1.0"
     inkscape:showpageshadow="2"
     inkscape:pageopacity="0.0"
     inkscape:pagecheckerboard="0"
     inkscape:deskcolor="#d1d1d1"
     showgrid="true"
     inkscape:zoom="14.34375"
     inkscape:cx="26.980392"
     inkscape:cy="32"
     inkscape:current-layer="svg623">
    <inkscape:grid
       type="xygrid"
       id="grid1262" />
  </sodipodi:namedview>
  <path
     style="fill:#00aad4;fill-opacity:1;stroke:#00aad4;stroke-width:1.05831;stroke-linecap:round;stroke-linejoin:bevel;stroke-dasharray:none;stroke-opacity:1"
     d="M 8.4666668,15.351087 C 11.639029,13.762375 14.81139,12.173662 14.81139,4.2301008 c -2.643634,0 -4.758542,-1.0591414 -6.3447232,-2.6478537"
     id="path1107" />
  <path
     style="fill:none;fill-opacity:1;stroke:#00aad4;stroke-width:1.05831;stroke-linecap:round;stroke-linejoin:bevel;stroke-dasharray:none;stroke-opacity:1"
     d="M 8.4666668,1.5822471 C 6.880486,3.1709594 4.7655782,4.2301008 2.121944,4.2301008 c 10e-8,7.9435612 3.1723616,9.5322742 6.3447228,11.1209862"
     id="path2905" />
</svg>
