<?xml version="1.0" encoding="UTF-8" standalone="no"?>
<svg
   width="24"
   height="24"
   version="1.1"
   viewBox="0 0 6.35 6.35"
   id="svg7"
   sodipodi:docname="div_justify_150.svg"
   inkscape:export-filename="div_justify_150.png"
   inkscape:export-xdpi="96"
   inkscape:export-ydpi="96"
   inkscape:version="1.3.2 (091e20e, 2023-11-25, custom)"
   xmlns:inkscape="http://www.inkscape.org/namespaces/inkscape"
   xmlns:sodipodi="http://sodipodi.sourceforge.net/DTD/sodipodi-0.dtd"
   xmlns="http://www.w3.org/2000/svg"
   xmlns:svg="http://www.w3.org/2000/svg">
  <defs
     id="defs7" />
  <sodipodi:namedview
     id="namedview7"
     pagecolor="#ffffff"
     bordercolor="#000000"
     borderopacity="0.25"
     inkscape:showpageshadow="2"
     inkscape:pageopacity="0.0"
     inkscape:pagecheckerboard="0"
     inkscape:deskcolor="#d1d1d1"
     showgrid="true"
     inkscape:current-layer="svg7">
    <inkscape:grid
       id="grid7"
       units="px"
       originx="0"
       originy="0"
       spacingx="0.13229167"
       spacingy="0.13229167"
       empcolor="#0099e5"
       empopacity="0.30196078"
       color="#0099e5"
       opacity="0.14901961"
       empspacing="2"
       dotted="false"
       gridanglex="30"
       gridanglez="30"
       visible="true" />
  </sodipodi:namedview>
  <path
     d="m0.79375005 4.0348933h4.7624998"
     fill="none"
     stroke="#008dd2"
     stroke-width=".39687"
     id="path1" />
  <path
     d="m0.79375005 0.85989333h4.7624998"
     fill="none"
     stroke="#008dd2"
     stroke-width=".39687"
     id="path2" />
  <path
     d="m0.79375005 3.2411933h4.7624998"
     fill="none"
     stroke="#008dd2"
     stroke-width=".39687"
     id="path3" />
  <path
     d="m0.79375005 2.4473933h4.7624998"
     fill="none"
     stroke="#008dd2"
     stroke-width=".39687"
     id="path4" />
  <path
     d="m0.79375005 1.6536933h4.7624998"
     fill="none"
     stroke="#008dd2"
     stroke-width=".39687"
     id="path5" />
  <path
     d="m0.79375005 4.8286933h4.7624998"
     fill="none"
     stroke="#008dd2"
     stroke-width=".39687"
     id="path6" />
  <path
     d="m0.79375005 5.6224433h4.7624998"
     fill="none"
     stroke="#008dd2"
     stroke-width=".39687"
     id="path7" />
</svg>
