<svg width="48" height="48" version="1.1" xmlns="http://www.w3.org/2000/svg">
 <radialGradient id="a" cx="12.1" cy="10.9" r="4.5" gradientTransform="matrix(0,3.3131299,-3.3131295,5.211862e-8,66.140389,-10.061599)" gradientUnits="userSpaceOnUse">
  <stop stop-color="#ff5555" offset="0"/>
  <stop stop-color="#aa0000" offset="1"/>
 </radialGradient>
 <g stroke="#ffffff" stroke-linecap="round" stroke-width="2.4">
  <circle cx="34.5" cy="34.5" r="12.3" fill="url(#a)" stroke-linejoin="round"/>
  <path d="m39 30-9 9" fill="none"/>
  <path d="m39 39-9-9" fill="none"/>
 </g>
</svg>
