<?xml version="1.0" encoding="UTF-8" standalone="no"?>
<svg
   height="64"
   viewBox="0 0 16.933333 16.933335"
   width="64"
   version="1.1"
   id="svg2470"
   sodipodi:docname="Picture_02_64.svg"
   inkscape:export-filename="Picture_02_64.png"
   inkscape:export-xdpi="96"
   inkscape:export-ydpi="96"
   inkscape:version="1.2 (dc2aedaf03, 2022-05-15)"
   xmlns:inkscape="http://www.inkscape.org/namespaces/inkscape"
   xmlns:sodipodi="http://sodipodi.sourceforge.net/DTD/sodipodi-0.dtd"
   xmlns="http://www.w3.org/2000/svg"
   xmlns:svg="http://www.w3.org/2000/svg">
  <defs
     id="defs2474">
    <linearGradient
       id="a-1"
       gradientUnits="userSpaceOnUse"
       x1="28.381756"
       x2="18.618242"
       y1="28.381756"
       y2="18.618242"
       gradientTransform="matrix(0.98581312,0,0,0.98581312,0.33339172,0.33339172)">
      <stop
         offset="0"
         stop-color="#009600"
         id="stop698" />
      <stop
         offset="1"
         stop-color="#6edb39"
         id="stop700" />
    </linearGradient>
  </defs>
  <sodipodi:namedview
     id="namedview2472"
     pagecolor="#ffffff"
     bordercolor="#666666"
     borderopacity="1.0"
     inkscape:showpageshadow="2"
     inkscape:pageopacity="0.0"
     inkscape:pagecheckerboard="0"
     inkscape:deskcolor="#d1d1d1"
     showgrid="true"
     inkscape:zoom="14.34375"
     inkscape:cx="27.050109"
     inkscape:cy="32"
     inkscape:current-layer="svg2470">
    <inkscape:grid
       type="xygrid"
       id="grid3576" />
  </sodipodi:namedview>
  <linearGradient
     id="a"
     gradientTransform="matrix(1.128889,0,0,1.1545455,-0.56444413,-0.76969731)"
     gradientUnits="userSpaceOnUse"
     x1="11.75"
     x2="12.21875"
     y1="3.416667"
     y2="7.541667">
    <stop
       offset="0"
       stop-color="#99c2ff"
       id="stop2432" />
    <stop
       offset="1"
       stop-color="#e5eeff"
       id="stop2434" />
  </linearGradient>
  <linearGradient
     id="b"
     gradientTransform="matrix(1.128889,0,0,1.1465329,-0.56444413,-1.7198595)"
     gradientUnits="userSpaceOnUse"
     x1="10.34375"
     x2="9.875"
     y1="13.5"
     y2="7.500026">
    <stop
       offset="0"
       stop-color="#aade87"
       id="stop2437" />
    <stop
       offset="1"
       stop-color="#0a0"
       id="stop2439" />
  </linearGradient>
  <g
     id="g5618"
     transform="translate(0,-1.0583332)">
    <path
       d="M 16.933334,14.816668 H 0 V 2.1166668 h 16.933334 z"
       fill="url(#a)"
       id="path2442"
       style="fill:url(#a);stroke-width:1.05833" />
    <path
       d="M 16.933334,10.583334 C 15.169445,8.819445 13.229167,5.291667 11.641667,5.291667 c -1.5875,0 -3.7041665,5.820834 -4.7624999,5.820834 -1.0583334,0 -2.1166668,-2.1166671 -3.1750002,-2.1166671 C 2.5354642,8.9958339 1.2347223,11.112501 0,12.170834 v 2.645834 h 16.933334 z"
       fill="url(#b)"
       id="path2444"
       style="fill:url(#b);stroke-width:1.05833" />
    <g
       fill="none"
       id="g2462"
       transform="scale(1.0583334)">
      <path
         d="m 5.5,3.5 v 1"
         stroke="#ffd42a"
         stroke-linecap="round"
         stroke-width="0.5"
         id="path2446" />
      <path
         d="M 6.9142136,4.0857864 6.2071068,4.7928932"
         stroke="#ffd42a"
         stroke-linecap="round"
         stroke-width="0.5"
         id="path2448" />
      <path
         d="M 4.0857864,4.0857864 4.7928932,4.7928932"
         stroke="#ffd42a"
         stroke-linecap="round"
         stroke-width="0.5"
         id="path2450" />
      <path
         d="m 3.5,5.5 h 1"
         stroke="#ffd42a"
         stroke-linecap="round"
         stroke-width="0.5"
         id="path2452" />
      <path
         d="M 4.0857864,6.9142136 4.7928932,6.2071068"
         stroke="#ffd42a"
         stroke-linecap="round"
         stroke-width="0.5"
         id="path2454" />
      <path
         d="m 5.5,7.5 v -1"
         stroke="#ffd42a"
         stroke-linecap="round"
         stroke-width="0.5"
         id="path2456" />
      <path
         d="M 6.9142136,6.9142136 6.2071068,6.2071068"
         stroke="#ffd42a"
         stroke-linecap="round"
         stroke-width="0.5"
         id="path2458" />
      <path
         d="m 7.5,5.5 h -1"
         stroke="#ffd42a"
         stroke-linecap="round"
         stroke-width="0.5"
         id="path2460" />
    </g>
    <circle
       cx="5.8208337"
       cy="5.8208337"
       fill="#ffe680"
       r="1.3229167"
       id="circle2464"
       style="stroke-width:1.05833" />
    <path
       d="M 0.27460683,2.3912736 H 16.658727 V 14.54206 H 0.27460683 Z"
       fill="none"
       stroke="#ffffff"
       stroke-linecap="round"
       stroke-width="0.549214"
       id="path2466" />
  </g>
  <g
     id="g5030"
     transform="scale(0.5291667)">
    <circle
       cx="23.5"
       cy="23.5"
       fill="url(#a)"
       stroke-dashoffset="1.49998"
       stroke-linejoin="round"
       stroke-width="1.37838"
       transform="matrix(0,1,1,0,0,0)"
       id="circle703"
       style="fill:url(#a-1);stroke:#ffffff;stroke-width:1.6;stroke-linecap:round;stroke-dasharray:none"
       r="7.6999998" />
    <g
       fill="none"
       stroke-width="2.25"
       id="g709"
       style="stroke:#ffffff;stroke-linecap:round">
      <path
         d="m 23.5,19.5 v 8"
         id="path705" />
      <path
         d="m 27.5,23.5 h -8"
         id="path707" />
    </g>
  </g>
</svg>
