<?xml version="1.0" encoding="UTF-8" standalone="no"?>
<svg
   height="48"
   width="48"
   version="1.1"
   id="svg20"
   sodipodi:docname="Mail_02_48.svg"
   inkscape:export-filename="A_01_48.png"
   inkscape:export-xdpi="96"
   inkscape:export-ydpi="96"
   inkscape:version="1.2 (dc2aedaf03, 2022-05-15)"
   xmlns:inkscape="http://www.inkscape.org/namespaces/inkscape"
   xmlns:sodipodi="http://sodipodi.sourceforge.net/DTD/sodipodi-0.dtd"
   xmlns="http://www.w3.org/2000/svg"
   xmlns:svg="http://www.w3.org/2000/svg">
  <defs
     id="defs24" />
  <sodipodi:namedview
     id="namedview22"
     pagecolor="#ffffff"
     bordercolor="#666666"
     borderopacity="1.0"
     inkscape:pageshadow="2"
     inkscape:pageopacity="0.0"
     inkscape:pagecheckerboard="0"
     inkscape:deskcolor="#d1d1d1"
     showgrid="true"
     inkscape:zoom="19.125"
     inkscape:cx="20.784314"
     inkscape:cy="24"
     inkscape:current-layer="svg20"
     inkscape:showpageshadow="2">
    <inkscape:grid
       type="xygrid"
       id="grid1108" />
  </sodipodi:namedview>
  <g
     id="g2530"
     transform="matrix(60.092233,0,0,59.600885,1.6236033,1.6949535)"
     style="stroke-width:1.06941">
    <path
       id="path583"
       style="fill:none;stroke:#00aad4;stroke-width:0.0751931;stroke-linecap:round;stroke-linejoin:round;stroke-dasharray:none;stroke-dashoffset:1.49998"
       d="M 0.45750861,0.44013324 A 0.11313613,0.15032728 23.14153 0 1 0.28948136,0.50526434 0.11313613,0.15032728 23.14153 0 1 0.26965176,0.31051395 0.11313613,0.15032728 23.14153 0 1 0.43767902,0.24538285 0.11313613,0.15032728 23.14153 0 1 0.45750861,0.44013324 Z" />
    <path
       style="fill:none;stroke:#00aad4;stroke-width:0.0626611;stroke-linecap:round;stroke-linejoin:round;stroke-dasharray:none;stroke-opacity:1"
       d="M 0.51422515,0.24769143 0.45402485,0.55150175 C 0.74802059,0.54588375 0.7876853,0.06159782 0.39819105,0.0533011 c -0.39438179,-0.0084008 -0.52160132,0.64195884 0.007688,0.64195884 0.13601175,0 0.23253854,-0.0460998 0.28462074,-0.13613068"
       id="path1258"
       sodipodi:nodetypes="ccssc" />
  </g>
</svg>
