<?xml version="1.0" encoding="UTF-8" standalone="no"?>
<svg
   height="36"
   width="36"
   version="1.1"
   id="svg408"
   sodipodi:docname="Time_05_36.svg"
   inkscape:export-filename="Time_05_36.png"
   inkscape:export-xdpi="96"
   inkscape:export-ydpi="96"
   inkscape:version="1.2 (dc2aedaf03, 2022-05-15)"
   xmlns:inkscape="http://www.inkscape.org/namespaces/inkscape"
   xmlns:sodipodi="http://sodipodi.sourceforge.net/DTD/sodipodi-0.dtd"
   xmlns="http://www.w3.org/2000/svg"
   xmlns:svg="http://www.w3.org/2000/svg">
  <defs
     id="defs412" />
  <sodipodi:namedview
     id="namedview410"
     pagecolor="#ffffff"
     bordercolor="#666666"
     borderopacity="1.0"
     inkscape:showpageshadow="2"
     inkscape:pageopacity="0.0"
     inkscape:pagecheckerboard="0"
     inkscape:deskcolor="#d1d1d1"
     showgrid="false"
     inkscape:zoom="25.5"
     inkscape:cx="17.980392"
     inkscape:cy="18"
     inkscape:current-layer="svg408" />
  <linearGradient
     id="a"
     gradientTransform="matrix(1.3999998 0 0 1.5 20.150002 -502.8061)"
     gradientUnits="userSpaceOnUse"
     x1="9"
     x2="14"
     y1="1030.3622"
     y2="1030.3622">
    <stop
       offset="0"
       stop-color="#808080"
       id="stop356" />
    <stop
       offset=".40312499"
       stop-color="#e6e6e6"
       id="stop358" />
    <stop
       offset="1"
       stop-color="#808080"
       id="stop360" />
  </linearGradient>
  <radialGradient
     id="b"
     cx="8.801107"
     cy="1036.9969"
     gradientTransform="matrix(.3333188 1.5000055 -1.4999937 .33333083 1585.0552 698.12246)"
     gradientUnits="userSpaceOnUse"
     r="9">
    <stop
       offset="0"
       stop-color="#ccc"
       id="stop363" />
    <stop
       offset="1"
       stop-color="#fff"
       id="stop365" />
  </radialGradient>
  <g
     transform="translate(-18.75 -1040.2372)"
     id="g406">
    <path
       d="m32.75 1044.2372v-3h7v3z"
       fill="url(#a)"
       fill-rule="evenodd"
       id="path368" />
    <circle
       cx="36.25"
       cy="1060.7372"
       fill="#808080"
       r="15"
       id="circle370" />
    <circle
       cx="36.25"
       cy="1060.7372"
       fill="url(#b)"
       r="13.5"
       id="circle372" />
    <path
       d="m32.500002 1041.7372h7.499995v3h-7.499995z"
       fill="none"
       id="path374" />
    <g
       fill-rule="evenodd"
       id="g404">
      <path
         d="m35.75 1051.2372h1v9h6v1h-7z"
         id="path376" />
      <path
         d="m26.75 1055.2372h1v1h-1z"
         fill="#2a7fff"
         id="path378" />
      <path
         d="m30.75 1051.2372h1v1h-1z"
         fill="#2a7fff"
         id="path380" />
      <path
         d="m35.75 1048.2372h1v2h-1z"
         fill="#2a7fff"
         id="path382" />
      <path
         d="m40.75 1051.2372h1v1h-1z"
         fill="#2a7fff"
         id="path384" />
      <path
         d="m44.75 1055.2372h1v1h-1z"
         fill="#2a7fff"
         id="path386" />
      <path
         d="m45.75 1065.2372h1v1h-1z"
         fill="#2a7fff"
         id="path388" />
      <path
         d="m46.75 1060.2372h2v1h-2z"
         fill="#2a7fff"
         id="path390" />
      <path
         d="m40.75 1069.2372h1v1h-1z"
         fill="#2a7fff"
         id="path392" />
      <path
         d="m35.75 1071.2372h1v2h-1z"
         fill="#2a7fff"
         id="path394" />
      <path
         d="m30.75 1069.2372h1v1h-1z"
         fill="#2a7fff"
         id="path396" />
      <path
         d="m26.75 1065.2372h1v1h-1z"
         fill="#2a7fff"
         id="path398" />
      <path
         d="m23.75 1060.2372h2v1h-2z"
         fill="#2a7fff"
         id="path400" />
      <path
         d="m34.25 1044.2372h4v2h-4z"
         fill="#808080"
         id="path402" />
    </g>
  </g>
</svg>
