<?xml version="1.0" encoding="UTF-8" standalone="no"?>
<svg
   width="24"
   height="24"
   version="1.1"
   viewBox="0 0 24 24"
   id="svg8"
   sodipodi:docname="select_150.svg"
   inkscape:export-filename="select_150.png"
   inkscape:export-xdpi="96"
   inkscape:export-ydpi="96"
   inkscape:version="1.3.2 (091e20e, 2023-11-25, custom)"
   xmlns:inkscape="http://www.inkscape.org/namespaces/inkscape"
   xmlns:sodipodi="http://sodipodi.sourceforge.net/DTD/sodipodi-0.dtd"
   xmlns="http://www.w3.org/2000/svg"
   xmlns:svg="http://www.w3.org/2000/svg">
  <defs
     id="defs8" />
  <sodipodi:namedview
     id="namedview8"
     pagecolor="#ffffff"
     bordercolor="#000000"
     borderopacity="0.25"
     inkscape:showpageshadow="2"
     inkscape:pageopacity="0.0"
     inkscape:pagecheckerboard="0"
     inkscape:deskcolor="#d1d1d1"
     showgrid="true"
     inkscape:current-layer="svg8">
    <inkscape:grid
       id="grid8"
       units="px"
       originx="0"
       originy="0"
       spacingx="0.5"
       spacingy="0.5"
       empcolor="#0099e5"
       empopacity="0.30196078"
       color="#0099e5"
       opacity="0.14901961"
       empspacing="2"
       dotted="false"
       gridanglex="30"
       gridanglez="30"
       visible="true" />
  </sodipodi:namedview>
  <rect
     x=".5"
     y="1.4999975"
     width="23"
     height="21"
     fill="#ffffff"
     fill-opacity=".917647"
     stroke="#b3b3b3"
     stroke-linecap="round"
     stroke-linejoin="round"
     stroke-width=".999995"
     id="rect1" />
  <path
     d="M 0.9999991,6.5 H 23"
     fill="#008dd2"
     stroke="#cccccc"
     stroke-linejoin="round"
     id="path1" />
  <path
     d="m3 10.25h7.666667"
     fill="#008dd2"
     stroke="#008dd2"
     stroke-linejoin="round"
     stroke-width="1.5"
     id="path2" />
  <path
     d="m17.5 22v-20"
     fill="#008dd2"
     stroke="#cccccc"
     stroke-linejoin="round"
     id="path3" />
  <path
     d="m3 13.25h10.733333"
     fill="#008dd2"
     stroke="#008dd2"
     stroke-linejoin="round"
     stroke-width="1.5"
     id="path4" />
  <path
     d="m3 16.25h9.2"
     fill="#008dd2"
     stroke="#008dd2"
     stroke-linejoin="round"
     stroke-width="1.5"
     id="path6" />
  <path
     d="m20.5 9.5-1e-6 7.436494"
     fill="#008dd2"
     stroke="#008dd2"
     stroke-linecap="round"
     stroke-linejoin="round"
     stroke-width="1.7"
     id="path7" />
  <path
     d="m3 19.25h12.266667"
     fill="#008dd2"
     stroke="#008dd2"
     stroke-linejoin="round"
     stroke-width="1.5"
     id="path8" />
  <path
     style="fill:#ffffff;stroke:#008dd2;stroke-width:1;stroke-linecap:round;stroke-linejoin:round;stroke-dasharray:none;stroke-opacity:1"
     d="m 19.3,3.3 1.2,1.5 1.2,-1.5"
     id="path9"
     sodipodi:nodetypes="ccc" />
</svg>
