<?xml version="1.0" encoding="UTF-8" standalone="no"?>
<svg
   width="48"
   height="48"
   version="1.1"
   viewBox="0 0 48 48"
   id="svg3"
   sodipodi:docname="tfbadmin_200.svg"
   inkscape:version="1.3.2 (091e20e, 2023-11-25, custom)"
   xmlns:inkscape="http://www.inkscape.org/namespaces/inkscape"
   xmlns:sodipodi="http://sodipodi.sourceforge.net/DTD/sodipodi-0.dtd"
   xmlns="http://www.w3.org/2000/svg"
   xmlns:svg="http://www.w3.org/2000/svg">
  <defs
     id="defs3" />
  <sodipodi:namedview
     id="namedview3"
     pagecolor="#ffffff"
     bordercolor="#000000"
     borderopacity="0.25"
     inkscape:showpageshadow="2"
     inkscape:pageopacity="0.0"
     inkscape:pagecheckerboard="0"
     inkscape:deskcolor="#d1d1d1"
     showgrid="true"
     inkscape:current-layer="svg3">
    <inkscape:grid
       id="grid3"
       units="px"
       originx="0"
       originy="0"
       spacingx="0.5"
       spacingy="0.5"
       empcolor="#0099e5"
       empopacity="0.30196078"
       color="#0099e5"
       opacity="0.14901961"
       empspacing="2"
       dotted="false"
       gridanglex="30"
       gridanglez="30"
       visible="true" />
  </sodipodi:namedview>
  <linearGradient
     id="a"
     x1="11"
     x2="11"
     y1="1051.4"
     y2="1033.9"
     gradientUnits="userSpaceOnUse">
    <stop
       stop-color="#f00"
       offset="0"
       id="stop1" />
    <stop
       stop-color="#d4aa00"
       offset="1"
       id="stop2" />
  </linearGradient>
  <path
     transform="matrix(2 0 0 2 -8e-6 -2056.8)"
     d="m12.5 1032c4.4088 1.3471 8.61 3.853 7.0664 9.8047-.65964 2.5434-2.8876 3.8398-5.1113 3.8398-1.2499 0-1.7239-1.1751-.97852-2.0761.73567-.8893 1.1619-1.5394 1.3652-2.1192.51621-1.4722.1948-1.9349-.0332-2.2402-.51158-.685-1.2755-1.0544-2.0098-1.4473.33379-.3049.97184-.2156 1.6621-.1445.592.061.70381-.4663.48047-.9766.0776.4909-.28493.6228-.89453.5489-1.2032-.1459-3.3509-1.009-3.4922-1.0469-.83915-.2253-1.3112.1521-1.0508 1.125l-.66406.022c-.37693.013-.49842.078-.78125.25-.11014.067-.32931.2247-.5293.4414-.2452.2657-.37905.6374-.13672.9629.26362.3541.66433.5468 1 .7109.37449-.9856 1.8034-.6633 2.125-.3769 1.3466 1.1992-.22101 1.7489-1.3301 2.1816-1.5411.6012-2.645 2.2876-2.5898 4.1211.060533 2.0113.33216 2.3348.76367 3.3164.55966 1.2731 2.7967 3.003 4.6387 3.003 5.5 0 9.9998-4.4763 10-9.9991.000202-5.3288-4.1779-9.7345-9.5-10.001zm-1-.1c-5.3131.266-9.4987 4.6803-9.5 10-.0009267 3.7332 2.0982 7.15 5.416 8.8613-.80682-1.0204-1.7102-2.5578-1.8887-4.1328-5.8262-7.6925 1.2008-13.626 5.9727-14.629zm-.75781 4.9961c.46578.1127.68359.3691.68359.3691h-1.0547s-.02469-.1733-.01953-.2422c.01732-.2312.31913-.1442.39064-.1269z"
     fill="url(#a)"
     stroke-linecap="round"
     stroke-width=".6"
     id="path2" />
  <path
     d="m35.676097 13.341339h6.647806m-8.407302 3.592053 5.083399-13.866985 5.083399 13.866985"
     fill="none"
     stroke="#2a7fff"
     stroke-linecap="round"
     stroke-linejoin="round"
     stroke-width="2.13322"
     id="path3" />
</svg>
