<?xml version="1.0" encoding="UTF-8" standalone="no"?>
<svg
   height="32"
   width="32"
   version="1.1"
   id="svg2"
   sodipodi:docname="Import_01_32.svg"
   inkscape:export-filename="Import_01_32.png"
   inkscape:export-xdpi="96"
   inkscape:export-ydpi="96"
   inkscape:version="1.3 (0e150ed6c4, 2023-07-21)"
   xmlns:inkscape="http://www.inkscape.org/namespaces/inkscape"
   xmlns:sodipodi="http://sodipodi.sourceforge.net/DTD/sodipodi-0.dtd"
   xmlns="http://www.w3.org/2000/svg"
   xmlns:svg="http://www.w3.org/2000/svg">
  <defs
     id="defs2" />
  <sodipodi:namedview
     id="namedview2"
     pagecolor="#ffffff"
     bordercolor="#000000"
     borderopacity="0.25"
     inkscape:showpageshadow="2"
     inkscape:pageopacity="0.0"
     inkscape:pagecheckerboard="0"
     inkscape:deskcolor="#d1d1d1"
     showgrid="true"
     inkscape:current-layer="svg2">
    <inkscape:grid
       id="grid2"
       units="px"
       originx="0"
       originy="0"
       spacingx="0.5"
       spacingy="0.5"
       empcolor="#0099e5"
       empopacity="0.30196078"
       color="#0099e5"
       opacity="0.14901961"
       empspacing="2"
       dotted="false"
       gridanglex="30"
       gridanglez="30"
       visible="true" />
  </sodipodi:namedview>
  <rect
     fill="#ebfcff"
     height="26.500002"
     ry="3.3254905"
     stroke-width="1.5"
     width="22.5"
     x="6.75"
     y="2.75"
     id="rect2"
     style="fill:#f5f7ff;fill-opacity:1;stroke:#00aad4;stroke-linejoin:round" />
  <path
     style="fill:none;stroke:#00aad4;stroke-width:4;stroke-linejoin:round;stroke-dasharray:none;stroke-opacity:1"
     d="m 7.5,5 h 21"
     id="path1"
     sodipodi:nodetypes="cc" />
  <path
     d="M 3.0000007,16.999998 H 21.000002"
     id="path2"
     style="fill:none;stroke:#f5f7ff;stroke-width:6;stroke-linecap:round;stroke-linejoin:round;stroke-dasharray:none;stroke-opacity:1" />
  <path
     d="m 16.000064,21.999999 5.000001,-5.000001 -5.000001,-5"
     id="path3"
     style="fill:none;stroke:#f5f7ff;stroke-width:6;stroke-linecap:round;stroke-linejoin:round;stroke-dasharray:none;stroke-opacity:1" />
  <path
     d="M 3.0000007,16.999998 H 21.000002"
     id="path4"
     style="fill:none;stroke:#ccaa00;stroke-width:2;stroke-linecap:round;stroke-linejoin:round;stroke-opacity:1" />
  <path
     d="m 16.000064,21.999999 5.000001,-5.000001 -5.000001,-5"
     id="path5"
     style="fill:none;stroke:#ccaa00;stroke-width:2;stroke-linecap:round;stroke-linejoin:round;stroke-opacity:1" />
</svg>
