<svg width="24" height="24" version="1.0" xmlns="http://www.w3.org/2000/svg">
 <defs>
  <radialGradient id="a" cx="7.5807457" cy="7.6225867" r="4.5" gradientTransform="matrix(1.1666667,-6.5746832e-8,5.6354434e-8,1.0000001,2.6666659,4.6071414)" gradientUnits="userSpaceOnUse">
   <stop stop-color="#ffffff" offset="0"/>
   <stop stop-color="#aaccff" offset="1"/>
  </radialGradient>
  <radialGradient id="b" cx="12.1" cy="10.900001" r="4.5" gradientTransform="matrix(0,1.7508417,-1.7508414,3.5823873e-8,34.220537,-6.0488217)" gradientUnits="userSpaceOnUse">
   <stop stop-color="#ff7f2a" offset="0"/>
   <stop stop-color="#d45500" offset="1"/>
  </radialGradient>
 </defs>
 <rect x=".5" y="6.5" width="23" height="14" rx="1.5" ry="1.5" fill="#e6e6e6" fill-rule="evenodd" stroke="#2a7efe" stroke-linecap="round" stroke-linejoin="round" style="paint-order:normal"/>
 <path d="m8.9333334 2.5h6.1333336c0.849466 0 1.448808 0.691822 1.533333 1.541667l0.766667 7.708333h-10.733334l0.7666667-7.708333c0.084525-0.849845 0.6838667-1.541667 1.5333337-1.541667z" fill="#ececec" fill-rule="evenodd" stroke="#2a7efe" stroke-linecap="round" stroke-linejoin="round" style="paint-order:normal"/>
 <circle cx="12" cy="13" r="6" fill="url(#a)" fill-rule="evenodd" stroke="#2d68a3" stroke-linecap="round" stroke-linejoin="round" stroke-width=".999996" style="paint-order:normal"/>
 <path d="m21 9.75h-1.5" fill="none" stroke="#488acc" stroke-width="1.5px"/>
 <path d="m9.5 4.5h5" fill="none" stroke="#488acc" stroke-width="1.5px"/>
 <path d="m1.75 7v13" fill="#b3b3b3" stroke="#488acc" stroke-linejoin="round" stroke-width="1.5"/>
 <circle transform="matrix(0,1,1,0,0,0)" cx="17.5" cy="17.5" r="6.5" fill="url(#b)" stroke-linecap="round"/>
 <path d="m16.5 14.5 3 3-3 3" fill="none" stroke="#ffffff" stroke-linecap="round" stroke-linejoin="round" stroke-width="1.8"/>
</svg>
