<?xml version="1.0" encoding="UTF-8" standalone="no"?>
<svg
   height="24"
   viewBox="0 0 6.3499998 6.3500003"
   width="24"
   version="1.1"
   id="svg433"
   sodipodi:docname="Chart_08_24.svg"
   inkscape:export-filename="Chart_08_24.png"
   inkscape:export-xdpi="96"
   inkscape:export-ydpi="96"
   inkscape:version="1.2 (dc2aedaf03, 2022-05-15)"
   xmlns:inkscape="http://www.inkscape.org/namespaces/inkscape"
   xmlns:sodipodi="http://sodipodi.sourceforge.net/DTD/sodipodi-0.dtd"
   xmlns:xlink="http://www.w3.org/1999/xlink"
   xmlns="http://www.w3.org/2000/svg"
   xmlns:svg="http://www.w3.org/2000/svg">
  <defs
     id="defs437">
    <linearGradient
       inkscape:collect="always"
       id="linearGradient2749">
      <stop
         style="stop-color:#ffffff;stop-opacity:1"
         offset="0"
         id="stop2747" />
      <stop
         style="stop-color:#ffd42a;stop-opacity:1;"
         offset="1"
         id="stop2745" />
    </linearGradient>
    <linearGradient
       inkscape:collect="always"
       id="linearGradient2739">
      <stop
         style="stop-color:#ffffff;stop-opacity:1"
         offset="0"
         id="stop2737" />
      <stop
         style="stop-color:#ff5555;stop-opacity:1;"
         offset="1"
         id="stop2735" />
    </linearGradient>
    <linearGradient
       inkscape:collect="always"
       id="linearGradient2729">
      <stop
         style="stop-color:#ffffff;stop-opacity:1"
         offset="0"
         id="stop2727" />
      <stop
         style="stop-color:#87decd;stop-opacity:1;"
         offset="1"
         id="stop2725" />
    </linearGradient>
    <linearGradient
       inkscape:collect="always"
       xlink:href="#linearGradient2729"
       id="linearGradient2731"
       x1="0.79375024"
       y1="4.3656248"
       x2="2.38125"
       y2="4.3656248"
       gradientUnits="userSpaceOnUse" />
    <linearGradient
       inkscape:collect="always"
       xlink:href="#linearGradient2739"
       id="linearGradient2741"
       x1="2.38125"
       y1="3.8364584"
       x2="3.96875"
       y2="3.8364584"
       gradientUnits="userSpaceOnUse" />
    <linearGradient
       inkscape:collect="always"
       xlink:href="#linearGradient2749"
       id="linearGradient2751"
       x1="3.9687503"
       y1="3.1749999"
       x2="5.5562503"
       y2="3.1749999"
       gradientUnits="userSpaceOnUse" />
    <linearGradient
       id="a"
       gradientUnits="userSpaceOnUse"
       x1="14.084459"
       x2="8.9155407"
       y1="14.084458"
       y2="8.9155388">
      <stop
         offset="0"
         stop-color="#a00"
         id="stop962" />
      <stop
         offset="1"
         stop-color="#f55"
         id="stop964" />
    </linearGradient>
  </defs>
  <sodipodi:namedview
     id="namedview435"
     pagecolor="#ffffff"
     bordercolor="#666666"
     borderopacity="1.0"
     inkscape:showpageshadow="2"
     inkscape:pageopacity="0.0"
     inkscape:pagecheckerboard="0"
     inkscape:deskcolor="#d1d1d1"
     showgrid="true"
     inkscape:zoom="38.25"
     inkscape:cx="10.679739"
     inkscape:cy="12"
     inkscape:current-layer="svg433">
    <inkscape:grid
       type="xygrid"
       id="grid3118" />
  </sodipodi:namedview>
  <path
     d="M 2.282031,2.4804688 H 0.89296924 V 6.2507807 H 2.282031 Z"
     fill="#87decd"
     stroke="#5fd3bc"
     id="path419"
     style="stroke-width:0.198438;stroke-linecap:round;stroke-dashoffset:1.49998;fill-opacity:1;fill:url(#linearGradient2731)" />
  <path
     d="M 5.4570313,0.09921898 H 4.0679693 V 6.2507808 h 1.389062 z"
     fill="#ffd42a"
     stroke="#ffcc00"
     id="path421"
     style="stroke-width:0.198438;stroke-linecap:round;stroke-dashoffset:1.49998;fill-opacity:1;fill:url(#linearGradient2751)" />
  <path
     d="M 3.869531,1.4221357 H 2.480469 V 6.250781 h 1.389062 z"
     fill="#ff5555"
     stroke="#ff5252"
     id="path423"
     style="stroke-width:0.198438;stroke-linecap:round;stroke-dashoffset:1.49998;fill-opacity:1;fill:url(#linearGradient2741)" />
  <g
     stroke="#ffffff"
     stroke-linecap="round"
     id="g975"
     transform="scale(0.26458334)">
    <circle
       cx="11.5"
       cy="11.5"
       fill="url(#a)"
       r="4.1351352"
       stroke-dashoffset="1.49998"
       stroke-linejoin="round"
       stroke-width="0.72973"
       transform="matrix(0,1.4444444,1.4444444,0,0.888889,0.888889)"
       id="circle967"
       style="fill:url(#a)" />
    <g
       fill="none"
       stroke-width="1.28565"
       transform="matrix(1.4043927,0,0,1.4043927,1.3494833,1.3494848)"
       id="g973">
      <path
         d="m 12.914214,10.085786 -2.828428,2.828427"
         id="path969" />
      <path
         d="M 12.914214,12.914213 10.085786,10.085786"
         id="path971" />
    </g>
  </g>
</svg>
