<svg width="64" height="64" version="1.1" xmlns="http://www.w3.org/2000/svg">
 <radialGradient id="a" cx="3.276873" cy="1043.5577" r="9" gradientTransform="matrix(4.031e-5,4.6959084,-4.6959688,2.9342e-4,4937.8295,21.621671)" gradientUnits="userSpaceOnUse">
  <stop stop-color="#fff" offset="0"/>
  <stop stop-color="#a8aebd" offset="1"/>
 </radialGradient>
 <radialGradient id="b" cx="8.888889" cy="11" r="5" gradientTransform="matrix(-3.1e-7,9.2210523,-9.2210529,-7.2e-7,134.90527,-48.491216)" gradientUnits="userSpaceOnUse">
  <stop stop-color="#bfbfbf" offset="0"/>
  <stop stop-color="#8c8c8c" offset="1"/>
 </radialGradient>
 <g>
  <circle cx="45" cy="45" r="18.25" fill="url(#a)" stroke="url(#b)" stroke-linecap="round" stroke-linejoin="round" stroke-width="1.5"/>
  <circle cx="59" cy="45" r="1" fill="#0088aa" stroke-width="1.66667"/>
  <path d="m45 31.5v13.5h8" fill="none" stroke="#666666" stroke-linecap="round" stroke-linejoin="round" stroke-width="2"/>
  <circle cx="45" cy="59" r="1" fill="#0088aa" stroke-width="1.66667"/>
  <circle cx="31" cy="45" r="1" fill="#0088aa" stroke-width="1.66667"/>
  <circle transform="rotate(-30)" cx="30.471144" cy="61.471142" r="1" fill="#0088aa" stroke-width="1.66667"/>
  <circle transform="rotate(-30)" cx="2.471143" cy="61.471142" r="1" fill="#0088aa" stroke-width="1.66667"/>
  <circle transform="rotate(-60)" cx="-2.4711421" cy="61.471142" r="1" fill="#0088aa" stroke-width="1.66667"/>
  <circle transform="rotate(-60)" cx="-30.471142" cy="61.471142" r="1" fill="#0088aa" stroke-width="1.66667"/>
  <circle transform="matrix(-.8660254 -.5 -.5 .8660254 0 0)" cx="-47.471142" cy="16.471142" r="1" fill="#0088aa" stroke-width="1.66667"/>
  <circle transform="matrix(-.8660254 -.5 -.5 .8660254 0 0)" cx="-75.471146" cy="16.471142" r="1" fill="#0088aa" stroke-width="1.66667"/>
  <circle transform="matrix(-.5 -.8660254 -.8660254 .5 0 0)" cx="-47.471142" cy="-16.471144" r="1" fill="#0088aa" stroke-width="1.66667"/>
  <circle transform="matrix(-.5 -.8660254 -.8660254 .5 0 0)" cx="-75.471138" cy="-16.471144" r="1" fill="#0088aa" stroke-width="1.66667"/>
 </g>
</svg>
