<?xml version="1.0" encoding="UTF-8" standalone="no"?>
<svg
   width="48"
   height="48"
   version="1.1"
   viewBox="0 0 12.7 12.700001"
   id="svg3"
   sodipodi:docname="Sound_07_48.svg"
   inkscape:export-filename="Sound_07_48.png"
   inkscape:export-xdpi="96"
   inkscape:export-ydpi="96"
   inkscape:version="1.3.2 (091e20e, 2023-11-25, custom)"
   xmlns:inkscape="http://www.inkscape.org/namespaces/inkscape"
   xmlns:sodipodi="http://sodipodi.sourceforge.net/DTD/sodipodi-0.dtd"
   xmlns="http://www.w3.org/2000/svg"
   xmlns:svg="http://www.w3.org/2000/svg">
  <defs
     id="defs3" />
  <sodipodi:namedview
     id="namedview3"
     pagecolor="#ffffff"
     bordercolor="#000000"
     borderopacity="0.25"
     inkscape:showpageshadow="2"
     inkscape:pageopacity="0.0"
     inkscape:pagecheckerboard="0"
     inkscape:deskcolor="#d1d1d1"
     showgrid="true"
     inkscape:current-layer="svg3">
    <inkscape:grid
       id="grid3"
       units="px"
       originx="0"
       originy="0"
       spacingx="0.13229167"
       spacingy="0.13229168"
       empcolor="#0099e5"
       empopacity="0.30196078"
       color="#0099e5"
       opacity="0.14901961"
       empspacing="2"
       dotted="false"
       gridanglex="30"
       gridanglez="30"
       visible="true" />
  </sodipodi:namedview>
  <g
     transform="scale(3.0000004)"
     stroke-linecap="round"
     stroke-linejoin="round"
     id="g3">
    <path
       d="m3.5041024 0.46259829c0.2048066 0.2088114 0.3046521 0.69276391 0.0413297 0.88490821-0.3530084 0.2954547-0.7287499 0.5482969-1.1173639 0.2121614s-0.0630448-0.80575661 0.2080932-1.1392084c0.2066659-0.2541619 0.6631336-0.1666726 0.867941 0.0421388z"
       fill="#00aad4"
       id="path1" />
    <path
       d="m0.61282968 3.3559566c-0.19843119 0.1984311 0.1072937 0.8772512 0.84248622 0.6126764 0.5875764-0.2114522 0.6614374-0.9260123 1.1905871-1.0583 0.52915-0.1322878 0.9260123 0.2645751 0.7937252 0.7937248"
       fill="none"
       stroke="#ff7f2a"
       stroke-linejoin="round"
       stroke-width=".264575"
       id="path2" />
    <path
       d="m2.0072802 1.3617425c0.06592 0.3195154 0.2499521 0.5336439 0.5997635 0.5997636l-1.6271426 1.4892493c-0.07951 0.072772-0.2022146 0.070057-0.2784302-0.00615l-0.1772854-0.1772822c-0.07621559-0.0762156-0.07892759-0.1989207-0.0061498-0.2784302z"
       fill="#00aad4"
       id="path3" />
  </g>
</svg>
