<?xml version="1.0" encoding="UTF-8" standalone="no"?>
<svg
   height="36"
   viewBox="0 0 36 36"
   width="36"
   version="1.1"
   id="svg5"
   sodipodi:docname="WiFi_02_36.svg"
   inkscape:export-filename="WiFi_02_36.png"
   inkscape:export-xdpi="96"
   inkscape:export-ydpi="96"
   inkscape:version="1.3.2 (091e20e, 2023-11-25, custom)"
   xmlns:inkscape="http://www.inkscape.org/namespaces/inkscape"
   xmlns:sodipodi="http://sodipodi.sourceforge.net/DTD/sodipodi-0.dtd"
   xmlns="http://www.w3.org/2000/svg"
   xmlns:svg="http://www.w3.org/2000/svg">
  <defs
     id="defs5" />
  <sodipodi:namedview
     id="namedview5"
     pagecolor="#ffffff"
     bordercolor="#000000"
     borderopacity="0.25"
     inkscape:showpageshadow="2"
     inkscape:pageopacity="0.0"
     inkscape:pagecheckerboard="0"
     inkscape:deskcolor="#d1d1d1"
     showgrid="true"
     inkscape:current-layer="svg5">
    <inkscape:grid
       id="grid5"
       units="px"
       originx="0"
       originy="0"
       spacingx="0.5"
       spacingy="0.5"
       empcolor="#0099e5"
       empopacity="0.30196078"
       color="#0099e5"
       opacity="0.14901961"
       empspacing="2"
       dotted="false"
       gridanglex="30"
       gridanglez="30"
       visible="true" />
  </sodipodi:namedview>
  <path
     d="m16.875 11.625h2.25l1.125 16.875 6.75 1.95605v2.54395h-18v-2.25l6.75-2.25z"
     fill="#ff7f00"
     id="path1" />
  <path
     d="m24.112793 7.29199-1.520507 1.639161c1.324937 1.230671 2.157714 2.983286 2.157714 4.943849 0 1.96056-.832777 3.713174-2.157714 4.943846l1.520507 1.639161c1.770303-1.64534 2.887207-3.985166 2.887207-6.583007 0-2.597844-1.116904-4.93767-2.887207-6.58301z"
     fill="#2a7efe"
     stroke-linecap="round"
     stroke-linejoin="round"
     stroke-width=".999999"
     id="path2" />
  <path
     d="m13.407714 18.818846c-1.324937-1.230672-2.157714-2.983287-2.157714-4.943846 0-1.960563.832777-3.713178 2.157714-4.943849l-1.520507-1.639161c-1.770303 1.645339-2.887207 3.985166-2.887207 6.58301 0 2.597841 1.116904 4.937667 2.887207 6.583007z"
     fill="#2a7efe"
     stroke-linecap="round"
     stroke-linejoin="round"
     stroke-width=".999999"
     id="path3" />
  <path
     d="m27.944824 3.165526-1.520507 1.634767c2.431764 2.257922 3.950683 5.484975 3.950683 9.074707 0 3.589728-1.518919 6.816782-3.950683 9.074706l1.520507 1.634767c2.87582-2.672491 4.680176-6.483569 4.680176-10.709473 0-4.225908-1.804356-8.036982-4.680176-10.709474z"
     fill="#2a7efe"
     stroke-linecap="round"
     stroke-linejoin="round"
     stroke-width=".999999"
     id="path4" />
  <path
     d="m9.575683 22.949706c-2.431764-2.257924-3.950683-5.484978-3.950683-9.074706 0-3.589732 1.518919-6.816785 3.950683-9.074707l-1.520508-1.634767c-2.875819 2.672492-4.680175 6.483566-4.680175 10.709474 0 4.225904 1.804356 8.036982 4.680175 10.709473z"
     fill="#2a7efe"
     stroke-linecap="round"
     stroke-linejoin="round"
     stroke-width=".999999"
     id="path5" />
</svg>
