<?xml version="1.0" encoding="UTF-8" standalone="no"?>
<svg
   height="12"
   width="12"
   version="1.1"
   id="svg278"
   sodipodi:docname="state_information_75.svg"
   inkscape:export-filename="state_information_75.png"
   inkscape:export-xdpi="96"
   inkscape:export-ydpi="96"
   inkscape:version="1.2.2 (732a01da63, 2022-12-09)"
   xmlns:inkscape="http://www.inkscape.org/namespaces/inkscape"
   xmlns:sodipodi="http://sodipodi.sourceforge.net/DTD/sodipodi-0.dtd"
   xmlns="http://www.w3.org/2000/svg"
   xmlns:svg="http://www.w3.org/2000/svg">
  <defs
     id="defs282" />
  <sodipodi:namedview
     id="namedview280"
     pagecolor="#ffffff"
     bordercolor="#666666"
     borderopacity="1.0"
     inkscape:showpageshadow="2"
     inkscape:pageopacity="0.0"
     inkscape:pagecheckerboard="0"
     inkscape:deskcolor="#d1d1d1"
     showgrid="true"
     inkscape:zoom="76.5"
     inkscape:cx="5.3594771"
     inkscape:cy="6"
     inkscape:current-layer="svg278">
    <inkscape:grid
       type="xygrid"
       id="grid790" />
  </sodipodi:namedview>
  <circle
     cx="6.25"
     cy="6"
     r="5.75"
     style="fill:#2a7fff;fill-opacity:1;fill-rule:evenodd;stroke:none;stroke-width:1.25455;stroke-linecap:round;stroke-linejoin:round"
     id="circle2" />
  <g
     id="g2958"
     transform="matrix(1.0909091,0,0,1.0909091,8.05,0.5454545)"
     style="stroke-width:1.375;stroke-dasharray:none">
    <path
       d="M -1.65,4.5920833 V 8"
       fill="none"
       stroke="#2a7fff"
       stroke-linecap="round"
       stroke-width="3"
       id="path405"
       style="fill:none;stroke:#ffffff;stroke-width:1.375;stroke-dasharray:none"
       sodipodi:nodetypes="cc" />
    <path
       d="M -1.65,2.0914167 V 2.35"
       fill="none"
       stroke="#2a7fff"
       stroke-linecap="round"
       stroke-width="3"
       id="path1602"
       style="fill:none;stroke:#ffffff;stroke-width:1.375;stroke-dasharray:none"
       sodipodi:nodetypes="cc" />
  </g>
</svg>
