<?xml version="1.0" encoding="UTF-8" standalone="no"?>
<svg
   height="16"
   viewBox="0 0 4.2333332 4.2333335"
   width="16"
   version="1.1"
   id="svg16"
   sodipodi:docname="Chart_04_16.svg"
   inkscape:version="1.2 (dc2aedaf03, 2022-05-15)"
   inkscape:export-filename="Chart_04_16.png"
   inkscape:export-xdpi="96"
   inkscape:export-ydpi="96"
   xmlns:inkscape="http://www.inkscape.org/namespaces/inkscape"
   xmlns:sodipodi="http://sodipodi.sourceforge.net/DTD/sodipodi-0.dtd"
   xmlns:xlink="http://www.w3.org/1999/xlink"
   xmlns="http://www.w3.org/2000/svg"
   xmlns:svg="http://www.w3.org/2000/svg">
  <defs
     id="defs20">
    <linearGradient
       inkscape:collect="always"
       id="linearGradient969">
      <stop
         style="stop-color:#ffffff;stop-opacity:1"
         offset="0"
         id="stop967" />
      <stop
         style="stop-color:#87decd;stop-opacity:1;"
         offset="1"
         id="stop965" />
    </linearGradient>
    <linearGradient
       inkscape:collect="always"
       id="linearGradient959">
      <stop
         style="stop-color:#ffffff;stop-opacity:1"
         offset="0"
         id="stop957" />
      <stop
         style="stop-color:#ff5555;stop-opacity:1;"
         offset="1"
         id="stop955" />
    </linearGradient>
    <linearGradient
       inkscape:collect="always"
       id="linearGradient949">
      <stop
         style="stop-color:#ffffff;stop-opacity:1"
         offset="0"
         id="stop947" />
      <stop
         style="stop-color:#ffd42a;stop-opacity:1;"
         offset="1"
         id="stop945" />
    </linearGradient>
    <linearGradient
       inkscape:collect="always"
       xlink:href="#linearGradient949"
       id="linearGradient951"
       x1="2.6458324"
       y1="2.1166667"
       x2="3.7041658"
       y2="2.1166667"
       gradientUnits="userSpaceOnUse" />
    <linearGradient
       inkscape:collect="always"
       xlink:href="#linearGradient959"
       id="linearGradient961"
       x1="1.5874988"
       y1="2.5135417"
       x2="2.6458322"
       y2="2.5135417"
       gradientUnits="userSpaceOnUse" />
    <linearGradient
       inkscape:collect="always"
       xlink:href="#linearGradient969"
       id="linearGradient971"
       x1="0.52916553"
       y1="2.9104167"
       x2="1.5874988"
       y2="2.9104167"
       gradientUnits="userSpaceOnUse" />
  </defs>
  <sodipodi:namedview
     id="namedview18"
     pagecolor="#ffffff"
     bordercolor="#666666"
     borderopacity="1.0"
     inkscape:showpageshadow="2"
     inkscape:pageopacity="0.0"
     inkscape:pagecheckerboard="0"
     inkscape:deskcolor="#d1d1d1"
     showgrid="true"
     inkscape:zoom="57.375"
     inkscape:cx="6.4662309"
     inkscape:cy="8"
     inkscape:current-layer="svg16">
    <inkscape:grid
       type="xygrid"
       id="grid1039" />
  </sodipodi:namedview>
  <path
     d="M 1.5213528,1.653646 H 0.59531153 V 4.1671874 H 1.5213528 Z"
     fill="#87decd"
     stroke="#5fd3bc"
     id="path2"
     style="stroke-width:0.132292;stroke-linecap:round;stroke-dashoffset:1.49998;fill-opacity:1;fill:url(#linearGradient971)" />
  <path
     d="M 3.6380207,0.06614599 H 2.7119793 V 4.1671875 h 0.9260414 z"
     fill="#ffd42a"
     stroke="#ffcc00"
     id="path4"
     style="fill:url(#linearGradient951);fill-opacity:1;stroke-width:0.132292;stroke-linecap:round;stroke-dashoffset:1.49998" />
  <path
     d="M 2.5796862,0.85989601 H 1.6536448 V 4.1671874 h 0.9260414 z"
     fill="#ff5555"
     stroke="#ff5252"
     id="path6"
     style="stroke-width:0.132292;stroke-linecap:round;stroke-dashoffset:1.49998;fill-opacity:1;fill:url(#linearGradient961);stroke:#ff5252;stroke-opacity:1" />
</svg>
