<?xml version="1.0" encoding="UTF-8" standalone="no"?>
<svg
   height="16"
   width="16"
   version="1.1"
   id="svg4602"
   sodipodi:docname="bookmark9_150.svg"
   inkscape:export-filename="bookmark9_150.png"
   inkscape:export-xdpi="96"
   inkscape:export-ydpi="96"
   inkscape:version="1.2.2 (732a01da63, 2022-12-09)"
   xmlns:inkscape="http://www.inkscape.org/namespaces/inkscape"
   xmlns:sodipodi="http://sodipodi.sourceforge.net/DTD/sodipodi-0.dtd"
   xmlns="http://www.w3.org/2000/svg"
   xmlns:svg="http://www.w3.org/2000/svg">
  <defs
     id="defs4606" />
  <sodipodi:namedview
     id="namedview4604"
     pagecolor="#ffffff"
     bordercolor="#666666"
     borderopacity="1.0"
     inkscape:showpageshadow="2"
     inkscape:pageopacity="0.0"
     inkscape:pagecheckerboard="0"
     inkscape:deskcolor="#d1d1d1"
     showgrid="true"
     inkscape:zoom="57.375"
     inkscape:cx="8"
     inkscape:cy="8"
     inkscape:current-layer="svg4602">
    <inkscape:grid
       type="xygrid"
       id="grid5017" />
  </sodipodi:namedview>
  <radialGradient
     id="a"
     cx="8"
     cy="8.000001"
     gradientUnits="userSpaceOnUse"
     r="8">
    <stop
       offset="0"
       stop-color="#4881cc"
       id="stop4591" />
    <stop
       offset=".81818181"
       stop-color="#4781cc"
       id="stop4593" />
    <stop
       offset="1"
       stop-color="#569af2"
       id="stop4595" />
  </radialGradient>
  <circle
     cx="8"
     cy="8"
     fill="url(#a)"
     r="8"
     id="circle4598" />
  <path
     d="M 8.4895935,8.7091921 C 7.8255608,9.0435933 7.1237554,8.9975322 6.4547677,8.6990251 5.4612017,8.2351259 5.0199267,7.1742193 5.0041472,6.1982686 4.9627614,5.2162789 5.2226795,4.1105426 6.1358587,3.5008401 6.9770115,2.949302 8.1099324,2.8906796 9.0807948,3.1436597 c 0.8905323,0.2352415 1.5487032,0.95884 1.7661132,1.7733626 0.401726,1.4046686 -0.03402,2.8898253 -0.762002,4.1399113 L 8.0000237,13.000001 H 6.175453 Z M 9.3669655,6.7728996 C 9.5763891,6.2199997 9.5671293,5.3834066 9.1464679,4.8203911 8.6640679,4.215268 7.5881157,4.1784433 6.9979727,4.6649278 6.4719759,5.1498843 6.4524735,5.9050105 6.5643853,6.5419679 6.6510121,7.0955213 7.1644685,7.6135535 7.7936426,7.6616242 8.697271,7.6931077 9.1312023,7.3952431 9.3669466,6.7728989 Z"
     fill="#ffffff"
     stroke-width="0.999991"
     id="path2255"
     style="fill:#ffffff"
     sodipodi:nodetypes="ccccccccccsccccs" />
</svg>
