<?xml version="1.0" encoding="UTF-8" standalone="no"?>
<svg
   height="36"
   viewBox="0 0 9.5249997 9.5250005"
   width="36"
   version="1.1"
   id="svg16"
   sodipodi:docname="Chart_08_36.svg"
   inkscape:export-filename="Chart_08_36.png"
   inkscape:export-xdpi="96"
   inkscape:export-ydpi="96"
   inkscape:version="1.2 (dc2aedaf03, 2022-05-15)"
   xmlns:inkscape="http://www.inkscape.org/namespaces/inkscape"
   xmlns:sodipodi="http://sodipodi.sourceforge.net/DTD/sodipodi-0.dtd"
   xmlns:xlink="http://www.w3.org/1999/xlink"
   xmlns="http://www.w3.org/2000/svg"
   xmlns:svg="http://www.w3.org/2000/svg">
  <defs
     id="defs20">
    <linearGradient
       inkscape:collect="always"
       id="linearGradient6257">
      <stop
         style="stop-color:#ffffff;stop-opacity:1"
         offset="0"
         id="stop6255" />
      <stop
         style="stop-color:#ffd42a;stop-opacity:1;"
         offset="1"
         id="stop6253" />
    </linearGradient>
    <linearGradient
       inkscape:collect="always"
       id="linearGradient6247">
      <stop
         style="stop-color:#ffffff;stop-opacity:1"
         offset="0"
         id="stop6245" />
      <stop
         style="stop-color:#ff5555;stop-opacity:1;"
         offset="1"
         id="stop6243" />
    </linearGradient>
    <linearGradient
       inkscape:collect="always"
       id="linearGradient6237">
      <stop
         style="stop-color:#ffffff;stop-opacity:1"
         offset="0"
         id="stop6235" />
      <stop
         style="stop-color:#87decd;stop-opacity:1;"
         offset="1"
         id="stop6233" />
    </linearGradient>
    <linearGradient
       inkscape:collect="always"
       xlink:href="#linearGradient6237"
       id="linearGradient6239"
       x1="1.3229164"
       y1="6.3499996"
       x2="3.7041661"
       y2="6.3499996"
       gradientUnits="userSpaceOnUse" />
    <linearGradient
       inkscape:collect="always"
       xlink:href="#linearGradient6247"
       id="linearGradient6249"
       x1="3.7041664"
       y1="5.55625"
       x2="6.0854162"
       y2="5.55625"
       gradientUnits="userSpaceOnUse" />
    <linearGradient
       inkscape:collect="always"
       xlink:href="#linearGradient6257"
       id="linearGradient6259"
       x1="6.0854166"
       y1="4.7625"
       x2="8.4666667"
       y2="4.7625"
       gradientUnits="userSpaceOnUse" />
    <linearGradient
       id="a"
       gradientUnits="userSpaceOnUse"
       x1="14.084459"
       x2="8.9155407"
       y1="14.084458"
       y2="8.9155388">
      <stop
         offset="0"
         stop-color="#a00"
         id="stop1238" />
      <stop
         offset="1"
         stop-color="#f55"
         id="stop1240" />
    </linearGradient>
  </defs>
  <sodipodi:namedview
     id="namedview18"
     pagecolor="#ffffff"
     bordercolor="#666666"
     borderopacity="1.0"
     inkscape:showpageshadow="2"
     inkscape:pageopacity="0.0"
     inkscape:pagecheckerboard="0"
     inkscape:deskcolor="#d1d1d1"
     showgrid="true"
     inkscape:zoom="25.5"
     inkscape:cx="15.980392"
     inkscape:cy="18"
     inkscape:current-layer="svg16">
    <inkscape:grid
       type="xygrid"
       id="grid6627" />
  </sodipodi:namedview>
  <path
     d="M 3.5553376,3.3238283 H 1.4717449 V 9.376171 h 2.0835927 z"
     fill="#87decd"
     stroke="#5fd3bc"
     id="path2"
     style="stroke-width:0.297657;stroke-linecap:round;stroke-dashoffset:1.49998;fill-opacity:1;fill:url(#linearGradient6239)" />
  <path
     d="M 8.3178382,0.14882847 H 6.2342451 V 9.3761715 h 2.0835931 z"
     fill="#ffd42a"
     stroke="#ffcc00"
     id="path4"
     style="stroke-width:0.297657;stroke-linecap:round;stroke-dashoffset:1.49998;fill-opacity:1;fill:url(#linearGradient6259)" />
  <path
     d="M 5.9365877,1.7363285 H 3.8529949 v 7.639843 h 2.0835928 z"
     fill="#ff5555"
     stroke="#ff5252"
     id="path6"
     style="stroke-width:0.297657;stroke-linecap:round;stroke-dashoffset:1.49998;fill-opacity:1;fill:url(#linearGradient6249)" />
  <g
     stroke="#ffffff"
     stroke-linecap="round"
     id="g1251"
     transform="scale(0.26458334)">
    <circle
       cx="11.5"
       cy="11.5"
       fill="url(#a)"
       r="4.1351352"
       stroke-dashoffset="1.49998"
       stroke-linejoin="round"
       stroke-width="0.72973"
       transform="matrix(0,2.111111,2.111111,0,2.222224,2.222224)"
       id="circle1243"
       style="fill:url(#a)" />
    <g
       fill="none"
       stroke-width="1.28565"
       transform="matrix(2.0525738,0,0,2.0525738,2.8954003,2.8954024)"
       id="g1249">
      <path
         d="m 12.914214,10.085786 -2.828428,2.828427"
         id="path1245" />
      <path
         d="M 12.914214,12.914213 10.085786,10.085786"
         id="path1247" />
    </g>
  </g>
</svg>
