<?xml version="1.0" encoding="UTF-8" standalone="no"?>
<svg
   height="24"
   width="24"
   version="1.1"
   id="svg145"
   sodipodi:docname="Cloud_04_24.svg"
   inkscape:export-filename="Cloud_04_24.png"
   inkscape:export-xdpi="96"
   inkscape:export-ydpi="96"
   inkscape:version="1.2.1 (9c6d41e410, 2022-07-14)"
   xmlns:inkscape="http://www.inkscape.org/namespaces/inkscape"
   xmlns:sodipodi="http://sodipodi.sourceforge.net/DTD/sodipodi-0.dtd"
   xmlns="http://www.w3.org/2000/svg"
   xmlns:svg="http://www.w3.org/2000/svg">
  <defs
     id="defs149" />
  <sodipodi:namedview
     id="namedview147"
     pagecolor="#ffffff"
     bordercolor="#666666"
     borderopacity="1.0"
     inkscape:showpageshadow="2"
     inkscape:pageopacity="0.0"
     inkscape:pagecheckerboard="0"
     inkscape:deskcolor="#d1d1d1"
     showgrid="true"
     inkscape:zoom="38.25"
     inkscape:cx="11.986928"
     inkscape:cy="12"
     inkscape:current-layer="svg145">
    <inkscape:grid
       type="xygrid"
       id="grid828" />
  </sodipodi:namedview>
  <linearGradient
     id="a"
     gradientTransform="matrix(1.0000001 0 0 .96627918 -.000185 .021704)"
     gradientUnits="userSpaceOnUse"
     x1="7.5"
     x2="9"
     y1="2"
     y2="13">
    <stop
       offset="0"
       stop-color="#5ab4f2"
       id="stop138" />
    <stop
       offset="1"
       stop-color="#0090ff"
       id="stop140" />
  </linearGradient>
  <path
     d="m3.2916412 12.583334c-4.3402416 0-4.3402416-5.8903525-.2858608-5.8903525-.5693967-6.06642786 9.1223586-5.70499836 9.1223586-1.4725879 4.918073-.3594726 5.574822 7.3629404-.506799 7.3629404z"
     fill="url(#a)"
     transform="matrix(1.5 0 0 1.5 .000278 0)"
     id="path143" />
  <g
     fill="none"
     stroke-linecap="round"
     transform="matrix(1.65,0,0,1.5999969,-8.025089,-4.172465)"
     id="g155">
    <g
       stroke="#ffffff"
       stroke-width="2.21565"
       id="g147">
      <path
         d="m 10.5,12.499938 1.99999,-2 2.00001,2"
         stroke-linejoin="round"
         id="path143-3" />
      <path
         d="M 12.500063,10.5 12.5,16.5"
         id="path145" />
    </g>
    <g
       stroke="#ff7f00"
       stroke-width="0.73855"
       id="g153">
      <path
         d="m 10.5,12.499938 1.99999,-2 2.00001,2"
         stroke-linejoin="round"
         id="path149" />
      <path
         d="M 12.500063,10.5 12.5,16.5"
         id="path151" />
    </g>
  </g>
</svg>
