<?xml version="1.0" encoding="UTF-8" standalone="no"?>
<svg
   height="48"
   width="48"
   version="1.1"
   id="svg566"
   sodipodi:docname="Delete_01_48.svg"
   inkscape:export-filename="Delete_01_48.png"
   inkscape:export-xdpi="96"
   inkscape:export-ydpi="96"
   inkscape:version="1.2-beta (1b65182ce9, 2022-04-05)"
   xmlns:inkscape="http://www.inkscape.org/namespaces/inkscape"
   xmlns:sodipodi="http://sodipodi.sourceforge.net/DTD/sodipodi-0.dtd"
   xmlns="http://www.w3.org/2000/svg"
   xmlns:svg="http://www.w3.org/2000/svg">
  <defs
     id="defs570" />
  <sodipodi:namedview
     id="namedview568"
     pagecolor="#ffffff"
     bordercolor="#666666"
     borderopacity="1.0"
     inkscape:pageshadow="2"
     inkscape:pageopacity="0.0"
     inkscape:pagecheckerboard="0"
     inkscape:deskcolor="#d1d1d1"
     showgrid="true"
     inkscape:zoom="19.125"
     inkscape:cx="24"
     inkscape:cy="24"
     inkscape:current-layer="svg566">
    <inkscape:grid
       type="xygrid"
       id="grid2079" />
  </sodipodi:namedview>
  <path
     d="M 11.999978,7.4999704 24.000001,19.499992 36.000022,7.4999704 40.50003,11.999978 28.500009,24.000001 40.50003,36.000022 36.000022,40.50003 24.000001,28.500009 11.999978,40.50003 7.4999704,36.000022 19.499992,24.000001 7.4999704,11.999978 Z"
     style="fill:#e60014;fill-rule:evenodd;stroke:#aa0000;stroke-width:1.5;stroke-linejoin:round;stroke-opacity:0.968627"
     id="path564" />
</svg>
