<?xml version="1.0" encoding="UTF-8" standalone="no"?>
<svg
   height="16"
   width="16"
   version="1.1"
   id="svg25"
   sodipodi:docname="pg_save_as.svg"
   inkscape:export-filename="pg_save_as.png"
   inkscape:export-xdpi="96"
   inkscape:export-ydpi="96"
   inkscape:version="1.3-beta (cedbd6c6ff, 2023-05-28)"
   xmlns:inkscape="http://www.inkscape.org/namespaces/inkscape"
   xmlns:sodipodi="http://sodipodi.sourceforge.net/DTD/sodipodi-0.dtd"
   xmlns="http://www.w3.org/2000/svg"
   xmlns:svg="http://www.w3.org/2000/svg">
  <defs
     id="defs25" />
  <sodipodi:namedview
     id="namedview25"
     pagecolor="#ffffff"
     bordercolor="#000000"
     borderopacity="0.25"
     inkscape:showpageshadow="2"
     inkscape:pageopacity="0.0"
     inkscape:pagecheckerboard="0"
     inkscape:deskcolor="#d1d1d1"
     showgrid="true"
     inkscape:current-layer="svg25">
    <inkscape:grid
       id="grid25"
       units="px"
       originx="0"
       originy="0"
       spacingx="0.5"
       spacingy="0.5"
       empcolor="#0099e5"
       empopacity="0.30196078"
       color="#0099e5"
       opacity="0.14901961"
       empspacing="2"
       dotted="false"
       gridanglex="30"
       gridanglez="30"
       visible="true" />
  </sodipodi:namedview>
  <linearGradient
     id="a"
     gradientTransform="matrix(1.0666667 0 0 .88888889 0 .888889)"
     gradientUnits="userSpaceOnUse"
     x1="2"
     x2="5"
     y1="9"
     y2="11">
    <stop
       offset="0"
       stop-color="#f00"
       id="stop1" />
    <stop
       offset="1"
       stop-color="#fff"
       id="stop2" />
  </linearGradient>
  <linearGradient
     id="b"
     gradientTransform="matrix(.88888889 0 0 1.0666667 .888889 -.533333)"
     gradientUnits="userSpaceOnUse"
     x1="7"
     x2="5"
     y1="10"
     y2="13">
    <stop
       offset="0"
       stop-color="#fc0"
       id="stop3" />
    <stop
       offset="1"
       stop-color="#fff"
       id="stop4" />
  </linearGradient>
  <linearGradient
     id="c"
     gradientTransform="matrix(1.0666667 0 0 .88888889 -.533333 1.777778)"
     gradientUnits="userSpaceOnUse"
     x1="6"
     x2="3"
     y1="15"
     y2="13">
    <stop
       offset="0"
       stop-color="#06f"
       id="stop5" />
    <stop
       offset="1"
       stop-color="#fff"
       id="stop6" />
  </linearGradient>
  <linearGradient
     id="d"
     gradientTransform="matrix(.88888889 0 0 1.0666667 0 -1.066667)"
     gradientUnits="userSpaceOnUse"
     x1="1"
     x2="3"
     y1="14"
     y2="11">
    <stop
       offset="0"
       stop-color="#0c0"
       id="stop7" />
    <stop
       offset="1"
       stop-color="#fff"
       id="stop8" />
  </linearGradient>
  <linearGradient
     id="e"
     gradientTransform="matrix(.96732065 0 0 .96732064 -6.624188 -6.624188)"
     gradientUnits="userSpaceOnUse"
     x1="14.084459"
     x2="8.915541"
     y1="14.084459"
     y2="8.915541">
    <stop
       offset="0"
       stop-color="#009600"
       id="stop9" />
    <stop
       offset="1"
       stop-color="#6edb39"
       id="stop10" />
  </linearGradient>
  <linearGradient
     id="f"
     gradientUnits="userSpaceOnUse"
     x1="14.5"
     x2="4.5"
     y1="15.5"
     y2="4.5">
    <stop
       offset="0"
       stop-color="#2a7fff"
       id="stop11" />
    <stop
       offset="1"
       stop-color="#66a4ff"
       id="stop12" />
  </linearGradient>
  <linearGradient
     id="g"
     gradientTransform="matrix(.69231067 0 0 .714285 .50002 1.500025)"
     gradientUnits="userSpaceOnUse"
     x1="13.53"
     x2="13.53"
     y1="3.5"
     y2="8.75">
    <stop
       offset="0"
       stop-color="#ececec"
       id="stop13" />
    <stop
       offset="1"
       stop-color="#b7bec8"
       id="stop14" />
  </linearGradient>
  <g
     stroke-width="1.3484"
     transform="translate(-2 -4)"
     id="g15">
    <path
       d="m4 4h9.9l1.1 1.125v10.875h-11z"
       fill="url(#f)"
       fill-rule="evenodd"
       id="path14" />
    <rect
       fill="#fff"
       height="6"
       rx=".366667"
       width="8"
       x="5.5"
       y="9"
       id="rect14" />
    <path
       d="m7 4v4h6v-4zm3.5 1h1.5v2h-1.5z"
       fill="url(#g)"
       fill-rule="evenodd"
       id="path15" />
  </g>
  <g
     fill="none"
     transform="translate(-2 -4)"
     id="g18">
    <path
       d="m6.5000001 10.5h5.9999999"
       stroke="#e6e6e6"
       stroke-width=".999997"
       id="path16" />
    <path
       d="m6.5000001 12.5h5.9999999"
       stroke="#e6e6e6"
       stroke-width=".999997"
       id="path17" />
    <path
       d="m5.5 14.5h8"
       stroke="#f60"
       id="path18" />
  </g>
  <g
     stroke-linecap="round"
     stroke-linejoin="round"
     transform="matrix(1.125 0 0 1.125 0 -2)"
     id="g23">
    <path
       d="m0 8h5.3333333v2.666667h-5.3333333z"
       fill="url(#a)"
       stroke-width=".861998"
       id="path19" />
    <path
       d="m2.6666667 13.333333h5.3333333v2.666667h-5.3333333z"
       fill="url(#c)"
       stroke-width=".861998"
       id="path20" />
    <path
       d="m0 16v-5.333333h2.6666667v5.333333z"
       fill="url(#d)"
       stroke-width=".861999"
       id="path21" />
    <path
       d="m5.3333333 13.333333v-5.333333h2.6666667v5.333333z"
       fill="url(#b)"
       stroke-width=".861999"
       id="path22" />
    <path
       d="m2.6666667 10.666667h2.6666666v2.666666h-2.6666666z"
       stroke-width="2.13334"
       id="path23" />
  </g>
  <circle
     cx="4.5"
     cy="4.5"
     fill="url(#e)"
     r="4.000001"
     transform="matrix(0 1 1 0 7 7)"
     id="circle23" />
  <g
     fill="none"
     stroke="#fff"
     stroke-linecap="round"
     id="g25">
    <path
       d="m11.5 9.5v4"
       id="path24" />
    <path
       d="m13.5 11.5h-4"
       id="path25" />
  </g>
</svg>
