<?xml version="1.0" encoding="UTF-8" standalone="no"?>
<svg
   width="24"
   height="24"
   version="1.1"
   viewBox="0 0 24 24"
   id="svg15"
   sodipodi:docname="tfpwebdataprovider.svg"
   inkscape:export-filename="tfpwebdataprovider.png"
   inkscape:export-xdpi="96"
   inkscape:export-ydpi="96"
   inkscape:version="1.3.2 (091e20e, 2023-11-25, custom)"
   xmlns:inkscape="http://www.inkscape.org/namespaces/inkscape"
   xmlns:sodipodi="http://sodipodi.sourceforge.net/DTD/sodipodi-0.dtd"
   xmlns:xlink="http://www.w3.org/1999/xlink"
   xmlns="http://www.w3.org/2000/svg"
   xmlns:svg="http://www.w3.org/2000/svg">
  <defs
     id="defs15" />
  <sodipodi:namedview
     id="namedview15"
     pagecolor="#ffffff"
     bordercolor="#000000"
     borderopacity="0.25"
     inkscape:showpageshadow="2"
     inkscape:pageopacity="0.0"
     inkscape:pagecheckerboard="0"
     inkscape:deskcolor="#d1d1d1"
     showgrid="true"
     inkscape:current-layer="svg15">
    <inkscape:grid
       id="grid15"
       units="px"
       originx="0"
       originy="0"
       spacingx="0.5"
       spacingy="0.5"
       empcolor="#0099e5"
       empopacity="0.30196078"
       color="#0099e5"
       opacity="0.14901961"
       empspacing="2"
       dotted="false"
       gridanglex="30"
       gridanglez="30"
       visible="true" />
  </sodipodi:namedview>
  <linearGradient
     id="a"
     x1="-19.72396"
     x2="-10.72396"
     y1="1026.8742"
     y2="1026.8742"
     gradientUnits="userSpaceOnUse"
     xlink:href="#b" />
  <linearGradient
     id="b">
    <stop
       stop-color="#4276c4"
       offset="0"
       id="stop1" />
    <stop
       stop-color="#80b3ff"
       offset=".34375"
       id="stop2" />
    <stop
       stop-color="#04a"
       offset="1"
       id="stop3" />
  </linearGradient>
  <linearGradient
     id="c"
     x1="-19.72396"
     x2="-10.72396"
     y1="1023.8742"
     y2="1023.8742"
     gradientUnits="userSpaceOnUse"
     xlink:href="#b" />
  <linearGradient
     id="d"
     x1="-19.72396"
     x2="-10.72396"
     y1="1020.8742"
     y2="1020.8742"
     gradientUnits="userSpaceOnUse"
     xlink:href="#b" />
  <path
     d="m19.5 11.5v-6.5"
     fill="none"
     stroke="#0097bd"
     stroke-linecap="round"
     id="path3" />
  <path
     d="m21.5 6-2-2-2 2"
     fill="none"
     stroke="#0097bd"
     stroke-linecap="round"
     stroke-linejoin="round"
     id="path4" />
  <g
     transform="matrix(1.25 0 0 1.25 26.90495 -1275.0926)"
     fill-rule="evenodd"
     stroke-linecap="round"
     stroke-linejoin="round"
     id="g10">
    <g
       fill="#bdd1ec"
       id="g9">
      <ellipse
         cx="-14.72396"
         cy="1032.3741"
         rx="5"
         ry="1.5"
         stroke="url(#a)"
         stroke-width="2"
         id="ellipse4" />
      <ellipse
         cx="-14.72396"
         cy="1030.4156"
         rx="5.494309"
         ry="1.958482"
         stroke="#fff"
         id="ellipse5" />
      <ellipse
         cx="-14.72396"
         cy="1029.3741"
         rx="5"
         ry="1.5"
         stroke="url(#c)"
         stroke-width="2"
         id="ellipse6" />
      <ellipse
         cx="-14.72396"
         cy="1027.4156"
         rx="5.494309"
         ry="1.958482"
         stroke="#fff"
         id="ellipse7" />
      <ellipse
         cx="-14.72396"
         cy="1026.3741"
         rx="5"
         ry="1.5"
         stroke="url(#d)"
         stroke-width="2"
         id="ellipse8" />
      <ellipse
         cx="-14.72396"
         cy="1024.4156"
         rx="5.494309"
         ry="1.958482"
         stroke="#fff"
         id="ellipse9" />
    </g>
    <ellipse
       cx="-14.72396"
       cy="1023.3741"
       rx="5.5"
       ry="2"
       fill="#80b3ff"
       stroke="url(#a)"
       id="ellipse10" />
  </g>
  <text
     x="-19"
     y="32.499981"
     id="text10"><tspan
       x="-19"
       y="47.078106"
       id="tspan10" /></text>
  <rect
     x="1.5000001"
     y="14.499999"
     width="21"
     height="8"
     fill="#d40000"
     stroke="#ff8080"
     stroke-dashoffset="1.49998"
     stroke-linecap="square"
     stroke-linejoin="round"
     stroke-width=".999998"
     id="rect10" />
  <g
     clip-rule="evenodd"
     fill="#ffffff"
     shape-rendering="geometricPrecision"
     stroke="#000000"
     stroke-width=".00383586"
     id="g15">
    <path
       d="m5.9310575 18.800261h-2.0861199v1.354779h2.3250178v0.844959h-3.1699554v-5h3.0884037v0.844958h-2.2434661v1.110346h2.0861199z"
       image-rendering="optimizeQuality"
       id="path10" />
    <path
       d="m8.9976854 18.394057 1.4373796 2.605942h-1.0119967l-0.9245821-1.693473-0.9255359 1.693473h-1.0129503l1.4402755-2.607085-1.3062399-2.392915h0.9838124l0.821627 1.488614 0.8216271-1.488614h0.9857549z"
       image-rendering="optimizeQuality"
       id="path11" />
    <path
       d="m13.209819 16.844958h-1.229526v4.155041h-0.844938v-4.155041h-1.235355v-0.844959h3.309819z"
       image-rendering="optimizeQuality"
       id="path12" />
    <path
       d="m12.5 21v-1h1v1z"
       image-rendering="optimizeQuality"
       id="path13" />
    <path
       d="m16.050208 16h0.949792v3.111578c0 0.406983-0.03387 0.720183-0.102632 0.939638-0.09172 0.285762-0.257666 0.515569-0.498894 0.689295-0.240197 0.172647-0.557891 0.259489-0.953086 0.259489-0.462844 0-0.818772-0.134899-1.067663-0.405819-0.250005-0.270963-0.375582-0.668759-0.377725-1.192269l0.897382-0.109748c0.01089 0.280108 0.04912 0.477864 0.116805 0.593266 0.101513 0.176054 0.255441 0.264061 0.462883 0.264061 0.208515 0 0.357-0.06286 0.443234-0.189732 0.08622-0.125753 0.129904-0.387528 0.129904-0.785326z"
       image-rendering="optimizeQuality"
       id="path14" />
    <path
       d="m17.72507 19.383005 0.821286-0.09812c0.0495 0.330555 0.148526 0.572332 0.298993 0.727669 0.150503 0.155338 0.353398 0.232432 0.60872 0.232432 0.269866 0 0.473749-0.0689 0.610589-0.206733 0.136875-0.137837 0.205825-0.298994 0.205825-0.483555 0-0.119148-0.02909-0.219605-0.08639-0.303667-0.05727-0.08291-0.15827-0.155338-0.301924-0.216079-0.09808-0.04205-0.32134-0.114474-0.670819-0.219605-0.44946-0.135458-0.764975-0.301372-0.946511-0.498718-0.255321-0.276863-0.382523-0.614384-0.382523-1.012688 0-0.255752 0.0602-0.496425 0.179593-0.719469 0.120388-0.223089 0.293204-0.392443 0.519364-0.509255 0.22623-0.116769 0.498039-0.175217 0.818356-0.175217 0.52134 0 0.91449 0.138985 1.177614 0.418142 0.264041 0.279157 0.401905 0.650573 0.415462 1.116628l-0.844587 0.035c-0.0359-0.259277-0.112586-0.444985-0.23008-0.558313-0.117457-0.113329-0.294156-0.170544-0.529071-0.170544-0.242718 0-0.433009 0.06074-0.569849 0.182225-0.08836 0.07824-0.132991 0.182183-0.132991 0.31301 0 0.119106 0.04173 0.220752 0.125224 0.304856 0.105808 0.108612 0.363071 0.220751 0.771754 0.337563 0.40872 0.115621 0.710608 0.237105 0.905736 0.360925 0.196115 0.124966 0.349513 0.29432 0.460157 0.510441 0.110679 0.21608 0.166002 0.482408 0.166002 0.798946 0 0.287312-0.06602 0.557124-0.199012 0.808246-0.132991 0.251122-0.320352 0.43802-0.563034 0.559503-0.242718 0.122673-0.545595 0.183372-0.907712 0.183372-0.527095 0-0.93193-0.145992-1.214436-0.439209-0.282506-0.291985-0.450449-0.718323-0.505806-1.277827z"
       image-rendering="optimizeQuality"
       id="path15" />
  </g>
</svg>
