<?xml version="1.0" encoding="UTF-8" standalone="no"?>
<svg
   height="32"
   width="32"
   version="1.1"
   id="svg836"
   sodipodi:docname="dialog_shield.svg"
   inkscape:export-filename="dialog_shield.png"
   inkscape:export-xdpi="96"
   inkscape:export-ydpi="96"
   inkscape:version="1.2.1 (9c6d41e410, 2022-07-14)"
   xmlns:inkscape="http://www.inkscape.org/namespaces/inkscape"
   xmlns:sodipodi="http://sodipodi.sourceforge.net/DTD/sodipodi-0.dtd"
   xmlns="http://www.w3.org/2000/svg"
   xmlns:svg="http://www.w3.org/2000/svg">
  <defs
     id="defs840" />
  <sodipodi:namedview
     id="namedview838"
     pagecolor="#ffffff"
     bordercolor="#666666"
     borderopacity="1.0"
     inkscape:showpageshadow="2"
     inkscape:pageopacity="0.0"
     inkscape:pagecheckerboard="0"
     inkscape:deskcolor="#d1d1d1"
     showgrid="true"
     inkscape:zoom="28.6875"
     inkscape:cx="15.982571"
     inkscape:cy="16"
     inkscape:current-layer="svg836">
    <inkscape:grid
       type="xygrid"
       id="grid1818" />
  </sodipodi:namedview>
  <linearGradient
     id="a"
     gradientUnits="userSpaceOnUse"
     x1="26"
     x2="16"
     y1="20"
     y2="18">
    <stop
       offset="0"
       stop-color="#e5efff"
       id="stop820" />
    <stop
       offset="1"
       stop-color="#acf"
       id="stop822" />
  </linearGradient>
  <linearGradient
     id="b"
     gradientUnits="userSpaceOnUse"
     x1="6"
     x2="16"
     y1="20"
     y2="18">
    <stop
       offset="0"
       stop-color="#fc0"
       id="stop825" />
    <stop
       offset="1"
       stop-color="#fea"
       id="stop827" />
  </linearGradient>
  <g
     stroke="#075ad6"
     stroke-linecap="round"
     stroke-linejoin="round"
     stroke-width="2"
     id="g834">
    <path
       d="m16 1.5c-6.5070298 3.8544603-8.0411249 3.5719205-12.5 4 1.0418453 21.437244 5.1246533 22.203585 12.5 25"
       fill="url(#b)"
       id="path830" />
    <path
       d="m16 1.5c6.50703 3.8544603 8.041125 3.5719205 12.5 4-1.041846 21.437244-5.124654 22.203585-12.5 25"
       fill="url(#a)"
       id="path832" />
  </g>
</svg>
