<svg width="16" height="16" version="1.1" xmlns="http://www.w3.org/2000/svg">
 <rect x=".25" y="3.25" width="15.5" height="11.5" fill="#f9f9f9" stroke="#2a7efe" stroke-width=".5" style="paint-order:normal"/>
 <path d="m1.1 1h13.8c0.6 0 1.1 0.5 1.1 1.1v1.4h-16v-1.4c0-0.6 0.5-1.1 1.1-1.1z" fill="#2a7efe"/>
 <path d="m5 5.5-2.5 3h11l-2.5-3" fill="none" stroke="#000000" stroke-linecap="round" stroke-linejoin="round"/>
 <path d="m2.5 8.5c0 4 4.5 4 4.5 0" fill="none" stroke="#000000" stroke-linecap="round" stroke-linejoin="round"/>
 <path d="m9 8.5c0 4 4.5 4 4.5 0" fill="none" stroke="#000000" stroke-linecap="round" stroke-linejoin="round"/>
</svg>
