<svg width="32" height="32" version="1.1" xmlns="http://www.w3.org/2000/svg">
 <defs>
  <linearGradient id="a" x1="8.000001" x2="8.000001" y1="13.855285" y2="4.5498314" gradientTransform="matrix(1.1434774,0,0,1.1332234,13.35218,14.233445)" gradientUnits="userSpaceOnUse">
   <stop stop-color="#d58914" stop-opacity=".956863" offset="0"/>
   <stop stop-color="#f4a428" stop-opacity=".992157" offset="1"/>
  </linearGradient>
 </defs>
 <path d="m22.5 14.799901 2.688476 5.3986 6.011617 0.865706-4.350046 4.202224 1.026906 5.933635-5.376953-2.801484-5.376954 2.801482 1.026906-5.933633-4.350046-4.202224 6.011617-0.865706z" fill="url(#a)" fill-rule="evenodd" stroke="#ffffff" stroke-linecap="round" stroke-linejoin="round" stroke-width="1.6"/>
</svg>
