<svg width="32" height="32" version="1.0" xmlns="http://www.w3.org/2000/svg" xmlns:xlink="http://www.w3.org/1999/xlink">
 <defs>
  <linearGradient id="b">
   <stop stop-color="#ffcc00" offset="0"/>
   <stop stop-color="#fff6d5" offset=".33333102"/>
   <stop stop-color="#ffcc00" offset="1"/>
  </linearGradient>
  <linearGradient id="d" x1="4" x2="14" y1="6" y2="4" gradientTransform="matrix(1.9087115 0 0 1.9170129 -1.1452096 -.2946105)" gradientUnits="userSpaceOnUse" xlink:href="#b"/>
  <linearGradient id="g" x1="2" x2="14" y1="6" y2="6" gradientTransform="matrix(1.9087115 0 0 1.9170129 -1.1452096 -.2946105)" gradientUnits="userSpaceOnUse" xlink:href="#a"/>
  <linearGradient id="a" x1="2" x2="14" y1="6" y2="6" gradientTransform="matrix(1.1361379,0,0,1.1252033,-1.015007,-1.564228)" gradientUnits="userSpaceOnUse">
   <stop stop-color="#e0c67e" offset="0"/>
   <stop stop-color="#c88e2c" offset=".4999288"/>
   <stop stop-color="#d2a641" offset="1"/>
  </linearGradient>
  <linearGradient id="c" x1="6" x2="11" y1="13" y2="13" gradientTransform="matrix(2.0904935 0 0 1.9170129 -2.5876095 -.2946105)" gradientUnits="userSpaceOnUse" xlink:href="#b"/>
  <linearGradient id="f" x1="2" x2="14" y1="6" y2="6" gradientTransform="matrix(2.0904935 0 0 1.9170129 -2.5876095 -.2946105)" gradientUnits="userSpaceOnUse" xlink:href="#a"/>
  <linearGradient id="e" x1="4.25" x2="11.75" y1="2.5" y2="2.5" gradientTransform="matrix(1.8399998 0 0 1.7037036 -.7599976 3.8148151)" gradientUnits="userSpaceOnUse">
   <stop stop-color="#dfc379" offset="0"/>
   <stop stop-color="#eddcb4" offset=".36666667"/>
   <stop stop-color="#d1a440" offset="1"/>
  </linearGradient>
 </defs>
 <path d="m 3.5,8.5 7.500001,7.999999 h 6 L 24.499999,8.5 v -4 H 3.5 Z" fill="url(#d)" fill-rule="evenodd" stroke="url(#g)"/>
 <path d="m17.000001 16.499999-1 10.999999h-4l-1-10.999999z" fill="url(#c)" fill-rule="evenodd" stroke="url(#f)" stroke-linecap="square"/>
 <path d="m4.0000019 8.5h19.999999" fill="none" stroke="url(#e)"/>
 <path d="M 22.000001,18.999999 30,26.999998" fill="none" stroke="#ff0b0a" stroke-linecap="round" stroke-linejoin="round" stroke-width="2.6"/>
 <path d="m30 18.999999-7.999999 7.999999" fill="none" stroke="#ff0b0a" stroke-linecap="round" stroke-linejoin="round" stroke-width="2.6"/>
</svg>
