<?xml version="1.0" encoding="UTF-8" standalone="no"?>
<svg
   height="16"
   viewBox="0 0 4.2333332 4.2333335"
   width="16"
   version="1.1"
   id="svg6"
   sodipodi:docname="Font_16_16.svg"
   inkscape:version="1.2 (dc2aedaf03, 2022-05-15)"
   inkscape:export-filename="Font_16_16.png"
   inkscape:export-xdpi="96"
   inkscape:export-ydpi="96"
   xmlns:inkscape="http://www.inkscape.org/namespaces/inkscape"
   xmlns:sodipodi="http://sodipodi.sourceforge.net/DTD/sodipodi-0.dtd"
   xmlns="http://www.w3.org/2000/svg"
   xmlns:svg="http://www.w3.org/2000/svg">
  <defs
     id="defs10">
    <filter
       inkscape:collect="always"
       style="color-interpolation-filters:sRGB"
       id="filter3611"
       x="-0.087504074"
       y="-0.06562271"
       width="1.1750081"
       height="1.1312454">
      <feGaussianBlur
         inkscape:collect="always"
         stdDeviation="0.11572292"
         id="feGaussianBlur3613" />
    </filter>
  </defs>
  <sodipodi:namedview
     id="namedview8"
     pagecolor="#ffffff"
     bordercolor="#666666"
     borderopacity="1.0"
     inkscape:showpageshadow="2"
     inkscape:pageopacity="0.0"
     inkscape:pagecheckerboard="0"
     inkscape:deskcolor="#d1d1d1"
     showgrid="true"
     inkscape:zoom="57.375"
     inkscape:cx="6.2135076"
     inkscape:cy="8"
     inkscape:current-layer="svg6">
    <inkscape:grid
       type="xygrid"
       id="grid135" />
  </sodipodi:namedview>
  <g
     id="g518">
    <path
       id="path3243"
       style="fill:#ffffff;fill-opacity:1;stroke:none;filter:url(#filter3611)"
       d="M 1.0588501,0 C 0.91312775,-2.0349976e-4 0.79486548,0.11782734 0.79478353,0.26354981 V 2.3807332 C 0.79375,2.9104167 0.79375,3.3072917 1.3084473,3.4416499 H 0.79271647 C 0.6471957,3.4417319 0.52924835,3.5596794 0.52916667,3.7052002 V 3.96875 c 8.196e-5,0.1455206 0.11802923,0.2634678 0.2635498,0.2635498 H 3.4395833 C 3.5851039,4.2322179 3.7030512,4.1142706 3.7031332,3.96875 V 3.7052002 C 3.7030512,3.5596796 3.5851039,3.4417323 3.4395833,3.4416504 H 2.9259196 C 3.4395833,3.3072917 3.4395833,2.9104167 3.4395833,2.3807332 V 0.26354981 C 3.4395013,0.11802923 3.3215541,8.1959004e-5 3.1760335,0 H 2.7770915 C 2.6315709,8.1959004e-5 2.381332,0.11854604 2.38125,0.26406662 V 2.38125 c 0,0.5291667 -0.5369899,0.5013669 -0.5291667,0 V 0.26768392 C 1.8520014,0.12216334 1.6007289,8.1959004e-5 1.4552083,0 Z"
       sodipodi:nodetypes="ccccccccccccccccccccccc" />
    <path
       id="path4"
       style="fill:#000000;fill-opacity:1;stroke:none"
       d="M 0.79375,3.7041667 V 3.96875 H 3.4394531 V 3.7041667 Z M 2.1166667,3.4395833 c -0.6614585,0 -1.0583334,-0.396875 -1.0583334,-1.0583333 V 0.26458333 h 0.396875 V 2.38125 c 0.00703,0.396875 0.2645832,0.6614583 0.6614584,0.6614583 0.3968749,0 0.6614587,-0.2645833 0.6614583,-0.6614583 l -2e-6,-2.11666667 H 3.175 V 2.38125 c 0,0.6614583 -0.396875,1.0583333 -1.0583333,1.0583333 z"
       sodipodi:nodetypes="cccccsscccssccss" />
  </g>
</svg>
