<?xml version="1.0" encoding="UTF-8" standalone="no"?>
<svg
   height="36"
   width="36"
   version="1.1"
   id="svg553"
   sodipodi:docname="Grid_11_36.svg"
   inkscape:export-filename="Grid_11_36.png"
   inkscape:export-xdpi="96"
   inkscape:export-ydpi="96"
   inkscape:version="1.2-beta (1b65182ce9, 2022-04-05)"
   xmlns:inkscape="http://www.inkscape.org/namespaces/inkscape"
   xmlns:sodipodi="http://sodipodi.sourceforge.net/DTD/sodipodi-0.dtd"
   xmlns="http://www.w3.org/2000/svg"
   xmlns:svg="http://www.w3.org/2000/svg">
  <defs
     id="defs557" />
  <sodipodi:namedview
     id="namedview555"
     pagecolor="#ffffff"
     bordercolor="#666666"
     borderopacity="1.0"
     inkscape:pageshadow="2"
     inkscape:pageopacity="0.0"
     inkscape:pagecheckerboard="0"
     inkscape:deskcolor="#d1d1d1"
     showgrid="true"
     inkscape:zoom="25.5"
     inkscape:cx="18"
     inkscape:cy="18"
     inkscape:current-layer="svg553">
    <inkscape:grid
       type="xygrid"
       id="grid1157" />
  </sodipodi:namedview>
  <linearGradient
     id="a"
     gradientTransform="matrix(0 -1.4166667 -1.5 0 24 23.527778)"
     gradientUnits="userSpaceOnUse"
     x1="9"
     x2="6"
     y1="10"
     y2="10.5">
    <stop
       offset="0"
       stop-color="#72cef6"
       id="stop509" />
    <stop
       offset="1"
       stop-color="#d2f5f8"
       id="stop511" />
  </linearGradient>
  <linearGradient
     id="b"
     gradientTransform="matrix(0 -1.4166667 -1.5 0 24 23.527778)"
     gradientUnits="userSpaceOnUse"
     x1="10"
     x2="5"
     y1="12.5"
     y2="12.5">
    <stop
       offset="0"
       stop-color="#4674a8"
       id="stop514" />
    <stop
       offset="1"
       stop-color="#42a0ce"
       id="stop516" />
  </linearGradient>
  <path
     d="m-29.489361 6.510639h22.978724v22.978724h-22.978724z"
     style="fill:#fff;stroke:#999;stroke-width:1.02128;stroke-linecap:round;stroke-linejoin:round;stroke-dashoffset:1.49998"
     transform="matrix(1.5 0 0 -1.5 45.000001 44.999998)"
     id="path519" />
  <g
     fill="none"
     stroke="#b3b3b3"
     transform="matrix(1.5 0 0 1.5 .000001 -.000002)"
     id="g531">
    <path
       d="m1 18.5h22"
       id="path521" />
    <path
       d="m6.5 23v-22"
       id="path523" />
    <path
       d="m23 5.5h-22"
       id="path525" />
    <path
       d="m18.5 23v-22"
       id="path527" />
    <path
       d="m12.5 23v-22"
       id="path529" />
  </g>
  <g
     stroke-linejoin="round"
     transform="matrix(1.5 0 0 -1.5 .000001 38.999998)"
     id="g537">
    <path
       d="m.5-16.5h23v7.666667h-23z"
       fill="none"
       opacity=".5"
       stroke="#fff"
       stroke-dashoffset="1.49998"
       transform="scale(1 -1)"
       id="path533" />
    <path
       d="m23.5 15.5h-23v-5.6666667h23z"
       fill="url(#a)"
       stroke="url(#b)"
       stroke-linecap="round"
       stroke-width=".999999"
       id="path535" />
  </g>
  <g
     fill="none"
     stroke-linecap="round"
     stroke-opacity=".996078"
     transform="matrix(0 -2.25 -2.25 0 40.500002 36.349998)"
     id="g551">
    <g
       stroke="#fff"
       stroke-width="3"
       transform="translate(-19.5 11)"
       id="g543">
      <path
         d="m27.5-1h3.5"
         opacity=".7"
         id="path539" />
      <path
         d="m31.5-4 3 3-3 3"
         opacity=".7"
         stroke-linejoin="round"
         id="path541" />
    </g>
    <g
       stroke="#3771c8"
       stroke-width="2"
       id="g549">
      <path
         d="m8 10h7"
         id="path545" />
      <path
         d="m12 7 3 3-3 3"
         stroke-linejoin="round"
         id="path547" />
    </g>
  </g>
</svg>
