<?xml version="1.0" encoding="UTF-8" standalone="no"?>
<svg
   width="36"
   height="36"
   version="1.1"
   viewBox="0 0 36 36"
   id="svg21"
   sodipodi:docname="tcalcedit_150.svg"
   inkscape:export-filename="tcalcedit_150.png"
   inkscape:export-xdpi="96"
   inkscape:export-ydpi="96"
   inkscape:version="1.3.2 (091e20e, 2023-11-25, custom)"
   xmlns:inkscape="http://www.inkscape.org/namespaces/inkscape"
   xmlns:sodipodi="http://sodipodi.sourceforge.net/DTD/sodipodi-0.dtd"
   xmlns="http://www.w3.org/2000/svg"
   xmlns:svg="http://www.w3.org/2000/svg">
  <sodipodi:namedview
     id="namedview21"
     pagecolor="#ffffff"
     bordercolor="#000000"
     borderopacity="0.25"
     inkscape:showpageshadow="2"
     inkscape:pageopacity="0.0"
     inkscape:pagecheckerboard="0"
     inkscape:deskcolor="#d1d1d1"
     showgrid="true"
     inkscape:current-layer="svg21">
    <inkscape:grid
       id="grid21"
       units="px"
       originx="0"
       originy="0"
       spacingx="0.5"
       spacingy="0.5"
       empcolor="#0099e5"
       empopacity="0.30196078"
       color="#0099e5"
       opacity="0.14901961"
       empspacing="2"
       dotted="false"
       gridanglex="30"
       gridanglez="30"
       visible="true" />
  </sodipodi:namedview>
  <defs
     id="defs2">
    <linearGradient
       id="a"
       x1="18"
       x2="18"
       y1="1031.8622"
       y2="1029.3622"
       gradientTransform="translate(0,-1011.3622)"
       gradientUnits="userSpaceOnUse">
      <stop
         stop-color="#ffffff"
         offset="0"
         id="stop1" />
      <stop
         stop-color="#aaeeff"
         offset="1"
         id="stop2" />
    </linearGradient>
  </defs>
  <rect
     x="24.499998"
     y="2.4999826"
     width="10.000003"
     height="10"
     fill="#ffffff"
     stroke="#2a7efe"
     stroke-linecap="round"
     stroke-linejoin="round"
     stroke-width="0.999998"
     style="paint-order:normal"
     id="rect2" />
  <rect
     x="2.4999981"
     y="2.4999826"
     width="22"
     height="10.000001"
     fill="#ffffff"
     fill-rule="evenodd"
     stroke="#2a7efe"
     stroke-linecap="round"
     stroke-linejoin="round"
     stroke-width="0.999996"
     style="paint-order:normal"
     id="rect3" />
  <circle
     cx="29.5"
     cy="7.4999828"
     r="2.75"
     fill="#c8ab37"
     id="circle3" />
  <rect
     x="6.5"
     y="15.499983"
     width="23"
     height="19"
     fill="#e3dedb"
     fill-rule="evenodd"
     stroke="#b3b3b3"
     stroke-linecap="round"
     stroke-linejoin="round"
     style="paint-order:normal"
     id="rect4" />
  <rect
     x="9"
     y="17.999983"
     width="18"
     height="3.9999919"
     fill="url(#a)"
     fill-rule="evenodd"
     style="fill:url(#a);paint-order:normal"
     id="rect5" />
  <rect
     x="9"
     y="23.999983"
     width="3"
     height="3"
     fill="#483737"
     fill-rule="evenodd"
     style="paint-order:normal"
     id="rect6" />
  <rect
     x="14"
     y="23.999983"
     width="3"
     height="3"
     fill="#483737"
     fill-rule="evenodd"
     style="paint-order:normal"
     id="rect7" />
  <rect
     x="19"
     y="23.999983"
     width="3"
     height="3"
     fill="#483737"
     fill-rule="evenodd"
     style="paint-order:normal"
     id="rect8" />
  <rect
     x="9"
     y="28.999983"
     width="3"
     height="3"
     fill="#483737"
     fill-rule="evenodd"
     style="paint-order:normal"
     id="rect9" />
  <rect
     x="14"
     y="28.999983"
     width="3"
     height="3"
     fill="#483737"
     fill-rule="evenodd"
     style="paint-order:normal"
     id="rect10" />
  <rect
     x="19"
     y="28.999983"
     width="3"
     height="3"
     fill="#483737"
     fill-rule="evenodd"
     style="paint-order:normal"
     id="rect11" />
  <rect
     x="24.000008"
     y="23.999983"
     width="2.9999924"
     height="3"
     fill="#d45500"
     fill-rule="evenodd"
     style="paint-order:normal"
     id="rect12" />
  <rect
     x="24.000008"
     y="28.999983"
     width="2.9999924"
     height="3"
     fill="#ff0000"
     fill-rule="evenodd"
     style="paint-order:normal"
     id="rect13" />
  <rect
     x="9"
     y="23.999983"
     width="1.5"
     height="1.5"
     fill="#ffffff"
     fill-rule="evenodd"
     style="paint-order:normal"
     id="rect14" />
  <rect
     x="14"
     y="23.999983"
     width="1.5"
     height="1.5"
     fill="#ffffff"
     fill-rule="evenodd"
     style="paint-order:normal"
     id="rect15" />
  <rect
     x="19"
     y="23.999983"
     width="1.5"
     height="1.5"
     fill="#ffffff"
     fill-rule="evenodd"
     style="paint-order:normal"
     id="rect16" />
  <rect
     x="9"
     y="28.999983"
     width="1.5"
     height="1.5"
     fill="#ffffff"
     fill-rule="evenodd"
     style="paint-order:normal"
     id="rect17" />
  <rect
     x="14"
     y="28.999983"
     width="1.5"
     height="1.5"
     fill="#ffffff"
     fill-rule="evenodd"
     style="paint-order:normal"
     id="rect18" />
  <rect
     x="19"
     y="28.999983"
     width="1.5"
     height="1.5"
     fill="#ffffff"
     fill-rule="evenodd"
     style="paint-order:normal"
     id="rect19" />
  <rect
     x="24"
     y="23.999983"
     width="1.5"
     height="1.5"
     fill="#ffffff"
     fill-rule="evenodd"
     style="paint-order:normal"
     id="rect20" />
  <rect
     x="24"
     y="28.999983"
     width="1.5"
     height="1.5"
     fill="#ffffff"
     fill-rule="evenodd"
     style="paint-order:normal"
     id="rect21" />
</svg>
