<?xml version="1.0" encoding="UTF-8" standalone="no"?>
<svg
   width="16"
   height="16"
   version="1.1"
   id="svg3"
   sodipodi:docname="File_27_16.svg"
   inkscape:export-filename="File_27_16.png"
   inkscape:export-xdpi="96"
   inkscape:export-ydpi="96"
   inkscape:version="1.3.2 (091e20e, 2023-11-25, custom)"
   xmlns:inkscape="http://www.inkscape.org/namespaces/inkscape"
   xmlns:sodipodi="http://sodipodi.sourceforge.net/DTD/sodipodi-0.dtd"
   xmlns="http://www.w3.org/2000/svg"
   xmlns:svg="http://www.w3.org/2000/svg">
  <defs
     id="defs3" />
  <sodipodi:namedview
     id="namedview3"
     pagecolor="#ffffff"
     bordercolor="#000000"
     borderopacity="0.25"
     inkscape:showpageshadow="2"
     inkscape:pageopacity="0.0"
     inkscape:pagecheckerboard="0"
     inkscape:deskcolor="#d1d1d1"
     showgrid="true"
     inkscape:current-layer="svg3">
    <inkscape:grid
       id="grid3"
       units="px"
       originx="0"
       originy="0"
       spacingx="0.5"
       spacingy="0.5"
       empcolor="#0099e5"
       empopacity="0.30196078"
       color="#0099e5"
       opacity="0.14901961"
       empspacing="2"
       dotted="false"
       gridanglex="30"
       gridanglez="30"
       visible="true" />
  </sodipodi:namedview>
  <path
     d="m12.499999 13c0 0.831-0.669 1.5-1.5 1.5h-7.0000014c-0.831 0-1.5-0.669-1.5-1.5v-10c0-0.831 0.669-1.5 1.5-1.5h7.0000014c0.831 0 1.5 0.669 1.5 1.5l1e-6 6.0000005"
     fill="#ebfcff"
     stroke="#00aad4"
     stroke-linejoin="round"
     stroke-width=".999995"
     id="path1" />
  <g
     transform="matrix(.63750001 0 0 .63425929 5.8034017 6.2673599)"
     fill="none"
     stroke="#ff7f2a"
     stroke-linecap="round"
     id="g3">
    <path
       d="m10.78256 6.0000004a4.7825597 4.7815899 0 1 1-9.5651191 0 4.7825597 4.7815899 0 1 1 9.5651191 0z"
       stroke-linejoin="round"
       stroke-width="1.96579"
       id="path2" />
    <path
       d="m10.000237 10 3.25 3.25"
       stroke-width="3.14526"
       id="path3" />
  </g>
</svg>
