<?xml version="1.0" encoding="UTF-8" standalone="no"?>
<svg
   height="48"
   viewBox="0 0 48 48"
   width="48"
   version="1.1"
   id="svg2"
   sodipodi:docname="Key_01_48.svg"
   inkscape:version="1.3 (0e150ed6c4, 2023-07-21)"
   xmlns:inkscape="http://www.inkscape.org/namespaces/inkscape"
   xmlns:sodipodi="http://sodipodi.sourceforge.net/DTD/sodipodi-0.dtd"
   xmlns="http://www.w3.org/2000/svg"
   xmlns:svg="http://www.w3.org/2000/svg">
  <defs
     id="defs2" />
  <sodipodi:namedview
     id="namedview2"
     pagecolor="#ffffff"
     bordercolor="#000000"
     borderopacity="0.25"
     inkscape:showpageshadow="2"
     inkscape:pageopacity="0.0"
     inkscape:pagecheckerboard="0"
     inkscape:deskcolor="#d1d1d1"
     showgrid="true"
     inkscape:current-layer="svg2">
    <inkscape:grid
       id="grid2"
       units="px"
       originx="0"
       originy="0"
       spacingx="0.5"
       spacingy="0.5"
       empcolor="#0099e5"
       empopacity="0.30196078"
       color="#0099e5"
       opacity="0.14901961"
       empspacing="2"
       dotted="false"
       gridanglex="30"
       gridanglez="30"
       visible="true" />
  </sodipodi:namedview>
  <g
     transform="matrix(2.999929 0 0 2.999929 3.500888 -.499823)"
     id="g2">
    <ellipse
       cx="4.956521"
       cy="10.588132"
       fill="none"
       rx="1.999979"
       ry="2.494393"
       stroke="#cca300"
       stroke-linecap="round"
       stroke-linejoin="round"
       stroke-width="1.2"
       transform="matrix(-.70526305 .70894572 .70894572 .70526305 0 0)"
       id="ellipse1" />
    <path
       d="m5.7824857 9.2175147 6.7175143-6.7175145"
       fill="none"
       stroke="#cca300"
       stroke-linecap="round"
       stroke-linejoin="round"
       stroke-width="1.3"
       id="path1" />
    <path
       d="m11.792893 3.2071069-2.8284269 2.8284271 1.7677669 1.7677671 1.06066-1.0606602-1.414213-1.4142135.707107-.7071068 1.414213 1.4142135 1.06066-1.0606601z"
       fill="#cca300"
       id="path2" />
  </g>
</svg>
