<?xml version="1.0" encoding="UTF-8" standalone="no"?>
<svg
   height="48"
   viewBox="0 0 48 48"
   width="48"
   version="1.1"
   id="svg606"
   sodipodi:docname="Print_04_48.svg"
   inkscape:export-filename="Print_04_48.png"
   inkscape:export-xdpi="96"
   inkscape:export-ydpi="96"
   inkscape:version="1.2.1 (9c6d41e410, 2022-07-14)"
   xmlns:inkscape="http://www.inkscape.org/namespaces/inkscape"
   xmlns:sodipodi="http://sodipodi.sourceforge.net/DTD/sodipodi-0.dtd"
   xmlns="http://www.w3.org/2000/svg"
   xmlns:svg="http://www.w3.org/2000/svg">
  <defs
     id="defs610" />
  <sodipodi:namedview
     id="namedview608"
     pagecolor="#ffffff"
     bordercolor="#666666"
     borderopacity="1.0"
     inkscape:showpageshadow="2"
     inkscape:pageopacity="0.0"
     inkscape:pagecheckerboard="0"
     inkscape:deskcolor="#d1d1d1"
     showgrid="true"
     inkscape:zoom="19.125"
     inkscape:cx="23.973856"
     inkscape:cy="24"
     inkscape:current-layer="svg606">
    <inkscape:grid
       type="xygrid"
       id="grid891" />
  </sodipodi:namedview>
  <g
     fill="none"
     id="g604">
    <g
       stroke="#00aad4"
       stroke-width="2"
       id="g596">
      <path
         d="m11 19h-4v4"
         stroke-linejoin="round"
         id="path584" />
      <path
         d="m11 23v-14h18v8"
         stroke-linecap="round"
         id="path586" />
      <path
         d="m35 27v8h-8.006536m-8.993464 0h-13v-12h14"
         stroke-linecap="round"
         stroke-linejoin="round"
         id="path588" />
      <path
         d="m27 31h4"
         stroke-linecap="round"
         stroke-linejoin="round"
         id="path590" />
      <path
         d="m15 13h10"
         id="path592" />
      <path
         d="m15 17h10"
         id="path594" />
    </g>
    <g
       stroke="#ff7f2a"
       stroke-linecap="round"
       transform="translate(2 2)"
       id="g602">
      <path
         d="m38.06512 28.500001a9.5651194 9.5631798 0 1 1 -19.130238 0 9.5651194 9.5631798 0 1 1 19.130238 0z"
         stroke-linejoin="round"
         stroke-width="2.86976"
         id="path598" />
      <path
         d="m36.5 36.5 7 7"
         stroke-width="5"
         id="path600" />
    </g>
  </g>
</svg>
