<?xml version="1.0" encoding="UTF-8" standalone="no"?>
<svg
   width="48"
   height="48"
   version="1.1"
   viewBox="0 0 48 48"
   id="svg2"
   sodipodi:docname="tprocess_200.svg"
   inkscape:export-filename="tprocess_200.png"
   inkscape:export-xdpi="96"
   inkscape:export-ydpi="96"
   inkscape:version="1.3.2 (091e20e, 2023-11-25, custom)"
   xmlns:inkscape="http://www.inkscape.org/namespaces/inkscape"
   xmlns:sodipodi="http://sodipodi.sourceforge.net/DTD/sodipodi-0.dtd"
   xmlns="http://www.w3.org/2000/svg"
   xmlns:svg="http://www.w3.org/2000/svg">
  <sodipodi:namedview
     id="namedview2"
     pagecolor="#ffffff"
     bordercolor="#000000"
     borderopacity="0.25"
     inkscape:showpageshadow="2"
     inkscape:pageopacity="0.0"
     inkscape:pagecheckerboard="0"
     inkscape:deskcolor="#d1d1d1"
     showgrid="true"
     inkscape:current-layer="svg2">
    <inkscape:grid
       id="grid2"
       units="px"
       originx="0"
       originy="0"
       spacingx="0.5"
       spacingy="0.5"
       empcolor="#0099e5"
       empopacity="0.30196078"
       color="#0099e5"
       opacity="0.14901961"
       empspacing="2"
       dotted="false"
       gridanglex="30"
       gridanglez="30"
       visible="true" />
  </sodipodi:namedview>
  <defs
     id="defs2">
    <linearGradient
       id="a"
       x1="8.0519476"
       x2="15.948051"
       y1="26.376619"
       y2="45.623371"
       gradientTransform="matrix(2.0263158,0,0,2.0263158,-0.31578919,-48.94736)"
       gradientUnits="userSpaceOnUse">
      <stop
         stop-color="#ffffff"
         offset="0"
         id="stop1"
         style="stop-color:#ffeeaa;stop-opacity:1" />
      <stop
         stop-color="#999999"
         offset="1"
         id="stop2"
         style="stop-color:#d4aa00;stop-opacity:1" />
    </linearGradient>
  </defs>
  <path
     d="M 21.593754,4.75 20.79167,11.1666 17.194825,12.658 12.087808,8.6852 8.6852203,12.0878 12.658041,17.1948 11.166668,20.7916 4.75,21.5938 v 4.8125 l 6.416668,0.8021 1.491373,3.5968 -3.9728207,5.107 3.4025877,3.4026 5.107017,-3.9728 3.596845,1.4914 0.802084,6.4166 h 4.812496 l 0.802083,-6.4166 3.596846,-1.4914 5.107017,3.9728 3.40259,-3.4026 -3.972824,-5.107 1.491371,-3.5968 L 43.25,26.4063 V 21.5938 L 36.833333,20.7916 35.34196,17.1948 39.314786,12.0878 35.912196,8.6852 30.805179,12.658 27.208333,11.1666 26.40625,4.75 Z m 2.40625,12.8334 A 6.416667,6.416667 0 0 1 30.41667,24 6.416667,6.416667 0 0 1 24.000004,30.4166 6.416667,6.416667 0 0 1 17.583334,24 a 6.416667,6.416667 0 0 1 6.41667,-6.4166 z"
     fill="url(#a)"
     fill-rule="evenodd"
     stroke="#999999"
     stroke-linejoin="round"
     stroke-width="1.5"
     id="path2"
     style="fill:url(#a);stroke:#d4aa00" />
</svg>
