<svg width="33" height="33" version="1.1" xmlns="http://www.w3.org/2000/svg">
 <path d="M 20.25,25.75 30,16 20.25,6.25" fill="none" stroke="#01a901" stroke-linecap="round" stroke-linejoin="round" stroke-width="6"/>
 <path d="m30 16h-27" fill="none" stroke="#01a901" stroke-linecap="round" stroke-width="6"/>
</svg>
