<?xml version="1.0" encoding="UTF-8" standalone="no"?>
<svg
   height="16"
   width="16"
   version="1.1"
   id="svg6775"
   sodipodi:docname="laz_cut.svg"
   inkscape:export-filename="laz_cut.png"
   inkscape:export-xdpi="96"
   inkscape:export-ydpi="96"
   inkscape:version="1.2.2 (732a01da63, 2022-12-09)"
   xmlns:inkscape="http://www.inkscape.org/namespaces/inkscape"
   xmlns:sodipodi="http://sodipodi.sourceforge.net/DTD/sodipodi-0.dtd"
   xmlns="http://www.w3.org/2000/svg"
   xmlns:svg="http://www.w3.org/2000/svg">
  <defs
     id="defs6779" />
  <sodipodi:namedview
     id="namedview6777"
     pagecolor="#ffffff"
     bordercolor="#666666"
     borderopacity="1.0"
     inkscape:showpageshadow="2"
     inkscape:pageopacity="0.0"
     inkscape:pagecheckerboard="0"
     inkscape:deskcolor="#d1d1d1"
     showgrid="true"
     inkscape:zoom="57.375"
     inkscape:cx="7.9912854"
     inkscape:cy="8"
     inkscape:current-layer="svg6775">
    <inkscape:grid
       type="xygrid"
       id="grid7192" />
  </sodipodi:namedview>
  <path
     d="m6.079893 10.989704 4.388994-10.59773506c1.380992.57212147 1.538953 2.79516636.776253 4.63679716-.873552 2.0327755-2.769288 7.3234049-4.480981 7.4559639z"
     fill="#fff"
     fill-rule="evenodd"
     stroke="#999"
     stroke-width=".6"
     id="path6765" />
  <ellipse
     cx="10.825906"
     cy="8.825378"
     fill="none"
     rx="1.702992"
     ry="2.25052"
     stroke="#f00"
     stroke-linejoin="round"
     stroke-miterlimit="5.6"
     stroke-width="1.20017"
     transform="matrix(.85732304 .51477879 -.49325621 .86988408 0 0)"
     id="ellipse6767" />
  <path
     d="m9.9201079 10.989704-4.3889935-10.59773506c-1.3809926.57212147-1.5389536 2.79516636-.7762531 4.63679716.8735514 2.0327755 2.7692876 7.3234049 4.4809806 7.4559639z"
     fill="#fff"
     fill-rule="evenodd"
     stroke="#999"
     stroke-width=".6"
     id="path6769" />
  <ellipse
     cx="-3.096563"
     cy="17.064398"
     fill="none"
     rx="1.702992"
     ry="2.25052"
     stroke="#f00"
     stroke-linejoin="round"
     stroke-miterlimit="5.6"
     stroke-width="1.20017"
     transform="matrix(-.85732304 .51477879 .49325621 .86988408 0 0)"
     id="ellipse6771" />
  <circle
     cx="8"
     cy="9.5"
     fill="#999"
     r=".65"
     id="circle6773" />
</svg>
