<?xml version="1.0" encoding="UTF-8" standalone="no"?>
<svg
   height="12"
   width="12"
   version="1.1"
   id="svg354"
   sodipodi:docname="quickfix_75.svg"
   inkscape:export-filename="quickfix_75.png"
   inkscape:export-xdpi="96"
   inkscape:export-ydpi="96"
   inkscape:version="1.2.1 (9c6d41e410, 2022-07-14)"
   xmlns:inkscape="http://www.inkscape.org/namespaces/inkscape"
   xmlns:sodipodi="http://sodipodi.sourceforge.net/DTD/sodipodi-0.dtd"
   xmlns:xlink="http://www.w3.org/1999/xlink"
   xmlns="http://www.w3.org/2000/svg"
   xmlns:svg="http://www.w3.org/2000/svg">
  <defs
     id="defs358" />
  <sodipodi:namedview
     id="namedview356"
     pagecolor="#ffffff"
     bordercolor="#666666"
     borderopacity="1.0"
     inkscape:showpageshadow="2"
     inkscape:pageopacity="0.0"
     inkscape:pagecheckerboard="0"
     inkscape:deskcolor="#d1d1d1"
     showgrid="true"
     inkscape:zoom="76.5"
     inkscape:cx="5.9934641"
     inkscape:cy="6"
     inkscape:current-layer="svg354">
    <inkscape:grid
       type="xygrid"
       id="grid945" />
  </sodipodi:namedview>
  <linearGradient
     id="a">
    <stop
       offset="0"
       stop-color="#fff"
       id="stop320" />
    <stop
       offset="1"
       stop-color="#ccc"
       id="stop322" />
  </linearGradient>
  <linearGradient
     id="b"
     gradientTransform="matrix(.04419436 .66289655 -.66289655 -.04419436 .887746 8.988862)"
     gradientUnits="userSpaceOnUse"
     x1="1.9975"
     x2="2.8346"
     xlink:href="#a"
     y1="13.588"
     y2="14.458" />
  <linearGradient
     id="c"
     gradientTransform="matrix(-.66289655 -.04419436 .04419436 .66289655 -13.516707 -5.415935)"
     gradientUnits="userSpaceOnUse"
     x1="1.9975"
     x2="2.8346"
     xlink:href="#a"
     y1="13.588"
     y2="14.458" />
  <linearGradient
     id="d"
     gradientTransform="matrix(-.66467295 .04242553 -.04242553 .66467295 -5.712873 .973554)"
     gradientUnits="userSpaceOnUse"
     x1="4.75"
     x2="6.75"
     y1="9.25"
     y2="11.25">
    <stop
       offset="0"
       stop-color="#333"
       id="stop327" />
    <stop
       offset=".3"
       stop-color="#e6e6e6"
       id="stop329" />
    <stop
       offset="1"
       stop-color="#1a1a1a"
       id="stop331" />
  </linearGradient>
  <g
     transform="matrix(-1 0 0 1 -6.500002 .499847)"
     id="g352">
    <path
       d="m-8.0391908 8.7235367 1.414197 1.4141973-1.2374271 1.237427-1.4141969-1.4141972z"
       fill="url(#b)"
       fill-rule="evenodd"
       stroke="#666"
       stroke-linejoin="round"
       stroke-width=".249995"
       id="path334" />
    <g
       fill="none"
       stroke="#e4b600"
       stroke-linecap="round"
       stroke-width=".264581"
       transform="matrix(3.7795573 0 0 3.7795573 -46.5 -3.999999)"
       id="g344">
      <path
         d="m8.334309 1.0583653v1.5874875"
         id="path336" />
      <path
         d="m8.9957621 1.1906559-1.3229062 1.3229063"
         id="path338" />
      <path
         d="m7.5405653 1.8521091h1.5874875"
         id="path340" />
      <path
         d="m7.6728562 1.1906156 1.3229063 1.3229063"
         id="path342" />
    </g>
    <g
       fill-rule="evenodd"
       id="g350">
      <path
         d="m-13.251384 3.5111897-1.414197-1.4141969-1.237427 1.237427 1.414197 1.4141969z"
         fill="url(#c)"
         stroke="#666"
         stroke-linejoin="round"
         stroke-width=".249995"
         id="path346" />
      <path
         d="m-7.8623075 8.7235367-5.3895935-5.3896347-1.414197 1.4141969 5.3895936 5.3896351z"
         fill="url(#d)"
         stroke-width="1.88974"
         id="path348" />
    </g>
  </g>
</svg>
