<?xml version="1.0" encoding="UTF-8" standalone="no"?>
<svg
   height="24"
   width="24"
   version="1.1"
   id="svg300"
   sodipodi:docname="menu_view_anchor_editor_150.svg"
   inkscape:export-filename="menu_view_anchor_editor_150.png"
   inkscape:export-xdpi="96"
   inkscape:export-ydpi="96"
   inkscape:version="1.2.2 (732a01da63, 2022-12-09)"
   xmlns:inkscape="http://www.inkscape.org/namespaces/inkscape"
   xmlns:sodipodi="http://sodipodi.sourceforge.net/DTD/sodipodi-0.dtd"
   xmlns="http://www.w3.org/2000/svg"
   xmlns:svg="http://www.w3.org/2000/svg">
  <defs
     id="defs304" />
  <sodipodi:namedview
     id="namedview302"
     pagecolor="#ffffff"
     bordercolor="#666666"
     borderopacity="1.0"
     inkscape:showpageshadow="2"
     inkscape:pageopacity="0.0"
     inkscape:pagecheckerboard="0"
     inkscape:deskcolor="#d1d1d1"
     showgrid="true"
     inkscape:zoom="38.25"
     inkscape:cx="11.986928"
     inkscape:cy="12"
     inkscape:current-layer="svg300">
    <inkscape:grid
       type="xygrid"
       id="grid527" />
  </sodipodi:namedview>
  <g
     stroke-width="1.5"
     id="g288">
    <path
       d="m.75 1.75h22.5v19.5h-22.5z"
       fill="#2a7fff"
       stroke="#2a7fff"
       stroke-linecap="round"
       stroke-linejoin="round"
       stroke-miterlimit="5.6"
       id="path284" />
    <path
       d="m1.5 4.75h21v15.75h-21z"
       fill="#fff"
       id="path286" />
  </g>
  <g
     fill="none"
     stroke="#4d4d4d"
     id="g298">
    <circle
       cx="12"
       cy="9"
       r="1.625"
       stroke-linecap="round"
       stroke-miterlimit="5.6"
       stroke-width="1.25"
       id="circle290" />
    <path
       d="m8.6999795 11.5h6.5217865"
       stroke-linecap="round"
       id="path292" />
    <path
       d="m12.000005 11.5v6.5"
       stroke-width="1.50001"
       id="path294" />
    <path
       d="m16 14.624997h2.000048c-2.250017 4.417696-10.0288952 4.382268-12.0000883 0h2.0000403"
       stroke-linecap="round"
       stroke-linejoin="round"
       stroke-width="1.24999"
       id="path296" />
  </g>
</svg>
