<?xml version="1.0" encoding="UTF-8" standalone="no"?>
<svg
   height="36"
   width="36"
   version="1.1"
   id="svg401"
   sodipodi:docname="Ok_04_36.svg"
   inkscape:export-filename="Ok_04_36.png"
   inkscape:export-xdpi="96"
   inkscape:export-ydpi="96"
   inkscape:version="1.2-beta (1b65182ce9, 2022-04-05)"
   xmlns:inkscape="http://www.inkscape.org/namespaces/inkscape"
   xmlns:sodipodi="http://sodipodi.sourceforge.net/DTD/sodipodi-0.dtd"
   xmlns="http://www.w3.org/2000/svg"
   xmlns:svg="http://www.w3.org/2000/svg">
  <defs
     id="defs405" />
  <sodipodi:namedview
     id="namedview403"
     pagecolor="#ffffff"
     bordercolor="#666666"
     borderopacity="1.0"
     inkscape:pageshadow="2"
     inkscape:pageopacity="0.0"
     inkscape:pagecheckerboard="0"
     inkscape:deskcolor="#d1d1d1"
     showgrid="true"
     inkscape:zoom="25.5"
     inkscape:cx="18"
     inkscape:cy="18"
     inkscape:current-layer="svg401">
    <inkscape:grid
       type="xygrid"
       id="grid766" />
  </sodipodi:namedview>
  <g
     id="g826">
    <path
       d="m 9,16.5 6.75,6.75 18,-17.9999991"
       stroke-width="3.6"
       id="path395"
       style="fill:none;stroke:#00aad4;stroke-linecap:round;stroke-linejoin:round" />
    <path
       d="m 30.874999,17.855769 v 16.01923 H 1.125 V 4.1250007 h 24.028846"
       stroke-dashoffset="1.49998"
       stroke-width="2.25"
       id="path397"
       style="fill:none;stroke:#00aad4;stroke-linecap:round;stroke-linejoin:round" />
  </g>
</svg>
