<?xml version="1.0" encoding="UTF-8" standalone="no"?>
<svg
   height="32"
   width="32"
   version="1.1"
   id="svg334"
   sodipodi:docname="Attention_01_32.svg"
   inkscape:export-filename="Attention_01_32.png"
   inkscape:export-xdpi="96"
   inkscape:export-ydpi="96"
   inkscape:version="1.2-beta (1b65182ce9, 2022-04-05)"
   xml:space="preserve"
   xmlns:inkscape="http://www.inkscape.org/namespaces/inkscape"
   xmlns:sodipodi="http://sodipodi.sourceforge.net/DTD/sodipodi-0.dtd"
   xmlns="http://www.w3.org/2000/svg"
   xmlns:svg="http://www.w3.org/2000/svg"><defs
     id="defs338" /><sodipodi:namedview
     id="namedview336"
     pagecolor="#ffffff"
     bordercolor="#666666"
     borderopacity="1.0"
     inkscape:pageshadow="2"
     inkscape:pageopacity="0.0"
     inkscape:pagecheckerboard="0"
     inkscape:deskcolor="#d1d1d1"
     showgrid="true"
     inkscape:zoom="28.6875"
     inkscape:cx="14.727669"
     inkscape:cy="16"
     inkscape:current-layer="g330"><inkscape:grid
       type="xygrid"
       id="grid2408" /></sodipodi:namedview><linearGradient
     id="a"
     gradientTransform="matrix(1.0241804,0,0,1.0166667,-0.658472,-0.133334)"
     gradientUnits="userSpaceOnUse"
     x1="4.5"
     x2="8.5"
     y1="9"
     y2="9"><stop
       offset="0"
       stop-color="#f2f2f2"
       id="stop308" /><stop
       offset=".5"
       stop-color="#d5f6ff"
       id="stop310" /><stop
       offset="1"
       stop-color="#f2f2f2"
       id="stop312" /></linearGradient><radialGradient
     id="b"
     cx="6.050546"
     cy="12.842726"
     gradientTransform="matrix(1.9554574,-7e-8,0,0.91237455,-6.432661,1.109381)"
     gradientUnits="userSpaceOnUse"
     r="4.045085"><stop
       offset="0"
       stop-color="#06f"
       id="stop315" /><stop
       offset="1"
       stop-color="#d5e5ff"
       id="stop317" /></radialGradient><g
     fill-rule="evenodd"
     id="g332"><g
       transform="matrix(2 0 0 2 1.000062 0)"
       id="g330"><g
         id="g1031"><path
           d="M 3.9503393,0.37499945 V 5.9666665 L 0.3657083,12.575 c -1.21973252,1.893005 0,3.05 1.5362705,3.05 h 8.1934442 c 1.53627,0 2.756003,-1.156995 1.53627,-3.05 L 8.0470615,5.9666665 V 0.37499945 Z"
           fill="url(#a)"
           stroke="#87aade"
           stroke-linejoin="round"
           stroke-width="0.75"
           id="path320"
           style="fill:url(#a)" /><path
           d="M 3.5032798,9.881194 2.1110438,12.125 c -1.129999,1.534204 -0.394233,2.25863 0.830505,2.256188 l 6.2117262,-0.01239 c 1.129999,0 1.694999,-1.121902 0.7656445,-2.102999 L 8.023276,9.8811925 Z"
           fill="url(#b)"
           id="path322"
           style="fill:url(#b);stroke-width:0.5" /></g><g
         fill-rule="evenodd"
         transform="translate(0.49997678)"
         id="g264"><path
           d="M 14.000054,15.000001 H 5.9999302 L 9.9999921,6.9998764 Z"
           fill="none"
           stroke="#ffffff"
           stroke-linejoin="round"
           stroke-width="2"
           id="path254" /><path
           d="M 14.000054,15.000001 H 5.9999302 L 9.9999921,6.9998764 Z"
           fill="#ffd42a"
           stroke="#806600"
           stroke-linejoin="round"
           stroke-width="0.75"
           id="path256" /><g
           fill="none"
           stroke="#000000"
           id="g262"><path
             d="m 9.999992,10 v 2"
             id="path258" /><path
             d="m 9.999992,13 v 1"
             id="path260" /></g></g></g></g></svg>
