<?xml version="1.0" encoding="UTF-8" standalone="no"?>
<svg
   width="64"
   height="64"
   version="1.1"
   viewBox="0 0 16.933 16.933"
   id="svg635"
   sodipodi:docname="Health_12_64.svg"
   inkscape:export-filename="Health_12_64.png"
   inkscape:export-xdpi="96"
   inkscape:export-ydpi="96"
   inkscape:version="1.2.1 (9c6d41e410, 2022-07-14)"
   xmlns:inkscape="http://www.inkscape.org/namespaces/inkscape"
   xmlns:sodipodi="http://sodipodi.sourceforge.net/DTD/sodipodi-0.dtd"
   xmlns="http://www.w3.org/2000/svg"
   xmlns:svg="http://www.w3.org/2000/svg">
  <defs
     id="defs639" />
  <sodipodi:namedview
     id="namedview637"
     pagecolor="#ffffff"
     bordercolor="#666666"
     borderopacity="1.0"
     inkscape:showpageshadow="2"
     inkscape:pageopacity="0.0"
     inkscape:pagecheckerboard="0"
     inkscape:deskcolor="#d1d1d1"
     showgrid="true"
     inkscape:zoom="14.34375"
     inkscape:cx="28.583878"
     inkscape:cy="32"
     inkscape:current-layer="svg635">
    <inkscape:grid
       type="xygrid"
       id="grid862" />
  </sodipodi:namedview>
  <path
     style="fill:none;stroke:#00aad4;stroke-width:0.846648;stroke-dasharray:none;stroke-opacity:1"
     d="M 7.0785116,14.343172 C -4.1909098,5.5310345 4.3725109,-2.6756767 8.4664997,3.8127355 11.42894,-0.88232708 16.73161,2.1170881 15.166709,7.4725882"
     id="path2228" />
  <g
     id="g4144"
     transform="scale(0.52915625)">
    <circle
       cx="23.799999"
       cy="23.799999"
       r="7.4000001"
       stroke-dashoffset="1.49998"
       stroke-linejoin="round"
       stroke-width="1.6"
       transform="matrix(0,1,1,0,0,0)"
       id="circle806"
       style="fill:none;stroke:#00aad4;stroke-linecap:round" />
    <path
       d="m 23.8,19.8 v 8"
       id="path808"
       style="fill:none;stroke:#00aad4;stroke-width:1.6;stroke-linecap:round;stroke-dasharray:none" />
    <path
       d="m 27.8,23.8 h -8"
       id="path810"
       style="fill:none;stroke:#00aad4;stroke-width:1.6;stroke-linecap:round;stroke-dasharray:none" />
    <rect
       style="fill:none;stroke-width:1.5;stroke-linecap:round;stroke-linejoin:round;stroke-miterlimit:5.6"
       id="rect4135"
       width="17"
       height="17"
       x="15"
       y="15" />
  </g>
</svg>
