<?xml version="1.0" encoding="UTF-8" standalone="no"?>
<svg
   width="24"
   height="24"
   version="1.0"
   id="svg350"
   inkscape:export-xdpi="96"
   inkscape:export-ydpi="96"
   inkscape:version="1.2.1 (9c6d41e410, 2022-07-14)"
   sodipodi:docname="pkg_installed_150.svg"
   inkscape:export-filename="pkg_installed_150.png"
   xmlns:inkscape="http://www.inkscape.org/namespaces/inkscape"
   xmlns:sodipodi="http://sodipodi.sourceforge.net/DTD/sodipodi-0.dtd"
   xmlns:xlink="http://www.w3.org/1999/xlink"
   xmlns="http://www.w3.org/2000/svg"
   xmlns:svg="http://www.w3.org/2000/svg">
  <sodipodi:namedview
     id="namedview352"
     pagecolor="#ffffff"
     bordercolor="#666666"
     borderopacity="1.0"
     inkscape:showpageshadow="2"
     inkscape:pageopacity="0.0"
     inkscape:pagecheckerboard="0"
     inkscape:deskcolor="#d1d1d1"
     showgrid="true"
     inkscape:zoom="38.25"
     inkscape:cx="14.065359"
     inkscape:cy="12.261438"
     inkscape:current-layer="svg350">
    <inkscape:grid
       type="xygrid"
       id="grid1112" />
  </sodipodi:namedview>
  <defs
     id="defs328">
    <linearGradient
       id="linearGradient933-3">
      <stop
         stop-color="#ffe991"
         offset="0"
         id="stop316" />
      <stop
         stop-color="#f5c400"
         offset="1"
         id="stop318" />
    </linearGradient>
    <linearGradient
       id="linearGradient1347"
       x1="8.837"
       x2="15.576"
       y1="7.8054"
       y2="10.838"
       gradientTransform="matrix(1.4839 0 0 1.4839 -.1129 24.918)"
       gradientUnits="userSpaceOnUse"
       xlink:href="#linearGradient933-3" />
    <linearGradient
       id="linearGradient1351"
       x1="8.837"
       x2="15.576"
       y1="7.8013"
       y2="10.834"
       gradientTransform="matrix(-1.4839 0 0 1.4839 25.113 24.924)"
       gradientUnits="userSpaceOnUse"
       xlink:href="#linearGradient933-3" />
    <linearGradient
       id="linearGradient1355"
       x1="1.4239"
       x2="15.576"
       y1="4.4317"
       y2="4.4317"
       gradientTransform="matrix(-1.4839 0 0 1.4839 25.113 24.924)"
       gradientUnits="userSpaceOnUse">
      <stop
         stop-color="#ffe478"
         offset="0"
         id="stop323" />
      <stop
         stop-color="#fff2c0"
         offset="1"
         id="stop325" />
    </linearGradient>
  </defs>
  <g
     transform="translate(0,-24)"
     id="g348">
    <g
       stroke="#ccaa00"
       stroke-linejoin="round"
       id="g336">
      <path
         d="m12.5 36.789 11-5.2887v9.5l-11 6z"
         fill="url(#linearGradient1347)"
         id="path330" />
      <path
         d="m12.5 36.5-11-5v9.5l11 6z"
         fill="url(#linearGradient1351)"
         id="path332" />
      <path
         d="m12.5 26.5-11 5 11 5 11-5z"
         fill="url(#linearGradient1355)"
         id="path334" />
    </g>
    <g
       fill="none"
       stroke="#5f8dd3"
       stroke-linecap="round"
       id="g346">
      <path
         d="m7.4 28.9 11.1 5.1"
         id="path338" />
      <path
         d="m6.5 34 11.1-5.1"
         id="path340" />
      <path
         d="m6.5 34v9.7"
         id="path342" />
      <path
         d="m18.5 34v9.7"
         id="path344" />
    </g>
  </g>
  <path
     style="fill:#00ff00;fill-opacity:1;fill-rule:evenodd;stroke:none;stroke-width:1.5px;stroke-linecap:butt;stroke-linejoin:miter;stroke-opacity:1"
     d="m 1.5,11.5 11,5 V 19 l -11,-5 z"
     id="path860"
     inkscape:connector-curvature="0"
     sodipodi:nodetypes="ccccc" />
  <path
     inkscape:connector-curvature="0"
     id="path862"
     d="m 23.5,11.5 -11,5 V 19 l 11,-5 z"
     style="fill:#37c837;fill-opacity:1;fill-rule:evenodd;stroke:none;stroke-width:1.5px;stroke-linecap:butt;stroke-linejoin:miter;stroke-opacity:1"
     sodipodi:nodetypes="ccccc" />
</svg>
