<?xml version="1.0" encoding="UTF-8" standalone="no"?>
<svg
   width="48"
   height="48"
   version="1.1"
   viewBox="0 0 48 48"
   id="svg12"
   sodipodi:docname="tsqltransaction_200.svg"
   inkscape:version="1.3.2 (091e20e, 2023-11-25, custom)"
   xmlns:inkscape="http://www.inkscape.org/namespaces/inkscape"
   xmlns:sodipodi="http://sodipodi.sourceforge.net/DTD/sodipodi-0.dtd"
   xmlns:xlink="http://www.w3.org/1999/xlink"
   xmlns="http://www.w3.org/2000/svg"
   xmlns:svg="http://www.w3.org/2000/svg">
  <sodipodi:namedview
     id="namedview12"
     pagecolor="#ffffff"
     bordercolor="#000000"
     borderopacity="0.25"
     inkscape:showpageshadow="2"
     inkscape:pageopacity="0.0"
     inkscape:pagecheckerboard="0"
     inkscape:deskcolor="#d1d1d1"
     showgrid="true"
     inkscape:current-layer="svg12">
    <inkscape:grid
       id="grid14"
       units="px"
       originx="0"
       originy="0"
       spacingx="0.5"
       spacingy="0.5"
       empcolor="#0099e5"
       empopacity="0.30196078"
       color="#0099e5"
       opacity="0.14901961"
       empspacing="2"
       dotted="false"
       gridanglex="30"
       gridanglez="30"
       visible="true" />
  </sodipodi:namedview>
  <defs
     id="defs3">
    <linearGradient
       id="b"
       x1="4"
       x2="28"
       y1="4"
       y2="4"
       gradientTransform="translate(2.3841858e-7,-2)"
       gradientUnits="userSpaceOnUse"
       xlink:href="#a" />
    <linearGradient
       id="a"
       x1="4"
       x2="28"
       y1="4"
       y2="4"
       gradientUnits="userSpaceOnUse">
      <stop
         stop-color="#4276c4"
         offset="0"
         id="stop1" />
      <stop
         stop-color="#80b3ff"
         offset=".3333333"
         id="stop2" />
      <stop
         stop-color="#04a"
         offset="1"
         id="stop3" />
    </linearGradient>
    <linearGradient
       inkscape:collect="always"
       xlink:href="#a"
       id="linearGradient12"
       gradientUnits="userSpaceOnUse"
       gradientTransform="translate(2.3841858e-7,-2)"
       x1="4"
       y1="4"
       x2="28"
       y2="4" />
    <linearGradient
       inkscape:collect="always"
       xlink:href="#a"
       id="linearGradient13"
       gradientUnits="userSpaceOnUse"
       gradientTransform="translate(2.3841858e-7,-2)"
       x1="4"
       y1="4"
       x2="28"
       y2="4" />
    <linearGradient
       inkscape:collect="always"
       xlink:href="#a"
       id="linearGradient14"
       gradientUnits="userSpaceOnUse"
       gradientTransform="translate(2.3841858e-7,-2)"
       x1="4"
       y1="4"
       x2="28"
       y2="4" />
  </defs>
  <rect
     x="2"
     y="29.999983"
     width="39"
     height="18"
     ry="3"
     fill="#739bdf"
     fill-rule="evenodd"
     style="paint-order:normal"
     id="rect3" />
  <ellipse
     cx="16"
     cy="24.999983"
     rx="10.2"
     ry="3.2"
     fill="none"
     stroke="url(#b)"
     stroke-linecap="round"
     stroke-linejoin="round"
     stroke-width="3.6"
     id="ellipse3"
     style="stroke:url(#linearGradient12)" />
  <ellipse
     cx="16"
     cy="22.400007"
     rx="9.8000002"
     ry="2.8"
     fill="none"
     stroke="#ffffff"
     stroke-linecap="round"
     stroke-linejoin="round"
     stroke-width="2.4"
     id="ellipse4" />
  <ellipse
     cx="16"
     cy="18.999983"
     rx="10.2"
     ry="3.2"
     fill="none"
     stroke="url(#b)"
     stroke-linecap="round"
     stroke-linejoin="round"
     stroke-width="3.6"
     id="ellipse5"
     style="stroke:url(#linearGradient13)" />
  <ellipse
     cx="16"
     cy="16.400007"
     rx="9.8000002"
     ry="2.8"
     fill="none"
     stroke="#ffffff"
     stroke-linecap="round"
     stroke-linejoin="round"
     stroke-width="2.4"
     id="ellipse6" />
  <ellipse
     cx="16"
     cy="12.999983"
     rx="10.2"
     ry="3.2"
     fill="none"
     stroke="url(#b)"
     stroke-linecap="round"
     stroke-linejoin="round"
     stroke-width="3.6"
     id="ellipse7"
     style="stroke:url(#linearGradient14)" />
  <ellipse
     cx="16"
     cy="10.400007"
     rx="9.8000002"
     ry="2.8"
     fill="none"
     stroke="#ffffff"
     stroke-linecap="round"
     stroke-linejoin="round"
     stroke-width="2.4"
     id="ellipse8" />
  <ellipse
     cx="16"
     cy="6.9999828"
     rx="10.8"
     ry="3.8"
     fill="#80b3ff"
     fill-rule="evenodd"
     stroke="url(#b)"
     stroke-linecap="round"
     stroke-linejoin="round"
     stroke-width="2.4"
     id="ellipse9"
     style="stroke:url(#b)" />
  <path
     d="m 28.661,34.65 v 8.7003 h 4.89928"
     fill="none"
     stroke="#ffffff"
     stroke-linecap="round"
     stroke-linejoin="round"
     stroke-width="1.3"
     id="path9" />
  <path
     d="m 23.51285,41.0717 3.09578,2.2787 M 22.48092,34.65 c 1.60073,0 2.8894,1.1921 2.8894,2.673 v 3.3543 c 0,1.4809 -1.28867,2.673 -2.8894,2.673 -1.60073,0 -2.88939,-1.1921 -2.88939,-2.673 V 37.323 c 0,-1.4809 1.28866,-2.673 2.88939,-2.673 z"
     fill="none"
     stroke="#ffffff"
     stroke-linecap="round"
     stroke-linejoin="round"
     stroke-width="1.3"
     id="path10" />
  <path
     d="M 16.84811,35.2178 C 16.29295,34.835 15.46862,34.65 14.48379,34.65 c -1.39173,0 -2.65814,0.7319 -2.65814,2.2537 0,1.1921 1.00545,1.6822 2.65814,1.9691 2.30127,0.3993 2.65812,1.1756 2.65812,2.2238 0,1.8941 -1.57603,2.2537 -2.65812,2.2537 -0.84003,0 -1.70229,-0.1022 -2.78379,-0.6624"
     fill="none"
     stroke="#ffffff"
     stroke-linecap="round"
     stroke-linejoin="round"
     stroke-width="1.3"
     id="path11" />
  <path
     d="M 36.044854,5.5006 24.494929,17.0241 H 34.994861 L 30.794887,27.5002 45.494788,12.8337 H 34.994861 l 7.359997,-7.3432 z"
     fill="#ffff00"
     fill-rule="evenodd"
     stroke="#f29406"
     stroke-linejoin="round"
     stroke-width="1px"
     style="paint-order:normal"
     id="path12" />
</svg>
