<?xml version="1.0" encoding="UTF-8" standalone="no"?>
<svg
   height="64"
   width="64"
   version="1.1"
   id="svg176"
   sodipodi:docname="Bell_03_64.svg"
   inkscape:export-filename="Bell_03_64.png"
   inkscape:export-xdpi="96"
   inkscape:export-ydpi="96"
   inkscape:version="1.2.1 (9c6d41e410, 2022-07-14)"
   xmlns:inkscape="http://www.inkscape.org/namespaces/inkscape"
   xmlns:sodipodi="http://sodipodi.sourceforge.net/DTD/sodipodi-0.dtd"
   xmlns="http://www.w3.org/2000/svg"
   xmlns:svg="http://www.w3.org/2000/svg">
  <defs
     id="defs180">
    <radialGradient
       id="radialGradient19980"
       cx="8"
       cy="14.05"
       r="1.9"
       gradientTransform="matrix(1.2823e-8,0.78947,-1.0526,1.0526e-8,22.789,8.1842)"
       gradientUnits="userSpaceOnUse">
      <stop
         stop-color="#ac3030"
         offset="0"
         id="stop7" />
      <stop
         stop-color="#f48c3c"
         offset="1"
         id="stop9" />
    </radialGradient>
    <radialGradient
       id="radialGradient7722"
       cx="7.5"
       cy="5.3512998"
       r="6.4738998"
       gradientTransform="matrix(0.081012,1.1343,-0.66634,0.047602,10.434,-3.1149)"
       gradientUnits="userSpaceOnUse">
      <stop
         stop-color="#fdf5dd"
         offset="0"
         id="stop2" />
      <stop
         stop-color="#fdc84f"
         offset="1"
         id="stop4" />
    </radialGradient>
    <radialGradient
       id="a"
       cx="12.1"
       cy="10.900001"
       gradientTransform="matrix(0,2.0740741,-2.0740739,4e-8,43.307408,-4.396297)"
       gradientUnits="userSpaceOnUse"
       r="4.5">
      <stop
         offset="0"
         stop-color="#f55"
         id="stop788" />
      <stop
         offset="1"
         stop-color="#a00"
         id="stop790" />
    </radialGradient>
  </defs>
  <sodipodi:namedview
     id="namedview178"
     pagecolor="#ffffff"
     bordercolor="#666666"
     borderopacity="1.0"
     inkscape:pageshadow="2"
     inkscape:pageopacity="0.0"
     inkscape:pagecheckerboard="0"
     inkscape:deskcolor="#d1d1d1"
     showgrid="true"
     inkscape:zoom="14.34375"
     inkscape:cx="32"
     inkscape:cy="32"
     inkscape:current-layer="svg176"
     inkscape:showpageshadow="2">
    <inkscape:grid
       type="xygrid"
       id="grid1029" />
  </sodipodi:namedview>
  <g
     id="g963"
     transform="matrix(4.0000697,0,0,4.0000697,-8.1578274e-4,-1.966967e-8)">
    <path
       d="m 6.1,14 c 0.071136,2.7117 3.8,2.6205 3.8,0"
       fill="url(#radialGradient19980)"
       id="path14"
       style="fill:url(#radialGradient19980)" />
    <path
       d="m 8.0002,2.5 c 2.6223,0.015139 4.0153,2.2532 4.0153,3.1472 0,2.4099 0.70488,4.1963 1.7538,5.7699 0.36394,0.54599 0.59493,1.9773 0,2.0981 -3.264,0.66293 -8.3926,0.62207 -11.538,0 -0.59543,-0.11775 -0.36474,-1.551 0,-2.0981 1.0489,-1.5736 1.7465,-3.36 1.7465,-5.7699 0,-0.89405 1.4003,-3.1623 4.0226,-3.1472 z"
       fill="url(#radialGradient7722)"
       stroke="#f48c3c"
       stroke-dashoffset="1.5"
       stroke-linejoin="round"
       stroke-width="0.5"
       id="path16"
       style="fill:url(#radialGradient7722);stroke-linecap:round" />
    <path
       d="M 4.2489,10.665 C 6.4877,11.08958 9.5,11 11.744,10.665"
       fill="none"
       stroke="#fdbc4d"
       id="path18"
       style="stroke-linecap:round" />
    <path
       d="M 8,0.375 A 0.775,0.78596 0 0 0 7.225,1.16096 V 1.55394 A 0.775,0.78596 0 0 0 8,2.3399 0.775,0.78596 0 0 0 8.775,1.55394 V 1.16096 A 0.775,0.78596 0 0 0 8,0.375 Z"
       color="#000000"
       fill="none"
       stroke="#f48c3c"
       stroke-width="0.75"
       id="path20"
       style="stroke-linecap:round" />
  </g>
  <g
     id="g1542"
     transform="scale(2)">
    <circle
       cx="23.5"
       cy="23.5"
       style="fill:url(#a);stroke:#ffffff;stroke-width:1.6;stroke-linecap:round;stroke-linejoin:round;stroke-dashoffset:1.49998"
       transform="matrix(0,1,1,0,0,0)"
       id="ellipse793"
       r="7.6999998" />
    <g
       id="g4083"
       transform="matrix(2,0,0,2,0.5,0.5)">
      <path
         d="m 13,10 -3,3"
         id="path3550"
         style="fill:none;stroke:#ffffff;stroke-width:1.2;stroke-linecap:round;stroke-dasharray:none"
         sodipodi:nodetypes="cc" />
      <path
         d="M 13,13 10,10"
         id="path3552"
         style="fill:none;stroke:#ffffff;stroke-width:1.2;stroke-linecap:round;stroke-dasharray:none"
         sodipodi:nodetypes="cc" />
    </g>
  </g>
</svg>
