<?xml version="1.0" encoding="UTF-8" standalone="no"?>
<svg
   height="16"
   width="16"
   version="1.1"
   id="svg1178"
   sodipodi:docname="Undo_01_16.svg"
   inkscape:export-filename="Undo_01_16.png"
   inkscape:export-xdpi="96"
   inkscape:export-ydpi="96"
   inkscape:version="1.2-beta (1b65182ce9, 2022-04-05)"
   xmlns:inkscape="http://www.inkscape.org/namespaces/inkscape"
   xmlns:sodipodi="http://sodipodi.sourceforge.net/DTD/sodipodi-0.dtd"
   xmlns="http://www.w3.org/2000/svg"
   xmlns:svg="http://www.w3.org/2000/svg">
  <defs
     id="defs1182" />
  <sodipodi:namedview
     id="namedview1180"
     pagecolor="#ffffff"
     bordercolor="#666666"
     borderopacity="1.0"
     inkscape:pageshadow="2"
     inkscape:pageopacity="0.0"
     inkscape:pagecheckerboard="0"
     inkscape:deskcolor="#d1d1d1"
     showgrid="true"
     inkscape:zoom="57.375"
     inkscape:cx="7.9912854"
     inkscape:cy="8"
     inkscape:current-layer="svg1178">
    <inkscape:grid
       type="xygrid"
       id="grid1405" />
  </sodipodi:namedview>
  <g
     fill="none"
     stroke="#d40000"
     stroke-linecap="round"
     transform="translate(1.999958 2.498763)"
     id="g1176">
    <path
       d="m2.5000416.33371161h5.991032c2.3016604 0 4.1675254 1.86586499 4.1675254 4.16752599 0 2.3016611-1.865865 4.1675259-4.1675254 4.1675259h-8.469032"
       stroke-width="1.66495"
       id="path1172" />
    <path
       d="m2.4476423 5.5267616-3.15810686 3.1581069 3.15810686 3.1581075"
       stroke-linejoin="round"
       stroke-width="1.57905"
       id="path1174" />
  </g>
</svg>
