<?xml version="1.0" encoding="UTF-8" standalone="no"?>
<svg
   height="36"
   width="36"
   version="1.1"
   id="svg163"
   sodipodi:docname="Time_07_36.svg"
   inkscape:export-filename="Time_07_36.png"
   inkscape:export-xdpi="96"
   inkscape:export-ydpi="96"
   inkscape:version="1.2.1 (9c6d41e410, 2022-07-14)"
   xmlns:inkscape="http://www.inkscape.org/namespaces/inkscape"
   xmlns:sodipodi="http://sodipodi.sourceforge.net/DTD/sodipodi-0.dtd"
   xmlns="http://www.w3.org/2000/svg"
   xmlns:svg="http://www.w3.org/2000/svg">
  <defs
     id="defs167" />
  <sodipodi:namedview
     id="namedview165"
     pagecolor="#ffffff"
     bordercolor="#666666"
     borderopacity="1.0"
     inkscape:pageshadow="2"
     inkscape:pageopacity="0.0"
     inkscape:pagecheckerboard="0"
     inkscape:deskcolor="#d1d1d1"
     showgrid="true"
     inkscape:zoom="25.5"
     inkscape:cx="18"
     inkscape:cy="18"
     inkscape:current-layer="g270"
     inkscape:showpageshadow="2">
    <inkscape:grid
       type="xygrid"
       id="grid903" />
  </sodipodi:namedview>
  <path
     id="path377"
     style="color:#000000;fill:#00aad4;stroke-width:1.45455;stroke-linecap:round;stroke-dashoffset:1.49998"
     d="M 20.873047 4 A 12.375 12.375 0 0 1 22.443359 9 L 33.818359 9 L 33.818359 31.818359 L 6.1816406 31.818359 L 6.1816406 21.845703 A 12.375 12.375 0 0 1 4 20.839844 L 4 34 L 36 34 L 36 4 L 20.873047 4 z " />
  <path
     style="fill:none;stroke:#00aad4;stroke-width:1.5;stroke-linecap:butt;stroke-linejoin:round;stroke-dasharray:none;stroke-opacity:1"
     d="m 17.5,20.5 -1.5,1 h 2.181923 z"
     id="path488"
     sodipodi:nodetypes="cccc" />
  <path
     style="fill:none;stroke:#00aad4;stroke-width:1.5;stroke-linecap:butt;stroke-linejoin:round;stroke-dasharray:none;stroke-opacity:1"
     d="m 22.5,13.5 -0.5,2 h 2.181923 z"
     id="path2184"
     sodipodi:nodetypes="cccc" />
  <path
     style="fill:none;stroke:#00aad4;stroke-width:1.5;stroke-linecap:butt;stroke-linejoin:round;stroke-dasharray:none;stroke-opacity:1"
     d="M 22,19.318077 V 21.5 h 2.181923 z"
     id="path2186" />
  <path
     style="fill:none;stroke:#00aad4;stroke-width:1.5;stroke-linecap:butt;stroke-linejoin:round;stroke-dasharray:none;stroke-opacity:1"
     d="M 28,13.318077 V 15.5 h 2.181923 z"
     id="path2188" />
  <path
     style="fill:none;stroke:#00aad4;stroke-width:1.5;stroke-linecap:butt;stroke-linejoin:round;stroke-dasharray:none;stroke-opacity:1"
     d="M 28,19.318077 V 21.5 h 2.181923 z"
     id="path2190" />
  <path
     style="fill:none;stroke:#00aad4;stroke-width:1.5;stroke-linecap:butt;stroke-linejoin:round;stroke-dasharray:none;stroke-opacity:1"
     d="M 10,25.318077 V 27.5 h 2.181923 z"
     id="path2194" />
  <path
     style="fill:none;stroke:#00aad4;stroke-width:1.5;stroke-linecap:butt;stroke-linejoin:round;stroke-dasharray:none;stroke-opacity:1"
     d="M 16,25.318077 V 27.5 h 2.181923 z"
     id="path2196" />
  <path
     style="fill:none;stroke:#00aad4;stroke-width:1.5;stroke-linecap:butt;stroke-linejoin:round;stroke-dasharray:none;stroke-opacity:1"
     d="M 22,25.318077 V 27.5 h 2.181923 z"
     id="path2198" />
  <path
     style="fill:none;stroke:#00aad4;stroke-width:1.5;stroke-linecap:butt;stroke-linejoin:round;stroke-dasharray:none;stroke-opacity:1"
     d="M 28,25.318077 V 27.5 h 2.181923 z"
     id="path2200" />
  <g
     fill="none"
     stroke="#00aad4"
     id="g270"
     transform="matrix(1.2623377,0,0,1.2623377,0.02629853,0.0262985)"
     style="stroke-width:1.78241">
    <circle
       cx="8"
       cy="8"
       r="7.1296282"
       stroke-width="2.5463"
       id="circle266"
       style="stroke-width:1.78241;stroke-dasharray:none" />
    <path
       d="m 7.9009773,2.35571 1.6e-6,5.5452673 4.3569941,0"
       id="path268"
       style="stroke-width:1.58436;stroke-dasharray:none"
       sodipodi:nodetypes="ccc" />
  </g>
</svg>
