<svg width="24" height="24" version="1.1" xmlns="http://www.w3.org/2000/svg">
 <g>
  <g transform="matrix(.94355986 0 0 .94000003 -1.157418 -.96)" stroke-width="1.06182">
   <g fill="none" stroke-linejoin="round">
    <path d="m14.476356 13.252309v4.257512l-1.060317.001v2.12775h-1.058313v5.321889h12.711783v-5.321889l-1.060317.001v-2.128755l-1.058313-.001v-4.257512z" stroke="#fff" stroke-width="3.18546"/>
    <g stroke="#b3b3b3" stroke-width="1.06182">
     <path d="m14.474353 17.510637h-1.059817v2.127659"/>
     <path d="m24.012698 19.638296.000287-2.127659h-1.060103"/>
    </g>
   </g>
   <path d="m14.475349 19.106382v-5.852073h8.476535v5.852073" fill="#fff" stroke="#6995db" stroke-width="1.06181"/>
   <g stroke-linecap="round">
    <path d="m12.461904 19.743479h12.50342v5.108788h-12.50342z" fill="#e6e6e6" stroke="#999" stroke-linejoin="round" stroke-width="1.27419"/>
    <g fill="none" stroke-width="1.06182">
     <path d="m16.592982 15.383984h4.239265" stroke="#b3b3b3"/>
     <path d="m21.893066 22.829787h1.059816" stroke="#f00"/>
     <path d="m16.593984 17.510637h4.239264" stroke="#b3b3b3"/>
    </g>
   </g>
  </g>
 </g>
</svg>
