<svg width="36" height="36" version="1.1" xmlns="http://www.w3.org/2000/svg">
 <rect x="2.55" y="2.55" width="30.9" height="30.9" rx="2.5" fill="#f0fcff" stroke="#00aad4" stroke-linejoin="round" stroke-width="1.1"/>
 <path d="m3 3h30v4h-30z" fill="#00aad4"/>
 <circle cx="26" cy="26" r="9.2" fill="#fff6ec" stroke="#ff3333" stroke-width="1.1"/>
 <path d="m30 26h-8" fill="none" stroke="#ff3333" stroke-linecap="round" stroke-width="2"/>
</svg>
