<?xml version="1.0" encoding="UTF-8" standalone="no"?>
<svg
   height="48"
   width="48"
   version="1.1"
   id="svg570"
   sodipodi:docname="Open_02_48.svg"
   inkscape:export-filename="Open_02_48.png"
   inkscape:export-xdpi="96"
   inkscape:export-ydpi="96"
   inkscape:version="1.2-beta (1b65182ce9, 2022-04-05)"
   xmlns:inkscape="http://www.inkscape.org/namespaces/inkscape"
   xmlns:sodipodi="http://sodipodi.sourceforge.net/DTD/sodipodi-0.dtd"
   xmlns="http://www.w3.org/2000/svg"
   xmlns:svg="http://www.w3.org/2000/svg">
  <defs
     id="defs574" />
  <sodipodi:namedview
     id="namedview572"
     pagecolor="#ffffff"
     bordercolor="#666666"
     borderopacity="1.0"
     inkscape:pageshadow="2"
     inkscape:pageopacity="0.0"
     inkscape:pagecheckerboard="0"
     inkscape:deskcolor="#d1d1d1"
     showgrid="true"
     inkscape:zoom="19.125"
     inkscape:cx="22.823529"
     inkscape:cy="24"
     inkscape:current-layer="svg570">
    <inkscape:grid
       type="xygrid"
       id="grid693" />
  </sodipodi:namedview>
  <g
     id="g860"
     transform="matrix(2.0000004,0,0,2.0000004,-0.99999965,-9.2388593e-7)">
    <g
       fill="none"
       stroke="#00aad4"
       stroke-linecap="round"
       stroke-linejoin="round"
       transform="matrix(1.5,0,0,1.5,1.25,-2.749981)"
       id="g560">
      <path
         d="M 7.5,8.5000248 V 2.5"
         id="path556" />
      <path
         d="M 5,5.0000248 7.5,2.4999669 10,5.0000248"
         id="path558" />
    </g>
    <g
       stroke-width="0.927015"
       transform="matrix(1.6155127,0,0,1.6206837,-0.424105,-0.890896)"
       id="g568">
      <path
         d="m 12.035012,5.9711 c 2.170032,1.1881731 3.015751,3.1965117 2.107775,5.005354 -0.907976,1.808841 -3.370742,3.02193 -6.137916,3.023364 -2.7671729,0.0014 -5.232562,-1.209102 -6.1444513,-3.017 C 0.94853017,9.1749187 1.7899032,7.1657055 3.9573609,5.9752852"
         fill="none"
         stroke="#00aad4"
         stroke-dashoffset="1.49998"
         stroke-linecap="round"
         stroke-width="0.927201"
         id="path562" />
      <path
         d="m 10.185319,7.824 c 1.490909,0.48195 2.167925,1.394851 1.664007,2.243775 C 11.345409,10.9167 9.7805554,11.499492 8.0031477,11.500193 6.2257395,11.500894 4.6590364,10.919338 4.1524192,10.070811 3.645802,9.222284 4.3199139,8.308852 5.8092884,7.825726"
         fill="none"
         stroke="#00aad4"
         stroke-dashoffset="1.49998"
         stroke-linecap="round"
         stroke-width="0.927015"
         id="path564" />
      <ellipse
         cx="8"
         cy="9.4999914"
         fill="#00aad4"
         rx="1"
         ry="0.5"
         id="ellipse566" />
    </g>
  </g>
</svg>
