<?xml version="1.0" encoding="UTF-8" standalone="no"?>
<svg
   height="48"
   viewBox="0 0 48 48"
   width="48"
   version="1.1"
   id="svg2"
   sodipodi:docname="Connection_03_48.svg"
   inkscape:export-filename="Connection_03_48.png"
   inkscape:export-xdpi="96"
   inkscape:export-ydpi="96"
   inkscape:version="1.3 (0e150ed6c4, 2023-07-21)"
   xmlns:inkscape="http://www.inkscape.org/namespaces/inkscape"
   xmlns:sodipodi="http://sodipodi.sourceforge.net/DTD/sodipodi-0.dtd"
   xmlns="http://www.w3.org/2000/svg"
   xmlns:svg="http://www.w3.org/2000/svg">
  <defs
     id="defs2" />
  <sodipodi:namedview
     id="namedview2"
     pagecolor="#ffffff"
     bordercolor="#000000"
     borderopacity="0.25"
     inkscape:showpageshadow="2"
     inkscape:pageopacity="0.0"
     inkscape:pagecheckerboard="0"
     inkscape:deskcolor="#d1d1d1"
     showgrid="true"
     inkscape:current-layer="svg2">
    <inkscape:grid
       id="grid2"
       units="px"
       originx="0"
       originy="0"
       spacingx="0.5"
       spacingy="0.5"
       empcolor="#0099e5"
       empopacity="0.30196078"
       color="#0099e5"
       opacity="0.14901961"
       empspacing="2"
       dotted="false"
       gridanglex="30"
       gridanglez="30"
       visible="true" />
  </sodipodi:namedview>
  <g
     fill="none"
     stroke-linecap="round"
     stroke-linejoin="round"
     stroke-width="1.79996"
     transform="matrix(2.0000481 0 0 2.0000481 -.001306 -.000718)"
     id="g2">
    <path
       d="m13.167063 10.833372-2.12127-2.1212688-4.8789177 4.8789178 2.1212686 2.12127-4.5375795 4.537579"
       stroke="#00aad4"
       id="path1" />
    <path
       d="m10.833667 13.166769 2.121269 2.121268 4.878918-4.878919-2.121268-2.1212688 4.537578-4.5375788"
       stroke="#00c1f0"
       id="path2" />
  </g>
  <path
     d="M 42,42 V 27 L 27,42 Z"
     fill="#00c1f0"
     id="path1-2"
     style="stroke-width:1;fill:#ccaa00;fill-opacity:1" />
</svg>
