<?xml version="1.0" encoding="UTF-8" standalone="no"?>
<svg
   height="24"
   viewBox="0 0 24 24"
   width="24"
   version="1.1"
   id="svg151"
   sodipodi:docname="Sort_04_24.svg"
   inkscape:export-filename="Sort_04_24.png"
   inkscape:export-xdpi="96"
   inkscape:export-ydpi="96"
   inkscape:version="1.2-beta (1b65182ce9, 2022-04-05)"
   xmlns:inkscape="http://www.inkscape.org/namespaces/inkscape"
   xmlns:sodipodi="http://sodipodi.sourceforge.net/DTD/sodipodi-0.dtd"
   xmlns="http://www.w3.org/2000/svg"
   xmlns:svg="http://www.w3.org/2000/svg">
  <defs
     id="defs155" />
  <sodipodi:namedview
     id="namedview153"
     pagecolor="#ffffff"
     bordercolor="#666666"
     borderopacity="1.0"
     inkscape:pageshadow="2"
     inkscape:pageopacity="0.0"
     inkscape:pagecheckerboard="0"
     inkscape:deskcolor="#d1d1d1"
     showgrid="true"
     inkscape:zoom="38.25"
     inkscape:cx="10.69281"
     inkscape:cy="12"
     inkscape:current-layer="svg151">
    <inkscape:grid
       type="xygrid"
       id="grid1859" />
  </sodipodi:namedview>
  <g
     id="g2160"
     transform="matrix(1.5,0,0,-1.5,-0.525,24.75)">
    <path
       d="M 4.375,14.5 V 2.5"
       stroke="#00aad4"
       stroke-linecap="round"
       id="path397"
       style="fill:none;stroke-width:1.25;stroke-dasharray:none" />
    <path
       d="M 1.875,5.046841 4.375,2.5 l 2.5,2.546841"
       stroke="#00aad4"
       stroke-linecap="round"
       stroke-linejoin="round"
       id="path399"
       style="fill:none;stroke-width:1.25;stroke-dasharray:none" />
  </g>
  <g
     stroke="#00aad4"
     id="g147"
     style="fill:none;stroke-width:1.5"
     transform="matrix(1,0,0,-1,0,24.5)">
    <path
       d="M 9.5,22.25 H 22"
       id="path135" />
    <path
       d="M 11,18.25 H 22"
       id="path137" />
    <path
       d="M 12.5,14.25 H 22"
       id="path139" />
    <path
       d="M 15.5,6.25 H 22"
       id="path141" />
    <path
       d="m 17,2.25 h 5"
       id="path143" />
    <path
       d="m 14,10.25 h 8"
       id="path145" />
  </g>
</svg>
