<?xml version="1.0" encoding="UTF-8" standalone="no"?>
<svg
   height="36"
   width="36"
   version="1.1"
   id="svg296"
   sodipodi:docname="Folder_08_36.svg"
   inkscape:export-filename="Folder_08_36.png"
   inkscape:export-xdpi="96"
   inkscape:export-ydpi="96"
   inkscape:version="1.2 (dc2aedaf03, 2022-05-15)"
   xmlns:inkscape="http://www.inkscape.org/namespaces/inkscape"
   xmlns:sodipodi="http://sodipodi.sourceforge.net/DTD/sodipodi-0.dtd"
   xmlns="http://www.w3.org/2000/svg"
   xmlns:svg="http://www.w3.org/2000/svg">
  <defs
     id="defs300" />
  <sodipodi:namedview
     id="namedview298"
     pagecolor="#ffffff"
     bordercolor="#666666"
     borderopacity="1.0"
     inkscape:pageshadow="2"
     inkscape:pageopacity="0.0"
     inkscape:pagecheckerboard="0"
     inkscape:deskcolor="#d1d1d1"
     showgrid="true"
     inkscape:zoom="25.5"
     inkscape:cx="16.019608"
     inkscape:cy="18"
     inkscape:current-layer="g859"
     showguides="true"
     inkscape:showpageshadow="2">
    <inkscape:grid
       type="xygrid"
       id="grid823" />
  </sodipodi:namedview>
  <g
     id="g859"
     transform="translate(0,2.0000012)">
    <g
       id="g1564"
       transform="translate(0,-2)">
      <path
         d="M 1.1253953,12.874999 1.1249947,6.1249796 c 0,-1.8749912 1.125195,-2.9999858 3.0001861,-2.9999858 H 9.9 c 2.249989,0 3,1.1249946 3,2.9999858 V 7.124999 h 21.975001 v 5.75"
         id="path8"
         style="fill:#fff3cc;fill-opacity:1;stroke:#f4c025;stroke-width:2.24999;stroke-linecap:round;stroke-linejoin:round"
         sodipodi:nodetypes="cccccccc" />
      <path
         d="M 34.874874,13.124999 H 1.1250605 V 30.87484 H 34.874874 Z"
         stroke-linecap="round"
         id="path290"
         style="fill:#f4c025;fill-opacity:1;stroke:#f4c025;stroke-width:2.24999;stroke-linejoin:round;stroke-opacity:1"
         sodipodi:nodetypes="ccccc" />
    </g>
  </g>
</svg>
