<svg width="32" height="32" version="1.0" xmlns="http://www.w3.org/2000/svg">
 <defs>
  <linearGradient id="b" x1="11" x2="21" y1="25.75" y2="25.75" gradientUnits="userSpaceOnUse">
   <stop stop-color="#999999" offset="0"/>
   <stop stop-color="#ffffff" offset=".4"/>
   <stop stop-color="#999999" offset="1"/>
  </linearGradient>
  <radialGradient id="a" cx="8.25" cy="3.6749997" r="4.5" gradientTransform="matrix(-2.222222,2.2222222,-2.222222,-2.222222,41.5,-2.1666676)" gradientUnits="userSpaceOnUse">
   <stop stop-color="#ffffff" offset="0"/>
   <stop stop-color="#ffffff" offset=".2"/>
   <stop stop-color="#ffcc00" offset="1"/>
  </radialGradient>
 </defs>
 <path d="m16 0.5c-4.694416 4e-7 -8.5 3.805584-8.5 8.5 0 2.820434 0.599962 3.928014 1.730468 5.808298 2.261024 3.76058 2.269532 2.691406 2.269532 6.691406h9c0-4 0.03588-2.93083 2.296876-6.691406 1.130498-1.88029 1.703124-2.987864 1.703124-5.808298 0-4.694416-3.805584-8.4999996-8.5-8.5z" fill="url(#a)" fill-rule="evenodd" stroke="#ffcc00" stroke-width="1px"/>
 <path d="m13 29.5h6l-2 2.5h-2z" fill="#333333" fill-rule="evenodd" stroke-width="2" style="paint-order:normal"/>
 <path d="m11.5 21.5h9v6c0 1.10457-0.89543 2-2 2h-5c-1.10457 0-2-0.89543-2-2z" fill="url(#b)" stroke="#999999"/>
</svg>
