<?xml version="1.0" encoding="UTF-8" standalone="no"?>
<svg
   height="48"
   viewBox="0 0 12.7 12.700001"
   width="48"
   version="1.1"
   id="svg746"
   sodipodi:docname="Math_04_48.svg"
   inkscape:version="1.2.1 (9c6d41e410, 2022-07-14)"
   inkscape:export-filename="Math_04_48.png"
   inkscape:export-xdpi="96"
   inkscape:export-ydpi="96"
   xmlns:inkscape="http://www.inkscape.org/namespaces/inkscape"
   xmlns:sodipodi="http://sodipodi.sourceforge.net/DTD/sodipodi-0.dtd"
   xmlns="http://www.w3.org/2000/svg"
   xmlns:svg="http://www.w3.org/2000/svg">
  <defs
     id="defs750" />
  <sodipodi:namedview
     id="namedview748"
     pagecolor="#ffffff"
     bordercolor="#666666"
     borderopacity="1.0"
     inkscape:showpageshadow="2"
     inkscape:pageopacity="0.0"
     inkscape:pagecheckerboard="0"
     inkscape:deskcolor="#d1d1d1"
     showgrid="true"
     inkscape:zoom="19.125"
     inkscape:cx="24"
     inkscape:cy="24"
     inkscape:current-layer="svg746">
    <inkscape:grid
       type="xygrid"
       id="grid1256" />
  </sodipodi:namedview>
  <g
     id="g903"
     transform="matrix(3.0000004,0,0,3.0000004,-5.4666667e-7,-0.00343979)">
    <path
       style="fill:none;stroke:#00aad4;stroke-width:0.330729;stroke-linecap:round;stroke-linejoin:miter;stroke-dasharray:none;stroke-opacity:1"
       d="M 0.9260417,1.4221354 C 0.9260416,1.2898438 1.0583333,1.157552 1.190625,1.157552 h 1.8520833 c 0.1322917,0 0.2645834,-0.1322917 0.2645833,-0.26458333"
       id="path1420"
       sodipodi:nodetypes="cccc" />
    <path
       style="fill:none;stroke:#00aad4;stroke-width:0.330729;stroke-linecap:round;stroke-linejoin:miter;stroke-dasharray:none;stroke-opacity:1"
       d="m 1.4221353,3.3072917 c 0.1322916,10e-8 0.2645833,-0.1322916 0.2645833,-0.2645833 V 1.190625"
       id="path1422"
       sodipodi:nodetypes="ccc" />
    <path
       style="fill:none;stroke:#00aad4;stroke-width:0.330729;stroke-linecap:round;stroke-linejoin:miter;stroke-dasharray:none;stroke-opacity:1"
       d="M 2.8111979,3.3072917 C 2.6789063,3.3072918 2.5466146,3.1750001 2.5466146,3.0427084 V 1.190625"
       id="path1424"
       sodipodi:nodetypes="ccc" />
  </g>
</svg>
