<?xml version="1.0" encoding="UTF-8" standalone="no"?>
<svg
   height="24"
   width="24"
   version="1.1"
   id="svg32"
   sodipodi:docname="Camera_02_24.svg"
   inkscape:export-filename="Camera_02_24.png"
   inkscape:export-xdpi="96"
   inkscape:export-ydpi="96"
   inkscape:version="1.2.1 (9c6d41e410, 2022-07-14)"
   xmlns:inkscape="http://www.inkscape.org/namespaces/inkscape"
   xmlns:sodipodi="http://sodipodi.sourceforge.net/DTD/sodipodi-0.dtd"
   xmlns="http://www.w3.org/2000/svg"
   xmlns:svg="http://www.w3.org/2000/svg">
  <defs
     id="defs36" />
  <sodipodi:namedview
     id="namedview34"
     pagecolor="#ffffff"
     bordercolor="#666666"
     borderopacity="1.0"
     inkscape:showpageshadow="2"
     inkscape:pageopacity="0.0"
     inkscape:pagecheckerboard="0"
     inkscape:deskcolor="#d1d1d1"
     showgrid="true"
     inkscape:zoom="38.25"
     inkscape:cx="11.986928"
     inkscape:cy="12"
     inkscape:current-layer="svg32">
    <inkscape:grid
       type="xygrid"
       id="grid965" />
  </sodipodi:namedview>
  <linearGradient
     id="a"
     gradientUnits="userSpaceOnUse"
     x1="9"
     x2="8.9844"
     y1="13.774505"
     y2="1.125004">
    <stop
       offset="0"
       stop-color="#ccc"
       id="stop2" />
    <stop
       offset=".75274092"
       stop-color="#ccc"
       id="stop4" />
    <stop
       offset=".77271861"
       stop-color="#e6e6e6"
       id="stop6" />
    <stop
       offset="1"
       stop-color="#fff"
       id="stop8" />
  </linearGradient>
  <radialGradient
     id="b"
     cx="9.00005"
     cy="8.999975"
     gradientUnits="userSpaceOnUse"
     r="2.6923125">
    <stop
       offset="0"
       stop-color="#fff"
       id="stop11" />
    <stop
       offset="1"
       stop-color="#acf"
       id="stop13" />
  </radialGradient>
  <g
     transform="matrix(1.4999813 0 0 1.4999813 0 .500034)"
     id="g30">
    <path
       d="m15.87495 5.625c0-.82235-.66706-1.5-1.4766-1.5h-1.783825l-.40375-1.6367-.0038-.013672c-.087-.2803-.21314-.58705-.4384-.85547-.22527-.26842-.5891-.49414-1.0151-.49414l-3.537925-.000028c-.42025 0-.78553.21139-1.019.48047-.23345.26908-.36584.58815-.4422.89844l-.3999 1.6211h-3.75285c-.8095 0-1.4766.67765-1.4766 1.5v7.375c0 .5.375.875.875.875h14c.5 0 .8752-.375.8752-.875z"
       fill="url(#a)"
       stroke="#808080"
       stroke-width=".25"
       id="path16" />
    <path
       d="m.25 6h15.5v7h-15.5z"
       fill="#808080"
       id="path18" />
    <g
       stroke-linecap="round"
       id="g26">
      <circle
         cx="9"
         cy="9"
         fill="url(#b)"
         r="3.5"
         stroke="#4d4d4d"
         stroke-linejoin="round"
         id="circle20" />
      <path
         d="m2.5 6v6"
         fill="none"
         stroke="#666"
         stroke-width="2"
         id="path22" />
      <path
         d="m13.75 6.5v-.5"
         fill="none"
         stroke="#d40000"
         stroke-width="1.5"
         id="path24" />
    </g>
    <path
       d="m7 2v1.3001489h.2256339v-.5472433h.664083v-.1734712h-.664083v-.4059618h.7853942v-.1734726h-.7853942zm1.2432197 0v1.0587182c0 .078091.023041.1385988.069449.1815198.047145.042921.1136548.064382.1991046.064382h.1326378v-.1734726h-.1061099c-.022102 0-.039343-.00597-.051863-.017884-.011781-.012514-.017884-.030105-.017884-.052757v-1.0605064zm1.1049171.3585696c-.1016563 0-.1886127.016993-.260804.050968-.072193.03398-.1274169.083457-.1657232.1484358-.037569.064977-.056334.143369-.056334.2351721v.1046189c0 .088227.019679.1636371.058718.2262307.039779.061997.097144.1090904.1722806.1412816.07514.032191.1657553.048285.2718332.048285.071456 0 .142397-.011919.2131156-.035767.070716-.024442.1346333-.058719.1913547-.1028315l-.1481362-.1198224c-.035359.026825-.075483.04769-.1204169.062594-.044937.01491-.090246.022354-.1359172.022354-.092081 0-.1633213-.020565-.2134133-.061699-.048293-.039655-.073079-.0961-.074813-.1690011h.7225029v-.060805c0-.1025334-.018151-.1904625-.054246-.2637862-.0353584-.073323-.0869235-.1293588-.1546956-.1681059-.0677703-.0387487-.1495406-.058122-.2453056-.058122zm.637557.013414.3809242.4566323-.3985102.4715345h.2497772l.271832-.3210131.260806.3210126h.249477l-.393741-.4646789.376157-.4634874h-.250673l-.242921.3186289-.252159-.3186289zm-.637557.1511187c.06998 0 .1256621.021161.1669151.063486.041996.041728.066403.1004482.073026.1761554h-.5076003c.00363-.072851.026407-.1302479.068852-.171684.047145-.045305.1133556-.067958.1988072-.067957z"
       id="path28" />
  </g>
</svg>
