<?xml version="1.0" encoding="UTF-8" standalone="no"?>
<svg
   height="22"
   width="22"
   version="1.1"
   id="svg16"
   sodipodi:docname="da_else.svg"
   inkscape:export-filename="da_else.png"
   inkscape:export-xdpi="96"
   inkscape:export-ydpi="96"
   inkscape:version="1.2.1 (9c6d41e410, 2022-07-14)"
   xmlns:inkscape="http://www.inkscape.org/namespaces/inkscape"
   xmlns:sodipodi="http://sodipodi.sourceforge.net/DTD/sodipodi-0.dtd"
   xmlns="http://www.w3.org/2000/svg"
   xmlns:svg="http://www.w3.org/2000/svg">
  <defs
     id="defs20" />
  <sodipodi:namedview
     id="namedview18"
     pagecolor="#ffffff"
     bordercolor="#666666"
     borderopacity="1.0"
     inkscape:showpageshadow="2"
     inkscape:pageopacity="0.0"
     inkscape:pagecheckerboard="0"
     inkscape:deskcolor="#d1d1d1"
     showgrid="true"
     inkscape:zoom="41.727273"
     inkscape:cx="10.988017"
     inkscape:cy="11"
     inkscape:current-layer="svg16">
    <inkscape:grid
       type="xygrid"
       id="grid2016" />
  </sodipodi:namedview>
  <g
     fill="none"
     id="g8">
    <path
       d="m12 6.5h7"
       stroke="#d38d5f"
       id="path2" />
    <path
       d="m12 8.5h7"
       stroke="#d38d5f"
       id="path4" />
    <path
       d="m13 11 5-7"
       stroke="#d38d5f"
       id="path6" />
  </g>
  <path
     d="m6 10h-2c-.00499-.2745227-.00749-.1718099-.00749-.2317058 0-.6189236.1782439-1.1280382.382888-1.5273437s.6139322-.8485243 1.2278645-1.3476562.9807943-.8260634 1.100586-.9807943c.1846788-.2445746.2770182-.5141058.2770182-.8085937 0-.4092882-.1647135-.7586805-.4941406-1.048177-.3244358-.2944879-.7636719-.4417318-1.3177083-.4417318-.5340712 0-.9807943.1522352-1.3401693.4567057s-.6064453.7686632-.7412109 1.3925781l-1.9316376-.2395833c.0549045-.8934462.4342448-1.6521267 1.1380208-2.2760416.7087673-.6239149 1.6371527-.9358724 2.7851562-.9358724 1.2078993 0 2.1687282.3169488 2.8824869.9508463.7137587.6289063 1.070638 1.3626302 1.070638 2.2011719 0 .4641927-.13227.9034288-.3968099 1.3177083-.2595486.4142795-.8185764.9782985-1.6770833 1.6920572-.4442274.3693577-.7212456.6663412-.8310546.8909505-.1048177.2246094-.1373368.3564887-.1273541.9354818zm-2 3v-2h2v2z"
     fill="#f00000"
     id="path10" />
  <path
     d="m20.5 17.5h-3.5c-1.5 0-2.5-.5-2.5-2v-2"
     fill="none"
     stroke="#00aad4"
     stroke-linecap="round"
     stroke-linejoin="round"
     id="path12" />
  <path
     d="m18.5 15.5 2 2-2 2"
     fill="none"
     stroke="#00aad4"
     stroke-linecap="round"
     stroke-linejoin="round"
     id="path14" />
</svg>
