<?xml version="1.0" encoding="UTF-8" standalone="no"?>
<svg
   height="64"
   width="64"
   version="1.1"
   id="svg159"
   sodipodi:docname="Refresh_02_64.svg"
   inkscape:export-filename="Refresh_02_64.png"
   inkscape:export-xdpi="96"
   inkscape:export-ydpi="96"
   inkscape:version="1.2-beta (1b65182ce9, 2022-04-05)"
   xmlns:inkscape="http://www.inkscape.org/namespaces/inkscape"
   xmlns:sodipodi="http://sodipodi.sourceforge.net/DTD/sodipodi-0.dtd"
   xmlns:xlink="http://www.w3.org/1999/xlink"
   xmlns="http://www.w3.org/2000/svg"
   xmlns:svg="http://www.w3.org/2000/svg">
  <defs
     id="defs161" />
  <sodipodi:namedview
     id="namedview12"
     pagecolor="#ffffff"
     bordercolor="#666666"
     borderopacity="1.0"
     inkscape:pageshadow="2"
     inkscape:pageopacity="0.0"
     inkscape:pagecheckerboard="0"
     inkscape:deskcolor="#d1d1d1"
     showgrid="true"
     inkscape:zoom="14.34375"
     inkscape:cx="32"
     inkscape:cy="32"
     inkscape:current-layer="svg159">
    <inkscape:grid
       type="xygrid"
       id="grid139" />
  </sodipodi:namedview>
  <linearGradient
     id="a"
     gradientUnits="userSpaceOnUse"
     x1="24"
     x2="24"
     xlink:href="#c"
     y1="3"
     y2="14" />
  <linearGradient
     id="b"
     gradientTransform="matrix(-2,0,0,-2,32,32)"
     gradientUnits="userSpaceOnUse"
     x1="12"
     x2="12"
     xlink:href="#c"
     y1="1.5"
     y2="7" />
  <linearGradient
     id="c">
    <stop
       offset="0"
       stop-color="#21b2fc"
       id="stop148" />
    <stop
       offset="1"
       stop-color="#97edff"
       id="stop150" />
  </linearGradient>
  <g
     fill-rule="evenodd"
     stroke="#2c5aa0"
     stroke-linejoin="round"
     stroke-width="1.5"
     id="g157"
     transform="matrix(2.0000135,0,0,2.0000135,-2.154061e-4,-1.8442609e-4)">
    <path
       d="m 16,2.5000804 c -2.376849,0 -4.554214,0.8320254 -6.3203124,2.1796876 L 13.25,8.2500804 c 0.809003,-0.4646444 1.738524,-0.75 2.75,-0.75 3.067178,0 5.5,2.4328222 5.5,5.4999996 l -4.5,-3.9e-5 7,7.000001 7,-7.000001 -4.5,3.9e-5 C 26.5,7.2307022 21.769378,2.5000804 16,2.5000804 Z"
       fill="url(#a)"
       id="path153"
       style="fill:url(#a)" />
    <path
       d="m 16,29.49992 c 2.376849,0 4.554214,-0.832026 6.320312,-2.179688 L 18.75,23.74992 c -0.809003,0.464644 -1.738524,0.75 -2.75,0.75 -3.067178,0 -5.5,-2.432822 -5.5,-5.5 l 4.5,3.9e-5 -7,-7.000001 -7,7.000001 4.5,-3.9e-5 c 0,5.769378 4.730622,10.5 10.5,10.5 z"
       fill="url(#b)"
       id="path155"
       style="fill:url(#b)" />
  </g>
</svg>
