<?xml version="1.0" encoding="UTF-8" standalone="no"?>
<svg
   height="16"
   width="16"
   version="1.1"
   id="svg189"
   sodipodi:docname="Window_12_16.svg"
   inkscape:version="1.2.2 (732a01da63, 2022-12-09)"
   xmlns:inkscape="http://www.inkscape.org/namespaces/inkscape"
   xmlns:sodipodi="http://sodipodi.sourceforge.net/DTD/sodipodi-0.dtd"
   xmlns="http://www.w3.org/2000/svg"
   xmlns:svg="http://www.w3.org/2000/svg">
  <defs
     id="defs193" />
  <sodipodi:namedview
     id="namedview191"
     pagecolor="#ffffff"
     bordercolor="#000000"
     borderopacity="0.25"
     inkscape:showpageshadow="2"
     inkscape:pageopacity="0.0"
     inkscape:pagecheckerboard="0"
     inkscape:deskcolor="#d1d1d1"
     showgrid="true"
     inkscape:zoom="56.875"
     inkscape:cx="7.9912088"
     inkscape:cy="8"
     inkscape:current-layer="svg189">
    <inkscape:grid
       type="xygrid"
       id="grid1100" />
  </sodipodi:namedview>
  <rect
     fill="#f5f7ff"
     height="13"
     rx="1.1"
     stroke="#00aad4"
     stroke-linejoin="round"
     width="13"
     x="1.5"
     y="1.5"
     id="rect163" />
  <path
     d="m1.5 1.5h13v2h-13z"
     fill="#00aad4"
     fill-rule="evenodd"
     stroke-width=".999991"
     id="path165" />
  <g
     fill="none"
     stroke="#00aad4"
     id="g187">
    <path
       d="m6.5 3.5v10.5"
       id="path167" />
    <g
       stroke-linecap="round"
       id="g185">
      <path
         d="m3.5 5.5h1"
         id="path169" />
      <path
         d="m3.5 11.5h1"
         id="path171" />
      <path
         d="m3.5 9.5h1"
         id="path173" />
      <path
         d="m3.5 7.5h1"
         id="path175" />
      <path
         d="m8.5 5.5h4"
         id="path177" />
      <path
         d="m8.5 11.5h4"
         id="path179" />
      <path
         d="m8.5 9.5h4"
         id="path181" />
      <path
         d="m8.5 7.5h4"
         id="path183" />
    </g>
  </g>
</svg>
