<?xml version="1.0" encoding="UTF-8" standalone="no"?>
<svg
   width="48"
   height="48"
   version="1.1"
   viewBox="0 0 48 48"
   id="svg27"
   sodipodi:docname="Database_16_48.svg"
   inkscape:export-filename="Database_16_48.png"
   inkscape:export-xdpi="96"
   inkscape:export-ydpi="96"
   inkscape:version="1.3.2 (091e20e, 2023-11-25, custom)"
   xmlns:inkscape="http://www.inkscape.org/namespaces/inkscape"
   xmlns:sodipodi="http://sodipodi.sourceforge.net/DTD/sodipodi-0.dtd"
   xmlns:xlink="http://www.w3.org/1999/xlink"
   xmlns="http://www.w3.org/2000/svg"
   xmlns:svg="http://www.w3.org/2000/svg">
  <defs
     id="defs27" />
  <sodipodi:namedview
     id="namedview27"
     pagecolor="#ffffff"
     bordercolor="#000000"
     borderopacity="0.25"
     inkscape:showpageshadow="2"
     inkscape:pageopacity="0.0"
     inkscape:pagecheckerboard="0"
     inkscape:deskcolor="#d1d1d1"
     showgrid="true"
     inkscape:current-layer="svg27">
    <inkscape:grid
       id="grid27"
       units="px"
       originx="0"
       originy="0"
       spacingx="0.5"
       spacingy="0.5"
       empcolor="#0099e5"
       empopacity="0.30196078"
       color="#0099e5"
       opacity="0.14901961"
       empspacing="2"
       dotted="false"
       gridanglex="30"
       gridanglez="30"
       visible="true" />
  </sodipodi:namedview>
  <linearGradient
     id="a"
     x1="7"
     x2="40"
     y1="15.5"
     y2="15.5"
     gradientUnits="userSpaceOnUse"
     xlink:href="#b" />
  <linearGradient
     id="b">
    <stop
       stop-color="#2de3e3"
       offset="0"
       id="stop1" />
    <stop
       stop-color="#71ffff"
       offset=".23818764"
       id="stop2" />
    <stop
       stop-color="#08b9b9"
       offset=".48656252"
       id="stop3" />
    <stop
       stop-color="#08cfcf"
       offset=".6837101"
       id="stop4" />
    <stop
       stop-color="#079a9a"
       offset=".86378187"
       id="stop5" />
    <stop
       stop-color="#07cccc"
       offset="1"
       id="stop6" />
  </linearGradient>
  <linearGradient
     id="c"
     x1="7"
     x2="40"
     y1="24.5"
     y2="24.5"
     gradientUnits="userSpaceOnUse"
     xlink:href="#b" />
  <linearGradient
     id="d"
     x1="7"
     x2="40"
     y1="30.868757"
     y2="30.868757"
     gradientUnits="userSpaceOnUse"
     xlink:href="#e" />
  <linearGradient
     id="e">
    <stop
       stop-color="#999999"
       offset="0"
       id="stop7" />
    <stop
       stop-color="#f8f8f8"
       offset=".23818764"
       id="stop8" />
    <stop
       stop-color="#868684"
       offset=".48656252"
       id="stop9" />
    <stop
       stop-color="#b2b2b2"
       offset=".6837101"
       id="stop10" />
    <stop
       stop-color="#4f4f4f"
       offset=".86378187"
       id="stop11" />
    <stop
       stop-color="#858585"
       offset="1"
       id="stop12" />
  </linearGradient>
  <linearGradient
     id="f"
     x1="7"
     x2="40"
     y1="39.868757"
     y2="39.868757"
     gradientUnits="userSpaceOnUse"
     xlink:href="#e" />
  <linearGradient
     id="g"
     x1="7"
     x2="40"
     y1="33.5"
     y2="33.5"
     gradientUnits="userSpaceOnUse"
     xlink:href="#b" />
  <linearGradient
     id="h"
     x1="7"
     x2="40"
     y1="35"
     y2="35"
     gradientUnits="userSpaceOnUse"
     xlink:href="#i" />
  <linearGradient
     id="i">
    <stop
       stop-color="#9d9d9d"
       offset="0"
       id="stop13" />
    <stop
       stop-color="#808080"
       offset="1"
       id="stop14" />
  </linearGradient>
  <linearGradient
     id="j"
     x1="7"
     x2="40"
     y1="21.868757"
     y2="21.868757"
     gradientUnits="userSpaceOnUse"
     xlink:href="#e" />
  <linearGradient
     id="k"
     x1="7"
     x2="40"
     y1="26"
     y2="26"
     gradientUnits="userSpaceOnUse"
     xlink:href="#i" />
  <linearGradient
     id="l"
     x1="7"
     x2="40"
     y1="12.868757"
     y2="12.868757"
     gradientUnits="userSpaceOnUse"
     xlink:href="#e" />
  <linearGradient
     id="m"
     x1="7"
     x2="40"
     y1="8"
     y2="8"
     gradientUnits="userSpaceOnUse">
    <stop
       stop-color="#b0b0b0"
       offset="0"
       id="stop15" />
    <stop
       stop-color="#cbcbcb"
       offset="1"
       id="stop16" />
  </linearGradient>
  <linearGradient
     id="n"
     x1="17.5"
     x2="22"
     y1="20"
     y2="14"
     gradientUnits="userSpaceOnUse"
     xlink:href="#i" />
  <ellipse
     cx="23.5"
     cy="17"
     rx="16.5"
     ry="3"
     fill="url(#n)"
     stroke-width=".999994"
     id="ellipse16" />
  <ellipse
     cx="23.5"
     cy="8"
     rx="16.5"
     ry="3"
     fill="url(#m)"
     stroke-width=".999994"
     id="ellipse17" />
  <path
     d="m23.5 15.5c-9.112697 0-16.5-1.343145-16.5-3v-4.5c0 1.656855 7.387303 3 16.5 3 9.1127 0 16.5-1.343145 16.5-3v4.5c0 1.656855-7.3873 3-16.5 3z"
     fill="url(#l)"
     stroke-linecap="round"
     stroke-width=".099999"
     id="path17" />
  <ellipse
     cx="23.5"
     cy="26"
     rx="16.5"
     ry="3"
     fill="url(#k)"
     stroke-width=".999994"
     id="ellipse18" />
  <path
     d="m23.5 24.5c-9.1127 0-16.5-1.343145-16.5-3v-4.5c0 1.656855 7.387303 3 16.5 3 9.1127 0 16.5-1.343145 16.5-3v4.5c-3e-6 1.656855-7.3873 3-16.5 3z"
     fill="url(#j)"
     stroke-linecap="round"
     stroke-width=".099999"
     id="path18" />
  <ellipse
     cx="23.5"
     cy="35"
     rx="16.5"
     ry="3"
     fill="url(#h)"
     stroke-width=".999994"
     id="ellipse19" />
  <path
     d="m8.5000013 31.742189v3c2.9999997 1.73205 8.9999997 2.057811 14.999999 2.057811 6.000002 0 12.000002-0.3 15.000002-2.057811v-3c-2.602466 1.034829-8.332624 1.757811-15.000002 1.757811-6.667375 0-12.397536-0.722982-14.999999-1.757811z"
     fill="url(#g)"
     stroke-linecap="round"
     stroke-width=".099999"
     id="path19" />
  <path
     d="m23.5 42.5c-9.1127 0-16.5-1.343145-16.5-3v-4.5c0 1.656855 7.387303 3 16.5 3 9.1127 0 16.5-1.343145 16.5-3v4.5c-3e-6 1.656855-7.3873 3-16.5 3z"
     fill="url(#f)"
     stroke-linecap="round"
     stroke-width=".099999"
     id="path20" />
  <path
     d="m23.5 33.5c-9.1127 0-16.5-1.343145-16.5-3v-4.5c0 1.656855 7.387303 3 16.5 3 9.1127 0 16.5-1.343145 16.5-3v4.5c-3e-6 1.656855-7.3873 3-16.5 3z"
     fill="url(#d)"
     stroke-linecap="round"
     stroke-width=".099999"
     id="path21" />
  <path
     d="m23.5 11.480012c-16.5 0-16.5-3.480012-16.5-3.480012s0 2.699988 16.5 2.699988 16.5-2.699988 16.5-2.699988 0 3.480012-16.5 3.480012z"
     fill="#e6e6e6"
     stroke-linecap="round"
     stroke-width=".099999"
     id="path22" />
  <path
     d="m23.5 38.480012c-16.5 0-16.5-3.480012-16.5-3.480012s0 2.699985 16.5 2.699985 16.5-2.699985 16.5-2.699985 0 3.480012-16.5 3.480012z"
     fill="#e6e6e6"
     stroke-linecap="round"
     stroke-width=".099999"
     id="path23" />
  <path
     d="m23.5 29.480012c-16.5 0-16.5-3.480012-16.5-3.480012s0 2.699988 16.5 2.699988 16.5-2.699988 16.5-2.699988 0 3.480012-16.5 3.480012z"
     fill="#e6e6e6"
     stroke-linecap="round"
     stroke-width=".099999"
     id="path24" />
  <path
     d="m23.5 20.480012c-16.5 0-16.5-3.480012-16.5-3.480012s0 2.699988 16.5 2.699988 16.5-2.699988 16.5-2.699988 0 3.480012-16.5 3.480012z"
     fill="#e6e6e6"
     stroke-linecap="round"
     stroke-width=".099999"
     id="path25" />
  <path
     d="m8.5000013 22.742189v3c2.9999997 1.73205 8.9999997 2.057811 14.999999 2.057811 6.000002 0 12.000002-0.3 15.000002-2.057811v-3c-2.602466 1.034829-8.332624 1.757811-15.000002 1.757811-6.667375 0-12.397536-0.722982-14.999999-1.757811z"
     fill="url(#c)"
     stroke-linecap="round"
     stroke-width=".099999"
     id="path26" />
  <path
     d="m8.5000013 13.742189v3c2.9999997 1.73205 8.9999997 2.057811 14.999999 2.057811 6.000002 0 12.000002-0.3 15.000002-2.057811v-3c-2.602466 1.034829-8.332624 1.757811-15.000002 1.757811-6.667375 0-12.397536-0.722982-14.999999-1.757811z"
     fill="url(#a)"
     stroke-linecap="round"
     stroke-width=".099999"
     id="path27" />
</svg>
