<?xml version="1.0" encoding="UTF-8" standalone="no"?>
<svg
   height="32"
   width="32"
   version="1.1"
   id="svg329"
   sodipodi:docname="Refresh_01_32.svg"
   inkscape:export-filename="Refresh_01_32.png"
   inkscape:export-xdpi="96"
   inkscape:export-ydpi="96"
   inkscape:version="1.2-beta (1b65182ce9, 2022-04-05)"
   xmlns:inkscape="http://www.inkscape.org/namespaces/inkscape"
   xmlns:sodipodi="http://sodipodi.sourceforge.net/DTD/sodipodi-0.dtd"
   xmlns:xlink="http://www.w3.org/1999/xlink"
   xmlns="http://www.w3.org/2000/svg"
   xmlns:svg="http://www.w3.org/2000/svg">
  <defs
     id="defs333" />
  <sodipodi:namedview
     id="namedview331"
     pagecolor="#ffffff"
     bordercolor="#666666"
     borderopacity="1.0"
     inkscape:pageshadow="2"
     inkscape:pageopacity="0.0"
     inkscape:pagecheckerboard="0"
     inkscape:deskcolor="#d1d1d1"
     showgrid="true"
     inkscape:zoom="28.6875"
     inkscape:cx="15.982571"
     inkscape:cy="16"
     inkscape:current-layer="svg329">
    <inkscape:grid
       type="xygrid"
       id="grid1504" />
  </sodipodi:namedview>
  <linearGradient
     id="a">
    <stop
       offset="0"
       stop-color="#80b3ff"
       id="stop316" />
    <stop
       offset="1"
       stop-color="#d5e5ff"
       id="stop318" />
  </linearGradient>
  <linearGradient
     id="b"
     gradientTransform="matrix(-2.0769231 0 0 -2.0685415 32.615385 33.014061)"
     gradientUnits="userSpaceOnUse"
     x1="10"
     x2="9"
     xlink:href="#a"
     y1="7"
     y2="2" />
  <linearGradient
     id="c"
     gradientTransform="matrix(2.0769231 0 0 2.0685415 -.615385 -1.014061)"
     gradientUnits="userSpaceOnUse"
     x1="10"
     x2="9"
     xlink:href="#a"
     y1="7"
     y2="2" />
  <g
     fill-rule="evenodd"
     stroke="#3566a4"
     stroke-linejoin="round"
     stroke-opacity=".988235"
     id="g327">
    <path
       d="m29.5 20.602812c-5.392109 4.764043-11.717355 5.994566-19 .897188l4-4h-12v12l4-4c5.847756 5.172382 16.443526 7.129493 23-4.897188z"
       fill="url(#b)"
       id="path323" />
    <path
       d="m2.5000003 11.397188c5.392109-4.764043 11.7173547-5.994566 18.9999997-.897188l-4 4h12v-12l-4 4c-5.847756-5.172382-16.4435257-7.129493-22.9999997 4.897188z"
       fill="url(#c)"
       id="path325" />
  </g>
</svg>
