<?xml version="1.0" encoding="UTF-8" standalone="no"?>
<svg
   width="48"
   height="48"
   version="1.1"
   viewBox="0 0 48 48"
   id="svg13"
   sodipodi:docname="tsynbatsyn_200.svg"
   inkscape:version="1.3.2 (091e20e, 2023-11-25, custom)"
   xmlns:inkscape="http://www.inkscape.org/namespaces/inkscape"
   xmlns:sodipodi="http://sodipodi.sourceforge.net/DTD/sodipodi-0.dtd"
   xmlns="http://www.w3.org/2000/svg"
   xmlns:svg="http://www.w3.org/2000/svg">
  <defs
     id="defs13" />
  <sodipodi:namedview
     id="namedview13"
     pagecolor="#ffffff"
     bordercolor="#000000"
     borderopacity="0.25"
     inkscape:showpageshadow="2"
     inkscape:pageopacity="0.0"
     inkscape:pagecheckerboard="0"
     inkscape:deskcolor="#d1d1d1"
     showgrid="true"
     inkscape:current-layer="svg13">
    <inkscape:grid
       id="grid13"
       units="px"
       originx="0"
       originy="0"
       spacingx="0.5"
       spacingy="0.5"
       empcolor="#0099e5"
       empopacity="0.30196078"
       color="#0099e5"
       opacity="0.14901961"
       empspacing="2"
       dotted="false"
       gridanglex="30"
       gridanglez="30"
       visible="true" />
  </sodipodi:namedview>
  <rect
     x="2.4999995"
     y="2.4999826"
     width="41"
     height="43"
     fill="#ffffff"
     fill-rule="evenodd"
     stroke="#2a7efe"
     stroke-linecap="square"
     stroke-linejoin="round"
     stroke-width="0.999999"
     style="paint-order:normal"
     id="rect1" />
  <rect
     x="3"
     y="2.9999826"
     width="7"
     height="42.000019"
     fill="#b3b3b3"
     fill-rule="evenodd"
     style="paint-order:normal"
     id="rect2" />
  <path
     d="M 14,9 H 36"
     stroke="#666666"
     stroke-width="2px"
     id="path2"
     style="fill:none" />
  <path
     d="m 18,13 h 8"
     stroke="#666666"
     stroke-width="2px"
     id="path3"
     style="fill:none" />
  <path
     d="M 22,17 H 34"
     stroke="#666666"
     stroke-width="2px"
     id="path4"
     style="fill:none" />
  <path
     d="m 18,21 h 4"
     stroke="#666666"
     stroke-width="2px"
     id="path5"
     style="fill:none" />
  <path
     d="M 14.000001,25 H 22"
     stroke="#666666"
     stroke-width="2px"
     id="path6"
     style="fill:none" />
  <path
     d="m 28,13 h 6"
     stroke="#ff0000"
     stroke-width="2px"
     id="path7"
     style="fill:none" />
  <path
     d="M 24,24.9998 H 36"
     stroke="#ff0000"
     stroke-width="2px"
     id="path8"
     style="fill:none" />
  <path
     d="m 22,21 h 6"
     stroke="#2a7fff"
     stroke-width="2px"
     id="path9"
     style="fill:none" />
  <path
     d="m 28,21 h 4"
     stroke="#666666"
     stroke-width="2px"
     id="path10"
     style="fill:none" />
  <path
     d="m 25.507164,38.5057 h 4.98567 m -6.305241,2.6939 3.812406,-10.3998 3.812408,10.3998"
     fill="none"
     stroke="#2c5aa0"
     stroke-linecap="round"
     stroke-linejoin="round"
     stroke-width="1.6"
     id="path11" />
  <path
     d="m 14.8,41.1998 h 4.191078 c 3.681139,0 3.038145,-5.3252 -0.249906,-5.3252 M 14.8,41.1998 V 30.8 h 3.941172 c 3.291436,0 3.038142,5.0746 0,5.0746 H 14.8"
     fill="none"
     stroke="#2c5aa0"
     stroke-linecap="round"
     stroke-linejoin="round"
     stroke-width="1.6"
     id="path12" />
  <path
     d="M 35.79993,41.2 V 30.8002 m -3.67693,0 h 7.35386"
     fill="none"
     stroke="#2c5aa0"
     stroke-linecap="round"
     stroke-linejoin="round"
     stroke-width="1.6"
     id="path13" />
</svg>
