<?xml version="1.0" encoding="UTF-8" standalone="no"?>
<svg
   height="16"
   width="16"
   version="1.1"
   id="svg3"
   sodipodi:docname="Layer_02_16.svg"
   inkscape:export-filename="Layer_02_16.png"
   inkscape:export-xdpi="96"
   inkscape:export-ydpi="96"
   inkscape:version="1.3.2 (091e20e, 2023-11-25, custom)"
   xmlns:inkscape="http://www.inkscape.org/namespaces/inkscape"
   xmlns:sodipodi="http://sodipodi.sourceforge.net/DTD/sodipodi-0.dtd"
   xmlns="http://www.w3.org/2000/svg"
   xmlns:svg="http://www.w3.org/2000/svg">
  <defs
     id="defs3" />
  <sodipodi:namedview
     id="namedview3"
     pagecolor="#ffffff"
     bordercolor="#000000"
     borderopacity="0.25"
     inkscape:showpageshadow="2"
     inkscape:pageopacity="0.0"
     inkscape:pagecheckerboard="0"
     inkscape:deskcolor="#d1d1d1"
     showgrid="true"
     inkscape:current-layer="svg3">
    <inkscape:grid
       id="grid3"
       units="px"
       originx="0"
       originy="0"
       spacingx="0.5"
       spacingy="0.5"
       empcolor="#0099e5"
       empopacity="0.30196078"
       color="#0099e5"
       opacity="0.14901961"
       empspacing="2"
       dotted="false"
       gridanglex="30"
       gridanglez="30"
       visible="true" />
  </sodipodi:namedview>
  <path
     d="m11.374999 10.625-3.3750001 1.125-3.3749995-1.125-4.1249994 1.375 7.5 2.5 7.5-2.5z"
     fill="#2a7efe"
     stroke-linecap="round"
     stroke-linejoin="round"
     id="path1" />
  <path
     d="m.5 4 7.5-2.5 7.5 2.5-7.5 2.5z"
     fill="#2a7efe"
     id="path2" />
  <path
     d="m11.374999 6.6249998-3.3750001 1.1250002-3.3749995-1.1249998-4.1249994 1.3749998 7.5 2.5 7.5-2.5z"
     fill="#ff7f00"
     stroke-linecap="round"
     stroke-linejoin="round"
     id="path3" />
</svg>
