<?xml version="1.0" encoding="UTF-8" standalone="no"?>
<svg
   height="24"
   width="24"
   version="1.1"
   id="svg143"
   sodipodi:docname="Folder_07_24.svg"
   inkscape:export-filename="Folder_07_24.png"
   inkscape:export-xdpi="96"
   inkscape:export-ydpi="96"
   inkscape:version="1.2 (dc2aedaf03, 2022-05-15)"
   xml:space="preserve"
   xmlns:inkscape="http://www.inkscape.org/namespaces/inkscape"
   xmlns:sodipodi="http://sodipodi.sourceforge.net/DTD/sodipodi-0.dtd"
   xmlns="http://www.w3.org/2000/svg"
   xmlns:svg="http://www.w3.org/2000/svg"><defs
     id="defs147" /><sodipodi:namedview
     id="namedview145"
     pagecolor="#ffffff"
     bordercolor="#666666"
     borderopacity="1.0"
     inkscape:pageshadow="2"
     inkscape:pageopacity="0.0"
     inkscape:pagecheckerboard="0"
     inkscape:deskcolor="#d1d1d1"
     showgrid="true"
     inkscape:zoom="38.25"
     inkscape:cx="12"
     inkscape:cy="12"
     inkscape:current-layer="svg143"
     inkscape:showpageshadow="2"
     showguides="true"><inkscape:grid
       type="xygrid"
       id="grid784" /></sodipodi:namedview><g
     id="g2330"
     transform="translate(0,-1)"><path
       d="M 2.250267,9.7499999 2.25,5.75 c 0,-1.25 0.750133,-2 2.000133,-2 h 3.7499339 c 1.5000004,0 2.0000001,0.75 2.0000001,2 h 11.75 v 3.9999999"
       id="path8-5"
       style="fill:#fff3cc;fill-opacity:1;stroke:#f4c025;stroke-width:1.5;stroke-linecap:round;stroke-linejoin:round;stroke-opacity:1"
       sodipodi:nodetypes="ccccccc" /><path
       d="M 23.250007,9.7499998 H 0.74999294 L 2.25,22.249926 l 19.500067,1.47e-4 z"
       id="path139"
       style="fill:#f4c025;fill-opacity:1;stroke:#f4c025;stroke-width:1.5;stroke-linejoin:round;stroke-opacity:1"
       sodipodi:nodetypes="ccccc" /></g></svg>
