<?xml version="1.0" encoding="UTF-8" standalone="no"?>
<svg
   height="32"
   width="32"
   version="1.1"
   id="svg18"
   sodipodi:docname="Font_06_32.svg"
   inkscape:export-filename="Font_06_32.png"
   inkscape:export-xdpi="96"
   inkscape:export-ydpi="96"
   inkscape:version="1.2 (dc2aedaf03, 2022-05-15)"
   xmlns:inkscape="http://www.inkscape.org/namespaces/inkscape"
   xmlns:sodipodi="http://sodipodi.sourceforge.net/DTD/sodipodi-0.dtd"
   xmlns="http://www.w3.org/2000/svg"
   xmlns:svg="http://www.w3.org/2000/svg">
  <defs
     id="defs22" />
  <sodipodi:namedview
     id="namedview20"
     pagecolor="#ffffff"
     bordercolor="#666666"
     borderopacity="1.0"
     inkscape:pageshadow="2"
     inkscape:pageopacity="0.0"
     inkscape:pagecheckerboard="0"
     inkscape:deskcolor="#d1d1d1"
     showgrid="true"
     inkscape:zoom="28.6875"
     inkscape:cx="16"
     inkscape:cy="16"
     inkscape:current-layer="svg18"
     inkscape:showpageshadow="2">
    <inkscape:grid
       type="xygrid"
       id="grid1022" />
  </sodipodi:namedview>
  <path
     id="path2-6"
     style="fill:#00aad4;stroke:none;stroke-width:7.54035"
     d="M 11.964939,1.4998681 1.5,30.500132 H 4.1758056 L 7.0859883,22.472715 C 7.1781393,22.209908 7.42687,22.033137 7.7070875,22.031309 l 4.8239765,-2e-6 0.683648,-2.464869 H 9.0664792 C 8.6095872,19.564654 8.2917059,19.114822 8.4453755,18.687524 L 12.879009,6.3006928 c 0.09215,-0.26281 0.340887,-0.439582 0.621103,-0.44141 0.280217,0.0018 0.52895,0.178602 0.621096,0.44141 L 17.01301,14.300612 19.24,13.153818 15.035279,1.4998681 Z"
     sodipodi:nodetypes="cccccccccccccccc" />
  <g
     id="g1474"
     transform="matrix(2,0,0,2,0,-2)"
     style="fill:none;stroke:#00aad4;stroke-opacity:1">
    <circle
       style="fill:none;stroke:#00aad4;stroke-width:1;stroke-linecap:round;stroke-linejoin:round;stroke-dasharray:none;stroke-dashoffset:1.49998;stroke-opacity:1"
       id="path346"
       cx="11.5"
       cy="12.5"
       r="4" />
    <path
       style="fill:none;stroke:#00aad4;stroke-width:1px;stroke-linecap:round;stroke-linejoin:round;stroke-opacity:1"
       d="m 9.75,12.25 1.75,-1.75 1.75,1.75"
       id="path1053"
       sodipodi:nodetypes="ccc" />
    <path
       style="fill:none;stroke:#00aad4;stroke-width:1px;stroke-linecap:round;stroke-linejoin:miter;stroke-opacity:1"
       d="m 11.5,11 v 3.5"
       id="path1469"
       sodipodi:nodetypes="cc" />
  </g>
</svg>
