<?xml version="1.0" encoding="UTF-8" standalone="no"?>
<svg
   width="36"
   height="36"
   clip-rule="evenodd"
   fill-rule="evenodd"
   image-rendering="optimizeQuality"
   shape-rendering="geometricPrecision"
   text-rendering="geometricPrecision"
   version="1.1"
   viewBox="0 0 1038.7078 1038.7078"
   id="svg17"
   sodipodi:docname="tsessionjsonrpcdispatcher_150.svg"
   inkscape:export-filename="tsessionjsonrpcdispatcher_150.png"
   inkscape:export-xdpi="96"
   inkscape:export-ydpi="96"
   inkscape:version="1.3.2 (091e20e, 2023-11-25, custom)"
   xmlns:inkscape="http://www.inkscape.org/namespaces/inkscape"
   xmlns:sodipodi="http://sodipodi.sourceforge.net/DTD/sodipodi-0.dtd"
   xmlns="http://www.w3.org/2000/svg"
   xmlns:svg="http://www.w3.org/2000/svg">
  <defs
     id="defs17" />
  <sodipodi:namedview
     id="namedview17"
     pagecolor="#ffffff"
     bordercolor="#000000"
     borderopacity="0.25"
     inkscape:showpageshadow="2"
     inkscape:pageopacity="0.0"
     inkscape:pagecheckerboard="0"
     inkscape:deskcolor="#d1d1d1"
     showgrid="true"
     inkscape:current-layer="svg17">
    <inkscape:grid
       id="grid17"
       units="px"
       originx="0"
       originy="0"
       spacingx="14.426497"
       spacingy="14.426497"
       empcolor="#0099e5"
       empopacity="0.30196078"
       color="#0099e5"
       opacity="0.14901961"
       empspacing="2"
       dotted="false"
       gridanglex="30"
       gridanglez="30"
       visible="true" />
  </sodipodi:namedview>
  <rect
     x="21.639759"
     y="21.639759"
     width="995.42828"
     height="995.42828"
     rx="86.558983"
     fill="#fff"
     stroke="#b3b3b3"
     stroke-dashoffset="1.49998"
     stroke-linecap="round"
     stroke-linejoin="round"
     stroke-width="43.2795"
     id="rect1" />
  <g
     transform="matrix(1.2058461 0 0 1.2058461 90.589495 -36.37336)"
     clip-rule="evenodd"
     fill="#e31e24"
     fill-rule="nonzero"
     image-rendering="optimizeQuality"
     shape-rendering="geometricPrecision"
     id="g4">
    <path
       d="m139.58046 461.65h28.755v89.967c0 11.766-1.0247 20.823-3.1066 27.17-2.776 8.2625-7.7999 14.907-15.105 19.931-7.2717 4.9911-16.889 7.503-28.854 7.503-14.014 0-24.789-3.8999-32.324-11.734-7.5696-7.8325-11.37-19.335-11.437-34.473l27.17-3.1732c.33066 8.0977 1.4873 13.816 3.5365 17.155 3.0739 5.0893 7.7344 7.635 14.014 7.635 6.3124 0 10.808-1.8179 13.419-5.4865 2.6112-3.637 3.9326-11.205 3.9326-22.707v-91.785z"
       id="path1" />
    <path
       d="m199.03 557.63 27.962-2.776c1.6858 9.3537 5.0577 16.195 10.181 20.592 5.1231 4.3964 12.03 6.5777 20.724 6.5777 9.1889 0 16.13-1.95 20.789-5.8499 4.6605-3.8999 7.0077-8.4611 7.0077-13.684 0-3.3718-.99196-6.2144-2.9419-8.5942-1.95-2.346-5.3872-4.3953-10.279-6.115-3.3379-1.1905-10.94-3.2386-22.839-6.2143-15.303-3.8333-26.046-8.5277-32.225-14.113-8.6935-7.8325-13.023-17.385-13.023-28.657 0-7.2378 2.0503-14.047 6.115-20.359 4.0996-6.3125 9.9822-11.106 17.683-14.41 7.7017-3.3052 16.956-4.9584 27.862-4.9584 17.748 0 31.136 3.9338 40.093 11.833 8.9903 7.8991 13.683 18.409 14.147 31.598l-28.755.99189c-1.2232-7.3371-3.8344-12.593-7.8336-15.798-3.9992-3.207-10.015-4.8252-18.013-4.8252-8.2624 0-14.741 1.7186-19.401 5.1559-3.0072 2.2151-4.5284 5.157-4.5284 8.8583 0 3.3707 1.4218 6.2471 4.2632 8.627 3.6032 3.0739 12.362 6.2471 26.276 9.5512 13.915 3.2725 24.194 6.7097 30.838 10.214 6.677 3.5365 11.898 8.3279 15.667 14.443 3.7679 6.115 5.6524 13.651 5.6524 22.608 0 8.1304-2.2478 15.765-6.7752 22.871-4.5285 7.107-10.908 12.395-19.171 15.832-8.2624 3.47-18.575 5.1897-30.904 5.1897-17.947 0-31.73-4.1324-41.348-12.428-9.6178-8.2625-15.336-20.327-17.22-36.159z"
       id="path2" />
    <path
       d="m335.79 533.5c0-14.477 2.1814-26.64 6.5112-36.489 3.207-7.2378 7.635-13.749 13.221-19.501 5.5858-5.7505 11.701-10.015 18.343-12.824 8.8584-3.7352 19.072-5.6197 30.64-5.6197 20.955 0 37.679 6.5111 50.272 19.501 12.56 13.023 18.839 31.102 18.839 54.271 0 22.972-6.247 40.951-18.707 53.908-12.461 12.99-29.152 19.468-50.008 19.468-21.121 0-37.944-6.4457-50.405-19.369-12.46-12.89-18.707-30.672-18.707-53.346zm29.548-.95804c0 16.096 3.7352 28.292 11.173 36.623 7.4364 8.2952 16.889 12.46 28.325 12.46 11.47 0 20.856-4.1324 28.226-12.361 7.3372-8.2625 11.007-20.626 11.007-37.118 0-16.295-3.5704-28.458-10.742-36.457-7.1397-8.0323-16.625-12.031-28.491-12.031-11.833 0-21.385 4.0658-28.624 12.164-7.2378 8.1316-10.874 20.361-10.874 36.721z"
       id="path3" />
    <path
       d="m586.76865 603.61058-57.54163-93.33561v93.33561h-26.57269v-141.98658h27.82973l58.43307 95.15233v-95.15233h26.57269v141.98658z"
       stroke-width=".11284"
       id="path4" />
  </g>
  <path
     d="m187.54446 260.569c9.01278-.22465 16.35399-2.48039 22.02399-6.88019 5.67002-4.34181 9.48939-10.32 11.34002-17.877 1.85058-7.6132 2.86509-20.584 2.98449-38.96801.0601-18.38399.35828-30.50898.89517-36.37399 1.07369-9.24889 2.98449-16.63501 5.84958-22.27401 2.80481-5.5831 6.32621-10.095 10.505-13.47801 4.17771-3.3273 9.54852-5.9226 16.054-7.6701 4.41651-1.07149 11.578-1.63571 21.60502-1.63571h9.72821v26.05402h-5.37201c-11.99601 0-19.93401 2.08599-23.87301 6.2032-3.87971 4.1161-5.84959 13.30801-5.84959 27.63302 0 28.81698-.6563 47.03199-1.96892 54.64498-2.08939 11.786-5.7291 20.86502-10.80298 27.23701-5.13312 6.37301-13.13001 12.06901-24.11202 16.97501 12.951 5.07581 22.32199 12.801 28.17102 23.177 5.7883 10.37601 8.71261 27.40699 8.71261 51.036 0 21.42999.1194 34.173.35826 38.235.9543 7.5003 3.28251 12.68899 7.04169 15.67802 3.82051 2.98878 11.22201 4.45566 22.26202 4.45566h5.43221v26.05402h-9.78851c-11.39901 0-19.696-.90272-24.82801-2.6513-7.40109-2.5374-13.608-6.5976-18.50102-12.29401-4.8942-5.63899-8.05739-12.801-9.49048-21.48498-1.49234-8.68461-2.26801-22.952-2.38632-42.74601-.1194-19.794-1.134-33.497-2.98451-41.05501-1.85049-7.6132-5.55157-13.591-11.161-17.989-5.66988-4.3988-12.89099-6.7104-21.84398-6.9361v-27.06898z"
     clip-rule="evenodd"
     fill="#1f1b20"
     fill-rule="nonzero"
     image-rendering="optimizeQuality"
     shape-rendering="geometricPrecision"
     stroke-width=".1065"
     id="path5" />
  <path
     d="m851.16331 260.56901c-9.01278-.22465-16.354-2.4804-22.024-6.88019-5.66999-4.34181-9.48939-10.32001-11.34-17.87701-1.85061-7.61318-2.86511-20.58401-2.98447-38.96802-.0602-18.384-.35831-30.50899-.89516-36.374-1.07373-9.24889-2.98452-16.635-5.84963-22.27401-2.80488-5.5831-6.32618-10.095-10.50499-13.47799-4.1777-3.32731-9.54861-5.9226-16.05399-7.67011-4.41651-1.07149-11.57801-1.6357-21.60501-1.6357h-9.7282v26.05402h5.3719c11.99601 0 19.93401 2.08599 23.873 6.20319 3.8797 4.1161 5.8496 13.30802 5.8496 27.63304 0 28.81699.65632 47.03197 1.96891 54.64498 2.08937 11.78599 5.72908 20.86502 10.80301 27.237 5.1331 6.37299 13.12999 12.06899 24.11199 16.97501-12.95102 5.07579-22.32201 12.801-28.17101 23.177-5.78832 10.37599-8.7126 27.40699-8.7126 51.03599 0 21.43-.1194 34.173-.35827 38.235-.9543 7.5003-3.2826 12.689-7.04169 15.67801-3.82052 2.98879-11.22201 4.45569-22.26203 4.45569h-5.4322v26.05401h9.78852c11.39899 0 19.696-.90272 24.828-2.65132 7.4011-2.53739 13.60801-6.59759 18.50101-12.29398 4.8942-5.63901 8.0574-12.80102 9.4905-21.485 1.49231-8.68461 2.26802-22.95199 2.38629-42.74599.1194-19.794 1.13402-33.49702 2.98452-41.05502 1.8506-7.61322 5.55161-13.59099 11.16099-17.98901 5.67002-4.39881 12.89102-6.71038 21.84402-6.93608v-27.06901z"
     clip-rule="evenodd"
     fill="#1f1b20"
     fill-rule="nonzero"
     image-rendering="optimizeQuality"
     shape-rendering="geometricPrecision"
     stroke-width=".106501"
     id="path6" />
  <path
     d="m450.3082 923.29585h-33.56122l-27.64575-46.35795q-3.74244-6.39837-7.36416-10.86516-3.50099-4.58751-7.24341-7.48487-3.62172-2.89738-7.96779-4.22533-4.34606-1.32796-9.77862-1.32796h-11.5895v70.26127h-28.61155v-173.11799h56.98167q12.19309 0 22.45462 2.89739 10.2615 2.89735 17.86713 8.81285 7.60559 5.79473 11.83092 14.60756 4.34607 8.69213 4.34607 20.40233 0 9.17502-2.77666 16.90134-2.65592 7.60561-7.72632 13.64179-4.94969 5.91546-12.07238 10.14081-7.002 4.22534-15.81483 6.51908v.48288q4.70823 2.65594 8.20922 5.91547 3.501 3.13883 6.63982 6.51911 3.13881 3.38025 6.15692 7.72632 3.13881 4.22533 6.88125 9.89935zm-105.15045-149.81828v56.25731h23.90333q6.63981 0 12.19309-2.0523 5.67402-2.0523 9.77864-5.91548 4.1046-3.86316 6.39837-9.41644 2.29374-5.55332 2.29374-12.43457 0-12.43456-7.84704-19.43653-7.84706-7.00199-22.57535-7.00199z"
     fill="#04a"
     stroke-width="46.3579"
     id="path7" />
  <path
     d="m518.27572 860.51945v62.7764h-28.61155v-173.11799h52.51485q29.81878 0 46.23723 13.88325 16.41843 13.88325 16.41843 39.11451 0 25.23129-17.14278 41.28756-17.14277 16.05627-46.35795 16.05627zm0-86.6797v63.25929h18.59147q18.47074 0 28.12865-8.57139 9.6579-8.57141 9.6579-24.14478 0-30.54312-35.49281-30.54312z"
     fill="#04a"
     stroke-width="46.3579"
     id="path8" />
  <path
     d="m762.8733 913.48375q-18.92382 9.81237-47.07593 9.81237-36.4459 0-58.40688-23.01233-21.96099-23.01231-21.96099-60.3927 0-40.18393 24.6477-64.94844 24.76452-24.76452 62.49536-24.76452 24.29725 0 40.30074 6.89202v27.56805q-16.938-10.04598-37.38039-10.04598-27.2176 0-44.1556 17.40525-16.82117 17.40524-16.82117 46.49186 0 27.68484 15.76985 44.15559 15.76984 16.35393 41.46888 16.35393 23.71318 0 41.11843-11.21412z"
     fill="#04a"
     stroke-width="44.8566"
     id="path9" />
  <g
     fill="none"
     id="g17">
    <path
       d="m346.23594 137.05172h346.23595"
       stroke="#666"
       stroke-width="43.2795"
       id="path10" />
    <path
       d="m346.23594 223.61071h346.23595"
       stroke="#666"
       stroke-width="43.2795"
       id="path11" />
    <path
       d="m692.47189 310.1697h-346.23595"
       stroke="#666"
       stroke-width="43.2795"
       id="path12" />
    <path
       d="m692.47189 396.72868h-346.23595"
       stroke="#666"
       stroke-width="43.2795"
       id="path13" />
    <path
       d="m519.35374 201.97121v216.39744"
       stroke="#fff"
       stroke-linecap="round"
       stroke-width="115.41198"
       id="path14" />
    <path
       d="m519.35389 450.82831 86.559-86.55898m-86.559 86.55898-86.55897-86.55898"
       stroke="#fff"
       stroke-linecap="round"
       stroke-width="129.83848"
       id="path15" />
    <path
       d="m519.35389 201.97121v216.39744"
       stroke="#0097bd"
       stroke-linecap="round"
       stroke-width="57.705989"
       id="path16" />
    <path
       d="m519.35389 450.82832 86.559-86.55898m-86.559 86.55898-86.55897-86.55898"
       stroke="#0097bd"
       stroke-linecap="round"
       stroke-width="57.705989"
       id="path17" />
  </g>
</svg>
