<?xml version="1.0" encoding="UTF-8" standalone="no"?>
<svg
   height="24"
   width="24"
   version="1.1"
   id="svg2417"
   sodipodi:docname="Filter_01_24.svg"
   inkscape:export-filename="Filter_01_24.png"
   inkscape:export-xdpi="96"
   inkscape:export-ydpi="96"
   inkscape:version="1.2 (dc2aedaf03, 2022-05-15)"
   xmlns:inkscape="http://www.inkscape.org/namespaces/inkscape"
   xmlns:sodipodi="http://sodipodi.sourceforge.net/DTD/sodipodi-0.dtd"
   xmlns:xlink="http://www.w3.org/1999/xlink"
   xmlns="http://www.w3.org/2000/svg"
   xmlns:svg="http://www.w3.org/2000/svg">
  <defs
     id="defs2421" />
  <sodipodi:namedview
     id="namedview2419"
     pagecolor="#ffffff"
     bordercolor="#666666"
     borderopacity="1.0"
     inkscape:showpageshadow="2"
     inkscape:pageopacity="0.0"
     inkscape:pagecheckerboard="0"
     inkscape:deskcolor="#d1d1d1"
     showgrid="true"
     inkscape:zoom="38.25"
     inkscape:cx="11.986928"
     inkscape:cy="12"
     inkscape:current-layer="svg2417">
    <inkscape:grid
       type="xygrid"
       id="grid2893" />
  </sodipodi:namedview>
  <linearGradient
     id="a"
     gradientTransform="matrix(1.7042068 0 0 1.6878049 -13.45196 -1734.1455)"
     gradientUnits="userSpaceOnUse"
     x1="9"
     x2="21"
     y1="1032.3622"
     y2="1032.3622">
    <stop
       offset="0"
       stop-color="#e0c67e"
       id="stop2386" />
    <stop
       offset=".4999288"
       stop-color="#c88e2c"
       id="stop2388" />
    <stop
       offset="1"
       stop-color="#d2a641"
       id="stop2390" />
  </linearGradient>
  <linearGradient
     id="b">
    <stop
       offset="0"
       stop-color="#fc0"
       id="stop2393" />
    <stop
       offset=".33333102"
       stop-color="#fff6d5"
       id="stop2395" />
    <stop
       offset="1"
       stop-color="#fc0"
       id="stop2397" />
  </linearGradient>
  <linearGradient
     id="c"
     gradientTransform="matrix(1.7042068 0 0 1.6878049 -13.45196 -1734.1455)"
     gradientUnits="userSpaceOnUse"
     x1="13"
     x2="18"
     xlink:href="#b"
     y1="1039.3622"
     y2="1039.3622" />
  <linearGradient
     id="d"
     gradientTransform="matrix(1.7042068 0 0 1.6878049 -13.45196 -1734.1455)"
     gradientUnits="userSpaceOnUse"
     x1="11"
     x2="21"
     xlink:href="#b"
     y1="1032.3622"
     y2="1030.3622" />
  <linearGradient
     id="e"
     gradientUnits="userSpaceOnUse"
     x1="5.9772515"
     x2="17.999999"
     y1="4.4930685"
     y2="4.5000005">
    <stop
       offset="0"
       stop-color="#dfc379"
       id="stop2402" />
    <stop
       offset=".37618256"
       stop-color="#eddcb4"
       id="stop2404" />
    <stop
       offset="1"
       stop-color="#d1a440"
       id="stop2406" />
  </linearGradient>
  <g
     stroke-width=".75"
     id="g2415">
    <path
       d="m2.375 4.625 6.9999995 8.25h5.2500005l7-8.25v-2.25h-19.25z"
       fill="url(#d)"
       fill-rule="evenodd"
       stroke="url(#a)"
       id="path2409" />
    <path
       d="m14.625 12.875-.9375 9.75h-3.375l-.9375005-9.75z"
       fill="url(#c)"
       fill-rule="evenodd"
       stroke="url(#a)"
       stroke-linecap="square"
       id="path2411" />
    <path
       d="m2.5 4.6250005h19"
       fill="none"
       stroke="url(#e)"
       id="path2413" />
  </g>
</svg>
