<svg width="33" height="33" version="1.1" xmlns="http://www.w3.org/2000/svg">
 <radialGradient id="a" cx="4" cy="4" r="5.5" gradientTransform="matrix(1.2e-7 3.8181819 -3.8181819 7e-8 27.272727 -3.272727)" gradientUnits="userSpaceOnUse">
  <stop stop-color="#ff8080" offset="0"/>
  <stop stop-color="#f00" offset="1"/>
 </radialGradient>
 <circle cx="16.5" cy="16.5" r="16.5" fill="url(#a)"/>
 <path d="m18.5 23 6.5-6.5-6.5-6.5" fill="none" stroke="#e5ff80" stroke-linecap="round" stroke-linejoin="round" stroke-width="4.5"/>
 <path d="m25 16.5h-17.5" fill="none" stroke="#e5ff80" stroke-linecap="round" stroke-linejoin="round" stroke-width="4.5"/>
</svg>
