<?xml version="1.0" encoding="UTF-8" standalone="no"?>
<svg
   height="48"
   width="48"
   version="1.1"
   id="svg988"
   sodipodi:docname="Exit_02_48.svg"
   inkscape:export-filename="Exit_02_48.png"
   inkscape:export-xdpi="96"
   inkscape:export-ydpi="96"
   inkscape:version="1.2-beta (1b65182ce9, 2022-04-05)"
   xmlns:inkscape="http://www.inkscape.org/namespaces/inkscape"
   xmlns:sodipodi="http://sodipodi.sourceforge.net/DTD/sodipodi-0.dtd"
   xmlns="http://www.w3.org/2000/svg"
   xmlns:svg="http://www.w3.org/2000/svg">
  <defs
     id="defs992" />
  <sodipodi:namedview
     id="namedview990"
     pagecolor="#ffffff"
     bordercolor="#666666"
     borderopacity="1.0"
     inkscape:pageshadow="2"
     inkscape:pageopacity="0.0"
     inkscape:pagecheckerboard="0"
     inkscape:deskcolor="#d1d1d1"
     showgrid="true"
     inkscape:zoom="19.125"
     inkscape:cx="24"
     inkscape:cy="24"
     inkscape:current-layer="svg988">
    <inkscape:grid
       type="xygrid"
       id="grid2033" />
  </sodipodi:namedview>
  <g
     fill="none"
     stroke="#00aad4"
     stroke-linecap="round"
     stroke-width="2.25"
     transform="matrix(1.9999922,0,0,1.9999922,2.0000861,-0.4107808)"
     id="g986">
    <path
       d="m 11,1.997281 v 9"
       id="path982" />
    <path
       d="M 15.875022,4.2247813 A 9.7500428,9.7473552 0 0 1 20.417817,15.18904 9.7500428,9.7473552 0 0 1 11.000001,22.413595 9.7500428,9.7473552 0 0 1 1.5821826,15.18904 9.7500428,9.7473552 0 0 1 6.1249792,4.224781"
       id="path984" />
  </g>
</svg>
