<?xml version="1.0" encoding="UTF-8" standalone="no"?>
<svg
   width="48"
   height="48"
   version="1.1"
   viewBox="0 0 48 48"
   id="svg3"
   sodipodi:docname="tbitbtn_200.svg"
   inkscape:export-filename="tbitbtn_200.png"
   inkscape:export-xdpi="96"
   inkscape:export-ydpi="96"
   inkscape:version="1.3.2 (091e20e, 2023-11-25, custom)"
   xmlns:inkscape="http://www.inkscape.org/namespaces/inkscape"
   xmlns:sodipodi="http://sodipodi.sourceforge.net/DTD/sodipodi-0.dtd"
   xmlns="http://www.w3.org/2000/svg"
   xmlns:svg="http://www.w3.org/2000/svg">
  <defs
     id="defs3" />
  <sodipodi:namedview
     id="namedview3"
     pagecolor="#ffffff"
     bordercolor="#000000"
     borderopacity="0.25"
     inkscape:showpageshadow="2"
     inkscape:pageopacity="0.0"
     inkscape:pagecheckerboard="0"
     inkscape:deskcolor="#d1d1d1"
     showgrid="true"
     inkscape:current-layer="svg3">
    <inkscape:grid
       id="grid3"
       units="px"
       originx="0"
       originy="0"
       spacingx="0.5"
       spacingy="0.5"
       empcolor="#0099e5"
       empopacity="0.30196078"
       color="#0099e5"
       opacity="0.14901961"
       empspacing="2"
       dotted="false"
       gridanglex="30"
       gridanglez="30"
       visible="true" />
  </sodipodi:namedview>
  <rect
     x=".75"
     y="11.75"
     width="46.5"
     height="24.5"
     rx="5.25"
     ry="5.25"
     fill="#ececec"
     stroke="#2a7efe"
     stroke-linecap="round"
     stroke-linejoin="round"
     stroke-width="1.5"
     style="paint-order:normal"
     id="rect1" />
  <path
     d="m26.49998 18.120074c2.17168 0 3.92 1.611384 3.92 3.612968v4.533918c0 2.001584-1.74832 3.612966-3.92 3.612966-2.17166 0-3.91998-1.611382-3.91998-3.612966v-4.533918c0-2.001584 1.74832-3.612968 3.91998-3.612968z"
     fill="none"
     stroke="#4d4d4d"
     stroke-linecap="round"
     stroke-linejoin="round"
     stroke-width="1.6"
     id="path1" />
  <path
     d="m40.737802 29.879998-3.261992-5.262294m2.650812-3.137704-5.220158 6.178978m-0.206464-9.538976v11.759996"
     fill="none"
     stroke="#4d4d4d"
     stroke-linecap="round"
     stroke-linejoin="round"
     stroke-width="1.6"
     id="path2" />
  <path
     d="M 6.8333331,24.333333 11.5,29 18,19"
     fill="none"
     stroke="#01a901"
     stroke-linecap="round"
     stroke-linejoin="round"
     stroke-width="3"
     id="path3" />
</svg>
