<?xml version="1.0" encoding="UTF-8" standalone="no"?>
<svg
   height="16"
   viewBox="0 0 4.2333332 4.2333335"
   width="16"
   version="1.1"
   id="svg197"
   sodipodi:docname="Arrow_30_16.svg"
   inkscape:export-filename="Arrow_30_16.png"
   inkscape:export-xdpi="96"
   inkscape:export-ydpi="96"
   inkscape:version="1.2 (dc2aedaf03, 2022-05-15)"
   xmlns:inkscape="http://www.inkscape.org/namespaces/inkscape"
   xmlns:sodipodi="http://sodipodi.sourceforge.net/DTD/sodipodi-0.dtd"
   xmlns="http://www.w3.org/2000/svg"
   xmlns:svg="http://www.w3.org/2000/svg">
  <defs
     id="defs201" />
  <sodipodi:namedview
     id="namedview199"
     pagecolor="#ffffff"
     bordercolor="#666666"
     borderopacity="1.0"
     inkscape:showpageshadow="2"
     inkscape:pageopacity="0.0"
     inkscape:pagecheckerboard="0"
     inkscape:deskcolor="#d1d1d1"
     showgrid="true"
     inkscape:zoom="57.375"
     inkscape:cx="7.9912854"
     inkscape:cy="8"
     inkscape:current-layer="svg197">
    <inkscape:grid
       type="xygrid"
       id="grid1114" />
  </sodipodi:namedview>
  <g
     fill="none"
     stroke-linecap="round"
     id="g195">
    <g
       stroke="#fff"
       stroke-width=".79375"
       id="g177">
      <path
         d="m1.7197917 1.1906193.5291666-.52916661.5291667.52916671"
         stroke-linejoin="round"
         id="path163" />
      <path
         d="m2.2489582.66145834v3.17499996"
         id="path165" />
      <g
         stroke-linejoin="round"
         id="g173">
        <path
           d="m3.3072915 1.7197917.5291667.5291666-.5291667.5291667"
           id="path167" />
        <path
           d="m1.1906193 2.778125-.52916661-.5291667.52916661-.5291666"
           id="path169" />
        <path
           d="m1.7197916 3.3072915.5291667.529167.5291667-.529167"
           id="path171" />
      </g>
      <path
         d="m.66145834 2.2489583h3.17499996"
         id="path175" />
    </g>
    <g
       stroke="#a00"
       stroke-width=".264583"
       id="g193">
      <path
         d="m1.7197917 1.1906193.5291666-.52916661.5291667.52916671"
         stroke-linejoin="round"
         id="path179" />
      <path
         d="m2.2489582.66145834v3.17499996"
         id="path181" />
      <g
         stroke-linejoin="round"
         id="g189">
        <path
           d="m3.3072915 1.7197917.5291667.5291666-.5291667.5291667"
           id="path183" />
        <path
           d="m1.1906193 2.778125-.52916661-.5291667.52916661-.5291666"
           id="path185" />
        <path
           d="m1.7197916 3.3072915.5291667.529167.5291667-.529167"
           id="path187" />
      </g>
      <path
         d="m.66145834 2.2489583h3.17499996"
         id="path191" />
    </g>
  </g>
</svg>
