<?xml version="1.0" encoding="UTF-8" standalone="no"?>
<svg
   height="16"
   width="16"
   version="1.1"
   id="svg159"
   sodipodi:docname="Folder_20_16.svg"
   inkscape:export-filename="Folder_20_16.png"
   inkscape:export-xdpi="96"
   inkscape:export-ydpi="96"
   inkscape:version="1.2.2 (732a01da63, 2022-12-09)"
   xml:space="preserve"
   xmlns:inkscape="http://www.inkscape.org/namespaces/inkscape"
   xmlns:sodipodi="http://sodipodi.sourceforge.net/DTD/sodipodi-0.dtd"
   xmlns="http://www.w3.org/2000/svg"
   xmlns:svg="http://www.w3.org/2000/svg"><defs
     id="defs163" /><sodipodi:namedview
     id="namedview161"
     pagecolor="#ffffff"
     bordercolor="#666666"
     borderopacity="1.0"
     inkscape:pageshadow="2"
     inkscape:pageopacity="0.0"
     inkscape:pagecheckerboard="0"
     inkscape:deskcolor="#d1d1d1"
     showgrid="true"
     inkscape:zoom="56.875"
     inkscape:cx="5.6351648"
     inkscape:cy="8"
     inkscape:current-layer="svg159"
     inkscape:showpageshadow="2"><inkscape:grid
       type="xygrid"
       id="grid836" /></sodipodi:namedview><rect
     height="11"
     ry="1"
     width="15"
     x="0.5"
     y="2.5"
     id="rect4"
     style="fill:#c2f3ff;stroke:#00aad4;stroke-width:1;stroke-linejoin:round"
     rx="1" /><path
     style="color:#000000;fill:#00aad4;stroke-linejoin:round;-inkscape-stroke:none"
     d="M 1.5,1 C 0.67765021,1 0,1.6776503 0,2.5 v 2 H 5.5 C 6.3223497,4.5 7,3.8223497 7,3 V 2.5 C 7,1.6776503 6.3223498,1 5.5,1 Z"
     id="path293"
     sodipodi:nodetypes="scccssss" /></svg>
