<?xml version="1.0" encoding="UTF-8" standalone="no"?>
<svg
   height="24"
   width="24"
   version="1.1"
   id="svg740"
   sodipodi:docname="Clean_02_24.svg"
   inkscape:export-filename="Clean_02_24.png"
   inkscape:export-xdpi="96"
   inkscape:export-ydpi="96"
   inkscape:version="1.2.1 (9c6d41e410, 2022-07-14)"
   xmlns:inkscape="http://www.inkscape.org/namespaces/inkscape"
   xmlns:sodipodi="http://sodipodi.sourceforge.net/DTD/sodipodi-0.dtd"
   xmlns:xlink="http://www.w3.org/1999/xlink"
   xmlns="http://www.w3.org/2000/svg"
   xmlns:svg="http://www.w3.org/2000/svg">
  <defs
     id="defs744">
    <linearGradient
       inkscape:collect="always"
       xlink:href="#linearGradient877"
       id="linearGradient879"
       x1="2"
       y1="4"
       x2="4"
       y2="2"
       gradientUnits="userSpaceOnUse"
       gradientTransform="matrix(-1.0350877,0,0,1.0350877,16.1272,-0.12720042)" />
    <linearGradient
       inkscape:collect="always"
       id="linearGradient877">
      <stop
         style="stop-color:#9d660d;stop-opacity:1"
         offset="0"
         id="stop873" />
      <stop
         id="stop881"
         offset="0.50192344"
         style="stop-color:#eea632;stop-opacity:1" />
      <stop
         style="stop-color:#9d650d;stop-opacity:1"
         offset="1"
         id="stop875" />
    </linearGradient>
    <radialGradient
       inkscape:collect="always"
       xlink:href="#linearGradient855"
       id="radialGradient847"
       cx="9.032692"
       cy="8.5654745"
       fx="9.032692"
       fy="8.5654745"
       r="6.499989"
       gradientUnits="userSpaceOnUse"
       gradientTransform="matrix(-0.54578625,0.70172505,1.6154925,1.2564941,-1.4473333,-8.5611415)" />
    <linearGradient
       inkscape:collect="always"
       id="linearGradient855">
      <stop
         style="stop-color:#fef6ce;stop-opacity:1"
         offset="0"
         id="stop849" />
      <stop
         style="stop-color:#d4aa00;stop-opacity:1"
         offset="1"
         id="stop853" />
    </linearGradient>
  </defs>
  <sodipodi:namedview
     id="namedview742"
     pagecolor="#ffffff"
     bordercolor="#666666"
     borderopacity="1.0"
     inkscape:pageshadow="2"
     inkscape:pageopacity="0.0"
     inkscape:pagecheckerboard="0"
     inkscape:deskcolor="#d1d1d1"
     showgrid="true"
     inkscape:zoom="38.25"
     inkscape:cx="12"
     inkscape:cy="12"
     inkscape:current-layer="svg740"
     inkscape:showpageshadow="2">
    <inkscape:grid
       type="xygrid"
       id="grid863" />
  </sodipodi:namedview>
  <g
     id="g2424"
     transform="matrix(1.4901814,0,0,1.4901814,0.07858315,0.07851408)"
     style="stroke-width:1.00659">
    <path
       sodipodi:nodetypes="cccc"
       inkscape:connector-curvature="0"
       id="path845-7"
       d="M 11.98685,6.083326 15.092112,2.9780628 C 16.644745,1.4254311 14.574569,-0.64474429 13.021938,0.90788728 L 9.916673,4.0131505"
       style="fill:url(#linearGradient879);fill-opacity:1;fill-rule:evenodd;stroke:#8c5400;stroke-width:0.332175;stroke-linecap:butt;stroke-linejoin:round;stroke-miterlimit:4;stroke-dasharray:none;stroke-opacity:1" />
    <path
       sodipodi:nodetypes="ccccccc"
       inkscape:connector-curvature="0"
       id="path833-8"
       d="M 8.980608,2.9649871 13.035013,7.0193915 10.50101,8.0329926 C 10.308947,11.428987 9.3358679,14.1146 7.9670069,15.635002 2.8990014,14.621401 0.58879884,11.357197 0.36499876,9.0465937 3.9126025,8.0329926 3.9126025,6.0057904 7.9670069,5.4989898 Z"
       style="fill:url(#radialGradient847);fill-opacity:1;fill-rule:evenodd;stroke:#aa8800;stroke-width:0.332174;stroke-linecap:round;stroke-linejoin:round;stroke-miterlimit:4;stroke-dasharray:none;stroke-opacity:1" />
    <path
       sodipodi:nodetypes="cc"
       inkscape:connector-curvature="0"
       id="path843-1"
       d="m 10.489679,8.0103216 -2.5,-2.5"
       style="fill:none;fill-rule:evenodd;stroke:#d40000;stroke-width:1.00659px;stroke-linecap:round;stroke-linejoin:miter;stroke-opacity:1" />
  </g>
</svg>
