<?xml version="1.0" encoding="UTF-8" standalone="no"?>
<svg
   height="16"
   viewBox="0 0 4.2333332 4.2333335"
   width="16"
   version="1.1"
   id="svg155"
   sodipodi:docname="Sound_04_16.svg"
   inkscape:export-filename="Sound_04_16.png"
   inkscape:export-xdpi="96"
   inkscape:export-ydpi="96"
   inkscape:version="1.2 (dc2aedaf03, 2022-05-15)"
   xmlns:inkscape="http://www.inkscape.org/namespaces/inkscape"
   xmlns:sodipodi="http://sodipodi.sourceforge.net/DTD/sodipodi-0.dtd"
   xmlns="http://www.w3.org/2000/svg"
   xmlns:svg="http://www.w3.org/2000/svg">
  <defs
     id="defs159" />
  <sodipodi:namedview
     id="namedview157"
     pagecolor="#ffffff"
     bordercolor="#666666"
     borderopacity="1.0"
     inkscape:showpageshadow="2"
     inkscape:pageopacity="0.0"
     inkscape:pagecheckerboard="0"
     inkscape:deskcolor="#d1d1d1"
     showgrid="true"
     inkscape:zoom="57.375"
     inkscape:cx="7.9912854"
     inkscape:cy="8"
     inkscape:current-layer="svg155">
    <inkscape:grid
       type="xygrid"
       id="grid869" />
  </sodipodi:namedview>
  <g
     fill="none"
     stroke="#00aad4"
     stroke-linecap="round"
     stroke-linejoin="round"
     id="g153">
    <path
       d="m1.1906248 1.4552083.6614585-.79374995.3968748-.00000001v2.91041666l-.3968748.0000001-.6614585-.7937501"
       stroke-width=".264583"
       id="path143" />
    <rect
       height="1.322917"
       rx=".264583"
       stroke-width=".264583"
       transform="scale(-1 1)"
       width=".79375"
       x="-1.190625"
       y="1.455208"
       id="rect145" />
    <g
       stroke-width=".264648"
       transform="matrix(0 -1 .99950855 0 .001365 0)"
       id="g151">
      <path
         d="m-1.5875001 2.7781248a.5291667.39687499 0 0 1 -.2645834.3437038.5291667.39687499 0 0 1 -.5291667 0 .5291667.39687499 0 0 1 -.2645833-.3437038"
         id="path147" />
      <path
         d="m-.92604184 2.7781248a1.190625 1.0583334 0 0 1 -.59531246.9165436 1.190625 1.0583334 0 0 1 -1.190625 0 1.190625 1.0583334 0 0 1 -.5953124-.9165436"
         id="path149" />
    </g>
  </g>
</svg>
