<?xml version="1.0" encoding="UTF-8" standalone="no"?>
<svg
   width="24"
   height="24"
   version="1.1"
   viewBox="0 0 24 24"
   id="svg13"
   sodipodi:docname="tdrawgrid.svg"
   inkscape:export-filename="tdrawgrid.png"
   inkscape:export-xdpi="96"
   inkscape:export-ydpi="96"
   inkscape:version="1.3.2 (091e20e, 2023-11-25, custom)"
   xmlns:inkscape="http://www.inkscape.org/namespaces/inkscape"
   xmlns:sodipodi="http://sodipodi.sourceforge.net/DTD/sodipodi-0.dtd"
   xmlns="http://www.w3.org/2000/svg"
   xmlns:svg="http://www.w3.org/2000/svg">
  <defs
     id="defs13" />
  <sodipodi:namedview
     id="namedview13"
     pagecolor="#ffffff"
     bordercolor="#000000"
     borderopacity="0.25"
     inkscape:showpageshadow="2"
     inkscape:pageopacity="0.0"
     inkscape:pagecheckerboard="0"
     inkscape:deskcolor="#d1d1d1"
     showgrid="true"
     inkscape:current-layer="svg13">
    <inkscape:grid
       id="grid13"
       units="px"
       originx="0"
       originy="0"
       spacingx="0.5"
       spacingy="0.5"
       empcolor="#0099e5"
       empopacity="0.30196078"
       color="#0099e5"
       opacity="0.14901961"
       empspacing="2"
       dotted="false"
       gridanglex="30"
       gridanglez="30"
       visible="true" />
  </sodipodi:namedview>
  <rect
     x="2.25"
     y="3.25"
     width="18.5"
     height="12.5"
     fill="#ffffff"
     stroke="#2a7efe"
     stroke-width=".5"
     style="paint-order:normal"
     id="rect1" />
  <rect
     transform="rotate(-90)"
     x="-15.750001"
     y="4.75"
     width="10.000001"
     height="5.000001"
     fill="#ffffff"
     stroke="#2a7efe"
     stroke-width=".499998"
     style="paint-order:normal"
     id="rect2" />
  <rect
     transform="rotate(-90)"
     x="-5.7500005"
     y="2.2499995"
     width="2.500001"
     height="18.5"
     fill="#ececec"
     stroke="#2a7efe"
     stroke-width=".499999"
     style="paint-order:normal"
     id="rect3" />
  <rect
     transform="scale(-1)"
     x="-4.7500005"
     y="-15.75"
     width="2.500001"
     height="10"
     fill="#ececec"
     stroke="#2a7efe"
     stroke-width=".499999"
     style="paint-order:normal"
     id="rect4" />
  <path
     d="m6 7.5h2.5"
     fill="none"
     stroke="#b3b3b3"
     id="path4" />
  <path
     d="m6 13.5h2.5"
     fill="none"
     stroke="#b3b3b3"
     id="path5" />
  <path
     d="m6 11.5h2.5"
     fill="none"
     stroke="#b3b3b3"
     id="path6" />
  <path
     d="m6 9.5h2.5"
     fill="none"
     stroke="#b3b3b3"
     id="path7" />
  <path
     d="m11.5 7.5h7"
     fill="none"
     stroke="#b3b3b3"
     id="path8" />
  <path
     d="m11.5 13.5h6"
     fill="none"
     stroke="#b3b3b3"
     id="path9" />
  <path
     d="m11.5 11.5h7"
     fill="none"
     stroke="#b3b3b3"
     id="path10" />
  <path
     d="m11.5 9.5h6"
     fill="none"
     stroke="#b3b3b3"
     id="path11" />
  <path
     d="m14.736921 8.4999376-5.4249157 10.833398h10.849676z"
     fill="none"
     fill-rule="evenodd"
     stroke="#ffffff"
     stroke-linejoin="round"
     stroke-width="2.5"
     id="path12" />
  <rect
     x="15.154136"
     y="15.16666"
     width="8.3458643"
     height="8.3333387"
     fill="#ff2a2a"
     stroke="#ffaaaa"
     stroke-linejoin="round"
     style="paint-order:normal"
     id="rect12" />
  <path
     d="m14.736921 8.4999376-5.4249157 10.833398h10.849676z"
     fill="#ffd42a"
     fill-rule="evenodd"
     stroke="#ffe680"
     stroke-linejoin="round"
     id="path13" />
  <ellipse
     cx="10.56391"
     cy="18.916664"
     rx="4.5902257"
     ry="4.5833364"
     fill="#2a7efe"
     stroke="#b3d1fe"
     stroke-linejoin="round"
     style="paint-order:normal"
     id="ellipse13" />
</svg>
