<?xml version="1.0" encoding="UTF-8" standalone="no"?>
<svg
   height="16"
   width="16"
   version="1.1"
   id="svg278"
   sodipodi:docname="InvalidDisabledBreakPoint_150.svg"
   inkscape:export-filename="InvalidDisabledBreakPoint_150.png"
   inkscape:export-xdpi="96"
   inkscape:export-ydpi="96"
   inkscape:version="1.2.2 (732a01da63, 2022-12-09)"
   xmlns:inkscape="http://www.inkscape.org/namespaces/inkscape"
   xmlns:sodipodi="http://sodipodi.sourceforge.net/DTD/sodipodi-0.dtd"
   xmlns="http://www.w3.org/2000/svg"
   xmlns:svg="http://www.w3.org/2000/svg">
  <defs
     id="defs282">
    <radialGradient
       id="a"
       cx="4"
       cy="4"
       gradientTransform="matrix(6e-8,1.8512398,-1.8512398,4e-8,13.223141,-1.586777)"
       gradientUnits="userSpaceOnUse"
       r="5.5">
      <stop
         offset="0"
         stop-color="#00f23e"
         id="stop138" />
      <stop
         offset="1"
         stop-color="#00ad00"
         id="stop140" />
    </radialGradient>
  </defs>
  <sodipodi:namedview
     id="namedview280"
     pagecolor="#ffffff"
     bordercolor="#666666"
     borderopacity="1.0"
     inkscape:showpageshadow="2"
     inkscape:pageopacity="0.0"
     inkscape:pagecheckerboard="0"
     inkscape:deskcolor="#d1d1d1"
     showgrid="true"
     inkscape:zoom="57.375"
     inkscape:cx="6.0217865"
     inkscape:cy="8"
     inkscape:current-layer="svg278">
    <inkscape:grid
       type="xygrid"
       id="grid646" />
  </sodipodi:namedview>
  <circle
     cx="8"
     cy="8"
     fill="url(#a)"
     r="8"
     id="circle143"
     style="fill:url(#a)" />
  <g
     id="g919"
     style="stroke:#ffffff;stroke-width:0.90625;stroke-opacity:1"
     transform="matrix(1.6551724,0,0,1.6551724,-1.1034485,-1.1034485)">
    <path
       style="fill:none;stroke:#ffffff;stroke-width:0.90625px;stroke-linecap:round;stroke-linejoin:miter;stroke-opacity:1"
       d="m 3.5,3.5 4,4"
       id="path355" />
    <path
       style="fill:none;stroke:#ffffff;stroke-width:0.90625px;stroke-linecap:round;stroke-linejoin:miter;stroke-opacity:1"
       d="m 7.5,3.5 -4,4"
       id="path357" />
  </g>
</svg>
