<?xml version="1.0" encoding="UTF-8" standalone="no"?>
<svg
   height="16"
   width="16"
   version="1.1"
   id="svg2"
   sodipodi:docname="dddomains.svg"
   inkscape:export-filename="dddomains.png"
   inkscape:export-xdpi="96"
   inkscape:export-ydpi="96"
   inkscape:version="1.3-beta (cedbd6c6ff, 2023-05-28)"
   xmlns:inkscape="http://www.inkscape.org/namespaces/inkscape"
   xmlns:sodipodi="http://sodipodi.sourceforge.net/DTD/sodipodi-0.dtd"
   xmlns="http://www.w3.org/2000/svg"
   xmlns:svg="http://www.w3.org/2000/svg">
  <defs
     id="defs2" />
  <sodipodi:namedview
     id="namedview2"
     pagecolor="#ffffff"
     bordercolor="#000000"
     borderopacity="0.25"
     inkscape:showpageshadow="2"
     inkscape:pageopacity="0.0"
     inkscape:pagecheckerboard="0"
     inkscape:deskcolor="#d1d1d1"
     showgrid="true"
     inkscape:current-layer="svg2">
    <inkscape:grid
       id="grid2"
       units="px"
       originx="0"
       originy="0"
       spacingx="0.5"
       spacingy="0.5"
       empcolor="#0099e5"
       empopacity="0.30196078"
       color="#0099e5"
       opacity="0.14901961"
       empspacing="2"
       dotted="false"
       gridanglex="30"
       gridanglez="30"
       visible="true" />
  </sodipodi:namedview>
  <rect
     fill="#c2f3ff"
     height="12.000003"
     ry="1.6000004"
     width="12.000002"
     x="0.49999851"
     y="0.5"
     id="rect1"
     style="stroke:#00aad4;stroke-width:0.999997;stroke-linejoin:round" />
  <rect
     fill="#ebfcff"
     height="12.000003"
     ry="1.6000004"
     width="12.000002"
     x="2.4999988"
     y="2.5"
     id="rect2"
     style="stroke:#00aad4;stroke-width:0.999997;stroke-linejoin:round" />
  <path
     d="m 4.606836,6.0003041 1.51162,2.4510172 -1.55264,2.5486667 h 0.78706 l 1.13665,-1.9412832 1.14641,1.9412832 h 0.78902 L 6.854736,8.4454622 8.348786,6.0003041 H 7.561726 L 6.485616,7.8361256 5.395846,6.0003041 Z"
     id="path48"
     style="fill:#00aad4;stroke:#00aad4;stroke-width:0.22;stroke-dasharray:none;fill-opacity:1;stroke-opacity:1" />
  <path
     d="M 10.850735,8.9678034 V 11 h -0.70147 V 8.9678034 L 8.625985,6.0003155 h 0.78055 l 1.09347,2.2557034 1.09347,-2.2557034 h 0.78055 z"
     id="path50"
     style="fill:#00aad4;stroke:#00aad4;stroke-width:0.22;stroke-dasharray:none;fill-opacity:1;stroke-opacity:1" />
</svg>
