<svg width="32" height="32" version="1.1" xmlns="http://www.w3.org/2000/svg">
 <path d="m19.87931 14.499962h8.62069v-8.6190079" fill="none" stroke="#fa0302" stroke-linecap="round" stroke-width="3"/>
 <path d="m26.689656 14.069006c-4.655174-9.5034899-15-16.41512-23.189656-3.455814" fill="none" stroke="#fa0302" stroke-linecap="round" stroke-width="3"/>
 <path d="m12.12069 17.499962h-8.62069v8.619008" fill="none" stroke="#2a7efe" stroke-linecap="round" stroke-width="3"/>
 <path d="m5.3103448 17.930918c4.6551732 9.503556 14.999999 16.415238 23.189655 3.45584" fill="none" stroke="#2a7efe" stroke-linecap="round" stroke-width="3"/>
</svg>
