<?xml version="1.0" encoding="UTF-8" standalone="no"?>
<svg
   height="16"
   width="16"
   version="1.1"
   id="svg5"
   sodipodi:docname="Key_03_16.svg"
   inkscape:version="1.3 (0e150ed6c4, 2023-07-21)"
   xmlns:inkscape="http://www.inkscape.org/namespaces/inkscape"
   xmlns:sodipodi="http://sodipodi.sourceforge.net/DTD/sodipodi-0.dtd"
   xmlns="http://www.w3.org/2000/svg"
   xmlns:svg="http://www.w3.org/2000/svg">
  <defs
     id="defs5" />
  <sodipodi:namedview
     id="namedview5"
     pagecolor="#ffffff"
     bordercolor="#000000"
     borderopacity="0.25"
     inkscape:showpageshadow="2"
     inkscape:pageopacity="0.0"
     inkscape:pagecheckerboard="0"
     inkscape:deskcolor="#d1d1d1"
     showgrid="true"
     inkscape:current-layer="svg5">
    <inkscape:grid
       id="grid5"
       units="px"
       originx="0"
       originy="0"
       spacingx="0.5"
       spacingy="0.5"
       empcolor="#0099e5"
       empopacity="0.30196078"
       color="#0099e5"
       opacity="0.14901961"
       empspacing="2"
       dotted="false"
       gridanglex="30"
       gridanglez="30"
       visible="true" />
  </sodipodi:namedview>
  <linearGradient
     id="a"
     gradientTransform="matrix(.84640529 0 0 .84640528 2.76634 2.766339)"
     gradientUnits="userSpaceOnUse"
     x1="14.08446"
     x2="8.915541"
     y1="14.08446"
     y2="8.915541">
    <stop
       offset="0"
       stop-color="#d40000"
       id="stop1" />
    <stop
       offset="1"
       stop-color="#ff2a2a"
       id="stop2" />
  </linearGradient>
  <g
     transform="translate(-.000366)"
     id="g3">
    <ellipse
       cx="4.956521"
       cy="10.588132"
       fill="none"
       rx="1.999979"
       ry="2.494393"
       stroke="#cca300"
       stroke-linecap="round"
       stroke-linejoin="round"
       stroke-width="1.2"
       transform="matrix(-.70526305 .70894572 .70894572 .70526305 0 0)"
       id="ellipse2" />
    <path
       d="m5.7824857 9.2175147 6.7175143-6.7175145"
       fill="none"
       stroke="#cca300"
       stroke-linecap="round"
       stroke-linejoin="round"
       stroke-width="1.3"
       id="path2" />
    <path
       d="m11.792893 3.2071069-2.8284269 2.8284271 1.7677669 1.7677671 1.06066-1.0606602-1.414213-1.4142135.707107-.7071068 1.414213 1.4142135 1.06066-1.0606601z"
       fill="#cca300"
       id="path3" />
  </g>
  <circle
     cx="12.5"
     cy="12.5"
     fill="url(#a)"
     r="3.5"
     transform="matrix(0 1 1 0 0 0)"
     id="circle3" />
  <g
     fill="none"
     stroke="#fff"
     stroke-linecap="round"
     id="g5">
    <path
       d="m11.297918 11.297918 2.404164 2.404164"
       id="path4" />
    <path
       d="m13.702082 11.297918-2.404164 2.404164"
       id="path5" />
  </g>
</svg>
