<?xml version="1.0" encoding="UTF-8" standalone="no"?>
<svg
   height="16"
   width="16"
   version="1.1"
   id="svg16"
   sodipodi:docname="Chart_03_16.svg"
   xml:space="preserve"
   inkscape:version="1.2 (dc2aedaf03, 2022-05-15)"
   inkscape:export-filename="Chart_03_16.png"
   inkscape:export-xdpi="96"
   inkscape:export-ydpi="96"
   xmlns:inkscape="http://www.inkscape.org/namespaces/inkscape"
   xmlns:sodipodi="http://sodipodi.sourceforge.net/DTD/sodipodi-0.dtd"
   xmlns="http://www.w3.org/2000/svg"
   xmlns:svg="http://www.w3.org/2000/svg"><defs
     id="defs20" /><sodipodi:namedview
     id="namedview18"
     pagecolor="#ffffff"
     bordercolor="#666666"
     borderopacity="1.0"
     inkscape:pageshadow="2"
     inkscape:pageopacity="0.0"
     inkscape:pagecheckerboard="0"
     inkscape:deskcolor="#d1d1d1"
     showgrid="true"
     inkscape:zoom="57.375"
     inkscape:cx="8"
     inkscape:cy="8"
     inkscape:current-layer="svg16"
     showguides="true"
     inkscape:showpageshadow="2"><inkscape:grid
       type="xygrid"
       id="grid294" /></sodipodi:namedview><path
     style="fill:none;stroke:#00aad4;stroke-width:1px;stroke-linecap:round;stroke-linejoin:round;stroke-opacity:1"
     d="m 0.5,1.5 v 13 h 15"
     id="path350"
     sodipodi:nodetypes="ccc" /><path
     style="fill:none;stroke:#00aad4;stroke-width:1.25;stroke-linecap:round;stroke-linejoin:miter;stroke-dasharray:none;stroke-opacity:1"
     d="m 3.625,12.5 v -5"
     id="path534"
     sodipodi:nodetypes="cc" /><path
     style="fill:none;stroke:#00aad4;stroke-width:1.25;stroke-linecap:round;stroke-linejoin:miter;stroke-dasharray:none;stroke-opacity:1"
     d="m 6.625,12.5 v -7"
     id="path536"
     sodipodi:nodetypes="cc" /><path
     style="fill:none;stroke:#00aad4;stroke-width:1.25;stroke-linecap:round;stroke-linejoin:miter;stroke-dasharray:none;stroke-opacity:1"
     d="m 9.625,12.5 v -4"
     id="path538"
     sodipodi:nodetypes="cc" /><path
     style="fill:none;stroke:#00aad4;stroke-width:1.25;stroke-linecap:round;stroke-linejoin:miter;stroke-dasharray:none;stroke-opacity:1"
     d="m 12.625,12.5 v -9"
     id="path540"
     sodipodi:nodetypes="cc" /></svg>
