<?xml version="1.0" encoding="UTF-8" standalone="no"?>
<svg
   height="16"
   width="16"
   version="1.1"
   id="svg15"
   sodipodi:docname="Refresh_01_16.svg"
   inkscape:export-filename="Refresh_01_16.png"
   inkscape:export-xdpi="96"
   inkscape:export-ydpi="96"
   inkscape:version="1.2-beta (1b65182ce9, 2022-04-05)"
   xmlns:inkscape="http://www.inkscape.org/namespaces/inkscape"
   xmlns:sodipodi="http://sodipodi.sourceforge.net/DTD/sodipodi-0.dtd"
   xmlns:xlink="http://www.w3.org/1999/xlink"
   xmlns="http://www.w3.org/2000/svg"
   xmlns:svg="http://www.w3.org/2000/svg">
  <defs
     id="defs19" />
  <sodipodi:namedview
     id="namedview17"
     pagecolor="#ffffff"
     bordercolor="#666666"
     borderopacity="1.0"
     inkscape:pageshadow="2"
     inkscape:pageopacity="0.0"
     inkscape:pagecheckerboard="0"
     inkscape:deskcolor="#d1d1d1"
     showgrid="true"
     inkscape:zoom="57.375"
     inkscape:cx="7.9912854"
     inkscape:cy="8"
     inkscape:current-layer="svg15">
    <inkscape:grid
       type="xygrid"
       id="grid2955" />
  </sodipodi:namedview>
  <linearGradient
     id="a">
    <stop
       offset="0"
       stop-color="#80b3ff"
       id="stop2" />
    <stop
       offset="1"
       stop-color="#d5e5ff"
       id="stop4" />
  </linearGradient>
  <linearGradient
     id="b"
     gradientTransform="matrix(-1 0 0 -1 16 16)"
     gradientUnits="userSpaceOnUse"
     x1="10"
     x2="9"
     xlink:href="#a"
     y1="7"
     y2="2" />
  <linearGradient
     id="c"
     gradientUnits="userSpaceOnUse"
     x1="10"
     x2="9"
     xlink:href="#a"
     y1="7"
     y2="2" />
  <g
     fill-rule="evenodd"
     stroke="#3566a4"
     stroke-linejoin="round"
     stroke-opacity=".988235"
     id="g13">
    <path
       d="m14.5 10c-2.600511 2.63687-4.7848012 4.290652-8.5.5l2-2h-6.5v6.5l2-2c4.1728856 3.341902 9.179738 3.641126 11-3z"
       fill="url(#b)"
       id="path9" />
    <path
       d="m1.5000002 6c2.600511-2.63687 4.7848012-4.2906522 8.4999998-.5l-1.9999998 2h6.4999998v-6.5000002l-2 2.0000002c-4.1728854-3.3419022-9.1797378-3.6411262-10.9999998 3z"
       fill="url(#c)"
       id="path11" />
  </g>
</svg>
