<?xml version="1.0" encoding="UTF-8" standalone="no"?>
<svg
   width="16"
   height="16"
   version="1.1"
   id="svg18"
   sodipodi:docname="Setup_05_16.svg"
   inkscape:export-filename="Setup_05_16.png"
   inkscape:export-xdpi="96"
   inkscape:export-ydpi="96"
   inkscape:version="1.3.2 (091e20e, 2023-11-25, custom)"
   xmlns:inkscape="http://www.inkscape.org/namespaces/inkscape"
   xmlns:sodipodi="http://sodipodi.sourceforge.net/DTD/sodipodi-0.dtd"
   xmlns="http://www.w3.org/2000/svg"
   xmlns:svg="http://www.w3.org/2000/svg">
  <sodipodi:namedview
     id="namedview18"
     pagecolor="#ffffff"
     bordercolor="#000000"
     borderopacity="0.25"
     inkscape:showpageshadow="2"
     inkscape:pageopacity="0.0"
     inkscape:pagecheckerboard="0"
     inkscape:deskcolor="#d1d1d1"
     showgrid="true"
     inkscape:current-layer="svg18">
    <inkscape:grid
       id="grid18"
       units="px"
       originx="0"
       originy="0"
       spacingx="0.5"
       spacingy="0.5"
       empcolor="#0099e5"
       empopacity="0.30196078"
       color="#0099e5"
       opacity="0.14901961"
       empspacing="2"
       dotted="false"
       gridanglex="30"
       gridanglez="30"
       visible="true" />
  </sodipodi:namedview>
  <defs
     id="defs14">
    <linearGradient
       id="a"
       x1="5.4640584"
       x2="7.5116959"
       y1="9.4888191"
       y2="11.536456"
       gradientTransform="matrix(2,0,0,2,0,-3e-6)"
       gradientUnits="userSpaceOnUse">
      <stop
         stop-color="#0055d4"
         offset="0"
         id="stop1" />
      <stop
         stop-color="#89b8ff"
         offset=".15760632"
         id="stop2" />
      <stop
         stop-color="#0055d4"
         offset=".88542914"
         id="stop3" />
      <stop
         stop-color="#003d97"
         offset="1"
         id="stop4" />
    </linearGradient>
    <radialGradient
       id="b"
       cx="15.071531"
       cy="1033.4419"
       r="3.4872861"
       gradientTransform="matrix(.06705676 -2.5767524 -2.5798064 .04059898 2687.0692 8.878935)"
       gradientUnits="userSpaceOnUse">
      <stop
         stop-color="#fff"
         offset="0"
         id="stop5" />
      <stop
         stop-color="#ccc"
         offset="1"
         id="stop6" />
    </radialGradient>
    <linearGradient
       id="c"
       x1="12.316649"
       x2="13"
       y1="13.316649"
       y2="14"
       gradientUnits="userSpaceOnUse">
      <stop
         stop-color="#a8a8a8"
         offset="0"
         id="stop7" />
      <stop
         stop-color="#1a1a1a"
         offset="1"
         id="stop8" />
    </linearGradient>
    <linearGradient
       id="d"
       x1="10.47674"
       x2="11.47674"
       y1="12.539411"
       y2="11.539411"
       gradientUnits="userSpaceOnUse">
      <stop
         stop-color="#1a1a1a"
         offset="0"
         id="stop9" />
      <stop
         stop-color="#ececec"
         offset=".52609098"
         id="stop10" />
      <stop
         stop-color="#1a1a1a"
         offset="1"
         id="stop11" />
    </linearGradient>
    <linearGradient
       id="e"
       x1="6"
       x2="8"
       y1="1033.3622"
       y2="1031.3622"
       gradientTransform="matrix(.99937458 0 0 .99904073 -3.520856 -1026.8347)"
       gradientUnits="userSpaceOnUse">
      <stop
         stop-color="#800000"
         offset="0"
         id="stop12" />
      <stop
         stop-color="#d40000"
         offset=".66836232"
         id="stop13" />
      <stop
         stop-color="#ff8080"
         offset="1"
         id="stop14" />
    </linearGradient>
  </defs>
  <g
     transform="matrix(1.0718449 0 0 1.0718449 -.51100867 -.65000951)"
     fill-rule="evenodd"
     id="g16">
    <path
       d="m10.69912 12.470717 0.886831 1.591966 0.675669 0.675634 1.414063-1.414-0.675683-0.675683-1.591895-0.885017"
       fill="url(#c)"
       id="path14" />
    <path
       d="m11.408105 11.763617-5.400115-5.4000063-0.708984 0.7071 5.400114 5.4000063"
       fill="url(#d)"
       id="path15" />
    <path
       d="m1.975705 1.5394107a1.4992118 1.498711 0 0 0-1.044269 2.5738l2.966894 2.9678a1.4992118 1.498711 0 1 0 2.119767-2.1192l-2.966894-2.9678a1.4992118 1.498711 0 0 0-1.075498-0.4546z"
       fill="url(#e)"
       id="path16" />
  </g>
  <g
     transform="matrix(.53592245 0 0 .53592245 .30159025 -1.5229535)"
     fill-rule="evenodd"
     id="g18">
    <path
       d="m18.5 12s-10.333334 10-14.5 14c-3.0181039 2.89738 1.0527162 7.052544 4 4l14-14.5z"
       fill="url(#a)"
       stroke-width="2"
       id="path17" />
    <path
       d="m26 15.5c2.871439-1.914293 3.723456-4.954602 2.5-6.5l-2.5 2.500003-3-0.500003-0.5-3.0000028 2.5-2.4999972c-1.545398-1.2234564-4.585707-0.3714388-6.5 2.5-2 3 1 5.5 1.5 6s3 3.5 6 1.5z"
       fill="url(#b)"
       stroke="#808080"
       stroke-width=".5"
       id="path18" />
  </g>
</svg>
