<?xml version="1.0" encoding="UTF-8" standalone="no"?>
<svg
   height="16"
   width="16"
   version="1.1"
   id="svg390"
   sodipodi:docname="menu_save_all.svg"
   inkscape:export-filename="menu_save_all.png"
   inkscape:export-xdpi="96"
   inkscape:export-ydpi="96"
   inkscape:version="1.2.2 (732a01da63, 2022-12-09)"
   xmlns:inkscape="http://www.inkscape.org/namespaces/inkscape"
   xmlns:sodipodi="http://sodipodi.sourceforge.net/DTD/sodipodi-0.dtd"
   xmlns:xlink="http://www.w3.org/1999/xlink"
   xmlns="http://www.w3.org/2000/svg"
   xmlns:svg="http://www.w3.org/2000/svg">
  <defs
     id="defs394" />
  <sodipodi:namedview
     id="namedview392"
     pagecolor="#ffffff"
     bordercolor="#666666"
     borderopacity="1.0"
     inkscape:showpageshadow="2"
     inkscape:pageopacity="0.0"
     inkscape:pagecheckerboard="0"
     inkscape:deskcolor="#d1d1d1"
     showgrid="true"
     inkscape:zoom="57.375"
     inkscape:cx="7.9912854"
     inkscape:cy="8"
     inkscape:current-layer="svg390">
    <inkscape:grid
       type="xygrid"
       id="grid617" />
  </sodipodi:namedview>
  <linearGradient
     id="a">
    <stop
       offset="0"
       stop-color="#2a7fff"
       id="stop344" />
    <stop
       offset="1"
       stop-color="#66a4ff"
       id="stop346" />
  </linearGradient>
  <linearGradient
     id="b"
     gradientTransform="matrix(.69231067 0 0 .714285 -3.49998 -2.499975)"
     gradientUnits="userSpaceOnUse"
     x1="13.53"
     x2="13.53"
     xlink:href="#f"
     y1="3.5"
     y2="8.75" />
  <linearGradient
     id="c"
     gradientUnits="userSpaceOnUse"
     x1="10.5"
     x2=".5"
     xlink:href="#a"
     y1="11.5"
     y2=".5" />
  <linearGradient
     id="d"
     gradientUnits="userSpaceOnUse"
     x1="14.5"
     x2="4.5"
     xlink:href="#a"
     y1="15.5"
     y2="4.5" />
  <linearGradient
     id="e"
     gradientTransform="matrix(.69231067 0 0 .714285 .50002 1.500025)"
     gradientUnits="userSpaceOnUse"
     x1="13.53"
     x2="13.53"
     xlink:href="#f"
     y1="3.5"
     y2="8.75" />
  <linearGradient
     id="f"
     gradientTransform="matrix(.69231067 0 0 .714285 -3.49998 -2.499975)"
     gradientUnits="userSpaceOnUse"
     x1="13.53"
     x2="13.53"
     y1="3.5"
     y2="8.75">
    <stop
       offset="0"
       stop-color="#ececec"
       id="stop353" />
    <stop
       offset="1"
       stop-color="#b7bec8"
       id="stop355" />
  </linearGradient>
  <g
     stroke-width="1.3484"
     id="g364">
    <path
       d="m-.00000003 0h9.90000013l1.0999999 1.125v10.875h-11.00000003z"
       fill="url(#c)"
       fill-rule="evenodd"
       id="path358" />
    <rect
       fill="#fff"
       height="6"
       rx=".366667"
       width="8"
       x="1.5"
       y="5"
       id="rect360" />
    <path
       d="m3 0v4h6v-4zm3.5 1h1.5v2h-1.5z"
       fill="url(#b)"
       fill-rule="evenodd"
       id="path362" />
  </g>
  <g
     fill="none"
     id="g372">
    <path
       d="m2.5000001 6.5h5.9999999"
       stroke="#e6e6e6"
       stroke-width=".999997"
       id="path366" />
    <path
       d="m2.5000001 8.5h5.9999999"
       stroke="#e6e6e6"
       stroke-width=".999997"
       id="path368" />
    <path
       d="m1.5 10.5h8"
       stroke="#f60"
       id="path370" />
  </g>
  <g
     stroke-width="1.3484"
     id="g380">
    <path
       d="m4 4h9.9l1.1 1.125v10.875h-11z"
       fill="url(#d)"
       fill-rule="evenodd"
       id="path374" />
    <rect
       fill="#fff"
       height="6"
       rx=".366667"
       width="8"
       x="5.5"
       y="9"
       id="rect376" />
    <path
       d="m7 4v4h6v-4zm3.5 1h1.5v2h-1.5z"
       fill="url(#e)"
       fill-rule="evenodd"
       id="path378" />
  </g>
  <g
     fill="none"
     id="g388">
    <path
       d="m6.5000001 10.5h5.9999999"
       stroke="#e6e6e6"
       stroke-width=".999997"
       id="path382" />
    <path
       d="m6.5000001 12.5h5.9999999"
       stroke="#e6e6e6"
       stroke-width=".999997"
       id="path384" />
    <path
       d="m5.5 14.5h8"
       stroke="#f60"
       id="path386" />
  </g>
</svg>
