<?xml version="1.0" encoding="UTF-8" standalone="no"?>
<svg
   height="24"
   width="24"
   version="1.1"
   id="svg1465"
   sodipodi:docname="landscape_24.svg"
   inkscape:version="1.2 (dc2aedaf03, 2022-05-15)"
   inkscape:export-filename="landscape_24.png"
   inkscape:export-xdpi="96"
   inkscape:export-ydpi="96"
   xmlns:inkscape="http://www.inkscape.org/namespaces/inkscape"
   xmlns:sodipodi="http://sodipodi.sourceforge.net/DTD/sodipodi-0.dtd"
   xmlns="http://www.w3.org/2000/svg"
   xmlns:svg="http://www.w3.org/2000/svg">
  <defs
     id="defs1469">
    <radialGradient
       id="a"
       cx="9.1740294"
       cy="7.8253603"
       gradientTransform="matrix(0.66909781,-2.2758851e-8,4.5190518e-8,0.58542853,1.8616763,4.291566)"
       gradientUnits="userSpaceOnUse"
       r="7.5"
       fx="9.1740294"
       fy="7.8253603">
      <stop
         offset="0"
         stop-color="#fff"
         id="stop2" />
      <stop
         offset="1"
         stop-color="#8fc1c7"
         id="stop4" />
    </radialGradient>
  </defs>
  <sodipodi:namedview
     id="namedview1467"
     pagecolor="#ffffff"
     bordercolor="#666666"
     borderopacity="1.0"
     inkscape:pageshadow="2"
     inkscape:pageopacity="0.0"
     inkscape:pagecheckerboard="0"
     inkscape:deskcolor="#d1d1d1"
     showgrid="true"
     inkscape:zoom="38.25"
     inkscape:cx="11.346405"
     inkscape:cy="12.013072"
     inkscape:current-layer="svg1465"
     showguides="true"
     inkscape:showpageshadow="2"
     inkscape:window-width="2560"
     inkscape:window-height="1009"
     inkscape:window-x="-8"
     inkscape:window-y="-8"
     inkscape:window-maximized="1">
    <inkscape:grid
       type="xygrid"
       id="grid1588" />
  </sodipodi:namedview>
  <g
     id="g2766"
     transform="matrix(0,-1,-1,0,24,24)">
    <path
       d="M 3.75,23.25 V 0.75 H 15 L 20.25,6 v 17.25 z"
       id="path1449"
       style="fill:none;stroke:#00aad4;stroke-width:1.5;stroke-linecap:round;stroke-linejoin:round"
       sodipodi:nodetypes="cccccc" />
    <path
       d="M 14.75,1 V 6.249999 H 20"
       id="path1453"
       style="fill:none;stroke:#00aad4;stroke-width:1.5;stroke-linecap:round;stroke-linejoin:round"
       sodipodi:nodetypes="ccc" />
  </g>
</svg>
