<?xml version="1.0" encoding="UTF-8" standalone="no"?>
<svg
   height="16"
   width="16"
   version="1.1"
   id="svg315"
   sodipodi:docname="Paperclip_01_16.svg"
   inkscape:export-filename="Paperclip_01_16.png"
   inkscape:export-xdpi="96"
   inkscape:export-ydpi="96"
   inkscape:version="1.2 (dc2aedaf03, 2022-05-15)"
   xml:space="preserve"
   xmlns:inkscape="http://www.inkscape.org/namespaces/inkscape"
   xmlns:sodipodi="http://sodipodi.sourceforge.net/DTD/sodipodi-0.dtd"
   xmlns="http://www.w3.org/2000/svg"
   xmlns:svg="http://www.w3.org/2000/svg"><defs
     id="defs319" /><sodipodi:namedview
     id="namedview317"
     pagecolor="#ffffff"
     bordercolor="#666666"
     borderopacity="1.0"
     inkscape:pageshadow="2"
     inkscape:pageopacity="0.0"
     inkscape:pagecheckerboard="0"
     inkscape:deskcolor="#d1d1d1"
     showgrid="true"
     inkscape:zoom="57.375"
     inkscape:cx="7.9912854"
     inkscape:cy="8"
     inkscape:current-layer="svg315"
     inkscape:showpageshadow="2"
     showguides="true"
     inkscape:lockguides="false"><inkscape:grid
       type="xygrid"
       id="grid983" /></sodipodi:namedview><path
     style="fill:none;stroke:#00aad4;stroke-width:1.25;stroke-linecap:round;stroke-linejoin:round;stroke-dashoffset:1.49998;stroke-opacity:1"
     d="M 11.021705,3.5743006 4.3041894,10.291815 c -0.4881553,0.488156 -0.4881553,1.279612 -1e-7,1.767768 0.4881554,0.488155 1.2796115,0.488155 1.7677669,0 L 12.789471,5.3420683 c 0.976311,-0.9763109 0.976311,-2.5592232 0,-3.535534 -0.97631,-0.97631072 -2.559223,-0.97631079 -3.5355342,0 L 2.5364224,8.5240487 c -1.4644661,1.4644661 -1.4644661,3.8388353 0,5.3033013 1.4644662,1.464466 3.8388348,1.464466 5.3033009,0 L 14.557238,7.1098352"
     id="path1148"
     sodipodi:nodetypes="ccsccsccscc" /></svg>
