<?xml version="1.0" encoding="UTF-8" standalone="no"?>
<svg
   height="32"
   width="32"
   version="1.1"
   id="svg429"
   sodipodi:docname="dialog_information.svg"
   inkscape:export-filename="dialog_information.png"
   inkscape:export-xdpi="96"
   inkscape:export-ydpi="96"
   inkscape:version="1.2.1 (9c6d41e410, 2022-07-14)"
   xmlns:inkscape="http://www.inkscape.org/namespaces/inkscape"
   xmlns:sodipodi="http://sodipodi.sourceforge.net/DTD/sodipodi-0.dtd"
   xmlns="http://www.w3.org/2000/svg"
   xmlns:svg="http://www.w3.org/2000/svg">
  <defs
     id="defs433" />
  <sodipodi:namedview
     id="namedview431"
     pagecolor="#ffffff"
     bordercolor="#666666"
     borderopacity="1.0"
     inkscape:showpageshadow="2"
     inkscape:pageopacity="0.0"
     inkscape:pagecheckerboard="0"
     inkscape:deskcolor="#d1d1d1"
     showgrid="true"
     inkscape:zoom="28.6875"
     inkscape:cx="15.982571"
     inkscape:cy="16"
     inkscape:current-layer="svg429">
    <inkscape:grid
       type="xygrid"
       id="grid1857" />
  </sodipodi:namedview>
  <linearGradient
     id="a"
     gradientUnits="userSpaceOnUse"
     x1="16.5000008"
     x2="24.03846317692"
     y1="9.53846247692"
     y2="26.76923133846">
    <stop
       offset="0"
       stop-color="#fff"
       id="stop420" />
    <stop
       offset="1"
       stop-color="#acf"
       id="stop422" />
  </linearGradient>
  <circle
     cx="16.5"
     cy="16"
     r="14"
     style="fill-rule:evenodd;stroke:#0055d4;stroke-width:2;stroke-linecap:round;stroke-linejoin:round;stroke-opacity:.954902;fill:url(#a)"
     id="circle425" />
  <path
     d="m7.096947 4.9838868-.0000002-1.6105962 1.806106.0000002.0000002 1.6105961zm-.0000003 8.0529782.0000003-6.9792477 1.806106.0000001-.0000003 6.9792476z"
     fill="#0055d4"
     transform="matrix(1.6610321 0 0 1.8626649 3.211744 .71669)"
     id="path427" />
</svg>
