<svg width="16" height="16" version="1.1" xmlns="http://www.w3.org/2000/svg">
 <g stroke="#ff7f00" stroke-linecap="round" stroke-linejoin="round" stroke-width=".999997">
  <ellipse transform="matrix(0,1,1,0,0,0)" cx="11.5" cy="11.500002" rx="4.0000014" ry="4" fill="#ffffff" stroke-dashoffset="1.49998"/>
  <path d="M 10.799999,9.7439014 12.799898,11.5 10.799999,13.256098" fill="none"/>
 </g>
</svg>
