<?xml version="1.0" encoding="UTF-8" standalone="no"?>
<svg
   width="48"
   height="48"
   version="1.1"
   viewBox="0 0 48 48"
   id="svg5"
   sodipodi:docname="tdatetimeintervalchartsource_200.svg"
   inkscape:version="1.3.2 (091e20e, 2023-11-25, custom)"
   xmlns:inkscape="http://www.inkscape.org/namespaces/inkscape"
   xmlns:sodipodi="http://sodipodi.sourceforge.net/DTD/sodipodi-0.dtd"
   xmlns="http://www.w3.org/2000/svg"
   xmlns:svg="http://www.w3.org/2000/svg">
  <defs
     id="defs5" />
  <sodipodi:namedview
     id="namedview5"
     pagecolor="#ffffff"
     bordercolor="#000000"
     borderopacity="0.25"
     inkscape:showpageshadow="2"
     inkscape:pageopacity="0.0"
     inkscape:pagecheckerboard="0"
     inkscape:deskcolor="#d1d1d1"
     showgrid="true"
     inkscape:current-layer="svg5">
    <inkscape:grid
       id="grid5"
       units="px"
       originx="0"
       originy="0"
       spacingx="0.5"
       spacingy="0.5"
       empcolor="#0099e5"
       empopacity="0.30196078"
       color="#0099e5"
       opacity="0.14901961"
       empspacing="2"
       dotted="false"
       gridanglex="30"
       gridanglez="30"
       visible="true" />
  </sodipodi:namedview>
  <rect
     x="2.5"
     y="2.5"
     width="43"
     height="43"
     fill="#ffffff"
     fill-rule="evenodd"
     stroke="#2a7efe"
     stroke-linecap="square"
     stroke-linejoin="round"
     style="paint-order:normal"
     id="rect1" />
  <path
     d="m7.1 26.4 5.9-10.4 4 17 7-5 6.9 12.9"
     fill="none"
     stroke="#2a7efe"
     stroke-linecap="round"
     stroke-linejoin="round"
     stroke-width="2.2"
     id="path1" />
  <path
     d="m7 10v31h31"
     fill="none"
     stroke="#4d4d4d"
     stroke-linecap="round"
     stroke-linejoin="round"
     stroke-width="2"
     id="path2" />
  <rect
     x="20.489468"
     y="8.4894238"
     width="23.021063"
     height="22.021097"
     fill="#ffffff"
     stroke="#999999"
     stroke-linecap="round"
     stroke-width=".978936"
     style="paint-order:normal"
     id="rect2" />
  <path
     d="m22 4h19.999966a2.0000348 2.0000348 0 0 1 2.000034 2v4h-24v-4a2 2 0 0 1 2-2z"
     fill="#d40000"
     style="paint-order:normal"
     id="path3" />
  <path
     d="m28.804132 25.178v-10.3562l-3.08221 1.9726"
     fill="none"
     stroke="#4d4d4d"
     stroke-linecap="round"
     stroke-linejoin="round"
     stroke-width="1.64384"
     id="path4" />
  <path
     d="m36.320548 14.822-3.397952 6.2162m-0.300678 1.181c0-1.3618 1.103954-2.4658 2.465754-2.4658 1.361798 0 2.465752 1.104 2.465752 2.4658v0.4932c0 1.3616-1.103954 2.4656-2.465752 2.4656-1.3618 0-2.465754-1.104-2.465754-2.4656z"
     fill="none"
     stroke="#4d4d4d"
     stroke-linecap="round"
     stroke-linejoin="round"
     stroke-width="1.64384"
     id="path5" />
</svg>
