<?xml version="1.0" encoding="UTF-8" standalone="no"?>
<svg
   width="32"
   height="32"
   version="1.1"
   viewBox="0 0 32 32"
   id="svg33"
   sodipodi:docname="Database_22_32.svg"
   inkscape:export-filename="Database_22_32.png"
   inkscape:export-xdpi="96"
   inkscape:export-ydpi="96"
   inkscape:version="1.3.2 (091e20e, 2023-11-25, custom)"
   xmlns:inkscape="http://www.inkscape.org/namespaces/inkscape"
   xmlns:sodipodi="http://sodipodi.sourceforge.net/DTD/sodipodi-0.dtd"
   xmlns:xlink="http://www.w3.org/1999/xlink"
   xmlns="http://www.w3.org/2000/svg"
   xmlns:svg="http://www.w3.org/2000/svg">
  <sodipodi:namedview
     id="namedview33"
     pagecolor="#ffffff"
     bordercolor="#000000"
     borderopacity="0.25"
     inkscape:showpageshadow="2"
     inkscape:pageopacity="0.0"
     inkscape:pagecheckerboard="0"
     inkscape:deskcolor="#d1d1d1"
     showgrid="true"
     inkscape:current-layer="svg33">
    <inkscape:grid
       id="grid33"
       units="px"
       originx="0"
       originy="0"
       spacingx="0.5"
       spacingy="0.5"
       empcolor="#0099e5"
       empopacity="0.30196078"
       color="#0099e5"
       opacity="0.14901961"
       empspacing="2"
       dotted="false"
       gridanglex="30"
       gridanglez="30"
       visible="true" />
  </sodipodi:namedview>
  <defs
     id="defs3">
    <linearGradient
       id="o"
       x1="52.5"
       x2="61.5"
       y1="7"
       y2="7"
       gradientTransform="matrix(1.4580246,0,0,-1.1407345,-58.918306,35.429228)"
       gradientUnits="userSpaceOnUse">
      <stop
         stop-color="#fc0"
         offset="0"
         id="stop1" />
      <stop
         stop-color="#f9f9f9"
         offset=".37840304"
         id="stop2" />
      <stop
         stop-color="#ffd42a"
         offset="1"
         id="stop3" />
    </linearGradient>
    <filter
       id="p"
       x="-0.11416538"
       y="-0.15622631"
       width="1.2283308"
       height="1.259821"
       color-interpolation-filters="sRGB">
      <feGaussianBlur
         stdDeviation="0.20503125"
         id="feGaussianBlur3" />
    </filter>
  </defs>
  <linearGradient
     id="a"
     x1="4.000001"
     x2="26.000001"
     y1="10"
     y2="10"
     gradientTransform="translate(1)"
     gradientUnits="userSpaceOnUse"
     xlink:href="#b" />
  <linearGradient
     id="b">
    <stop
       stop-color="#2de3e3"
       offset="0"
       id="stop4" />
    <stop
       stop-color="#71ffff"
       offset=".23818764"
       id="stop5" />
    <stop
       stop-color="#08b9b9"
       offset=".48656252"
       id="stop6" />
    <stop
       stop-color="#08cfcf"
       offset=".6837101"
       id="stop7" />
    <stop
       stop-color="#079a9a"
       offset=".86378187"
       id="stop8" />
    <stop
       stop-color="#07cccc"
       offset="1"
       id="stop9" />
  </linearGradient>
  <linearGradient
     id="c"
     x1="4.000001"
     x2="26.000001"
     y1="16"
     y2="16"
     gradientTransform="translate(1)"
     gradientUnits="userSpaceOnUse"
     xlink:href="#b" />
  <linearGradient
     id="d"
     x1="4.000001"
     x2="26.000001"
     y1="20.245838"
     y2="20.245838"
     gradientTransform="translate(1)"
     gradientUnits="userSpaceOnUse"
     xlink:href="#e" />
  <linearGradient
     id="e">
    <stop
       stop-color="#999999"
       offset="0"
       id="stop10" />
    <stop
       stop-color="#f8f8f8"
       offset=".23818764"
       id="stop11" />
    <stop
       stop-color="#868684"
       offset=".48656252"
       id="stop12" />
    <stop
       stop-color="#b2b2b2"
       offset=".6837101"
       id="stop13" />
    <stop
       stop-color="#4f4f4f"
       offset=".86378187"
       id="stop14" />
    <stop
       stop-color="#858585"
       offset="1"
       id="stop15" />
  </linearGradient>
  <linearGradient
     id="f"
     x1="4.000001"
     x2="26.000001"
     y1="26.245838"
     y2="26.245838"
     gradientTransform="translate(1)"
     gradientUnits="userSpaceOnUse"
     xlink:href="#e" />
  <linearGradient
     id="g"
     x1="4.000001"
     x2="26.000001"
     y1="22"
     y2="22"
     gradientTransform="translate(1)"
     gradientUnits="userSpaceOnUse"
     xlink:href="#b" />
  <linearGradient
     id="h"
     x1="4.000001"
     x2="26.000001"
     y1="23"
     y2="23"
     gradientTransform="translate(1)"
     gradientUnits="userSpaceOnUse"
     xlink:href="#i" />
  <linearGradient
     id="i">
    <stop
       stop-color="#9d9d9d"
       offset="0"
       id="stop16" />
    <stop
       stop-color="#808080"
       offset="1"
       id="stop17" />
  </linearGradient>
  <linearGradient
     id="j"
     x1="4.000001"
     x2="26.000001"
     y1="14.245838"
     y2="14.245838"
     gradientTransform="translate(1)"
     gradientUnits="userSpaceOnUse"
     xlink:href="#e" />
  <linearGradient
     id="k"
     x1="4.000001"
     x2="26.000001"
     y1="17"
     y2="17"
     gradientTransform="translate(1)"
     gradientUnits="userSpaceOnUse"
     xlink:href="#i" />
  <linearGradient
     id="l"
     x1="4.000001"
     x2="26.000001"
     y1="8.245838"
     y2="8.245838"
     gradientTransform="translate(1)"
     gradientUnits="userSpaceOnUse"
     xlink:href="#e" />
  <linearGradient
     id="m"
     x1="4.000001"
     x2="26.000001"
     y1="5"
     y2="5"
     gradientTransform="translate(1)"
     gradientUnits="userSpaceOnUse">
    <stop
       stop-color="#b0b0b0"
       offset="0"
       id="stop18" />
    <stop
       stop-color="#cbcbcb"
       offset="1"
       id="stop19" />
  </linearGradient>
  <linearGradient
     id="n"
     x1="11.000001"
     x2="14.000001"
     y1="13"
     y2="9"
     gradientTransform="translate(1)"
     gradientUnits="userSpaceOnUse"
     xlink:href="#i" />
  <ellipse
     cx="16"
     cy="11"
     rx="11"
     ry="2"
     fill="url(#n)"
     id="ellipse19" />
  <ellipse
     cx="16"
     cy="5"
     rx="11"
     ry="2"
     fill="url(#m)"
     id="ellipse20" />
  <path
     d="m16 10c-6.0751313 0-11-0.89543-11-2v-3c0 1.10457 4.9248687 2 11 2 6.075133 0 11-0.89543 11-2v3c0 1.10457-4.924867 2-11 2z"
     fill="url(#l)"
     stroke-linecap="round"
     stroke-width=".1"
     id="path20" />
  <ellipse
     cx="16"
     cy="17"
     rx="11"
     ry="2"
     fill="url(#k)"
     id="ellipse21" />
  <path
     d="m16 16c-6.0751331 0-11-0.89543-11-2v-3c0 1.10457 4.9248687 2 11 2 6.075133 0 11-0.89543 11-2v3c-2e-6 1.10457-4.924867 2-11 2z"
     fill="url(#j)"
     stroke-linecap="round"
     stroke-width=".1"
     id="path21" />
  <ellipse
     cx="16"
     cy="23"
     rx="11"
     ry="2"
     fill="url(#h)"
     id="ellipse22" />
  <path
     d="m 6.0000008,20.828126 v 2 C 8.0000007,23.982826 12,24.2 16,24.2 c 4.000002,0 8.000001,-0.2 10.000001,-1.371874 v -2 C 24.265024,21.518012 20.444919,22 16,22 11.555083,22 7.7349759,21.518012 6.0000008,20.828126 Z"
     fill="url(#g)"
     stroke-linecap="round"
     stroke-width=".1"
     id="path22" />
  <path
     d="m16 28c-6.0751331 0-11-0.89543-11-2v-3c0 1.10457 4.9248687 2 11 2 6.075133 0 11-0.89543 11-2v3c-2e-6 1.10457-4.924867 2-11 2z"
     fill="url(#f)"
     stroke-linecap="round"
     stroke-width=".1"
     id="path23" />
  <path
     d="m16 22c-6.0751331 0-11-0.89543-11-2v-3c0 1.10457 4.9248687 2 11 2 6.075133 0 11-0.89543 11-2v3c-2e-6 1.10457-4.924867 2-11 2z"
     fill="url(#d)"
     stroke-linecap="round"
     stroke-width=".1"
     id="path24" />
  <path
     d="m16 7.320008c-11 0-11-2.320008-11-2.320008s0 1.799992 11 1.799992 11-1.799992 11-1.799992 0 2.320008-11 2.320008z"
     fill="#e6e6e6"
     stroke-linecap="round"
     stroke-width=".1"
     id="path25" />
  <path
     d="m16 25.320008c-11 0-11-2.320008-11-2.320008s0 1.79999 11 1.79999 11-1.79999 11-1.79999 0 2.320008-11 2.320008z"
     fill="#e6e6e6"
     stroke-linecap="round"
     stroke-width=".1"
     id="path26" />
  <path
     d="m16 19.320008c-11 0-11-2.320008-11-2.320008s0 1.799992 11 1.799992 11-1.799992 11-1.799992 0 2.320008-11 2.320008z"
     fill="#e6e6e6"
     stroke-linecap="round"
     stroke-width=".1"
     id="path27" />
  <path
     d="m16 13.320008c-11 0-11-2.320008-11-2.320008s0 1.799992 11 1.799992 11-1.799992 11-1.799992 0 2.320008-11 2.320008z"
     fill="#e6e6e6"
     stroke-linecap="round"
     stroke-width=".1"
     id="path28" />
  <path
     d="m 6.0000008,14.828126 v 2 C 8.0000007,17.982826 12,18.2 16,18.2 c 4.000002,0 8.000001,-0.2 10.000001,-1.371874 v -2 C 24.265024,15.518012 20.444919,16 16,16 11.555083,16 7.7349759,15.518012 6.0000008,14.828126 Z"
     fill="url(#c)"
     stroke-linecap="round"
     stroke-width=".1"
     id="path29" />
  <path
     d="m 6.0000008,8.828126 v 2 C 8.0000007,11.982826 12,12.2 16,12.2 c 4.000002,0 8.000001,-0.2 10.000001,-1.371874 v -2 C 24.265024,9.518012 20.444919,10 16,10 11.555083,10 7.7349759,9.518012 6.0000008,8.828126 Z"
     fill="url(#a)"
     stroke-linecap="round"
     stroke-width=".1"
     id="path30" />
  <path
     d="m19.625 23v-2.264609c0-2.684318 2.182611-4.860391 4.875-4.860391s4.875 2.176073 4.875 4.860391v2.264609"
     fill="none"
     stroke="#b3b3b3"
     stroke-linejoin="round"
     stroke-width="2.25"
     id="path31" />
  <path
     transform="matrix(1.5,0,0,1.5,1.9999995,1.2499995)"
     d="m11.75 14.5v-1.509739c0-1.789546 1.455074-3.240261 3.25-3.240261s3.25 1.450715 3.25 3.240261v1.509739"
     fill="none"
     filter="url(#p)"
     stroke="#ffffff"
     stroke-linejoin="round"
     stroke-width=".5"
     id="path32" />
  <path
     d="m31.548487 31.548487v-8.096972h-14.096972v8.096972z"
     fill="url(#o)"
     stroke="#d4aa00"
     stroke-linecap="round"
     stroke-linejoin="round"
     stroke-width=".903027"
     id="path33" />
</svg>
