<?xml version="1.0" encoding="UTF-8" standalone="no"?>
<svg
   height="32"
   width="32"
   version="1.1"
   id="svg193"
   sodipodi:docname="Open_01_32.svg"
   inkscape:export-filename="Open_01_32.png"
   inkscape:export-xdpi="96"
   inkscape:export-ydpi="96"
   inkscape:version="1.2-beta (1b65182ce9, 2022-04-05)"
   xmlns:inkscape="http://www.inkscape.org/namespaces/inkscape"
   xmlns:sodipodi="http://sodipodi.sourceforge.net/DTD/sodipodi-0.dtd"
   xmlns="http://www.w3.org/2000/svg"
   xmlns:svg="http://www.w3.org/2000/svg">
  <defs
     id="defs197" />
  <sodipodi:namedview
     id="namedview195"
     pagecolor="#ffffff"
     bordercolor="#666666"
     borderopacity="1.0"
     inkscape:pageshadow="2"
     inkscape:pageopacity="0.0"
     inkscape:pagecheckerboard="0"
     inkscape:deskcolor="#d1d1d1"
     showgrid="true"
     inkscape:zoom="28.6875"
     inkscape:cx="15.982571"
     inkscape:cy="16"
     inkscape:current-layer="svg193">
    <inkscape:grid
       type="xygrid"
       id="grid1518" />
  </sodipodi:namedview>
  <linearGradient
     id="a"
     gradientUnits="userSpaceOnUse"
     x1="4.5"
     x2="5.5"
     y1="4.5"
     y2="9.5">
    <stop
       offset="0"
       stop-color="#ffeaa6"
       id="stop177" />
    <stop
       offset="1"
       stop-color="#e0ba58"
       id="stop179" />
  </linearGradient>
  <linearGradient
     id="b"
     gradientUnits="userSpaceOnUse"
     x1="6.5"
     x2="7"
     y1="8.5"
     y2="13.5">
    <stop
       offset="0"
       stop-color="#ffe9a3"
       id="stop182" />
    <stop
       offset="1"
       stop-color="#e3ba59"
       id="stop184" />
  </linearGradient>
  <g
     stroke="#d8872d"
     stroke-linejoin="round"
     stroke-width=".5"
     transform="matrix(2 0 0 2 0 -1)"
     id="g191">
    <path
       d="m1.25 13.75v-10.5h4.5l1 1.013332h7v9.486668z"
       fill="url(#a)"
       id="path187" />
    <path
       d="m15.25 6.25h-12.5l-1.5 7.5h12.5z"
       fill="url(#b)"
       id="path189" />
  </g>
</svg>
