<?xml version="1.0" encoding="UTF-8" standalone="no"?>
<svg
   height="16"
   width="16"
   version="1.1"
   id="svg16"
   sodipodi:docname="Camera_01_16.svg"
   inkscape:export-filename="Camera_01_16.png"
   inkscape:export-xdpi="96"
   inkscape:export-ydpi="96"
   inkscape:version="1.2-beta (1b65182ce9, 2022-04-05)"
   xmlns:inkscape="http://www.inkscape.org/namespaces/inkscape"
   xmlns:sodipodi="http://sodipodi.sourceforge.net/DTD/sodipodi-0.dtd"
   xmlns="http://www.w3.org/2000/svg"
   xmlns:svg="http://www.w3.org/2000/svg">
  <defs
     id="defs20" />
  <sodipodi:namedview
     id="namedview18"
     pagecolor="#ffffff"
     bordercolor="#666666"
     borderopacity="1.0"
     inkscape:pageshadow="2"
     inkscape:pageopacity="0.0"
     inkscape:pagecheckerboard="0"
     inkscape:deskcolor="#d1d1d1"
     showgrid="true"
     inkscape:zoom="57.375"
     inkscape:cx="7.6078431"
     inkscape:cy="8"
     inkscape:current-layer="svg16">
    <inkscape:grid
       type="xygrid"
       id="grid864" />
  </sodipodi:namedview>
  <g
     fill="none"
     stroke="#00aad4"
     id="g14">
    <g
       stroke-linecap="round"
       id="g8">
      <path
         d="m6 1.5c-.5539994 0-.8745841.4983363-1 1l-.5 2h-3c-.55399945 0-1 .4460006-1 1v7c0 .553999.44600055 1 1 1h13c.553999 0 1-.446001 1-1v-7c0-.5539994-.446001-1-1-1h-3l-.5-2c-.151934-.4821012-.446001-1-1-1z"
         stroke-linejoin="round"
         id="path2" />
      <circle
         cx="8"
         cy="8.5"
         r="3.25"
         stroke-linejoin="round"
         id="circle4" />
      <path
         d="m 2.5,6.5 v 5"
         id="path6"
         sodipodi:nodetypes="cc" />
    </g>
    <path
       d="m13.5 6v1"
       id="path10" />
    <path
       d="m7 3.5h2"
       stroke-linecap="round"
       id="path12" />
  </g>
</svg>
