<svg width="24" height="24" version="1.1" xmlns="http://www.w3.org/2000/svg">
 <g fill="none" stroke-linecap="round">
  <rect x="15.375" y="17.125" width="6.5" height="4.75" ry="2" stroke="#ffffff" stroke-linejoin="round" stroke-width="4.25"/>
  <rect x="7.125" y="17.125" width="6.5" height="4.75" ry="2" stroke="#ffffff" stroke-linejoin="round" stroke-width="4.25"/>
  <path d="m11 19.5h7" stroke="#ffffff" stroke-width="4.25"/>
  <rect x="15.375" y="17.125" width="6.5" height="4.75" ry="2" stroke="#00aad4" stroke-linejoin="round" stroke-width="1.25"/>
  <rect x="7.125" y="17.125" width="6.5" height="4.75" ry="2" stroke="#00aad4" stroke-linejoin="round" stroke-width="1.25"/>
  <path d="m11.5 19.5h6" stroke="#00aad4" stroke-width="1.75"/>
 </g>
</svg>
