<?xml version="1.0" encoding="UTF-8" standalone="no"?>
<svg
   height="16"
   width="16"
   version="1.1"
   id="svg3908"
   sodipodi:docname="table_item.svg"
   inkscape:version="1.2.2 (732a01da63, 2022-12-09)"
   xmlns:inkscape="http://www.inkscape.org/namespaces/inkscape"
   xmlns:sodipodi="http://sodipodi.sourceforge.net/DTD/sodipodi-0.dtd"
   xmlns="http://www.w3.org/2000/svg"
   xmlns:svg="http://www.w3.org/2000/svg">
  <defs
     id="defs3912" />
  <sodipodi:namedview
     id="namedview3910"
     pagecolor="#ffffff"
     bordercolor="#000000"
     borderopacity="0.25"
     inkscape:showpageshadow="2"
     inkscape:pageopacity="0.0"
     inkscape:pagecheckerboard="0"
     inkscape:deskcolor="#d1d1d1"
     showgrid="true"
     inkscape:zoom="56.875"
     inkscape:cx="7.9912088"
     inkscape:cy="8"
     inkscape:current-layer="svg3908">
    <inkscape:grid
       type="xygrid"
       id="grid4172" />
  </sodipodi:namedview>
  <rect
     fill="#ffefc3"
     height="13.000001"
     rx="1.5"
     stroke="#f99b05"
     stroke-linejoin="round"
     stroke-width=".999995"
     width="10.000001"
     x="3.499998"
     y="1.5"
     id="rect3900" />
  <g
     fill="#f00"
     stroke-width="1.05385"
     transform="matrix(.92151319 0 0 .97709924 42.418693 -1004.537114)"
     id="g3906">
    <path
       d="m-36.161167 1038.2263h-1.328125c-.0035-.191-.0052-.8188-.0052-.8605 0-.4305.07118-.7847.213541-1.0625.142361-.2777.427084-.5902.854167-.9375.427083-.3472.682292-.5746.765625-.6823.128472-.1701.192708-.3576.192708-.5625 0-.2847-.114583-.5277-.34375-.7291-.225694-.2049-.531249-.3073-.916666-.3073-.371528 0-.682292.1059-.932292.3177s-.421875.5347-.515625.9687l-1.34375-.1666c.03819-.6215.302082-1.1493.791667-1.5834.493055-.434 1.138889-.651 1.9375-.651.840277 0 1.50868.2205 2.005208.6615.496528.4375.744792.9479.744792 1.5312 0 .3229-.09201.6285-.276042.9167-.180555.2882-.569444.6806-1.166667 1.1771-.309027.2569-.501736.4635-.578125.6197-.07292.1563-.105903.9473-.09896 1.3501z"
       id="path3902" />
    <path
       d="m-37.621484 1040.6692v-1.5658h1.621484v1.5658z"
       id="path3904" />
  </g>
</svg>
