<?xml version="1.0" encoding="UTF-8" standalone="no"?>
<svg
   height="32"
   viewBox="0 0 32 32"
   width="32"
   version="1.1"
   id="svg2"
   sodipodi:docname="Repeat_05_32.svg"
   inkscape:export-filename="Repeat_05_32.png"
   inkscape:export-xdpi="96"
   inkscape:export-ydpi="96"
   inkscape:version="1.3.2 (091e20e, 2023-11-25, custom)"
   xmlns:inkscape="http://www.inkscape.org/namespaces/inkscape"
   xmlns:sodipodi="http://sodipodi.sourceforge.net/DTD/sodipodi-0.dtd"
   xmlns="http://www.w3.org/2000/svg"
   xmlns:svg="http://www.w3.org/2000/svg">
  <defs
     id="defs2" />
  <sodipodi:namedview
     id="namedview2"
     pagecolor="#ffffff"
     bordercolor="#000000"
     borderopacity="0.25"
     inkscape:showpageshadow="2"
     inkscape:pageopacity="0.0"
     inkscape:pagecheckerboard="0"
     inkscape:deskcolor="#d1d1d1"
     showgrid="true"
     inkscape:current-layer="svg2">
    <inkscape:grid
       id="grid2"
       units="px"
       originx="0"
       originy="0"
       spacingx="0.5"
       spacingy="0.5"
       empcolor="#0099e5"
       empopacity="0.30196078"
       color="#0099e5"
       opacity="0.14901961"
       empspacing="2"
       dotted="false"
       gridanglex="30"
       gridanglez="30"
       visible="true" />
  </sodipodi:namedview>
  <g
     stroke="#fa0302"
     stroke-linecap="round"
     stroke-linejoin="round"
     id="g2"
     transform="matrix(-1,0,0,1,31.998248,0)">
    <path
       d="M 25.998278,17.499516 A 9.9998446,9.9998446 0 0 1 19.810166,26.744383 9.9998446,9.9998446 0 0 1 8.9044956,24.547419 9.9998446,9.9998446 0 0 1 6.7785766,13.627677 9.9998446,9.9998446 0 0 1 16.063535,7.4998829"
       fill="none"
       stroke-width="3.59994"
       id="path1" />
    <path
       d="M 16.9998,2.0998698 V 12.899702 l 6.3999,-5.400029 z"
       fill="#fa0302"
       stroke-width="1.99997"
       id="path2" />
  </g>
</svg>
