<svg width="32" height="32" version="1.1" viewBox="0 0 32 32" xmlns="http://www.w3.org/2000/svg">
 <path d="m0.5 14v-4.5h31v4.5" fill="#e5e5e5" stroke="#2a7fff" stroke-linejoin="round"/>
 <path d="m10.5 8.5h11v4h10v17h-31v-17h10z" fill="#ffffff" stroke="#2a7fff" stroke-linejoin="round"/>
 <path d="m5.000001 16.999999h2" fill="none" stroke="#b3b3b3" stroke-linecap="square" stroke-linejoin="round" stroke-width="2"/>
 <path d="m12 16.999999h11" fill="none" stroke="#b3b3b3" stroke-linecap="square" stroke-linejoin="round" stroke-width="2"/>
 <path d="m5.000001 20.999999h2" fill="none" stroke="#b3b3b3" stroke-linecap="square" stroke-linejoin="round" stroke-width="2"/>
 <path d="m12 20.999999h14.999999" fill="none" stroke="#b3b3b3" stroke-linecap="square" stroke-linejoin="round" stroke-width="2"/>
 <path d="m5.000001 24.999999h2" fill="none" stroke="#b3b3b3" stroke-linecap="square" stroke-linejoin="round" stroke-width="2"/>
 <path d="m12 24.999999h12.999999" fill="none" stroke="#b3b3b3" stroke-linecap="square" stroke-linejoin="round" stroke-width="2"/>
 <circle cx="6.000001" cy="3.9999998" r="2.4999998" fill="#ff0000"/>
</svg>
