<svg width="36" height="36" version="1.1" xmlns="http://www.w3.org/2000/svg">
 <defs>
  <linearGradient id="b" x1="52.5" x2="61.5" y1="7" y2="7" gradientTransform="matrix(1.6548514,0,0,-1.4088407,-67.179396,40.29283)" gradientUnits="userSpaceOnUse">
   <stop stop-color="#fc0" offset="0"/>
   <stop stop-color="#f9f9f9" offset=".37840304"/>
   <stop stop-color="#ffd42a" offset="1"/>
  </linearGradient>
  <filter id="a" x="-.098814654" y="-.13810241" width="1.1976293" height="1.228012" color-interpolation-filters="sRGB">
   <feGaussianBlur stdDeviation="0.3109375"/>
  </filter>
 </defs>
 <g stroke-linejoin="round">
  <path d="m22.2 25v-2.44221c0-3.235168 2.596748-5.85779 5.8-5.85779s5.8 2.622623 5.8 5.85779v2.44221" fill="none" stroke="#b3b3b3" stroke-width="2.4"/>
  <path d="m22.2 25v-2.44221c0-3.235168 2.596748-5.85779 5.8-5.85779s5.8 2.622623 5.8 5.85779v2.44221" fill="none" filter="url(#a)" stroke="#ffffff" stroke-width=".8"/>
  <path d="m35.5 35.5v-10h-16v10z" fill="url(#b)" stroke="#d4aa00" stroke-linecap="round"/>
 </g>
</svg>
