<?xml version="1.0" encoding="UTF-8" standalone="no"?>
<svg
   height="16"
   width="16"
   version="1.1"
   id="svg38"
   sodipodi:docname="mirror_vertical.svg"
   inkscape:export-filename="mirror_vertical.png"
   inkscape:export-xdpi="96"
   inkscape:export-ydpi="96"
   inkscape:version="1.2.1 (9c6d41e410, 2022-07-14)"
   xmlns:inkscape="http://www.inkscape.org/namespaces/inkscape"
   xmlns:sodipodi="http://sodipodi.sourceforge.net/DTD/sodipodi-0.dtd"
   xmlns:xlink="http://www.w3.org/1999/xlink"
   xmlns="http://www.w3.org/2000/svg"
   xmlns:svg="http://www.w3.org/2000/svg">
  <defs
     id="defs42" />
  <sodipodi:namedview
     id="namedview40"
     pagecolor="#ffffff"
     bordercolor="#666666"
     borderopacity="1.0"
     inkscape:showpageshadow="2"
     inkscape:pageopacity="0.0"
     inkscape:pagecheckerboard="0"
     inkscape:deskcolor="#d1d1d1"
     showgrid="true"
     inkscape:zoom="57.375"
     inkscape:cx="7.7298475"
     inkscape:cy="8"
     inkscape:current-layer="svg38">
    <inkscape:grid
       type="xygrid"
       id="grid649" />
  </sodipodi:namedview>
  <linearGradient
     id="a">
    <stop
       offset="0"
       stop-color="#5f8dd3"
       id="stop2" />
    <stop
       offset="1"
       stop-color="#87aade"
       id="stop4" />
  </linearGradient>
  <linearGradient
     id="b"
     gradientUnits="userSpaceOnUse"
     x1="2"
     x2="5"
     xlink:href="#d"
     y1="5"
     y2="5" />
  <linearGradient
     id="c"
     gradientUnits="userSpaceOnUse"
     x1="1.5"
     x2="5.5"
     xlink:href="#a"
     y1="11"
     y2="11" />
  <linearGradient
     id="d">
    <stop
       offset="0"
       stop-color="#b9d6ff"
       id="stop9" />
    <stop
       offset="1"
       stop-color="#84a3df"
       id="stop11" />
  </linearGradient>
  <linearGradient
     id="e"
     gradientTransform="matrix(-1,0,0,1,9,0)"
     gradientUnits="userSpaceOnUse"
     x1="-5"
     x2="-2"
     xlink:href="#d"
     y1="5"
     y2="5" />
  <linearGradient
     id="f"
     gradientTransform="matrix(-1,0,0,1,9,0)"
     gradientUnits="userSpaceOnUse"
     x1="-5.5"
     x2="-1.5"
     xlink:href="#a"
     y1="11"
     y2="11" />
  <g
     id="g632"
     transform="rotate(90,8,8)">
    <path
       d="M 14.5,14 V 2 l -4,1 v 10 z"
       fill="url(#e)"
       fill-rule="evenodd"
       stroke="url(#f)"
       stroke-linejoin="round"
       stroke-opacity="0.976471"
       id="path16"
       style="fill:url(#e);stroke:url(#f)" />
    <path
       d="M 1.5,14 V 2 l 4,1 v 10 z"
       fill="url(#b)"
       fill-rule="evenodd"
       stroke="url(#c)"
       stroke-linejoin="round"
       stroke-opacity="0.976471"
       id="path18"
       style="fill:url(#b);stroke:url(#c)" />
    <g
       fill="none"
       stroke-linecap="round"
       transform="translate(0,0.5)"
       id="g36">
      <g
         stroke="#ffffff"
         stroke-width="3"
         id="g26">
        <path
           d="m 6.5,5.5 -3,2.5 3,2.5"
           stroke-linejoin="round"
           id="path20" />
        <path
           d="m 3.5,8 h 9"
           id="path22" />
        <path
           d="m 9.5,5.5 3,2.5 -3,2.5"
           stroke-linejoin="round"
           id="path24" />
      </g>
      <g
         stroke="#ff7f00"
         id="g34">
        <path
           d="m 6.5,5.5 -3,2.5 3,2.5"
           stroke-linejoin="round"
           id="path28" />
        <path
           d="m 3.5,8 h 9"
           id="path30" />
        <path
           d="m 9.5,5.5 3,2.5 -3,2.5"
           stroke-linejoin="round"
           id="path32" />
      </g>
    </g>
  </g>
</svg>
