<?xml version="1.0" encoding="UTF-8" standalone="no"?>
<svg
   height="64"
   viewBox="0 0 16.933333 16.933335"
   width="64"
   version="1.1"
   id="svg751"
   sodipodi:docname="Print_04_64.svg"
   inkscape:export-filename="Print_04_64.png"
   inkscape:export-xdpi="96"
   inkscape:export-ydpi="96"
   inkscape:version="1.2.1 (9c6d41e410, 2022-07-14)"
   xmlns:inkscape="http://www.inkscape.org/namespaces/inkscape"
   xmlns:sodipodi="http://sodipodi.sourceforge.net/DTD/sodipodi-0.dtd"
   xmlns="http://www.w3.org/2000/svg"
   xmlns:svg="http://www.w3.org/2000/svg">
  <defs
     id="defs755" />
  <sodipodi:namedview
     id="namedview753"
     pagecolor="#ffffff"
     bordercolor="#666666"
     borderopacity="1.0"
     inkscape:showpageshadow="2"
     inkscape:pageopacity="0.0"
     inkscape:pagecheckerboard="0"
     inkscape:deskcolor="#d1d1d1"
     showgrid="true"
     inkscape:zoom="14.34375"
     inkscape:cx="31.965142"
     inkscape:cy="32"
     inkscape:current-layer="svg751">
    <inkscape:grid
       type="xygrid"
       id="grid874" />
  </sodipodi:namedview>
  <g
     fill="none"
     transform="translate(-2.645833 -1.852241)"
     id="g749">
    <g
       stroke="#00aad4"
       stroke-width=".705562"
       id="g741">
      <path
         d="m6.8791973 9.0840744h-1.234737v1.2347366"
         stroke-linejoin="round"
         id="path729" />
      <path
         d="m6.7028056 10.054225v-4.67436h6.1736834v2.8222549"
         stroke-linecap="round"
         id="path731" />
      <path
         d="m14.99318 11.494751v2.704661h-2.777485m-3.4667544 0h-4.1628261v-4.056992h4.8566305"
         stroke-linecap="round"
         stroke-linejoin="round"
         id="path733" />
      <path
         d="m12.435511 12.700089h-.264586"
         stroke-linecap="round"
         stroke-linejoin="round"
         id="path735" />
      <path
         d="m7.9375427 6.9673832h3.7042093"
         id="path737" />
      <path
         d="m7.9375427 8.5549015h3.7042093"
         id="path739" />
    </g>
    <g
       stroke="#ff7f2a"
       stroke-linecap="round"
       transform="matrix(.70556373 0 0 .70556373 9.348493 8.554901)"
       id="g747">
      <path
         d="m10.78256 6.0000004a4.7825597 4.7815899 0 1 1 -9.5651191 0 4.7825597 4.7815899 0 1 1 9.5651191 0z"
         stroke-linejoin="round"
         stroke-width="1.43488"
         id="path743" />
      <path
         d="m10 10 3.25 3.25"
         stroke-width="2.5"
         id="path745" />
    </g>
  </g>
</svg>
