<?xml version="1.0" encoding="UTF-8" standalone="no"?>
<svg
   height="24"
   width="24"
   version="1.1"
   id="svg14"
   sodipodi:docname="Search_04_24.svg"
   inkscape:export-filename="Search_04_24.png"
   inkscape:export-xdpi="96"
   inkscape:export-ydpi="96"
   inkscape:version="1.2.1 (9c6d41e410, 2022-07-14)"
   xmlns:inkscape="http://www.inkscape.org/namespaces/inkscape"
   xmlns:sodipodi="http://sodipodi.sourceforge.net/DTD/sodipodi-0.dtd"
   xmlns="http://www.w3.org/2000/svg"
   xmlns:svg="http://www.w3.org/2000/svg">
  <defs
     id="defs18" />
  <sodipodi:namedview
     id="namedview16"
     pagecolor="#ffffff"
     bordercolor="#666666"
     borderopacity="1.0"
     inkscape:showpageshadow="2"
     inkscape:pageopacity="0.0"
     inkscape:pagecheckerboard="0"
     inkscape:deskcolor="#d1d1d1"
     showgrid="true"
     inkscape:zoom="38.25"
     inkscape:cx="11.986928"
     inkscape:cy="12"
     inkscape:current-layer="svg14">
    <inkscape:grid
       type="xygrid"
       id="grid982" />
  </sodipodi:namedview>
  <g
     fill="none"
     stroke="#00aad4"
     stroke-linecap="round"
     id="g12">
    <path
       d="m17.4 9.5000002a7.9 7.8991149 0 1 1 -15.7999999 0 7.9 7.8991149 0 1 1 15.7999999 0z"
       stroke-linejoin="round"
       stroke-width="1.2"
       id="path2" />
    <path
       d="m16 16 5.499999 5.500337"
       stroke-width="3.75"
       id="path4" />
    <g
       stroke-width="1.2"
       id="g10">
      <path
         d="m5.5 9.5h8"
         id="path6" />
      <path
         d="m9.5 5.5v8"
         id="path8" />
    </g>
  </g>
</svg>
