<?xml version="1.0" encoding="UTF-8" standalone="no"?>
<svg
   width="36"
   height="36"
   version="1.1"
   viewBox="0 0 36 36"
   id="svg13"
   sodipodi:docname="tdbchartsource_150.svg"
   inkscape:version="1.3.2 (091e20e, 2023-11-25, custom)"
   xmlns:inkscape="http://www.inkscape.org/namespaces/inkscape"
   xmlns:sodipodi="http://sodipodi.sourceforge.net/DTD/sodipodi-0.dtd"
   xmlns:xlink="http://www.w3.org/1999/xlink"
   xmlns="http://www.w3.org/2000/svg"
   xmlns:svg="http://www.w3.org/2000/svg">
  <sodipodi:namedview
     id="namedview13"
     pagecolor="#ffffff"
     bordercolor="#000000"
     borderopacity="0.25"
     inkscape:showpageshadow="2"
     inkscape:pageopacity="0.0"
     inkscape:pagecheckerboard="0"
     inkscape:deskcolor="#d1d1d1"
     showgrid="true"
     inkscape:current-layer="svg13">
    <inkscape:grid
       id="grid13"
       units="px"
       originx="0"
       originy="0"
       spacingx="0.5"
       spacingy="0.5"
       empcolor="#0099e5"
       empopacity="0.30196078"
       color="#0099e5"
       opacity="0.14901961"
       empspacing="2"
       dotted="false"
       gridanglex="30"
       gridanglez="30"
       visible="true" />
  </sodipodi:namedview>
  <defs
     id="defs6">
    <linearGradient
       id="a"
       x1="3"
       x2="13"
       y1="1040.8622"
       y2="1040.8622"
       gradientTransform="matrix(1.05 0 0 .99999999 15.6 -1024.6122)"
       gradientUnits="userSpaceOnUse"
       xlink:href="#b" />
    <linearGradient
       id="b">
      <stop
         stop-color="#4276c4"
         offset="0"
         id="stop1" />
      <stop
         stop-color="#80b3ff"
         offset=".2857143"
         id="stop2" />
      <stop
         stop-color="#04a"
         offset="1"
         id="stop3" />
    </linearGradient>
    <linearGradient
       id="c"
       x1="3"
       x2="13"
       y1="1040.8622"
       y2="1040.8622"
       gradientTransform="matrix(1.05 0 0 .99999999 15.6 -1027.6122)"
       gradientUnits="userSpaceOnUse"
       xlink:href="#b" />
    <linearGradient
       id="d"
       x1="3"
       x2="13"
       y1="1040.8622"
       y2="1040.8622"
       gradientTransform="matrix(1.05 0 0 .99999999 15.6 -1030.6122)"
       gradientUnits="userSpaceOnUse"
       xlink:href="#b" />
    <linearGradient
       id="e"
       x1="2.6896551"
       x2="13.310345"
       y1="1031.8622"
       y2="1031.8622"
       gradientTransform="matrix(.98863636 0 0 .84375002 16.09091 -863.38374)"
       gradientUnits="userSpaceOnUse">
      <stop
         stop-color="#4276c4"
         offset="0"
         id="stop4" />
      <stop
         stop-color="#80b3ff"
         offset=".28571427"
         id="stop5" />
      <stop
         stop-color="#04a"
         offset="1"
         id="stop6" />
    </linearGradient>
  </defs>
  <rect
     x="1.5"
     y="2.5"
     width="32"
     height="32"
     fill="#ffffff"
     fill-rule="evenodd"
     stroke="#2a7efe"
     stroke-linecap="square"
     stroke-linejoin="round"
     style="paint-order:normal"
     id="rect6" />
  <path
     d="m4.825 20.3 4.425-7.8 3 12.75 5.25-3.75 5.175 9.675"
     fill="none"
     stroke="#2a7efe"
     stroke-linecap="round"
     stroke-linejoin="round"
     stroke-width="1.65"
     id="path6" />
  <path
     d="m4.75 8v23.25h23.25"
     fill="none"
     stroke="#4d4d4d"
     stroke-linecap="round"
     stroke-linejoin="round"
     stroke-width="1.5"
     id="path7" />
  <ellipse
     cx="24"
     cy="16.25"
     rx="5.25"
     ry="1.5"
     fill="none"
     stroke="url(#a)"
     stroke-linecap="round"
     stroke-linejoin="round"
     stroke-width="1.5"
     id="ellipse7" />
  <ellipse
     cx="24"
     cy="14.75"
     rx="5.25"
     ry="1.5"
     fill="none"
     stroke="#ffffff"
     stroke-linecap="round"
     stroke-linejoin="round"
     stroke-width="1.5"
     id="ellipse8" />
  <ellipse
     cx="24"
     cy="13.25"
     rx="5.25"
     ry="1.5"
     fill="none"
     stroke="url(#c)"
     stroke-linecap="round"
     stroke-linejoin="round"
     stroke-width="1.5"
     id="ellipse9" />
  <ellipse
     cx="24"
     cy="11.75"
     rx="5.25"
     ry="1.5"
     fill="none"
     stroke="#ffffff"
     stroke-linecap="round"
     stroke-linejoin="round"
     stroke-width="1.5"
     id="ellipse10" />
  <ellipse
     cx="24"
     cy="10.25"
     rx="5.25"
     ry="1.5"
     fill="none"
     stroke="url(#d)"
     stroke-linecap="round"
     stroke-linejoin="round"
     stroke-width="1.5"
     id="ellipse11" />
  <ellipse
     cx="24"
     cy="8.75"
     rx="5.25"
     ry="1.5"
     fill="none"
     stroke="#ffffff"
     stroke-linecap="round"
     stroke-linejoin="round"
     stroke-width="1.5"
     id="ellipse12" />
  <ellipse
     cx="24"
     cy="7.25"
     rx="5.4375"
     ry="1.6875"
     fill="#80b3ff"
     fill-rule="evenodd"
     stroke="url(#e)"
     stroke-linecap="round"
     stroke-linejoin="round"
     stroke-width="1.125"
     id="ellipse13" />
</svg>
