<?xml version="1.0" encoding="UTF-8" standalone="no"?>
<svg
   width="32"
   height="32"
   version="1.0"
   id="svg195"
   inkscape:export-xdpi="96"
   inkscape:export-ydpi="96"
   inkscape:version="1.2.1 (9c6d41e410, 2022-07-14)"
   sodipodi:docname="pkg_compile_200.svg"
   inkscape:export-filename="pkg_compile_200.png"
   xmlns:inkscape="http://www.inkscape.org/namespaces/inkscape"
   xmlns:sodipodi="http://sodipodi.sourceforge.net/DTD/sodipodi-0.dtd"
   xmlns:xlink="http://www.w3.org/1999/xlink"
   xmlns="http://www.w3.org/2000/svg"
   xmlns:svg="http://www.w3.org/2000/svg">
  <sodipodi:namedview
     id="namedview197"
     pagecolor="#ffffff"
     bordercolor="#666666"
     borderopacity="1.0"
     inkscape:showpageshadow="2"
     inkscape:pageopacity="0.0"
     inkscape:pagecheckerboard="0"
     inkscape:deskcolor="#d1d1d1"
     showgrid="true"
     inkscape:zoom="28.6875"
     inkscape:cx="14.971678"
     inkscape:cy="16"
     inkscape:current-layer="svg195">
    <inkscape:grid
       type="xygrid"
       id="grid1136" />
  </sodipodi:namedview>
  <defs
     id="defs173">
    <linearGradient
       id="linearGradient1347"
       x1="8.837"
       x2="15.576"
       y1="7.8054"
       y2="10.838"
       gradientTransform="matrix(1.983 0 0 1.983 -.35541 .68892)"
       gradientUnits="userSpaceOnUse"
       xlink:href="#linearGradient933-3" />
    <linearGradient
       id="linearGradient933-3">
      <stop
         stop-color="#ffe991"
         offset="0"
         id="stop162" />
      <stop
         stop-color="#f5c400"
         offset="1"
         id="stop164" />
    </linearGradient>
    <linearGradient
       id="linearGradient1351"
       x1="8.837"
       x2="15.576"
       y1="7.8013"
       y2="10.834"
       gradientTransform="matrix(-1.983 0 0 1.983 33.356 .69694)"
       gradientUnits="userSpaceOnUse"
       xlink:href="#linearGradient933-3" />
    <linearGradient
       id="linearGradient1355"
       x1="1.4239"
       x2="15.576"
       y1="4.4317"
       y2="4.4317"
       gradientTransform="matrix(-1.983 0 0 1.983 33.356 .69694)"
       gradientUnits="userSpaceOnUse">
      <stop
         stop-color="#ffe478"
         offset="0"
         id="stop168" />
      <stop
         stop-color="#fff2c0"
         offset="1"
         id="stop170" />
    </linearGradient>
  </defs>
  <g
     stroke-width="1.6"
     id="g193">
    <g
       stroke="#ccaa00"
       stroke-linejoin="round"
       id="g181">
      <path
         d="m16.5 16.552 14.7-7.0674v12.695l-14.7 8.0179z"
         fill="url(#linearGradient1347)"
         id="path175" />
      <path
         d="m16.5 16.166-14.7-6.6816v12.695l14.7 8.0179z"
         fill="url(#linearGradient1351)"
         id="path177" />
      <path
         d="m16.5 2.803-14.7 6.6816 14.7 6.6816 14.7-6.6816z"
         fill="url(#linearGradient1355)"
         id="path179" />
    </g>
    <g
       fill="none"
       stroke="#5f8dd3"
       stroke-linecap="round"
       id="g191">
      <path
         d="m9.6846 6.0101 15.115 6.6157"
         id="path183" />
      <path
         d="m8.2 12.626 15.115-6.6157"
         id="path185" />
      <path
         d="m8.2 12.626v12.962"
         id="path187" />
      <path
         d="m24.8 12.626v12.962"
         id="path189" />
    </g>
  </g>
  <path
     d="m 17.74081,14.38215 0.654953,2.570062 -1.441952,1.442352 -2.57345,-0.654375 -0.780402,1.884056 2.282417,1.356993 -2.83e-4,2.039509 -2.280429,1.354186 0.780485,1.884257 2.570062,-0.65495 1.442352,1.441949 -0.654375,2.57345 1.884055,0.780402 1.356993,-2.282417 2.03951,2.83e-4 1.354186,2.280431 1.884257,-0.780484 -0.654949,-2.570063 1.441949,-1.442351 2.573451,0.654373 0.780401,-1.884056 -2.282418,-1.35699 2.84e-4,-2.039509 2.280429,-1.354189 -0.780484,-1.884257 -2.570062,0.654952 -1.442351,-1.441952 0.654374,-2.57345 -1.884056,-0.780402 -1.356991,2.282417 -2.03951,-2.83e-4 -1.354189,-2.280429 z m 3.088463,4.791466 a 3.0592582,3.0592581 0 0 1 3.997113,1.655657 3.0592582,3.0592581 0 0 1 -1.655658,3.997115 3.0592582,3.0592581 0 0 1 -3.997113,-1.65566 3.0592582,3.0592581 0 0 1 1.655658,-3.997112 z"
     fill="#3771c8"
     id="path780"
     style="stroke:#ffffff;stroke-width:3.2;stroke-linejoin:round;stroke-dasharray:none;stroke-opacity:1;paint-order:stroke fill markers" />
</svg>
