<?xml version="1.0" encoding="UTF-8" standalone="no"?>
<svg
   height="16"
   viewBox="0 0 4.2333332 4.2333335"
   width="16"
   version="1.1"
   id="svg2"
   sodipodi:docname="Window_05_16.svg"
   inkscape:version="1.2.1 (9c6d41e410, 2022-07-14)"
   inkscape:export-filename="Window_05_16.png"
   inkscape:export-xdpi="96"
   inkscape:export-ydpi="96"
   xmlns:inkscape="http://www.inkscape.org/namespaces/inkscape"
   xmlns:sodipodi="http://sodipodi.sourceforge.net/DTD/sodipodi-0.dtd"
   xmlns="http://www.w3.org/2000/svg"
   xmlns:svg="http://www.w3.org/2000/svg">
  <defs
     id="defs6" />
  <sodipodi:namedview
     id="namedview4"
     pagecolor="#ffffff"
     bordercolor="#666666"
     borderopacity="1.0"
     inkscape:showpageshadow="2"
     inkscape:pageopacity="0.0"
     inkscape:pagecheckerboard="0"
     inkscape:deskcolor="#d1d1d1"
     showgrid="true"
     inkscape:zoom="57.375"
     inkscape:cx="8"
     inkscape:cy="8"
     inkscape:current-layer="svg2">
    <inkscape:grid
       type="xygrid"
       id="grid1292" />
  </sodipodi:namedview>
  <g
     id="g647"
     transform="matrix(0.81655248,0,0,0.81655248,0.22936542,0.55897278)">
    <path
       id="path1865"
       style="fill:#71c837;fill-opacity:1;fill-rule:evenodd;stroke:none;stroke-width:0.268401px;stroke-linecap:butt;stroke-linejoin:miter;stroke-opacity:1"
       d="m 1.6181888,2.2665283 c -0.3487153,0 -0.70736504,0.071345 -0.90571559,0.2628609 a 0.08820326,0.08820326 0 0 0 -0.001033,0.00137 C 0.61534311,2.6272802 0.56865618,2.7517997 0.5481428,2.8983531 0.5276294,3.0449059 0.5291948,3.2181275 0.5291948,3.4395775 a 0.08820326,0.08820326 0 0 0 0.0881945,0.088194 h 1.939933 a 0.08820326,0.08820326 0 0 0 0.088195,-0.088192 c 0,-0.082824 4.586e-4,-0.1539428 0,-0.2204862 l -0.179145,0.014813 c 6.44e-5,0.037625 -1.7e-6,0.07703 0,0.1174778 H 1.714996 L 1.8993086,2.6020799 1.9988719,2.4825352 c 0.022593,0.0051 0.044713,0.010481 0.065801,0.016537 0.02641,0.00758 0.051007,0.016109 0.074414,0.025149 L 2.2393395,2.3740146 C 2.199452,2.3571482 2.1574944,2.3422767 2.1132492,2.3295728 1.9644986,2.2868633 1.7925464,2.2665276 1.6181888,2.2665283 Z M 1.1872074,2.4945936 1.281603,2.6020806 1.4659156,3.3513889 H 0.70868359 C 0.70901344,3.1819785 0.7082338,3.0269492 0.72280847,2.922819 0.74031788,2.7977278 0.77218267,2.7207554 0.83615212,2.6561687 0.90656205,2.5885634 1.0345274,2.5323869 1.1872074,2.4945936 Z" />
    <g
       id="g3920"
       transform="matrix(0.24109392,0,0,0.23674508,-0.3411162,-0.4543363)"
       style="stroke-width:1.47661">
      <ellipse
         style="fill:none;fill-opacity:1;fill-rule:evenodd;stroke:#00aad4;stroke-width:0.738308;stroke-linecap:square;stroke-linejoin:round;stroke-miterlimit:4;stroke-dasharray:none;stroke-dashoffset:0;stroke-opacity:1;paint-order:normal"
         id="ellipse1869"
         cx="7.9996805"
         cy="8.6028032"
         ry="2.6287367"
         rx="2.1916399" />
      <path
         style="fill:#00aad4;fill-opacity:1;fill-rule:evenodd;stroke:none;stroke-width:1.23637px;stroke-linecap:butt;stroke-linejoin:miter;stroke-opacity:1"
         d="m 5.6252385,8.4695855 c 0,0 0.6219607,-1.1440237 1.1367442,-0.685928 C 8.2567635,9.113673 8.7442247,6.3799688 10.374822,8.4695855 10.96852,6.3917278 9.446372,5.0968943 8.041915,5.6137908 6.543256,5.1202455 5.0315405,6.6885648 5.6252385,8.4695855 Z"
         id="path1871"
         inkscape:connector-curvature="0"
         sodipodi:nodetypes="csccc" />
    </g>
    <path
       id="path920"
       style="color:#000000;fill:#ff7f2a;fill-opacity:1;stroke:none;stroke-width:0.176389"
       d="M 3.6159502,1.1982042 2.2999237,2.5142306 2.1807234,3.1109213 2.777414,2.991721 4.0934404,1.6756945 Z m 0,0.2494249 L 3.8440155,1.6756945 3.6159502,1.9037598 3.3878848,1.6756945 Z M 3.2631724,1.8004069 3.4912378,2.0284722 2.7098901,2.80982 2.4818247,2.5817546 Z"
       sodipodi:nodetypes="cccccccccccccccc" />
  </g>
  <g
     id="path294"
     transform="matrix(0.16837121,0,0,0.16837121,-0.07215907,-0.07215902)">
    <path
       id="path377"
       style="color:#000000;fill:#00aad4;stroke-linecap:round;stroke-dashoffset:1.49998"
       d="M 1.9999999,2.7857144 2,24 H 24 V 2.7857144 Z M 3.5714285,6.7142858 H 22.428571 V 22.428571 H 3.5714286 Z"
       sodipodi:nodetypes="cccccccccc" />
  </g>
</svg>
