<?xml version="1.0" encoding="UTF-8" standalone="no"?>
<svg
   height="16"
   width="16"
   version="1.1"
   id="svg12"
   sodipodi:docname="laz_refresh.svg"
   inkscape:export-filename="laz_refresh.png"
   inkscape:export-xdpi="96"
   inkscape:export-ydpi="96"
   inkscape:version="1.2.2 (732a01da63, 2022-12-09)"
   xmlns:inkscape="http://www.inkscape.org/namespaces/inkscape"
   xmlns:sodipodi="http://sodipodi.sourceforge.net/DTD/sodipodi-0.dtd"
   xmlns="http://www.w3.org/2000/svg"
   xmlns:svg="http://www.w3.org/2000/svg">
  <defs
     id="defs16" />
  <sodipodi:namedview
     id="namedview14"
     pagecolor="#ffffff"
     bordercolor="#666666"
     borderopacity="1.0"
     inkscape:showpageshadow="2"
     inkscape:pageopacity="0.0"
     inkscape:pagecheckerboard="0"
     inkscape:deskcolor="#d1d1d1"
     showgrid="true"
     inkscape:zoom="57.375"
     inkscape:cx="6.9891068"
     inkscape:cy="8"
     inkscape:current-layer="g10">
    <inkscape:grid
       type="xygrid"
       id="grid1606" />
  </sodipodi:namedview>
  <g
     fill="none"
     stroke="#00aad4"
     stroke-linecap="round"
     stroke-width="1.5"
     id="g10">
    <g
       id="g1977">
      <path
         d="m9.939655 7.25h4.310345v-4.3095045"
         id="path2"
         style="stroke:#ff0000;stroke-opacity:1" />
      <path
         d="m13.344828 7.0345224c-2.327587-4.7517454-7.5000004-8.2075604-11.594828-1.7279074"
         id="path4"
         style="stroke:#ff0000;stroke-opacity:1" />
    </g>
    <g
       id="g1973"
       style="stroke:#2a7fff;stroke-opacity:1">
      <path
         d="m6.0603449 8.75h-4.3103449v4.309504"
         id="path6"
         style="stroke:#2a7fff;stroke-opacity:1" />
      <path
         d="m2.6551724 8.9654776c2.3275862 4.7517784 7.4999996 8.2076194 11.5948276 1.7279204"
         id="path8"
         style="stroke:#2a7fff;stroke-opacity:1" />
    </g>
  </g>
</svg>
