<?xml version="1.0" encoding="UTF-8" standalone="no"?>
<svg
   height="64"
   width="64"
   version="1.1"
   id="svg291"
   sodipodi:docname="Save_03_64.svg"
   inkscape:export-filename="Save_03_64.png"
   inkscape:export-xdpi="96"
   inkscape:export-ydpi="96"
   inkscape:version="1.2-beta (1b65182ce9, 2022-04-05)"
   xmlns:inkscape="http://www.inkscape.org/namespaces/inkscape"
   xmlns:sodipodi="http://sodipodi.sourceforge.net/DTD/sodipodi-0.dtd"
   xmlns="http://www.w3.org/2000/svg"
   xmlns:svg="http://www.w3.org/2000/svg">
  <defs
     id="defs293" />
  <sodipodi:namedview
     id="namedview12"
     pagecolor="#ffffff"
     bordercolor="#666666"
     borderopacity="1.0"
     inkscape:pageshadow="2"
     inkscape:pageopacity="0.0"
     inkscape:pagecheckerboard="0"
     inkscape:deskcolor="#d1d1d1"
     showgrid="true"
     inkscape:zoom="14.34375"
     inkscape:cx="29.455338"
     inkscape:cy="32"
     inkscape:current-layer="svg291">
    <inkscape:grid
       type="xygrid"
       id="grid139" />
  </sodipodi:namedview>
  <linearGradient
     id="a"
     gradientUnits="userSpaceOnUse"
     x1="14"
     x2="15.5"
     y1="9"
     y2="14">
    <stop
       offset="0"
       stop-color="#ccc"
       id="stop276" />
    <stop
       offset="1"
       stop-color="#f2f2f2"
       id="stop278" />
  </linearGradient>
  <g
     id="g1028"
     transform="scale(4)">
    <path
       d="M 14.5,15.5 V 2 L 13,0.5 H 0.5 v 15 z"
       fill="#0062f5"
       id="path722-7"
       style="fill:none;fill-rule:evenodd;stroke:#00aad4;stroke-width:1;stroke-linecap:round;stroke-linejoin:round;stroke-opacity:1"
       sodipodi:nodetypes="cccccc" />
    <path
       style="fill:none;stroke:#00aad4;stroke-width:1px;stroke-linecap:round;stroke-linejoin:round;stroke-opacity:1"
       d="m 4.5,1 v 4.5 h 7 V 1"
       id="path1004"
       sodipodi:nodetypes="cccc" />
    <path
       style="fill:none;stroke:#00aad4;stroke-width:1.5;stroke-linecap:butt;stroke-linejoin:miter;stroke-dasharray:none;stroke-opacity:1"
       d="m 9.5,1.5 v 3"
       id="path1006"
       sodipodi:nodetypes="cc" />
    <path
       style="fill:none;stroke:#00aad4;stroke-width:1;stroke-linecap:round;stroke-linejoin:round;stroke-dasharray:none;stroke-opacity:1"
       d="M 2.5,15 V 7.5 h 10 V 15"
       id="path1008"
       sodipodi:nodetypes="cccc" />
  </g>
</svg>
