<svg width="64" height="64" version="1.1" viewBox="0 0 64 64" xmlns="http://www.w3.org/2000/svg">
 <defs>
  <linearGradient id="b" x1="23" x2="23" y1="6.5" y2="15" gradientTransform="matrix(1.3404585,1.341717,-1.3408883,1.342147,31.04896,5.934352)" gradientUnits="userSpaceOnUse">
   <stop stop-color="#89a02c" offset="0"/>
   <stop stop-color="#445016" offset="1"/>
  </linearGradient>
  <linearGradient id="c" x1="25.714283" x2="25.714283" y1="15.5" y2="6.2142854" gradientTransform="matrix(1.3404585,1.341717,-1.3408883,1.342147,31.04896,5.934352)" gradientUnits="userSpaceOnUse">
   <stop stop-color="#668000" offset="0"/>
   <stop stop-color="#aad400" offset="1"/>
  </linearGradient>
  <radialGradient id="a" cx="21.957434" cy="5.9936466" r="3.105469" gradientTransform="matrix(1.3408944,1.3422765,-1.0059966,1.0063819,29.542624,7.54204)" gradientUnits="userSpaceOnUse">
   <stop stop-color="#803300" offset="0"/>
   <stop stop-color="#d45500" offset="1"/>
  </radialGradient>
 </defs>
 <g stroke-linejoin="round">
  <path d="M 51.173812,44.826188 56,33.2" fill="none" stroke="#d4aa00" stroke-linecap="round" stroke-width="2.4"/>
  <path d="M 33.2,49.209612 35.567864,46.809116 40,46.810104" fill="none" stroke="#aca793" stroke-linecap="round" stroke-width="2.4"/>
  <path d="m 47.6,33.2 -2.4,2.367864 V 40" fill="none" stroke="#aca793" stroke-linecap="round" stroke-width="2.4"/>
  <path d="m36 40h3.180768l2.819232 2.819232" fill="none" stroke="#aca793" stroke-linecap="round" stroke-width="2.4"/>
  <path d="M 46.8,62.8 49.200496,60.432136 49.199508,56" fill="none" stroke="#aca793" stroke-linecap="round" stroke-width="2.4"/>
  <path d="M 51.173812,44.826188 62.8,40" fill="none" stroke="#d4aa00" stroke-linecap="round" stroke-width="2.4"/>
  <path d="m57.2131 38.7869c-1.517484-1.505316-3.63468-2.276972-6.037996-2.237708l-0.0013 8.276996 8.295384-0.0013c0.0344-2.408588-0.743524-4.522464-2.256096-6.03796z" fill="url(#a)" stroke-width="6.6482"/>
  <path d="m 62.8,48.4 -2.367864,2.4 H 56" fill="none" stroke="#aca793" stroke-linecap="round" stroke-width="2.4"/>
  <path d="M 56,60 V 56.819232 L 53.180768,54" fill="none" stroke="#aca793" stroke-linecap="round" stroke-width="2.4"/>
  <path d="m59.469196 44.82486-8.295416 0.0013 0.0013-8.276996a9.4991056 12.33176 44.894672 0 0-9.41682 4.263192 9.4991056 12.33176 44.894672 0 0-2.003008 15.443024 9.4991056 12.33176 44.894672 0 0 15.428536-2.004892 9.4991056 12.33176 44.894672 0 0 4.285384-9.425656z" fill="url(#c)" stroke-width="6.6482"/>
  <path d="m51.42872 44.585756-10.814544 10.800068" fill="none" stroke="url(#b)" stroke-linecap="round" stroke-width="2.4"/>
 </g>
</svg>
