<?xml version="1.0" encoding="UTF-8" standalone="no"?>
<svg
   width="36"
   height="36"
   version="1.1"
   viewBox="0 0 36 36"
   id="svg4"
   sodipodi:docname="TPSScript_150.svg"
   inkscape:version="1.3.2 (091e20e, 2023-11-25, custom)"
   xmlns:inkscape="http://www.inkscape.org/namespaces/inkscape"
   xmlns:sodipodi="http://sodipodi.sourceforge.net/DTD/sodipodi-0.dtd"
   xmlns="http://www.w3.org/2000/svg"
   xmlns:svg="http://www.w3.org/2000/svg">
  <sodipodi:namedview
     id="namedview4"
     pagecolor="#ffffff"
     bordercolor="#000000"
     borderopacity="0.25"
     inkscape:showpageshadow="2"
     inkscape:pageopacity="0.0"
     inkscape:pagecheckerboard="0"
     inkscape:deskcolor="#d1d1d1"
     showgrid="true"
     inkscape:current-layer="svg4">
    <inkscape:grid
       id="grid4"
       units="px"
       originx="0"
       originy="0"
       spacingx="0.5"
       spacingy="0.5"
       empcolor="#0099e5"
       empopacity="0.30196078"
       color="#0099e5"
       opacity="0.14901961"
       empspacing="2"
       dotted="false"
       gridanglex="30"
       gridanglez="30"
       visible="true" />
  </sodipodi:namedview>
  <defs
     id="defs2">
    <linearGradient
       id="a"
       x1="2.5"
       x2="21.5"
       y1="1030.8622"
       y2="1049.8622"
       gradientTransform="matrix(1.4761904,0,0,1.4761912,0.28571443,-1517.7735)"
       gradientUnits="userSpaceOnUse">
      <stop
         stop-color="#dbe2e3"
         offset="0"
         id="stop1" />
      <stop
         stop-color="#2c5aa0"
         offset="1"
         id="stop2" />
    </linearGradient>
  </defs>
  <rect
     x="2.5"
     y="2.4999826"
     width="31"
     height="31.000017"
     ry="4.4285736"
     fill="url(#a)"
     fill-rule="evenodd"
     stroke="#2f5da1"
     stroke-linecap="square"
     stroke-linejoin="round"
     style="fill:url(#a);paint-order:normal"
     id="rect2" />
  <path
     d="m 25.442507,8.8445 v 2.3158 h -3.679924 l -0.317235,4.822 q -0.09517,1.2531 -0.09517,2.1731 0,2.2048 0.507576,2.6965 0.523437,0.4758 1.253077,0.4758 1.522727,0 1.808239,-1.9193 h 0.571022 q -0.523437,4.4096 -3.521306,4.4096 -1.395834,0 -2.252368,-0.8565 -0.840672,-0.8566 -0.840672,-2.5379 0,-1.1103 0.333097,-4.6951 l 0.428267,-4.5682 h -3.36269 q -0.333096,5.7737 -0.808949,8.4385 -0.45999,2.6648 -1.031013,3.442 -0.555161,0.7772 -1.522727,0.7772 -0.72964,0 -1.237216,-0.4283 -0.491714,-0.4282 -0.491714,-1.1261 0,-0.6662 0.856534,-1.8241 1.253078,-1.6814 1.871686,-3.4896 0.618608,-1.8241 0.935842,-5.7896 h -1.078598 q -1.300663,0 -1.99858,0.5869 -0.682054,0.571 -1.300662,1.6496 H 9.8979999 Q 10.35799,11.6996 11.087631,10.6052 11.817271,9.5107 12.578634,9.1776 13.35586,8.8445 15.322716,8.8445 Z"
     stroke-width="1px"
     id="path2"
     style="fill:#ffffff" />
  <rect
     x="0.49999949"
     y="23.499983"
     width="15"
     height="12"
     fill="#ffffff"
     fill-rule="evenodd"
     stroke="#2a7efe"
     stroke-linecap="square"
     stroke-linejoin="round"
     stroke-width="0.999999"
     style="paint-order:normal"
     id="rect3" />
  <path
     d="M 3.45,32.5496 V 26.45 h 1.86332 c 2.48442,0 2.48442,3.3438 0,3.3438 H 3.45"
     fill="none"
     stroke="#4d4d4d"
     stroke-linecap="round"
     stroke-linejoin="round"
     stroke-width="0.9"
     id="path3" />
  <path
     d="M 12.69578,26.8481 C 12.30662,26.5798 11.72876,26.45 11.0384,26.45 c -0.97558,0 -1.86333,0.5132 -1.86333,1.58 0,0.8358 0.7048,1.1794 1.86333,1.3805 1.61317,0.28 1.86332,0.8242 1.86332,1.5591 1e-5,1.3279 -1.10478,1.58 -1.86332,1.58 -0.58885,0 -1.19328,-0.072 -1.9514,-0.4644"
     fill="none"
     stroke="#4d4d4d"
     stroke-linecap="round"
     stroke-linejoin="round"
     stroke-width="0.9"
     id="path4" />
</svg>
