<?xml version="1.0" encoding="UTF-8" standalone="no"?>
<svg
   height="48"
   width="48"
   version="1.1"
   id="svg28"
   sodipodi:docname="Setup_03_48.svg"
   inkscape:export-filename="Setup_03_48.png"
   inkscape:export-xdpi="96"
   inkscape:export-ydpi="96"
   inkscape:version="1.3.2 (091e20e, 2023-11-25, custom)"
   xmlns:inkscape="http://www.inkscape.org/namespaces/inkscape"
   xmlns:sodipodi="http://sodipodi.sourceforge.net/DTD/sodipodi-0.dtd"
   xmlns="http://www.w3.org/2000/svg"
   xmlns:svg="http://www.w3.org/2000/svg">
  <defs
     id="defs32">
    <linearGradient
       id="c"
       x1="5.4640584"
       x2="7.5116959"
       y1="9.4888191"
       y2="11.536456"
       gradientTransform="matrix(2.9971002,0,0,2.9999926,9.598564,1.3946478)"
       gradientUnits="userSpaceOnUse">
      <stop
         stop-color="#d40000"
         offset="0"
         id="stop1" />
      <stop
         stop-color="#ff8989"
         offset=".15760632"
         id="stop2-8" />
      <stop
         stop-color="#d40000"
         offset=".88542914"
         id="stop3" />
      <stop
         stop-color="#970000"
         offset="1"
         id="stop4-4" />
    </linearGradient>
    <radialGradient
       id="d"
       cx="15.071531"
       cy="1033.4419"
       r="3.4872861"
       gradientTransform="matrix(0.10048791,-3.8651191,-3.8659692,0.06089832,4030.8116,20.257042)"
       gradientUnits="userSpaceOnUse">
      <stop
         stop-color="#fff"
         offset="0"
         id="stop5" />
      <stop
         stop-color="#ccc"
         offset="1"
         id="stop6-8" />
    </radialGradient>
  </defs>
  <sodipodi:namedview
     id="namedview30"
     pagecolor="#ffffff"
     bordercolor="#666666"
     borderopacity="1.0"
     inkscape:pageshadow="2"
     inkscape:pageopacity="0.0"
     inkscape:pagecheckerboard="0"
     inkscape:deskcolor="#d1d1d1"
     showgrid="true"
     inkscape:zoom="19.125"
     inkscape:cx="22.797386"
     inkscape:cy="24"
     inkscape:current-layer="svg28"
     inkscape:showpageshadow="2">
    <inkscape:grid
       id="grid9"
       units="px"
       originx="0"
       originy="0"
       spacingx="0.5"
       spacingy="0.5"
       empcolor="#0099e5"
       empopacity="0.30196078"
       color="#0099e5"
       opacity="0.14901961"
       empspacing="2"
       dotted="false"
       gridanglex="30"
       gridanglez="30"
       visible="true" />
  </sodipodi:namedview>
  <linearGradient
     id="a"
     gradientUnits="userSpaceOnUse"
     x1="33.5"
     x2="36.5"
     y1="11"
     y2="11">
    <stop
       offset="0"
       stop-color="#e60000"
       id="stop2" />
    <stop
       offset=".28920922"
       stop-color="#ff8989"
       id="stop4" />
    <stop
       offset="1"
       stop-color="#e60000"
       id="stop6" />
  </linearGradient>
  <radialGradient
     id="b"
     cx="14.847369"
     cy="1032.7991"
     gradientTransform="matrix(1.0112065,-1.1395816,0.8602807,0.86027992,-869.51081,-865.07646)"
     gradientUnits="userSpaceOnUse"
     r="3.487286">
    <stop
       offset="0"
       stop-color="#fff"
       id="stop9" />
    <stop
       offset="1"
       stop-color="#ccc"
       id="stop11" />
  </radialGradient>
  <path
     id="path9"
     style="fill:#aaccff;fill-rule:evenodd;stroke-linejoin:round"
     d="M 17.625,1 16.833984,7.3339844 13.283203,8.8046875 8.242188,4.8847656 4.884766,8.2421875 8.804688,13.283203 7.333984,16.833984 1,17.625 v 4.75 l 6.333984,0.791016 1.470704,3.550781 -3.919922,5.041015 3.357422,3.357422 5.041015,-3.919922 3.550781,1.470704 0.544922,4.365234 12.53125,-11.962891 c -0.83556,-1.907746 -1.058014,-4.503338 0.607422,-7.003906 0.538277,-0.808192 1.136675,-1.518689 1.769531,-2.146484 L 31.195312,13.283203 35.115234,8.2421875 31.757812,4.8847656 26.716797,8.8046875 23.166016,7.3339844 22.375,1 Z M 20,13.666016 c 3.497801,0 6.333986,2.836183 6.333984,6.333984 0,3.497801 -2.836183,6.333984 -6.333984,6.333984 C 16.502198,26.333986 13.666016,23.497801 13.666016,20 13.666015,16.502197 16.502197,13.666014 20,13.666016 Z" />
  <path
     d="M 17.625,0 A 1.0001,1.0001 0 0 0 16.632812,0.875 L 15.914063,6.6328125 13.4375,7.6582031 8.8574219,4.0957031 A 1.0001,1.0001 0 0 0 7.5351562,4.1777344 L 4.1777344,7.5351562 A 1.0001,1.0001 0 0 0 4.0957031,8.8574219 L 7.6582031,13.4375 6.6328125,15.914063 0.875,16.632812 A 1.0001,1.0001 0 0 0 0,17.625 v 4.75 a 1.0001,1.0001 0 0 0 0.875,0.992187 l 5.7578125,0.71875 1.0253906,2.476563 -3.5625,4.580078 a 1.0001,1.0001 0 0 0 0.082031,1.322266 l 3.3574218,3.357422 a 1.0001,1.0001 0 0 0 1.3222657,0.08203 l 4.5800781,-3.5625 2.476563,1.02539 0.564453,4.523438 1.800781,-1.720703 -0.453125,-3.626953 A 1.0001,1.0001 0 0 0 17.216797,31.742187 L 13.666016,30.271484 A 1.0001,1.0001 0 0 0 12.669922,30.40625 L 8.3261719,33.785156 6.2148437,31.673828 9.59375,27.330078 A 1.0001,1.0001 0 0 0 9.7285156,26.333984 L 8.2578125,22.783203 A 1.0001,1.0001 0 0 0 7.4570312,22.173828 L 2,21.492187 v -2.984375 l 5.4570312,-0.68164 A 1.0001,1.0001 0 0 0 8.2578125,17.216797 L 9.7285156,13.666016 A 1.0001,1.0001 0 0 0 9.59375,12.669922 L 6.2148437,8.3261719 8.3261719,6.2148437 12.669922,9.59375 a 1.0001,1.0001 0 0 0 0.996094,0.1347656 L 17.216797,8.2578125 A 1.0001,1.0001 0 0 0 17.826172,7.4570312 L 18.507812,2 h 2.984375 l 0.681641,5.4570312 a 1.0001,1.0001 0 0 0 0.609375,0.8007813 l 3.550781,1.4707031 A 1.0001,1.0001 0 0 0 27.330078,9.59375 l 4.34375,-3.3789063 2.111328,2.1113282 -3.378906,4.3437501 a 1.0001,1.0001 0 0 0 -0.134766,0.996094 l 1.267578,3.060546 c 0.484934,-0.568297 0.997234,-1.079211 1.533204,-1.527343 L 32.341797,13.4375 35.904297,8.8574219 A 1.0001,1.0001 0 0 0 35.822266,7.5351562 L 32.464844,4.1777344 A 1.0001,1.0001 0 0 0 31.142578,4.0957031 L 26.5625,7.6582031 24.085937,6.6328125 23.367187,0.875 A 1.0001,1.0001 0 0 0 22.375,0 Z"
     style="fill:#457abe;fill-rule:evenodd;stroke-linejoin:round"
     id="path5" />
  <path
     d="m 20,12.666016 c -4.038238,-3e-6 -7.333986,3.295746 -7.333984,7.333984 0,4.038236 3.295746,7.333987 7.333984,7.333984 4.038236,0 7.333984,-3.295748 7.333984,-7.333984 3e-6,-4.038237 -3.295748,-7.333984 -7.333984,-7.333984 z m 0,2 c 2.957358,0 5.333986,2.376627 5.333984,5.333984 0,2.957358 -2.376626,5.333984 -5.333984,5.333984 C 17.042642,25.333986 14.666016,22.957358 14.666016,20 14.666015,17.04264 17.04264,14.666014 20,14.666016 Z"
     style="fill:#457abe;fill-rule:evenodd;stroke-linejoin:round"
     id="path4" />
  <g
     fill-rule="evenodd"
     id="g8">
    <path
       d="m 31.826982,24.894613 c 0,0 -9.990259,9.499957 -16.234217,15.499942 -4.522781,4.34606 1.577547,10.57879 5.994201,5.999986 L 37.071909,30.1446 Z"
       fill="url(#c)"
       stroke-width="2.99999"
       id="path7"
       style="fill:url(#c)" />
    <path
       d="m 43.066119,30.188615 c 4.302995,-2.871432 5.579785,-7.431884 3.746375,-9.749976 l -3.746375,3.749996 -4.495651,-0.750003 -0.749274,-4.499993 3.746375,-3.749987 c -2.315857,-1.83518 -6.871912,-0.557156 -9.740576,3.749991 -2.9971,4.499989 1.49855,8.24998 2.247825,8.999978 0.749275,0.749998 4.49565,5.249987 8.991301,2.249994 z"
       fill="url(#d)"
       stroke="#808080"
       stroke-width="0.749998"
       id="path8"
       style="fill:url(#d)" />
  </g>
</svg>
