<?xml version="1.0" encoding="UTF-8" standalone="no"?>
<svg
   height="16"
   viewBox="0 0 4.2333332 4.2333335"
   width="16"
   version="1.1"
   id="svg2"
   sodipodi:docname="Cancel_03_16.svg"
   inkscape:version="1.2 (dc2aedaf03, 2022-05-15)"
   inkscape:export-filename="Cancel_03_16.png"
   inkscape:export-xdpi="96"
   inkscape:export-ydpi="96"
   xmlns:inkscape="http://www.inkscape.org/namespaces/inkscape"
   xmlns:sodipodi="http://sodipodi.sourceforge.net/DTD/sodipodi-0.dtd"
   xmlns="http://www.w3.org/2000/svg"
   xmlns:svg="http://www.w3.org/2000/svg">
  <defs
     id="defs6">
    <radialGradient
       id="a"
       cx="12.1"
       cy="10.900001"
       gradientTransform="matrix(0,0.49887766,-0.49887761,0,6.8809484,-4.5932378)"
       gradientUnits="userSpaceOnUse"
       r="4.5">
      <stop
         offset="0"
         stop-color="#f55"
         id="stop788" />
      <stop
         offset="1"
         stop-color="#a00"
         id="stop790" />
    </radialGradient>
    <radialGradient
       id="a-7"
       cx="12.1"
       cy="10.900001"
       gradientTransform="matrix(0,0.4988777,-0.49887766,0,6.8148022,-9.5541766)"
       gradientUnits="userSpaceOnUse"
       r="4.5">
      <stop
         offset="0"
         stop-color="#ff7f2a"
         id="stop962" />
      <stop
         offset="1"
         stop-color="#d45500"
         id="stop964" />
    </radialGradient>
  </defs>
  <sodipodi:namedview
     id="namedview4"
     pagecolor="#ffffff"
     bordercolor="#666666"
     borderopacity="1.0"
     inkscape:showpageshadow="2"
     inkscape:pageopacity="0.0"
     inkscape:pagecheckerboard="0"
     inkscape:deskcolor="#d1d1d1"
     showgrid="true"
     inkscape:zoom="57.375"
     inkscape:cx="8"
     inkscape:cy="8"
     inkscape:current-layer="svg2">
    <inkscape:grid
       type="xygrid"
       id="grid1292" />
  </sodipodi:namedview>
  <g
     id="g1343">
    <circle
       cx="2.1166668"
       cy="2.116667"
       style="fill:url(#a);stroke:#ffd5d5;stroke-width:0.264584;stroke-linecap:round;stroke-linejoin:round;stroke-dasharray:none;stroke-dashoffset:1.49998"
       transform="matrix(0,1,1,0,0,0)"
       id="ellipse793"
       r="1.8520833" />
    <g
       id="g1218"
       transform="translate(0.13229167)">
      <path
         d="M 2.6458333,1.4552084 1.3229167,2.778125"
         id="path3550"
         style="fill:none;stroke:#ffffff;stroke-width:0.529167;stroke-linecap:round;stroke-dasharray:none"
         sodipodi:nodetypes="cc" />
      <path
         d="M 2.6458333,2.778125 1.3229167,1.4552084"
         id="path3552"
         style="fill:none;stroke:#ffffff;stroke-width:0.529167;stroke-linecap:round;stroke-dasharray:none"
         sodipodi:nodetypes="cc" />
    </g>
  </g>
</svg>
