<?xml version="1.0" encoding="UTF-8" standalone="no"?>
<svg
   height="16"
   width="16"
   version="1.1"
   id="svg442"
   sodipodi:docname="menu_project_save_as.svg"
   inkscape:export-filename="menu_project_save_as.png"
   inkscape:export-xdpi="96"
   inkscape:export-ydpi="96"
   inkscape:version="1.2.2 (732a01da63, 2022-12-09)"
   xmlns:inkscape="http://www.inkscape.org/namespaces/inkscape"
   xmlns:sodipodi="http://sodipodi.sourceforge.net/DTD/sodipodi-0.dtd"
   xmlns="http://www.w3.org/2000/svg"
   xmlns:svg="http://www.w3.org/2000/svg">
  <defs
     id="defs446" />
  <sodipodi:namedview
     id="namedview444"
     pagecolor="#ffffff"
     bordercolor="#666666"
     borderopacity="1.0"
     inkscape:showpageshadow="2"
     inkscape:pageopacity="0.0"
     inkscape:pagecheckerboard="0"
     inkscape:deskcolor="#d1d1d1"
     showgrid="true"
     inkscape:zoom="57.375"
     inkscape:cx="7.9912854"
     inkscape:cy="8"
     inkscape:current-layer="svg442">
    <inkscape:grid
       type="xygrid"
       id="grid669" />
  </sodipodi:namedview>
  <radialGradient
     id="a"
     cx="7.388889"
     cy="3.048611"
     gradientTransform="matrix(-.00000005 .81632663 -.81632648 -.00000005 11.774378 1.753967)"
     gradientUnits="userSpaceOnUse"
     r="3.5">
    <stop
       offset="0"
       stop-color="#ff8080"
       id="stop380" />
    <stop
       offset="1"
       stop-color="#e50000"
       id="stop382" />
  </radialGradient>
  <radialGradient
     id="b"
     cx="10.5"
     cy="9.5"
     gradientTransform="matrix(-.00000008 .81632648 -.81632648 -.00000009 19.040818 2.714285)"
     gradientUnits="userSpaceOnUse"
     r="3.5">
    <stop
       offset="0"
       stop-color="#ffe680"
       id="stop385" />
    <stop
       offset="1"
       stop-color="#e5b800"
       id="stop387" />
  </radialGradient>
  <radialGradient
     id="c"
     cx="3"
     cy="10"
     gradientTransform="matrix(0 .81632648 -.81632648 0 15.448978 8.836734)"
     gradientUnits="userSpaceOnUse"
     r="3.5">
    <stop
       offset="0"
       stop-color="#80b2ff"
       id="stop390" />
    <stop
       offset="1"
       stop-color="#2672e5"
       id="stop392" />
  </radialGradient>
  <linearGradient
     id="d"
     gradientTransform="matrix(.96732065 0 0 .96732064 -6.624188 -6.624188)"
     gradientUnits="userSpaceOnUse"
     x1="14.084459"
     x2="8.915541"
     y1="14.084459"
     y2="8.915541">
    <stop
       offset="0"
       stop-color="#009600"
       id="stop395" />
    <stop
       offset="1"
       stop-color="#6edb39"
       id="stop397" />
  </linearGradient>
  <linearGradient
     id="e"
     gradientUnits="userSpaceOnUse"
     x1="14.5"
     x2="4.5"
     y1="15.5"
     y2="4.5">
    <stop
       offset="0"
       stop-color="#2a7fff"
       id="stop400" />
    <stop
       offset="1"
       stop-color="#66a4ff"
       id="stop402" />
  </linearGradient>
  <linearGradient
     id="f"
     gradientTransform="matrix(.69231067 0 0 .714285 .50002 1.500025)"
     gradientUnits="userSpaceOnUse"
     x1="13.53"
     x2="13.53"
     y1="3.5"
     y2="8.75">
    <stop
       offset="0"
       stop-color="#ececec"
       id="stop405" />
    <stop
       offset="1"
       stop-color="#b7bec8"
       id="stop407" />
  </linearGradient>
  <g
     stroke-width="1.3484"
     transform="translate(-2 -4)"
     id="g416">
    <path
       d="m4 4h9.9l1.1 1.125v10.875h-11z"
       fill="url(#e)"
       fill-rule="evenodd"
       id="path410" />
    <rect
       fill="#fff"
       height="6"
       rx=".366667"
       width="8"
       x="5.5"
       y="9"
       id="rect412" />
    <path
       d="m7 4v4h6v-4zm3.5 1h1.5v2h-1.5z"
       fill="url(#f)"
       fill-rule="evenodd"
       id="path414" />
  </g>
  <g
     fill="none"
     transform="translate(-2 -4)"
     id="g424">
    <path
       d="m6.5000001 10.5h5.9999999"
       stroke="#e6e6e6"
       stroke-width=".999997"
       id="path418" />
    <path
       d="m6.5000001 12.5h5.9999999"
       stroke="#e6e6e6"
       stroke-width=".999997"
       id="path420" />
    <path
       d="m5.5 14.5h8"
       stroke="#f60"
       id="path422" />
  </g>
  <circle
     cx="4.5"
     cy="4.5"
     fill="url(#d)"
     r="4.000001"
     transform="matrix(0 1 1 0 7 7)"
     id="circle426" />
  <g
     fill="none"
     stroke="#fff"
     stroke-linecap="round"
     id="g432">
    <path
       d="m11.5 9.5v4"
       id="path428" />
    <path
       d="m13.5 11.5h-4"
       id="path430" />
  </g>
  <g
     stroke-width=".714286"
     transform="translate(-5.5 1.5)"
     id="g440">
    <circle
       cx="10"
       cy="8.5"
       fill="url(#a)"
       r="2.5"
       id="circle434" />
    <circle
       cx="12"
       cy="12"
       fill="url(#b)"
       r="2.5"
       id="circle436" />
    <circle
       cx="8"
       cy="12"
       fill="url(#c)"
       r="2.5"
       id="circle438" />
  </g>
</svg>
