<svg width="16" height="16" version="1.1" xmlns="http://www.w3.org/2000/svg">
 <defs>
  <linearGradient id="a" x1="33" x2="36" y1="1037.3622" y2="1037.3622" gradientTransform="matrix(.66619925 .38460905 -.33990203 .58869506 342.7906 -620.91602)" gradientUnits="userSpaceOnUse">
   <stop stop-color="#999" offset="0"/>
   <stop stop-color="#fff" offset=".49999997"/>
   <stop stop-color="#999" offset="1"/>
  </linearGradient>
  <linearGradient id="b" x1="33" x2="36" y1="1035.3622" y2="1035.3622" gradientTransform="matrix(.66619925 .38460905 -.33990203 .58869506 342.7906 -620.91602)" gradientUnits="userSpaceOnUse">
   <stop stop-color="#a00" offset="0"/>
   <stop stop-color="#f00" offset=".51070523"/>
   <stop stop-color="#a00" offset="1"/>
  </linearGradient>
  <linearGradient id="c" x1="33" x2="36" y1="1041.8622" y2="1041.8622" gradientTransform="matrix(.66619925 .38460905 -.35650589 .61745218 360.04014 -650.79146)" gradientUnits="userSpaceOnUse">
   <stop stop-color="#a05a2c" offset="0"/>
   <stop stop-color="#ff0" offset=".26457807"/>
   <stop stop-color="#ff0" offset=".75078517"/>
   <stop stop-color="#a05a2c" offset="1"/>
  </linearGradient>
 </defs>
 <rect transform="matrix(.82404192 .56652883 -.82404192 .56652883 0 0)" x="8.0309544" y="-1.6772897" width="10.415119" height="10.415119" ry="1.209368" fill="#dbe2e3"/>
 <path d="m13.400016 7.3125166c-0.543394 1.4357304-1.286806 2.6526874-2.630331 3.6874834 0.130315 0.442709 0.546741 1.59438 0.638518 2.057814l4.177735-2.872462c0.552099-0.3795691 0.552181-0.9912538 0-1.3707037z" fill="#44aa00" stop-color="#000000" stroke-linecap="round" stroke-linejoin="round"/>
 <path d="m10.041016 13.996681c-0.2278726-1.47572-0.6659248-2.831903-1.2929691-4.0433607-2.5379299 1.0005627-5.4363499 0.2365867-8.1601563-1.2589845l-0.17382812 0.1203125c-0.55209974 0.3795686-0.55209974 0.9911346 0 1.3707037l6.5898437 4.528907c0.5520998 0.379569 1.4400878 0.379569 1.9921876 0z" fill="#44aa00" stop-color="#000000" stroke-linecap="round" stroke-linejoin="round"/>
 <path d="m2.1035156 7.6523435c2.0716055 0.9872377 4.081963 1.3790295 5.7734375 0.8722657-0.8011581-1.1152217-1.7934821-2.0612676-2.9511719-2.8101564z" fill="#44aa00" stop-color="#000000" stroke-linecap="round" stroke-linejoin="round"/>
 <path d="m8.3867188 6.6640625 1.15625-2.0019531-0.546875-0.3769532c-0.5520999-0.3795685-1.4400877-0.3795686-1.9921876 0l-0.6640625 0.4589844c0.7535935 0.5603059 1.4367792 1.204177 2.0468751 1.9199219z" fill="#44aa00" stop-color="#000000" stroke-linecap="round" stroke-linejoin="round"/>
 <path d="m12.424064 2.0323617 1.998598 1.1538269-0.769283 1.3323621-1.998597-1.1538274z" fill="url(#a)" fill-rule="evenodd" stroke-width="1.06377"/>
 <path d="m13.193346 0.7 1.998596 1.1538305-0.773298 1.3393176-1.99458-1.1607863z" fill="url(#b)" fill-rule="evenodd" stroke-width="1.06377"/>
 <path d="m11.654782 3.3647234 1.998597 1.1538274-2.307845 3.9970842-1.998597-1.1538267z" fill="url(#c)" fill-rule="evenodd" stroke-width="1.06377"/>
 <path d="m9.346937 7.3618084-0.2554522 1.6290048 0.9709372 0.5605405 1.283112-1.0357187z" fill="#d38d5f" fill-rule="evenodd" stroke-width="1.01059"/>
 <path d="m9.7177325 9.7964778a0.38461579 0.38463421 75 0 1-0.5254202 0.1407859 0.38461579 0.38463421 75 0 1-0.1407789-0.525394 0.38461579 0.38463421 75 0 1 0.5254202-0.1407859 0.38461579 0.38463421 75 0 1 0.1407789 0.525394zm-0.6262477-0.8056646 0.9709372 0.5605405-0.4361987 0.3520957-0.6215792-0.3588493z" fill="#333333" stroke-dashoffset="1.49998" stroke-linecap="round" stroke-linejoin="round" stroke-width="1.33373"/>
</svg>
