<?xml version="1.0" encoding="UTF-8" standalone="no"?>
<svg
   height="16"
   width="16"
   version="1.1"
   id="svg48"
   sodipodi:docname="Grid_07_16.svg"
   inkscape:export-filename="Grid_07_16.png"
   inkscape:export-xdpi="96"
   inkscape:export-ydpi="96"
   inkscape:version="1.2-beta (1b65182ce9, 2022-04-05)"
   xmlns:inkscape="http://www.inkscape.org/namespaces/inkscape"
   xmlns:sodipodi="http://sodipodi.sourceforge.net/DTD/sodipodi-0.dtd"
   xmlns="http://www.w3.org/2000/svg"
   xmlns:svg="http://www.w3.org/2000/svg">
  <defs
     id="defs52" />
  <sodipodi:namedview
     id="namedview50"
     pagecolor="#ffffff"
     bordercolor="#666666"
     borderopacity="1.0"
     inkscape:pageshadow="2"
     inkscape:pageopacity="0.0"
     inkscape:pagecheckerboard="0"
     inkscape:deskcolor="#d1d1d1"
     showgrid="true"
     inkscape:zoom="57.375"
     inkscape:cx="8"
     inkscape:cy="8"
     inkscape:current-layer="svg48">
    <inkscape:grid
       type="xygrid"
       id="grid1076" />
  </sodipodi:namedview>
  <linearGradient
     id="a"
     gradientTransform="matrix(0 -1 -1 0 16 16)"
     gradientUnits="userSpaceOnUse"
     x1="9"
     x2="6"
     y1="10"
     y2="10.5">
    <stop
       offset="0"
       stop-color="#72cef6"
       id="stop2" />
    <stop
       offset="1"
       stop-color="#d2f5f8"
       id="stop4" />
  </linearGradient>
  <linearGradient
     id="b"
     gradientTransform="matrix(0 -1 -1 0 16 16)"
     gradientUnits="userSpaceOnUse"
     x1="10"
     x2="5"
     y1="12.5"
     y2="12.5">
    <stop
       offset="0"
       stop-color="#4674a8"
       id="stop7" />
    <stop
       offset="1"
       stop-color="#42a0ce"
       id="stop9" />
  </linearGradient>
  <g
     transform="matrix(1 0 0 -1 15.75 21.75)"
     id="g32">
    <path
       d="m6.25-15.25h15v15h-15z"
       fill="#fff"
       stroke="#999"
       stroke-dashoffset="1.49998"
       stroke-linecap="round"
       stroke-linejoin="round"
       transform="matrix(0 1 1 0 0 0)"
       id="path12" />
    <g
       fill="none"
       stroke="#b3b3b3"
       id="g24">
      <path
         d="m-12.25 6.75v14"
         id="path14" />
      <path
         d="m-14.75 10.25h14"
         id="path16" />
      <path
         d="m-3.25 20.75v-14"
         id="path18" />
      <path
         d="m-14.75 18.25h14"
         id="path20" />
      <path
         d="m-14.75 14.25h14"
         id="path22" />
    </g>
    <g
       stroke-linejoin="round"
       transform="matrix(0 -1 -1 0 .25 21.75)"
       id="g30">
      <path
         d="m.5-11.5h15v6h-15z"
         fill="none"
         opacity=".5"
         stroke="#fff"
         stroke-dashoffset="1.49998"
         transform="scale(1 -1)"
         id="path26" />
      <path
         d="m15.5 10.5h-15v-4h15z"
         fill="url(#a)"
         stroke="url(#b)"
         stroke-linecap="round"
         id="path28" />
    </g>
  </g>
  <g
     fill="none"
     stroke-linecap="round"
     stroke-opacity=".996078"
     id="g46">
    <g
       stroke="#fff"
       stroke-width="3"
       transform="translate(-19.75 9)"
       id="g38">
      <path
         d="m27.5-1h3.5"
         opacity=".7"
         id="path34" />
      <path
         d="m31.5-4 3 3-3 3"
         opacity=".7"
         stroke-linejoin="round"
         id="path36" />
    </g>
    <g
       stroke="#3771c8"
       stroke-width="2"
       transform="translate(-.25 -2)"
       id="g44">
      <path
         d="m8 10h7"
         id="path40" />
      <path
         d="m12 7 3 3-3 3"
         stroke-linejoin="round"
         id="path42" />
    </g>
  </g>
</svg>
