<?xml version="1.0" encoding="UTF-8" standalone="no"?>
<svg
   height="48"
   width="48"
   version="1.1"
   id="svg10"
   sodipodi:docname="Cancel_01_48.svg"
   inkscape:export-filename="Cancel_01_48.png"
   inkscape:export-xdpi="96"
   inkscape:export-ydpi="96"
   inkscape:version="1.2-beta (1b65182ce9, 2022-04-05)"
   xmlns:inkscape="http://www.inkscape.org/namespaces/inkscape"
   xmlns:sodipodi="http://sodipodi.sourceforge.net/DTD/sodipodi-0.dtd"
   xmlns="http://www.w3.org/2000/svg"
   xmlns:svg="http://www.w3.org/2000/svg">
  <defs
     id="defs14" />
  <sodipodi:namedview
     id="namedview12"
     pagecolor="#ffffff"
     bordercolor="#666666"
     borderopacity="1.0"
     inkscape:pageshadow="2"
     inkscape:pageopacity="0.0"
     inkscape:pagecheckerboard="0"
     inkscape:deskcolor="#d1d1d1"
     showgrid="true"
     inkscape:zoom="19.125"
     inkscape:cx="24"
     inkscape:cy="24"
     inkscape:current-layer="svg10">
    <inkscape:grid
       type="xygrid"
       id="grid2135" />
  </sodipodi:namedview>
  <g
     id="g2072"
     transform="scale(2)">
    <circle
       cx="12"
       cy="12"
       r="10.25"
       style="fill:#e60014;fill-rule:evenodd;stroke:#ab0000;stroke-width:1.5;stroke-linecap:round;stroke-linejoin:round;stroke-opacity:0.972549"
       id="circle2" />
    <g
       fill="none"
       stroke="#ffffff"
       stroke-width="1.25914"
       transform="matrix(1.5883883,0,0,1.5883883,33.712836,-40.532009)"
       id="g8">
      <path
         d="m -16.502788,30.239463 5.66612,5.666121"
         id="path4" />
      <path
         d="m -16.502788,35.905584 5.66612,-5.666121"
         id="path6" />
    </g>
  </g>
</svg>
