<svg width="32" height="32" version="1.0" xmlns="http://www.w3.org/2000/svg">
 <path d="m26 10-10 11-10-11" fill="none" stroke="#36cd36" stroke-linecap="round" stroke-linejoin="round" stroke-width="3.6"/>
</svg>
