<?xml version="1.0" encoding="UTF-8" standalone="no"?>
<svg
   height="36"
   width="36"
   version="1.1"
   id="svg1019"
   sodipodi:docname="Setup_02_36.svg"
   inkscape:export-filename="Setup_02_36.png"
   inkscape:export-xdpi="96"
   inkscape:export-ydpi="96"
   inkscape:version="1.2-beta (1b65182ce9, 2022-04-05)"
   xmlns:inkscape="http://www.inkscape.org/namespaces/inkscape"
   xmlns:sodipodi="http://sodipodi.sourceforge.net/DTD/sodipodi-0.dtd"
   xmlns:xlink="http://www.w3.org/1999/xlink"
   xmlns="http://www.w3.org/2000/svg"
   xmlns:svg="http://www.w3.org/2000/svg">
  <defs
     id="defs1023">
    <linearGradient
       inkscape:collect="always"
       xlink:href="#linearGradient1797"
       id="linearGradient1799"
       x1="8"
       y1="-20"
       x2="3"
       y2="-25"
       gradientUnits="userSpaceOnUse"
       gradientTransform="matrix(1.625,0,0,1.625,8.0625008,29.562499)" />
    <linearGradient
       inkscape:collect="always"
       id="linearGradient1797">
      <stop
         style="stop-color:#009600;stop-opacity:1"
         offset="0"
         id="stop1793" />
      <stop
         style="stop-color:#6edb39;stop-opacity:1"
         offset="1"
         id="stop1795" />
    </linearGradient>
  </defs>
  <sodipodi:namedview
     id="namedview1021"
     pagecolor="#ffffff"
     bordercolor="#666666"
     borderopacity="1.0"
     inkscape:pageshadow="2"
     inkscape:pageopacity="0.0"
     inkscape:pagecheckerboard="0"
     inkscape:deskcolor="#d1d1d1"
     showgrid="true"
     inkscape:zoom="25.5"
     inkscape:cx="17.980392"
     inkscape:cy="18"
     inkscape:current-layer="svg1019">
    <inkscape:grid
       type="xygrid"
       id="grid1142" />
  </sodipodi:namedview>
  <linearGradient
     id="a"
     gradientUnits="userSpaceOnUse"
     x1="42.812499"
     x2="34.687499"
     y1="20.812498"
     y2="12.687498">
    <stop
       offset="0"
       stop-color="#009600"
       id="stop1000" />
    <stop
       offset="1"
       stop-color="#6edb39"
       id="stop1002" />
  </linearGradient>
  <path
     d="m 20.417981,2.2515813 -2.43491,4.2818591 -2.965977,0.00106 -2.435942,-4.28452 L 9.1947632,3.6526691 10.501908,8.404755 8.4038937,10.501264 3.6544193,9.1952727 2.2515815,12.582023 l 4.2818616,2.434909 0.00106,2.965979 -4.2845227,2.43594 1.4026884,3.386388 4.7520856,-1.307145 2.0965116,2.098015 -1.3059918,4.749474 3.3867468,1.402836 2.43491,-4.281861 2.965978,-0.0011 2.435942,4.284524 3.386388,-1.402688 -1.307147,-4.752085 2.098014,-2.096513 4.749474,1.305993 1.402838,-3.386751 -4.281861,-2.434909 -0.0011,-2.965976 4.284566,-2.435903 -1.402689,-3.3863903 -4.752086,1.3071463 -2.096512,-2.0980163 1.305993,-4.7494718 z m -2.047526,9.7327507 a 4.8877227,4.8877227 0 0 1 2.645216,6.386119 4.8877227,4.8877227 0 0 1 -6.386118,2.645218 4.8877227,4.8877227 0 0 1 -2.645219,-6.38612 4.8877227,4.8877227 0 0 1 6.386121,-2.645217 z"
     fill="#aaccff"
     fill-rule="evenodd"
     stroke="#457abe"
     stroke-linejoin="round"
     id="path1005"
     style="stroke-width:1.5" />
  <g
     id="g1526"
     transform="matrix(0,1.5,-1.5,0,36.375,0.375)">
    <circle
       style="fill:url(#linearGradient1799);fill-opacity:1;stroke:#ffffff;stroke-width:1;stroke-linecap:round;stroke-linejoin:round;stroke-miterlimit:4;stroke-dasharray:none;stroke-dashoffset:1.49998;stroke-opacity:1"
       id="path883"
       cx="17"
       cy="-7"
       transform="matrix(1,0,0,-1,-0.25,0.25)"
       r="6.5" />
    <g
       id="g1519">
      <path
         style="fill:none;stroke:#ffffff;stroke-width:2;stroke-linecap:round;stroke-linejoin:miter;stroke-miterlimit:4;stroke-dasharray:none;stroke-opacity:1"
         d="m 14.25,7.25 h 5"
         id="path1522"
         sodipodi:nodetypes="cc" />
      <path
         style="fill:none;stroke:#ffffff;stroke-width:2;stroke-linecap:round;stroke-linejoin:miter;stroke-miterlimit:4;stroke-dasharray:none;stroke-opacity:1"
         d="m 16.75,4.75 v 5"
         id="path1215-2"
         sodipodi:nodetypes="cc" />
    </g>
  </g>
</svg>
