<?xml version="1.0" encoding="UTF-8" standalone="no"?>
<svg
   height="36"
   width="36"
   version="1.1"
   id="svg602"
   sodipodi:docname="Print_05_36.svg"
   inkscape:export-filename="Print_05_36.png"
   inkscape:export-xdpi="96"
   inkscape:export-ydpi="96"
   inkscape:version="1.2.1 (9c6d41e410, 2022-07-14)"
   xmlns:inkscape="http://www.inkscape.org/namespaces/inkscape"
   xmlns:sodipodi="http://sodipodi.sourceforge.net/DTD/sodipodi-0.dtd"
   xmlns="http://www.w3.org/2000/svg"
   xmlns:svg="http://www.w3.org/2000/svg">
  <defs
     id="defs606" />
  <sodipodi:namedview
     id="namedview604"
     pagecolor="#ffffff"
     bordercolor="#666666"
     borderopacity="1.0"
     inkscape:showpageshadow="2"
     inkscape:pageopacity="0.0"
     inkscape:pagecheckerboard="0"
     inkscape:deskcolor="#d1d1d1"
     showgrid="true"
     inkscape:zoom="25.5"
     inkscape:cx="17.980392"
     inkscape:cy="18"
     inkscape:current-layer="svg602">
    <inkscape:grid
       type="xygrid"
       id="grid884" />
  </sodipodi:namedview>
  <g
     fill="none"
     id="g600">
    <g
       stroke="#00aad4"
       stroke-width="2"
       transform="translate(-1)"
       id="g592">
      <path
         d="m9 14h-5v5"
         stroke-linejoin="round"
         id="path582" />
      <path
         d="m9 19v-16h19v9.5"
         id="path584" />
      <path
         d="m13.5 32h-11.5v-13h11"
         stroke-linecap="round"
         stroke-linejoin="round"
         id="path586" />
      <path
         d="m13 8h11"
         id="path588" />
      <path
         d="m13 13h6"
         id="path590" />
    </g>
    <g
       stroke="#ff7f00"
       stroke-width=".8"
       transform="scale(2.25)"
       id="g598">
      <path
         d="m8.7193521 6.9209069.3507038 1.3761786-.7721143.7723287-1.3779933-.3503947-.4178779 1.0088463 1.222155.7266222-.0001517 1.092086-1.2210901.72512.4179224 1.008955 1.3761786-.350704.7723287.772114-.3503946 1.377994 1.0088462.417877.7266221-1.222154 1.092086.000151.72512 1.22109 1.008955-.417922-.350704-1.376179.772114-.772329 1.377994.350395.417877-1.008846-1.222154-.726622.000151-1.092086 1.22109-.7251208-.417923-1.0089542-1.376178.3507038-.772329-.7721143.350395-1.3779934-1.008846-.4178778-.726623 1.2221549-1.092085-.0001517-.7251207-1.2210901z"
         id="path594" />
      <circle
         cx="11"
         cy="11"
         r="1.4"
         stroke-dashoffset="1.49998"
         id="circle596" />
    </g>
  </g>
</svg>
