<?xml version="1.0" encoding="UTF-8" standalone="no"?>
<svg
   height="24"
   viewBox="0 0 6.35 6.35"
   width="24"
   version="1.1"
   id="svg189"
   sodipodi:docname="menu_unindent_150.svg"
   inkscape:export-filename="menu_unindent_150.png"
   inkscape:export-xdpi="96"
   inkscape:export-ydpi="96"
   inkscape:version="1.2.1 (9c6d41e410, 2022-07-14)"
   xmlns:inkscape="http://www.inkscape.org/namespaces/inkscape"
   xmlns:sodipodi="http://sodipodi.sourceforge.net/DTD/sodipodi-0.dtd"
   xmlns="http://www.w3.org/2000/svg"
   xmlns:svg="http://www.w3.org/2000/svg">
  <defs
     id="defs193" />
  <sodipodi:namedview
     id="namedview191"
     pagecolor="#ffffff"
     bordercolor="#666666"
     borderopacity="1.0"
     inkscape:showpageshadow="2"
     inkscape:pageopacity="0.0"
     inkscape:pagecheckerboard="0"
     inkscape:deskcolor="#d1d1d1"
     showgrid="true"
     inkscape:zoom="38.25"
     inkscape:cx="12"
     inkscape:cy="12"
     inkscape:current-layer="svg189">
    <inkscape:grid
       type="xygrid"
       id="grid590" />
  </sodipodi:namedview>
  <path
     d="M 1.5875,0.19843701 H 6.0854167"
     id="path161"
     style="fill:none;stroke:#d4aa00;stroke-width:0.396874"
     sodipodi:nodetypes="cc" />
  <path
     d="M 1.5874999,4.1671868 H 6.0854166"
     id="path163"
     style="fill:none;stroke:#d4aa00;stroke-width:0.396874"
     sodipodi:nodetypes="cc" />
  <path
     d="M 1.5874999,0.9921869 H 6.0854166"
     id="path165"
     style="fill:none;stroke:#d4aa00;stroke-width:0.396874"
     sodipodi:nodetypes="cc" />
  <path
     d="M 2.38125,3.3734368 H 6.0854167"
     stroke="#2a7fff"
     id="path169"
     style="fill:none;stroke-width:0.396874"
     sodipodi:nodetypes="cc" />
  <path
     d="M 2.38125,2.5796869 H 6.0854167"
     stroke="#2a7fff"
     id="path171"
     style="fill:none;stroke-width:0.396874"
     sodipodi:nodetypes="cc" />
  <path
     d="M 2.38125,1.7859369 H 6.0854167"
     stroke="#2a7fff"
     id="path173"
     style="fill:none;stroke-width:0.396874"
     sodipodi:nodetypes="cc" />
  <path
     d="M 1.5875,4.9609368 H 6.0854167"
     stroke="#d4aa00"
     id="path175"
     style="fill:none;stroke-width:0.396874"
     sodipodi:nodetypes="cc" />
  <path
     d="m 0.95249332,1.7197917 -0.7937499,0.7937499 0.7937499,0.7937499"
     stroke="#00d400"
     stroke-linecap="round"
     stroke-linejoin="round"
     stroke-width="0.264583"
     id="path183"
     style="fill:none;stroke:#ff0000;stroke-width:0.3175;stroke-dasharray:none"
     sodipodi:nodetypes="ccc" />
  <path
     d="m 0.26458333,2.5135417 1.65364587,-2e-7"
     stroke="#00d400"
     stroke-linecap="round"
     stroke-width="0.264583"
     id="path185"
     style="fill:none;stroke:#ff0000;stroke-width:0.396875;stroke-dasharray:none"
     sodipodi:nodetypes="cc" />
  <path
     d="M 1.5875,5.754687 H 6.0854167"
     stroke="#d4aa00"
     id="path1111"
     style="fill:none;stroke-width:0.396874"
     sodipodi:nodetypes="cc" />
</svg>
