<svg width="32" height="32" version="1.1" viewBox="0 0 32 32" xmlns="http://www.w3.org/2000/svg" xmlns:xlink="http://www.w3.org/1999/xlink">
 <defs>
  <linearGradient id="b" x1="8.000001" x2="12.000001" y1="9" y2="12.5" gradientTransform="matrix(2.4285712 0 0 2.3077019 -.2499936 -1.9231958)" gradientUnits="userSpaceOnUse">
   <stop stop-color="#aaccff" offset="0"/>
   <stop stop-color="#0057dc" offset="1"/>
  </linearGradient>
  <linearGradient id="c" x1="2" x2="8.75" y1="5" y2="11.75" gradientTransform="matrix(2.0000008,0,0,2.0000008,-3.2980232e-6,1.9999942)" gradientUnits="userSpaceOnUse">
   <stop stop-color="#ffd5d5" offset="0"/>
   <stop stop-color="#dc0000" offset="1"/>
  </linearGradient>
  <radialGradient id="a" cx="7.9705882" cy="5.2647057" r="3.4999995" gradientTransform="matrix(0,2.615386,-2.615386,0,30.769241,-11.846168)" gradientUnits="userSpaceOnUse">
   <stop stop-color="#fff6d5" offset="0"/>
   <stop stop-color="#ffcc00" offset="1"/>
  </radialGradient>
 </defs>
 <circle cx="19.000006" cy="12.999999" r="8.5000048" fill="url(#a)" stroke="#f5c400" stroke-linecap="round" stroke-linejoin="round" stroke-width=".999998"/>
 <rect x="4.499999" y="12.499999" width="13.000006" height="13.000006" fill="url(#c)" stroke="#ff5555" stroke-linecap="round" stroke-linejoin="round" stroke-width=".999998"/>
 <path d="m12.499966 27.500005h17.000069l-8.500033-15.000064z" fill="url(#b)" stroke="#5599ff" stroke-linecap="round" stroke-linejoin="round"/>
</svg>
