<?xml version="1.0" encoding="UTF-8" standalone="no"?>
<svg
   height="24"
   width="24"
   version="1.1"
   id="svg2"
   sodipodi:docname="ddindexes_150.svg"
   inkscape:export-filename="ddindexes_150.png"
   inkscape:export-xdpi="96"
   inkscape:export-ydpi="96"
   inkscape:version="1.3-beta (cedbd6c6ff, 2023-05-28)"
   xmlns:inkscape="http://www.inkscape.org/namespaces/inkscape"
   xmlns:sodipodi="http://sodipodi.sourceforge.net/DTD/sodipodi-0.dtd"
   xmlns="http://www.w3.org/2000/svg"
   xmlns:svg="http://www.w3.org/2000/svg">
  <defs
     id="defs2" />
  <sodipodi:namedview
     id="namedview2"
     pagecolor="#ffffff"
     bordercolor="#000000"
     borderopacity="0.25"
     inkscape:showpageshadow="2"
     inkscape:pageopacity="0.0"
     inkscape:pagecheckerboard="0"
     inkscape:deskcolor="#d1d1d1"
     showgrid="true"
     inkscape:current-layer="svg2">
    <inkscape:grid
       id="grid2"
       units="px"
       originx="0"
       originy="0"
       spacingx="0.5"
       spacingy="0.5"
       empcolor="#0099e5"
       empopacity="0.30196078"
       color="#0099e5"
       opacity="0.14901961"
       empspacing="2"
       dotted="false"
       gridanglex="30"
       gridanglez="30"
       visible="true" />
  </sodipodi:namedview>
  <rect
     fill="#c2f3ff"
     height="18.800011"
     ry="2.4000001"
     width="18.800009"
     x="0.59999502"
     y="0.59999502"
     id="rect1"
     style="stroke:#00aad4;stroke-width:1.19999;stroke-linejoin:round" />
  <rect
     fill="#ebfcff"
     height="18.800011"
     ry="2.400001"
     width="18.800009"
     x="3.5999951"
     y="3.5999949"
     id="rect2"
     style="stroke:#00aad4;stroke-width:1.19999;stroke-linejoin:round" />
  <path
     d="m 8.581639,8 -2.58126,7.000027 h 1.058207 l 0.527737,-1.536725 h 2.82462 l 0.527736,1.536725 h 1.060942 L 9.418361,8 Z m 0.418362,1.353521 1.09102,3.177356 H 7.906246 Z"
     id="path2-7"
     style="fill:#00aad4;fill-opacity:1;stroke-width:0.264583" />
  <path
     d="m 19.75586,8.847294 -3.04746,5.218727 h 3.14375 V 15 H 15.5 V 14.152679 L 18.57154,8.933952 H 15.58666 V 7.999973 h 4.1692 z"
     id="path52"
     style="fill:#00aad4;fill-opacity:1;stroke-width:0.264583" />
  <rect
     style="fill:#00aad4;fill-opacity:1;stroke:none;stroke-width:1;stroke-linejoin:round"
     id="rect10"
     width="1.5"
     height="1.5"
     x="6.5"
     y="16" />
  <rect
     style="fill:#00aad4;fill-opacity:1;stroke:none;stroke-width:1;stroke-linejoin:round"
     id="rect11"
     width="1.5"
     height="1.5"
     x="18.5"
     y="16" />
  <rect
     style="fill:#00aad4;fill-opacity:1;stroke:none;stroke-width:1;stroke-linejoin:round"
     id="rect12"
     width="1.5"
     height="1.5"
     x="15.5"
     y="16" />
  <rect
     style="fill:#00aad4;fill-opacity:1;stroke:none;stroke-width:1;stroke-linejoin:round"
     id="rect13"
     width="1.5"
     height="1.5"
     x="12.5"
     y="16" />
  <rect
     style="fill:#00aad4;fill-opacity:1;stroke:none;stroke-width:1;stroke-linejoin:round"
     id="rect14"
     width="1.5"
     height="1.5"
     x="9.5"
     y="16" />
</svg>
