<?xml version="1.0" encoding="UTF-8" standalone="no"?>
<svg
   width="24"
   height="24"
   version="1.1"
   viewBox="0 0 24 24"
   id="svg6"
   sodipodi:docname="tsynmacrorecorder.svg"
   inkscape:version="1.3.2 (091e20e, 2023-11-25, custom)"
   xmlns:inkscape="http://www.inkscape.org/namespaces/inkscape"
   xmlns:sodipodi="http://sodipodi.sourceforge.net/DTD/sodipodi-0.dtd"
   xmlns="http://www.w3.org/2000/svg"
   xmlns:svg="http://www.w3.org/2000/svg">
  <defs
     id="defs6" />
  <sodipodi:namedview
     id="namedview6"
     pagecolor="#ffffff"
     bordercolor="#000000"
     borderopacity="0.25"
     inkscape:showpageshadow="2"
     inkscape:pageopacity="0.0"
     inkscape:pagecheckerboard="0"
     inkscape:deskcolor="#d1d1d1"
     showgrid="true"
     inkscape:current-layer="svg6">
    <inkscape:grid
       id="grid6"
       units="px"
       originx="0"
       originy="0"
       spacingx="0.5"
       spacingy="0.5"
       empcolor="#0099e5"
       empopacity="0.30196078"
       color="#0099e5"
       opacity="0.14901961"
       empspacing="2"
       dotted="false"
       gridanglex="30"
       gridanglez="30"
       visible="true" />
  </sodipodi:namedview>
  <rect
     x="1.25"
     y="1.2499826"
     width="20.5"
     height="21.5"
     fill="#ffffff"
     fill-rule="evenodd"
     stroke="#2a7efe"
     stroke-linecap="square"
     stroke-linejoin="round"
     stroke-width="0.5"
     style="paint-order:normal"
     id="rect1" />
  <rect
     x="1.5"
     y="1.4999826"
     width="3.5"
     height="21.000017"
     fill="#b3b3b3"
     fill-rule="evenodd"
     style="paint-order:normal"
     id="rect2" />
  <circle
     cx="9"
     cy="15.999983"
     r="3"
     fill="#e50000"
     fill-rule="evenodd"
     style="paint-order:normal"
     id="circle2" />
  <path
     d="m 16.5,13 v 6 l 3,-3 z"
     fill="#0055d4"
     fill-rule="evenodd"
     stroke="#0055d4"
     stroke-linejoin="round"
     stroke-width="1px"
     id="path2" />
  <path
     d="m 14.5,12 -1.25,8"
     fill="none"
     stroke="#333333"
     stroke-linecap="round"
     stroke-width="1px"
     id="path3" />
  <path
     d="M 15.65,9.5997 V 4.4 l 3.7,5.1997 V 4.4"
     fill="none"
     stroke="#2c5aa0"
     stroke-linecap="round"
     stroke-linejoin="round"
     stroke-width="0.8"
     id="path4" />
  <path
     d="M 9.41775,4.7394 C 9.08585,4.5106 8.59302,4.4 8.00425,4.4 7.17223,4.4 6.41511,4.8375 6.41511,5.7469 c 0,0.7125 0.60109,1.0054 1.58914,1.1768 1.3758,0.2387 1.58913,0.7026 1.58913,1.3291 0,1.132 -0.94221,1.3469 -1.58913,1.3469 -0.50221,0 -1.01769,-0.061 -1.66425,-0.3959"
     fill="none"
     stroke="#2c5aa0"
     stroke-linecap="round"
     stroke-linejoin="round"
     stroke-width="0.8"
     id="path5" />
  <path
     d="M 12.48914,9.5998 V 7.5049 M 10.9,4.4001 12.48914,7.5049 14.07828,4.4001"
     fill="none"
     stroke="#2c5aa0"
     stroke-linecap="round"
     stroke-linejoin="round"
     stroke-width="0.8"
     id="path6" />
</svg>
