<?xml version="1.0" encoding="UTF-8" standalone="no"?>
<svg
   height="48"
   viewBox="0 0 12.7 12.700001"
   width="48"
   version="1.1"
   id="svg600"
   sodipodi:docname="Font_13_48.svg"
   inkscape:export-filename="Font_13_48.png"
   inkscape:export-xdpi="96"
   inkscape:export-ydpi="96"
   inkscape:version="1.2 (dc2aedaf03, 2022-05-15)"
   xmlns:inkscape="http://www.inkscape.org/namespaces/inkscape"
   xmlns:sodipodi="http://sodipodi.sourceforge.net/DTD/sodipodi-0.dtd"
   xmlns="http://www.w3.org/2000/svg"
   xmlns:svg="http://www.w3.org/2000/svg">
  <defs
     id="defs604">
    <filter
       inkscape:collect="always"
       style="color-interpolation-filters:sRGB"
       id="filter2918"
       x="-0.077505999"
       y="-0.072650977"
       width="1.155012"
       height="1.145302">
      <feGaussianBlur
         inkscape:collect="always"
         stdDeviation="0.38441348"
         id="feGaussianBlur2920" />
    </filter>
  </defs>
  <sodipodi:namedview
     id="namedview602"
     pagecolor="#ffffff"
     bordercolor="#666666"
     borderopacity="1.0"
     inkscape:showpageshadow="2"
     inkscape:pageopacity="0.0"
     inkscape:pagecheckerboard="0"
     inkscape:deskcolor="#d1d1d1"
     showgrid="true"
     inkscape:zoom="19.125"
     inkscape:cx="18.849673"
     inkscape:cy="24"
     inkscape:current-layer="svg600">
    <inkscape:grid
       type="xygrid"
       id="grid1199" />
  </sodipodi:namedview>
  <g
     id="g935">
    <path
       id="path2551"
       style="fill:#ffffff;stroke:none;filter:url(#filter2918)"
       d="M 5.1604087,0 A 0.7930484,0.7930484 0 0 0 4.414201,0.52554934 L 0.44545086,11.638567 a 0.7930484,0.7930484 0 0 0 0.74620774,1.0604 H 2.947107 a 0.7930484,0.7930484 0 0 0 0.7462078,-0.525033 l 0.947229,-2.6504839 h 3.4178794 l 0.947229,2.6504839 a 0.7930484,0.7930484 0 0 0 0.7462077,0.525033 h 1.7580321 a 0.7930484,0.7930484 0 0 0 0.746208,-1.0604 L 8.2873498,0.52554934 A 0.7930484,0.7930484 0 0 0 7.5411421,0 Z M 6.3494835,4.7382123 6.9256757,6.3515505 H 5.7732912 Z" />
    <path
       d="M 5.1593754,0.7937502 1.1906252,11.90625 H 2.9482148 L 4.0821435,8.7312503 H 8.6178582 L 9.7517862,11.90625 H 11.509375 L 7.5406252,0.7937502 Z m 1.1906248,1.5875002 1.700893,4.7624999 H 4.6491075 Z"
       stroke="#ffffff"
       stroke-width="0.198438"
       id="path723"
       sodipodi:nodetypes="ccccccccccccc"
       style="stroke:none" />
  </g>
  <path
     id="path2019"
     style="fill:#d40000;stroke:#ffffff;stroke-width:0.635005"
     d="m 8.6626436,6.1118383 c -0.2774446,0 -0.6035563,0.01209 -0.9440528,0.068034 C 7.3684582,6.231167 7.0558864,6.3195205 6.767973,6.3851308 6.2395512,6.5055485 6.0222318,6.6890868 6.0011837,7.0765627 c -0.00969,0.178588 0.063678,0.3506276 0.169549,0.4720959 0.3300915,0.2931346 0.6721186,0.2054171 1.0070339,0.1282837 0.5106308,-0.1175887 1.0497197,-0.2124672 1.5310946,-0.2360413 0.4903921,-0.024 0.7725203,0.036171 0.9556545,0.179602 0.085564,0.06702 0.2723086,0.2836006 0.2723086,0.492622 0,0.1043375 0,0.2086751 0,0.3130133 C 9.4669598,8.3432575 8.971744,8.3053279 8.5444711,8.2978486 7.5446399,8.2803351 6.7611135,8.5325627 6.1912996,9.0111245 5.6612662,9.4372175 5.3514406,9.9981121 5.3384035,10.555699 c -0.01038,0.444774 0.1536008,0.954922 0.6371034,1.303396 0.560173,0.403734 1.2085427,0.519183 1.7674395,0.523403 0.2946347,0 0.625088,-0.04066 0.9762061,-0.112891 0.4380784,-0.101811 0.8787979,-0.284605 1.2331062,-0.420756 0.00498,0.02715 -0.00137,0.01509 0,0.05645 0.00537,0.143407 0.1234863,0.256816 0.2671723,0.256576 h 1.274206 c 0.148789,0 0.273548,1.55e-4 0.405897,-0.03592 0.117754,-0.03207 0.214724,-0.09163 0.272309,-0.14368 0.124093,-0.11217 0.210655,-0.294277 0.210655,-0.482359 0,-0.07826 -0.0056,-0.170116 -0.04624,-0.266836 -0.04377,-0.104233 -0.110629,-0.172348 -0.159274,-0.215539 C 12.060403,10.914018 11.973451,10.904892 11.91495,10.88412 11.776203,10.83485 11.647121,10.8328 11.49364,10.8328 h -0.22093 c -0.01038,-0.8983159 -0.0051,-1.8224729 -0.0051,-2.7299465 0,-0.6094843 -0.238973,-1.1049107 -0.688483,-1.4522083 C 10.125713,6.2927114 9.4877526,6.1118392 8.6626496,6.1118392 Z m -0.179827,3.5201946 c 0.5227829,-0.02412 1.0577909,0.093861 1.4540356,0.174463 0.00489,0.1509098 -0.00411,0.4477671 -0.00513,0.5490781 -0.3061898,0.21877 -0.667234,0.382739 -1.0738167,0.508017 -0.4013921,0.124921 -0.7653424,0.189865 -1.0841032,0.189865 -0.3762921,0 -0.6691481,-0.07236 -0.8888618,-0.215518 C 6.7859611,10.773451 6.7201722,10.612718 6.7153689,10.51978 6.7068453,10.355212 6.830158,10.185349 7.0698857,10.032289 7.5219574,9.7436554 8.026481,9.6617949 8.4828166,9.6320329 Z"
     sodipodi:nodetypes="scsscsssccsccscccccscssccsscccsccccsscsc" />
</svg>
