<?xml version="1.0" encoding="UTF-8" standalone="no"?>
<svg
   height="16"
   viewBox="0 0 4.2333332 4.2333335"
   width="16"
   version="1.1"
   id="svg2"
   sodipodi:docname="Health_04_16.svg"
   inkscape:version="1.2.1 (9c6d41e410, 2022-07-14)"
   xml:space="preserve"
   inkscape:export-filename="Health_04_16.png"
   inkscape:export-xdpi="96"
   inkscape:export-ydpi="96"
   xmlns:inkscape="http://www.inkscape.org/namespaces/inkscape"
   xmlns:sodipodi="http://sodipodi.sourceforge.net/DTD/sodipodi-0.dtd"
   xmlns:xlink="http://www.w3.org/1999/xlink"
   xmlns="http://www.w3.org/2000/svg"
   xmlns:svg="http://www.w3.org/2000/svg"><defs
     id="defs6"><linearGradient
       inkscape:collect="always"
       id="linearGradient1041"><stop
         style="stop-color:#ffaaaa;stop-opacity:1"
         offset="0"
         id="stop1037" /><stop
         style="stop-color:#ff0000;stop-opacity:1"
         offset="1"
         id="stop1039" /></linearGradient><radialGradient
       inkscape:collect="always"
       xlink:href="#linearGradient1041"
       id="radialGradient1043"
       cx="1.9253448"
       cy="1.5859377"
       fx="1.9253448"
       fy="1.5859377"
       r="1.8520745"
       gradientTransform="matrix(0.25308069,1.0629388,-1.5000071,0.35714457,3.4526832,-0.89314111)"
       gradientUnits="userSpaceOnUse" /><linearGradient
       id="a"
       gradientUnits="userSpaceOnUse"
       x1="14.084459"
       x2="8.9155407"
       y1="14.084459"
       y2="8.9155407"
       gradientTransform="matrix(0.96732065,0,0,0.96732064,0.37581255,0.37581223)"><stop
         offset="0"
         stop-color="#009600"
         id="stop2" /><stop
         offset="1"
         stop-color="#6edb39"
         id="stop4" /></linearGradient><radialGradient
       id="a-2"
       cx="-11.5"
       cy="8.5"
       gradientTransform="rotate(90,-1.5,18.749999)"
       gradientUnits="userSpaceOnUse"
       r="3.5"><stop
         offset="0"
         stop-color="#fff"
         id="stop2-0" /><stop
         offset="1"
         stop-color="#d5e5ff"
         id="stop4-1" /></radialGradient></defs><sodipodi:namedview
     id="namedview4"
     pagecolor="#ffffff"
     bordercolor="#666666"
     borderopacity="1.0"
     inkscape:showpageshadow="2"
     inkscape:pageopacity="0.0"
     inkscape:pagecheckerboard="0"
     inkscape:deskcolor="#d1d1d1"
     showgrid="true"
     inkscape:zoom="57.375"
     inkscape:cx="7.7472767"
     inkscape:cy="8"
     inkscape:current-layer="svg2"><inkscape:grid
       type="xygrid"
       id="grid1292" /></sodipodi:namedview><path
     id="path353"
     style="fill:url(#radialGradient1043);fill-opacity:1;stroke:#d40000;stroke-width:0.264583px;stroke-linecap:butt;stroke-linejoin:miter;stroke-opacity:1"
     d="m 1.2155802,0.39690051 c -0.93105403,0.002291 -1.61151193,1.70202259 0.8743709,3.41127989 3.28034,-2.2555149 1.0468171,-4.49400631 0,-2.83811398 C 1.8364251,0.56903004 1.5131336,0.39616837 1.2155802,0.39690051 Z" /><g
     id="g919"
     transform="scale(0.26458333)"><g
       id="g911"><circle
         cx="9.5"
         cy="9.5"
         r="3.5"
         stroke="#ffffff"
         stroke-linejoin="round"
         stroke-width="0.75"
         id="circle7"
         style="fill:none;stroke:#ffffff;stroke-width:2;stroke-linecap:round;stroke-dasharray:none" /><path
         d="M 10.880769,10.880769 14.25,14.25"
         stroke="#ffffff"
         stroke-width="3"
         id="path9"
         style="fill:none;stroke:#ffffff;stroke-width:3.5;stroke-linecap:round;stroke-dasharray:none" /></g><g
       id="g891"><path
         d="m 10.931,10.931 3.369231,3.369231"
         stroke="#a05a2c"
         stroke-width="1.4"
         id="path11"
         style="fill:none;stroke-linecap:round" /><circle
         cx="9.5"
         cy="9.5"
         fill="url(#a)"
         fill-rule="evenodd"
         r="3.125"
         stroke="#dd8703"
         stroke-linejoin="round"
         id="circle15"
         style="fill:url(#a-2);stroke-width:0.75;stroke-linecap:round;stroke-dasharray:none" /></g></g></svg>
