<?xml version="1.0" encoding="UTF-8" standalone="no"?>
<svg
   height="16"
   width="16"
   version="1.1"
   id="svg4"
   sodipodi:docname="Setup_06_16.svg"
   inkscape:export-filename="Setup_06_16.png"
   inkscape:export-xdpi="96"
   inkscape:export-ydpi="96"
   inkscape:version="1.2-beta (1b65182ce9, 2022-04-05)"
   xmlns:inkscape="http://www.inkscape.org/namespaces/inkscape"
   xmlns:sodipodi="http://sodipodi.sourceforge.net/DTD/sodipodi-0.dtd"
   xmlns="http://www.w3.org/2000/svg"
   xmlns:svg="http://www.w3.org/2000/svg">
  <defs
     id="defs8" />
  <sodipodi:namedview
     id="namedview6"
     pagecolor="#ffffff"
     bordercolor="#666666"
     borderopacity="1.0"
     inkscape:pageshadow="2"
     inkscape:pageopacity="0.0"
     inkscape:pagecheckerboard="0"
     inkscape:deskcolor="#d1d1d1"
     showgrid="true"
     inkscape:zoom="57.375"
     inkscape:cx="8"
     inkscape:cy="8"
     inkscape:current-layer="svg4">
    <inkscape:grid
       type="xygrid"
       id="grid2500" />
  </sodipodi:namedview>
  <path
     d="m10.003988.71213756-1.2454208 2.19011004-1.5170544.0005447-1.2459482-2.19147117-1.7320891.71745477.6685857 2.4306226-1.0731046 1.0723344-2.4292872-.6679962-.71753127 1.7322738 2.19010997 1.2454211.0005444 1.5170549-2.19147089 1.2459475.71745469 1.732089 2.4306223-.668585 1.0723346 1.073104-.6679966 2.429289 1.7322741.717531 1.2454214-2.190111 1.5170536-.000544 1.2459493 2.191471 1.732089-.717456-.668586-2.430622 1.073105-1.072334 2.429288.667996.717531-1.732274-2.190111-1.2454211-.000545-1.5170545 2.191472-1.2459481-.717454-1.7320889-2.430624.6685852-1.072334-1.0731044.667996-2.4292872zm-1.0472798 4.97816314a2.4999998 2.4999998 0 0 1 1.3529898 3.266407 2.4999998 2.4999998 0 0 1 -3.2664067 1.3529903 2.4999998 2.4999998 0 0 1 -1.3529903-3.2664072 2.4999998 2.4999998 0 0 1 3.2664072-1.3529901z"
     fill="none"
     stroke="#00aad4"
     stroke-linejoin="round"
     stroke-width=".999997"
     id="path2" />
</svg>
