<?xml version="1.0" encoding="UTF-8" standalone="no"?>
<svg
   height="64"
   viewBox="0 0 16.933333 16.933335"
   width="64"
   version="1.1"
   id="svg623"
   sodipodi:docname="Picture_11_64.svg"
   inkscape:version="1.2 (dc2aedaf03, 2022-05-15)"
   inkscape:export-filename="Picture_11_64.png"
   inkscape:export-xdpi="96"
   inkscape:export-ydpi="96"
   xmlns:inkscape="http://www.inkscape.org/namespaces/inkscape"
   xmlns:sodipodi="http://sodipodi.sourceforge.net/DTD/sodipodi-0.dtd"
   xmlns="http://www.w3.org/2000/svg"
   xmlns:svg="http://www.w3.org/2000/svg">
  <defs
     id="defs627" />
  <sodipodi:namedview
     id="namedview625"
     pagecolor="#ffffff"
     bordercolor="#666666"
     borderopacity="1.0"
     inkscape:showpageshadow="2"
     inkscape:pageopacity="0.0"
     inkscape:pagecheckerboard="0"
     inkscape:deskcolor="#d1d1d1"
     showgrid="true"
     inkscape:zoom="14.34375"
     inkscape:cx="26.59695"
     inkscape:cy="32"
     inkscape:current-layer="svg623">
    <inkscape:grid
       type="xygrid"
       id="grid1262" />
  </sodipodi:namedview>
  <g
     id="g2843"
     transform="matrix(1.0583335,0,0,1.0583335,-2.0583335e-6,-1e-6)">
    <g
       stroke-width="0.5"
       id="g2657"
       style="fill:none;stroke:#00aad4;stroke-linecap:round">
      <circle
         cx="4.5"
         cy="5.5"
         r="1"
         stroke-linejoin="round"
         id="circle2639" />
      <path
         d="m 4.5,3.5 v 1"
         id="path2641" />
      <path
         d="M 3.0857864,4.0857864 3.7928932,4.7928932"
         id="path2643" />
      <path
         d="m 2.5,5.5 h 1"
         id="path2645" />
      <path
         d="M 3.0857864,6.9142136 3.7928932,6.2071068"
         id="path2647" />
      <path
         d="m 4.5,7.5 v -1"
         id="path2649" />
      <path
         d="M 5.9142136,6.9142136 5.2071068,6.2071068"
         id="path2651" />
      <path
         d="m 6.5,5.5 h -1"
         id="path2653" />
      <path
         d="M 5.9142136,4.0857864 5.2071068,4.7928932"
         id="path2655" />
    </g>
    <path
       d="M 0.5,12 3,8.5 5,10 11,4 15.5,7"
       stroke-linejoin="round"
       stroke-width="0.75"
       id="path2659"
       style="fill:none;stroke:#00aad4;stroke-linecap:round" />
    <path
       d="M 15.500002,7 V 2.5 H 0.5 v 11 H 6"
       stroke-width="0.999996"
       id="path2661"
       style="fill:none;stroke:#00aad4;stroke-linecap:round" />
  </g>
  <g
     id="g1474"
     transform="matrix(1.0583334,0,0,1.0583334,0,-1.0583334)"
     style="stroke:#00aad4;stroke-opacity:1">
    <circle
       style="fill:none;stroke:#00aad4;stroke-width:1;stroke-linecap:round;stroke-linejoin:round;stroke-dasharray:none;stroke-dashoffset:1.49998;stroke-opacity:1"
       id="path346"
       cx="11.5"
       cy="12.5"
       r="4" />
    <path
       style="fill:none;stroke:#00aad4;stroke-width:1px;stroke-linecap:round;stroke-linejoin:round;stroke-opacity:1"
       d="m 9.75,12.25 1.75,-1.75 1.75,1.75"
       id="path1053"
       sodipodi:nodetypes="ccc" />
    <path
       style="fill:none;stroke:#00aad4;stroke-width:1px;stroke-linecap:round;stroke-linejoin:miter;stroke-opacity:1"
       d="m 11.5,11 v 3.5"
       id="path1469"
       sodipodi:nodetypes="cc" />
  </g>
</svg>
