<?xml version="1.0" encoding="UTF-8" standalone="no"?>
<svg
   height="32"
   width="32"
   version="1.1"
   id="svg2723"
   sodipodi:docname="Filter_01_32.svg"
   inkscape:export-filename="Filter_01_32.png"
   inkscape:export-xdpi="96"
   inkscape:export-ydpi="96"
   inkscape:version="1.2 (dc2aedaf03, 2022-05-15)"
   xmlns:inkscape="http://www.inkscape.org/namespaces/inkscape"
   xmlns:sodipodi="http://sodipodi.sourceforge.net/DTD/sodipodi-0.dtd"
   xmlns:xlink="http://www.w3.org/1999/xlink"
   xmlns="http://www.w3.org/2000/svg"
   xmlns:svg="http://www.w3.org/2000/svg">
  <defs
     id="defs2727" />
  <sodipodi:namedview
     id="namedview2725"
     pagecolor="#ffffff"
     bordercolor="#666666"
     borderopacity="1.0"
     inkscape:showpageshadow="2"
     inkscape:pageopacity="0.0"
     inkscape:pagecheckerboard="0"
     inkscape:deskcolor="#d1d1d1"
     showgrid="true"
     inkscape:zoom="28.6875"
     inkscape:cx="15.982571"
     inkscape:cy="16"
     inkscape:current-layer="svg2723">
    <inkscape:grid
       type="xygrid"
       id="grid2846" />
  </sodipodi:namedview>
  <linearGradient
     id="a"
     gradientTransform="matrix(2.2722758 0 0 2.2504066 -17.935946 -2312.8608)"
     gradientUnits="userSpaceOnUse"
     x1="9"
     x2="21"
     y1="1032.3622"
     y2="1032.3622">
    <stop
       offset="0"
       stop-color="#e0c67e"
       id="stop2694" />
    <stop
       offset=".4999288"
       stop-color="#c88e2c"
       id="stop2696" />
    <stop
       offset="1"
       stop-color="#d2a641"
       id="stop2698" />
  </linearGradient>
  <linearGradient
     id="b">
    <stop
       offset="0"
       stop-color="#fc0"
       id="stop2701" />
    <stop
       offset=".33333102"
       stop-color="#fff6d5"
       id="stop2703" />
    <stop
       offset="1"
       stop-color="#fc0"
       id="stop2705" />
  </linearGradient>
  <linearGradient
     id="c"
     gradientTransform="matrix(2.2722758 0 0 2.2504066 -17.935946 -2312.8608)"
     gradientUnits="userSpaceOnUse"
     x1="13"
     x2="18"
     xlink:href="#b"
     y1="1039.3622"
     y2="1039.3622" />
  <linearGradient
     id="d"
     gradientTransform="matrix(2.2722758 0 0 2.2504066 -17.935946 -2312.8608)"
     gradientUnits="userSpaceOnUse"
     x1="11"
     x2="21"
     xlink:href="#b"
     y1="1032.3622"
     y2="1030.3622" />
  <linearGradient
     id="e"
     gradientUnits="userSpaceOnUse"
     x1="8.5"
     x2="23.5"
     y1="5"
     y2="5">
    <stop
       offset="0"
       stop-color="#dfc379"
       id="stop2710" />
    <stop
       offset=".36666667"
       stop-color="#eddcb4"
       id="stop2712" />
    <stop
       offset="1"
       stop-color="#d1a440"
       id="stop2714" />
  </linearGradient>
  <path
     d="m3.5 5 9 11.5h7l9.000001-11v-3h-25.000001z"
     fill="url(#d)"
     fill-rule="evenodd"
     stroke="url(#a)"
     id="path2717" />
  <path
     d="m19.5 16.5-1.25 13h-4.5l-1.25-13z"
     fill="url(#c)"
     fill-rule="evenodd"
     stroke="url(#a)"
     stroke-linecap="square"
     id="path2719" />
  <path
     d="m4 5.5h24"
     fill="none"
     stroke="url(#e)"
     id="path2721" />
</svg>
