<?xml version="1.0" encoding="UTF-8" standalone="no"?>
<svg
   height="64"
   viewBox="0 0 16.933333 16.933335"
   width="64"
   version="1.1"
   id="svg697"
   sodipodi:docname="Sound_06_64.svg"
   inkscape:export-filename="Sound_06_64.png"
   inkscape:export-xdpi="96"
   inkscape:export-ydpi="96"
   inkscape:version="1.2.1 (9c6d41e410, 2022-07-14)"
   xmlns:inkscape="http://www.inkscape.org/namespaces/inkscape"
   xmlns:sodipodi="http://sodipodi.sourceforge.net/DTD/sodipodi-0.dtd"
   xmlns="http://www.w3.org/2000/svg"
   xmlns:svg="http://www.w3.org/2000/svg">
  <defs
     id="defs701" />
  <sodipodi:namedview
     id="namedview699"
     pagecolor="#ffffff"
     bordercolor="#666666"
     borderopacity="1.0"
     inkscape:showpageshadow="2"
     inkscape:pageopacity="0.0"
     inkscape:pagecheckerboard="0"
     inkscape:deskcolor="#d1d1d1"
     showgrid="true"
     inkscape:zoom="14.34375"
     inkscape:cx="29.490196"
     inkscape:cy="32"
     inkscape:current-layer="g695">
    <inkscape:grid
       type="xygrid"
       id="grid820" />
  </sodipodi:namedview>
  <g
     fill="none"
     stroke="#00aad4"
     stroke-linecap="round"
     stroke-linejoin="round"
     stroke-width=".264583"
     id="g695">
    <g
       transform="scale(4.0000005)"
       id="g687">
      <path
         d="m1.1906248 1.4552083.6614585-.79374995.3968748-.00000001v2.91041666l-.3968748.0000001-.6614585-.7937501"
         id="path683" />
      <rect
         height="1.322917"
         rx=".264583"
         transform="scale(-1 1)"
         width=".79375"
         x="-1.190625"
         y="1.455208"
         id="rect685" />
    </g>
    <g
       transform="matrix(0 -3.999996 3.9984595 0 .004076 .000008)"
       id="g693"
       style="stroke:#ff7f2a;stroke-opacity:1">
      <path
         d="m-1.5875001 2.7781248a.5291667.39687499 0 0 1 -.2645834.3437038.5291667.39687499 0 0 1 -.5291667 0 .5291667.39687499 0 0 1 -.2645833-.3437038"
         id="path689"
         style="stroke:#ff7f2a;stroke-opacity:1" />
      <path
         d="m-.92604184 2.7781248a1.190625 1.0583334 0 0 1 -.59531246.9165436 1.190625 1.0583334 0 0 1 -1.190625 0 1.190625 1.0583334 0 0 1 -.5953124-.9165436"
         id="path691"
         style="stroke:#ff7f2a;stroke-opacity:1" />
    </g>
  </g>
</svg>
