<svg width="36" height="36" version="1.1" xmlns="http://www.w3.org/2000/svg">
 <defs>
  <radialGradient id="a" cx="12.1" cy="10.900001" r="4.5" gradientTransform="matrix(0,2.3164983,-2.3164981,4e-8,48.622561,-4.656904)" gradientUnits="userSpaceOnUse">
   <stop stop-color="#5599ff" offset="0"/>
   <stop stop-color="#0055d4" offset="1"/>
  </radialGradient>
 </defs>
 <g stroke="#ffffff" stroke-linecap="round">
  <circle transform="matrix(0,1,1,0,0,0)" cx="26.500002" cy="26.5" r="8.6000004" fill="url(#a)" stroke-dashoffset="1.49998" stroke-linejoin="round" stroke-width="1.8"/>
  <path d="m22.562595 27.093655 3.937242 3.937405 3.937568-3.937405" fill="none" stroke-linejoin="round" stroke-width="2.24994"/>
  <path d="m26.499859 31.03106v-8.999784" fill="none" stroke-width="2.24994px"/>
 </g>
</svg>
