<?xml version="1.0" encoding="UTF-8" standalone="no"?>
<svg
   width="36"
   height="36"
   version="1.1"
   viewBox="0 0 36 36"
   id="svg6"
   sodipodi:docname="todbcconnection_150.svg"
   inkscape:version="1.3.2 (091e20e, 2023-11-25, custom)"
   inkscape:export-filename="todbcconnection_150.png"
   inkscape:export-xdpi="96"
   inkscape:export-ydpi="96"
   xmlns:inkscape="http://www.inkscape.org/namespaces/inkscape"
   xmlns:sodipodi="http://sodipodi.sourceforge.net/DTD/sodipodi-0.dtd"
   xmlns="http://www.w3.org/2000/svg"
   xmlns:svg="http://www.w3.org/2000/svg">
  <defs
     id="defs6" />
  <sodipodi:namedview
     id="namedview6"
     pagecolor="#ffffff"
     bordercolor="#000000"
     borderopacity="0.25"
     inkscape:showpageshadow="2"
     inkscape:pageopacity="0.0"
     inkscape:pagecheckerboard="0"
     inkscape:deskcolor="#d1d1d1"
     showgrid="true"
     inkscape:current-layer="svg6">
    <inkscape:grid
       id="grid6"
       units="px"
       originx="0"
       originy="0"
       spacingx="0.5"
       spacingy="0.5"
       empcolor="#0099e5"
       empopacity="0.30196078"
       color="#0099e5"
       opacity="0.14901961"
       empspacing="2"
       dotted="false"
       gridanglex="30"
       gridanglez="30"
       visible="true" />
  </sodipodi:namedview>
  <rect
     style="fill:#ffffff;stroke:none;stroke-width:1;stroke-linejoin:round"
     id="rect1"
     width="36"
     height="15"
     x="0"
     y="11"
     ry="1.5" />
  <path
     d="m 36,2.5 h -4.5 v 2 h -4 V 2"
     stroke="#ff0000"
     id="path1"
     style="fill:none;stroke-linejoin:round" />
  <path
     d="m 21,2.5 h 4.5 v -2 h 4 V 3"
     stroke="#2a7efe"
     id="path2"
     style="fill:none;stroke-linejoin:round" />
  <path
     d="m 19.6,22.4 h 3.143334 c 2.760877,0 2.278627,-3.9939 -0.187432,-3.9939 M 19.6,22.4 v -7.8 h 2.955902 c 2.468599,0 2.278627,3.8061 0,3.8061 H 19.6"
     stroke="#333333"
     stroke-linecap="round"
     stroke-width="1.2"
     id="path3"
     style="fill:none;stroke-linejoin:round;stroke:#000000" />
  <path
     d="M 31.283263,20.9185 C 30.774271,22.8281 26.6,23.3449 26.6,19.692 v -2.3833 c 0,-3.6528 4.174271,-3.136 4.683263,-1.2264"
     stroke="#d40000"
     stroke-linecap="round"
     stroke-width="1.2"
     id="path4"
     style="fill:none;stroke-linejoin:round" />
  <path
     d="m 17.167582,19.8508 c 0,1.4685 -0.658329,2.5493 -2.38379,2.5493 H 12.4 v -7.8 h 2.383792 c 1.725461,0 2.38379,1.0807 2.38379,2.5492 z"
     stroke="#333333"
     stroke-linecap="round"
     stroke-width="1.2"
     id="path5"
     style="fill:none;stroke-linejoin:round;stroke:#000000" />
  <path
     d="m 7.3902,14.6 c 1.43552,0 2.59121,1.0688 2.59121,2.3964 v 3.0073 C 9.98141,21.3312 8.82572,22.4 7.3902,22.4 5.95467,22.4 4.799,21.3312 4.799,20.0037 V 16.9964 C 4.799,15.6688 5.95467,14.6 7.3902,14.6 Z"
     stroke="#d40000"
     stroke-linecap="round"
     stroke-width="1.2"
     id="path6"
     style="fill:none;stroke-linejoin:round" />
</svg>
