<?xml version="1.0" encoding="UTF-8" standalone="no"?>
<svg
   width="32"
   height="32"
   version="1.1"
   id="svg317"
   sodipodi:docname="Delete_02_32.svg"
   inkscape:export-filename="Delete_02_32.png"
   inkscape:export-xdpi="96"
   inkscape:export-ydpi="96"
   inkscape:version="1.2 (dc2aedaf03, 2022-05-15)"
   xmlns:inkscape="http://www.inkscape.org/namespaces/inkscape"
   xmlns:sodipodi="http://sodipodi.sourceforge.net/DTD/sodipodi-0.dtd"
   xmlns:xlink="http://www.w3.org/1999/xlink"
   xmlns="http://www.w3.org/2000/svg"
   xmlns:svg="http://www.w3.org/2000/svg">
  <sodipodi:namedview
     id="namedview319"
     pagecolor="#ffffff"
     bordercolor="#666666"
     borderopacity="1.0"
     inkscape:showpageshadow="2"
     inkscape:pageopacity="0.0"
     inkscape:pagecheckerboard="0"
     inkscape:deskcolor="#d1d1d1"
     showgrid="true"
     inkscape:zoom="28.6875"
     inkscape:cx="15.982571"
     inkscape:cy="16"
     inkscape:current-layer="svg317">
    <inkscape:grid
       type="xygrid"
       id="grid1117" />
  </sodipodi:namedview>
  <defs
     id="defs283">
    <linearGradient
       id="linearGradient2838"
       x1="1"
       x2="15"
       y1="9"
       y2="9"
       gradientTransform="matrix(2.0887 0 0 2.0714 -.70954 -.60714)"
       gradientUnits="userSpaceOnUse"
       xlink:href="#a" />
    <linearGradient
       id="linearGradient2840"
       x1="1"
       x2="15"
       y1="9"
       y2="9"
       gradientTransform="matrix(2.0887 0 0 2.0714 -.70954 .39286)"
       gradientUnits="userSpaceOnUse"
       xlink:href="#a" />
  </defs>
  <linearGradient
     id="a">
    <stop
       stop-color="#999"
       offset="0"
       id="stop285" />
    <stop
       stop-color="#ccc"
       offset=".42857"
       id="stop287" />
    <stop
       stop-color="#666"
       offset="1"
       id="stop289" />
  </linearGradient>
  <linearGradient
     id="d"
     x1="1"
     x2="15"
     y1="9"
     y2="9"
     gradientTransform="matrix(2.0887 0 0 2.0714 -.70954 -4.6071)"
     gradientUnits="userSpaceOnUse"
     xlink:href="#a" />
  <g
     fill="none"
     id="g315">
    <path
       d="m2.5 2.5h27l-4 29h-19z"
       stroke="url(#linearGradient2838)"
       id="path293" />
    <g
       stroke="url(#linearGradient2840)"
       id="g303">
      <path
         d="m5.5 26.5h21"
         id="path295" />
      <path
         d="m5 20.5h22"
         id="path297" />
      <path
         d="m4 14.5h24"
         id="path299" />
      <path
         d="m3.5 8.5h25"
         id="path301" />
    </g>
    <g
       stroke="url(#linearGradient2838)"
       id="g311">
      <path
         d="m11.5 31.5-2.8104-29"
         id="path305" />
      <path
         d="m20.5 31.5 2.8104-29"
         id="path307" />
      <path
         d="m16 31.5v-29"
         id="path309" />
    </g>
    <path
       d="m2.5 3.5h27"
       stroke="url(#d)"
       id="path313" />
  </g>
</svg>
