<?xml version="1.0" encoding="UTF-8" standalone="no"?>
<svg
   width="48"
   height="48"
   version="1.1"
   viewBox="0 0 48 48"
   id="svg4"
   sodipodi:docname="Magnet_01_48.svg"
   inkscape:export-filename="Magnet_01_48.png"
   inkscape:export-xdpi="96"
   inkscape:export-ydpi="96"
   inkscape:version="1.3.2 (091e20e, 2023-11-25, custom)"
   xmlns:inkscape="http://www.inkscape.org/namespaces/inkscape"
   xmlns:sodipodi="http://sodipodi.sourceforge.net/DTD/sodipodi-0.dtd"
   xmlns="http://www.w3.org/2000/svg"
   xmlns:svg="http://www.w3.org/2000/svg">
  <sodipodi:namedview
     id="namedview4"
     pagecolor="#ffffff"
     bordercolor="#000000"
     borderopacity="0.25"
     inkscape:showpageshadow="2"
     inkscape:pageopacity="0.0"
     inkscape:pagecheckerboard="0"
     inkscape:deskcolor="#d1d1d1"
     showgrid="true"
     inkscape:current-layer="svg4">
    <inkscape:grid
       id="grid4"
       units="px"
       originx="0"
       originy="0"
       spacingx="0.5"
       spacingy="0.5"
       empcolor="#0099e5"
       empopacity="0.30196078"
       color="#0099e5"
       opacity="0.14901961"
       empspacing="2"
       dotted="false"
       gridanglex="30"
       gridanglez="30"
       visible="true" />
  </sodipodi:namedview>
  <defs
     id="defs1">
    <filter
       id="c"
       x="-0.19657702"
       y="-0.11749647"
       width="1.393154"
       height="1.2949109"
       color-interpolation-filters="sRGB">
      <feGaussianBlur
         stdDeviation="0.416 0.664"
         id="feGaussianBlur1" />
    </filter>
  </defs>
  <path
     d="m36.750134 12.749629v-9.7501028"
     fill="none"
     stroke="#b3b3b3"
     stroke-width="10.5001"
     id="path1" />
  <path
     d="m11.249864 12.749629v-9.7501028"
     fill="none"
     stroke="#b3b3b3"
     stroke-width="10.5001"
     id="path2" />
  <path
     d="m36.750134 12.749629v17.250183c0 7.041704-5.70843 12.750135-12.750135 12.750135-7.041704 0-12.750135-5.708431-12.750135-12.750135v-17.250183"
     fill="none"
     stroke="#ff0000"
     stroke-width="10.5001"
     id="path3" />
  <path
     transform="matrix(2.8048715 0 0 2.7330166 .1585939 2.8893862)"
     d="m3.8934971 0.53638592v9.0629606c0 5.9999995 9.2130049 5.9999995 9.2130049 0v-9.0629606"
     fill="none"
     filter="url(#c)"
     opacity=".7"
     stroke="#ffffff"
     stroke-width="1.62533"
     style="mix-blend-mode:normal"
     id="path4" />
</svg>
