<svg width="48" height="48" version="1.1" viewBox="0 0 12.7 12.7" xmlns="http://www.w3.org/2000/svg">
 <g fill="none" stroke="#00aad4" stroke-linecap="round" stroke-linejoin="round">
  <path d="m1.9182 0.33073h8.8635v12.039h-8.8635z" stroke-width=".66146"/>
  <path d="m3.4396 1.8521 5.8208 1e-7v1.8521h-5.8208z" stroke-width=".52916"/>
  <g stroke-width=".52917">
   <g transform="translate(-1e-6 .26458)">
    <path d="m8.9958 5.0271-4e-7 1.0583h-1.0583"/>
    <path d="m4.7625 5.0271-4e-7 1.0583h-1.0583"/>
    <path d="m6.8792 5.0271-4e-7 1.0583h-1.0583"/>
   </g>
   <g transform="translate(-1e-6 4.4979)">
    <path d="m8.9958 5.0271-4e-7 1.0583h-1.0583"/>
    <path d="m4.7625 5.0271-4e-7 1.0583h-1.0583"/>
    <path d="m6.8792 5.0271-4e-7 1.0583h-1.0583"/>
   </g>
   <g transform="translate(-1e-6 2.3812)">
    <path d="m8.9958 5.0271-4e-7 1.0583h-1.0583"/>
    <path d="m4.7625 5.0271-4e-7 1.0583h-1.0583"/>
    <path d="m6.8792 5.0271-4e-7 1.0583h-1.0583"/>
   </g>
  </g>
 </g>
</svg>
