<svg width="16" height="16" version="1.0" xmlns="http://www.w3.org/2000/svg">
 <path d="m13 10.499956-5-5.4999998-5 5.4999998" fill="none" stroke="#36cd36" stroke-linecap="round" stroke-linejoin="round" stroke-width="1.8"/>
</svg>
