<svg width="32" height="32" version="1.0" xmlns="http://www.w3.org/2000/svg">
 <rect x=".5" y="7.5" width="31" height="22" fill="#f9f9f9" stroke="#2a7efe" style="paint-order:normal"/>
 <path d="m2.8 2h26.4c1.4 0 2.8 1.4 2.8 2.8v3.2h-32v-3.2c0-1.4 1.4-2.8 2.8-2.8z" fill="#2a7efe"/>
</svg>
