<svg width="64" height="64" version="1.1" xmlns="http://www.w3.org/2000/svg">
 <circle transform="matrix(0,1,1,0,0,0)" cx="45.999996" cy="46.000004" r="16.4" fill="#fffffe" stroke="#00aad4" stroke-dashoffset="1.49998" stroke-linecap="round" stroke-linejoin="round" stroke-width="3.19999"/>
 <path d="m46 38v16" fill="none" stroke="#00aad4" stroke-linecap="round" stroke-width="3.2"/>
 <path d="m54 46h-16" fill="none" stroke="#00aad4" stroke-linecap="round" stroke-width="3.2"/>
</svg>
