<?xml version="1.0" encoding="UTF-8" standalone="no"?>
<svg
   height="24"
   viewBox="0 0 6.3499998 6.3500003"
   width="24"
   version="1.1"
   id="svg47"
   sodipodi:docname="Cube_04_24.svg"
   inkscape:export-filename="Cube_04_24.png"
   inkscape:export-xdpi="96"
   inkscape:export-ydpi="96"
   inkscape:version="1.2.1 (9c6d41e410, 2022-07-14)"
   xmlns:inkscape="http://www.inkscape.org/namespaces/inkscape"
   xmlns:sodipodi="http://sodipodi.sourceforge.net/DTD/sodipodi-0.dtd"
   xmlns="http://www.w3.org/2000/svg"
   xmlns:svg="http://www.w3.org/2000/svg">
  <defs
     id="defs51" />
  <sodipodi:namedview
     id="namedview49"
     pagecolor="#ffffff"
     bordercolor="#666666"
     borderopacity="1.0"
     inkscape:showpageshadow="2"
     inkscape:pageopacity="0.0"
     inkscape:pagecheckerboard="0"
     inkscape:deskcolor="#d1d1d1"
     showgrid="true"
     inkscape:zoom="38.25"
     inkscape:cx="11.986928"
     inkscape:cy="12"
     inkscape:current-layer="svg47">
    <inkscape:grid
       type="xygrid"
       id="grid1232" />
  </sodipodi:namedview>
  <linearGradient
     id="a"
     gradientUnits="userSpaceOnUse"
     x1="8.5"
     x2="10.486842"
     y1="-2.5"
     y2="2.494157">
    <stop
       offset="0"
       stop-color="#aeefff"
       id="stop2" />
    <stop
       offset="1"
       stop-color="#0cf"
       id="stop4" />
  </linearGradient>
  <g
     stroke="#165044"
     id="g45">
    <g
       fill-rule="evenodd"
       stroke-linejoin="round"
       stroke-width=".5"
       transform="matrix(.26458334 0 0 .26458334 .264583 1.852083)"
       id="g13">
      <path
         d="m10.486842 2.4342149-9.2368421-4.1052632 10.2631581-3.0789474 9.236842 4.10526318z"
         fill="url(#a)"
         id="path7" />
      <path
         d="m1.2499999-1.6710483v12.3157893l9.2368421 4.105263v-12.3157891z"
         fill="#f0f000"
         id="path9" />
      <path
         d="m20.75-.64473252v11.80262652l-10.263158 3.59211v-12.3157891z"
         fill="#00d455"
         id="path11" />
    </g>
    <g
       fill="none"
       id="g43">
      <g
         stroke-width=".487179"
         transform="matrix(.27154606226 0 0 .27154606226 .18799300224 1.81726912412)"
         id="g23">
        <path
           d="m10.5 6.5 10-3.45"
           id="path15" />
        <path
           d="m10.5 10.275388 10-3.4617187"
           id="path17" />
        <path
           d="m14 1.45v11.825"
           id="path19" />
        <path
           d="m17 .55000001v11.67499999"
           id="path21" />
      </g>
      <g
         stroke-width=".5"
         transform="matrix(.26458334 0 0 .26458334 .264583 1.852083)"
         id="g41">
        <path
           d="m10.486842 6.5394728-9.2368305-4.1052632"
           id="path25" />
        <path
           d="m10.486842 10.414213-9.2368421-4.1052633"
           id="path27" />
        <path
           d="m7.4078947 1.065792v12.315792"
           id="path29" />
        <path
           d="m4.3289473-.30263079v12.31579379"
           id="path31" />
        <path
           d="m14.078947 1.356578-9.2368418-4.1052683"
           id="path33" />
        <path
           d="m17.157895.4328989-9.2368308-4.1052632"
           id="path35" />
        <path
           d="m17.671053-2.0131589-10.2631583 3.0789527"
           id="path37" />
        <path
           d="m14.592105-3.3815799-10.2631577 3.07895264"
           id="path39" />
      </g>
    </g>
  </g>
</svg>
