<?xml version="1.0" encoding="UTF-8" standalone="no"?>
<svg
   height="32"
   width="32"
   version="1.1"
   id="svg314"
   sodipodi:docname="Light_01_32.svg"
   inkscape:export-filename="Light_01_32.png"
   inkscape:export-xdpi="96"
   inkscape:export-ydpi="96"
   inkscape:version="1.2-beta (1b65182ce9, 2022-04-05)"
   xmlns:inkscape="http://www.inkscape.org/namespaces/inkscape"
   xmlns:sodipodi="http://sodipodi.sourceforge.net/DTD/sodipodi-0.dtd"
   xmlns="http://www.w3.org/2000/svg"
   xmlns:svg="http://www.w3.org/2000/svg">
  <defs
     id="defs318" />
  <sodipodi:namedview
     id="namedview316"
     pagecolor="#ffffff"
     bordercolor="#666666"
     borderopacity="1.0"
     inkscape:pageshadow="2"
     inkscape:pageopacity="0.0"
     inkscape:pagecheckerboard="0"
     inkscape:deskcolor="#d1d1d1"
     showgrid="true"
     inkscape:zoom="28.6875"
     inkscape:cx="16"
     inkscape:cy="16"
     inkscape:current-layer="svg314">
    <inkscape:grid
       type="xygrid"
       id="grid979" />
  </sodipodi:namedview>
  <linearGradient
     id="a"
     gradientTransform="matrix(2.5,0,0,2.5999998,-4,-8.699997)"
     gradientUnits="userSpaceOnUse"
     x1="6"
     x2="10"
     y1="12.833333"
     y2="12.833333">
    <stop
       offset="0"
       stop-color="#999"
       id="stop285" />
    <stop
       offset=".39922822"
       stop-color="#fff"
       id="stop287" />
    <stop
       offset="1"
       stop-color="#999"
       id="stop289" />
  </linearGradient>
  <radialGradient
     id="b"
     cx="6.497474"
     cy="3.206305"
     gradientTransform="matrix(-4e-8,1.8461535,-1.8461538,-1.3e-7,13.419332,-8.495334)"
     gradientUnits="userSpaceOnUse"
     r="3.25">
    <stop
       offset="0"
       stop-color="#fff"
       id="stop292" />
    <stop
       offset=".16666666"
       stop-color="#fff"
       id="stop294" />
    <stop
       offset="1"
       stop-color="#9fc0df"
       id="stop296" />
  </radialGradient>
  <filter
     id="c"
     color-interpolation-filters="sRGB"
     height="1.3660874"
     width="1.3987902"
     x="-0.1993951"
     y="-0.18304369">
    <feGaussianBlur
       stdDeviation="0.47768985"
       id="feGaussianBlur299" />
  </filter>
  <g
     id="g2121">
    <path
       d="m 11.491567,22.769484 c 0,-4.700726 0,-4.700726 -2.2610003,-8.461307 C 8.1000667,12.427887 7.5,10.820436 7.5,8 7.5,4.2394193 10.3475,0.5 16,0.5 c 5.6525,0 8.5,3.7394193 8.5,7.5 0,2.820436 -0.572933,4.427887 -1.703433,6.308177 -2.261,3.760581 -2.261,3.760581 -2.261,8.461307 z"
       fill="#e0ebf5"
       stroke="#64b0d3"
       id="path302"
       style="fill-rule:evenodd" />
    <path
       d="m 11,21.5 h 10 v 6.33658 c 0,1.206969 -1.25,2.112192 -2.5,2.112192 h -5 c -1.25,0 -2.499999,-0.905223 -2.499999,-2.112192 z"
       fill="#999999"
       id="path304"
       style="fill-rule:evenodd" />
    <path
       d="m 13.187316,29.948774 h 5.6525 L 17.144067,32 h -2.261 z"
       fill="#333333"
       id="path306"
       style="fill-rule:evenodd" />
    <path
       d="m 12,22.5 h 8 v 5.416665 c 0,0.600168 -1.014694,1.083334 -1.568694,1.083334 H 13.568694 C 13.014694,28.999999 12,28.516833 12,27.916665 Z"
       fill="url(#a)"
       id="path308"
       style="fill:url(#a);fill-rule:evenodd" />
    <ellipse
       cx="8.4940004"
       cy="4.75"
       fill="url(#b)"
       filter="url(#c)"
       rx="2.8748341"
       ry="3.131645"
       transform="matrix(2.261,0,0,2.0512258,-3.204933,-0.819613)"
       id="ellipse310"
       style="fill:url(#b);fill-rule:evenodd;filter:url(#c)" />
  </g>
</svg>
