<svg width="48" height="48" version="1.1" xmlns="http://www.w3.org/2000/svg">
 <circle transform="matrix(0,1,1,0,0,0)" cx="34.499996" cy="34.499996" r="12.3" fill="#fffffe" stroke="#00aad4" stroke-dashoffset="1.49998" stroke-linecap="round" stroke-linejoin="round" stroke-width="2.40001"/>
 <path d="m34.5 28v13" fill="none" stroke="#00aad4" stroke-linecap="round" stroke-width="2.4"/>
 <path d="m41 34.5h-13" fill="none" stroke="#00aad4" stroke-linecap="round" stroke-width="2.4"/>
</svg>
