<?xml version="1.0" encoding="UTF-8" standalone="no"?>
<svg
   width="24"
   height="24"
   version="1.1"
   viewBox="0 0 24 24"
   id="svg8"
   sodipodi:docname="treplacedialog.svg"
   inkscape:export-filename="treplacedialog.png"
   inkscape:export-xdpi="96"
   inkscape:export-ydpi="96"
   inkscape:version="1.3.2 (091e20e, 2023-11-25, custom)"
   xmlns:inkscape="http://www.inkscape.org/namespaces/inkscape"
   xmlns:sodipodi="http://sodipodi.sourceforge.net/DTD/sodipodi-0.dtd"
   xmlns="http://www.w3.org/2000/svg"
   xmlns:svg="http://www.w3.org/2000/svg">
  <sodipodi:namedview
     id="namedview8"
     pagecolor="#ffffff"
     bordercolor="#000000"
     borderopacity="0.25"
     inkscape:showpageshadow="2"
     inkscape:pageopacity="0.0"
     inkscape:pagecheckerboard="0"
     inkscape:deskcolor="#d1d1d1"
     showgrid="true"
     inkscape:current-layer="svg8"
     showguides="true">
    <inkscape:grid
       id="grid8"
       units="px"
       originx="0"
       originy="0"
       spacingx="0.5"
       spacingy="0.5"
       empcolor="#0099e5"
       empopacity="0.30196078"
       color="#0099e5"
       opacity="0.14901961"
       empspacing="2"
       dotted="false"
       gridanglex="30"
       gridanglez="30"
       visible="true" />
  </sodipodi:namedview>
  <defs
     id="defs3">
    <radialGradient
       id="a"
       cx="5.9885998"
       cy="7.2880998"
       r="3.75"
       gradientTransform="matrix(-1.9121759e-7,1.183728,-1.0926832,-1.7073279e-7,18.93952,4.7037448)"
       gradientUnits="userSpaceOnUse">
      <stop
         stop-color="#f8fbff"
         offset="0"
         id="stop1" />
      <stop
         stop-color="#d1e3ff"
         offset=".66667"
         id="stop2" />
      <stop
         stop-color="#f8fbff"
         offset="1"
         id="stop3" />
    </radialGradient>
  </defs>
  <rect
     x="1.25"
     y="4.25"
     width="21.5"
     height="18.5"
     fill="#f9f9f9"
     stroke="#2a7efe"
     stroke-width=".5"
     style="paint-order:normal"
     id="rect3" />
  <path
     d="m 2.5,1 h 19 C 22.35,1 23,1.6 23,2.5 V 4 H 1 V 2.5 C 1,1.6 1.6,1 2.5,1 Z"
     fill="#2a7efe"
     id="path3"
     sodipodi:nodetypes="sssccss"
     style="stroke:none" />
  <path
     d="m 15,16.5 3,3"
     stroke="#cba201"
     stroke-linecap="round"
     stroke-width="2"
     id="path4"
     style="fill:none"
     sodipodi:nodetypes="cc" />
  <circle
     cx="12"
     cy="13.5"
     r="3.4999998"
     fill="url(#a)"
     fill-rule="evenodd"
     stroke="#2a7efe"
     stroke-linejoin="round"
     stroke-width="0.75"
     id="circle4"
     style="fill:url(#a);stroke-width:0.5;stroke-dasharray:none" />
  <path
     d="m17.3 6.8 1.7 1.7-1.7 1.7"
     stroke="#01a901"
     stroke-linecap="round"
     stroke-linejoin="round"
     id="path5"
     style="fill:none" />
  <path
     d="m19 8.5h-6.5"
     stroke="#01a901"
     stroke-linecap="round"
     id="path6"
     style="fill:none" />
  <path
     d="m6.7 16.8-1.7 1.7 1.7 1.7"
     fill="none"
     stroke="#fa0302"
     stroke-linecap="round"
     stroke-linejoin="round"
     id="path7" />
  <path
     d="m5 18.5h6.5"
     fill="none"
     stroke="#fa0302"
     stroke-linecap="round"
     id="path8" />
</svg>
