<?xml version="1.0" encoding="UTF-8" standalone="no"?>
<svg
   height="64"
   viewBox="0 0 16.933333 16.933335"
   width="64"
   version="1.1"
   id="svg623"
   sodipodi:docname="Font_15_64.svg"
   inkscape:version="1.2 (dc2aedaf03, 2022-05-15)"
   inkscape:export-filename="Font_15_64.png"
   inkscape:export-xdpi="96"
   inkscape:export-ydpi="96"
   xmlns:inkscape="http://www.inkscape.org/namespaces/inkscape"
   xmlns:sodipodi="http://sodipodi.sourceforge.net/DTD/sodipodi-0.dtd"
   xmlns="http://www.w3.org/2000/svg"
   xmlns:svg="http://www.w3.org/2000/svg">
  <defs
     id="defs627">
    <filter
       inkscape:collect="always"
       style="color-interpolation-filters:sRGB"
       id="filter1784"
       x="-0.0875056"
       y="-0.065621853"
       width="1.1750112"
       height="1.1312437">
      <feGaussianBlur
         inkscape:collect="always"
         stdDeviation="0.46301277"
         id="feGaussianBlur1786" />
    </filter>
  </defs>
  <sodipodi:namedview
     id="namedview625"
     pagecolor="#ffffff"
     bordercolor="#666666"
     borderopacity="1.0"
     inkscape:showpageshadow="2"
     inkscape:pageopacity="0.0"
     inkscape:pagecheckerboard="0"
     inkscape:deskcolor="#d1d1d1"
     showgrid="true"
     inkscape:zoom="14.34375"
     inkscape:cx="28.583878"
     inkscape:cy="32"
     inkscape:current-layer="svg623">
    <inkscape:grid
       type="xygrid"
       id="grid1262" />
  </sodipodi:namedview>
  <g
     id="g1790">
    <path
       id="path1225"
       style="fill:#ffffff;fill-opacity:1;stroke:none;stroke-width:0.264583;stroke-dasharray:none;filter:url(#filter1784)"
       d="M 3.1760337 0 A 1.0586998 1.0586998 0 0 0 2.1171835 1.0588501 L 2.1171835 15.875001 A 1.0586998 1.0586998 0 0 0 3.1760337 16.933851 L 9.2971073 16.933851 C 10.918124 16.933851 12.301175 16.505513 13.294796 15.650208 C 14.288416 14.794902 14.81615 13.525799 14.81615 12.1698 C 14.816151 10.402241 13.877449 9.0985677 12.698967 8.2852827 C 12.894169 8.1135472 13.173319 8.0710294 13.337688 7.8594689 C 13.960246 7.0581664 14.286984 5.9960142 14.286984 4.7614667 C 14.286984 3.614788 13.764807 2.4817113 12.876734 1.5740642 C 11.988662 0.66641696 10.678309 1.5666465e-16 9.1229577 0 L 3.1760337 0 z M 6.8786502 4.234367 L 8.466667 4.234367 C 8.6434471 4.234367 8.9430881 4.3555376 9.1736006 4.5857668 C 9.4041133 4.815996 9.5255171 5.1150211 9.5255171 5.2911501 C 9.5255171 5.4721025 9.4055063 5.7713366 9.1777347 6.0001508 C 8.9499631 6.228965 8.6547915 6.3494835 8.466667 6.3494835 L 6.8786502 6.3494835 L 6.8786502 4.234367 z M 6.9318769 10.583851 L 8.9963505 10.583851 C 9.1724787 10.583851 9.4725667 10.705049 9.7032841 10.935767 C 9.9340014 11.166484 10.054683 11.466572 10.054684 11.642701 C 10.054684 11.995261 9.9608984 12.270131 9.8376428 12.417847 C 9.7143873 12.565562 9.5551749 12.698967 8.9963505 12.698967 L 6.9318769 12.698967 L 6.9318769 10.583851 z " />
    <path
       d="M 3.1749999,1.0583333 V 15.875001 H 9.297624 c 2.873209,0 4.460709,-1.500684 4.46071,-3.704168 1e-6,-2.116667 -1.723586,-3.4699113 -3.175001,-3.7041663 1.5875,-0.529167 2.645833,-1.5875 2.645833,-3.704167 0,-1.5874997 -1.5875,-3.7041664 -4.105176,-3.7041664 z M 5.8208329,3.175 H 8.466666 c 1.058334,0 2.116667,1.0583327 2.116667,2.1166667 0,1.058333 -1.043864,2.116666 -2.116667,2.116666 H 5.8208329 Z m 0.051676,6.3499997 H 8.995833 c 1.058333,0 2.116666,1.0583333 2.116666,2.1166673 0,1.058333 -0.529166,2.116666 -2.116666,2.116666 H 5.8725093 Z"
       id="path2"
       style="fill:#000000;fill-opacity:1;stroke:none;stroke-width:0.264583;stroke-dasharray:none"
       sodipodi:nodetypes="ccsscssccssscccssscc" />
  </g>
</svg>
