<?xml version="1.0" encoding="UTF-8" standalone="no"?>
<svg
   width="48"
   height="48"
   version="1.1"
   viewBox="0 0 48 48"
   id="svg14"
   sodipodi:docname="tsynperlsyn_200.svg"
   inkscape:version="1.3.2 (091e20e, 2023-11-25, custom)"
   xmlns:inkscape="http://www.inkscape.org/namespaces/inkscape"
   xmlns:sodipodi="http://sodipodi.sourceforge.net/DTD/sodipodi-0.dtd"
   xmlns="http://www.w3.org/2000/svg"
   xmlns:svg="http://www.w3.org/2000/svg">
  <defs
     id="defs14" />
  <sodipodi:namedview
     id="namedview14"
     pagecolor="#ffffff"
     bordercolor="#000000"
     borderopacity="0.25"
     inkscape:showpageshadow="2"
     inkscape:pageopacity="0.0"
     inkscape:pagecheckerboard="0"
     inkscape:deskcolor="#d1d1d1"
     showgrid="true"
     inkscape:current-layer="svg14">
    <inkscape:grid
       id="grid14"
       units="px"
       originx="0"
       originy="0"
       spacingx="0.5"
       spacingy="0.5"
       empcolor="#0099e5"
       empopacity="0.30196078"
       color="#0099e5"
       opacity="0.14901961"
       empspacing="2"
       dotted="false"
       gridanglex="30"
       gridanglez="30"
       visible="true" />
  </sodipodi:namedview>
  <rect
     x="2.5"
     y="2.5"
     width="41"
     height="43"
     fill="#ffffff"
     fill-rule="evenodd"
     stroke="#2a7efe"
     stroke-linecap="square"
     stroke-linejoin="round"
     style="paint-order:normal"
     id="rect1" />
  <rect
     x="3"
     y="3"
     width="7"
     height="24"
     fill="#b3b3b3"
     fill-rule="evenodd"
     stroke-width=".755929"
     style="paint-order:normal"
     id="rect2" />
  <path
     d="m14 9h22"
     fill="none"
     stroke="#666666"
     stroke-width="2px"
     id="path2" />
  <path
     d="m18 13h8"
     fill="none"
     stroke="#666666"
     stroke-width="2px"
     id="path3" />
  <path
     d="m22 17h12"
     fill="none"
     stroke="#666666"
     stroke-width="2px"
     id="path4" />
  <path
     d="m18 21h4"
     fill="none"
     stroke="#666666"
     stroke-width="2px"
     id="path5" />
  <path
     d="m14 25h8"
     fill="none"
     stroke="#666666"
     stroke-width="2px"
     id="path6" />
  <path
     d="m28 13h6"
     fill="none"
     stroke="#ff0000"
     stroke-width="2px"
     id="path7" />
  <path
     d="m24 24.9998h12"
     fill="none"
     stroke="#ff0000"
     stroke-width="2px"
     id="path8" />
  <path
     d="m22 21h6"
     fill="none"
     stroke="#2a7fff"
     stroke-width="2px"
     id="path9" />
  <path
     d="m28 21h4"
     fill="none"
     stroke="#666666"
     stroke-width="2px"
     id="path10" />
  <path
     d="m6.80002 41.2v-10.3996h3.00005c4.00007 0 4.00007 5.70098 0 5.70098h-3.00005"
     fill="none"
     stroke="#2c5aa0"
     stroke-linecap="round"
     stroke-linejoin="round"
     stroke-width="1.60003"
     id="path11" />
  <path
     d="m21.6974 35.9998h-5.29721m6.10737-5.19978h-6.10737v10.3996h6.10737"
     fill="none"
     stroke="#2c5aa0"
     stroke-linecap="round"
     stroke-linejoin="round"
     stroke-width="1.60003"
     id="path12" />
  <path
     d="m36.4005 30.8v10.3996h3.75773"
     fill="none"
     stroke="#2c5aa0"
     stroke-linecap="round"
     stroke-linejoin="round"
     stroke-width="1.60003"
     id="path13" />
  <path
     d="m32.845 41.1996-2.41908-4.79703m-4.09169 4.79703v-10.3996h3.17831c4.23775 0 4.23775 5.70097 0 5.70097h-3.17831"
     fill="none"
     stroke="#2c5aa0"
     stroke-linecap="round"
     stroke-linejoin="round"
     stroke-width="1.60003"
     id="path14" />
</svg>
