<?xml version="1.0" encoding="UTF-8" standalone="no"?>
<svg
   height="32"
   width="32"
   version="1.1"
   id="svg291"
   sodipodi:docname="Sort_02_32.svg"
   inkscape:export-filename="Sort_02_32.png"
   inkscape:export-xdpi="96"
   inkscape:export-ydpi="96"
   inkscape:version="1.2-beta (1b65182ce9, 2022-04-05)"
   xmlns:inkscape="http://www.inkscape.org/namespaces/inkscape"
   xmlns:sodipodi="http://sodipodi.sourceforge.net/DTD/sodipodi-0.dtd"
   xmlns="http://www.w3.org/2000/svg"
   xmlns:svg="http://www.w3.org/2000/svg">
  <defs
     id="defs295" />
  <sodipodi:namedview
     id="namedview293"
     pagecolor="#ffffff"
     bordercolor="#666666"
     borderopacity="1.0"
     inkscape:pageshadow="2"
     inkscape:pageopacity="0.0"
     inkscape:pagecheckerboard="0"
     inkscape:deskcolor="#d1d1d1"
     showgrid="true"
     inkscape:zoom="28.6875"
     inkscape:cx="13.925926"
     inkscape:cy="16"
     inkscape:current-layer="g1104">
    <inkscape:grid
       type="xygrid"
       id="grid1074" />
  </sodipodi:namedview>
  <linearGradient
     id="a"
     gradientUnits="userSpaceOnUse"
     x1="12"
     x2="12"
     y1="11.999999"
     y2="1.499999"
     gradientTransform="matrix(2.0000001,0,0,-2,-1e-6,30.999995)">
    <stop
       offset="0"
       stop-color="#006cbd"
       id="stop278" />
    <stop
       offset="1"
       stop-color="#6bc0ff"
       id="stop280" />
  </linearGradient>
  <g
     id="g1104">
    <g
       id="g5405">
      <path
         d="M 16.5,31 H 13.654317 L 12.523113,27.819918 H 7.3443237 L 6.2749831,31 H 3.5 L 8.5462272,17 H 11.312373 Z M 11.683548,25.461118 9.8983691,20.26603 8.1485386,25.461118 Z"
         fill="#177ecb"
         id="path283"
         style="fill:#d40000;stroke-width:0.969834" />
      <path
         d="m 4,14.999999 v -2.51337 L 12,3.334516 H 4.5 V 1 h 11 V 3.165075 L 7.2840002,12.674897 H 16 v 2.325102 z"
         fill="#d40000"
         id="path285"
         sodipodi:nodetypes="ccccccccccc"
         style="fill:#177ecb;fill-opacity:1;stroke-width:1.0668" />
      <path
         d="m 22,28.999997 v -18 h -4 l 6,-7.9999996 6,7.9999996 h -4 v 18 z"
         fill="url(#a)"
         fill-rule="evenodd"
         id="path287"
         style="fill:url(#a);stroke-width:1" />
    </g>
  </g>
</svg>
