<?xml version="1.0" encoding="UTF-8" standalone="no"?>
<svg
   height="16"
   width="16"
   version="1.1"
   id="svg23"
   sodipodi:docname="Cloud_05_16.svg"
   inkscape:export-filename="Cloud_05_16.png"
   inkscape:export-xdpi="96"
   inkscape:export-ydpi="96"
   inkscape:version="1.2.1 (9c6d41e410, 2022-07-14)"
   xmlns:inkscape="http://www.inkscape.org/namespaces/inkscape"
   xmlns:sodipodi="http://sodipodi.sourceforge.net/DTD/sodipodi-0.dtd"
   xmlns="http://www.w3.org/2000/svg"
   xmlns:svg="http://www.w3.org/2000/svg">
  <defs
     id="defs27" />
  <sodipodi:namedview
     id="namedview25"
     pagecolor="#ffffff"
     bordercolor="#666666"
     borderopacity="1.0"
     inkscape:showpageshadow="2"
     inkscape:pageopacity="0.0"
     inkscape:pagecheckerboard="0"
     inkscape:deskcolor="#d1d1d1"
     showgrid="true"
     inkscape:zoom="57.375"
     inkscape:cx="7.9912854"
     inkscape:cy="8"
     inkscape:current-layer="svg23">
    <inkscape:grid
       type="xygrid"
       id="grid1061" />
  </sodipodi:namedview>
  <linearGradient
     id="a"
     gradientTransform="matrix(1 0 0 .96627912 0 .188371)"
     gradientUnits="userSpaceOnUse"
     x1="7.5"
     x2="9"
     y1="2"
     y2="13">
    <stop
       offset="0"
       stop-color="#5ab4f2"
       id="stop2" />
    <stop
       offset="1"
       stop-color="#0090ff"
       id="stop4" />
  </linearGradient>
  <path
     d="m3.2918266 12.75c-4.3402413 0-4.3402413-5.8903521-.2858606-5.8903521-.5693967-6.06642748 9.122356-5.704998 9.122356-1.4725878 4.918073-.3594726 5.574822 7.3629399-.506798 7.3629399z"
     fill="url(#a)"
     id="path7" />
  <g
     fill="none"
     stroke-linecap="round"
     transform="matrix(1 0 0 -1 0 23)"
     id="g21">
    <path
       d="m6.7500629 10.249937 1.7499271-1.7499991 1.750072 1.7499991"
       stroke="#fff"
       stroke-linejoin="round"
       stroke-width="3"
       id="path9" />
    <path
       d="m8.5 8.5v6"
       stroke="#fff"
       stroke-width="3"
       id="path11" />
    <g
       stroke="#ff7f00"
       stroke-width=".999998"
       id="g19">
      <path
         d="m8.5 9.5v4"
         id="path13" />
      <path
         d="m6.5 10.499938 1.99999-2.0000001 2.00001 2.0000001"
         stroke-linejoin="round"
         id="path15" />
      <path
         d="m8.5 9.5v5"
         id="path17" />
    </g>
  </g>
</svg>
