<?xml version="1.0" encoding="UTF-8" standalone="no"?>
<svg
   height="32"
   width="32"
   version="1.1"
   id="svg425"
   sodipodi:docname="Cut_03_32.svg"
   inkscape:export-filename="Cut_03_32.png"
   inkscape:export-xdpi="96"
   inkscape:export-ydpi="96"
   inkscape:version="1.2.2 (732a01da63, 2022-12-09)"
   xmlns:inkscape="http://www.inkscape.org/namespaces/inkscape"
   xmlns:sodipodi="http://sodipodi.sourceforge.net/DTD/sodipodi-0.dtd"
   xmlns="http://www.w3.org/2000/svg"
   xmlns:svg="http://www.w3.org/2000/svg">
  <defs
     id="defs429" />
  <sodipodi:namedview
     id="namedview427"
     pagecolor="#ffffff"
     bordercolor="#000000"
     borderopacity="0.25"
     inkscape:showpageshadow="2"
     inkscape:pageopacity="0.0"
     inkscape:pagecheckerboard="0"
     inkscape:deskcolor="#d1d1d1"
     showgrid="true"
     inkscape:zoom="28.4375"
     inkscape:cx="15.859341"
     inkscape:cy="16"
     inkscape:current-layer="svg425">
    <inkscape:grid
       type="xygrid"
       id="grid946" />
  </sodipodi:namedview>
  <g
     stroke="#00aad4"
     id="g421">
    <path
       d="m10.599995.59997243c-3.6000043 2.25000197.4 11.25001057 2.600002 16.25001557l-2.200002 5.200005 1.600002 2.800003 3.400003-5.000005 3.400003 5.000005 1.600002-2.800003-2.200002-5.200005c2.200002-5.000005 6.200006-14.0000136 2.600002-16.25001557l-5.400005 12.25001157z"
       fill="#c2f3ff"
       fill-rule="evenodd"
       stroke-linejoin="round"
       stroke-width="1.2"
       id="path413" />
    <g
       fill="none"
       stroke-dashoffset="1.49998"
       stroke-width="2.00102"
       id="g419">
      <ellipse
         cx="-15.883492"
         cy="23.937634"
         rx="3.286446"
         ry="4.469217"
         transform="matrix(-.97401041 -.22650325 -.27031482 .96277199 0 0)"
         id="ellipse415" />
      <ellipse
         cx="14.95676"
         cy="31.19315"
         rx="3.286446"
         ry="4.469217"
         transform="matrix(.97401041 -.22650325 .27031482 .96277199 0 0)"
         id="ellipse417" />
    </g>
  </g>
  <circle
     cx="16"
     cy="16.424986"
     fill="#00aad4"
     r="1.200001"
     id="circle423" />
</svg>
