<?xml version="1.0" encoding="UTF-8" standalone="no"?>
<svg
   height="36"
   width="36"
   version="1.1"
   id="svg6"
   sodipodi:docname="Align_07_36.svg"
   inkscape:export-filename="Align_07_36.png"
   inkscape:export-xdpi="96"
   inkscape:export-ydpi="96"
   inkscape:version="1.3-beta (cedbd6c6ff, 2023-05-28)"
   xmlns:inkscape="http://www.inkscape.org/namespaces/inkscape"
   xmlns:sodipodi="http://sodipodi.sourceforge.net/DTD/sodipodi-0.dtd"
   xmlns="http://www.w3.org/2000/svg"
   xmlns:svg="http://www.w3.org/2000/svg">
  <defs
     id="defs6" />
  <sodipodi:namedview
     id="namedview6"
     pagecolor="#ffffff"
     bordercolor="#000000"
     borderopacity="0.25"
     inkscape:showpageshadow="2"
     inkscape:pageopacity="0.0"
     inkscape:pagecheckerboard="0"
     inkscape:deskcolor="#d1d1d1"
     showgrid="true"
     inkscape:zoom="17.854446"
     inkscape:cx="14.198144"
     inkscape:cy="18.566804"
     inkscape:current-layer="g6">
    <inkscape:grid
       id="grid6"
       units="px"
       originx="0"
       originy="0"
       spacingx="0.5"
       spacingy="0.5"
       empcolor="#0099e5"
       empopacity="0.30196078"
       color="#0099e5"
       opacity="0.14901961"
       empspacing="2"
       dotted="false"
       gridanglex="30"
       gridanglez="30"
       visible="true" />
  </sodipodi:namedview>
  <g
     fill="none"
     stroke="#00aad4"
     stroke-width="1.8"
     transform="translate(0 .1)"
     id="g6">
    <path
       d="m 10,27.8 20,0"
       id="path1"
       sodipodi:nodetypes="cc" />
    <path
       d="m 10,22.8 20,0"
       id="path2"
       sodipodi:nodetypes="cc" />
    <path
       d="m 10,12.8 20,0"
       id="path3"
       sodipodi:nodetypes="cc" />
    <path
       d="m 10,32.8 20,0"
       id="path4"
       sodipodi:nodetypes="cc" />
    <path
       d="m 10,17.8 20,0"
       id="path5"
       sodipodi:nodetypes="cc" />
    <path
       d="m 10,7.8 20,0"
       id="path6"
       sodipodi:nodetypes="cc" />
    <path
       d="m 10,2.8 20,0"
       id="path7"
       sodipodi:nodetypes="cc" />
    <path
       d="M 6,27.8 H 7.9999999"
       id="path8"
       style="stroke-width:1.8" />
    <path
       d="M 6,22.8 H 7.9999999"
       id="path9"
       style="stroke-width:1.8" />
    <path
       d="M 6,12.8 H 7.9999999"
       id="path10"
       style="stroke-width:1.8" />
    <path
       d="M 6,32.8 H 7.9999999"
       id="path11"
       style="stroke-width:1.8" />
    <path
       d="M 6,17.8 H 7.9999999"
       id="path12"
       style="stroke-width:1.8" />
    <path
       d="M 6,7.8 H 7.9999999"
       id="path13"
       style="stroke-width:1.8" />
    <path
       d="M 6,2.8 H 7.9999999"
       id="path14"
       style="stroke-width:1.8" />
  </g>
</svg>
