<?xml version="1.0" encoding="UTF-8" standalone="no"?>
<svg
   height="36"
   width="36"
   version="1.1"
   id="svg151"
   sodipodi:docname="Export_01_36.svg"
   inkscape:export-filename="Export_01_36.png"
   inkscape:export-xdpi="96"
   inkscape:export-ydpi="96"
   inkscape:version="1.2-beta (1b65182ce9, 2022-04-05)"
   xmlns:inkscape="http://www.inkscape.org/namespaces/inkscape"
   xmlns:sodipodi="http://sodipodi.sourceforge.net/DTD/sodipodi-0.dtd"
   xmlns="http://www.w3.org/2000/svg"
   xmlns:svg="http://www.w3.org/2000/svg">
  <defs
     id="defs155" />
  <sodipodi:namedview
     id="namedview153"
     pagecolor="#ffffff"
     bordercolor="#666666"
     borderopacity="1.0"
     inkscape:pageshadow="2"
     inkscape:pageopacity="0.0"
     inkscape:pagecheckerboard="0"
     inkscape:deskcolor="#d1d1d1"
     showgrid="true"
     inkscape:zoom="25.5"
     inkscape:cx="18"
     inkscape:cy="18"
     inkscape:current-layer="svg151">
    <inkscape:grid
       type="xygrid"
       id="grid810" />
  </sodipodi:namedview>
  <path
     d="m 33.125,28.875 v 6.25 H 0.87499999 V 7.875 H 33.125 v 4.25"
     fill="none"
     stroke="#00aad4"
     stroke-linecap="round"
     stroke-linejoin="round"
     stroke-width="1.75"
     id="path141"
     sodipodi:nodetypes="cccccc" />
  <path
     d="M 0,2 H 34 V 9.0000005 H 0 Z"
     fill="#00aad4"
     fill-rule="evenodd"
     stroke-width="1.74341"
     id="path143"
     sodipodi:nodetypes="ccccc" />
  <g
     fill="none"
     stroke="#00aad4"
     stroke-linecap="round"
     stroke-linejoin="round"
     transform="matrix(2.1875 0 0 2.1875 .000045 .30625)"
     id="g149">
    <path
       d="M 6.9571119,9.5 H 15.957112"
       id="path145"
       sodipodi:nodetypes="cc" />
    <path
       d="m 13.457143,12 2.5,-2.5 -2.5,-2.5"
       id="path147"
       sodipodi:nodetypes="ccc" />
  </g>
</svg>
