<?xml version="1.0" encoding="UTF-8" standalone="no"?>
<svg
   height="32"
   viewBox="0 0 8.4666664 8.4666671"
   width="32"
   version="1.1"
   id="svg377"
   sodipodi:docname="Font_16_32.svg"
   inkscape:version="1.2 (dc2aedaf03, 2022-05-15)"
   inkscape:export-filename="Font_16_32.png"
   inkscape:export-xdpi="96"
   inkscape:export-ydpi="96"
   xmlns:inkscape="http://www.inkscape.org/namespaces/inkscape"
   xmlns:sodipodi="http://sodipodi.sourceforge.net/DTD/sodipodi-0.dtd"
   xmlns="http://www.w3.org/2000/svg"
   xmlns:svg="http://www.w3.org/2000/svg">
  <defs
     id="defs381">
    <filter
       inkscape:collect="always"
       style="color-interpolation-filters:sRGB"
       id="filter2079"
       x="-0.08750407"
       y="-0.065622713"
       width="1.1750081"
       height="1.1312454">
      <feGaussianBlur
         inkscape:collect="always"
         stdDeviation="0.23150235"
         id="feGaussianBlur2081" />
    </filter>
  </defs>
  <sodipodi:namedview
     id="namedview379"
     pagecolor="#ffffff"
     bordercolor="#666666"
     borderopacity="1.0"
     inkscape:showpageshadow="2"
     inkscape:pageopacity="0.0"
     inkscape:pagecheckerboard="0"
     inkscape:deskcolor="#d1d1d1"
     showgrid="true"
     inkscape:zoom="28.6875"
     inkscape:cx="14.291939"
     inkscape:cy="16"
     inkscape:current-layer="svg377">
    <inkscape:grid
       type="xygrid"
       id="grid1274" />
  </sodipodi:namedview>
  <g
     id="g2085">
    <path
       id="path1712"
       style="fill:#ffffff;fill-opacity:1;stroke:none;stroke-width:1;filter:url(#filter2079)"
       d="M 2.1171835 0 A 0.52935004 0.52935004 0 0 0 1.5880168 0.52916667 L 1.5880168 4.7614665 C 1.5880168 5.5288529 1.8274627 6.2142751 2.3047689 6.6915813 C 2.3881189 6.7749313 2.5081462 6.8097761 2.6034587 6.87865 L 1.5880168 6.87865 A 0.52935004 0.52935004 0 0 0 1.0588501 7.4083334 L 1.0588501 7.9375001 A 0.52935004 0.52935004 0 0 0 1.5880168 8.4666667 L 6.87865 8.4666667 A 0.52935004 0.52935004 0 0 0 7.4083334 7.9375001 L 7.4083334 7.4083334 A 0.52935004 0.52935004 0 0 0 6.87865 6.87865 L 5.861141 6.87865 C 5.957087 6.8093948 6.0780837 6.7734409 6.1618978 6.6895142 C 6.6387157 6.2120558 6.8786501 5.5285925 6.87865 4.7614665 L 6.87865 0.52916667 A 0.52935004 0.52935004 0 0 0 6.3494833 0 L 5.5567668 0 A 0.52935004 0.52935004 0 0 0 5.0276001 0.52916667 L 5.0276001 4.7614665 C 5.0276003 5.0408639 4.9428745 5.2226506 4.8183106 5.3474773 C 4.6937467 5.472304 4.5133305 5.5567668 4.2343669 5.5567668 C 3.9554029 5.5567668 3.780355 5.4747408 3.6561076 5.3495443 C 3.5318602 5.2243477 3.4446182 5.0363955 3.4395834 4.7521648 L 3.4395834 0.52916667 A 0.52935004 0.52935004 0 0 0 2.9098999 0 L 2.1171835 0 z " />
    <path
       id="path4"
       style="fill:#000000;fill-opacity:1;stroke:none;stroke-width:1"
       d="M 1.5876303,7.4083335 V 7.9375 H 6.8790365 V 7.4083335 Z M 4.2334637,6.8791667 c -1.322917,0 -2.1166668,-0.79375 -2.1166668,-2.1166666 V 0.52916672 h 0.79375 V 4.7625001 c 0.01406,0.79375 0.5291664,1.3229166 1.3229168,1.3229166 0.7937498,0 1.3229174,-0.5291666 1.3229166,-1.3229166 l -4e-6,-4.23333338 h 0.793754 V 4.7625001 c 0,1.3229166 -0.79375,2.1166666 -2.1166666,2.1166666 z"
       sodipodi:nodetypes="cccccsscccssccss" />
  </g>
</svg>
