<?xml version="1.0" encoding="UTF-8" standalone="no"?>
<svg
   height="24"
   width="24"
   version="1.1"
   id="svg185"
   sodipodi:docname="Attention_01_24.svg"
   inkscape:export-filename="Attention_01_24.png"
   inkscape:export-xdpi="96"
   inkscape:export-ydpi="96"
   inkscape:version="1.2-beta (1b65182ce9, 2022-04-05)"
   xml:space="preserve"
   xmlns:inkscape="http://www.inkscape.org/namespaces/inkscape"
   xmlns:sodipodi="http://sodipodi.sourceforge.net/DTD/sodipodi-0.dtd"
   xmlns="http://www.w3.org/2000/svg"
   xmlns:svg="http://www.w3.org/2000/svg"><defs
     id="defs189" /><sodipodi:namedview
     id="namedview187"
     pagecolor="#ffffff"
     bordercolor="#666666"
     borderopacity="1.0"
     inkscape:pageshadow="2"
     inkscape:pageopacity="0.0"
     inkscape:pagecheckerboard="0"
     inkscape:deskcolor="#d1d1d1"
     showgrid="true"
     inkscape:zoom="38.25"
     inkscape:cx="10.470588"
     inkscape:cy="12"
     inkscape:current-layer="g181"><inkscape:grid
       type="xygrid"
       id="grid2323" /></sodipodi:namedview><linearGradient
     id="a"
     gradientUnits="userSpaceOnUse"
     x1="-21.775552"
     x2="-17.775552"
     y1="35.314893"
     y2="35.314893"><stop
       offset="0"
       stop-color="#f2f2f2"
       id="stop157" /><stop
       offset=".5"
       stop-color="#d5f6ff"
       id="stop159" /><stop
       offset="1"
       stop-color="#f2f2f2"
       id="stop161" /></linearGradient><radialGradient
     id="b"
     cx="6.050546"
     cy="12.842726"
     gradientTransform="matrix(1.7304949,-6e-8,0,0.81323863,-30.745991,28.370693)"
     gradientUnits="userSpaceOnUse"
     r="4.045085"><stop
       offset="0"
       stop-color="#06f"
       id="stop164" /><stop
       offset="1"
       stop-color="#d5e5ff"
       id="stop166" /></radialGradient><g
     fill-rule="evenodd"
     id="g183"><g
       transform="matrix(1.5 0 0 1.5 .800512 .1875)"
       id="g181"><g
         transform="translate(25.718919,-26.439893)"
         id="g173"><path
           d="m -21.775552,26.814893 v 5.5 l -3.5,6.5 c -1.190935,1.861972 0,3 1.5,3 h 7.693086 c 1.5,0 2.690935,-1.138028 1.5,-3 l -3.5,-6.5 v -5.5 z"
           fill="url(#a)"
           stroke="#87aade"
           stroke-linejoin="round"
           id="path169"
           style="fill:url(#a)" /><path
           d="m -21.919261,36.314893 -1.356291,2 c -1,1 -0.5,2 0.5,2 h 6 c 1,0 1.5,-1 0.5,-2 l -1.5,-2 z"
           fill="url(#b)"
           id="path171"
           style="fill:url(#b)" /></g><g
         id="g1515"
         transform="matrix(0.66666667,0,0,0.66666667,-0.53367496,-0.12500008)"><path
           d="M 22.500093,22.5 H 10.499907 L 16.5,10.499813 Z"
           fill="none"
           stroke="#ffffff"
           stroke-linejoin="round"
           stroke-width="3"
           id="path254"
           style="fill-rule:evenodd" /><path
           d="M 22.500093,22.5 H 10.499907 L 16.5,10.499813 Z"
           fill="#ffd42a"
           stroke="#806600"
           stroke-linejoin="round"
           stroke-width="1.125"
           id="path256"
           style="fill-rule:evenodd" /><g
           fill="none"
           stroke="#000000"
           id="g262"
           transform="matrix(1.5,0,0,1.5,1.5000122,-1.5e-6)"
           style="fill-rule:evenodd;stroke-width:0.666667;stroke-dasharray:none"><path
             d="m 9.999992,10 -1e-7,2.666668"
             id="path258"
             style="stroke-width:0.666667;stroke-dasharray:none"
             sodipodi:nodetypes="cc" /><path
             d="M 9.9999919,13.333334 9.999992,14"
             id="path260"
             style="stroke-width:0.666667;stroke-dasharray:none"
             sodipodi:nodetypes="cc" /></g></g></g></g></svg>
