<?xml version="1.0" encoding="UTF-8" standalone="no"?>
<svg
   height="64"
   viewBox="0 0 16.933333 16.933335"
   width="64"
   version="1.1"
   id="svg683"
   sodipodi:docname="Database_11_64.svg"
   inkscape:export-filename="Database_11_64.png"
   inkscape:export-xdpi="96"
   inkscape:export-ydpi="96"
   inkscape:version="1.2.1 (9c6d41e410, 2022-07-14)"
   xmlns:inkscape="http://www.inkscape.org/namespaces/inkscape"
   xmlns:sodipodi="http://sodipodi.sourceforge.net/DTD/sodipodi-0.dtd"
   xmlns="http://www.w3.org/2000/svg"
   xmlns:svg="http://www.w3.org/2000/svg">
  <defs
     id="defs687" />
  <sodipodi:namedview
     id="namedview685"
     pagecolor="#ffffff"
     bordercolor="#666666"
     borderopacity="1.0"
     inkscape:showpageshadow="2"
     inkscape:pageopacity="0.0"
     inkscape:pagecheckerboard="0"
     inkscape:deskcolor="#d1d1d1"
     showgrid="true"
     inkscape:zoom="14.34375"
     inkscape:cx="32"
     inkscape:cy="32"
     inkscape:current-layer="svg683">
    <inkscape:grid
       type="xygrid"
       id="grid806" />
  </sodipodi:namedview>
  <path
     id="path673"
     style="fill:#00aad4;stroke-width:0.529168;stroke-linecap:round;stroke-linejoin:round;stroke-miterlimit:5.6"
     d="m 7.4083336,1.0583334 c -3.506891,0 -6.3500002,1.1058372 -6.3500002,2.4696168 v 1.9755901 c 0,1.3637793 2.8431092,2.4691 6.3500002,2.4691 0.9055226,0 1.7661431,-0.073894 2.5455812,-0.2067057 C 10.625927,7.4085958 11.367116,7.2004282 12.126909,7.1556359 13.140436,6.718117 13.757817,6.1388465 13.757817,5.5035403 V 3.5532716 3.5279502 c 0,-1.3637796 -2.842592,-2.4696168 -6.3494834,-2.4696168 z m 0,1.4820801 c 2.9341414,0 4.8501454,0.9485556 5.7505534,1.6955038 C 12.260515,4.8486745 10.349761,5.5459264 7.4083336,5.5035403 4.4959555,5.4614027 2.5850703,4.7754651 1.6763835,4.1909588 2.5800516,3.4412934 4.4795528,2.5404135 7.4083336,2.5404135 Z M 1.0583334,6.9851036 v 2.4691001 c 0,1.3329643 2.7165978,2.4191253 6.1138389,2.4675493 0.08593,-0.890026 0.3959925,-1.743763 0.901237,-2.481502 -0.2186811,0.00885 -0.4403664,0.013953 -0.6650757,0.013953 -3.5068945,0 -6.3500002,-1.1053192 -6.3500002,-2.4691001 z m 0,3.9506634 v 2.469617 c 0,1.36378 2.8431057,2.469617 6.3500002,2.469617 0.3351061,0 0.6638791,-0.01 0.9849529,-0.02946 C 7.8029977,15.145424 7.404503,14.304098 7.2367679,13.403834 3.8094565,13.368347 1.0583334,12.277161 1.0583334,10.935767 Z"
     sodipodi:nodetypes="ssssccscssscccscsccsccssccc" />
  <g
     fill="none"
     stroke="#ff2828"
     stroke-linecap="round"
     stroke-width="2"
     transform="matrix(0.49976854,0,0,0.49976854,0.94074072,0.94074072)"
     id="g800">
    <circle
       cx="23"
       cy="23"
       r="8"
       stroke-dashoffset="1.49998"
       stroke-linejoin="round"
       id="circle794" />
    <path
       d="m 20,20 6,6"
       id="path796" />
    <path
       d="m 26,20 -6,6"
       id="path798" />
  </g>
</svg>
