<?xml version="1.0" encoding="UTF-8" standalone="no"?>
<svg
   height="48"
   viewBox="0 0 48 48"
   width="48"
   version="1.1"
   id="svg7"
   sodipodi:docname="Target_01_48.svg"
   inkscape:version="1.3 (0e150ed6c4, 2023-07-21)"
   xmlns:inkscape="http://www.inkscape.org/namespaces/inkscape"
   xmlns:sodipodi="http://sodipodi.sourceforge.net/DTD/sodipodi-0.dtd"
   xmlns="http://www.w3.org/2000/svg"
   xmlns:svg="http://www.w3.org/2000/svg">
  <defs
     id="defs7" />
  <sodipodi:namedview
     id="namedview7"
     pagecolor="#ffffff"
     bordercolor="#000000"
     borderopacity="0.25"
     inkscape:showpageshadow="2"
     inkscape:pageopacity="0.0"
     inkscape:pagecheckerboard="0"
     inkscape:deskcolor="#d1d1d1"
     showgrid="true"
     inkscape:current-layer="svg7">
    <inkscape:grid
       id="grid7"
       units="px"
       originx="0"
       originy="0"
       spacingx="0.5"
       spacingy="0.5"
       empcolor="#0099e5"
       empopacity="0.30196078"
       color="#0099e5"
       opacity="0.14901961"
       empspacing="2"
       dotted="false"
       gridanglex="30"
       gridanglez="30"
       visible="true" />
  </sodipodi:namedview>
  <circle
     cx="24.000006"
     cy="24.000003"
     fill="#00aad4"
     r="4.5"
     stroke-width="3"
     id="circle1" />
  <g
     fill="none"
     stroke="#00aad4"
     stroke-linecap="round"
     stroke-linejoin="round"
     transform="matrix(3 0 0 3 -1.5 1.5)"
     id="g7">
    <circle
       cx="8.500002"
       cy="7.500001"
       r="3.15"
       stroke-width=".7"
       id="circle2" />
    <circle
       cx="8.500002"
       cy="7.500001"
       r="5.5"
       id="circle3" />
    <g
       stroke-width=".8"
       id="g6">
      <path
         d="m8.5.8v3.2"
         id="path3" />
      <path
         d="m8.5 11v3.2"
         id="path4" />
      <path
         d="m1.8 7.5h3.2"
         id="path5" />
      <path
         d="m12 7.5h3.2"
         id="path6" />
    </g>
  </g>
</svg>
