<svg width="32" height="32" version="1.1" xmlns="http://www.w3.org/2000/svg">
 <defs>
  <radialGradient id="a" cx="12.1" cy="10.900001" r="4.5" gradientTransform="matrix(0,2.0740741,-2.0740739,4e-8,43.307408,-4.396297)" gradientUnits="userSpaceOnUse">
   <stop stop-color="#5599ff" offset="0"/>
   <stop stop-color="#0055d4" offset="1"/>
  </radialGradient>
 </defs>
 <g stroke="#ffffff" stroke-linecap="round">
  <circle transform="matrix(0,1,1,0,0,0)" cx="23.5" cy="23.5" r="7.6999998" fill="url(#a)" stroke-dashoffset="1.49998" stroke-linejoin="round" stroke-width="1.6"/>
  <path d="m23.00001 26.999916-3.499915-3.499771 3.499915-3.50006" fill="none" stroke-linejoin="round" stroke-width="1.99995"/>
  <path d="m19.500095 23.500125h7.999808" fill="none" stroke-width="1.99995px"/>
 </g>
</svg>
