<?xml version="1.0" encoding="UTF-8" standalone="no"?>
<svg
   width="32"
   height="32"
   version="1.1"
   viewBox="0 0 8.4667 8.4667"
   id="svg260"
   sodipodi:docname="Health_12_32.svg"
   inkscape:export-filename="Health_12_32.png"
   inkscape:export-xdpi="96"
   inkscape:export-ydpi="96"
   inkscape:version="1.2.1 (9c6d41e410, 2022-07-14)"
   xmlns:inkscape="http://www.inkscape.org/namespaces/inkscape"
   xmlns:sodipodi="http://sodipodi.sourceforge.net/DTD/sodipodi-0.dtd"
   xmlns="http://www.w3.org/2000/svg"
   xmlns:svg="http://www.w3.org/2000/svg">
  <defs
     id="defs264" />
  <sodipodi:namedview
     id="namedview262"
     pagecolor="#ffffff"
     bordercolor="#666666"
     borderopacity="1.0"
     inkscape:showpageshadow="2"
     inkscape:pageopacity="0.0"
     inkscape:pagecheckerboard="0"
     inkscape:deskcolor="#d1d1d1"
     showgrid="true"
     inkscape:zoom="28.6875"
     inkscape:cx="15.494553"
     inkscape:cy="16"
     inkscape:current-layer="svg260">
    <inkscape:grid
       type="xygrid"
       id="grid883" />
  </sodipodi:namedview>
  <path
     style="fill:none;stroke:#00aad4;stroke-width:0.423334;stroke-dasharray:none;stroke-opacity:1"
     d="M 3.4814689,7.1262359 C -2.0660484,2.737406 2.1933536,-1.3266882 4.2333501,1.906416 5.7170273,-0.44500153 8.3746742,1.0634828 7.5796782,3.7495133"
     id="path2228" />
  <g
     id="g4144"
     transform="scale(0.26458437)">
    <circle
       cx="23.799999"
       cy="23.799999"
       r="7.4000001"
       stroke-dashoffset="1.49998"
       stroke-linejoin="round"
       stroke-width="1.6"
       transform="matrix(0,1,1,0,0,0)"
       id="circle806"
       style="fill:none;stroke:#00aad4;stroke-linecap:round" />
    <path
       d="m 23.8,19.8 v 8"
       id="path808"
       style="fill:none;stroke:#00aad4;stroke-width:1.6;stroke-linecap:round;stroke-dasharray:none" />
    <path
       d="m 27.8,23.8 h -8"
       id="path810"
       style="fill:none;stroke:#00aad4;stroke-width:1.6;stroke-linecap:round;stroke-dasharray:none" />
    <rect
       style="fill:none;stroke-width:1.5;stroke-linecap:round;stroke-linejoin:round;stroke-miterlimit:5.6"
       id="rect4135"
       width="17"
       height="17"
       x="15"
       y="15" />
  </g>
</svg>
