<svg width="24" height="24" version="1.1" viewBox="0 0 6.3499998 6.3500003" xmlns="http://www.w3.org/2000/svg">
 <path d="m1.1244789 1.5874995 0.3175001 4.5640633h3.7306255l0.3175-4.5640633" fill="#ebfcff" stroke="#00aad4" stroke-linecap="round" stroke-linejoin="round" stroke-width=".396875px"/>
 <path d="m0.72760391 1.5874995c1.7639519-0.3616004 3.3734382-0.3968747 5.1593757 0" fill="#ebfcff" stroke="#00aad4" stroke-linecap="round" stroke-linejoin="round" stroke-width=".396875px"/>
 <path d="m2.5135417 1.1906245v-0.59531254c0.5953125-0.19843757 0.9921875-0.19843757 1.5875001 0v0.59531254" fill="#ebfcff" stroke="#00aad4" stroke-linecap="round" stroke-linejoin="round" stroke-width=".396875px"/>
 <path d="m3.3072914 2.182812v3.1750003" fill="none" stroke="#00aad4" stroke-linecap="round" stroke-linejoin="round" stroke-width=".396875px"/>
 <path d="m2.4341666 5.3578126-0.238125-3.1750006" fill="none" stroke="#00aad4" stroke-linecap="round" stroke-linejoin="round" stroke-width=".396875px"/>
 <path d="m4.1804169 5.3578126 0.238125-3.1750006" fill="none" stroke="#00aad4" stroke-linecap="round" stroke-linejoin="round" stroke-width=".396875px"/>
</svg>
