<?xml version="1.0" encoding="UTF-8" standalone="no"?>
<svg
   height="32"
   viewBox="0 0 8.4666664 8.4666671"
   width="32"
   version="1.1"
   id="svg217"
   sodipodi:docname="Cube_04_32.svg"
   inkscape:export-filename="Cube_04_32.png"
   inkscape:export-xdpi="96"
   inkscape:export-ydpi="96"
   inkscape:version="1.2.1 (9c6d41e410, 2022-07-14)"
   xmlns:inkscape="http://www.inkscape.org/namespaces/inkscape"
   xmlns:sodipodi="http://sodipodi.sourceforge.net/DTD/sodipodi-0.dtd"
   xmlns="http://www.w3.org/2000/svg"
   xmlns:svg="http://www.w3.org/2000/svg">
  <defs
     id="defs221" />
  <sodipodi:namedview
     id="namedview219"
     pagecolor="#ffffff"
     bordercolor="#666666"
     borderopacity="1.0"
     inkscape:showpageshadow="2"
     inkscape:pageopacity="0.0"
     inkscape:pagecheckerboard="0"
     inkscape:deskcolor="#d1d1d1"
     showgrid="true"
     inkscape:zoom="28.6875"
     inkscape:cx="15.982571"
     inkscape:cy="16"
     inkscape:current-layer="svg217">
    <inkscape:grid
       type="xygrid"
       id="grid1205" />
  </sodipodi:namedview>
  <linearGradient
     id="a"
     gradientUnits="userSpaceOnUse"
     x1="3.307291"
     x2="4.043251"
     y1="1.455207"
     y2="3.305127">
    <stop
       offset="0"
       stop-color="#aeefff"
       id="stop176" />
    <stop
       offset="1"
       stop-color="#0cf"
       id="stop178" />
  </linearGradient>
  <g
     stroke="#165044"
     stroke-linejoin="round"
     stroke-width=".185208"
     id="g215">
    <g
       fill-rule="evenodd"
       id="g187">
      <path
         d="m4.043251 3.2829232-3.42148242-1.5206588 3.80164722-1.14049418 3.4214824 1.52065888z"
         fill="url(#a)"
         id="path181" />
      <path
         d="m.62176858 1.7622644v4.5619765l3.42148242 1.5206588v-4.5619765z"
         fill="#f0f000"
         id="path183" />
      <path
         d="m7.8448982 2.1424291v4.3718923l-3.8016472 1.3305783v-4.5619765z"
         fill="#00d455"
         id="path185" />
    </g>
    <g
       fill="none"
       id="g213">
      <path
         d="m4.043251 4.8035801 3.8016472-1.3115683"
         id="path189" />
      <path
         d="m4.043251 6.2388494 3.8016472-1.3160233"
         id="path191" />
      <path
         d="m5.3738275 2.8837482v4.4954479"
         id="path193" />
      <path
         d="m6.5143217 2.5416v4.4384231"
         id="path195" />
      <path
         d="m4.043251 4.8035801-3.42147813-1.5206588"
         id="path197" />
      <path
         d="m4.043251 6.2388494-3.42148242-1.5206589"
         id="path199" />
      <path
         d="m2.8222787 2.7402688v4.5619775"
         id="path201" />
      <path
         d="m1.7622627 2.2691493v4.5619782"
         id="path203" />
      <path
         d="m5.3738274 2.8837483-3.4214823-1.5206607"
         id="path205" />
      <path
         d="m6.5143218 2.541602-3.4214783-1.5206589"
         id="path207" />
      <path
         d="m6.7044042 1.6355408-3.8821255 1.1047281"
         id="path209" />
      <path
         d="m5.5639098 1.1286546-3.8016471 1.140496"
         id="path211" />
    </g>
  </g>
</svg>
