<?xml version="1.0" encoding="UTF-8" standalone="no"?>
<svg
   width="64"
   height="64"
   version="1.1"
   viewBox="0 0 64 64"
   id="svg6"
   sodipodi:docname="Temperature_01_64.svg"
   inkscape:export-filename="Temperature_01_64.png"
   inkscape:export-xdpi="96"
   inkscape:export-ydpi="96"
   inkscape:version="1.3.2 (091e20e, 2023-11-25, custom)"
   xmlns:inkscape="http://www.inkscape.org/namespaces/inkscape"
   xmlns:sodipodi="http://sodipodi.sourceforge.net/DTD/sodipodi-0.dtd"
   xmlns="http://www.w3.org/2000/svg"
   xmlns:svg="http://www.w3.org/2000/svg">
  <defs
     id="defs6" />
  <sodipodi:namedview
     id="namedview6"
     pagecolor="#ffffff"
     bordercolor="#000000"
     borderopacity="0.25"
     inkscape:showpageshadow="2"
     inkscape:pageopacity="0.0"
     inkscape:pagecheckerboard="0"
     inkscape:deskcolor="#d1d1d1"
     showgrid="true"
     inkscape:current-layer="svg6">
    <inkscape:grid
       id="grid6"
       units="px"
       originx="0"
       originy="0"
       spacingx="0.5"
       spacingy="0.5"
       empcolor="#0099e5"
       empopacity="0.30196078"
       color="#0099e5"
       opacity="0.14901961"
       empspacing="2"
       dotted="false"
       gridanglex="30"
       gridanglez="30"
       visible="true" />
  </sodipodi:namedview>
  <path
     d="m42.999927 47.942037c0 6.627397-5.372568 11.999966-11.999966 11.999966-6.627397 0-11.999966-5.372569-11.999966-11.999966 0.02-4.267024 2.304566-8.202421 5.999983-10.335907v-27.663986c0-7.845529 11.999966-7.845529 11.999966 0v27.609298c3.712283 2.143286 5.999384 6.104019 5.999983 10.390595z"
     fill="#ebfcff"
     stroke="#00aad4"
     stroke-linecap="round"
     stroke-linejoin="round"
     stroke-width="1.99999"
     id="path1" />
  <circle
     cx="30.99996"
     cy="47.942039"
     r="5.9999828"
     fill="#ff7f00"
     id="circle1" />
  <path
     d="m42.999927 17.942122h5.999983"
     fill="none"
     stroke="#ff7f00"
     stroke-linecap="round"
     stroke-linejoin="round"
     stroke-width="1.99999"
     id="path2" />
  <path
     d="m42.999927 9.9421439h5.999983"
     fill="none"
     stroke="#ff7f00"
     stroke-linecap="round"
     stroke-linejoin="round"
     stroke-width="1.99999"
     id="path3" />
  <path
     d="m42.999927 33.942076h5.999983"
     fill="none"
     stroke="#ff7f00"
     stroke-linecap="round"
     stroke-linejoin="round"
     stroke-width="1.99999"
     id="path4" />
  <path
     d="m42.999927 25.942099h5.999983"
     fill="none"
     stroke="#ff7f00"
     stroke-linecap="round"
     stroke-linejoin="round"
     stroke-width="1.99999"
     id="path5" />
  <path
     d="m30.999961 9.9421439v37.999893"
     fill="none"
     stroke="#ff7f00"
     stroke-linecap="round"
     stroke-linejoin="round"
     stroke-width="1.99999"
     id="path6" />
</svg>
