<?xml version="1.0" encoding="UTF-8" standalone="no"?>
<svg
   height="32"
   width="32"
   version="1.1"
   id="svg260"
   sodipodi:docname="Add_10_32.svg"
   inkscape:export-filename="Add_10_32.png"
   inkscape:export-xdpi="96"
   inkscape:export-ydpi="96"
   inkscape:version="1.2.2 (732a01da63, 2022-12-09)"
   xmlns:inkscape="http://www.inkscape.org/namespaces/inkscape"
   xmlns:sodipodi="http://sodipodi.sourceforge.net/DTD/sodipodi-0.dtd"
   xmlns="http://www.w3.org/2000/svg"
   xmlns:svg="http://www.w3.org/2000/svg">
  <defs
     id="defs264" />
  <sodipodi:namedview
     id="namedview262"
     pagecolor="#ffffff"
     bordercolor="#666666"
     borderopacity="1.0"
     inkscape:showpageshadow="2"
     inkscape:pageopacity="0.0"
     inkscape:pagecheckerboard="0"
     inkscape:deskcolor="#d1d1d1"
     showgrid="true"
     inkscape:zoom="28.6875"
     inkscape:cx="16.104575"
     inkscape:cy="16"
     inkscape:current-layer="svg260">
    <inkscape:grid
       type="xygrid"
       id="grid883" />
  </sodipodi:namedview>
  <circle
     cx="16"
     cy="16"
     r="13.25"
     style="fill:#e0edff;fill-rule:evenodd;stroke:#2a7efe;stroke-width:2.5;stroke-linecap:round;stroke-linejoin:round;stroke-dasharray:none"
     id="circle258" />
  <path
     d="M 16,10 V 22"
     id="path705"
     style="fill:none;stroke:#2a7efe;stroke-width:2.5;stroke-linecap:round;stroke-dasharray:none;stroke-opacity:1"
     sodipodi:nodetypes="cc" />
  <path
     d="M 22,16 H 10"
     id="path707"
     style="fill:none;stroke:#2a7efe;stroke-width:2.5;stroke-linecap:round;stroke-dasharray:none;stroke-opacity:1"
     sodipodi:nodetypes="cc" />
</svg>
