<?xml version="1.0" encoding="UTF-8" standalone="no"?>
<svg
   width="24"
   height="24"
   version="1.1"
   viewBox="0 0 24 24"
   id="svg2"
   sodipodi:docname="tfontdialog.svg"
   inkscape:export-filename="tfontdialog.png"
   inkscape:export-xdpi="96"
   inkscape:export-ydpi="96"
   inkscape:version="1.3.2 (091e20e, 2023-11-25, custom)"
   xmlns:inkscape="http://www.inkscape.org/namespaces/inkscape"
   xmlns:sodipodi="http://sodipodi.sourceforge.net/DTD/sodipodi-0.dtd"
   xmlns="http://www.w3.org/2000/svg"
   xmlns:svg="http://www.w3.org/2000/svg">
  <defs
     id="defs2" />
  <sodipodi:namedview
     id="namedview2"
     pagecolor="#ffffff"
     bordercolor="#000000"
     borderopacity="0.25"
     inkscape:showpageshadow="2"
     inkscape:pageopacity="0.0"
     inkscape:pagecheckerboard="0"
     inkscape:deskcolor="#d1d1d1"
     showgrid="true"
     inkscape:current-layer="svg2">
    <inkscape:grid
       id="grid2"
       units="px"
       originx="0"
       originy="0"
       spacingx="0.5"
       spacingy="0.5"
       empcolor="#0099e5"
       empopacity="0.30196078"
       color="#0099e5"
       opacity="0.14901961"
       empspacing="2"
       dotted="false"
       gridanglex="30"
       gridanglez="30"
       visible="true" />
  </sodipodi:namedview>
  <rect
     x="1.25"
     y="4.25"
     width="21.5"
     height="18.5"
     fill="#f9f9f9"
     stroke="#2a7efe"
     stroke-width="0.5"
     style="paint-order:normal"
     id="rect1" />
  <path
     d="m 2.5,1 h 19 C 22.35,1 23,1.6 23,2.5 V 4 H 1 V 2.5 C 1,1.6 1.6,1 2.5,1 Z"
     fill="#2a7efe"
     id="path1" />
  <path
     d="m 8.085,19 v -0.4628 c 0.3215817,-0.066 1.239678,-0.2775 1.239678,-0.5325 V 9.004 C 9.0326847,8.6299 8.5295883,8.5787 8.085,8.4628 V 8 h 7.342038 l 0.288094,0.2357 C 15.688932,8.91 15.47732,10.032 15.37465,10.3572 H 14.877032 C 14.859572,9.8217 14.789722,9.4405 14.66751,9.2135 14.551108,8.9865 14.382325,8.8731 14.161163,8.8731 h -3.177766 l 4.83e-4,4.0107 h 3.247607 l 0.270634,0.2619 c -0.236918,0.3947 -0.614813,0.9476 -0.820632,1.1123 -0.398152,-0.3983 -0.917874,-0.5798 -1.719836,-0.5798 H 10.98388 l -4.83e-4,4.3265 c -2.6e-5,0.2325 0.926517,0.4257 1.510313,0.5325 V 19 Z"
     fill="#aa0000"
     id="path2" />
</svg>
