<?xml version="1.0" encoding="UTF-8" standalone="no"?>
<svg
   height="24"
   viewBox="0 0 6.35 6.35"
   width="24"
   version="1.1"
   id="svg340"
   sodipodi:docname="Window_12_24.svg"
   inkscape:version="1.2.2 (732a01da63, 2022-12-09)"
   xmlns:inkscape="http://www.inkscape.org/namespaces/inkscape"
   xmlns:sodipodi="http://sodipodi.sourceforge.net/DTD/sodipodi-0.dtd"
   xmlns="http://www.w3.org/2000/svg"
   xmlns:svg="http://www.w3.org/2000/svg">
  <defs
     id="defs344" />
  <sodipodi:namedview
     id="namedview342"
     pagecolor="#ffffff"
     bordercolor="#000000"
     borderopacity="0.25"
     inkscape:showpageshadow="2"
     inkscape:pageopacity="0.0"
     inkscape:pagecheckerboard="0"
     inkscape:deskcolor="#d1d1d1"
     showgrid="true"
     inkscape:zoom="37.916667"
     inkscape:cx="11.986813"
     inkscape:cy="12"
     inkscape:current-layer="svg340">
    <inkscape:grid
       type="xygrid"
       id="grid1080" />
  </sodipodi:namedview>
  <rect
     fill="#f5f7ff"
     height="5.503334"
     rx=".449792"
     stroke="#00aad4"
     stroke-linejoin="round"
     stroke-width=".3175"
     width="5.503333"
     x=".423333"
     y=".423333"
     id="rect312" />
  <path
     d="m.52916666.52916655h5.29166664v.74083335h-5.29166664z"
     fill="#00aad4"
     fill-rule="evenodd"
     stroke-width=".396872"
     id="path314" />
  <g
     fill="none"
     stroke="#00aad4"
     stroke-width=".3175"
     id="g338">
    <path
       d="m2.2754167 1.0583333v4.8947916"
       id="path316" />
    <g
       stroke-linecap="round"
       id="g336">
      <path
         d="m1.0847917 1.9579167h.6085416"
         id="path318" />
      <path
         d="m1.0847917 4.3391667h.6085416"
         id="path320" />
      <path
         d="m1.0847917 3.5454167h.6085416"
         id="path322" />
      <path
         d="m1.0847917 2.7516667h.6085416"
         id="path324" />
      <path
         d="m2.936875 1.9579167h2.2489583"
         id="path326" />
      <path
         d="m2.936875 5.1329167h2.2489583"
         id="path328" />
      <path
         d="m2.936875 4.3391667h2.2489583"
         id="path330" />
      <path
         d="m2.936875 3.5454167h2.2489583"
         id="path332" />
      <path
         d="m2.936875 2.7516667h2.2489583"
         id="path334" />
    </g>
  </g>
</svg>
