<?xml version="1.0" encoding="UTF-8" standalone="no"?>
<svg
   height="32"
   width="32"
   version="1.1"
   id="svg9"
   sodipodi:docname="Star_02_32.svg"
   inkscape:export-filename="Star_02_32.png"
   inkscape:export-xdpi="96"
   inkscape:export-ydpi="96"
   inkscape:version="1.2.1 (9c6d41e410, 2022-07-14)"
   xmlns:inkscape="http://www.inkscape.org/namespaces/inkscape"
   xmlns:sodipodi="http://sodipodi.sourceforge.net/DTD/sodipodi-0.dtd"
   xmlns="http://www.w3.org/2000/svg"
   xmlns:svg="http://www.w3.org/2000/svg">
  <defs
     id="defs13" />
  <sodipodi:namedview
     id="namedview11"
     pagecolor="#ffffff"
     bordercolor="#666666"
     borderopacity="1.0"
     inkscape:pageshadow="2"
     inkscape:pageopacity="0.0"
     inkscape:pagecheckerboard="0"
     inkscape:deskcolor="#d1d1d1"
     showgrid="true"
     inkscape:zoom="28.6875"
     inkscape:cx="16"
     inkscape:cy="16"
     inkscape:current-layer="svg9"
     inkscape:showpageshadow="2">
    <inkscape:grid
       type="xygrid"
       id="grid802" />
  </sodipodi:namedview>
  <linearGradient
     id="a"
     gradientUnits="userSpaceOnUse"
     x1="8"
     x2="8"
     y1="15"
     y2="4">
    <stop
       offset="0"
       stop-color="#d58914"
       stop-opacity=".956863"
       id="stop2" />
    <stop
       offset="1"
       stop-color="#f4a428"
       stop-opacity=".992157"
       id="stop4" />
  </linearGradient>
  <path
     d="m 15.999999,1.7346752 4.635292,9.3916928 10.364824,1.50603 -7.500058,7.310412 1.770524,10.322472 -9.270582,-4.87361 L 6.7294199,30.26528 8.4999419,19.94281 0.9998851,12.632396 11.36471,11.126368 Z"
     fill="url(#a)"
     fill-rule="evenodd"
     id="path533"
     style="fill:none;stroke:#00aad4;stroke-width:2;stroke-linejoin:round;stroke-opacity:1" />
</svg>
