<?xml version="1.0" encoding="UTF-8" standalone="no"?>
<svg
   width="32"
   height="32"
   version="1.1"
   viewBox="0 0 32 32"
   id="svg4"
   sodipodi:docname="Mouse_02_32.svg"
   inkscape:export-filename="Mouse_02_32.png"
   inkscape:export-xdpi="96"
   inkscape:export-ydpi="96"
   inkscape:version="1.3.2 (091e20e, 2023-11-25, custom)"
   xmlns:inkscape="http://www.inkscape.org/namespaces/inkscape"
   xmlns:sodipodi="http://sodipodi.sourceforge.net/DTD/sodipodi-0.dtd"
   xmlns="http://www.w3.org/2000/svg"
   xmlns:svg="http://www.w3.org/2000/svg">
  <defs
     id="defs4">
    <linearGradient
       id="a"
       x1="-12.899813"
       x2="-3.8998129"
       y1="6.3482304"
       y2="13.599531"
       gradientTransform="matrix(0,2.0605565,2.0273521,0,-0.1756328,36.465287)"
       gradientUnits="userSpaceOnUse">
      <stop
         stop-color="#f9f9f9"
         offset="0"
         id="stop1" />
      <stop
         stop-color="#e6e6e6"
         offset="1"
         id="stop2" />
    </linearGradient>
  </defs>
  <sodipodi:namedview
     id="namedview4"
     pagecolor="#ffffff"
     bordercolor="#000000"
     borderopacity="0.25"
     inkscape:showpageshadow="2"
     inkscape:pageopacity="0.0"
     inkscape:pagecheckerboard="0"
     inkscape:deskcolor="#d1d1d1"
     showgrid="true"
     inkscape:current-layer="svg4">
    <inkscape:grid
       id="grid4"
       units="px"
       originx="0"
       originy="0"
       spacingx="0.5"
       spacingy="0.5"
       empcolor="#0099e5"
       empopacity="0.30196078"
       color="#0099e5"
       opacity="0.14901961"
       empspacing="2"
       dotted="false"
       gridanglex="30"
       gridanglez="30"
       visible="true" />
  </sodipodi:namedview>
  <path
     d="M 9.1230849,8.7877555 C 5.6116069,6.7271995 5.5732999,2.4000306 0,2.4000306"
     fill="none"
     stroke="#808080"
     stroke-width="0.8"
     id="path2"
     style="stroke-width:1.5;stroke-dasharray:none" />
  <path
     d="M 6.5223429,11.279886 11.580874,6.1432455 c 1.72067,-1.747238 4.166178,-1.732077 6.119603,0.25151 0,0 4.49836,3.9969625 6.591122,6.1595595 11.315964,11.69357 0.06009,23.123252 -11.385619,11.700838 C 10.754489,22.10804 6.7700279,17.49398 6.7700279,17.49398 4.8166029,15.510394 4.8016719,13.027127 6.5223429,11.279886 Z"
     fill="#ffffff"
     stroke="#808080"
     stroke-width="0.8"
     id="path3"
     style="fill:#ffffff;stroke:none" />
  <path
     d="m 28.599305,18.7936 c 3.328111,9.095639 -6.141519,15.275829 -15.795133,5.634334 -2.169928,-2.167202 -6.1810481,-6.825593 -6.1810481,-6.825593 -0.778619,-0.791371 -1.250908,-1.659529 -1.43736,-2.531427 2.354342,1.038815 4.655534,3.0476 6.8027151,3.879643 3.762018,1.457796 7.095737,2.060556 10.136763,1.030278 1.276423,-0.432443 3.814207,-0.911417 6.474063,-1.187235 z"
     fill="url(#a)"
     id="path5"
     style="fill:url(#a);stroke:none;stroke-width:1" />
  <path
     d="M 9.1230849,8.7877555 15.711979,15.484565"
     fill="#ffffff"
     stroke="#808080"
     stroke-width="0.8"
     id="path4"
     style="stroke-width:1.1;stroke-dasharray:none" />
  <path
     d="M 9.9777589,21.312701 21.446194,9.6564325"
     fill="#ffffff"
     stroke="#808080"
     stroke-width="0.8"
     id="path7"
     style="stroke-width:1.1;stroke-dasharray:none" />
  <path
     d="M 6.1749539,11.146205 11.449649,5.7901035 c 1.794199,-1.82189 4.344211,-1.806082 6.381109,0.262255 0,0 4.690586,4.1677335 6.872779,6.4227285 11.799526,12.193178 0.06267,24.111194 -11.872158,12.200757 C 10.58795,22.436996 6.4332219,17.6258 6.4332219,17.6258 4.3963229,15.557463 4.3807529,12.968098 6.1749539,11.146205 Z"
     fill="none"
     stroke="#808080"
     stroke-width="0.8"
     id="path6"
     style="stroke-width:1.1;stroke-dasharray:none" />
</svg>
