<?xml version="1.0" encoding="UTF-8" standalone="no"?>
<svg
   height="16"
   width="16"
   version="1.1"
   id="svg31"
   sodipodi:docname="item_unit.svg"
   inkscape:export-filename="item_unit.png"
   inkscape:export-xdpi="96"
   inkscape:export-ydpi="96"
   inkscape:version="1.2.2 (732a01da63, 2022-12-09)"
   xmlns:inkscape="http://www.inkscape.org/namespaces/inkscape"
   xmlns:sodipodi="http://sodipodi.sourceforge.net/DTD/sodipodi-0.dtd"
   xmlns="http://www.w3.org/2000/svg"
   xmlns:svg="http://www.w3.org/2000/svg">
  <defs
     id="defs35" />
  <sodipodi:namedview
     id="namedview33"
     pagecolor="#ffffff"
     bordercolor="#666666"
     borderopacity="1.0"
     inkscape:showpageshadow="2"
     inkscape:pageopacity="0.0"
     inkscape:pagecheckerboard="0"
     inkscape:deskcolor="#d1d1d1"
     showgrid="true"
     inkscape:zoom="57.375"
     inkscape:cx="7.9912854"
     inkscape:cy="8"
     inkscape:current-layer="svg31">
    <inkscape:grid
       type="xygrid"
       id="grid616" />
  </sodipodi:namedview>
  <linearGradient
     id="a"
     gradientUnits="userSpaceOnUse"
     x1="13.812501"
     x2="8.187499"
     y1="13.8125"
     y2="8.187498">
    <stop
       offset="0"
       stop-color="#009600"
       id="stop2" />
    <stop
       offset="1"
       stop-color="#6edb39"
       id="stop4" />
  </linearGradient>
  <path
     d="m2.5.5h11v14h-11z"
     fill="#fff"
     stroke="#d4aa00"
     stroke-linecap="round"
     stroke-linejoin="round"
     stroke-miterlimit="5.6"
     id="path7" />
  <g
     fill="none"
     stroke="#2a7fff"
     id="g19">
    <path
       d="m5 5.5h6"
       id="path9" />
    <path
       d="m5 3.5h6"
       id="path11" />
    <path
       d="m5 7.5h6"
       id="path13" />
    <path
       d="m5 9.5h6"
       id="path15" />
    <path
       d="m5 11.5h6"
       id="path17" />
  </g>
</svg>
