<?xml version="1.0" encoding="UTF-8" standalone="no"?>
<svg
   width="24"
   height="24"
   version="1.1"
   viewBox="0 0 24 24"
   id="svg2"
   sodipodi:docname="tcheckboxthemed.svg"
   inkscape:export-filename="tcheckboxthemed.png"
   inkscape:export-xdpi="96"
   inkscape:export-ydpi="96"
   inkscape:version="1.3.2 (091e20e, 2023-11-25, custom)"
   xmlns:inkscape="http://www.inkscape.org/namespaces/inkscape"
   xmlns:sodipodi="http://sodipodi.sourceforge.net/DTD/sodipodi-0.dtd"
   xmlns="http://www.w3.org/2000/svg"
   xmlns:svg="http://www.w3.org/2000/svg">
  <defs
     id="defs2" />
  <sodipodi:namedview
     id="namedview2"
     pagecolor="#ffffff"
     bordercolor="#000000"
     borderopacity="0.25"
     inkscape:showpageshadow="2"
     inkscape:pageopacity="0.0"
     inkscape:pagecheckerboard="0"
     inkscape:deskcolor="#d1d1d1"
     showgrid="true"
     inkscape:current-layer="svg2">
    <inkscape:grid
       id="grid2"
       units="px"
       originx="0"
       originy="0"
       spacingx="0.5"
       spacingy="0.5"
       empcolor="#0099e5"
       empopacity="0.30196078"
       color="#0099e5"
       opacity="0.14901961"
       empspacing="2"
       dotted="false"
       gridanglex="30"
       gridanglez="30"
       visible="true" />
  </sodipodi:namedview>
  <path
     d="M 19.23988,16.2499 V 6.75 m -3.35988,0 h 6.71973"
     fill="none"
     stroke="#2a7fff"
     stroke-width="1.5"
     id="path1"
     style="stroke-linecap:round;stroke-linejoin:round" />
  <rect
     x="1.25"
     y="5.2499828"
     width="12.5"
     height="12.5"
     rx="2.3026319"
     ry="2.3026319"
     fill="#ececec"
     stroke="#2a7efe"
     stroke-width="0.5"
     style="stroke-linecap:round;stroke-linejoin:round;paint-order:normal"
     id="rect1" />
  <path
     d="M 4.619047,11.619 7,14 10.571429,9.2381"
     fill="none"
     stroke="#2a7efe"
     stroke-width="1.5"
     id="path2"
     style="stroke-linecap:round;stroke-linejoin:round" />
</svg>
