<?xml version="1.0" encoding="UTF-8" standalone="no"?>
<svg
   width="24"
   height="24"
   version="1.1"
   viewBox="0 0 24 24"
   id="svg7"
   sodipodi:docname="tscrollbox.svg"
   inkscape:export-filename="tscrollbox.png"
   inkscape:export-xdpi="96"
   inkscape:export-ydpi="96"
   inkscape:version="1.3.2 (091e20e, 2023-11-25, custom)"
   xmlns:inkscape="http://www.inkscape.org/namespaces/inkscape"
   xmlns:sodipodi="http://sodipodi.sourceforge.net/DTD/sodipodi-0.dtd"
   xmlns:xlink="http://www.w3.org/1999/xlink"
   xmlns="http://www.w3.org/2000/svg"
   xmlns:svg="http://www.w3.org/2000/svg">
  <sodipodi:namedview
     id="namedview7"
     pagecolor="#ffffff"
     bordercolor="#000000"
     borderopacity="0.25"
     inkscape:showpageshadow="2"
     inkscape:pageopacity="0.0"
     inkscape:pagecheckerboard="0"
     inkscape:deskcolor="#d1d1d1"
     showgrid="true"
     inkscape:current-layer="svg7">
    <inkscape:grid
       id="grid7"
       units="px"
       originx="0"
       originy="0"
       spacingx="0.5"
       spacingy="0.5"
       empcolor="#0099e5"
       empopacity="0.30196078"
       color="#0099e5"
       opacity="0.14901961"
       empspacing="2"
       dotted="false"
       gridanglex="30"
       gridanglez="30"
       visible="true" />
  </sodipodi:namedview>
  <defs
     id="defs2">
    <linearGradient
       id="b"
       x1="11"
       x2="11"
       y1="1039.5"
       y2="1045.2"
       gradientTransform="matrix(.43333063 0 0 .61111286 2.3 -629.02573)"
       gradientUnits="userSpaceOnUse"
       xlink:href="#a" />
    <linearGradient
       id="a">
      <stop
         stop-color="#e6e6e6"
         offset="0"
         id="stop1" />
      <stop
         stop-color="#fff"
         offset="1"
         id="stop2" />
    </linearGradient>
    <linearGradient
       id="d"
       x1="11"
       x2="11"
       y1="1039.5"
       y2="1045.2"
       gradientTransform="matrix(.36667121 0 0 .61111286 10.6 -629.02573)"
       gradientUnits="userSpaceOnUse"
       xlink:href="#a" />
    <linearGradient
       id="c"
       x1="11"
       x2="11"
       y1="1039.5"
       y2="1045.2"
       gradientTransform="matrix(.43333063 0 0 .388892 2.3 -391.39101)"
       gradientUnits="userSpaceOnUse"
       xlink:href="#a" />
  </defs>
  <rect
     x="2.25"
     y="3.25"
     width="18.5"
     height="18.5"
     fill="#f9f9f9"
     stroke="#2a7efe"
     stroke-width=".5"
     style="paint-order:normal"
     id="rect2" />
  <rect
     x="12.25"
     y="5.25"
     width="5.4999995"
     height="5.5"
     fill="url(#d)"
     stroke="#999999"
     stroke-linecap="round"
     stroke-linejoin="round"
     stroke-width=".500001"
     style="paint-order:normal"
     id="rect3" />
  <rect
     x="4.25"
     y="12.25"
     width="6.5"
     height="3.5"
     fill="url(#c)"
     stroke="#999999"
     stroke-linecap="round"
     stroke-linejoin="round"
     stroke-width=".5"
     style="paint-order:normal"
     id="rect4" />
  <rect
     x="4.25"
     y="5.25"
     width="6.5"
     height="5.5"
     fill="url(#b)"
     stroke="#999999"
     stroke-linecap="round"
     stroke-linejoin="round"
     stroke-width=".5"
     style="paint-order:normal"
     id="rect5" />
  <rect
     x="17.25"
     y="3.25"
     width="3.5"
     height="15"
     fill="#e6e6e6"
     stroke="#2a7efe"
     stroke-width=".5"
     style="paint-order:normal"
     id="rect6" />
  <path
     d="m19 5.5v5"
     fill="#e6e6e6"
     stroke="#2a7efe"
     stroke-linecap="round"
     stroke-linejoin="round"
     id="path6" />
  <rect
     transform="rotate(-90)"
     x="-21.75"
     y="2.25"
     width="3.5"
     height="15"
     fill="#e6e6e6"
     stroke="#2a7efe"
     stroke-width=".5"
     style="paint-order:normal"
     id="rect7" />
  <path
     d="m4.5 20h5"
     fill="#e6e6e6"
     stroke="#2a7efe"
     stroke-linecap="round"
     stroke-linejoin="round"
     id="path7" />
</svg>
