<svg width="16" height="16" version="1.1" xmlns="http://www.w3.org/2000/svg">
 <g fill="none" stroke-linecap="round">
  <path d="m1.5 12.5h4" stroke="#ffffff" stroke-width="3"/>
  <path d="m3.5 14.5v-4" stroke="#ffffff" stroke-width="3"/>
  <path d="m1.5 12.5h4" stroke="#ff6600"/>
  <path d="m3.5 14.5v-4" stroke="#ff6600"/>
 </g>
</svg>
