<?xml version="1.0" encoding="UTF-8" standalone="no"?>
<svg
   width="16"
   height="16"
   version="1.1"
   id="svg2"
   sodipodi:docname="items_save.svg"
   inkscape:export-filename="items_save.png"
   inkscape:export-xdpi="96"
   inkscape:export-ydpi="96"
   inkscape:version="1.3.2 (091e20e, 2023-11-25, custom)"
   xmlns:inkscape="http://www.inkscape.org/namespaces/inkscape"
   xmlns:sodipodi="http://sodipodi.sourceforge.net/DTD/sodipodi-0.dtd"
   xmlns="http://www.w3.org/2000/svg"
   xmlns:svg="http://www.w3.org/2000/svg">
  <defs
     id="defs2" />
  <sodipodi:namedview
     id="namedview2"
     pagecolor="#ffffff"
     bordercolor="#000000"
     borderopacity="0.25"
     inkscape:showpageshadow="2"
     inkscape:pageopacity="0.0"
     inkscape:pagecheckerboard="0"
     inkscape:deskcolor="#d1d1d1"
     showgrid="true"
     inkscape:current-layer="svg2">
    <inkscape:grid
       id="grid2"
       units="px"
       originx="0"
       originy="0"
       spacingx="0.5"
       spacingy="0.5"
       empcolor="#0099e5"
       empopacity="0.30196078"
       color="#0099e5"
       opacity="0.14901961"
       empspacing="2"
       dotted="false"
       gridanglex="30"
       gridanglez="30"
       visible="true" />
  </sodipodi:namedview>
  <path
     d="m14.5 13.7v-11.7l-1.5-1.5h-10.7c-0.4418278 0-0.8 0.3581722-0.8 0.8v12.4c0 0.441828 0.3581722 0.8 0.8 0.8h11.4c0.441828 0 0.8-0.358172 0.8-0.8z"
     fill="#e0edff"
     fill-rule="evenodd"
     stroke="#2a7efe"
     stroke-linejoin="round"
     id="path1" />
  <rect
     x="4.5"
     y=".5"
     width="7"
     height="5.0000038"
     rx="1"
     ry="1"
     fill="#ebf3ff"
     stroke="#2a7efe"
     stroke-linejoin="round"
     stroke-width=".999996"
     id="rect1" />
  <path
     d="m9.25 2v2"
     fill="none"
     stroke="#2a7efe"
     stroke-linejoin="round"
     stroke-width="1.5"
     id="path2" />
  <rect
     x="3.5"
     y="7.4999971"
     width="9"
     height="7"
     rx="1"
     ry=".99999988"
     fill="#ebf3ff"
     stroke="#2a7efe"
     stroke-linejoin="round"
     stroke-width=".999995"
     id="rect2" />
</svg>
