<?xml version="1.0" encoding="UTF-8" standalone="no"?>
<svg
   width="32"
   height="32"
   version="1.1"
   viewBox="0 0 32 32"
   id="svg3"
   sodipodi:docname="lineedit_200.svg"
   inkscape:export-filename="lineedit_200.png"
   inkscape:export-xdpi="96"
   inkscape:export-ydpi="96"
   inkscape:version="1.3.2 (091e20e, 2023-11-25, custom)"
   xmlns:inkscape="http://www.inkscape.org/namespaces/inkscape"
   xmlns:sodipodi="http://sodipodi.sourceforge.net/DTD/sodipodi-0.dtd"
   xmlns="http://www.w3.org/2000/svg"
   xmlns:svg="http://www.w3.org/2000/svg">
  <defs
     id="defs3" />
  <sodipodi:namedview
     id="namedview3"
     pagecolor="#ffffff"
     bordercolor="#000000"
     borderopacity="0.25"
     inkscape:showpageshadow="2"
     inkscape:pageopacity="0.0"
     inkscape:pagecheckerboard="0"
     inkscape:deskcolor="#d1d1d1"
     showgrid="true"
     inkscape:current-layer="svg3">
    <inkscape:grid
       id="grid3"
       units="px"
       originx="0"
       originy="0"
       spacingx="0.5"
       spacingy="0.5"
       empcolor="#0099e5"
       empopacity="0.30196078"
       color="#0099e5"
       opacity="0.14901961"
       empspacing="2"
       dotted="false"
       gridanglex="30"
       gridanglez="30"
       visible="true" />
  </sodipodi:namedview>
  <rect
     x=".5"
     y="7.5"
     width="31"
     height="17"
     rx="2.5"
     ry="2.5"
     fill="#ffffff"
     stroke="#008dd2"
     stroke-linecap="round"
     stroke-linejoin="round"
     style="paint-order:normal"
     id="rect1" />
  <path
     d="m8.9999636 20.199935v-8.399935l-2.5 1.6"
     fill="none"
     stroke="#666666"
     stroke-linecap="round"
     stroke-linejoin="round"
     stroke-width="1.6"
     id="path1" />
  <path
     d="m13.070986 13.269852c0.23233-0.847275 1.007948-1.469852 1.928978-1.469852 1.10457 0 2 0.895431 2 2 0 0.422825-0.1312 0.815005-0.355502 1.138416l-3.644498 5.261584h4"
     fill="none"
     stroke="#666666"
     stroke-linecap="round"
     stroke-linejoin="round"
     stroke-width="1.6"
     id="path2" />
  <path
     d="m21.061804 13.304522c0.220456-0.864907 1.004612-1.504522 1.93816-1.504522 1.10457 0 2 0.895431 2 2v0.2c0 1.104569-0.89543 2-2 2 1.10457 0 2 0.895431 2 2v0.2c0 1.104569-0.89543 2-2 2-0.933548 0-1.717704-0.639615-1.93816-1.504522"
     fill="none"
     stroke="#666666"
     stroke-linecap="round"
     stroke-linejoin="round"
     stroke-width="1.6"
     id="path3" />
</svg>
