<?xml version="1.0" encoding="UTF-8" standalone="no"?>
<svg
   height="36"
   width="36"
   version="1.1"
   id="svg14"
   sodipodi:docname="Time_10_36.svg"
   inkscape:export-filename="Time_10_36.png"
   inkscape:export-xdpi="96"
   inkscape:export-ydpi="96"
   inkscape:version="1.2.1 (9c6d41e410, 2022-07-14)"
   xmlns:inkscape="http://www.inkscape.org/namespaces/inkscape"
   xmlns:sodipodi="http://sodipodi.sourceforge.net/DTD/sodipodi-0.dtd"
   xmlns="http://www.w3.org/2000/svg"
   xmlns:svg="http://www.w3.org/2000/svg">
  <defs
     id="defs18" />
  <sodipodi:namedview
     id="namedview16"
     pagecolor="#ffffff"
     bordercolor="#666666"
     borderopacity="1.0"
     inkscape:pageshadow="2"
     inkscape:pageopacity="0.0"
     inkscape:pagecheckerboard="0"
     inkscape:deskcolor="#d1d1d1"
     showgrid="true"
     inkscape:zoom="25.5"
     inkscape:cx="18"
     inkscape:cy="18"
     inkscape:current-layer="svg14"
     inkscape:showpageshadow="2">
    <inkscape:grid
       type="xygrid"
       id="grid247" />
  </sodipodi:namedview>
  <path
     d="m 3.75,0.75 h 28.5 v 34.5 H 3.75 Z"
     fill="#ffffff"
     stroke="#3771c8"
     stroke-linecap="round"
     id="path2"
     style="stroke-width:1.5;stroke-dasharray:none;stroke:#00aad4;stroke-opacity:1;fill:none" />
  <path
     d="M 3,0 H 33 V 9 H 3 Z"
     fill="#d40000"
     id="path4"
     style="stroke-width:1.5;fill:#00aad4;fill-opacity:1;stroke:none" />
  <path
     d="M 9.2548829,25.449737 H 12.155272 V 15.331372 L 9,15.970933 v -1.634568 l 3.137695,-0.639561 h 1.775391 v 11.752933 h 2.900389 v 1.510155 H 9.2548829 Z"
     id="path6"
     style="stroke-width:1.5;fill:#00aad4;fill-opacity:1;stroke:none" />
  <path
     d="m 20.025709,13.696804 h 6.969727 v 1.510155 h -5.34375 v 3.25134 q 0.386719,-0.132707 0.773438,-0.195442 0.386719,-0.07088 0.773438,-0.07088 2.197265,0 3.480468,1.217141 1.283202,1.216991 1.283202,3.295678 0,2.140968 -1.318359,3.331417 -1.31836,1.181552 -3.717773,1.181552 -0.826171,0 -1.687499,-0.141756 -0.85254,-0.141756 -1.766601,-0.426475 v -1.803317 q 0.791015,0.435372 1.634764,0.648458 0.84375,0.213237 1.78418,0.213237 1.520508,0 2.408203,-0.808311 0.887695,-0.808461 0.887695,-2.194353 0,-1.385741 -0.887695,-2.194203 -0.887695,-0.808461 -2.408203,-0.808461 -0.711914,0 -1.423829,0.160003 -0.703124,0.159853 -1.441406,0.497503 z"
     id="path8"
     style="stroke-width:1.5;fill:#00aad4;fill-opacity:1;stroke:none" />
</svg>
