<svg width="24" height="24" version="1.1" viewBox="0 0 24 24" xmlns="http://www.w3.org/2000/svg">
 <path d="m18 6-12 12" fill="none" stroke="#fa0302" stroke-linecap="round" stroke-width="3.75"/>
 <path d="M 18,18 6,6" fill="none" stroke="#fa0302" stroke-linecap="round" stroke-width="3.75"/>
</svg>
