<?xml version="1.0" encoding="UTF-8" standalone="no"?>
<svg
   width="36"
   height="36"
   version="1.1"
   viewBox="0 0 36 36"
   id="svg2"
   sodipodi:docname="tfontdialog_150.svg"
   inkscape:export-filename="tfontdialog_150.png"
   inkscape:export-xdpi="96"
   inkscape:export-ydpi="96"
   inkscape:version="1.3.2 (091e20e, 2023-11-25, custom)"
   xmlns:inkscape="http://www.inkscape.org/namespaces/inkscape"
   xmlns:sodipodi="http://sodipodi.sourceforge.net/DTD/sodipodi-0.dtd"
   xmlns="http://www.w3.org/2000/svg"
   xmlns:svg="http://www.w3.org/2000/svg">
  <defs
     id="defs2" />
  <sodipodi:namedview
     id="namedview2"
     pagecolor="#ffffff"
     bordercolor="#000000"
     borderopacity="0.25"
     inkscape:showpageshadow="2"
     inkscape:pageopacity="0.0"
     inkscape:pagecheckerboard="0"
     inkscape:deskcolor="#d1d1d1"
     showgrid="true"
     inkscape:current-layer="svg2">
    <inkscape:grid
       id="grid2"
       units="px"
       originx="0"
       originy="0"
       spacingx="0.5"
       spacingy="0.5"
       empcolor="#0099e5"
       empopacity="0.30196078"
       color="#0099e5"
       opacity="0.14901961"
       empspacing="2"
       dotted="false"
       gridanglex="30"
       gridanglez="30"
       visible="true" />
  </sodipodi:namedview>
  <rect
     x="2.5"
     y="6.5"
     width="31"
     height="27"
     fill="#f9f9f9"
     stroke="#2a7efe"
     style="paint-order:normal"
     id="rect1" />
  <path
     d="M 34,3.5 V 7 H 2 V 3.5 C 2,2.8 2.7,2 3.5,2 h 29 C 33.2,2 34,2.7 34,3.5 Z"
     fill="#2a7efe"
     id="path1" />
  <path
     d="m 12.103989,29 v -0.7153 c 0.496989,-0.102 1.915862,-0.4288 1.915862,-0.8229 V 13.5516 C 13.56859,12.9734 12.791078,12.8943 12.103989,12.7152 V 12 h 11.346765 l 0.445235,0.3642 c -0.04049,1.0421 -0.367526,2.7761 -0.526198,3.2787 h -0.769044 c -0.02698,-0.8276 -0.134934,-1.4167 -0.323806,-1.7675 -0.179894,-0.3509 -0.44074,-0.5261 -0.782535,-0.5261 h -4.911085 l 7.47e-4,6.1983 h 5.019019 l 0.418252,0.4048 c -0.366145,0.61 -0.950163,1.4645 -1.268246,1.719 -0.615325,-0.6155 -1.418531,-0.896 -2.657925,-0.896 h -1.5111 l -7.47e-4,6.6864 c -4e-5,0.3593 1.431887,0.6579 2.334116,0.8229 V 29 Z"
     fill="#aa0000"
     id="path2" />
</svg>
