<?xml version="1.0" encoding="UTF-8" standalone="no"?>
<svg
   height="32"
   viewBox="0 0 32 32"
   width="32"
   version="1.1"
   id="svg8"
   sodipodi:docname="Key_04_32.svg"
   inkscape:export-filename="Key_04_32.png"
   inkscape:export-xdpi="96"
   inkscape:export-ydpi="96"
   inkscape:version="1.3.2 (091e20e, 2023-11-25, custom)"
   xmlns:inkscape="http://www.inkscape.org/namespaces/inkscape"
   xmlns:sodipodi="http://sodipodi.sourceforge.net/DTD/sodipodi-0.dtd"
   xmlns="http://www.w3.org/2000/svg"
   xmlns:svg="http://www.w3.org/2000/svg">
  <defs
     id="defs8" />
  <sodipodi:namedview
     id="namedview8"
     pagecolor="#ffffff"
     bordercolor="#000000"
     borderopacity="0.25"
     inkscape:showpageshadow="2"
     inkscape:pageopacity="0.0"
     inkscape:pagecheckerboard="0"
     inkscape:deskcolor="#d1d1d1"
     showgrid="true"
     inkscape:current-layer="svg8">
    <inkscape:grid
       id="grid8"
       units="px"
       originx="0"
       originy="0"
       spacingx="0.5"
       spacingy="0.5"
       empcolor="#0099e5"
       empopacity="0.30196078"
       color="#0099e5"
       opacity="0.14901961"
       empspacing="2"
       dotted="false"
       gridanglex="30"
       gridanglez="30"
       visible="true" />
  </sodipodi:namedview>
  <radialGradient
     id="a"
     cx="12.851111"
     cy="-2.486543"
     gradientTransform="matrix(3.2500002 -.00000019 .00000011 2.2500004 -22.766116 19.594726)"
     gradientUnits="userSpaceOnUse"
     r="4">
    <stop
       offset="0"
       stop-color="#bc9c00"
       id="stop1" />
    <stop
       offset="1"
       stop-color="#e5bf00"
       id="stop2" />
  </radialGradient>
  <linearGradient
     id="b"
     gradientUnits="userSpaceOnUse"
     x1="11"
     x2="8"
     y1="24"
     y2="21">
    <stop
       offset="0"
       stop-color="#b29400"
       id="stop3" />
    <stop
       offset="1"
       stop-color="#e0ba00"
       id="stop4" />
  </linearGradient>
  <linearGradient
     id="c"
     gradientUnits="userSpaceOnUse"
     x1="12"
     x2="8"
     y1="30"
     y2="26">
    <stop
       offset="0"
       stop-color="#ccaa00"
       id="stop5" />
    <stop
       offset="1"
       stop-color="#b89900"
       id="stop6" />
  </linearGradient>
  <path
     d="m23 2c-3.865986 0-7 3.134014-7 7s3.134014 7 7 7 7-3.134014 7-7-3.134014-7-7-7zm0 3c2.761424 0 4 1.238576 4 4-.0086 4.767514-8.84336-3.991268-4-4z"
     fill="url(#a)"
     stroke-linecap="round"
     stroke-linejoin="round"
     stroke-width="2"
     id="path6" />
  <path
     d="m11 29-2-2 4-4 2 2"
     fill="none"
     stroke="url(#c)"
     stroke-linecap="round"
     stroke-width="3"
     id="path7" />
  <path
     d="m5 27 13.5-13.5"
     fill="none"
     stroke="url(#b)"
     stroke-linecap="round"
     stroke-linejoin="round"
     stroke-width="4"
     id="path8" />
</svg>
