<?xml version="1.0" encoding="UTF-8" standalone="no"?>
<svg
   width="24"
   height="24"
   version="1.1"
   viewBox="0 0 24 24"
   id="svg14"
   sodipodi:docname="tstringgrid.svg"
   inkscape:export-filename="tstringgrid.png"
   inkscape:export-xdpi="96"
   inkscape:export-ydpi="96"
   inkscape:version="1.3.2 (091e20e, 2023-11-25, custom)"
   xmlns:inkscape="http://www.inkscape.org/namespaces/inkscape"
   xmlns:sodipodi="http://sodipodi.sourceforge.net/DTD/sodipodi-0.dtd"
   xmlns="http://www.w3.org/2000/svg"
   xmlns:svg="http://www.w3.org/2000/svg">
  <defs
     id="defs14" />
  <sodipodi:namedview
     id="namedview14"
     pagecolor="#ffffff"
     bordercolor="#000000"
     borderopacity="0.25"
     inkscape:showpageshadow="2"
     inkscape:pageopacity="0.0"
     inkscape:pagecheckerboard="0"
     inkscape:deskcolor="#d1d1d1"
     showgrid="true"
     inkscape:current-layer="svg14">
    <inkscape:grid
       id="grid14"
       units="px"
       originx="0"
       originy="0"
       spacingx="0.5"
       spacingy="0.5"
       empcolor="#0099e5"
       empopacity="0.30196078"
       color="#0099e5"
       opacity="0.14901961"
       empspacing="2"
       dotted="false"
       gridanglex="30"
       gridanglez="30"
       visible="true" />
  </sodipodi:namedview>
  <rect
     x="2.25"
     y="3.25"
     width="18.5"
     height="12.5"
     fill="#ffffff"
     stroke="#2a7efe"
     stroke-width=".5"
     style="paint-order:normal"
     id="rect1" />
  <rect
     transform="rotate(-90)"
     x="-15.750001"
     y="4.75"
     width="10.000001"
     height="5.000001"
     fill="#ffffff"
     stroke="#2a7efe"
     stroke-width=".499998"
     style="paint-order:normal"
     id="rect2" />
  <rect
     transform="rotate(-90)"
     x="-5.7500005"
     y="2.2499995"
     width="2.500001"
     height="18.5"
     fill="#ececec"
     stroke="#2a7efe"
     stroke-width=".499999"
     style="paint-order:normal"
     id="rect3" />
  <rect
     transform="scale(-1)"
     x="-4.7500005"
     y="-15.75"
     width="2.500001"
     height="10"
     fill="#ececec"
     stroke="#2a7efe"
     stroke-width=".499999"
     style="paint-order:normal"
     id="rect4" />
  <path
     d="m6 7.5h2.5"
     fill="none"
     stroke="#b3b3b3"
     id="path4" />
  <path
     d="m6 13.5h2.5"
     fill="none"
     stroke="#b3b3b3"
     id="path5" />
  <path
     d="m6 11.5h2.5"
     fill="none"
     stroke="#b3b3b3"
     id="path6" />
  <path
     d="m6 9.5h2.5"
     fill="none"
     stroke="#b3b3b3"
     id="path7" />
  <path
     d="m11.5 7.5h7"
     fill="none"
     stroke="#b3b3b3"
     id="path8" />
  <path
     d="m11.5 13.5h6"
     fill="none"
     stroke="#b3b3b3"
     id="path9" />
  <path
     d="m11.5 11.5h7"
     fill="none"
     stroke="#b3b3b3"
     id="path10" />
  <path
     d="m11.5 9.5h6"
     fill="none"
     stroke="#b3b3b3"
     id="path11" />
  <path
     d="m6.759768 21.253012h2.492762m-3.15253 1.34691 1.906149-5.199699 1.9061495 5.199699"
     fill="none"
     stroke="#2a7fff"
     stroke-linecap="round"
     stroke-linejoin="round"
     stroke-width=".8"
     id="path12" />
  <path
     d="m12.634702 18.886265v0c0.684025 0 1.234703 0.552394 1.234703 1.238552v1.238552c0 0.68616-0.550678 1.238553-1.234703 1.238553v0c-0.684025 0-1.234702-0.552393-1.234702-1.238553v-1.238552c0-0.686158 0.550677-1.238552 1.234702-1.238552zm-1.234702-1.486265v5.201922"
     fill="none"
     stroke="#2a7fff"
     stroke-linecap="round"
     stroke-linejoin="round"
     stroke-width=".8"
     id="path13" />
  <path
     d="m17.62873 19.38591c-0.224491-0.304923-0.585473-0.501988-0.994027-0.501988h-1e-6c-0.684027 0-1.234702 0.552394-1.234702 1.238552l5.71e-4 1.238552c0 0.68616 0.550677 1.238553 1.2347 1.238553h2e-6c0.408555 0 0.769537-0.197063 0.994028-0.501988"
     fill="none"
     stroke="#2a7fff"
     stroke-linecap="round"
     stroke-linejoin="round"
     stroke-width=".8"
     id="path14" />
</svg>
