<?xml version="1.0" encoding="UTF-8" standalone="no"?>
<svg
   height="64"
   width="64"
   version="1.1"
   id="svg655"
   sodipodi:docname="Health_15_64.svg"
   inkscape:export-filename="Health_15_64.png"
   inkscape:export-xdpi="96"
   inkscape:export-ydpi="96"
   inkscape:version="1.2.1 (9c6d41e410, 2022-07-14)"
   xmlns:inkscape="http://www.inkscape.org/namespaces/inkscape"
   xmlns:sodipodi="http://sodipodi.sourceforge.net/DTD/sodipodi-0.dtd"
   xmlns="http://www.w3.org/2000/svg"
   xmlns:svg="http://www.w3.org/2000/svg">
  <defs
     id="defs659" />
  <sodipodi:namedview
     id="namedview657"
     pagecolor="#ffffff"
     bordercolor="#666666"
     borderopacity="1.0"
     inkscape:showpageshadow="2"
     inkscape:pageopacity="0.0"
     inkscape:pagecheckerboard="0"
     inkscape:deskcolor="#d1d1d1"
     showgrid="true"
     inkscape:zoom="14.34375"
     inkscape:cx="29.490196"
     inkscape:cy="32"
     inkscape:current-layer="svg655">
    <inkscape:grid
       type="xygrid"
       id="grid1060" />
  </sodipodi:namedview>
  <radialGradient
     id="a"
     cx="8.559438"
     cy="9.409261"
     gradientTransform="matrix(1.0034825 3.8357493 -3.593218 1.041476 63.701424 -5.415894)"
     gradientUnits="userSpaceOnUse"
     r="5.499738">
    <stop
       offset="0"
       stop-color="#faa"
       id="stop624" />
    <stop
       offset="1"
       stop-color="#f00"
       id="stop626" />
  </radialGradient>
  <linearGradient
     id="b"
     gradientTransform="matrix(3.5384618 0 0 4.90909 -4.307696 -7.272727)"
     gradientUnits="userSpaceOnUse"
     x1="6.227273"
     x2="3.863637"
     y1="13.076924"
     y2="5.461539">
    <stop
       offset="0"
       stop-color="#e3ce49"
       id="stop629" />
    <stop
       offset="1"
       stop-color="#fceb84"
       id="stop631" />
  </linearGradient>
  <linearGradient
     id="c"
     gradientTransform="matrix(3.5384618 0 0 4.90909 -4.307696 -7.272727)"
     gradientUnits="userSpaceOnUse"
     x1="7.5"
     x2="7.5"
     y1="13.5"
     y2="2.5">
    <stop
       offset="0"
       stop-color="#aa8e1e"
       id="stop634" />
    <stop
       offset="1"
       stop-color="#ccaa24"
       id="stop636" />
  </linearGradient>
  <linearGradient
     id="d"
     gradientTransform="matrix(1.6923079 0 0 1.090909 10.461544 -15.727273)"
     gradientUnits="userSpaceOnUse"
     x1="5.399997"
     x2="5.399997"
     y1="4.333334"
     y2="11.666667">
    <stop
       offset="0"
       stop-color="#fc0"
       id="stop639"
       style="stop-color:#ff6600;stop-opacity:1;" />
    <stop
       offset="1"
       stop-color="#fff6d5"
       id="stop641" />
  </linearGradient>
  <linearGradient
     id="e"
     gradientTransform="matrix(1.6923079 0 0 1.090909 10.461544 -15.727273)"
     gradientUnits="userSpaceOnUse"
     x1="7.999997"
     x2="7.999997"
     y1="13.500001"
     y2="2.5">
    <stop
       offset="0"
       stop-color="#744b18"
       id="stop644" />
    <stop
       offset="1"
       stop-color="#ca7f26"
       id="stop646" />
  </linearGradient>
  <rect
     fill="url(#b)"
     fill-rule="evenodd"
     height="53.999996"
     rx="3"
     stroke="url(#c)"
     stroke-linecap="square"
     stroke-width="2"
     width="46"
     x="1"
     y="5.000001"
     id="rect649" />
  <rect
     fill="url(#d)"
     fill-rule="evenodd"
     height="12"
     rx="3"
     stroke="url(#e)"
     stroke-linecap="square"
     stroke-width="2"
     transform="scale(1 -1)"
     width="22"
     x="13"
     y="-13.000001"
     id="rect651" />
  <path
     d="m44.001434 31.734765c11.064302-17.509855 35.166553 5.519983-.002601 30.665272-35.1690574-25.14533-11.059871-48.175127.002601-30.665272z"
     fill="url(#a)"
     stroke="#fff"
     stroke-linejoin="round"
     stroke-width="3.2"
     id="path653" />
</svg>
