<svg width="36" height="36" version="1.1" xmlns="http://www.w3.org/2000/svg">
 <defs>
  <linearGradient id="linearGradient1174" x1="8" x2="8" y1="5.5" y2="11" gradientTransform="matrix(1.0033 0 0 .81698 -.024446 3.3709)" gradientUnits="userSpaceOnUse">
   <stop stop-color="#f6d756" offset="0"/>
   <stop stop-color="#fcf19c" offset="1"/>
  </linearGradient>
  <linearGradient id="linearGradient1227-3" x1="9" x2="9" y1="1.0004" y2="9.0004" gradientTransform="translate(-1.2911e-5,-3.934e-4)" gradientUnits="userSpaceOnUse">
   <stop stop-color="#fcf19c" offset="0"/>
   <stop stop-color="#f6d756" offset=".5"/>
   <stop stop-color="#f6ca13" offset=".53011"/>
   <stop stop-color="#f6d756" offset=".5625"/>
   <stop stop-color="#fcf19c" offset="1"/>
  </linearGradient>
  <linearGradient id="linearGradient923-3" x1="7" x2="7" y1="5.5" y2=".5" gradientTransform="translate(-1.2911e-5)" gradientUnits="userSpaceOnUse">
   <stop stop-color="#c79c46" offset="0"/>
   <stop stop-color="#ac8435" offset="1"/>
  </linearGradient>
  <filter id="filter958" x="-.03518" y="-.10525" width="1.0704" height="1.2105" color-interpolation-filters="sRGB">
   <feGaussianBlur stdDeviation="0.15298335"/>
  </filter>
  <linearGradient id="linearGradient1039" x1="8" x2="8" y1="5.5" y2="2.5" gradientTransform="matrix(1 0 0 -1 .0017648 16.002)" gradientUnits="userSpaceOnUse">
   <stop stop-color="#f6d756" offset="0"/>
   <stop stop-color="#fcf19c" offset="1"/>
  </linearGradient>
 </defs>
 <g transform="matrix(2.25 0 0 2.25 2.0117e-7 .49999)" stroke-linecap="round" stroke-linejoin="round">
  <rect x=".15" y="5.15" width="15.7" height="8.7" fill="url(#linearGradient1174)" stroke="#c79c46" stroke-dashoffset="1.5" stroke-width=".3"/>
  <path d="m7.9996 0.15-7.8496 5 7.8496 5 7.8496-5z" fill="url(#linearGradient1227-3)" stroke="url(#linearGradient923-3)" stroke-width=".3"/>
  <path transform="matrix(.93381 0 0 -.93793 .53116 15.226)" d="m0.50207 1.8402 7.4962 5.0111 7.4962-5.0111" fill="none" filter="url(#filter958)" stroke="#c79c46" stroke-width=".32056" style="mix-blend-mode:normal"/>
  <path d="m8 9-7.8243 4.8247h15.649z" fill="url(#linearGradient1039)" stroke="#c79c46" stroke-width=".3"/>
 </g>
</svg>
