<svg width="64" height="64" version="1.1" xmlns="http://www.w3.org/2000/svg">
 <path d="m32.757812 34.800781c-8.416007 0-17.029453 1.493985-21.642578 5.234375a1.40014 1.40014 0 0 0-0.021484 0.017578c-2.2417901 1.890739-3.3799865 4.387622-3.8808594 7.392578-0.5008728 3.004959-0.4628906 6.581957-0.4628906 11.154297a1.40014 1.40014 0 0 0 1.4003906 1.400391h33.060547a5.5999999 5.5999999 0 0 1 0.888671-2.800781h-7.560547l3.917969-15.888672 2.583985-3.095703c1.031208 0.161904 2.025234 0.351505 2.957031 0.576172 3.24551 0.782527 5.761225 1.994352 6.949219 3.265625 0.871245 1.068004 1.504581 2.014915 1.984375 2.955078l0.568359 0.568359 1.884766-1.884766c-0.58566-1.145918-1.334991-2.280337-2.302735-3.460937a1.40014 1.40014 0 0 0-0.054687-0.0625c-1.853801-2.004127-4.827812-3.246768-8.373047-4.101563-3.545235-0.854793-7.688481-1.269531-11.896485-1.269531zm-9.61914 3.640625 2.523437 2.869141 3.919922 15.888672h-19.976562c0.0042-3.738572-0.00934-7.022279 0.3691406-9.292969 0.4349376-2.609386 1.2192586-4.270014 2.9199216-5.707031 2.067055-1.669107 5.842826-2.970609 10.244141-3.757813z" fill="#00aad4" fill-rule="evenodd" stroke-linecap="round" stroke-linejoin="round"/>
 <ellipse cx="31.99894" cy="21.429504" rx="12.265352" ry="14.766517" fill="none" stroke="#00aad4" stroke-linecap="square" stroke-linejoin="round" stroke-width="2.8" style="paint-order:normal"/>
 <path d="m18.710546 20.681175s3.480758-6.426374 6.361706-3.853093c8.365431 7.471154 11.093473-7.8850011 20.218991 3.853093 3.322587-11.67204-5.196003-18.945564-13.055943-16.041979-8.387136-2.7724133-16.847342 6.037375-13.524754 16.041979z" fill="#00aad4" fill-rule="evenodd"/>
 <path d="M 46.782,60.217028 60.217028,46.782" fill="none" stroke="#00aad4" stroke-linecap="round" stroke-width="5"/>
 <path d="M 60.217028,60.217028 46.782,46.782" fill="none" stroke="#00aad4" stroke-linecap="round" stroke-width="5"/>
</svg>
