<?xml version="1.0" encoding="UTF-8" standalone="no"?>
<svg
   width="24"
   height="24"
   version="1.1"
   viewBox="0 0 24 24"
   id="svg33"
   sodipodi:docname="Database_22_24.svg"
   inkscape:export-filename="Database_22_24.png"
   inkscape:export-xdpi="96"
   inkscape:export-ydpi="96"
   inkscape:version="1.3.2 (091e20e, 2023-11-25, custom)"
   xmlns:inkscape="http://www.inkscape.org/namespaces/inkscape"
   xmlns:sodipodi="http://sodipodi.sourceforge.net/DTD/sodipodi-0.dtd"
   xmlns:xlink="http://www.w3.org/1999/xlink"
   xmlns="http://www.w3.org/2000/svg"
   xmlns:svg="http://www.w3.org/2000/svg">
  <sodipodi:namedview
     id="namedview33"
     pagecolor="#ffffff"
     bordercolor="#000000"
     borderopacity="0.25"
     inkscape:showpageshadow="2"
     inkscape:pageopacity="0.0"
     inkscape:pagecheckerboard="0"
     inkscape:deskcolor="#d1d1d1"
     showgrid="true"
     inkscape:current-layer="svg33">
    <inkscape:grid
       id="grid33"
       units="px"
       originx="0"
       originy="0"
       spacingx="0.5"
       spacingy="0.5"
       empcolor="#0099e5"
       empopacity="0.30196078"
       color="#0099e5"
       opacity="0.14901961"
       empspacing="2"
       dotted="false"
       gridanglex="30"
       gridanglez="30"
       visible="true" />
  </sodipodi:namedview>
  <defs
     id="defs3">
    <filter
       id="p"
       x="-0.093448399"
       y="-0.11681051"
       width="1.1868968"
       height="1.196498"
       color-interpolation-filters="sRGB">
      <feGaussianBlur
         stdDeviation=".1328125"
         id="feGaussianBlur1" />
    </filter>
    <linearGradient
       id="o"
       x1="52.5"
       x2="61.5"
       y1="7"
       y2="7"
       gradientTransform="matrix(1.1635673,0,0,-1.0214095,-48.571449,27.099932)"
       gradientUnits="userSpaceOnUse">
      <stop
         stop-color="#fc0"
         offset="0"
         id="stop1" />
      <stop
         stop-color="#f9f9f9"
         offset=".37840304"
         id="stop2" />
      <stop
         stop-color="#ffd42a"
         offset="1"
         id="stop3" />
    </linearGradient>
  </defs>
  <linearGradient
     id="a"
     x1="1"
     x2="12"
     y1="4.5"
     y2="4.5"
     gradientTransform="matrix(1.4545453 0 0 1.5 2.545454 .999938)"
     gradientUnits="userSpaceOnUse"
     xlink:href="#b" />
  <linearGradient
     id="b">
    <stop
       stop-color="#2de3e3"
       offset="0"
       id="stop4" />
    <stop
       stop-color="#71ffff"
       offset=".23818764"
       id="stop5" />
    <stop
       stop-color="#08b9b9"
       offset=".48656252"
       id="stop6" />
    <stop
       stop-color="#08cfcf"
       offset=".6837101"
       id="stop7" />
    <stop
       stop-color="#079a9a"
       offset=".86378187"
       id="stop8" />
    <stop
       stop-color="#07cccc"
       offset="1"
       id="stop9" />
  </linearGradient>
  <linearGradient
     id="c">
    <stop
       stop-color="#999999"
       offset="0"
       id="stop10" />
    <stop
       stop-color="#f8f8f8"
       offset=".23818764"
       id="stop11" />
    <stop
       stop-color="#868684"
       offset=".48656252"
       id="stop12" />
    <stop
       stop-color="#b2b2b2"
       offset=".6837101"
       id="stop13" />
    <stop
       stop-color="#4f4f4f"
       offset=".86378187"
       id="stop14" />
    <stop
       stop-color="#858585"
       offset="1"
       id="stop15" />
  </linearGradient>
  <linearGradient
     id="d">
    <stop
       stop-color="#9d9d9d"
       offset="0"
       id="stop16" />
    <stop
       stop-color="#808080"
       offset="1"
       id="stop17" />
  </linearGradient>
  <linearGradient
     id="e"
     x1="1"
     x2="12"
     y1="3.122919"
     y2="3.122919"
     gradientTransform="matrix(1.4545453 0 0 1.5 2.545455 2.249959)"
     gradientUnits="userSpaceOnUse"
     xlink:href="#c" />
  <linearGradient
     id="f"
     x1="1"
     x2="12"
     y1="1.5"
     y2="1.5"
     gradientTransform="matrix(1.4545453 0 0 1.5 2.545455 2.249959)"
     gradientUnits="userSpaceOnUse">
    <stop
       stop-color="#b0b0b0"
       offset="0"
       id="stop18" />
    <stop
       stop-color="#cbcbcb"
       offset="1"
       id="stop19" />
  </linearGradient>
  <linearGradient
     id="g"
     x1="4.5"
     x2="6"
     y1="6"
     y2="4"
     gradientTransform="matrix(1.4545453 0 0 1.5 2.545455 .999959)"
     gradientUnits="userSpaceOnUse"
     xlink:href="#d" />
  <linearGradient
     id="h"
     x1="1"
     x2="12"
     y1="4.5"
     y2="4.5"
     gradientTransform="matrix(1.4545453 0 0 1.5 2.545454 4.999918)"
     gradientUnits="userSpaceOnUse"
     xlink:href="#b" />
  <linearGradient
     id="i"
     x1="1"
     x2="12"
     y1="3.122919"
     y2="3.122919"
     gradientTransform="matrix(1.4545453 0 0 1.5 2.545454 6.249918)"
     gradientUnits="userSpaceOnUse"
     xlink:href="#c" />
  <linearGradient
     id="j"
     x1="4.5"
     x2="6"
     y1="6"
     y2="4"
     gradientTransform="matrix(1.4545453 0 0 1.5 2.545454 4.999939)"
     gradientUnits="userSpaceOnUse"
     xlink:href="#d" />
  <linearGradient
     id="k"
     x1="1"
     x2="12"
     y1="4.5"
     y2="4.5"
     gradientTransform="matrix(1.4545453 0 0 1.5 2.545454 8.999918)"
     gradientUnits="userSpaceOnUse"
     xlink:href="#b" />
  <linearGradient
     id="l"
     x1="1"
     x2="12"
     y1="3.122919"
     y2="3.122919"
     gradientTransform="matrix(1.4545453 0 0 1.5 2.545454 10.249918)"
     gradientUnits="userSpaceOnUse"
     xlink:href="#c" />
  <linearGradient
     id="m"
     x1="4.5"
     x2="6"
     y1="6"
     y2="4"
     gradientTransform="matrix(1.4545453 0 0 1.5 2.545454 8.999939)"
     gradientUnits="userSpaceOnUse"
     xlink:href="#d" />
  <linearGradient
     id="n"
     x1="1"
     x2="12"
     y1="3.122919"
     y2="3.122919"
     gradientTransform="matrix(1.4545453 0 0 1.5 2.545454 14.249918)"
     gradientUnits="userSpaceOnUse"
     xlink:href="#c" />
  <ellipse
     cx="12"
     cy="8.499959"
     rx="7.999999"
     ry="1.5"
     fill="url(#g)"
     stroke-width=".999995"
     id="ellipse19" />
  <ellipse
     cx="12"
     cy="4.499959"
     rx="7.999999"
     ry="1.5"
     fill="url(#f)"
     stroke-width=".999995"
     id="ellipse20" />
  <path
     d="m4.7272726 7.1214855v1.3784732c1.4545452.866024 4.3636367 1 7.2727274 1 2.909092 0 5.818183-.121095 7.272727-1.000001v-1.3784732c-1.261802.517415-4.040059.878906-7.272727.878906-3.2326668 0-6.010927-.361491-7.2727274-.878905z"
     fill="url(#a)"
     stroke-linecap="round"
     stroke-width=".1"
     id="path20" />
  <path
     d="m12.000001 8.4999587c-4.4182773 0-7.9999999-.671573-7.9999999-1.5l-.0000001-2.5c0 .828427 3.5817218 1.7500212 8 1.7500212 4.418278 0 7.999999-.9215941 7.999999-1.7500212v2.5c0 .828427-3.58172 1.5-7.999999 1.5z"
     fill="url(#e)"
     stroke-linecap="round"
     stroke-width=".1"
     id="path21" />
  <path
     d="m12.000001 6.1949865c-7.9999992 1e-7 -7.9999993-1.6950066-7.9999993-1.6950066s1e-7 1.3049934 7.9999993 1.3049934c8 0 8-1.3049934 8-1.3049934s0 1.6950066-8 1.6950066z"
     fill="#e6e6e6"
     stroke-linecap="round"
     stroke-width=".1"
     id="path22" />
  <ellipse
     cx="11.999999"
     cy="12.499938"
     rx="7.999999"
     ry="1.5"
     fill="url(#j)"
     stroke-width=".999995"
     id="ellipse22" />
  <path
     d="m4.7272716 11.121034v1.378905c1.4545454.866024 4.3636367 1 7.2727284 1 2.909091 0 5.818182-.121095 7.272726-1.000001v-1.378905c-1.261802.517415-4.040059.878906-7.272726.878906-3.2326676 0-6.0109279-.361491-7.2727284-.878905z"
     fill="url(#h)"
     stroke-linecap="round"
     stroke-width=".1"
     id="path23" />
  <path
     d="m12 12.499938c-4.4182782 0-8.0000009-.671573-8.0000009-1.5l-.0000001-2.5000206c0 .828427 3.5817228 1.5000213 8.000001 1.5000213 4.418278 0 7.999998-.6715942 7.999998-1.5000213v2.5000206c0 .828427-3.58172 1.5-7.999998 1.5z"
     fill="url(#i)"
     stroke-linecap="round"
     stroke-width=".1"
     id="path24" />
  <path
     d="m12 10.194946c-8 0-8.0000001-1.6950074-8.0000001-1.6950074s1e-7 1.3049931 8.0000001 1.3049931c7.999999 0 7.999999-1.3049931 7.999999-1.3049931s0 1.6950074-7.999999 1.6950074z"
     fill="#e6e6e6"
     stroke-linecap="round"
     stroke-width=".1"
     id="path25" />
  <ellipse
     cx="11.999999"
     cy="16.499941"
     rx="7.999999"
     ry="1.5"
     fill="url(#m)"
     stroke-width=".999995"
     id="ellipse25" />
  <path
     d="m4.7272716 15.121034v1.378905c1.4545454.866024 4.3636367 1 7.2727284 1 2.909091 0 5.818182-.121095 7.272726-1.000001v-1.378905c-1.261802.517415-4.040059.878906-7.272726.878906-3.2326676 0-6.0109279-.361491-7.2727284-.878905z"
     fill="url(#k)"
     stroke-linecap="round"
     stroke-width=".1"
     id="path26" />
  <path
     d="m12 16.499939c-4.4182782 0-8.0000009-.671573-8.0000009-1.5l-.0000001-2.500021c0 .828427 3.5817228 1.500021 8.000001 1.500021 4.418278 0 7.999998-.671594 7.999998-1.500021v2.500021c0 .828427-3.58172 1.5-7.999998 1.5z"
     fill="url(#l)"
     stroke-linecap="round"
     stroke-width=".1"
     id="path27" />
  <path
     d="m12 14.194946c-8 0-8.0000001-1.695007-8.0000001-1.695007s1e-7 1.304994 8.0000001 1.304994c7.999999 0 7.999999-1.304994 7.999999-1.304994s0 1.695007-7.999999 1.695007z"
     fill="#e6e6e6"
     stroke-linecap="round"
     stroke-width=".1"
     id="path28" />
  <path
     d="m12 20.499941c-4.4182782 0-8.0000009-.671573-8.0000009-1.5l-.0000001-2.500023c0 .828427 3.5817228 1.500021 8.000001 1.500021 4.418278 0 7.999998-.671594 7.999998-1.500021v2.500023c0 .828427-3.58172 1.5-7.999998 1.5z"
     fill="url(#n)"
     stroke-linecap="round"
     stroke-width=".1"
     id="path29" />
  <path
     d="m12 18.194946c-8 0-8.0000001-1.695007-8.0000001-1.695007s1e-7 1.304994 8.0000001 1.304994c7.999999 0 7.999999-1.304994 7.999999-1.304994s0 1.695007-7.999999 1.695007z"
     fill="#e6e6e6"
     stroke-linecap="round"
     stroke-width=".1"
     id="path30" />
  <path
     d="m13.875 16v-2.480945c0-2.283648 1.846825-4.13491 4.125-4.13491s4.125 1.851263 4.125 4.13491v2.480945"
     fill="none"
     stroke="#b3b3b3"
     stroke-linejoin="round"
     stroke-width="1.75"
     id="path31" />
  <path
     transform="matrix(1.6832729,0,0,1.6839079,1.1254582,-3.0423996)"
     d="m7.5 11.321773v-1.4999996c0-1.380712 1.119288-2.5 2.5-2.5s2.5 1.119288 2.5 2.5v1.4999996"
     fill="none"
     filter="url(#p)"
     stroke="#ffffff"
     stroke-linejoin="round"
     stroke-width=".296984"
     id="path32" />
  <path
     d="m23.625 23.62513v-7.25h-11.25v7.25z"
     fill="url(#o)"
     stroke="#d4aa00"
     stroke-linecap="round"
     stroke-linejoin="round"
     stroke-width=".749999"
     id="path33" />
</svg>
