<?xml version="1.0" encoding="UTF-8" standalone="no"?>
<svg
   height="24"
   width="24"
   version="1.1"
   id="svg1464"
   sodipodi:docname="User_01_24.svg"
   inkscape:export-filename="User_01_24.png"
   inkscape:export-xdpi="96"
   inkscape:export-ydpi="96"
   inkscape:version="1.2-beta (1b65182ce9, 2022-04-05)"
   xmlns:inkscape="http://www.inkscape.org/namespaces/inkscape"
   xmlns:sodipodi="http://sodipodi.sourceforge.net/DTD/sodipodi-0.dtd"
   xmlns="http://www.w3.org/2000/svg"
   xmlns:svg="http://www.w3.org/2000/svg">
  <defs
     id="defs1468" />
  <sodipodi:namedview
     id="namedview1466"
     pagecolor="#ffffff"
     bordercolor="#666666"
     borderopacity="1.0"
     inkscape:pageshadow="2"
     inkscape:pageopacity="0.0"
     inkscape:pagecheckerboard="0"
     inkscape:deskcolor="#d1d1d1"
     showgrid="true"
     inkscape:zoom="38.25"
     inkscape:cx="10.470588"
     inkscape:cy="12"
     inkscape:current-layer="g1960">
    <inkscape:grid
       type="xygrid"
       id="grid1612" />
  </sodipodi:namedview>
  <g
     id="g1960"
     transform="scale(1.5)">
    <g
       id="g2908">
      <circle
         style="fill:none;stroke:#00aad4;stroke-linecap:round;stroke-linejoin:round;stroke-dashoffset:1.49998"
         id="path355"
         cx="8"
         cy="8"
         r="7" />
      <circle
         style="fill:none;stroke:#00aad4;stroke-width:1;stroke-linecap:round;stroke-linejoin:round;stroke-dashoffset:1.49998;stroke-dasharray:none"
         id="path912"
         cx="8"
         cy="6.5"
         r="2.0833333" />
      <path
         style="fill:none;stroke:#00aad4;stroke-width:1px;stroke-linecap:butt;stroke-linejoin:miter;stroke-opacity:1"
         d="M 4,13.5 C 4,8 12,8 12,13.5"
         id="path968"
         sodipodi:nodetypes="cc" />
    </g>
  </g>
</svg>
