<?xml version="1.0" encoding="UTF-8" standalone="no"?>
<svg
   height="24"
   width="24"
   version="1.1"
   id="svg8"
   sodipodi:docname="filename_150.svg"
   inkscape:export-filename="filename_150.png"
   inkscape:export-xdpi="96"
   inkscape:export-ydpi="96"
   inkscape:version="1.1.2 (0a00cf5339, 2022-02-04, custom)"
   xmlns:inkscape="http://www.inkscape.org/namespaces/inkscape"
   xmlns:sodipodi="http://sodipodi.sourceforge.net/DTD/sodipodi-0.dtd"
   xmlns="http://www.w3.org/2000/svg"
   xmlns:svg="http://www.w3.org/2000/svg"
   xmlns:rdf="http://www.w3.org/1999/02/22-rdf-syntax-ns#"
   xmlns:cc="http://creativecommons.org/ns#"
   xmlns:dc="http://purl.org/dc/elements/1.1/">
  <metadata
     id="metadata14">
    <rdf:RDF>
      <cc:Work
         rdf:about="">
        <dc:format>image/svg+xml</dc:format>
        <dc:type
           rdf:resource="http://purl.org/dc/dcmitype/StillImage" />
      </cc:Work>
    </rdf:RDF>
  </metadata>
  <defs
     id="defs12" />
  <sodipodi:namedview
     pagecolor="#ffffff"
     bordercolor="#666666"
     borderopacity="1"
     objecttolerance="10"
     gridtolerance="10"
     guidetolerance="10"
     inkscape:pageopacity="0"
     inkscape:pageshadow="2"
     inkscape:window-width="640"
     inkscape:window-height="480"
     id="namedview10"
     showgrid="true"
     inkscape:zoom="38"
     inkscape:cx="11.986842"
     inkscape:cy="12"
     inkscape:current-layer="svg8"
     inkscape:document-rotation="0"
     showguides="true"
     inkscape:guide-bbox="true"
     inkscape:snap-bbox="true"
     inkscape:bbox-paths="true"
     inkscape:bbox-nodes="true"
     inkscape:snap-bbox-edge-midpoints="true"
     inkscape:snap-bbox-midpoints="true"
     inkscape:pagecheckerboard="0">
    <inkscape:grid
       type="xygrid"
       id="grid839" />
  </sodipodi:namedview>
  <path
     style="fill:none;fill-opacity:1;stroke:#00aad4;stroke-width:1.5;stroke-opacity:1"
     d="M 6.75,20.25 V 6.75 h 7.5 l 3,3 v 10.5 z"
     id="path1591"
     sodipodi:nodetypes="cccccc" />
  <path
     d="m 9,11.25 h 6"
     id="path2"
     style="fill:none;stroke:#00aad4;stroke-width:1.5;stroke-linecap:butt;stroke-opacity:1"
     sodipodi:nodetypes="cc" />
  <rect
     style="fill:none;stroke:#00aad4;stroke-width:1.5;stroke-linecap:round;stroke-dashoffset:1.49998;stroke-opacity:1"
     id="rect862"
     width="22.5"
     height="22.5"
     x="0.75"
     y="0.75" />
  <rect
     style="fill:#00aad4;fill-opacity:1;stroke:#00aad4;stroke-width:1.49999;stroke-linecap:round;stroke-dashoffset:1.49998;stroke-opacity:1"
     id="rect1112"
     width="22.5"
     height="2.5"
     x="0.75"
     y="0.75" />
  <path
     d="m 9,17.25 h 6"
     id="path2772"
     style="fill:none;stroke:#00aad4;stroke-width:1.5;stroke-linecap:butt;stroke-opacity:1"
     sodipodi:nodetypes="cc" />
  <path
     d="m 9,14.25 h 6"
     id="path2774"
     style="fill:none;stroke:#00aad4;stroke-width:1.5;stroke-linecap:butt;stroke-opacity:1"
     sodipodi:nodetypes="cc" />
</svg>
