<?xml version="1.0" encoding="UTF-8" standalone="no"?>
<svg
   height="32"
   viewBox="0 0 32 32"
   width="32"
   version="1.1"
   id="svg38"
   sodipodi:docname="Money_01_32.svg"
   inkscape:export-filename="Money_01_32.png"
   inkscape:export-xdpi="96"
   inkscape:export-ydpi="96"
   inkscape:version="1.3.2 (091e20e, 2023-11-25, custom)"
   xmlns:inkscape="http://www.inkscape.org/namespaces/inkscape"
   xmlns:sodipodi="http://sodipodi.sourceforge.net/DTD/sodipodi-0.dtd"
   xmlns:xlink="http://www.w3.org/1999/xlink"
   xmlns="http://www.w3.org/2000/svg"
   xmlns:svg="http://www.w3.org/2000/svg">
  <defs
     id="defs38" />
  <sodipodi:namedview
     id="namedview38"
     pagecolor="#ffffff"
     bordercolor="#000000"
     borderopacity="0.25"
     inkscape:showpageshadow="2"
     inkscape:pageopacity="0.0"
     inkscape:pagecheckerboard="0"
     inkscape:deskcolor="#d1d1d1"
     showgrid="true"
     inkscape:current-layer="svg38">
    <inkscape:grid
       id="grid38"
       units="px"
       originx="0"
       originy="0"
       spacingx="0.5"
       spacingy="0.5"
       empcolor="#0099e5"
       empopacity="0.30196078"
       color="#0099e5"
       opacity="0.14901961"
       empspacing="2"
       dotted="false"
       gridanglex="30"
       gridanglez="30"
       visible="true" />
  </sodipodi:namedview>
  <linearGradient
     id="a"
     gradientTransform="matrix(.09838648 0 0 .1140263 -68.554319 -11.841396)"
     gradientUnits="userSpaceOnUse"
     spreadMethod="pad"
     x1="493.51001"
     x2="554.48999"
     xlink:href="#c"
     y1="105.46"
     y2="105.46" />
  <linearGradient
     id="b"
     gradientTransform="matrix(.09838648 0 0 .1140263 -68.554319 -12.709174)"
     gradientUnits="userSpaceOnUse"
     x1="493.51001"
     x2="554.48999"
     xlink:href="#d"
     y1="105.46"
     y2="105.46" />
  <linearGradient
     id="c"
     gradientTransform="matrix(.09838648 0 0 .1140263 -68.554319 -11.841396)"
     gradientUnits="userSpaceOnUse"
     spreadMethod="pad"
     x1="493.51001"
     x2="554.48999"
     y1="105.46"
     y2="105.46">
    <stop
       offset="0"
       stop-color="#623116"
       id="stop1" />
    <stop
       offset=".21342"
       stop-color="#cda355"
       id="stop2" />
    <stop
       offset=".42393"
       stop-color="#fef8d3"
       id="stop3" />
    <stop
       offset=".60341"
       stop-color="#ae7f43"
       id="stop4" />
    <stop
       offset=".78558"
       stop-color="#ddb86c"
       id="stop5" />
    <stop
       offset="1"
       stop-color="#603014"
       id="stop6" />
  </linearGradient>
  <linearGradient
     id="d"
     gradientTransform="matrix(.09838648 0 0 .1140263 -68.554319 -12.709174)"
     gradientUnits="userSpaceOnUse"
     x1="493.51001"
     x2="554.48999"
     y1="105.46"
     y2="105.46">
    <stop
       offset="0"
       stop-color="#ba902c"
       id="stop7" />
    <stop
       offset="1"
       stop-color="#dbb66a"
       id="stop8" />
  </linearGradient>
  <path
     d="m1 5h30v18h-30z"
     fill="#f2f2f2"
     stroke="#37c837"
     stroke-linecap="round"
     stroke-width="2"
     id="path8" />
  <g
     fill="#37c837"
     id="g11">
    <path
       d="m2 20h2v2h-2z"
       id="path9" />
    <path
       d="m2 6h2v2h-2z"
       id="path10" />
    <path
       d="m28 6h2v2h-2z"
       id="path11" />
    <ellipse
       cx="16"
       cy="14"
       rx="8"
       ry="5"
       id="ellipse11" />
  </g>
  <g
     transform="matrix(2 0 0 2 46.5 30)"
     id="g13">
    <path
       d="m-20-.68359375v.8671875c0 .08480241 1.307164.31640625 3 .31640625s3-.23160383 3-.31640625v-.8671875z"
       fill="url(#a)"
       id="path12" />
    <path
       d="m-14-.6839613c0 .0848026-1.307162.31618351-3 .31618351s-3-.23138101-3-.31618351 1.307162-.3160387 3-.3160387 3 .23123735 3 .3160387z"
       fill="url(#b)"
       stroke-width=".306336"
       id="path13" />
  </g>
  <g
     transform="matrix(2 0 0 2 46 28)"
     id="g15">
    <path
       d="m-20-.68359375v.8671875c0 .08480241 1.307164.31640625 3 .31640625s3-.23160383 3-.31640625v-.8671875z"
       fill="url(#c)"
       id="path14" />
    <path
       d="m-14-.6839613c0 .0848026-1.307162.31618351-3 .31618351s-3-.23138101-3-.31618351 1.307162-.3160387 3-.3160387 3 .23123735 3 .3160387z"
       fill="url(#d)"
       stroke-width=".306336"
       id="path15" />
  </g>
  <g
     transform="matrix(2 0 0 2 46.5 26)"
     id="g17">
    <path
       d="m-20-.68359375v.8671875c0 .08480241 1.307164.31640625 3 .31640625s3-.23160383 3-.31640625v-.8671875z"
       fill="url(#a)"
       id="path16" />
    <path
       d="m-14-.6839613c0 .0848026-1.307162.31618351-3 .31618351s-3-.23138101-3-.31618351 1.307162-.3160387 3-.3160387 3 .23123735 3 .3160387z"
       fill="url(#b)"
       stroke-width=".306336"
       id="path17" />
  </g>
  <g
     transform="matrix(2 0 0 2 60 30)"
     id="g19">
    <path
       d="m-20-.68359375v.8671875c0 .08480241 1.307164.31640625 3 .31640625s3-.23160383 3-.31640625v-.8671875z"
       fill="url(#c)"
       id="path18" />
    <path
       d="m-14-.6839613c0 .0848026-1.307162.31618351-3 .31618351s-3-.23138101-3-.31618351 1.307162-.3160387 3-.3160387 3 .23123735 3 .3160387z"
       fill="url(#d)"
       stroke-width=".306336"
       id="path19" />
  </g>
  <g
     transform="matrix(2 0 0 2 59.5 28)"
     id="g21">
    <path
       d="m-20-.68359375v.8671875c0 .08480241 1.307164.31640625 3 .31640625s3-.23160383 3-.31640625v-.8671875z"
       fill="url(#a)"
       id="path20" />
    <path
       d="m-14-.6839613c0 .0848026-1.307162.31618351-3 .31618351s-3-.23138101-3-.31618351 1.307162-.3160387 3-.3160387 3 .23123735 3 .3160387z"
       fill="url(#b)"
       stroke-width=".306336"
       id="path21" />
  </g>
  <g
     transform="matrix(2 0 0 2 60 26)"
     id="g23">
    <path
       d="m-20-.68359375v.8671875c0 .08480241 1.307164.31640625 3 .31640625s3-.23160383 3-.31640625v-.8671875z"
       fill="url(#c)"
       id="path22" />
    <path
       d="m-14-.6839613c0 .0848026-1.307162.31618351-3 .31618351s-3-.23138101-3-.31618351 1.307162-.3160387 3-.3160387 3 .23123735 3 .3160387z"
       fill="url(#d)"
       stroke-width=".306336"
       id="path23" />
  </g>
  <g
     transform="matrix(2 0 0 2 60 24)"
     id="g25">
    <path
       d="m-20-.68359375v.8671875c0 .08480241 1.307164.31640625 3 .31640625s3-.23160383 3-.31640625v-.8671875z"
       fill="url(#c)"
       id="path24" />
    <path
       d="m-14-.6839613c0 .0848026-1.307162.31618351-3 .31618351s-3-.23138101-3-.31618351 1.307162-.3160387 3-.3160387 3 .23123735 3 .3160387z"
       fill="url(#d)"
       stroke-width=".306336"
       id="path25" />
  </g>
  <g
     transform="matrix(2 0 0 2 59.5 22)"
     id="g27">
    <path
       d="m-20-.68359375v.8671875c0 .08480241 1.307164.31640625 3 .31640625s3-.23160383 3-.31640625v-.8671875z"
       fill="url(#a)"
       id="path26" />
    <path
       d="m-14-.6839613c0 .0848026-1.307162.31618351-3 .31618351s-3-.23138101-3-.31618351 1.307162-.3160387 3-.3160387 3 .23123735 3 .3160387z"
       fill="url(#b)"
       stroke-width=".306336"
       id="path27" />
  </g>
  <g
     transform="matrix(2 0 0 2 60 20)"
     id="g29">
    <path
       d="m-20-.68359375v.8671875c0 .08480241 1.307164.31640625 3 .31640625s3-.23160383 3-.31640625v-.8671875z"
       fill="url(#c)"
       id="path28" />
    <path
       d="m-14-.6839613c0 .0848026-1.307162.31618351-3 .31618351s-3-.23138101-3-.31618351 1.307162-.3160387 3-.3160387 3 .23123735 3 .3160387z"
       fill="url(#d)"
       stroke-width=".306336"
       id="path29" />
  </g>
  <g
     transform="matrix(2 0 0 2 59.5 18)"
     id="g31">
    <path
       d="m-20-.68359375v.8671875c0 .08480241 1.307164.31640625 3 .31640625s3-.23160383 3-.31640625v-.8671875z"
       fill="url(#a)"
       id="path30" />
    <path
       d="m-14-.6839613c0 .0848026-1.307162.31618351-3 .31618351s-3-.23138101-3-.31618351 1.307162-.3160387 3-.3160387 3 .23123735 3 .3160387z"
       fill="url(#b)"
       stroke-width=".306336"
       id="path31" />
  </g>
  <g
     transform="matrix(2 0 0 2 60 16)"
     id="g33">
    <path
       d="m-20-.68359375v.8671875c0 .08480241 1.307164.31640625 3 .31640625s3-.23160383 3-.31640625v-.8671875z"
       fill="url(#c)"
       id="path32" />
    <path
       d="m-14-.6839613c0 .0848026-1.307162.31618351-3 .31618351s-3-.23138101-3-.31618351 1.307162-.3160387 3-.3160387 3 .23123735 3 .3160387z"
       fill="url(#d)"
       stroke-width=".306336"
       id="path33" />
  </g>
  <g
     transform="matrix(2 0 0 2 46 24)"
     id="g35">
    <path
       d="m-20-.68359375v.8671875c0 .08480241 1.307164.31640625 3 .31640625s3-.23160383 3-.31640625v-.8671875z"
       fill="url(#c)"
       id="path34" />
    <path
       d="m-14-.6839613c0 .0848026-1.307162.31618351-3 .31618351s-3-.23138101-3-.31618351 1.307162-.3160387 3-.3160387 3 .23123735 3 .3160387z"
       fill="url(#d)"
       stroke-width=".306336"
       id="path35" />
  </g>
  <g
     transform="matrix(2 0 0 2 46 22)"
     id="g37">
    <path
       d="m-20-.68359375v.8671875c0 .08480241 1.307164.31640625 3 .31640625s3-.23160383 3-.31640625v-.8671875z"
       fill="url(#c)"
       id="path36" />
    <path
       d="m-14-.6839613c0 .0848026-1.307162.31618351-3 .31618351s-3-.23138101-3-.31618351 1.307162-.3160387 3-.3160387 3 .23123735 3 .3160387z"
       fill="url(#d)"
       stroke-width=".306336"
       id="path37" />
  </g>
  <path
     d="m14.978349 16.205579c.0054-1.490504.0164-2.973312-.0058-4.471559-.0044-.302647-.661079-.367247-1.320003-.286692-.556015.06796-1.221408.2584-1.694346.139248-.535122-.134828.271527-.275832.706527-.339601 1.579924-.231609 3.096264-.566042 4.685728-.75282.387621-.04554.402216.17275.338248.288278-.268753.485411-.199691 1.201923-.208263 1.804312-.0194 1.366684-.015 2.733855.0044 4.100505.0054.387497.404978.440708 1.186222.465264.504816.0158 1.299982-.03566 1.122626.237859-.136168.210004-1.089405.08779-1.580484.07538-1.656203-.0418-3.320382-.09764-4.971461.0184-.810065.05692-.812807-.338127-.03452-.306963.579778.02322 1.563363-.0234 1.659818-.282481.08886-.238676.110346-.459222.111186-.689101z"
     fill="#fff"
     stroke-linecap="round"
     stroke-width="3.16702"
     id="path38" />
</svg>
