<?xml version="1.0" encoding="UTF-8" standalone="no"?>
<svg
   height="16"
   width="16"
   version="1.1"
   id="svg2"
   sodipodi:docname="ddforeignkeys.svg"
   inkscape:export-filename="ddforeignkeys.png"
   inkscape:export-xdpi="96"
   inkscape:export-ydpi="96"
   inkscape:version="1.3-beta (cedbd6c6ff, 2023-05-28)"
   xmlns:inkscape="http://www.inkscape.org/namespaces/inkscape"
   xmlns:sodipodi="http://sodipodi.sourceforge.net/DTD/sodipodi-0.dtd"
   xmlns="http://www.w3.org/2000/svg"
   xmlns:svg="http://www.w3.org/2000/svg">
  <defs
     id="defs2" />
  <sodipodi:namedview
     id="namedview2"
     pagecolor="#ffffff"
     bordercolor="#000000"
     borderopacity="0.25"
     inkscape:showpageshadow="2"
     inkscape:pageopacity="0.0"
     inkscape:pagecheckerboard="0"
     inkscape:deskcolor="#d1d1d1"
     showgrid="true"
     inkscape:current-layer="svg2">
    <inkscape:grid
       id="grid2"
       units="px"
       originx="0"
       originy="0"
       spacingx="0.5"
       spacingy="0.5"
       empcolor="#0099e5"
       empopacity="0.30196078"
       color="#0099e5"
       opacity="0.14901961"
       empspacing="2"
       dotted="false"
       gridanglex="30"
       gridanglez="30"
       visible="true" />
  </sodipodi:namedview>
  <rect
     fill="#c2f3ff"
     height="12.000003"
     ry="1.6000004"
     width="12.000002"
     x="0.49999851"
     y="0.5"
     id="rect1"
     style="stroke:#00aad4;stroke-width:0.999997;stroke-linejoin:round" />
  <rect
     fill="#ebfcff"
     height="12.000003"
     ry="1.6000004"
     width="12.000002"
     x="2.4999988"
     y="2.5"
     id="rect2"
     style="stroke:#00aad4;stroke-width:0.999997;stroke-linejoin:round" />
  <g
     id="g3">
    <circle
       style="fill:#ebfcff;stroke:#00aad4;stroke-width:0.8;stroke-linecap:round;stroke-linejoin:round"
       id="path1"
       cx="14.261214"
       cy="2.6782033"
       r="1.6"
       transform="rotate(30)" />
    <path
       style="fill:#ebfcff;stroke:#00aad4;stroke-width:1;stroke-linecap:round;stroke-linejoin:round;stroke-dasharray:none"
       d="M 9.2794243,8.4500001 4.6894898,5.8"
       id="path2"
       sodipodi:nodetypes="cc" />
    <path
       style="fill:#ebfcff;stroke:#00aad4;stroke-width:1.8;stroke-linecap:butt;stroke-linejoin:round;stroke-dasharray:none"
       d="m 5.9711731,6.9838388 -0.75,1.2990381"
       id="path3"
       sodipodi:nodetypes="cc" />
  </g>
</svg>
