<svg width="16" height="16" version="1.0" xmlns="http://www.w3.org/2000/svg">
 <path d="m0.5 6.9v5.3l5 1.5v-5.3z" color="#000000" fill="#ff0000" stroke="#ffffff" stroke-linejoin="round" stroke-width=".25" style="paint-order:normal"/>
 <path d="m10.5 6.9-5 1.5-5-1.5 5-1.5z" color="#000000" fill="#ff4c4c" stroke="#ffffff" stroke-linejoin="round" stroke-width=".25" style="paint-order:normal"/>
 <path d="m5.5 8.4v5.3l5 1.5v-5.3z" color="#000000" fill="#00b800" stroke="#ffffff" stroke-linejoin="round" stroke-width=".25" style="paint-order:normal"/>
 <path d="m15.5 8.4v5.3l-5 1.5v-5.3z" color="#000000" fill="#00a300" stroke="#ffffff" stroke-linejoin="round" stroke-width=".25" style="paint-order:normal"/>
 <path d="m15.5 8.4-5 1.5-5-1.5 5-1.5z" color="#000000" fill="#00d400" stroke="#ffffff" stroke-linejoin="round" stroke-width=".25" style="paint-order:normal"/>
 <path d="m3 2.95v4.7l5 1.5v-4.7z" color="#000000" fill="#0066ff" stroke="#ffffff" stroke-linejoin="round" stroke-width=".25" style="paint-order:normal"/>
 <path d="m13 2.95v4.7l-5 1.5v-4.7z" color="#000000" fill="#0052cc" stroke="#ffffff" stroke-linejoin="round" stroke-width=".25" style="paint-order:normal"/>
 <path d="m13 2.95-5 1.5-5-1.5 5-1.5z" color="#000000" fill="#4c93ff" stroke="#ffffff" stroke-linejoin="round" stroke-width=".25" style="paint-order:normal"/>
</svg>
