<?xml version="1.0" encoding="UTF-8" standalone="no"?>
<svg
   width="48"
   height="48"
   version="1.1"
   viewBox="0 0 48 48"
   id="svg9"
   sodipodi:docname="tmultipropertylink_200.svg"
   inkscape:version="1.3.2 (091e20e, 2023-11-25, custom)"
   xmlns:inkscape="http://www.inkscape.org/namespaces/inkscape"
   xmlns:sodipodi="http://sodipodi.sourceforge.net/DTD/sodipodi-0.dtd"
   xmlns="http://www.w3.org/2000/svg"
   xmlns:svg="http://www.w3.org/2000/svg">
  <sodipodi:namedview
     id="namedview9"
     pagecolor="#ffffff"
     bordercolor="#000000"
     borderopacity="0.25"
     inkscape:showpageshadow="2"
     inkscape:pageopacity="0.0"
     inkscape:pagecheckerboard="0"
     inkscape:deskcolor="#d1d1d1"
     showgrid="true"
     inkscape:current-layer="svg9">
    <inkscape:grid
       id="grid9"
       units="px"
       originx="0"
       originy="0"
       spacingx="0.5"
       spacingy="0.5"
       empcolor="#0099e5"
       empopacity="0.30196078"
       color="#0099e5"
       opacity="0.14901961"
       empspacing="2"
       dotted="false"
       gridanglex="30"
       gridanglez="30"
       visible="true" />
  </sodipodi:namedview>
  <defs
     id="defs6">
    <radialGradient
       id="a"
       cx="5.3999925"
       cy="1034.7039"
       r="4"
       gradientTransform="matrix(2.4999876,-2.5000158,1.5000215,1.5000046,-1553.5779,-1526.5605)"
       gradientUnits="userSpaceOnUse">
      <stop
         stop-color="#198d19"
         offset="0"
         id="stop1" />
      <stop
         stop-color="#ffffff"
         offset="1"
         id="stop2" />
    </radialGradient>
    <radialGradient
       id="c"
       cx="5.3999925"
       cy="1034.7039"
       r="4"
       gradientTransform="matrix(2.4999876,-2.5000158,1.5000215,1.5000046,-1537.5779,-1526.5604)"
       gradientUnits="userSpaceOnUse">
      <stop
         stop-color="#1a75ff"
         offset="0"
         id="stop3" />
      <stop
         stop-color="#ffffff"
         offset="1"
         id="stop4" />
    </radialGradient>
    <radialGradient
       id="b"
       cx="5.3999925"
       cy="1034.7039"
       r="4"
       gradientTransform="matrix(2.4999876,-2.5000158,1.5000215,1.5000046,-1553.5779,-1510.5604)"
       gradientUnits="userSpaceOnUse">
      <stop
         stop-color="#ff1919"
         offset="0"
         id="stop5" />
      <stop
         stop-color="#ffffff"
         offset="1"
         id="stop6" />
    </radialGradient>
  </defs>
  <circle
     cx="10"
     cy="9.9999828"
     r="7"
     fill="url(#a)"
     fill-rule="evenodd"
     stroke="#198d19"
     stroke-linecap="square"
     stroke-width="2"
     style="fill:url(#a);stroke-linejoin:round;paint-order:normal"
     id="circle6" />
  <circle
     cx="26"
     cy="9.9999828"
     r="7"
     fill="url(#c)"
     fill-rule="evenodd"
     stroke="#1a75ff"
     stroke-linecap="square"
     stroke-width="2"
     style="fill:url(#c);stroke-linejoin:round;paint-order:normal"
     id="circle7" />
  <circle
     cx="10"
     cy="25.999983"
     r="7"
     fill="url(#b)"
     fill-rule="evenodd"
     stroke="#ff1a1a"
     stroke-linecap="square"
     stroke-width="2"
     style="fill:url(#b);stroke-linejoin:round;paint-order:normal"
     id="circle8" />
  <path
     d="M 21.100372,21.1004 26.757301,26.7573 31,22.5146 39.485395,31 35.242696,35.2428"
     fill="none"
     stroke="#2a7efe"
     stroke-linecap="round"
     stroke-width="3.60005"
     id="path8"
     style="stroke-linejoin:round" />
  <path
     d="M 45.142324,45.1423 39.485395,39.4855 35.242696,43.7281 26.757301,35.2428 31,31"
     fill="none"
     stroke="#ff1a1a"
     stroke-linecap="round"
     stroke-width="3.60005"
     id="path9"
     style="stroke-linejoin:round" />
</svg>
