<svg width="16" height="16" version="1.1" xmlns="http://www.w3.org/2000/svg">
 <rect x="1.25" y="1.25" width="13.5" height="13.5" rx="1.1" fill="#f0fcff" stroke="#00aad4" stroke-linejoin="round" stroke-width=".5"/>
 <path d="m1.45 1.45h13.1v2.05h-13.1z" fill="#00aad4"/>
 <path d="m4.499886 7 1.14e-4 1c0 0.5 1.290864 1 3.5 1 2.209137 0 3.500171-0.5 3.500114-1l-1.14e-4 -1c0 0.5-1.290863 1-3.5 1-2.209136 0-3.5-0.5-3.500114-1z" fill="#2a7fff" stroke-linecap="round" stroke-linejoin="round" stroke-miterlimit="5.6" stroke-width="1.33334"/>
 <ellipse cx="8" cy="6" rx="3.5" ry="1" fill="#2a7fff" stroke-linecap="round" stroke-width=".8"/>
 <path d="m4.499886 9 1.14e-4 1c0 0.5 1.290864 1 3.5 1 2.209137 0 3.500171-0.5 3.500114-1l-1.14e-4 -1c0 0.5-1.290863 1-3.5 1-2.209136 0-3.5-0.5-3.500114-1z" fill="#2a7fff" stroke-linecap="round" stroke-linejoin="round" stroke-miterlimit="5.6" stroke-width="1.33334"/>
 <path d="m4.499886 11 1.14e-4 1c0 0.5 1.290864 1 3.5 1 2.209137 0 3.500171-0.5 3.500114-1l-1.14e-4 -1c0 0.5-1.290863 1-3.5 1-2.209136 0-3.5-0.5-3.500114-1z" fill="#2a7fff" stroke-linecap="round" stroke-linejoin="round" stroke-miterlimit="5.6" stroke-width="1.33334"/>
</svg>
