<svg width="16" height="16" version="1.0" xmlns="http://www.w3.org/2000/svg">
 <defs>
  <linearGradient id="b" x1="11" x2="21" y1="25.75" y2="25.75" gradientTransform="matrix(.5 0 0 .5 .50000031 0)" gradientUnits="userSpaceOnUse">
   <stop stop-color="#999999" offset="0"/>
   <stop stop-color="#ffffff" offset=".4"/>
   <stop stop-color="#999999" offset="1"/>
  </linearGradient>
  <radialGradient id="a" cx="8.25" cy="3.675" r="4.5" gradientTransform="matrix(-1.111111,1.1111111,-1.111111,-1.111111,21.25,-1.0833338)" gradientUnits="userSpaceOnUse">
   <stop stop-color="#ffffff" offset="0"/>
   <stop stop-color="#ffffff" offset=".2"/>
   <stop stop-color="#ffcc00" offset="1"/>
  </radialGradient>
 </defs>
 <path d="m8.5 0.25c-2.3472083 2.2e-7 -4.25 1.9027921-4.25 4.25 0 1.4102166 0.2999809 1.9640068 0.8652344 2.9041485 1.1305114 1.880291 1.1347656 1.3457031 1.1347656 3.3457035h4.5c0-2.0000004 0.01794-1.4654149 1.148438-3.3457035 0.565249-0.9401441 0.851562-1.4939319 0.851562-2.9041485 0-2.3472079-1.902792-4.2499998-4.25-4.25z" fill="url(#a)" fill-rule="evenodd" stroke="#ffcc00" stroke-width=".5px"/>
 <path d="m7 14.75h3l-1 1.25h-1z" fill="#333333" fill-rule="evenodd" style="paint-order:normal"/>
 <path d="m6.25 10.75h4.5v3c0 0.552285-0.447715 1-1 1h-2.5c-0.5522847 0-1-0.447715-1-1z" fill="url(#b)" stroke="#999999" stroke-width=".5"/>
</svg>
