<?xml version="1.0" encoding="UTF-8" standalone="no"?>
<svg
   width="36"
   height="36"
   version="1.1"
   viewBox="0 0 36 36"
   id="svg8"
   sodipodi:docname="tfilelistbox_150.svg"
   inkscape:export-filename="tfilelistbox_150.png"
   inkscape:export-xdpi="96"
   inkscape:export-ydpi="96"
   inkscape:version="1.3.2 (091e20e, 2023-11-25, custom)"
   xmlns:inkscape="http://www.inkscape.org/namespaces/inkscape"
   xmlns:sodipodi="http://sodipodi.sourceforge.net/DTD/sodipodi-0.dtd"
   xmlns="http://www.w3.org/2000/svg"
   xmlns:svg="http://www.w3.org/2000/svg">
  <defs
     id="defs8" />
  <sodipodi:namedview
     id="namedview8"
     pagecolor="#ffffff"
     bordercolor="#000000"
     borderopacity="0.25"
     inkscape:showpageshadow="2"
     inkscape:pageopacity="0.0"
     inkscape:pagecheckerboard="0"
     inkscape:deskcolor="#d1d1d1"
     showgrid="true"
     inkscape:current-layer="svg8">
    <inkscape:grid
       id="grid8"
       units="px"
       originx="0"
       originy="0"
       spacingx="0.5"
       spacingy="0.5"
       empcolor="#0099e5"
       empopacity="0.30196078"
       color="#0099e5"
       opacity="0.14901961"
       empspacing="2"
       dotted="false"
       gridanglex="30"
       gridanglez="30"
       visible="true" />
  </sodipodi:namedview>
  <rect
     x="4.5"
     y="4.4999828"
     width="27"
     height="27"
     fill="#f9f9f9"
     stroke="#2a7efe"
     style="paint-order:normal"
     id="rect1" />
  <rect
     x="26.5"
     y="4.4999828"
     width="5"
     height="27"
     fill="#e6e6e6"
     stroke="#2a7efe"
     style="paint-order:normal"
     id="rect2" />
  <path
     d="m 29,8.5 v 9"
     fill="#e6e6e6"
     stroke="#2a7efe"
     stroke-linecap="round"
     stroke-linejoin="round"
     stroke-width="1.5"
     id="path2" />
  <path
     d="m 14.5,10.75 h 9"
     fill="#b3b3b3"
     stroke="#b3b3b3"
     stroke-width="2.5"
     id="path3" />
  <path
     d="m 14.5,19.75 h 9"
     fill="#b3b3b3"
     stroke="#b3b3b3"
     stroke-width="2.5"
     id="path4" />
  <path
     d="m 14.5,28.75 h 9"
     fill="#b3b3b3"
     stroke="#b3b3b3"
     stroke-width="2.5"
     id="path5" />
  <path
     d="m 7.5,7.5 h 3 l 2,2 v 5 h -5 z"
     fill="none"
     stroke="#666666"
     stroke-linejoin="round"
     id="path6"
     style="fill:#ffffff" />
  <path
     d="m 7.5,31 v -5.5 h 3 l 2,2 V 31"
     fill="none"
     stroke="#666666"
     stroke-linejoin="round"
     id="path7"
     style="fill:#ffffff" />
  <path
     d="m 7.5,16.5 h 3 l 2,2 v 5 h -5 z"
     fill="none"
     stroke="#666666"
     stroke-linejoin="round"
     id="path8"
     style="fill:#ffffff" />
</svg>
