<svg width="32" height="32" version="1.0" xmlns="http://www.w3.org/2000/svg">
 <rect x=".5" y="5.5" width="31" height="22" fill="#f9f9f9" stroke="#2a7efe" style="paint-order:normal"/>
 <path d="m6 10.5h3" fill="none" stroke="#000000" stroke-width="3"/>
 <path d="m6 16.5h3" fill="none" stroke="#000000" stroke-width="3"/>
 <path d="m6 22.5h3" fill="none" stroke="#000000" stroke-width="3"/>
 <path d="m14.5 22.5h3" fill="none" stroke="#000000" stroke-width="3"/>
 <path d="m23 22.5h3" fill="none" stroke="#000000" stroke-width="3"/>
 <path d="m23 16.5h3" fill="none" stroke="#000000" stroke-width="3"/>
 <path d="m23 10.5h3" fill="none" stroke="#000000" stroke-width="3"/>
 <path d="m14.5 10.5h3" fill="none" stroke="#000000" stroke-width="3"/>
 <path d="m8.75 11.75h14.5v9.5h-14.5z" fill="none" stroke="#b3b3b3" stroke-linecap="round" stroke-width="1.5"/>
</svg>
