<svg width="24" height="24" version="1.1" viewBox="0 0 24 24" xmlns="http://www.w3.org/2000/svg">
 <defs>
  <linearGradient id="a" x1="22.825163" x2="22.822721" y1="6.2446866" y2="15.028725" gradientTransform="matrix(1.3656766 .00037929207 .00037934511 1.3661144 -17.549158 .2103869)" gradientUnits="userSpaceOnUse">
   <stop stop-color="#89a02c" offset="0"/>
   <stop stop-color="#445016" offset="1"/>
  </linearGradient>
  <radialGradient id="c" cx="-9" cy="10.699678" r="5.9492188" gradientTransform="matrix(.75 0 0 .53578463 19.25 2.2672769)" gradientUnits="userSpaceOnUse">
   <stop stop-color="#803300" offset="0"/>
   <stop stop-color="#d45500" offset="1"/>
  </radialGradient>
  <linearGradient id="b" x1="-3" x2="-3" y1="28" y2="4" gradientTransform="matrix(.75 0 0 .75 14.75 .5)" gradientUnits="userSpaceOnUse">
   <stop stop-color="#668000" offset="0"/>
   <stop stop-color="#aad400" offset="1"/>
  </linearGradient>
 </defs>
 <path d="m14 5.375 1.875-3.75" fill="none" stroke="#d4aa00" stroke-linecap="round" stroke-linejoin="round" stroke-width="1.5"/>
 <path d="m11 5.375-1.875-3.75" fill="none" stroke="#d4aa00" stroke-linecap="round" stroke-linejoin="round" stroke-width="1.5"/>
 <path d="m5 5.75v2.25l2.25 2.25" fill="none" stroke="#aca793" stroke-linecap="round" stroke-linejoin="round" stroke-width="1.5"/>
 <path d="m5 20.75v-2.25l2.25-2.25" fill="none" stroke="#aca793" stroke-linecap="round" stroke-linejoin="round" stroke-width="1.5"/>
 <path d="m2.375 14.75 1.5-1.5 4.125-0.75" fill="none" stroke="#aca793" stroke-linecap="round" stroke-linejoin="round" stroke-width="1.5"/>
 <path d="m20 5.75v2.25l-2.25 2.25" fill="none" stroke="#aca793" stroke-linecap="round" stroke-linejoin="round" stroke-width="1.5"/>
 <path d="m20 20.75v-2.25l-2.25-2.25" fill="none" stroke="#aca793" stroke-linecap="round" stroke-linejoin="round" stroke-width="1.5"/>
 <path d="m22.625 14.75-1.875-1.5-3.75-0.75" fill="none" stroke="#aca793" stroke-linecap="round" stroke-linejoin="round" stroke-width="1.5"/>
 <ellipse cx="12.5" cy="12.5" rx="6.75" ry="9" fill="url(#b)" stroke-width=".75"/>
 <path d="M 16.961915,5.75 A 6.75,9 0 0 0 12.5,3.5 6.75,9 0 0 0 8.038087,5.7529296 L 12.5,9.875 16.958985,5.75 Z" fill="url(#c)" stroke-linecap="round" stroke-linejoin="round" stroke-width="1.80001"/>
 <path d="m12.5 9.5v11.25" fill="#c83737" stroke="url(#a)" stroke-linecap="round" stroke-linejoin="round" stroke-width="1.5"/>
</svg>
