<?xml version="1.0" encoding="UTF-8" standalone="no"?>
<svg
   height="32"
   width="32"
   version="1.1"
   id="svg299"
   sodipodi:docname="menu_toggle_bookmarks_200.svg"
   inkscape:export-filename="menu_toggle_bookmarks_200.png"
   inkscape:export-xdpi="96"
   inkscape:export-ydpi="96"
   inkscape:version="1.2.2 (732a01da63, 2022-12-09)"
   xmlns:inkscape="http://www.inkscape.org/namespaces/inkscape"
   xmlns:sodipodi="http://sodipodi.sourceforge.net/DTD/sodipodi-0.dtd"
   xmlns="http://www.w3.org/2000/svg"
   xmlns:svg="http://www.w3.org/2000/svg">
  <defs
     id="defs303" />
  <sodipodi:namedview
     id="namedview301"
     pagecolor="#ffffff"
     bordercolor="#666666"
     borderopacity="1.0"
     inkscape:showpageshadow="2"
     inkscape:pageopacity="0.0"
     inkscape:pagecheckerboard="0"
     inkscape:deskcolor="#d1d1d1"
     showgrid="true"
     inkscape:zoom="28.6875"
     inkscape:cx="14.779956"
     inkscape:cy="16"
     inkscape:current-layer="svg299">
    <inkscape:grid
       type="xygrid"
       id="grid526" />
  </sodipodi:namedview>
  <radialGradient
     id="a"
     cx="17"
     cy="17.5"
     gradientUnits="userSpaceOnUse"
     r="12">
    <stop
       offset="0"
       stop-color="#2a7fff"
       id="stop284" />
    <stop
       offset=".69999999"
       stop-color="#4d94ff"
       id="stop286" />
    <stop
       offset="1"
       stop-color="#96bdff"
       id="stop288" />
  </radialGradient>
  <circle
     cx="17"
     cy="17.5"
     fill="url(#a)"
     r="12"
     transform="translate(-1 -2.5)"
     id="circle291" />
  <g
     fill="none"
     stroke-linecap="round"
     stroke-width="2"
     id="g297">
    <path
       d="m7.5 1h-6.5v6.5"
       stroke="#00cc00"
       id="path293" />
    <path
       d="m24.5 29h6.5v-6.5"
       stroke="#f00"
       id="path295" />
  </g>
</svg>
