<?xml version="1.0" encoding="UTF-8" standalone="no"?>
<svg
   width="36"
   height="36"
   version="1.1"
   viewBox="0 0 36 36"
   id="svg23"
   sodipodi:docname="tsynmemo_150.svg"
   inkscape:version="1.3.2 (091e20e, 2023-11-25, custom)"
   xmlns:inkscape="http://www.inkscape.org/namespaces/inkscape"
   xmlns:sodipodi="http://sodipodi.sourceforge.net/DTD/sodipodi-0.dtd"
   xmlns="http://www.w3.org/2000/svg"
   xmlns:svg="http://www.w3.org/2000/svg">
  <sodipodi:namedview
     id="namedview23"
     pagecolor="#ffffff"
     bordercolor="#000000"
     borderopacity="0.25"
     inkscape:showpageshadow="2"
     inkscape:pageopacity="0.0"
     inkscape:pagecheckerboard="0"
     inkscape:deskcolor="#d1d1d1"
     showgrid="true"
     inkscape:current-layer="svg23">
    <inkscape:grid
       id="grid23"
       units="px"
       originx="0"
       originy="0"
       spacingx="0.5"
       spacingy="0.5"
       empcolor="#0099e5"
       empopacity="0.30196078"
       color="#0099e5"
       opacity="0.14901961"
       empspacing="2"
       dotted="false"
       gridanglex="30"
       gridanglez="30"
       visible="true" />
  </sodipodi:namedview>
  <defs
     id="defs10">
    <linearGradient
       id="c"
       x1="34"
       x2="37"
       y1="1029.3622"
       y2="1029.3622"
       gradientTransform="matrix(1.7500002,0,0,1.3918056,-36.669173,-1451.3274)"
       gradientUnits="userSpaceOnUse">
      <stop
         stop-color="#999999"
         offset="0"
         id="stop1" />
      <stop
         stop-color="#ffffff"
         offset=".49999997"
         id="stop2" />
      <stop
         stop-color="#999999"
         offset="1"
         id="stop3" />
    </linearGradient>
    <linearGradient
       id="b"
       x1="34"
       x2="37"
       y1="1027.3622"
       y2="1027.3622"
       gradientTransform="matrix(1.7500002,0,0,1.3918056,-36.669173,-1451.3274)"
       gradientUnits="userSpaceOnUse">
      <stop
         stop-color="#aa0000"
         offset="0"
         id="stop4" />
      <stop
         stop-color="#ff0000"
         offset=".51070523"
         id="stop5" />
      <stop
         stop-color="#aa0000"
         offset="1"
         id="stop6" />
    </linearGradient>
    <linearGradient
       id="a"
       x1="34"
       x2="37"
       y1="1033.8622"
       y2="1033.8622"
       gradientTransform="matrix(1.7500002,0,0,1.3918056,-36.669173,-1451.3274)"
       gradientUnits="userSpaceOnUse">
      <stop
         stop-color="#a05a2c"
         offset="0"
         id="stop7" />
      <stop
         stop-color="#ffff00"
         offset=".26457807"
         id="stop8" />
      <stop
         stop-color="#ffff00"
         offset=".75078517"
         id="stop9" />
      <stop
         stop-color="#a05a2c"
         offset="1"
         id="stop10" />
    </linearGradient>
  </defs>
  <rect
     x="2.4999981"
     y="2.4999826"
     width="30.000004"
     height="31.000017"
     fill="#ffffff"
     fill-rule="evenodd"
     stroke="#2a7efe"
     stroke-linecap="square"
     stroke-linejoin="round"
     style="paint-order:normal"
     id="rect10" />
  <rect
     x="3"
     y="2.9999826"
     width="4"
     height="30.000017"
     fill="#b3b3b3"
     fill-rule="evenodd"
     style="paint-order:normal"
     id="rect11" />
  <rect
     transform="rotate(45)"
     x="22.830843"
     y="-20.047268"
     width="5.2500005"
     height="2.7836354"
     fill="url(#c)"
     fill-rule="evenodd"
     style="paint-order:normal"
     id="rect12" />
  <rect
     transform="rotate(45)"
     x="22.830843"
     y="-22.830898"
     width="5.2500005"
     height="2.7836354"
     fill="url(#b)"
     fill-rule="evenodd"
     style="paint-order:normal"
     id="rect13" />
  <rect
     transform="rotate(45)"
     x="22.830843"
     y="-17.263638"
     width="5.2500005"
     height="9.7426634"
     fill="url(#a)"
     fill-rule="evenodd"
     style="paint-order:normal"
     id="rect14" />
  <path
     d="m21.461943 10.8258-1.143978 2.7916 2.063609 2.0636 2.79268-1.1429z"
     fill="#d38d5f"
     fill-rule="evenodd"
     id="path14" />
  <path
     d="M 20.317965,13.6174 22.381574,15.681 20,16.5 19.5,16 Z"
     fill="#333333"
     fill-rule="evenodd"
     id="path15" />
  <path
     d="m21 19.25h9"
     fill="none"
     stroke="#666666"
     stroke-width="1.5"
     id="path16" />
  <path
     d="m23 22.25h6"
     fill="none"
     stroke="#2a7fff"
     stroke-width="1.5"
     id="path17" />
  <path
     d="m23 25.25h6"
     fill="none"
     stroke="#666666"
     stroke-width="1.5"
     id="path18" />
  <path
     d="m21 28.25h9"
     fill="none"
     stroke="#d45500"
     stroke-width="1.5"
     id="path19" />
  <path
     d="m15.721262 19.026572c0.292941 0.308746 0.469117 0.732952 0.469117 1.475814 0 0.983129-0.889589 1.774602-1.994589 1.774602h-1.391581c-1.105003 0-1.994588-0.791475-1.994588-1.774602 0-0.983132 0.889585-1.774606 1.994588-1.774606h0.649405v3.549208"
     fill="none"
     stroke="#2c5aa0"
     stroke-linecap="round"
     stroke-linejoin="round"
     stroke-width="1.15556"
     id="path20" />
  <path
     d="m10.809621 6.8523865v-1.9e-6c0-0.983133 0.799937-1.7746046 1.793585-1.7746046h1.793586c0.993647 0 1.793587 0.7914716 1.793587 1.7746046v1.9e-6c0 0.9831303-0.79994 1.7745992-1.793587 1.7745992h-1.793586c-0.993648 0-1.793585-0.7914689-1.793585-1.7745992z"
     fill="none"
     stroke="#2c5aa0"
     stroke-linecap="round"
     stroke-linejoin="round"
     stroke-width="1.15556"
     id="path21" />
  <path
     d="m12.661775 27.500001c-1.035796 0-1.869665-0.676208-1.869665-1.516157s0.833869-1.423574 1.869665-1.423574h3.348014m-5.217679 5.879462h5.217679m-3.348014 0c-1.035796 0-1.869665-0.676203-1.869665-1.516153 0-0.839954 0.833869-1.423578 1.869665-1.423578h3.348014"
     fill="none"
     stroke="#2c5aa0"
     stroke-linecap="round"
     stroke-linejoin="round"
     stroke-width="1.12054"
     id="path22" />
  <path
     d="m12.661774 13.5c-1.035796 0-1.869665-0.676204-1.869665-1.516155 0-0.839948 0.833869-1.423575 1.869665-1.423575h3.348012m-5.217677 5.879463h5.217677m-3.348012 0c-1.035796 0-1.869665-0.676204-1.869665-1.516155 0-0.839952 0.833869-1.423578 1.869665-1.423578h3.348012"
     fill="none"
     stroke="#2c5aa0"
     stroke-linecap="round"
     stroke-linejoin="round"
     stroke-width="1.12054"
     id="path23" />
</svg>
