<svg width="48" height="48" version="1.1" xmlns="http://www.w3.org/2000/svg">
 <g transform="matrix(2.8126 0 0 2.8126 1.4997 1.4998)" stroke="#00aad4" stroke-linecap="round" stroke-linejoin="round">
  <g fill="none">
   <path d="m11.937 0.49996 3.5627 3.5625-2.1376 2.1375-3.5627-3.5625z"/>
   <path d="m9.7996 2.6374 3.5627 3.5625-7.1255 7.1249-3.5627-3.5625z"/>
   <path d="m2.6742 9.7624-1.6109 3.8009 1.3733 1.3733 3.8003-1.6117z"/>
  </g>
  <path d="m1.0633 13.563 1.3733 1.3733-1.2501 0.53018c-0.40331 0.1653-0.81839-0.24982-0.65311-0.65306z" fill="#00aad4" fill-rule="evenodd"/>
 </g>
</svg>
