<?xml version="1.0" encoding="UTF-8" standalone="no"?>
<svg
   height="32"
   width="32"
   version="1.1"
   id="svg904"
   sodipodi:docname="08 PackageType_200.svg"
   inkscape:export-filename="08 PackageType_200.png"
   inkscape:export-xdpi="96"
   inkscape:export-ydpi="96"
   inkscape:version="1.2.1 (9c6d41e410, 2022-07-14)"
   xmlns:inkscape="http://www.inkscape.org/namespaces/inkscape"
   xmlns:sodipodi="http://sodipodi.sourceforge.net/DTD/sodipodi-0.dtd"
   xmlns:xlink="http://www.w3.org/1999/xlink"
   xmlns="http://www.w3.org/2000/svg"
   xmlns:svg="http://www.w3.org/2000/svg">
  <defs
     id="defs908">
    <linearGradient
       id="linearGradient1347"
       x1="8.8369999"
       x2="15.576"
       y1="7.8053999"
       y2="10.838"
       gradientTransform="matrix(1.983,0,0,1.983,-0.35541,0.68892)"
       gradientUnits="userSpaceOnUse"
       xlink:href="#linearGradient933-3" />
    <linearGradient
       id="linearGradient933-3">
      <stop
         stop-color="#ffe991"
         offset="0"
         id="stop162" />
      <stop
         stop-color="#f5c400"
         offset="1"
         id="stop164" />
    </linearGradient>
    <linearGradient
       id="linearGradient1351"
       x1="8.8369999"
       x2="15.576"
       y1="7.8013"
       y2="10.834"
       gradientTransform="matrix(-1.983,0,0,1.983,33.356,0.69694)"
       gradientUnits="userSpaceOnUse"
       xlink:href="#linearGradient933-3" />
    <linearGradient
       id="linearGradient1355"
       x1="1.4239"
       x2="15.576"
       y1="4.4317002"
       y2="4.4317002"
       gradientTransform="matrix(-1.983,0,0,1.983,33.356,0.69694)"
       gradientUnits="userSpaceOnUse">
      <stop
         stop-color="#ffe478"
         offset="0"
         id="stop168" />
      <stop
         stop-color="#fff2c0"
         offset="1"
         id="stop170" />
    </linearGradient>
  </defs>
  <sodipodi:namedview
     id="namedview906"
     pagecolor="#ffffff"
     bordercolor="#666666"
     borderopacity="1.0"
     inkscape:showpageshadow="2"
     inkscape:pageopacity="0.0"
     inkscape:pagecheckerboard="0"
     inkscape:deskcolor="#d1d1d1"
     showgrid="true"
     inkscape:zoom="28.6875"
     inkscape:cx="16"
     inkscape:cy="16"
     inkscape:current-layer="svg904">
    <inkscape:grid
       type="xygrid"
       id="grid1407" />
  </sodipodi:namedview>
  <linearGradient
     id="a"
     gradientUnits="userSpaceOnUse"
     x1="11"
     x2="14"
     y1="9"
     y2="11.5">
    <stop
       offset="0"
       stop-color="#ffe991"
       id="stop861" />
    <stop
       offset="1"
       stop-color="#e6b800"
       id="stop863" />
  </linearGradient>
  <linearGradient
     id="b"
     gradientUnits="userSpaceOnUse"
     x1="4"
     x2="1"
     y1="7"
     y2="10">
    <stop
       offset="0"
       stop-color="#ffea91"
       id="stop866" />
    <stop
       offset="1"
       stop-color="#e6b900"
       id="stop868" />
  </linearGradient>
  <linearGradient
     id="c"
     gradientUnits="userSpaceOnUse"
     x1="4.5"
     x2="13.5"
     y1="3"
     y2="4.5">
    <stop
       offset="0"
       stop-color="#fff2c0"
       id="stop871" />
    <stop
       offset="1"
       stop-color="#ffe478"
       id="stop873" />
  </linearGradient>
  <g
     stroke-width="1.6"
     id="g193"
     transform="translate(0,-1.0030079)">
    <g
       stroke="#ccaa00"
       stroke-linejoin="round"
       id="g181">
      <path
         d="M 16.5,16.552 31.2,9.4846 v 12.695 l -14.7,8.0179 z"
         fill="url(#linearGradient1347)"
         id="path175"
         style="fill:url(#linearGradient1347)" />
      <path
         d="M 16.5,16.166 1.8,9.4844 v 12.695 l 14.7,8.0179 z"
         fill="url(#linearGradient1351)"
         id="path177"
         style="fill:url(#linearGradient1351)" />
      <path
         d="M 16.5,2.803 1.8,9.4846 16.5,16.1662 31.2,9.4846 Z"
         fill="url(#linearGradient1355)"
         id="path179"
         style="fill:url(#linearGradient1355)" />
    </g>
    <g
       fill="none"
       stroke="#5f8dd3"
       stroke-linecap="round"
       id="g191">
      <path
         d="m 9.6846,6.0101 15.115,6.6157"
         id="path183" />
      <path
         d="M 8.2,12.626 23.315,6.0103"
         id="path185" />
      <path
         d="M 8.2,12.626 V 25.588"
         id="path187" />
      <path
         d="M 24.8,12.626 V 25.588"
         id="path189" />
    </g>
  </g>
  <path
     d="m 16.000002,12 1e-5,5 h 1.272726 c 0.03638,-1.213122 0.307444,-1.963812 0.962462,-2.882844 0.982528,-0.11028 2.091064,-0.241632 3.492076,-0.260012 v 13.770194 c -0.582238,0.367614 -1.471948,0.616662 -2.54545,0.745326 V 30 h 7.636354 v -1.627336 c -1.14629,-0.14704 -1.908626,-0.396096 -2.54545,-0.745326 V 13.857144 c 1.219064,0.0184 2.360266,0.15706 3.542938,0.285712 0.527656,0.790368 0.784238,1.533738 0.911602,2.857144 h 1.272726 l -10e-6,-5 z"
     fill="#009600"
     id="path568"
     style="stroke:#ffffff;stroke-width:4;stroke-dasharray:none;paint-order:stroke fill markers"
     sodipodi:nodetypes="ccccccccccccccccc" />
</svg>
