<?xml version="1.0" encoding="UTF-8" standalone="no"?>
<svg
   height="24"
   width="24"
   version="1.1"
   id="svg302"
   sodipodi:docname="Font_05_24.svg"
   inkscape:export-filename="Font_05_24.png"
   inkscape:export-xdpi="96"
   inkscape:export-ydpi="96"
   inkscape:version="1.2 (dc2aedaf03, 2022-05-15)"
   xmlns:inkscape="http://www.inkscape.org/namespaces/inkscape"
   xmlns:sodipodi="http://sodipodi.sourceforge.net/DTD/sodipodi-0.dtd"
   xmlns="http://www.w3.org/2000/svg"
   xmlns:svg="http://www.w3.org/2000/svg">
  <defs
     id="defs306" />
  <sodipodi:namedview
     id="namedview304"
     pagecolor="#ffffff"
     bordercolor="#666666"
     borderopacity="1.0"
     inkscape:pageshadow="2"
     inkscape:pageopacity="0.0"
     inkscape:pagecheckerboard="0"
     inkscape:deskcolor="#d1d1d1"
     showgrid="true"
     inkscape:zoom="38.25"
     inkscape:cx="11.620915"
     inkscape:cy="12"
     inkscape:current-layer="svg302"
     inkscape:showpageshadow="2">
    <inkscape:grid
       type="xygrid"
       id="grid994" />
  </sodipodi:namedview>
  <path
     id="path2-6"
     style="fill:#00aad4;stroke:none;stroke-width:5.65526"
     d="M 8.8487038,1.1249016 1,22.875098 h 2.006854 l 2.1826368,-6.020563 c 0.06911,-0.197105 0.255661,-0.329683 0.465825,-0.331054 l 3.617982,-2e-6 0.512736,-1.848651 h -3.111175 c -0.342669,-0.0013 -0.58108,-0.338712 -0.465828,-0.659186 l 3.325226,-9.2901219 c 0.06912,-0.1971078 0.255665,-0.3296865 0.4658272,-0.3310578 0.210163,0.00137 0.396712,0.1339512 0.465822,0.3310578 L 12.634758,10.725459 14.305,9.8653634 11.151459,1.1249016 Z"
     sodipodi:nodetypes="cccccccccccccccc" />
  <g
     id="g1474"
     transform="matrix(1.5,0,0,1.5,0,-1.5)"
     style="fill:none;stroke:#00aad4">
    <circle
       style="fill:none;stroke-width:1;stroke-linecap:round;stroke-linejoin:round;stroke-dasharray:none;stroke-dashoffset:1.49998"
       id="path346"
       cx="11.5"
       cy="12.5"
       r="4" />
    <g
       id="g530"
       transform="translate(0,-0.16666667)">
      <path
         style="fill:none;stroke:#00aad4;stroke-width:1px;stroke-linecap:round;stroke-linejoin:miter;stroke-opacity:1"
         d="m 10,11 3,3"
         id="path1469"
         sodipodi:nodetypes="cc" />
      <path
         style="fill:none;stroke:#00aad4;stroke-width:1px;stroke-linecap:round;stroke-linejoin:miter;stroke-opacity:1"
         d="m 13,11 -3,3"
         id="path522"
         sodipodi:nodetypes="cc" />
    </g>
  </g>
</svg>
