<?xml version="1.0" encoding="UTF-8" standalone="no"?>
<svg
   width="24"
   height="24"
   version="1.1"
   viewBox="0 0 24 24"
   id="svg9"
   sodipodi:docname="topendialog.svg"
   inkscape:export-filename="topendialog.png"
   inkscape:export-xdpi="96"
   inkscape:export-ydpi="96"
   inkscape:version="1.3.2 (091e20e, 2023-11-25, custom)"
   xmlns:inkscape="http://www.inkscape.org/namespaces/inkscape"
   xmlns:sodipodi="http://sodipodi.sourceforge.net/DTD/sodipodi-0.dtd"
   xmlns="http://www.w3.org/2000/svg"
   xmlns:svg="http://www.w3.org/2000/svg">
  <sodipodi:namedview
     id="namedview9"
     pagecolor="#ffffff"
     bordercolor="#000000"
     borderopacity="0.25"
     inkscape:showpageshadow="2"
     inkscape:pageopacity="0.0"
     inkscape:pagecheckerboard="0"
     inkscape:deskcolor="#d1d1d1"
     showgrid="true"
     inkscape:current-layer="svg9">
    <inkscape:grid
       id="grid9"
       units="px"
       originx="0"
       originy="0"
       spacingx="0.5"
       spacingy="0.5"
       empcolor="#0099e5"
       empopacity="0.30196078"
       color="#0099e5"
       opacity="0.14901961"
       empspacing="2"
       dotted="false"
       gridanglex="30"
       gridanglez="30"
       visible="true" />
  </sodipodi:namedview>
  <defs
     id="defs4">
    <linearGradient
       id="b"
       x1="-28.500042"
       x2="-21.000042"
       y1="1030.8622"
       y2="1034.3622"
       gradientTransform="translate(33.000042,-1043.3622)"
       gradientUnits="userSpaceOnUse">
      <stop
         stop-color="#fdbd17"
         offset="0"
         id="stop1" />
      <stop
         stop-color="#e3a726"
         offset="1"
         id="stop2" />
    </linearGradient>
    <linearGradient
       id="a"
       x1="-27.785778"
       x2="-9.214345"
       y1="1036.5765"
       y2="1045.1479"
       gradientTransform="matrix(0.6999998,0,0,0.7,23.95004,-734.10354)"
       gradientUnits="userSpaceOnUse">
      <stop
         stop-color="#ffe496"
         offset="0"
         id="stop3" />
      <stop
         stop-color="#ffcc40"
         offset="1"
         id="stop4" />
    </linearGradient>
    <linearGradient
       id="b-7"
       x1="-28.000021"
       x2="-16.000021"
       y1="1031.3622"
       y2="1033.3622"
       gradientTransform="translate(33.000042,-1021.3622)"
       gradientUnits="userSpaceOnUse">
      <stop
         stop-color="#fdbd17"
         offset="0"
         id="stop3-8" />
      <stop
         stop-color="#e3a726"
         offset="1"
         id="stop4-6" />
    </linearGradient>
    <linearGradient
       id="a-1"
       x1="-27.388893"
       x2="-9.6111107"
       y1="1036.8622"
       y2="1044.8622"
       gradientTransform="matrix(0.6749998,0,0,0.75000003,23.487519,-764.64667)"
       gradientUnits="userSpaceOnUse">
      <stop
         stop-color="#ffe496"
         offset="0"
         id="stop1-9" />
      <stop
         stop-color="#ffcc40"
         offset="1"
         id="stop2-1" />
    </linearGradient>
  </defs>
  <rect
     x="1.25"
     y="4.25"
     width="21.5"
     height="18.5"
     fill="#f9f9f9"
     stroke="#2a7efe"
     stroke-width="0.5"
     style="paint-order:normal"
     id="rect1" />
  <path
     d="m 2.5,1 h 19 C 22.35,1 23,1.6 23,2.5 V 4 H 1 V 2.5 C 1,1.6 1.6,1 2.5,1 Z"
     fill="#2a7efe"
     id="path1" />
  <path
     d="M 4.000093,16 4,10.0002 C 3.999977,9.4479 4.447715,9.0001 5.000042,9.0001 l 4,-10e-5 c 0.552299,0 1.000039,0.4477 1.000066,1 l 3.3e-5,0.4999 6.999901,10e-5 a 1.0000125,1.0000125 0 0 1 1,1 V 16 Z"
     fill="url(#b)"
     id="path5-9"
     style="fill:url(#b-7)" />
  <path
     d="m 12.5,7.5 h 7 v 10 h -7 z"
     fill="#ffffff"
     fill-rule="evenodd"
     stroke="#b3b3b3"
     stroke-width="1px"
     id="path2" />
  <path
     d="M 17.107163,12.25 H 4.892878 a 0.64285714,0.68181822 0 0 0 -0.642857,0.681857 v 6.136286 A 0.64285714,0.68181822 0 0 0 4.892878,19.75 h 12.214285 a 0.64285714,0.68181822 0 0 0 0.642858,-0.681857 V 12.931857 A 0.64285714,0.68181822 0 0 0 17.107163,12.25 Z"
     fill="url(#a)"
     stroke-width="0.651339"
     id="path6-4"
     style="fill:url(#a-1);stroke:#edb020;stroke-width:0.5;stroke-dasharray:none;stroke-opacity:1" />
  <path
     d="m 14,10 h 4"
     fill="none"
     stroke="#b3b3b3"
     stroke-width="1px"
     id="path3" />
</svg>
