<?xml version="1.0" encoding="UTF-8" standalone="no"?>
<svg
   height="16"
   width="16"
   version="1.1"
   id="svg201"
   sodipodi:docname="menu_project_new.svg"
   inkscape:export-filename="menu_project_new.png"
   inkscape:export-xdpi="96"
   inkscape:export-ydpi="96"
   inkscape:version="1.2.2 (732a01da63, 2022-12-09)"
   xmlns:inkscape="http://www.inkscape.org/namespaces/inkscape"
   xmlns:sodipodi="http://sodipodi.sourceforge.net/DTD/sodipodi-0.dtd"
   xmlns="http://www.w3.org/2000/svg"
   xmlns:svg="http://www.w3.org/2000/svg">
  <defs
     id="defs205" />
  <sodipodi:namedview
     id="namedview203"
     pagecolor="#ffffff"
     bordercolor="#666666"
     borderopacity="1.0"
     inkscape:showpageshadow="2"
     inkscape:pageopacity="0.0"
     inkscape:pagecheckerboard="0"
     inkscape:deskcolor="#d1d1d1"
     showgrid="true"
     inkscape:zoom="57.375"
     inkscape:cx="7.9912854"
     inkscape:cy="8"
     inkscape:current-layer="svg201">
    <inkscape:grid
       type="xygrid"
       id="grid507" />
  </sodipodi:namedview>
  <radialGradient
     id="a"
     cx="7.388889"
     cy="3.048611"
     gradientTransform="matrix(-.00000006 .97959197 -.9795918 -.00000006 12.129253 -1.095239)"
     gradientUnits="userSpaceOnUse"
     r="3.5">
    <stop
       offset="0"
       stop-color="#ff8080"
       id="stop166" />
    <stop
       offset="1"
       stop-color="#e50000"
       id="stop168" />
  </radialGradient>
  <radialGradient
     id="b"
     cx="3"
     cy="10"
     gradientTransform="matrix(0 .9795918 -.9795918 0 15.938775 8.204081)"
     gradientUnits="userSpaceOnUse"
     r="3.5">
    <stop
       offset="0"
       stop-color="#80b2ff"
       id="stop171" />
    <stop
       offset="1"
       stop-color="#2672e5"
       id="stop173" />
  </radialGradient>
  <radialGradient
     id="c"
     cx="10.5"
     cy="9.5"
     gradientTransform="matrix(-.0000001 .9795918 -.9795918 -.00000011 21.448981 .857143)"
     gradientUnits="userSpaceOnUse"
     r="3.5">
    <stop
       offset="0"
       stop-color="#ffe680"
       id="stop176" />
    <stop
       offset="1"
       stop-color="#e5b800"
       id="stop178" />
  </radialGradient>
  <g
     stroke-width=".857143"
     transform="translate(0 -1)"
     id="g187">
    <circle
       cx="10"
       cy="7"
       fill="url(#a)"
       r="3"
       id="circle181" />
    <circle
       cx="13"
       cy="12"
       fill="url(#c)"
       r="3"
       id="circle183" />
    <circle
       cx="7"
       cy="12"
       fill="url(#b)"
       r="3"
       id="circle185" />
  </g>
  <g
     fill="none"
     stroke="#e4b600"
     stroke-linecap="round"
     stroke-width=".8"
     id="g197">
    <path
       d="m3.3996471.39999999.0002267 6.20000001"
       id="path189" />
    <path
       d="m1.337386 1.3373859 4.124976 4.124976"
       id="path191" />
    <path
       d="m6.6 3.3998738h-6.19999993"
       id="path193" />
    <path
       d="m5.462362 1.3373859-4.124976 4.124976"
       id="path195" />
  </g>
  <circle
     cx="3.4"
     cy="3.4"
     fill="#fff"
     r=".85"
     stroke="#ffe680"
     stroke-linejoin="round"
     stroke-miterlimit="5.6"
     stroke-width=".5"
     id="circle199" />
</svg>
