<?xml version="1.0" encoding="UTF-8" standalone="no"?>
<svg
   width="16"
   height="16"
   version="1.1"
   viewBox="0 0 16 16"
   id="svg8"
   sodipodi:docname="Circle_01_16.svg"
   inkscape:version="1.3.2 (091e20e, 2023-11-25, custom)"
   xmlns:inkscape="http://www.inkscape.org/namespaces/inkscape"
   xmlns:sodipodi="http://sodipodi.sourceforge.net/DTD/sodipodi-0.dtd"
   xmlns="http://www.w3.org/2000/svg"
   xmlns:svg="http://www.w3.org/2000/svg">
  <defs
     id="defs8" />
  <sodipodi:namedview
     id="namedview8"
     pagecolor="#ffffff"
     bordercolor="#000000"
     borderopacity="0.25"
     inkscape:showpageshadow="2"
     inkscape:pageopacity="0.0"
     inkscape:pagecheckerboard="0"
     inkscape:deskcolor="#d1d1d1"
     showgrid="true"
     inkscape:current-layer="svg8">
    <inkscape:grid
       id="grid8"
       units="px"
       originx="0"
       originy="0"
       spacingx="0.5"
       spacingy="0.5"
       empcolor="#0099e5"
       empopacity="0.30196078"
       color="#0099e5"
       opacity="0.14901961"
       empspacing="2"
       dotted="false"
       gridanglex="30"
       gridanglez="30"
       visible="true" />
  </sodipodi:namedview>
  <circle
     cx="8"
     cy="3"
     r="1.3"
     fill="#2a7efe"
     stroke-width="0"
     id="circle1" />
  <circle
     cx="4.4644661"
     cy="4.4644661"
     r="1.3"
     fill="#2a7efe"
     stroke-width="0"
     id="circle2" />
  <circle
     cx="11.535534"
     cy="11.535534"
     r="1.3"
     fill="#2a7efe"
     stroke-width="0"
     id="circle3" />
  <circle
     cx="8"
     cy="13"
     r="1.3"
     fill="#2a7efe"
     stroke-width="0"
     id="circle4" />
  <circle
     cx="4.4644661"
     cy="11.535534"
     r="1.3"
     fill="#2a7efe"
     stroke-width="0"
     id="circle5" />
  <circle
     cx="13"
     cy="8"
     r="1.3"
     fill="#2a7efe"
     stroke-width="0"
     id="circle6" />
  <circle
     cx="3"
     cy="8"
     r="1.3"
     fill="#2a7efe"
     stroke-width="0"
     id="circle7" />
  <circle
     cx="11.535534"
     cy="4.4644661"
     r="1.3"
     fill="#2a7efe"
     stroke-width="0"
     id="circle8" />
</svg>
