<svg width="48" height="48" version="1.1" xmlns="http://www.w3.org/2000/svg">
 <defs>
  <radialGradient id="a" cx="12.1" cy="10.900001" r="4.5" gradientTransform="matrix(0,3.0437711,-3.0437707,5e-8,64.56801,-5.4387241)" gradientUnits="userSpaceOnUse">
   <stop stop-color="#ff7f2a" offset="0"/>
   <stop stop-color="#d45500" offset="1"/>
  </radialGradient>
 </defs>
 <g stroke="#ffffff" stroke-linecap="round">
  <circle transform="matrix(0,1,1,0,0,0)" cx="35.5" cy="35.5" r="11.3" fill="url(#a)" stroke-dashoffset="1.49998" stroke-linejoin="round" stroke-width="2.4"/>
  <path d="m30.249778 36.124872 5.249653 5.249872 5.250092-5.249872" fill="none" stroke-linejoin="round" stroke-width="2.99991"/>
  <path d="m35.499461 41.374744v-11.999712" fill="none" stroke-width="2.99991px"/>
 </g>
</svg>
