<svg width="48" height="48" version="1.1" viewBox="0 0 48 48" xmlns="http://www.w3.org/2000/svg">
 <defs>
  <radialGradient id="a" cx="8.5594378" cy="9.4092607" r="5.4997382" gradientTransform="matrix(.75261271 2.8768288 -2.6949166 .78111158 47.776055 -4.0622295)" gradientUnits="userSpaceOnUse">
   <stop stop-color="#faa" offset="0"/>
   <stop stop-color="#f00" offset="1"/>
  </radialGradient>
 </defs>
 <path d="m33.001041 23.800929c8.29824-13.132467 26.374947 4.140011-0.0019 22.999093-26.376822-18.85911-8.294913-36.13156 0.0019-22.999093z" fill="url(#a)" stroke="#ffffff" stroke-linejoin="round" stroke-width="2.40001"/>
</svg>
