<?xml version="1.0" encoding="UTF-8" standalone="no"?>
<svg
   height="48"
   viewBox="0 0 48 48"
   width="48"
   version="1.1"
   id="svg4"
   sodipodi:docname="Cube_05_48.svg"
   inkscape:export-filename="Cube_05_48.png"
   inkscape:export-xdpi="96"
   inkscape:export-ydpi="96"
   inkscape:version="1.3-beta (cedbd6c6ff, 2023-05-28)"
   xmlns:inkscape="http://www.inkscape.org/namespaces/inkscape"
   xmlns:sodipodi="http://sodipodi.sourceforge.net/DTD/sodipodi-0.dtd"
   xmlns="http://www.w3.org/2000/svg"
   xmlns:svg="http://www.w3.org/2000/svg">
  <defs
     id="defs4" />
  <sodipodi:namedview
     id="namedview4"
     pagecolor="#ffffff"
     bordercolor="#000000"
     borderopacity="0.25"
     inkscape:showpageshadow="2"
     inkscape:pageopacity="0.0"
     inkscape:pagecheckerboard="0"
     inkscape:deskcolor="#d1d1d1"
     showgrid="true"
     inkscape:current-layer="g4">
    <inkscape:grid
       id="grid4"
       units="px"
       originx="0"
       originy="0"
       spacingx="0.5"
       spacingy="0.5"
       empcolor="#0099e5"
       empopacity="0.30196078"
       color="#0099e5"
       opacity="0.14901961"
       empspacing="2"
       dotted="false"
       gridanglex="30"
       gridanglez="30"
       visible="true" />
  </sodipodi:namedview>
  <g
     stroke-linecap="round"
     stroke-linejoin="round"
     stroke-width="4.11439"
     id="g4">
    <path
       d="m-42.941349 5.142983h18.000456v18.000456h-18.000456z"
       fill="#0c0"
       transform="matrix(-.70710678 -.70710678 .70710678 -.70710678 0 0)"
       id="path3" />
    <path
       d="m4 7.999086h18.000456v18.000456h-18.000456z"
       fill="#f00"
       id="path1" />
    <path
       d="m22.000456 25.99954h18.000456v18.000456h-18.000456z"
       fill="#06f"
       id="path2" />
    <path
       d="m-44 4h18.000456v18.000456h-18.000456z"
       fill="#fc0"
       transform="rotate(-90)"
       id="path4" />
  </g>
</svg>
