<?xml version="1.0" encoding="UTF-8" standalone="no"?>
<svg
   width="36"
   height="36"
   version="1.1"
   viewBox="0 0 36 36"
   id="svg12"
   sodipodi:docname="tpopupnotifier_150.svg"
   inkscape:export-filename="tpopupnotifier_150.png"
   inkscape:export-xdpi="96"
   inkscape:export-ydpi="96"
   inkscape:version="1.3.2 (091e20e, 2023-11-25, custom)"
   xmlns:inkscape="http://www.inkscape.org/namespaces/inkscape"
   xmlns:sodipodi="http://sodipodi.sourceforge.net/DTD/sodipodi-0.dtd"
   xmlns="http://www.w3.org/2000/svg"
   xmlns:svg="http://www.w3.org/2000/svg">
  <sodipodi:namedview
     id="namedview12"
     pagecolor="#ffffff"
     bordercolor="#000000"
     borderopacity="0.25"
     inkscape:showpageshadow="2"
     inkscape:pageopacity="0.0"
     inkscape:pagecheckerboard="0"
     inkscape:deskcolor="#d1d1d1"
     showgrid="true"
     inkscape:current-layer="svg12">
    <inkscape:grid
       id="grid12"
       units="px"
       originx="0"
       originy="0"
       spacingx="0.5"
       spacingy="0.5"
       empcolor="#0099e5"
       empopacity="0.30196078"
       color="#0099e5"
       opacity="0.14901961"
       empspacing="2"
       dotted="false"
       gridanglex="30"
       gridanglez="30"
       visible="true" />
  </sodipodi:namedview>
  <defs
     id="defs5">
    <radialGradient
       id="a"
       cx="16"
       cy="10"
       r="2.5999999"
       gradientTransform="matrix(0.75000002,0,0,0.74999798,3.250001,5.5002)"
       gradientUnits="userSpaceOnUse">
      <stop
         stop-color="#ffffff"
         offset="0"
         id="stop1" />
      <stop
         stop-color="#ffe680"
         offset=".57692301"
         id="stop2" />
      <stop
         stop-color="#ffcc00"
         offset="1"
         id="stop3" />
    </radialGradient>
    <linearGradient
       id="b"
       x1="7.9999995"
       x2="7.9999995"
       y1="1.4999998"
       y2="11.238683"
       gradientTransform="matrix(1.0000001,0,0,0.69230583,3.500001,8.9616)"
       gradientUnits="userSpaceOnUse">
      <stop
         stop-color="#80b4fe"
         offset="0"
         id="stop4" />
      <stop
         stop-color="#e7f6fe"
         offset="1"
         id="stop5" />
    </linearGradient>
  </defs>
  <rect
     x="0.5"
     y="6.4999828"
     width="35"
     height="23"
     fill="#ffffae"
     stroke="#2a7efe"
     stroke-linecap="round"
     stroke-linejoin="round"
     style="paint-order:normal"
     id="rect5" />
  <path
     d="m 32.5,9.5 -4,4"
     fill="none"
     stroke="#808080"
     stroke-linecap="round"
     id="path5" />
  <path
     d="m 28.5,9.5 4,4"
     fill="none"
     stroke="#808080"
     stroke-linecap="round"
     id="path6" />
  <path
     d="M 4,25.25 H 16.000001"
     fill="none"
     stroke="#b3b3b3"
     stroke-width="1.5px"
     id="path7" />
  <path
     d="m 11.500001,22.25 h 9.000001"
     fill="none"
     stroke="#b3b3b3"
     stroke-width="1.5px"
     id="path8" />
  <path
     d="m 19.000002,25.25 h 10.5"
     fill="none"
     stroke="#b3b3b3"
     stroke-width="1.49999px"
     id="path9" />
  <path
     d="M 4,22.25 H 8.500001"
     fill="none"
     stroke="#b3b3b3"
     stroke-width="1.5px"
     id="path10" />
  <path
     d="m 23.500002,22.25 h 6"
     fill="none"
     stroke="#b3b3b3"
     stroke-width="1.49999px"
     id="path11" />
  <rect
     x="4"
     y="9.9999828"
     width="15.000001"
     height="8.9999752"
     fill="url(#b)"
     stroke-width="1.5"
     id="rect11"
     style="fill:url(#b)" />
  <path
     d="m 4,19.0001 3.512159,-3.7498 c 1.023674,-1.0931 2.741591,-0.9462 3.781448,0 l 2.884965,2.6247 1.887545,-1.1249 c 0.575238,-0.3429 0.959118,-0.2997 1.522846,0 l 1.411039,0.75 v 1.5 z"
     fill="#01a901"
     stroke-width="1.5"
     id="path12" />
  <ellipse
     cx="15.250002"
     cy="12.999983"
     rx="1.8750001"
     ry="1.8749948"
     fill="url(#a)"
     stroke-width="1.5"
     id="ellipse12"
     style="fill:url(#a)" />
</svg>
