<?xml version="1.0" encoding="UTF-8" standalone="no"?>
<svg
   height="64"
   width="64"
   version="1.1"
   id="svg574"
   sodipodi:docname="Error_01_64.svg"
   inkscape:export-filename="Error_01_64.png"
   inkscape:export-xdpi="96"
   inkscape:export-ydpi="96"
   inkscape:version="1.2-beta (1b65182ce9, 2022-04-05)"
   xmlns:inkscape="http://www.inkscape.org/namespaces/inkscape"
   xmlns:sodipodi="http://sodipodi.sourceforge.net/DTD/sodipodi-0.dtd"
   xmlns="http://www.w3.org/2000/svg"
   xmlns:svg="http://www.w3.org/2000/svg">
  <defs
     id="defs578" />
  <sodipodi:namedview
     id="namedview576"
     pagecolor="#ffffff"
     bordercolor="#666666"
     borderopacity="1.0"
     inkscape:pageshadow="2"
     inkscape:pageopacity="0.0"
     inkscape:pagecheckerboard="0"
     inkscape:deskcolor="#d1d1d1"
     showgrid="true"
     inkscape:zoom="14.34375"
     inkscape:cx="32"
     inkscape:cy="32"
     inkscape:current-layer="svg574">
    <inkscape:grid
       type="xygrid"
       id="grid2898" />
  </sodipodi:namedview>
  <g
     fill-rule="evenodd"
     id="g572"
     transform="scale(2)">
    <circle
       cx="16"
       cy="16"
       r="14"
       style="fill:#e60014;stroke:#ab0000;stroke-width:2;stroke-linecap:round;stroke-linejoin:round;stroke-opacity:0.980392"
       id="circle568" />
    <path
       d="m 5.5,13.5 v 5 h 21 v -5 z"
       fill="#ffffff"
       id="path570" />
  </g>
</svg>
