<?xml version="1.0" encoding="UTF-8" standalone="no"?>
<svg
   height="36"
   viewBox="0 0 9.5249997 9.5250005"
   width="36"
   version="1.1"
   id="svg500"
   sodipodi:docname="Remove_05_36.svg"
   inkscape:version="1.2 (dc2aedaf03, 2022-05-15)"
   inkscape:export-filename="Remove_05_36.png"
   inkscape:export-xdpi="96"
   inkscape:export-ydpi="96"
   xmlns:inkscape="http://www.inkscape.org/namespaces/inkscape"
   xmlns:sodipodi="http://sodipodi.sourceforge.net/DTD/sodipodi-0.dtd"
   xmlns="http://www.w3.org/2000/svg"
   xmlns:svg="http://www.w3.org/2000/svg">
  <defs
     id="defs504">
    <radialGradient
       id="a"
       cx="12.1"
       cy="10.900001"
       gradientTransform="matrix(0,0.49887766,-0.49887761,0,6.8809484,-4.5932378)"
       gradientUnits="userSpaceOnUse"
       r="4.5">
      <stop
         offset="0"
         stop-color="#f55"
         id="stop788" />
      <stop
         offset="1"
         stop-color="#a00"
         id="stop790" />
    </radialGradient>
    <radialGradient
       id="a-7"
       cx="12.1"
       cy="10.900001"
       gradientTransform="matrix(0,0.49887766,-0.49887761,0,6.8809484,-4.5932378)"
       gradientUnits="userSpaceOnUse"
       r="4.5">
      <stop
         offset="0"
         stop-color="#f55"
         id="stop788-8" />
      <stop
         offset="1"
         stop-color="#a00"
         id="stop790-6" />
    </radialGradient>
  </defs>
  <sodipodi:namedview
     id="namedview502"
     pagecolor="#ffffff"
     bordercolor="#666666"
     borderopacity="1.0"
     inkscape:showpageshadow="2"
     inkscape:pageopacity="0.0"
     inkscape:pagecheckerboard="0"
     inkscape:deskcolor="#d1d1d1"
     showgrid="true"
     inkscape:zoom="25.5"
     inkscape:cx="16.627451"
     inkscape:cy="18"
     inkscape:current-layer="svg500">
    <inkscape:grid
       type="xygrid"
       id="grid1268" />
  </sodipodi:namedview>
  <g
     id="g2754"
     transform="scale(2.2499997)">
    <circle
       cx="2.1166668"
       cy="2.116667"
       style="fill:url(#a-7);stroke:#ffd5d5;stroke-width:0.264584;stroke-linecap:round;stroke-linejoin:round;stroke-dasharray:none;stroke-dashoffset:1.49998"
       transform="matrix(0,1,1,0,0,0)"
       id="ellipse793"
       r="1.8520833" />
    <path
       d="M 2.778125,2.1166667 H 1.4552083"
       id="path3550"
       style="fill:none;stroke:#ffffff;stroke-width:0.529167;stroke-linecap:round;stroke-dasharray:none"
       sodipodi:nodetypes="cc" />
  </g>
</svg>
