<svg width="16" height="16" version="1.1" xmlns="http://www.w3.org/2000/svg">
 <g fill-rule="evenodd" stroke="#ffffff">
  <path d="m6.5 15.5h6v-2h3v-2h-5v2h-2v-2h-2z" fill="#ff7f00"/>
  <path d="m10.5 9.5h-6v2h-3v2h5v-2h2v2h2z" fill="#00d455"/>
 </g>
</svg>
