<?xml version="1.0" encoding="UTF-8" standalone="no"?>
<svg
   height="48"
   viewBox="0 0 12.7 12.700001"
   width="48"
   version="1.1"
   id="svg145"
   sodipodi:docname="Health_01_48.svg"
   inkscape:export-filename="Health_01_48.png"
   inkscape:export-xdpi="96"
   inkscape:export-ydpi="96"
   inkscape:version="1.2.1 (9c6d41e410, 2022-07-14)"
   xmlns:inkscape="http://www.inkscape.org/namespaces/inkscape"
   xmlns:sodipodi="http://sodipodi.sourceforge.net/DTD/sodipodi-0.dtd"
   xmlns="http://www.w3.org/2000/svg"
   xmlns:svg="http://www.w3.org/2000/svg">
  <defs
     id="defs149" />
  <sodipodi:namedview
     id="namedview147"
     pagecolor="#ffffff"
     bordercolor="#666666"
     borderopacity="1.0"
     inkscape:showpageshadow="2"
     inkscape:pageopacity="0.0"
     inkscape:pagecheckerboard="0"
     inkscape:deskcolor="#d1d1d1"
     showgrid="true"
     inkscape:zoom="19.125"
     inkscape:cx="23.973856"
     inkscape:cy="24"
     inkscape:current-layer="svg145">
    <inkscape:grid
       type="xygrid"
       id="grid932" />
  </sodipodi:namedview>
  <radialGradient
     id="a"
     cx="1.925345"
     cy="1.585938"
     gradientTransform="matrix(.79826018 3.3713267 -4.7312813 1.1327567 10.648129 -3.165681)"
     gradientUnits="userSpaceOnUse"
     r="1.852075">
    <stop
       offset="0"
       stop-color="#faa"
       id="stop138" />
    <stop
       offset="1"
       stop-color="#f00"
       id="stop140" />
  </radialGradient>
  <path
     d="m3.5919201.92594876c-2.93670496.0072632-5.0829866 5.39831064 2.7579168 10.81956824 10.3467581-7.1538243 3.3018415-14.2536553 0-9.0016559-.7996648-1.2719686-1.819382-1.82023434-2.7579168-1.81791234z"
     fill="url(#a)"
     stroke="#d40000"
     stroke-width=".264583"
     id="path143" />
</svg>
