<?xml version="1.0" encoding="UTF-8" standalone="no"?>
<svg
   height="32"
   viewBox="0 0 8.4667 8.4667"
   width="32"
   version="1.1"
   id="svg6"
   sodipodi:docname="dddatadict_200.svg"
   inkscape:export-filename="dddatadict_200.png"
   inkscape:export-xdpi="96"
   inkscape:export-ydpi="96"
   inkscape:version="1.3-beta (cedbd6c6ff, 2023-05-28)"
   xmlns:inkscape="http://www.inkscape.org/namespaces/inkscape"
   xmlns:sodipodi="http://sodipodi.sourceforge.net/DTD/sodipodi-0.dtd"
   xmlns="http://www.w3.org/2000/svg"
   xmlns:svg="http://www.w3.org/2000/svg">
  <defs
     id="defs6" />
  <sodipodi:namedview
     id="namedview6"
     pagecolor="#ffffff"
     bordercolor="#000000"
     borderopacity="0.25"
     inkscape:showpageshadow="2"
     inkscape:pageopacity="0.0"
     inkscape:pagecheckerboard="0"
     inkscape:deskcolor="#d1d1d1"
     showgrid="true"
     inkscape:current-layer="svg6">
    <inkscape:grid
       id="grid6"
       units="px"
       originx="0"
       originy="0"
       spacingx="0.13229219"
       spacingy="0.13229219"
       empcolor="#0099e5"
       empopacity="0.30196078"
       color="#0099e5"
       opacity="0.14901961"
       empspacing="2"
       dotted="false"
       gridanglex="30"
       gridanglez="30"
       visible="true" />
  </sodipodi:namedview>
  <rect
     fill="#f5f7ff"
     height="7.011486"
     rx=".582086"
     stroke="#00aad4"
     stroke-linejoin="round"
     stroke-width=".396877"
     width="7.011486"
     x=".727607"
     y=".727607"
     id="rect1"
     style="fill:#ebfcff;fill-opacity:1" />
  <g
     stroke-linecap="round"
     id="g5"
     style="fill:#00aad4"
     transform="translate(1.4305115e-6,-0.5291689)">
    <path
       d="m 2.3812594,3.7041812 6.04e-5,0.5291687 c 0,0.2645842 0.6830626,0.5291687 1.8520303,0.5291687 1.1689682,0 1.8521207,-0.2645845 1.8520905,-0.5291687 l -6.02e-5,-0.5291687 c 0,0.2645843 -0.6830621,0.5291687 -1.8520303,0.5291687 -1.1689677,0 -1.8520303,-0.2645844 -1.8520907,-0.5291687 z"
       stroke-linejoin="round"
       stroke-miterlimit="5.6"
       stroke-width="0.352781"
       id="path2" />
    <ellipse
       cx="4.2333488"
       cy="3.1750131"
       rx="1.85203"
       ry="0.52916902"
       stroke-width="0.211667"
       id="ellipse2" />
    <g
       stroke-linejoin="round"
       stroke-miterlimit="5.6"
       stroke-width="0.352781"
       id="g4">
      <path
         d="m 2.3812594,4.7625186 6.04e-5,0.5291688 c 0,0.2645844 0.6830626,0.5291689 1.8520303,0.5291689 1.1689682,0 1.8521207,-0.2645845 1.8520905,-0.5291689 l -6.02e-5,-0.5291688 c 0,0.2645844 -0.6830621,0.5291688 -1.8520303,0.5291688 -1.1689677,0 -1.8520303,-0.2645844 -1.8520907,-0.5291688 z"
         id="path3" />
      <path
         d="m 2.3812594,5.8208563 6.04e-5,0.5291685 c 0,0.2645844 0.6830626,0.5291689 1.8520303,0.5291689 1.1689682,0 1.8521207,-0.2645845 1.8520905,-0.5291689 l -6.02e-5,-0.5291685 c 0,0.2645843 -0.6830621,0.5291685 -1.8520303,0.5291685 -1.1689677,0 -1.8520303,-0.2645842 -1.8520907,-0.5291685 z"
         id="path4" />
    </g>
  </g>
</svg>
