<?xml version="1.0" encoding="UTF-8" standalone="no"?>
<svg
   height="36"
   width="36"
   version="1.1"
   id="svg41"
   sodipodi:docname="Print_01_36.svg"
   inkscape:export-filename="Print_01_36.png"
   inkscape:export-xdpi="96"
   inkscape:export-ydpi="96"
   inkscape:version="1.2-beta (1b65182ce9, 2022-04-05)"
   xmlns:inkscape="http://www.inkscape.org/namespaces/inkscape"
   xmlns:sodipodi="http://sodipodi.sourceforge.net/DTD/sodipodi-0.dtd"
   xmlns:xlink="http://www.w3.org/1999/xlink"
   xmlns="http://www.w3.org/2000/svg"
   xmlns:svg="http://www.w3.org/2000/svg">
  <defs
     id="defs45" />
  <sodipodi:namedview
     id="namedview43"
     pagecolor="#ffffff"
     bordercolor="#666666"
     borderopacity="1.0"
     inkscape:pageshadow="2"
     inkscape:pageopacity="0.0"
     inkscape:pagecheckerboard="0"
     inkscape:deskcolor="#d1d1d1"
     showgrid="true"
     inkscape:zoom="25.5"
     inkscape:cx="17.980392"
     inkscape:cy="18"
     inkscape:current-layer="svg41">
    <inkscape:grid
       type="xygrid"
       id="grid170" />
  </sodipodi:namedview>
  <linearGradient
     id="a">
    <stop
       offset="0"
       stop-color="#e6e6e6"
       id="stop2" />
    <stop
       offset="1"
       stop-color="#ccc"
       id="stop4" />
  </linearGradient>
  <linearGradient
     id="b">
    <stop
       offset="0"
       stop-color="#666"
       id="stop7" />
    <stop
       offset="1"
       stop-color="#999"
       id="stop9" />
  </linearGradient>
  <linearGradient
     id="c"
     gradientUnits="userSpaceOnUse"
     x1="15.75"
     x2="4.5"
     xlink:href="#b"
     y1="44.75"
     y2="35.75" />
  <linearGradient
     id="d"
     gradientUnits="userSpaceOnUse"
     x1="13.5"
     x2="7.5"
     xlink:href="#b"
     y1="42.75"
     y2="36.75" />
  <linearGradient
     id="e"
     gradientUnits="userSpaceOnUse"
     x1="3"
     x2="21"
     xlink:href="#a"
     y1="38"
     y2="42.5" />
  <linearGradient
     id="f"
     gradientUnits="userSpaceOnUse"
     x1="9.75"
     x2="14.25"
     xlink:href="#a"
     y1="38.25"
     y2="41.25" />
  <linearGradient
     id="g"
     gradientUnits="userSpaceOnUse"
     x1="15"
     x2="16.5"
     y1="34.75"
     y2="37.75">
    <stop
       offset="0"
       stop-color="#999"
       id="stop16" />
    <stop
       offset="1"
       stop-color="#666"
       id="stop18" />
  </linearGradient>
  <g
     transform="matrix(1.5,0,0,1.5,0,-36)"
     id="g39">
    <path
       d="M 0.5,37 2,31.5 h 20 l 1.5,5.5"
       fill="#e6e6e6"
       fill-rule="evenodd"
       stroke="url(#g)"
       stroke-linecap="round"
       stroke-linejoin="round"
       id="path21"
       style="stroke:url(#g)" />
    <path
       d="M 4,38 5,34.5 H 19 L 20,38"
       fill="none"
       stroke="#999999"
       stroke-linecap="round"
       id="path23" />
    <g
       fill-rule="evenodd"
       id="g33">
      <path
         d="m 5.5,34.5 v -10 h 10 l 3,3 v 7"
         fill="#ffffff"
         stroke="#6995db"
         stroke-linejoin="round"
         id="path25" />
      <path
         d="m 0.5,37.5 v 8 h 23 v -8 z"
         fill="url(#e)"
         stroke="url(#c)"
         stroke-linecap="square"
         id="path27"
         style="fill:url(#e);stroke:url(#c)" />
      <path
         d="m 3.5,41.5 v 6 h 17 v -6"
         fill="#ffffff"
         stroke="#6e99dd"
         id="path29" />
      <path
         d="m 3.5,37.5 v 4 h 17 v -4 z"
         fill="url(#f)"
         stroke="url(#d)"
         stroke-linecap="square"
         stroke-linejoin="round"
         id="path31"
         style="fill:url(#f);stroke:url(#d)" />
    </g>
    <path
       d="m 8.25,27.75 h 6"
       fill="none"
       stroke="#bbd6f5"
       stroke-linecap="round"
       stroke-width="1.5"
       id="path35" />
    <path
       d="m 8.25,30.75 h 7.5"
       fill="none"
       stroke="#bbd6f5"
       stroke-linecap="round"
       stroke-width="1.5"
       id="path37" />
  </g>
</svg>
