<?xml version="1.0" encoding="UTF-8" standalone="no"?>
<svg
   width="48"
   height="48"
   version="1.1"
   viewBox="0 0 48 48"
   id="svg10"
   sodipodi:docname="tcolorlistbox_200.svg"
   inkscape:export-filename="tcolorlistbox_200.png"
   inkscape:export-xdpi="96"
   inkscape:export-ydpi="96"
   inkscape:version="1.3.2 (091e20e, 2023-11-25, custom)"
   xmlns:inkscape="http://www.inkscape.org/namespaces/inkscape"
   xmlns:sodipodi="http://sodipodi.sourceforge.net/DTD/sodipodi-0.dtd"
   xmlns="http://www.w3.org/2000/svg"
   xmlns:svg="http://www.w3.org/2000/svg">
  <defs
     id="defs10" />
  <sodipodi:namedview
     id="namedview10"
     pagecolor="#ffffff"
     bordercolor="#000000"
     borderopacity="0.25"
     inkscape:showpageshadow="2"
     inkscape:pageopacity="0.0"
     inkscape:pagecheckerboard="0"
     inkscape:deskcolor="#d1d1d1"
     showgrid="true"
     inkscape:current-layer="svg10">
    <inkscape:grid
       id="grid10"
       units="px"
       originx="0"
       originy="0"
       spacingx="0.5"
       spacingy="0.5"
       empcolor="#0099e5"
       empopacity="0.30196078"
       color="#0099e5"
       opacity="0.14901961"
       empspacing="2"
       dotted="false"
       gridanglex="30"
       gridanglez="30"
       visible="true" />
  </sodipodi:namedview>
  <rect
     x="5.5"
     y="5.5"
     width="37"
     height="37"
     fill="#f9f9f9"
     stroke="#2a7efe"
     style="stroke-width:1;paint-order:normal"
     id="rect1" />
  <path
     d="m17 20 h14"
     fill="none"
     stroke="#b3b3b3"
     stroke-width="2px"
     id="path1" />
  <path
     d="m17 12 h14"
     fill="none"
     stroke="#b3b3b3"
     stroke-width="2px"
     id="path2" />
  <path
     d="M 17 28 H 31"
     fill="none"
     stroke="#b3b3b3"
     stroke-width="2px"
     id="path3" />
  <path
     d="M 17 36 H 31"
     fill="none"
     stroke="#b3b3b3"
     stroke-width="2px"
     id="path4" />
  <rect
     x="9"
     y="9"
     width="6"
     height="6"
     fill="#ff6600"
     style="paint-order:normal"
     id="rect4" />
  <rect
     x="9"
     y="33"
     width="6"
     height="6"
     fill="#37c837"
     style="paint-order:normal"
     id="rect5" />
  <rect
     x="9"
     y="25"
     width="6"
     height="6"
     fill="#ff0000"
     style="paint-order:normal"
     id="rect6" />
  <rect
     x="9"
     y="17"
     width="6"
     height="6"
     fill="#0066ff"
     style="paint-order:normal"
     id="rect7" />
  <rect
     x="36.5"
     y="5.5"
     width="6"
     height="37"
     fill="#e6e6e6"
     stroke="#2a7efe"
     style="stroke-width:1;stroke-dasharray:none;paint-order:normal"
     id="rect8" />
  <path
     style="fill:#e6e6e6;fill-opacity:1;stroke:#2a7efe;stroke-width:2;stroke-linecap:round;stroke-linejoin:round;stroke-dasharray:none;stroke-opacity:1"
     d="M 39.5,11 V 23"
     id="path5" />
</svg>
