<svg width="16" height="16" version="1.1" xmlns="http://www.w3.org/2000/svg">
 <defs>
  <radialGradient id="a" cx="12.1" cy="10.900001" r="4.5" gradientTransform="matrix(0,1.0774576,-1.0774249,1.9512496e-8,21.789407,-2.9918059)" gradientUnits="userSpaceOnUse">
   <stop stop-color="#ff7f2a" offset="0"/>
   <stop stop-color="#d45500" offset="1"/>
  </radialGradient>
 </defs>
 <g stroke="#ffffff" stroke-linecap="round">
  <ellipse transform="matrix(0,1,1,0,0,0)" cx="11.5" cy="11.500002" rx="3.9999402" ry="4.000061" fill="url(#a)" stroke-dashoffset="1.49998" stroke-linejoin="round" stroke-width=".999998"/>
  <path d="M 9.7500004,11.25 11.499928,9.5 13.25,11.25" fill="none" stroke-linejoin="round" stroke-width=".999998"/>
  <path d="M 11.499938,9.5000003 V 13.5" fill="none" stroke-width=".999998px"/>
 </g>
</svg>
