<?xml version="1.0" encoding="UTF-8" standalone="no"?>
<svg
   height="16"
   width="16"
   version="1.1"
   id="svg401"
   sodipodi:docname="Chart_02_16.svg"
   inkscape:export-filename="Chart_02_16.png"
   inkscape:export-xdpi="96"
   inkscape:export-ydpi="96"
   inkscape:version="1.2-beta (1b65182ce9, 2022-04-05)"
   xmlns:inkscape="http://www.inkscape.org/namespaces/inkscape"
   xmlns:sodipodi="http://sodipodi.sourceforge.net/DTD/sodipodi-0.dtd"
   xmlns="http://www.w3.org/2000/svg"
   xmlns:svg="http://www.w3.org/2000/svg">
  <defs
     id="defs405" />
  <sodipodi:namedview
     id="namedview403"
     pagecolor="#ffffff"
     bordercolor="#666666"
     borderopacity="1.0"
     inkscape:pageshadow="2"
     inkscape:pageopacity="0.0"
     inkscape:pagecheckerboard="0"
     inkscape:deskcolor="#d1d1d1"
     showgrid="true"
     inkscape:zoom="57.375"
     inkscape:cx="8"
     inkscape:cy="8"
     inkscape:current-layer="svg401">
    <inkscape:grid
       type="xygrid"
       id="grid904" />
  </sodipodi:namedview>
  <g
     fill-rule="evenodd"
     id="g399">
    <path
       d="m7.25 1.0410156c-3.4972456.3780103-6.25 3.3668395-6.25 6.9589844 0 1.6539756.5852827 3.178621 1.5566406 4.380859l2.4882813-2.4882809c-.3457129-.5434839-.5449219-1.1914459-.5449219-1.8925781 0-1.6954104 1.1653622-3.0823755 2.75-3.4199219z"
       fill="#f60"
       id="path395" />
    <path
       d="m8.75 1.0410156v3.5390625c1.584631.3375515 2.75 1.7245164 2.75 3.4199219 0 1.9537227-1.5462773 3.5-3.5 3.5-.701083 0-1.3471642-.201207-1.890625-.546875l-2.4902344 2.490234c1.2022379.971358 2.7268834 1.556641 4.3808594 1.556641 3.845261 0 7-3.154739 7-7 0-3.5921449-2.752754-6.5809741-6.25-6.9589844z"
       fill="#0cf"
       id="path397" />
  </g>
</svg>
