<?xml version="1.0" encoding="UTF-8" standalone="no"?>
<svg
   height="32"
   width="32"
   version="1.1"
   id="svg1636"
   sodipodi:docname="Sound_01_32.svg"
   inkscape:export-filename="Sound_01_32.png"
   inkscape:export-xdpi="96"
   inkscape:export-ydpi="96"
   inkscape:version="1.2-beta (1b65182ce9, 2022-04-05)"
   xmlns:inkscape="http://www.inkscape.org/namespaces/inkscape"
   xmlns:sodipodi="http://sodipodi.sourceforge.net/DTD/sodipodi-0.dtd"
   xmlns="http://www.w3.org/2000/svg"
   xmlns:svg="http://www.w3.org/2000/svg">
  <defs
     id="defs1640" />
  <sodipodi:namedview
     id="namedview1638"
     pagecolor="#ffffff"
     bordercolor="#666666"
     borderopacity="1.0"
     inkscape:pageshadow="2"
     inkscape:pageopacity="0.0"
     inkscape:pagecheckerboard="0"
     inkscape:deskcolor="#d1d1d1"
     showgrid="true"
     inkscape:zoom="28.6875"
     inkscape:cx="15.982571"
     inkscape:cy="16"
     inkscape:current-layer="svg1636">
    <inkscape:grid
       type="xygrid"
       id="grid1759" />
  </sodipodi:namedview>
  <g
     id="g1362"
     transform="matrix(2.0000178,0,0,2.0000178,0.03672562,0.00123909)">
    <path
       style="fill:none;stroke:#00aad4;stroke-width:1px;stroke-linecap:round;stroke-linejoin:round;stroke-opacity:1"
       d="m 11.5,14.5 c 4.894378,-0.09859 5,-7 0,-6.9999996 z"
       id="path357"
       sodipodi:nodetypes="ccc" />
    <path
       style="fill:none;stroke:#00aad4;stroke-width:1px;stroke-linecap:round;stroke-linejoin:round;stroke-opacity:1"
       d="m 4.5,14.5 c -4.99297205,0 -5,-7 0,-6.9999996 z"
       id="path1010"
       sodipodi:nodetypes="ccc" />
    <path
       style="fill:none;stroke:#00aad4;stroke-width:1px;stroke-linecap:round;stroke-linejoin:miter;stroke-opacity:1"
       d="M 2,8 C 1.8521084,-0.96832345 14,-1 14,8"
       id="path1012"
       sodipodi:nodetypes="cc" />
  </g>
</svg>
