<?xml version="1.0" encoding="UTF-8" standalone="no"?>
<svg
   height="48"
   width="48"
   version="1.1"
   id="svg723"
   sodipodi:docname="Lock_03_48.svg"
   inkscape:export-filename="Lock_03_48.png"
   inkscape:export-xdpi="96"
   inkscape:export-ydpi="96"
   inkscape:version="1.2 (dc2aedaf03, 2022-05-15)"
   xmlns:inkscape="http://www.inkscape.org/namespaces/inkscape"
   xmlns:sodipodi="http://sodipodi.sourceforge.net/DTD/sodipodi-0.dtd"
   xmlns="http://www.w3.org/2000/svg"
   xmlns:svg="http://www.w3.org/2000/svg">
  <defs
     id="defs727" />
  <sodipodi:namedview
     id="namedview725"
     pagecolor="#ffffff"
     bordercolor="#666666"
     borderopacity="1.0"
     inkscape:showpageshadow="2"
     inkscape:pageopacity="0.0"
     inkscape:pagecheckerboard="0"
     inkscape:deskcolor="#d1d1d1"
     showgrid="true"
     inkscape:zoom="19.125"
     inkscape:cx="23.973856"
     inkscape:cy="24"
     inkscape:current-layer="g721">
    <inkscape:grid
       type="xygrid"
       id="grid470" />
  </sodipodi:namedview>
  <linearGradient
     id="a"
     gradientTransform="matrix(1.7503236 0 0 1.4957189 -88.180133 7.794953)"
     gradientUnits="userSpaceOnUse"
     x1="52.5"
     x2="61.5"
     y1="7"
     y2="7">
    <stop
       offset="0"
       stop-color="#fc0"
       id="stop705" />
    <stop
       offset=".37840304"
       stop-color="#f9f9f9"
       id="stop707" />
    <stop
       offset="1"
       stop-color="#ffd42a"
       id="stop709" />
  </linearGradient>
  <radialGradient
     id="b"
     cx="33.463123"
     cy="-1.059664"
     gradientTransform="matrix(1.2587404 -.9651516 .97902133 1.2409088 -29.122411 42.711931)"
     gradientUnits="userSpaceOnUse"
     r="5.5">
    <stop
       offset="0"
       id="stop712" />
    <stop
       offset="1"
       stop-color="#e6e6e6"
       id="stop714" />
  </radialGradient>
  <g
     transform="scale(2)"
     id="g721">
    <g
       id="g593">
      <path
         d="m3.5 12.5h17v11h-17z"
         fill="url(#a)"
         stroke="#d4aa00"
         stroke-linejoin="round"
         id="path717" />
      <path
         d="M 11.961538,0 C 7.7297608,0 4.2692307,3.411506 4.2692307,7.583334 V 12 H 7.0664336 V 7.583334 c 0,-2.681524 2.1750475,-4.825758 4.8951044,-4.825758 2.720057,0 4.895105,2.144234 4.895105,4.825758 l 0,0.416666 h 2.797203 l 0,-0.416666 C 19.653846,3.411506 16.193317,0 11.961538,0 Z"
         fill="url(#b)"
         id="path719"
         sodipodi:nodetypes="ssccsssccss" />
    </g>
  </g>
</svg>
