<svg width="32" height="32" version="1.1" xmlns="http://www.w3.org/2000/svg">
 <defs>
  <linearGradient id="a" x1="17.658785" x2="11.341217" y1="17.658785" y2="11.341217" gradientTransform="matrix(1.5289256,0,0,1.5289255,1.3305752,1.3305776)" gradientUnits="userSpaceOnUse">
   <stop stop-color="#009600" offset="0"/>
   <stop stop-color="#6edb39" offset="1"/>
  </linearGradient>
 </defs>
 <g stroke="#ffffff" stroke-linecap="round">
  <ellipse transform="matrix(0,1,1,0,0,0)" cx="23.5" cy="23.5" rx="7.727272" ry="7.7272716" fill="url(#a)" stroke-dashoffset="1.49998" stroke-linejoin="round" stroke-width="1.54546"/>
  <path d="m25.87721 25.535759 9.2e-5 -4.413037-4.41322-9.1e-5" fill="none" stroke-linejoin="round" stroke-width="1.78317"/>
  <path d="m25.341706 21.658291-4.993006 4.993006" fill="none" stroke-width="2.13985"/>
 </g>
</svg>
