<?xml version="1.0" encoding="UTF-8" standalone="no"?>
<svg
   width="24"
   height="24"
   version="1.1"
   viewBox="0 0 24 24"
   id="svg4"
   sodipodi:docname="Edit_04_24.svg"
   inkscape:export-filename="Edit_04_24.png"
   inkscape:export-xdpi="96"
   inkscape:export-ydpi="96"
   inkscape:version="1.3.2 (091e20e, 2023-11-25, custom)"
   xmlns:inkscape="http://www.inkscape.org/namespaces/inkscape"
   xmlns:sodipodi="http://sodipodi.sourceforge.net/DTD/sodipodi-0.dtd"
   xmlns="http://www.w3.org/2000/svg"
   xmlns:svg="http://www.w3.org/2000/svg">
  <defs
     id="defs4" />
  <sodipodi:namedview
     id="namedview4"
     pagecolor="#ffffff"
     bordercolor="#000000"
     borderopacity="0.25"
     inkscape:showpageshadow="2"
     inkscape:pageopacity="0.0"
     inkscape:pagecheckerboard="0"
     inkscape:deskcolor="#d1d1d1"
     showgrid="true"
     inkscape:current-layer="svg4">
    <inkscape:grid
       id="grid4"
       units="px"
       originx="0"
       originy="0"
       spacingx="0.5"
       spacingy="0.5"
       empcolor="#0099e5"
       empopacity="0.30196078"
       color="#0099e5"
       opacity="0.14901961"
       empspacing="2"
       dotted="false"
       gridanglex="30"
       gridanglez="30"
       visible="true" />
  </sodipodi:namedview>
  <path
     d="M 16.207873,3.6909078 20.309091,7.7921275 8.4119815,19.689236 1.5,22.5 4.3107629,15.588018 Z"
     fill="#ffefb3"
     stroke="#c29c00"
     stroke-linejoin="round"
     stroke-width="1.2"
     id="path1" />
  <path
     d="M 8.4119815,19.689236 C 7.4141775,17.611127 6.3888719,16.585823 4.3107629,15.588018 L 1.5,22.5 Z"
     fill="#c29c00"
     id="path2" />
  <path
     d="m1.5 22.5 0.9369214-2.303994 1.3670729 1.367073z"
     fill="#2a7fff"
     stroke="#2a7fff"
     stroke-linejoin="round"
     stroke-width="1.2"
     id="path3" />
  <path
     d="m19.920183 2.029207 2.050609 2.0506088c0.566259 0.5662612 0.624299 1.4263093 0.129637 1.9209736l-1.791337 1.7913375-4.101218-4.1012196 1.791336-1.7913368c0.494661-0.4946646 1.354712-0.4366241 1.920973 0.1296365z"
     fill="#ff9999"
     stroke="#fa0302"
     stroke-width="1.2"
     id="path4" />
</svg>
