<?xml version="1.0" encoding="UTF-8" standalone="no"?>
<svg
   width="64"
   height="64"
   version="1.1"
   viewBox="0 0 64 64"
   id="svg27"
   sodipodi:docname="Database_16_64.svg"
   inkscape:export-filename="Database_16_64.png"
   inkscape:export-xdpi="96"
   inkscape:export-ydpi="96"
   inkscape:version="1.3.2 (091e20e, 2023-11-25, custom)"
   xmlns:inkscape="http://www.inkscape.org/namespaces/inkscape"
   xmlns:sodipodi="http://sodipodi.sourceforge.net/DTD/sodipodi-0.dtd"
   xmlns:xlink="http://www.w3.org/1999/xlink"
   xmlns="http://www.w3.org/2000/svg"
   xmlns:svg="http://www.w3.org/2000/svg">
  <defs
     id="defs27" />
  <sodipodi:namedview
     id="namedview27"
     pagecolor="#ffffff"
     bordercolor="#000000"
     borderopacity="0.25"
     inkscape:showpageshadow="2"
     inkscape:pageopacity="0.0"
     inkscape:pagecheckerboard="0"
     inkscape:deskcolor="#d1d1d1"
     showgrid="true"
     inkscape:current-layer="svg27">
    <inkscape:grid
       id="grid27"
       units="px"
       originx="0"
       originy="0"
       spacingx="0.5"
       spacingy="0.5"
       empcolor="#0099e5"
       empopacity="0.30196078"
       color="#0099e5"
       opacity="0.14901961"
       empspacing="2"
       dotted="false"
       gridanglex="30"
       gridanglez="30"
       visible="true" />
  </sodipodi:namedview>
  <linearGradient
     id="a"
     x1="9"
     x2="53"
     y1="21"
     y2="21"
     gradientUnits="userSpaceOnUse"
     xlink:href="#b"
     gradientTransform="translate(1)" />
  <linearGradient
     id="b">
    <stop
       stop-color="#2de3e3"
       offset="0"
       id="stop1" />
    <stop
       stop-color="#71ffff"
       offset=".23818764"
       id="stop2" />
    <stop
       stop-color="#08b9b9"
       offset=".48656252"
       id="stop3" />
    <stop
       stop-color="#08cfcf"
       offset=".6837101"
       id="stop4" />
    <stop
       stop-color="#079a9a"
       offset=".86378187"
       id="stop5" />
    <stop
       stop-color="#07cccc"
       offset="1"
       id="stop6" />
  </linearGradient>
  <linearGradient
     id="c"
     x1="9"
     x2="53"
     y1="33"
     y2="33"
     gradientUnits="userSpaceOnUse"
     xlink:href="#b"
     gradientTransform="translate(1)" />
  <linearGradient
     id="d"
     x1="9"
     x2="53"
     y1="41.491676"
     y2="41.491676"
     gradientUnits="userSpaceOnUse"
     xlink:href="#e"
     gradientTransform="translate(1)" />
  <linearGradient
     id="e">
    <stop
       stop-color="#999999"
       offset="0"
       id="stop7" />
    <stop
       stop-color="#f8f8f8"
       offset=".23818764"
       id="stop8" />
    <stop
       stop-color="#868684"
       offset=".48656252"
       id="stop9" />
    <stop
       stop-color="#b2b2b2"
       offset=".6837101"
       id="stop10" />
    <stop
       stop-color="#4f4f4f"
       offset=".86378187"
       id="stop11" />
    <stop
       stop-color="#858585"
       offset="1"
       id="stop12" />
  </linearGradient>
  <linearGradient
     id="f"
     x1="9"
     x2="53"
     y1="53.491676"
     y2="53.491676"
     gradientUnits="userSpaceOnUse"
     xlink:href="#e"
     gradientTransform="translate(1)" />
  <linearGradient
     id="g"
     x1="9"
     x2="53"
     y1="45"
     y2="45"
     gradientUnits="userSpaceOnUse"
     xlink:href="#b"
     gradientTransform="translate(1)" />
  <linearGradient
     id="h"
     x1="9"
     x2="53"
     y1="47"
     y2="47"
     gradientUnits="userSpaceOnUse"
     xlink:href="#i"
     gradientTransform="translate(1)" />
  <linearGradient
     id="i">
    <stop
       stop-color="#9d9d9d"
       offset="0"
       id="stop13" />
    <stop
       stop-color="#808080"
       offset="1"
       id="stop14" />
  </linearGradient>
  <linearGradient
     id="j"
     x1="9"
     x2="53"
     y1="29.491676"
     y2="29.491676"
     gradientUnits="userSpaceOnUse"
     xlink:href="#e"
     gradientTransform="translate(1)" />
  <linearGradient
     id="k"
     x1="9"
     x2="53"
     y1="35"
     y2="35"
     gradientUnits="userSpaceOnUse"
     xlink:href="#i"
     gradientTransform="translate(1)" />
  <linearGradient
     id="l"
     x1="9"
     x2="53"
     y1="17.491676"
     y2="17.491676"
     gradientUnits="userSpaceOnUse"
     xlink:href="#e"
     gradientTransform="translate(1)" />
  <linearGradient
     id="m"
     x1="9"
     x2="53"
     y1="11"
     y2="11"
     gradientUnits="userSpaceOnUse"
     gradientTransform="translate(1)">
    <stop
       stop-color="#b0b0b0"
       offset="0"
       id="stop15" />
    <stop
       stop-color="#cbcbcb"
       offset="1"
       id="stop16" />
  </linearGradient>
  <linearGradient
     id="n"
     x1="23"
     x2="29"
     y1="27"
     y2="19"
     gradientUnits="userSpaceOnUse"
     xlink:href="#i"
     gradientTransform="translate(1)" />
  <ellipse
     cx="32"
     cy="23"
     rx="22"
     ry="4"
     fill="url(#n)"
     id="ellipse16"
     style="fill:url(#n)" />
  <ellipse
     cx="32"
     cy="11"
     rx="22"
     ry="4"
     fill="url(#m)"
     id="ellipse17"
     style="fill:url(#m)" />
  <path
     d="M 32,21 C 19.849737,21 10,19.20914 10,17 v -6 c 0,2.20914 9.849737,4 22,4 12.150266,0 22,-1.79086 22,-4 v 6 c 0,2.20914 -9.849734,4 -22,4 z"
     fill="url(#l)"
     stroke-linecap="round"
     stroke-width="0.1"
     id="path17"
     style="fill:url(#l)" />
  <ellipse
     cx="32"
     cy="35"
     rx="22"
     ry="4"
     fill="url(#k)"
     id="ellipse18"
     style="fill:url(#k)" />
  <path
     d="M 32,33 C 19.849734,33 10,31.20914 10,29 v -6 c 0,2.20914 9.849737,4 22,4 12.150266,0 22,-1.79086 22,-4 v 6 c -3e-6,2.20914 -9.849734,4 -22,4 z"
     fill="url(#j)"
     stroke-linecap="round"
     stroke-width="0.1"
     id="path18"
     style="fill:url(#j)" />
  <ellipse
     cx="32"
     cy="47"
     rx="22"
     ry="4"
     fill="url(#h)"
     id="ellipse19"
     style="fill:url(#h)" />
  <path
     d="m 12.000002,42.656252 v 4 C 16.000001,48.965652 24.000001,49.4 32,49.4 c 8.000003,0 16.000003,-0.4 20.000002,-2.743748 v -4 C 48.530049,44.036024 40.889837,45 32,45 23.110167,45 15.469952,44.036024 12.000002,42.656252 Z"
     fill="url(#g)"
     stroke-linecap="round"
     stroke-width="0.1"
     id="path19"
     style="fill:url(#g)" />
  <path
     d="M 32,57 C 19.849734,57 10,55.20914 10,53 v -6 c 0,2.20914 9.849737,4 22,4 12.150266,0 22,-1.79086 22,-4 v 6 c -3e-6,2.20914 -9.849734,4 -22,4 z"
     fill="url(#f)"
     stroke-linecap="round"
     stroke-width="0.1"
     id="path20"
     style="fill:url(#f)" />
  <path
     d="M 32,45 C 19.849734,45 10,43.20914 10,41 v -6 c 0,2.20914 9.849737,4 22,4 12.150266,0 22,-1.79086 22,-4 v 6 c -3e-6,2.20914 -9.849734,4 -22,4 z"
     fill="url(#d)"
     stroke-linecap="round"
     stroke-width="0.1"
     id="path21"
     style="fill:url(#d)" />
  <path
     d="M 32,15.640016 C 10,15.640016 10,11 10,11 c 0,0 0,3.599984 22,3.599984 C 54,14.599984 54,11 54,11 c 0,0 0,4.640016 -22,4.640016 z"
     fill="#e6e6e6"
     stroke-linecap="round"
     stroke-width="0.1"
     id="path22" />
  <path
     d="M 32,51.640016 C 10,51.640016 10,47 10,47 c 0,0 0,3.59998 22,3.59998 C 54,50.59998 54,47 54,47 c 0,0 0,4.640016 -22,4.640016 z"
     fill="#e6e6e6"
     stroke-linecap="round"
     stroke-width="0.1"
     id="path23" />
  <path
     d="M 32,39.640016 C 10,39.640016 10,35 10,35 c 0,0 0,3.599984 22,3.599984 C 54,38.599984 54,35 54,35 c 0,0 0,4.640016 -22,4.640016 z"
     fill="#e6e6e6"
     stroke-linecap="round"
     stroke-width="0.1"
     id="path24" />
  <path
     d="M 32,27.640016 C 10,27.640016 10,23 10,23 c 0,0 0,3.599984 22,3.599984 C 54,26.599984 54,23 54,23 c 0,0 0,4.640016 -22,4.640016 z"
     fill="#e6e6e6"
     stroke-linecap="round"
     stroke-width="0.1"
     id="path25" />
  <path
     d="m 12.000002,30.656252 v 4 C 16.000001,36.965652 24.000001,37.4 32,37.4 c 8.000003,0 16.000003,-0.4 20.000002,-2.743748 v -4 C 48.530049,32.036024 40.889837,33 32,33 23.110167,33 15.469952,32.036024 12.000002,30.656252 Z"
     fill="url(#c)"
     stroke-linecap="round"
     stroke-width="0.1"
     id="path26"
     style="fill:url(#c)" />
  <path
     d="m 12.000002,18.656252 v 4 C 16.000001,24.965652 24.000001,25.4 32,25.4 c 8.000003,0 16.000003,-0.4 20.000002,-2.743748 v -4 C 48.530049,20.036024 40.889837,21 32,21 23.110167,21 15.469952,20.036024 12.000002,18.656252 Z"
     fill="url(#a)"
     stroke-linecap="round"
     stroke-width="0.1"
     id="path27"
     style="fill:url(#a)" />
</svg>
