<svg width="36" height="36" version="1.1" xmlns="http://www.w3.org/2000/svg">
 <linearGradient id="a" x1="31.6875" x2="20.312501" y1="31.687501" y2="20.312502" gradientTransform="matrix(.87912084 0 0 .87912084 5.142859 5.1428579)" gradientUnits="userSpaceOnUse">
  <stop stop-color="#d40000" offset="0"/>
  <stop stop-color="#ff2a2a" offset="1"/>
 </linearGradient>
 <g>
  <circle transform="matrix(0,1,1,0,0,0)" cx="28" cy="28" r="8" fill="url(#a)" stroke-dashoffset="1.49998" stroke-linejoin="round"/>
  <path d="m24.814956 24.818372 6.363962 6.363962" fill="none" stroke="#ffffff" stroke-linecap="round" stroke-width="2"/>
  <path d="m31.178918 24.818372-6.363962 6.363962" fill="none" stroke="#ffffff" stroke-linecap="round" stroke-width="2"/>
 </g>
</svg>
