<?xml version="1.0" encoding="UTF-8" standalone="no"?>
<svg
   width="48"
   height="48"
   version="1.1"
   viewBox="0 0 48 48"
   id="svg6"
   sodipodi:docname="todbcconnection_200.svg"
   inkscape:version="1.3.2 (091e20e, 2023-11-25, custom)"
   inkscape:export-filename="todbcconnection_200.png"
   inkscape:export-xdpi="96"
   inkscape:export-ydpi="96"
   xmlns:inkscape="http://www.inkscape.org/namespaces/inkscape"
   xmlns:sodipodi="http://sodipodi.sourceforge.net/DTD/sodipodi-0.dtd"
   xmlns="http://www.w3.org/2000/svg"
   xmlns:svg="http://www.w3.org/2000/svg">
  <defs
     id="defs6" />
  <sodipodi:namedview
     id="namedview6"
     pagecolor="#ffffff"
     bordercolor="#000000"
     borderopacity="0.25"
     inkscape:showpageshadow="2"
     inkscape:pageopacity="0.0"
     inkscape:pagecheckerboard="0"
     inkscape:deskcolor="#d1d1d1"
     showgrid="true"
     inkscape:current-layer="svg6">
    <inkscape:grid
       id="grid6"
       units="px"
       originx="0"
       originy="0"
       spacingx="0.5"
       spacingy="0.5"
       empcolor="#0099e5"
       empopacity="0.30196078"
       color="#0099e5"
       opacity="0.14901961"
       empspacing="2"
       dotted="false"
       gridanglex="30"
       gridanglez="30"
       visible="true" />
  </sodipodi:namedview>
  <rect
     style="fill:#ffffff;stroke:none;stroke-width:1;stroke-linejoin:round"
     id="rect1"
     width="48"
     height="20"
     x="0"
     y="14"
     ry="3.1578948" />
  <path
     d="m 26,5 h 5 V 1 h 8 v 5"
     stroke="#2a7efe"
     stroke-width="2"
     id="path1"
     style="fill:none;stroke-linejoin:round" />
  <path
     d="M 48,5 H 43 V 9 H 35 V 4"
     stroke="#ff0000"
     stroke-width="2"
     id="path2"
     style="fill:none;stroke-linejoin:round" />
  <path
     d="m 26.8,29.1999 h 4.191078 c 3.681139,0 3.038145,-5.3252 -0.249906,-5.3252 M 26.8,29.1999 V 18.8001 h 3.941172 c 3.291436,0 3.038142,5.0746 0,5.0746 H 26.8"
     stroke="#333333"
     stroke-linecap="round"
     stroke-width="1.6"
     id="path3"
     style="fill:none;stroke-linejoin:round;stroke:#000000" />
  <path
     d="M 43.083391,27.2241 C 42.40473,29.7702 36.839,30.4592 36.839,25.5888 v -3.1777 c 0,-4.8704 5.56573,-4.1813 6.244391,-1.6352"
     stroke="#d40000"
     stroke-linecap="round"
     stroke-width="1.6"
     id="path4"
     style="fill:none;stroke-linejoin:round" />
  <path
     d="m 23.156733,25.801 c 0,1.958 -0.877768,3.3989 -3.178364,3.3989 H 16.8 V 18.8002 h 3.178369 c 2.300596,0 3.178364,1.4409 3.178364,3.3989 z"
     stroke="#333333"
     stroke-linecap="round"
     stroke-width="1.6"
     id="path5"
     style="fill:none;stroke-linejoin:round;stroke:#000000" />
  <path
     d="m 9.55491,18.8001 c 1.91402,0 3.4549,1.4251 3.4549,3.1951 v 4.0096 c 0,1.7701 -1.54088,3.1951 -3.4549,3.1951 C 7.64088,29.1999 6.1,27.7749 6.1,26.0048 v -4.0096 c 0,-1.77 1.54088,-3.1951 3.45491,-3.1951 z"
     stroke="#d40000"
     stroke-linecap="round"
     stroke-width="1.6"
     id="path6"
     style="fill:none;stroke-linejoin:round" />
</svg>
