<?xml version="1.0" encoding="UTF-8" standalone="no"?>
<svg
   height="48"
   viewBox="0 0 12.7 12.700001"
   width="48"
   version="1.1"
   id="svg746"
   sodipodi:docname="Eye_01_48.svg"
   inkscape:version="1.2 (dc2aedaf03, 2022-05-15)"
   inkscape:export-filename="Eye_01_48.png"
   inkscape:export-xdpi="96"
   inkscape:export-ydpi="96"
   xmlns:inkscape="http://www.inkscape.org/namespaces/inkscape"
   xmlns:sodipodi="http://sodipodi.sourceforge.net/DTD/sodipodi-0.dtd"
   xmlns="http://www.w3.org/2000/svg"
   xmlns:svg="http://www.w3.org/2000/svg">
  <defs
     id="defs750" />
  <sodipodi:namedview
     id="namedview748"
     pagecolor="#ffffff"
     bordercolor="#666666"
     borderopacity="1.0"
     inkscape:showpageshadow="2"
     inkscape:pageopacity="0.0"
     inkscape:pagecheckerboard="0"
     inkscape:deskcolor="#d1d1d1"
     showgrid="true"
     inkscape:zoom="19.125"
     inkscape:cx="22.457516"
     inkscape:cy="24"
     inkscape:current-layer="g1912">
    <inkscape:grid
       type="xygrid"
       id="grid1256" />
  </sodipodi:namedview>
  <g
     id="g1088"
     transform="matrix(3.0000015,0,0,3.0000015,4.9613507e-8,0.02374954)">
    <g
       id="g1912">
      <g
         id="g1029" />
      <g
         id="g832">
        <path
           style="fill:none;stroke:#00aad4;stroke-width:0.264583px;stroke-linecap:round;stroke-linejoin:round;stroke-opacity:1"
           d="m 0.13229068,2.1166667 c 0.66145833,1.8520833 3.29816692,1.8097365 3.96875002,0 -0.6614584,-1.85208337 -3.30729169,-1.85208337 -3.96875002,0 z"
           id="path365"
           sodipodi:nodetypes="ccc" />
        <circle
           style="fill:#00aad4;fill-opacity:1;stroke:none;stroke-width:4.23333;stroke-linecap:round;stroke-linejoin:round"
           id="circle1025"
           cx="2.1166666"
           cy="2.1166666"
           r="0.79374999" />
        <ellipse
           style="fill:#aaeeff;stroke:none;stroke-width:4.23333;stroke-linecap:round;stroke-linejoin:round"
           id="ellipse1027"
           cx="1.8520833"
           cy="1.8520832"
           rx="0.39687499"
           ry="0.39687496" />
        <path
           style="fill:none;stroke:#00aad4;stroke-width:0.264583px;stroke-linecap:round;stroke-linejoin:miter;stroke-opacity:1"
           d="m 0.92604167,2.1166667 c 0.43600463,-0.8803903 1.98437503,-0.9260417 2.38125003,0"
           id="path1020"
           sodipodi:nodetypes="cc" />
      </g>
    </g>
  </g>
</svg>
