<?xml version="1.0" encoding="UTF-8" standalone="no"?>
<svg
   height="32"
   viewBox="0 0 8.4666664 8.4666671"
   width="32"
   version="1.1"
   id="svg377"
   sodipodi:docname="menu_manage_desktops_200.svg"
   inkscape:version="1.2.1 (9c6d41e410, 2022-07-14)"
   inkscape:export-filename="menu_manage_desktops_200.png"
   inkscape:export-xdpi="96"
   inkscape:export-ydpi="96"
   xmlns:inkscape="http://www.inkscape.org/namespaces/inkscape"
   xmlns:sodipodi="http://sodipodi.sourceforge.net/DTD/sodipodi-0.dtd"
   xmlns="http://www.w3.org/2000/svg"
   xmlns:svg="http://www.w3.org/2000/svg">
  <defs
     id="defs381" />
  <sodipodi:namedview
     id="namedview379"
     pagecolor="#ffffff"
     bordercolor="#666666"
     borderopacity="1.0"
     inkscape:showpageshadow="2"
     inkscape:pageopacity="0.0"
     inkscape:pagecheckerboard="0"
     inkscape:deskcolor="#d1d1d1"
     showgrid="true"
     inkscape:zoom="28.6875"
     inkscape:cx="16"
     inkscape:cy="16"
     inkscape:current-layer="svg377"
     showguides="false">
    <inkscape:grid
       type="xygrid"
       id="grid1274" />
  </sodipodi:namedview>
  <path
     d="M 1.587483,7.4082827 1.5874704,7.1435981 3.7040591,6.6145315 h 1.0583281 l 2.1166489,0.5290666 -7.26e-5,0.2646846 H 1.587483"
     fill="#808080"
     stroke="#ffffff"
     stroke-width="1.05833"
     style="stroke:#ffffff;stroke-linecap:round;stroke-linejoin:round;paint-order:stroke fill markers;stroke-width:0.84666667;stroke-dasharray:none"
     id="path2"
     sodipodi:nodetypes="ccccccc" />
  <path
     id="rect4"
     style="fill:#ffffff;stroke:#ffffff;stroke-width:0.416301;stroke-linecap:round;stroke-linejoin:round;stroke-miterlimit:5.6;stroke-dasharray:none"
     d="M 0.31398407,0.84315051 H 8.1526827 V 5.5068492 H 0.31398407 V 0.84315051"
     sodipodi:nodetypes="ccccc" />
  <path
     id="rect6"
     style="fill:#aaccff;stroke:#483e37;stroke-width:0.52916667;stroke-linecap:round;stroke-linejoin:round;stroke-miterlimit:5.6;stroke-dasharray:none"
     d="M 0.7937318,1.3229722 H 7.6728545 V 5.0271307 H 0.7937318 V 1.3229722"
     sodipodi:nodetypes="ccccc" />
  <path
     d="m 4.2333531,5.2916076 2e-7,1.3229163"
     fill="none"
     stroke="#666666"
     stroke-width="1.05833"
     id="path10"
     sodipodi:nodetypes="cc" />
</svg>
