<?xml version="1.0" encoding="UTF-8" standalone="no"?>
<svg
   height="48"
   viewBox="0 0 12.7 12.700001"
   width="48"
   version="1.1"
   id="svg746"
   sodipodi:docname="Health_09_48.svg"
   inkscape:version="1.2.1 (9c6d41e410, 2022-07-14)"
   inkscape:export-filename="Health_09_48.png"
   inkscape:export-xdpi="96"
   inkscape:export-ydpi="96"
   xmlns:inkscape="http://www.inkscape.org/namespaces/inkscape"
   xmlns:sodipodi="http://sodipodi.sourceforge.net/DTD/sodipodi-0.dtd"
   xmlns="http://www.w3.org/2000/svg"
   xmlns:svg="http://www.w3.org/2000/svg">
  <defs
     id="defs750" />
  <sodipodi:namedview
     id="namedview748"
     pagecolor="#ffffff"
     bordercolor="#666666"
     borderopacity="1.0"
     inkscape:showpageshadow="2"
     inkscape:pageopacity="0.0"
     inkscape:pagecheckerboard="0"
     inkscape:deskcolor="#d1d1d1"
     showgrid="true"
     inkscape:zoom="19.125"
     inkscape:cx="24"
     inkscape:cy="24"
     inkscape:current-layer="svg746">
    <inkscape:grid
       type="xygrid"
       id="grid1256" />
  </sodipodi:namedview>
  <g
     id="g2362">
    <path
       style="fill:none;stroke:#00aad4;stroke-width:0.634999;stroke-linecap:round;stroke-linejoin:round;stroke-dasharray:none;stroke-opacity:1"
       d="M 7.3280342,2.200787 11.028381,5.9011339"
       id="path355"
       sodipodi:nodetypes="cc" />
    <path
       style="fill:none;stroke:#00aad4;stroke-width:0.634999;stroke-linecap:round;stroke-linejoin:round;stroke-dasharray:none;stroke-opacity:1"
       d="M 7.9705733,3.2458715 3.1400374,8.0764068 3.3413096,9.8878578 5.1527606,10.089131 9.9832965,5.2585947"
       id="path353" />
    <path
       style="fill:none;stroke:#00aad4;stroke-width:0.634999;stroke-linecap:round;stroke-linejoin:round;stroke-dasharray:none;stroke-opacity:1"
       d="M 9.7820243,1.0318751 12.197292,3.4471428"
       id="path357"
       sodipodi:nodetypes="cc" />
    <path
       style="fill:none;stroke:#00aad4;stroke-width:0.634999;stroke-linecap:round;stroke-linejoin:round;stroke-dasharray:none;stroke-opacity:1"
       d="M 3.3413096,9.8878578 0.92604171,12.303125"
       id="path459"
       sodipodi:nodetypes="cc" />
    <path
       style="fill:none;stroke:#00aad4;stroke-width:1.34933;stroke-linecap:butt;stroke-linejoin:round;stroke-dasharray:none;stroke-opacity:1"
       d="M 10.847917,2.3812501 9.1281254,4.1010418"
       id="path359-6"
       sodipodi:nodetypes="cc" />
    <path
       style="fill:none;stroke:#00aad4;stroke-width:0.529196px;stroke-linecap:butt;stroke-linejoin:miter;stroke-opacity:1"
       d="M 4.894363,6.7469497 5.9529922,7.8053416"
       id="path1004"
       sodipodi:nodetypes="cc" />
    <path
       style="fill:none;stroke:#00aad4;stroke-width:0.529196px;stroke-linecap:butt;stroke-linejoin:miter;stroke-opacity:1"
       d="M 5.688394,5.9531553 6.7467866,7.0115472"
       id="path948"
       sodipodi:nodetypes="cc" />
    <path
       style="fill:none;stroke:#00aad4;stroke-width:0.529196px;stroke-linecap:butt;stroke-linejoin:miter;stroke-opacity:1"
       d="M 7.2759827,4.3655663 8.3343753,5.4239585"
       id="path950"
       sodipodi:nodetypes="cc" />
    <path
       style="fill:none;stroke:#00aad4;stroke-width:0.529196px;stroke-linecap:butt;stroke-linejoin:miter;stroke-opacity:1"
       d="m 6.4821884,5.1593609 1.0583925,1.058392"
       id="path952"
       sodipodi:nodetypes="cc" />
    <path
       style="fill:none;stroke:#00aad4;stroke-width:0.529196px;stroke-linecap:butt;stroke-linejoin:miter;stroke-opacity:1"
       d="M 4.1005686,7.540744 5.1591978,8.599136"
       id="path1087"
       sodipodi:nodetypes="cc" />
  </g>
</svg>
