<?xml version="1.0" encoding="UTF-8" standalone="no"?>
<svg
   height="24"
   viewBox="0 0 6.3499998 6.3500003"
   width="24"
   version="1.1"
   id="svg17"
   sodipodi:docname="Arrow_20_24.svg"
   inkscape:export-filename="Arrow_20_24.png"
   inkscape:export-xdpi="96"
   inkscape:export-ydpi="96"
   inkscape:version="1.2 (dc2aedaf03, 2022-05-15)"
   xmlns:inkscape="http://www.inkscape.org/namespaces/inkscape"
   xmlns:sodipodi="http://sodipodi.sourceforge.net/DTD/sodipodi-0.dtd"
   xmlns="http://www.w3.org/2000/svg"
   xmlns:svg="http://www.w3.org/2000/svg">
  <defs
     id="defs21" />
  <sodipodi:namedview
     id="namedview19"
     pagecolor="#ffffff"
     bordercolor="#666666"
     borderopacity="1.0"
     inkscape:showpageshadow="2"
     inkscape:pageopacity="0.0"
     inkscape:pagecheckerboard="0"
     inkscape:deskcolor="#d1d1d1"
     showgrid="true"
     inkscape:zoom="38.25"
     inkscape:cx="11.986928"
     inkscape:cy="12"
     inkscape:current-layer="g15">
    <inkscape:grid
       type="xygrid"
       id="grid1010" />
  </sodipodi:namedview>
  <radialGradient
     id="a"
     cx="12.1"
     cy="10.900001"
     gradientTransform="matrix(0 .4988777 -.49887766 0 6.880948 -4.593239)"
     gradientUnits="userSpaceOnUse"
     r="4.5">
    <stop
       offset="0"
       stop-color="#59f"
       id="stop2" />
    <stop
       offset="1"
       stop-color="#0055d4"
       id="stop4" />
  </radialGradient>
  <g
     stroke-linecap="round"
     id="g15">
    <circle
       cx="2.116667"
       cy="2.116667"
       fill="url(#a)"
       r="1.852083"
       stroke="#d5e5ff"
       stroke-dashoffset="1.49998"
       stroke-linejoin="round"
       stroke-width=".264583"
       transform="matrix(0 1.5000001 1.5000001 0 0 0)"
       id="circle7" />
    <g
       fill="none"
       stroke="#ffffff"
       stroke-width="0.529167"
       transform="matrix(0,1.5000001,-1.5000001,0,6.469063,-0.06614613)"
       id="g13">
      <path
         d="M 2.3592014,1.4684373 3.0868056,2.1960415 2.3592014,2.9236457"
         stroke-linejoin="round"
         id="path9" />
      <path
         d="M 3.0868056,2.1960415 H 1.2347222"
         id="path11" />
    </g>
  </g>
</svg>
