<?xml version="1.0" encoding="UTF-8" standalone="no"?>
<svg
   height="24"
   width="24"
   version="1.1"
   id="svg17"
   sodipodi:docname="Zoom_01_24.svg"
   inkscape:version="1.2-beta (1b65182ce9, 2022-04-05)"
   inkscape:export-filename="Zoom_01_24.png"
   inkscape:export-xdpi="96"
   inkscape:export-ydpi="96"
   xmlns:inkscape="http://www.inkscape.org/namespaces/inkscape"
   xmlns:sodipodi="http://sodipodi.sourceforge.net/DTD/sodipodi-0.dtd"
   xmlns="http://www.w3.org/2000/svg"
   xmlns:svg="http://www.w3.org/2000/svg">
  <defs
     id="defs21" />
  <sodipodi:namedview
     id="namedview19"
     pagecolor="#ffffff"
     bordercolor="#666666"
     borderopacity="1.0"
     inkscape:pageshadow="2"
     inkscape:pageopacity="0.0"
     inkscape:pagecheckerboard="0"
     inkscape:deskcolor="#d1d1d1"
     showgrid="true"
     inkscape:zoom="38.25"
     inkscape:cx="10.326797"
     inkscape:cy="12"
     inkscape:current-layer="svg17">
    <inkscape:grid
       type="xygrid"
       id="grid333" />
  </sodipodi:namedview>
  <radialGradient
     id="a"
     cx="5.988626"
     cy="7.28811"
     gradientTransform="matrix(-4.2e-7,2.6,-2.4000002,-3.8e-7,23.472531,-11.070424)"
     gradientUnits="userSpaceOnUse"
     r="3.75">
    <stop
       offset="0"
       stop-color="#f8fbff"
       id="stop2" />
    <stop
       offset=".66666657"
       stop-color="#d1e3ff"
       id="stop4" />
    <stop
       offset="1"
       stop-color="#f8fbff"
       id="stop6" />
  </radialGradient>
  <g
     id="g331">
    <circle
       cx="8.2310619"
       cy="8.25"
       fill="url(#a)"
       fill-rule="evenodd"
       r="7.6875"
       stroke="#dd8703"
       stroke-linejoin="round"
       stroke-width="1.125"
       id="circle11"
       style="fill:url(#a);stroke-linecap:round" />
    <path
       d="m 14.625,14.606062 7.5,7.5"
       fill="none"
       stroke="#a05a2c"
       stroke-width="3.75"
       id="path13"
       style="stroke-linecap:round" />
  </g>
  <g
     id="g5950"
     transform="translate(0,2)">
    <path
       d="m 9.7500001,18 h -7.5"
       id="path1031"
       style="fill:none;stroke:#ffffff;stroke-width:4.5;stroke-linecap:round;stroke-dasharray:none" />
    <path
       d="m 9.7500001,18 h -7.5"
       id="path13-4"
       style="fill:none;stroke:#ff6600;stroke-width:2;stroke-linecap:round;stroke-dasharray:none" />
  </g>
</svg>
