<?xml version="1.0" encoding="UTF-8" standalone="no"?>
<svg
   width="48"
   height="48"
   version="1.1"
   viewBox="0 0 48 48"
   id="svg6"
   sodipodi:docname="teditbutton_200.svg"
   inkscape:export-filename="teditbutton_200.png"
   inkscape:export-xdpi="96"
   inkscape:export-ydpi="96"
   inkscape:version="1.3.2 (091e20e, 2023-11-25, custom)"
   xmlns:inkscape="http://www.inkscape.org/namespaces/inkscape"
   xmlns:sodipodi="http://sodipodi.sourceforge.net/DTD/sodipodi-0.dtd"
   xmlns="http://www.w3.org/2000/svg"
   xmlns:svg="http://www.w3.org/2000/svg">
  <defs
     id="defs6" />
  <sodipodi:namedview
     id="namedview6"
     pagecolor="#ffffff"
     bordercolor="#000000"
     borderopacity="0.25"
     inkscape:showpageshadow="2"
     inkscape:pageopacity="0.0"
     inkscape:pagecheckerboard="0"
     inkscape:deskcolor="#d1d1d1"
     showgrid="true"
     inkscape:current-layer="svg6">
    <inkscape:grid
       id="grid6"
       units="px"
       originx="0"
       originy="0"
       spacingx="0.5"
       spacingy="0.5"
       empcolor="#0099e5"
       empopacity="0.30196078"
       color="#0099e5"
       opacity="0.14901961"
       empspacing="2"
       dotted="false"
       gridanglex="30"
       gridanglez="30"
       visible="true" />
  </sodipodi:namedview>
  <g
     transform="translate(0,-1004.3622)"
     stroke-linecap="round"
     id="g6">
    <path
       d="m34.75 1017.1122h12.5v22.5h-12.5z"
       fill="#ececec"
       fill-rule="evenodd"
       stroke="#2a7efe"
       stroke-linejoin="round"
       stroke-width="1.5"
       id="path1" />
    <rect
       x=".5"
       y="1016.8622"
       width="31"
       height="23"
       fill="#ffffff"
       stroke="#2a7efe"
       stroke-linejoin="round"
       stroke-width=".999998"
       style="paint-order:normal"
       id="rect1" />
    <path
       d="m11.2 1029.1566h-3.36c-1.64904 0-2.24 1.1592-2.24 1.9922 0 1.3918 0.91902 2.4134 2.24 2.4134 1.094842 0 2.22986-0.6932 3.36-1.0042m0 1.0042v-5.488c0-2.428-1.240922-2.912-2.8-2.912-0.381972 0-1.14901 0.022-1.907506 0.5192"
       fill="none"
       stroke="#4d4d4d"
       stroke-linejoin="round"
       stroke-width="1.6"
       id="path2" />
    <path
       d="m18.187924 1025.1622h2e-6c1.5512 0 2.8 1.2488 2.8 2.8v2.8c0 1.5512-1.2488 2.8-2.8 2.8h-2e-6c-1.5512 0-2.8-1.2488-2.8-2.8v-2.8c0-1.5512 1.2488-2.8 2.8-2.8zm-2.8-3.36v11.76"
       fill="none"
       stroke="#4d4d4d"
       stroke-linejoin="round"
       stroke-width="1.6"
       id="path3" />
    <path
       d="m25 1022.3622v12"
       fill="none"
       stroke="#4d4d4d"
       stroke-width="1.4"
       id="path4" />
    <path
       d="m23 1021.3622 2 1 2-1"
       fill="none"
       stroke="#4d4d4d"
       stroke-width="1.4"
       id="path5" />
    <path
       d="m23 1035.3622 2-1 2 1"
       fill="none"
       stroke="#4d4d4d"
       stroke-width="1.4"
       id="path6" />
  </g>
</svg>
