<?xml version="1.0" encoding="UTF-8" standalone="no"?>
<svg
   width="24"
   height="24"
   version="1.1"
   id="svg18"
   sodipodi:docname="menu_run_withdebugging_150.svg"
   inkscape:export-filename="menu_run_withdebugging_150.png"
   inkscape:export-xdpi="96"
   inkscape:export-ydpi="96"
   inkscape:version="1.3.2 (091e20e, 2023-11-25, custom)"
   xmlns:inkscape="http://www.inkscape.org/namespaces/inkscape"
   xmlns:sodipodi="http://sodipodi.sourceforge.net/DTD/sodipodi-0.dtd"
   xmlns="http://www.w3.org/2000/svg"
   xmlns:svg="http://www.w3.org/2000/svg">
  <sodipodi:namedview
     id="namedview18"
     pagecolor="#ffffff"
     bordercolor="#000000"
     borderopacity="0.25"
     inkscape:showpageshadow="2"
     inkscape:pageopacity="0.0"
     inkscape:pagecheckerboard="0"
     inkscape:deskcolor="#d1d1d1"
     showgrid="true"
     inkscape:current-layer="svg18">
    <inkscape:grid
       id="grid18"
       units="px"
       originx="0"
       originy="0"
       spacingx="0.5"
       spacingy="0.5"
       empcolor="#0099e5"
       empopacity="0.30196078"
       color="#0099e5"
       opacity="0.14901961"
       empspacing="2"
       dotted="false"
       gridanglex="30"
       gridanglez="30"
       visible="true" />
  </sodipodi:namedview>
  <defs
     id="defs6">
    <radialGradient
       id="c"
       cx="21.957434"
       cy="5.9936466"
       r="3.105469"
       gradientTransform="matrix(.79349967 .00028049014 2.22393e-8 .65003304 .07729853 11.56725)"
       gradientUnits="userSpaceOnUse">
      <stop
         stop-color="#803300"
         offset="0"
         id="stop1" />
      <stop
         stop-color="#d45500"
         offset="1"
         id="stop2" />
    </radialGradient>
    <linearGradient
       id="a"
       x1="25.714283"
       x2="25.714283"
       y1="15.5"
       y2="6.2142854"
       gradientTransform="matrix(.79320529 .00024064049 .00022031364 .86666668 .04750233 10.561372)"
       gradientUnits="userSpaceOnUse">
      <stop
         stop-color="#668000"
         offset="0"
         id="stop3" />
      <stop
         stop-color="#aad400"
         offset="1"
         id="stop4" />
    </linearGradient>
    <linearGradient
       id="b"
       x1="23"
       x2="23"
       y1="6.5"
       y2="15"
       gradientTransform="matrix(.81690765 .00023828127 .000226897 .85816993 -.47453577 10.833318)"
       gradientUnits="userSpaceOnUse">
      <stop
         stop-color="#89a02c"
         offset="0"
         id="stop5" />
      <stop
         stop-color="#445016"
         offset="1"
         id="stop6" />
    </linearGradient>
  </defs>
  <path
     d="m5.5 2.5v18l5.773438-4.722656c-0.02138-0.108272-0.0332-0.220316-0.0332-0.332031v-1.048829c0-1.106988 0.98075-1.704225 1.703125-1.703125 0.49124-2.95e-4 0.918006 0.228241 1.232422 0.570313 0.0622-0.07284 0.139472-0.136401 0.207032-0.207031l-0.369141-0.90625c-0.316796-0.778796 0.0066-1.682618 0.708984-2.105469z"
     fill="#00cc00"
     fill-rule="evenodd"
     stroke-linejoin="round"
     id="path6" />
  <path
     d="m5.5605469 2.0039063a0.50005 0.50005 0 0 0-0.2753907 0.0449218 0.50005 0.50005 0 0 0-0.2851562 0.4511719v18a0.50005 0.50005 0 0 0 0.8164062 0.386719l5.6425778-4.617188c-0.13881-0.251109-0.21875-0.533203-0.21875-0.824218v-0.28711l-5.240234 4.287109v-15.890624l8.330078 6.8164065c0.166333-0.188286 0.374858-0.341601 0.619141-0.4414065 0.103061-0.042108 0.2046-0.072557 0.30664-0.09375l-9.4394528-7.7226562a0.50005 0.50005 0 0 0-0.2558593-0.109375z"
     fill="#008000"
     fill-rule="evenodd"
     stroke-linejoin="round"
     id="path7" />
  <g
     stroke-linejoin="round"
     id="g18">
    <path
       d="m18.451686 13.845158 0.951683-2.339602"
       fill="none"
       stroke="#d4aa00"
       stroke-linecap="round"
       stroke-width="1.01111"
       id="path8" />
    <path
       d="m16.548319 13.845158-0.951684-2.339602"
       fill="none"
       stroke="#d4aa00"
       stroke-linecap="round"
       stroke-width="1.01111"
       id="path9" />
    <path
       d="m17.498571 12.733333a5.6333349 3.9727974 89.953824 0 0-2.459865 1.224775l2.460859 2.688768 2.465688-2.694044a5.6333349 3.9727974 89.953824 0 0-2.466682-1.219499z"
       fill="url(#c)"
       stroke-width="2.83602"
       id="path10" />
    <path
       d="m12.950001 14.394444v1.04853l1.268912 1.336916"
       fill="none"
       stroke="#aca793"
       stroke-linecap="round"
       stroke-width="1.01111"
       id="path11" />
    <path
       d="m12.966579 23.494443-0.01658-1.354382 1.268911-1.336917"
       fill="none"
       stroke="#aca793"
       stroke-linecap="round"
       stroke-width="1.01111"
       id="path12" />
    <path
       d="m11.505557 19.828395 0.951683-1.002685 2.420168-0.464942"
       fill="none"
       stroke="#aca793"
       stroke-linecap="round"
       stroke-width="1.01111"
       id="path13" />
    <path
       d="m22.05069 14.394445 3e-6 1.048529-1.268914 1.336917"
       fill="none"
       stroke="#aca793"
       stroke-linecap="round"
       stroke-width="1.01111"
       id="path14" />
    <path
       d="m22.034111 23.494444 0.01658-1.354381-1.268911-1.336916"
       fill="none"
       stroke="#aca793"
       stroke-linecap="round"
       stroke-width="1.01111"
       id="path15" />
    <path
       d="m23.494445 19.828395-0.951682-1.002685-2.421224-0.46339"
       fill="none"
       stroke="#aca793"
       stroke-linecap="round"
       stroke-width="1.01111"
       id="path16" />
    <path
       d="m19.952857 13.939287-2.453299 2.680505-2.446911-2.673529a5.6333349 3.9727974 89.953824 0 0-1.524868 4.419199 5.6333349 3.9727974 89.953824 0 0 3.973655 5.634538 5.6333349 3.9727974 89.953824 0 0 3.970789-5.632129 5.6333349 3.9727974 89.953824 0 0-1.519366-4.428584z"
       fill="url(#a)"
       stroke-width="2.83602"
       id="path17" />
    <path
       d="m17.500001 16.272222v7.222222"
       fill="none"
       stroke="url(#b)"
       stroke-linecap="round"
       stroke-width="1.01111"
       id="path18" />
  </g>
</svg>
