<?xml version="1.0" encoding="UTF-8" standalone="no"?>
<svg
   height="48"
   width="48"
   version="1.1"
   id="svg441"
   sodipodi:docname="Cut_01_48.svg"
   inkscape:export-filename="Cut_01_48.png"
   inkscape:export-xdpi="96"
   inkscape:export-ydpi="96"
   inkscape:version="1.2-beta (1b65182ce9, 2022-04-05)"
   xmlns:inkscape="http://www.inkscape.org/namespaces/inkscape"
   xmlns:sodipodi="http://sodipodi.sourceforge.net/DTD/sodipodi-0.dtd"
   xmlns:xlink="http://www.w3.org/1999/xlink"
   xmlns="http://www.w3.org/2000/svg"
   xmlns:svg="http://www.w3.org/2000/svg">
  <defs
     id="defs445" />
  <sodipodi:namedview
     id="namedview443"
     pagecolor="#ffffff"
     bordercolor="#666666"
     borderopacity="1.0"
     inkscape:pageshadow="2"
     inkscape:pageopacity="0.0"
     inkscape:pagecheckerboard="0"
     inkscape:deskcolor="#d1d1d1"
     showgrid="true"
     inkscape:zoom="19.125"
     inkscape:cx="24"
     inkscape:cy="24"
     inkscape:current-layer="svg441">
    <inkscape:grid
       type="xygrid"
       id="grid2086" />
  </sodipodi:namedview>
  <linearGradient
     id="a">
    <stop
       offset="0"
       stop-color="#bdcee7"
       id="stop422" />
    <stop
       offset="1"
       stop-color="#fff"
       id="stop424" />
  </linearGradient>
  <linearGradient
     id="b"
     gradientTransform="matrix(1.1548494,-0.47835429,0.38268343,0.92387953,-4.393644,4.805189)"
     gradientUnits="userSpaceOnUse"
     x1="7"
     x2="8.730994"
     xlink:href="#a"
     y1="5"
     y2="4.731483" />
  <linearGradient
     id="c"
     gradientTransform="matrix(-1.1548494,-0.47835429,-0.38268343,0.92387953,20.393644,4.805189)"
     gradientUnits="userSpaceOnUse"
     x1="7"
     x2="8.730994"
     xlink:href="#a"
     y1="5"
     y2="4.731483" />
  <g
     fill-rule="evenodd"
     transform="matrix(2.9999566,0,0,2.9999566,-2.1314084e-4,0.23710702)"
     id="g439">
    <path
       d="M 5.595667,11.133 10,0.5 c 1.385819,0.5740252 1.544332,2.8044674 0.778966,4.6522263 C 9.902362,7.191766 8,12.5 6.2823257,12.633 Z"
       fill="url(#c)"
       stroke="#999999"
       stroke-width="0.5"
       id="path429"
       style="fill:url(#c)" />
    <path
       d="M 10.404333,11.133 6,0.5 C 4.614181,1.0740252 4.455668,3.3044674 5.221034,5.1522263 6.0976379,7.191766 8,12.5 9.7176743,12.633 Z"
       fill="url(#b)"
       stroke="#999999"
       stroke-width="0.5"
       id="path431"
       style="fill:url(#b)" />
    <g
       fill="#e60000"
       id="g437">
      <path
         d="M 5.9016701,10.106326 C 5.2418947,9.7628691 4.477047,9.8112903 3.8400705,10.103258 3.203094,10.395225 2.658576,10.922052 2.2988973,11.612987 c -0.3596787,0.690936 -0.478907,1.439155 -0.3527175,2.128401 0.1261894,0.689246 0.5252228,1.343547 1.1849991,1.687004 0.6597743,0.343458 1.4246221,0.295036 2.0615996,0.0031 C 5.829755,15.139494 6.374273,14.612667 6.7339517,13.921731 7.0936305,13.230795 7.2128587,12.482576 7.0866693,11.79333 6.9604789,11.104083 6.5614455,10.449783 5.9016701,10.106326 Z m -0.6926228,1.330517 c 0.1975197,0.102826 0.3433869,0.300402 0.4029878,0.625945 0.059604,0.325542 0.00551,0.75502 -0.2086002,1.166319 -0.214109,0.4113 -0.5348903,0.701949 -0.835745,0.83985 -0.3008547,0.137901 -0.546369,0.13174 -0.7438879,0.02892 -0.1975198,-0.102826 -0.3416558,-0.299502 -0.4012567,-0.625044 -0.059604,-0.325542 -0.00724,-0.755922 0.2068682,-1.167221 0.2141099,-0.4113 0.5366232,-0.701047 0.8374769,-0.838948 0.3008547,-0.1379 0.5446381,-0.132642 0.7421571,-0.02982 z"
         id="path433" />
      <path
         d="m 10.098703,10.106606 c 0.659776,-0.343457 1.423721,-0.2967686 2.060699,-0.0048 0.636975,0.291968 1.182397,0.820527 1.542075,1.511463 0.359678,0.690935 0.478906,1.439155 0.352717,2.128401 -0.126189,0.689246 -0.525224,1.343547 -1.184998,1.687004 -0.659775,0.343457 -1.424624,0.295036 -2.061602,0.0031 C 10.170619,15.139773 9.6261001,14.612945 9.2664224,13.92201 8.9067437,13.231074 8.786613,12.481122 8.9128015,11.791877 9.0389919,11.10263 9.4389278,10.450063 10.098703,10.106606 Z m 0.692623,1.330516 c -0.197519,0.102826 -0.341655,0.299501 -0.401257,0.625043 -0.0596,0.325543 -0.0072,0.755922 0.206869,1.167222 0.214109,0.4113 0.535722,0.699314 0.836576,0.837215 0.300855,0.137901 0.545539,0.134375 0.743059,0.03155 0.197517,-0.102826 0.340752,-0.301233 0.400353,-0.626775 0.0596,-0.325543 0.0081,-0.754188 -0.205966,-1.165489 -0.214109,-0.411299 -0.536623,-0.701047 -0.837478,-0.838948 -0.300854,-0.137901 -0.544637,-0.132641 -0.742157,-0.02982 z"
         id="path435" />
    </g>
  </g>
</svg>
