<?xml version="1.0" encoding="UTF-8" standalone="no"?>
<svg
   height="48"
   width="48"
   version="1.1"
   id="svg1522"
   sodipodi:docname="dialog_warning_150.svg"
   inkscape:export-filename="dialog_warning_150.png"
   inkscape:export-xdpi="96"
   inkscape:export-ydpi="96"
   inkscape:version="1.2.1 (9c6d41e410, 2022-07-14)"
   xmlns:inkscape="http://www.inkscape.org/namespaces/inkscape"
   xmlns:sodipodi="http://sodipodi.sourceforge.net/DTD/sodipodi-0.dtd"
   xmlns="http://www.w3.org/2000/svg"
   xmlns:svg="http://www.w3.org/2000/svg">
  <defs
     id="defs1526" />
  <sodipodi:namedview
     id="namedview1524"
     pagecolor="#ffffff"
     bordercolor="#666666"
     borderopacity="1.0"
     inkscape:showpageshadow="2"
     inkscape:pageopacity="0.0"
     inkscape:pagecheckerboard="0"
     inkscape:deskcolor="#d1d1d1"
     showgrid="true"
     inkscape:zoom="19.125"
     inkscape:cx="23.973856"
     inkscape:cy="24"
     inkscape:current-layer="svg1522">
    <inkscape:grid
       type="xygrid"
       id="grid1645" />
  </sodipodi:namedview>
  <linearGradient
     id="a"
     gradientUnits="userSpaceOnUse"
     x1="18.5166665"
     x2="11.61666656"
     y1="226.96666314"
     y2="214.69999658">
    <stop
       offset="0"
       stop-color="#fc0"
       id="stop1509" />
    <stop
       offset="1"
       stop-color="#fea"
       id="stop1511" />
  </linearGradient>
  <g
     fill-rule="evenodd"
     transform="matrix(2 0 0 2 0 -410)"
     id="g1520">
    <path
       d="m22.733381 227.73333h-21.4667617l10.7333807-21.46676z"
       fill="url(#a)"
       stroke="#a80"
       stroke-linejoin="round"
       stroke-width="1.53333"
       id="path1514" />
    <path
       d="m11 214.5v6.5h2v-6.5z"
       id="path1516" />
    <path
       d="m11 222.5v2h2v-2z"
       id="path1518" />
  </g>
</svg>
