<?xml version="1.0" encoding="UTF-8" standalone="no"?>
<svg
   height="48"
   viewBox="0 0 12.7 12.700001"
   width="48"
   version="1.1"
   id="svg746"
   sodipodi:docname="Math_03_48.svg"
   inkscape:version="1.2.1 (9c6d41e410, 2022-07-14)"
   inkscape:export-filename="Math_03_48.png"
   inkscape:export-xdpi="96"
   inkscape:export-ydpi="96"
   xmlns:inkscape="http://www.inkscape.org/namespaces/inkscape"
   xmlns:sodipodi="http://sodipodi.sourceforge.net/DTD/sodipodi-0.dtd"
   xmlns="http://www.w3.org/2000/svg"
   xmlns:svg="http://www.w3.org/2000/svg">
  <defs
     id="defs750" />
  <sodipodi:namedview
     id="namedview748"
     pagecolor="#ffffff"
     bordercolor="#666666"
     borderopacity="1.0"
     inkscape:showpageshadow="2"
     inkscape:pageopacity="0.0"
     inkscape:pagecheckerboard="0"
     inkscape:deskcolor="#d1d1d1"
     showgrid="true"
     inkscape:zoom="19.125"
     inkscape:cx="24"
     inkscape:cy="24"
     inkscape:current-layer="svg746">
    <inkscape:grid
       type="xygrid"
       id="grid1256" />
  </sodipodi:namedview>
  <path
     style="fill:none;stroke:#00aad4;stroke-width:0.793725px;stroke-linecap:butt;stroke-linejoin:miter;stroke-opacity:1"
     d="m 6.3500009,6.3500002 c -2.5644298,3.3373253 -5.55626335,1.8540699 -5.55626335,0 0,-1.8540696 2.99183355,-3.3373254 5.55626335,0 2.564429,3.3373253 5.5562621,1.8540696 5.5562621,0 0,-1.8540696 -2.9918331,-3.3373254 -5.5562621,0 z"
     id="path882"
     sodipodi:nodetypes="zczcz" />
</svg>
