<?xml version="1.0" encoding="UTF-8" standalone="no"?>
<svg
   height="48"
   viewBox="0 0 12.7 12.700001"
   width="48"
   version="1.1"
   id="svg530"
   sodipodi:docname="Grid_15_48.svg"
   inkscape:export-filename="Grid_15_48.png"
   inkscape:export-xdpi="96"
   inkscape:export-ydpi="96"
   inkscape:version="1.2.1 (9c6d41e410, 2022-07-14)"
   xmlns:inkscape="http://www.inkscape.org/namespaces/inkscape"
   xmlns:sodipodi="http://sodipodi.sourceforge.net/DTD/sodipodi-0.dtd"
   xmlns="http://www.w3.org/2000/svg"
   xmlns:svg="http://www.w3.org/2000/svg">
  <defs
     id="defs534" />
  <sodipodi:namedview
     id="namedview532"
     pagecolor="#ffffff"
     bordercolor="#666666"
     borderopacity="1.0"
     inkscape:showpageshadow="2"
     inkscape:pageopacity="0.0"
     inkscape:pagecheckerboard="0"
     inkscape:deskcolor="#d1d1d1"
     showgrid="true"
     inkscape:zoom="19.125"
     inkscape:cx="23.973856"
     inkscape:cy="24"
     inkscape:current-layer="svg530">
    <inkscape:grid
       type="xygrid"
       id="grid895" />
  </sodipodi:namedview>
  <g
     stroke-linecap="round"
     stroke-linejoin="round"
     transform="translate(-2.953639 -4.835131)"
     id="g528">
    <path
       d="m3.3505363 4.835131c-.2191782.000022-.3968512.177696-.396875.396875v9.525c.000022.219178.177696.396851.396875.396875h3.3718498c-.1906823-.256564-.3565365-.522057-.4976413-.79375h-.0961152v-.193786c-.5173108-1.097518-.636905-2.277745-.3410666-3.333115.1223328-.436412.3079274-.851059.5410518-1.2355514h-.199986v-1.5874999h1.5874999v.094568c.7823526-.5537604 1.7342651-.8882864 2.7781253-.8882864 1.047115 0 1.998028.3391138 2.778125.897652v-.10387h1.5875v1.5874999h-.217043c.239459.3943192.429498.8195468.553458 1.2665868.2906 1.047988.171466 2.219404-.336415 3.306763v.189134h-.09146c-.139748.271955-.303704.53752-.49299.79375h.981313c.219186 0 .396875-.17769.396875-.396875v-9.5249998c-.000026-.2191782-.1777-.3968512-.396879-.396875h-11.9062493zm.396875.79375h1.5874999v1.5874999h-1.5874999zm2.3812499 0h1.5875001v1.5874999h-1.5875001zm2.3812501 0h1.5874997v1.5874999h-1.5874997zm2.3812497 0h1.5875v1.5874999h-1.5875zm2.38125 0h1.5875v1.5874999h-1.5875zm-9.5249997 2.3812499h1.5874999v1.5875001h-1.5874999zm6.7468747 2.1828121c-.297275 0-.5751432.07319-.823198.198438h.426331v1.5875h-1.5146335c-.03438.256143-.021654.522089.068214.79375h1.4464495v1.522412a1.48844 1.48844 0 0 1 .511596.536401 1.48844 1.48844 0 0 1 .282154-.506945v-1.55186h1.45415c.08337-.269486.08929-.535027.05116-.79375h-1.505347v-1.5875h.415481c-.245896-.125667-.520534-.198438-.812324-.198438zm-6.7468747.198438h1.5874999v1.5875h-1.5874999zm0 2.38125h1.5874999v1.5875h-1.5874999z"
       fill="#d4aa00"
       stroke-dashoffset="1.5"
       stroke-width=".79375"
       id="path524" />
    <path
       d="m14.067484 16.840601h-2.38125v-1.289844c3.950573-2.30775 1.984375-6.8460948-1.190625-6.8460948-3.1749999 0-5.1593748 4.4648438-1.1863386 6.8460948l-.00428 1.289844h-2.3812499"
       fill="none"
       stroke="#2a7fff"
       stroke-width="1.38906"
       id="path526" />
  </g>
</svg>
