<?xml version="1.0" encoding="UTF-8" standalone="no"?>
<svg
   height="64"
   width="64"
   version="1.1"
   id="svg847"
   sodipodi:docname="Paste_03_64.svg"
   inkscape:export-filename="Paste_03_64.png"
   inkscape:export-xdpi="96"
   inkscape:export-ydpi="96"
   inkscape:version="1.2.1 (9c6d41e410, 2022-07-14)"
   xmlns:inkscape="http://www.inkscape.org/namespaces/inkscape"
   xmlns:sodipodi="http://sodipodi.sourceforge.net/DTD/sodipodi-0.dtd"
   xmlns="http://www.w3.org/2000/svg"
   xmlns:svg="http://www.w3.org/2000/svg">
  <defs
     id="defs851" />
  <sodipodi:namedview
     id="namedview849"
     pagecolor="#ffffff"
     bordercolor="#666666"
     borderopacity="1.0"
     inkscape:pageshadow="2"
     inkscape:pageopacity="0.0"
     inkscape:pagecheckerboard="0"
     inkscape:deskcolor="#d1d1d1"
     showgrid="true"
     inkscape:zoom="14.34375"
     inkscape:cx="28.583878"
     inkscape:cy="32"
     inkscape:current-layer="g845"
     inkscape:showpageshadow="2">
    <inkscape:grid
       type="xygrid"
       id="grid2447" />
  </sodipodi:namedview>
  <linearGradient
     id="a"
     gradientTransform="matrix(.42307697 0 0 .27272725 3.040598 -3.963901)"
     gradientUnits="userSpaceOnUse"
     x1="5.399997"
     x2="5.399997"
     y1="4.333334"
     y2="11.666667">
    <stop
       offset="0"
       stop-color="#fc0"
       id="stop809" />
    <stop
       offset="1"
       stop-color="#fff6d5"
       id="stop811" />
  </linearGradient>
  <linearGradient
     id="b"
     gradientTransform="matrix(.42307697 0 0 .27272725 3.040598 -3.963901)"
     gradientUnits="userSpaceOnUse"
     x1="7.999997"
     x2="7.999997"
     y1="13.500001"
     y2="2.5">
    <stop
       offset="0"
       stop-color="#744b18"
       id="stop814" />
    <stop
       offset="1"
       stop-color="#ca7f26"
       id="stop816" />
  </linearGradient>
  <linearGradient
     id="c"
     gradientTransform="matrix(.6153846 0 0 .86366045 7.252135 4.122932)"
     gradientUnits="userSpaceOnUse"
     x1="3.666667"
     x2="3.666667"
     y1="3.722222"
     y2="12.277779">
    <stop
       offset="0"
       stop-color="#fff"
       id="stop819" />
    <stop
       offset="1"
       stop-color="#e0ebf4"
       id="stop821" />
  </linearGradient>
  <linearGradient
     id="d"
     gradientTransform="matrix(.6153846 0 0 .86366045 7.252135 4.122932)"
     gradientUnits="userSpaceOnUse"
     x1="7.277778"
     x2="7.277778"
     y1="13.500001"
     y2="2.5">
    <stop
       offset="0"
       stop-color="#3a7ab7"
       id="stop824" />
    <stop
       offset="1"
       stop-color="#75a5d3"
       id="stop826" />
  </linearGradient>
  <g
     transform="scale(4)"
     id="g845">
    <g
       id="g986"
       transform="translate(2)">
      <rect
         fill="url(#a)"
         fill-rule="evenodd"
         height="3"
         rx="0.192307"
         ry="0.136364"
         stroke="url(#b)"
         stroke-linecap="square"
         transform="scale(1,-1)"
         width="5"
         x="3.5"
         y="-3.5"
         id="rect841"
         style="fill:none;stroke:#00aad4;stroke-opacity:1" />
      <path
         d="M 8.75,1.5 H 11 c 0.234385,0 0.5,0.1726364 0.5,0.5 v 12 c 0,0.327364 -0.265615,0.5 -0.5,0.5 H 1 C 0.76561535,14.5 0.5,14.327364 0.5,14 V 2 C 0.5,1.6726364 0.76561535,1.5 1,1.5 h 2.25"
         id="path886"
         style="fill:none;stroke:#00aad4;stroke-opacity:1"
         sodipodi:nodetypes="csssccsssc" />
    </g>
    <path
       style="fill:none;stroke:#00aad4;stroke-width:1.25;stroke-linecap:round;stroke-linejoin:round;stroke-dasharray:none;stroke-opacity:1"
       d="m 5.725,9 1.5,2 3.5,-4.5"
       id="path1230"
       sodipodi:nodetypes="ccc" />
  </g>
</svg>
