<?xml version="1.0" encoding="UTF-8" standalone="no"?>
<svg
   height="64"
   width="64"
   version="1.1"
   id="svg16"
   sodipodi:docname="File_15_64.svg"
   inkscape:export-filename="File_15_64.png"
   inkscape:export-xdpi="96"
   inkscape:export-ydpi="96"
   inkscape:version="1.2 (dc2aedaf03, 2022-05-15)"
   xmlns:inkscape="http://www.inkscape.org/namespaces/inkscape"
   xmlns:sodipodi="http://sodipodi.sourceforge.net/DTD/sodipodi-0.dtd"
   xmlns:xlink="http://www.w3.org/1999/xlink"
   xmlns="http://www.w3.org/2000/svg"
   xmlns:svg="http://www.w3.org/2000/svg">
  <defs
     id="defs20">
    <radialGradient
       id="a-9"
       cx="9.1740294"
       cy="7.8253603"
       gradientTransform="matrix(0.66909781,-2.2758851e-8,4.5190518e-8,0.58542853,1.8616763,4.291566)"
       gradientUnits="userSpaceOnUse"
       r="7.5"
       fx="9.1740294"
       fy="7.8253603">
      <stop
         offset="0"
         stop-color="#fff"
         id="stop2-5"
         style="stop-color:#ccddff;stop-opacity:1;" />
      <stop
         offset="1"
         stop-color="#8fc1c7"
         id="stop4-2"
         style="stop-color:#ffffff;stop-opacity:1" />
    </radialGradient>
    <linearGradient
       inkscape:collect="always"
       xlink:href="#a-9"
       id="linearGradient4344"
       x1="52"
       y1="60"
       x2="12"
       y2="4"
       gradientUnits="userSpaceOnUse" />
    <radialGradient
       id="a"
       cx="4.1671958"
       cy="1041.9056"
       gradientTransform="matrix(0.09628186,-0.96268178,0.91820995,0.09182587,-933.88939,-67.612204)"
       gradientUnits="userSpaceOnUse"
       r="9">
      <stop
         offset="0"
         stop-color="#acf"
         id="stop1058" />
      <stop
         offset="1"
         stop-color="#fff"
         id="stop1060" />
    </radialGradient>
  </defs>
  <sodipodi:namedview
     id="namedview18"
     pagecolor="#ffffff"
     bordercolor="#666666"
     borderopacity="1.0"
     inkscape:pageshadow="2"
     inkscape:pageopacity="0.0"
     inkscape:pagecheckerboard="0"
     inkscape:deskcolor="#d1d1d1"
     showgrid="true"
     inkscape:zoom="14.34375"
     inkscape:cx="28.583878"
     inkscape:cy="32"
     inkscape:current-layer="svg16"
     inkscape:showpageshadow="2">
    <inkscape:grid
       type="xygrid"
       id="grid1649" />
  </sodipodi:namedview>
  <path
     d="M 10,62 V 2 h 29 l 15,15 v 45 z"
     id="path2911"
     style="fill:url(#linearGradient4344);stroke:#b3b3b3;stroke-width:4;stroke-linecap:round;stroke-linejoin:round;stroke-opacity:1;fill-opacity:1"
     sodipodi:nodetypes="cccccc" />
  <path
     d="M 38,2 V 18 H 54"
     id="path2913"
     style="fill:none;stroke:#b3b3b3;stroke-width:4;stroke-linecap:round;stroke-linejoin:round;stroke-opacity:1" />
  <g
     id="g1677"
     transform="scale(2)">
    <circle
       cx="21.5"
       cy="21.5"
       fill="url(#a)"
       r="8.500001"
       stroke="#4d4d4d"
       stroke-linecap="round"
       stroke-linejoin="round"
       id="circle1063"
       style="fill:url(#a)" />
    <path
       d="m 21.5,15 v 6.5 h 5"
       fill="none"
       stroke="#666666"
       id="path1065" />
    <g
       stroke-linecap="round"
       stroke-linejoin="round"
       id="g1083">
      <path
         d="m 14.416667,21.027779 h 0.944444 v 0.944444 h -0.944444 z"
         fill="#0088aa"
         stroke-width="0.999997"
         id="path1067" />
      <path
         d="m 25.75,25.75 h 0.944444 v 0.944444 H 25.75 Z"
         fill="#0088aa"
         stroke-width="0.999997"
         id="path1069" />
      <path
         d="m 16.305555,25.75 h 0.944444 v 0.944444 h -0.944444 z"
         fill="#0088aa"
         stroke-width="0.999997"
         id="path1071" />
      <path
         d="m 16.305555,16.305555 h 0.944444 v 0.944444 h -0.944444 z"
         fill="#0088aa"
         stroke-width="0.999997"
         id="path1073" />
      <path
         d="m 27.638889,21.027779 h 0.944444 v 0.944444 h -0.944444 z"
         fill="#0088aa"
         stroke-width="0.999997"
         id="path1075" />
      <path
         d="m 21.027779,27.638889 h 0.944444 v 0.944444 h -0.944444 z"
         fill="#0088aa"
         stroke-width="0.999997"
         id="path1077" />
      <path
         d="m 25.75,16.305555 h 0.944444 v 0.944444 H 25.75 Z"
         fill="#0088aa"
         stroke-width="0.999997"
         id="path1079" />
      <circle
         cx="21.5"
         cy="21.5"
         fill="none"
         r="9.75"
         stroke="#ffffff"
         stroke-width="1.5"
         id="circle1081" />
    </g>
  </g>
</svg>
