<?xml version="1.0" encoding="UTF-8" standalone="no"?>
<svg
   width="32"
   height="32"
   version="1.1"
   viewBox="0 0 32 32"
   id="svg2"
   sodipodi:docname="tag_h2_200.svg"
   inkscape:export-filename="tag_h2_200.png"
   inkscape:export-xdpi="96"
   inkscape:export-ydpi="96"
   inkscape:version="1.3.2 (091e20e, 2023-11-25, custom)"
   xmlns:inkscape="http://www.inkscape.org/namespaces/inkscape"
   xmlns:sodipodi="http://sodipodi.sourceforge.net/DTD/sodipodi-0.dtd"
   xmlns="http://www.w3.org/2000/svg"
   xmlns:svg="http://www.w3.org/2000/svg">
  <defs
     id="defs2" />
  <sodipodi:namedview
     id="namedview2"
     pagecolor="#ffffff"
     bordercolor="#000000"
     borderopacity="0.25"
     inkscape:showpageshadow="2"
     inkscape:pageopacity="0.0"
     inkscape:pagecheckerboard="0"
     inkscape:deskcolor="#d1d1d1"
     showgrid="true"
     inkscape:current-layer="svg2">
    <inkscape:grid
       id="grid2"
       units="px"
       originx="0"
       originy="0"
       spacingx="0.5"
       spacingy="0.5"
       empcolor="#0099e5"
       empopacity="0.30196078"
       color="#0099e5"
       opacity="0.14901961"
       empspacing="2"
       dotted="false"
       gridanglex="30"
       gridanglez="30"
       visible="true" />
  </sodipodi:namedview>
  <path
     d="m6.299995 15.999999h8.402894m0-6.800004v13.60001m-8.402894-13.60001v13.60001"
     fill="none"
     stroke="#008dd2"
     stroke-linecap="round"
     stroke-linejoin="round"
     stroke-width="2.39999"
     id="path2" />
  <path
     d="m 20.31826,11.57976 c 0.387221,-1.371779 1.67994,-2.3797604 3.215016,-2.3797604 1.840979,0 3.333387,1.4497444 3.333387,3.2380954 0,0.684574 -0.21867,1.319531 -0.592513,1.843149 L 20.199887,22.8 h 6.666776"
     id="path3"
     style="fill:none;stroke:#008dd2;stroke-width:2.4;stroke-linecap:round;stroke-linejoin:round;stroke-opacity:1" />
</svg>
