<?xml version="1.0" encoding="UTF-8" standalone="no"?>
<svg
   width="24"
   height="24"
   version="1.1"
   viewBox="0 0 24 24"
   id="svg11"
   sodipodi:docname="replace_by_finder_150.svg"
   inkscape:version="1.3.2 (091e20e, 2023-11-25, custom)"
   xmlns:inkscape="http://www.inkscape.org/namespaces/inkscape"
   xmlns:sodipodi="http://sodipodi.sourceforge.net/DTD/sodipodi-0.dtd"
   xmlns="http://www.w3.org/2000/svg"
   xmlns:svg="http://www.w3.org/2000/svg">
  <sodipodi:namedview
     id="namedview11"
     pagecolor="#ffffff"
     bordercolor="#000000"
     borderopacity="0.25"
     inkscape:showpageshadow="2"
     inkscape:pageopacity="0.0"
     inkscape:pagecheckerboard="0"
     inkscape:deskcolor="#d1d1d1"
     showgrid="true"
     inkscape:current-layer="svg11">
    <inkscape:grid
       id="grid11"
       units="px"
       originx="0"
       originy="0"
       spacingx="0.5"
       spacingy="0.5"
       empcolor="#0099e5"
       empopacity="0.30196078"
       color="#0099e5"
       opacity="0.14901961"
       empspacing="2"
       dotted="false"
       gridanglex="30"
       gridanglez="30"
       visible="true" />
  </sodipodi:namedview>
  <defs
     id="defs7">
    <linearGradient
       id="a"
       x1="7.9999995"
       x2="7.9999995"
       y1="1.4999998"
       y2="11.238683"
       gradientTransform="matrix(1.2000054 0 0 .92307949 -.60000268 2.6154569)"
       gradientUnits="userSpaceOnUse">
      <stop
         stop-color="#80b4fe"
         offset="0"
         id="stop1" />
      <stop
         stop-color="#e7f6fe"
         offset="1"
         id="stop2" />
    </linearGradient>
    <radialGradient
       id="b"
       cx="16"
       cy="10"
       r="2.5999999"
       gradientTransform="matrix(1.0500046,0,0,1.0500047,-4.0500181,-1.9999022)"
       gradientUnits="userSpaceOnUse">
      <stop
         stop-color="#ffffff"
         offset="0"
         id="stop3" />
      <stop
         stop-color="#ffe680"
         offset=".57692301"
         id="stop4" />
      <stop
         stop-color="#ffcc00"
         offset="1"
         id="stop5" />
    </radialGradient>
    <radialGradient
       id="c"
       cx="-11.886363"
       cy="8.886363"
       r="3.5"
       gradientTransform="matrix(0,1.32,-1.32,0,5.729999,30.69)"
       gradientUnits="userSpaceOnUse">
      <stop
         stop-color="#fff"
         offset="0"
         id="stop6" />
      <stop
         stop-color="#d5e5ff"
         offset="1"
         id="stop7" />
    </radialGradient>
  </defs>
  <path
     d="m21.750097 18.248563-9.00004 0.0015 3.000013 3.000014"
     fill="none"
     stroke="#2a7efe"
     stroke-linecap="round"
     stroke-linejoin="round"
     stroke-width="1.50001"
     id="path7" />
  <path
     d="m14.250063 15.24855 9.00004 0.0015-3.000013-3.000014"
     fill="none"
     stroke="#fa0302"
     stroke-linecap="round"
     stroke-linejoin="round"
     stroke-width="1.50001"
     id="path8" />
  <path
     d="m0 4v12.000053l4.2158391-5.000998c1.2284128-1.457283 3.2873431-1.261442 4.5351764 0l3.1904435 3.2256a2.5500113 2.5500113 0 0 1 2.308604-1.526374h0.908208c0.137386-0.02532 0.27162-0.02273 0.407228 0h2.434581v-8.698281z"
     fill="url(#a)"
     stroke-width="1.5"
     id="path9" />
  <path
     d="m11.827201 16.000053a2.5500113 2.5500113 0 0 1-0.125977-0.752932 2.5500113 2.5500113 0 0 1 0.240235-1.022466l-3.1904435-3.2256c-1.2478333-1.261442-3.3067636-1.457283-4.5351764 0l-4.2158391 5.000998z"
     fill="#01a901"
     stroke-width="1.5"
     id="path10" />
  <ellipse
     cx="12.750056"
     cy="8.50002"
     rx="2.6250114"
     ry="2.6250117"
     fill="url(#b)"
     stroke-width="1.5"
     id="ellipse10" />
  <path
     d="m4.5 16.5 6.6 6.6"
     fill="none"
     stroke="#a05a2c"
     stroke-linecap="round"
     stroke-width="1.8"
     id="path11" />
  <circle
     transform="scale(-1,1)"
     cx="-4.5"
     cy="16.5"
     r="4.125"
     fill="url(#c)"
     fill-rule="evenodd"
     stroke="#dd8703"
     stroke-linecap="round"
     stroke-linejoin="round"
     stroke-width=".75"
     id="circle11" />
</svg>
