<?xml version="1.0" encoding="UTF-8" standalone="no"?>
<svg
   width="24"
   height="24"
   version="1.1"
   viewBox="0 0 6.35 6.35"
   id="svg5"
   sodipodi:docname="Window_17_24.svg"
   inkscape:export-filename="Window_17_24.png"
   inkscape:export-xdpi="96"
   inkscape:export-ydpi="96"
   inkscape:version="1.3.2 (091e20e, 2023-11-25, custom)"
   xmlns:inkscape="http://www.inkscape.org/namespaces/inkscape"
   xmlns:sodipodi="http://sodipodi.sourceforge.net/DTD/sodipodi-0.dtd"
   xmlns="http://www.w3.org/2000/svg"
   xmlns:svg="http://www.w3.org/2000/svg">
  <defs
     id="defs5" />
  <sodipodi:namedview
     id="namedview5"
     pagecolor="#ffffff"
     bordercolor="#000000"
     borderopacity="0.25"
     inkscape:showpageshadow="2"
     inkscape:pageopacity="0.0"
     inkscape:pagecheckerboard="0"
     inkscape:deskcolor="#d1d1d1"
     showgrid="true"
     inkscape:current-layer="svg5">
    <inkscape:grid
       id="grid5"
       units="px"
       originx="0"
       originy="0"
       spacingx="0.13229167"
       spacingy="0.13229167"
       empcolor="#0099e5"
       empopacity="0.30196078"
       color="#0099e5"
       opacity="0.14901961"
       empspacing="2"
       dotted="false"
       gridanglex="30"
       gridanglez="30"
       visible="true" />
  </sodipodi:namedview>
  <rect
     x=".423333"
     y=".423333"
     width="5.503333"
     height="5.503334"
     rx=".449792"
     fill="#f5f7ff"
     stroke="#00aad4"
     stroke-linejoin="round"
     stroke-width=".3175"
     id="rect1" />
  <path
     d="m.52916666.52916655h5.29166664v.74083335h-5.29166664z"
     fill="#00aad4"
     fill-rule="evenodd"
     stroke-width=".396872"
     id="path1" />
  <g
     fill="none"
     stroke="#00aad4"
     stroke-linecap="round"
     stroke-width=".264583"
     id="g5">
    <path
       d="m2.3812501 1.9843751-0.9260417-1e-7v0.9260418"
       id="path2" />
    <path
       d="m1.4552084 4.2333336v0.926042l0.9260417-3e-7"
       id="path3" />
    <path
       d="m3.9687502 5.1593753 0.9260419 2e-7 -1e-7 -0.9260419"
       id="path4" />
    <path
       d="m4.894792 2.9104168 1e-7 -0.9260419-0.9260419 2e-7"
       id="path5" />
  </g>
</svg>
