<?xml version="1.0" encoding="UTF-8" standalone="no"?>
<svg
   height="48"
   viewBox="0 0 12.7 12.700001"
   width="48"
   version="1.1"
   id="svg746"
   sodipodi:docname="Font_15_48.svg"
   inkscape:version="1.2 (dc2aedaf03, 2022-05-15)"
   inkscape:export-filename="Font_15_48.png"
   inkscape:export-xdpi="96"
   inkscape:export-ydpi="96"
   xmlns:inkscape="http://www.inkscape.org/namespaces/inkscape"
   xmlns:sodipodi="http://sodipodi.sourceforge.net/DTD/sodipodi-0.dtd"
   xmlns="http://www.w3.org/2000/svg"
   xmlns:svg="http://www.w3.org/2000/svg">
  <defs
     id="defs750">
    <filter
       inkscape:collect="always"
       style="color-interpolation-filters:sRGB"
       id="filter2552"
       x="-0.087504072"
       y="-0.065622713"
       width="1.1750081"
       height="1.1312454">
      <feGaussianBlur
         inkscape:collect="always"
         stdDeviation="0.34722527"
         id="feGaussianBlur2554" />
    </filter>
  </defs>
  <sodipodi:namedview
     id="namedview748"
     pagecolor="#ffffff"
     bordercolor="#666666"
     borderopacity="1.0"
     inkscape:showpageshadow="2"
     inkscape:pageopacity="0.0"
     inkscape:pagecheckerboard="0"
     inkscape:deskcolor="#d1d1d1"
     showgrid="true"
     inkscape:zoom="19.125"
     inkscape:cx="21.385621"
     inkscape:cy="24"
     inkscape:current-layer="svg746">
    <inkscape:grid
       type="xygrid"
       id="grid1256" />
  </sodipodi:namedview>
  <g
     id="g2558">
    <path
       id="path2185"
       style="fill:#ffffff;fill-opacity:1;stroke:none;stroke-width:0.264583;stroke-dasharray:none;filter:url(#filter2552)"
       d="M 2.3807333 0 A 0.79304805 0.79304805 0 0 0 1.5880168 0.7927165 L 1.5880168 11.90625 A 0.79304805 0.79304805 0 0 0 2.3807333 12.698967 L 6.9727013 12.698967 C 8.1881144 12.698967 9.2253554 12.379197 9.9704512 11.738302 C 10.715547 11.097407 11.111467 10.145923 11.111467 9.1291589 C 11.111468 7.7664387 10.330161 6.892802 9.4102787 6.2890221 C 9.5970831 6.1381892 9.8495022 6.0906803 10.001974 5.8947309 C 10.469144 5.2943464 10.714592 4.4983025 10.714592 3.5723919 C 10.714592 2.7129255 10.32387 1.8629747 9.6583256 1.1818401 C 8.992781 0.50070545 8.0100238 6.2665862e-16 6.8435102 0 L 2.3807333 0 z M 5.1583417 3.1739666 L 6.3494835 3.1739666 C 6.4819057 3.1739666 6.7075257 3.2643249 6.8807172 3.4375164 C 7.0539087 3.6107079 7.1447838 3.836328 7.1447838 3.9687502 C 7.1447838 4.1047857 7.0537675 4.3282181 6.8827843 4.4999839 C 6.7118011 4.6717497 6.4908981 4.7635337 6.3494835 4.7635337 L 5.1583417 4.7635337 L 5.1583417 3.1739666 z M 5.197099 7.9375003 L 6.7458417 7.9375003 C 6.8789135 7.9375003 7.1046049 8.0283465 7.2775922 8.2010501 C 7.4505795 8.3737537 7.5411421 8.5977949 7.5411421 8.7302168 C 7.5411421 8.9948001 7.4696597 9.2032662 7.376811 9.3146773 C 7.2839624 9.4260884 7.1648521 9.5255171 6.7458417 9.5255171 L 5.197099 9.5255171 L 5.197099 7.9375003 z " />
    <path
       d="M 2.3812495,0.79375025 V 11.90625 h 4.5919682 c 2.1549073,0 3.3455323,-1.125512 3.3455333,-2.7781248 10e-7,-1.5875 -1.29269,-2.6024332 -2.381251,-2.7781246 1.190625,-0.3968752 1.984375,-1.1906251 1.984375,-2.7781252 0,-1.1906251 -1.190625,-2.77812515 -3.0788822,-2.77812515 z m 1.984375,1.58750005 h 1.984375 c 0.7937502,0 1.5875005,0.7937499 1.5875005,1.5875002 0,0.7937499 -0.7828984,1.5874998 -1.5875005,1.5874998 h -1.984375 z m 0.038757,4.7624999 h 2.3424931 c 0.7937496,0 1.5874994,0.79375 1.5874994,1.5875 0,0.79375 -0.396874,1.5874998 -1.5874994,1.5874998 H 4.4043818 Z"
       id="path2"
       style="fill:#000000;fill-opacity:1;stroke:none;stroke-width:0.264583;stroke-dasharray:none"
       sodipodi:nodetypes="ccsscssccssscccssscc" />
  </g>
</svg>
