<?xml version="1.0" encoding="UTF-8" standalone="no"?>
<svg
   height="16"
   width="16"
   version="1.1"
   id="svg143"
   sodipodi:docname="Folder_16_16.svg"
   inkscape:export-filename="Folder_16_16.png"
   inkscape:export-xdpi="96"
   inkscape:export-ydpi="96"
   inkscape:version="1.2.2 (732a01da63, 2022-12-09)"
   xmlns:inkscape="http://www.inkscape.org/namespaces/inkscape"
   xmlns:sodipodi="http://sodipodi.sourceforge.net/DTD/sodipodi-0.dtd"
   xmlns="http://www.w3.org/2000/svg"
   xmlns:svg="http://www.w3.org/2000/svg">
  <defs
     id="defs147" />
  <sodipodi:namedview
     id="namedview145"
     pagecolor="#ffffff"
     bordercolor="#000000"
     borderopacity="0.25"
     inkscape:showpageshadow="2"
     inkscape:pageopacity="0.0"
     inkscape:pagecheckerboard="0"
     inkscape:deskcolor="#d1d1d1"
     showgrid="true"
     inkscape:zoom="56.875"
     inkscape:cx="6.7164835"
     inkscape:cy="8"
     inkscape:current-layer="svg143">
    <inkscape:grid
       type="xygrid"
       id="grid922" />
  </sodipodi:namedview>
  <g
     stroke="#00aad4"
     stroke-linejoin="round"
     id="g141">
    <path
       d="m 1.5,1.5 c -0.55399938,0 -1,0.4460007 -1,1 v 5 h 15 v -4 c 0,-0.5539994 -0.446001,-1 -1,-1 H 6 C 6,1.9460007 5.5539993,1.5 5,1.5 Z"
       fill="#ebfcff"
       id="path137"
       sodipodi:nodetypes="ssccsscss" />
    <path
       d="m 1.5,6.5 h 4 c 0,-0.6320783 0.3907767,-1 1,-1 h 8 c 0.554,0 1,0.446 1,1 v 6 c 0,0.554 -0.446,1 -1,1 h -13 c -0.554,0 -1,-0.446 -1,-1 v -5 c 0,-0.554 0.446,-1 1,-1 z"
       fill="#c2f3ff"
       stroke-width="0.999997"
       id="path139"
       sodipodi:nodetypes="scsssssssss" />
  </g>
</svg>
