<?xml version="1.0" encoding="UTF-8" standalone="no"?>
<svg
   width="36"
   height="36"
   version="1.1"
   viewBox="0 0 36 36"
   id="svg4"
   sodipodi:docname="Mouse_01_36.svg"
   inkscape:export-filename="Mouse_01_36.png"
   inkscape:export-xdpi="96"
   inkscape:export-ydpi="96"
   inkscape:version="1.3.2 (091e20e, 2023-11-25, custom)"
   xmlns:inkscape="http://www.inkscape.org/namespaces/inkscape"
   xmlns:sodipodi="http://sodipodi.sourceforge.net/DTD/sodipodi-0.dtd"
   xmlns="http://www.w3.org/2000/svg"
   xmlns:svg="http://www.w3.org/2000/svg">
  <defs
     id="defs4" />
  <sodipodi:namedview
     id="namedview4"
     pagecolor="#ffffff"
     bordercolor="#000000"
     borderopacity="0.25"
     inkscape:showpageshadow="2"
     inkscape:pageopacity="0.0"
     inkscape:pagecheckerboard="0"
     inkscape:deskcolor="#d1d1d1"
     showgrid="true"
     inkscape:current-layer="svg4">
    <inkscape:grid
       id="grid4"
       units="px"
       originx="0"
       originy="0"
       spacingx="0.5"
       spacingy="0.5"
       empcolor="#0099e5"
       empopacity="0.30196078"
       color="#0099e5"
       opacity="0.14901961"
       empspacing="2"
       dotted="false"
       gridanglex="30"
       gridanglez="30"
       visible="true" />
  </sodipodi:namedview>
  <path
     transform="matrix(2.1233593 0 0 2.1666021 0 .39109679)"
     d="m2.875521 6.124479 3.248958-3.248958a2.0935496 2.0935496 2.3177325 0 1 3.0755209 0.1244791l5.8000001 6.8235295a1.2896695 1.2896695 92.317732 0 1-0.07072 1.7471864l-3.358568 3.358568a1.2896695 1.2896695 177.68227 0 1-1.7471824 0.070716l-6.8235295-5.8000001a2.0935496 2.0935496 87.682268 0 1-0.1244791-3.0755209z"
     fill="#f4eed7"
     stroke="#808080"
     stroke-width=".466228"
     id="path1" />
  <path
     d="m10.157692 23.608873 12.596685-12.85322"
     fill="none"
     stroke="#808080"
     stroke-width=".999999"
     id="path2" />
  <path
     d="m9.555117 10.140806 6.900918 7.041457"
     fill="none"
     stroke="#808080"
     stroke-width=".999999"
     id="path3" />
  <path
     d="M 9.555117,10.140806 C 5.87735,7.974204 5.837229,3.641 0,3.641"
     fill="none"
     stroke="#808080"
     stroke-width="1.4"
     id="path4" />
</svg>
