<svg width="22" height="22" version="1.1" xmlns="http://www.w3.org/2000/svg">
 <radialGradient id="a" cx="4" cy="4" r="5.5" gradientTransform="matrix(8e-8 2.5454546 -2.5454546 5e-8 18.181818 -2.181818)" gradientUnits="userSpaceOnUse">
  <stop stop-color="#ff8080" offset="0"/>
  <stop stop-color="#f00" offset="1"/>
 </radialGradient>
 <circle cx="11" cy="11" r="11" fill="url(#a)"/>
 <path d="M 12.363636,15.772727 17.136363,11 12.363636,6.2272728" fill="none" stroke="#e5ff80" stroke-linecap="round" stroke-linejoin="round" stroke-width="3"/>
 <path d="m16 11h-11.136364" fill="none" stroke="#e5ff80" stroke-linecap="round" stroke-width="3.5"/>
</svg>
