<?xml version="1.0" encoding="UTF-8" standalone="no"?>
<svg
   height="48"
   viewBox="0 0 12.7 12.700001"
   width="48"
   version="1.1"
   id="svg600"
   sodipodi:docname="Font_08_48.svg"
   inkscape:export-filename="Font_08_48.png"
   inkscape:export-xdpi="96"
   inkscape:export-ydpi="96"
   inkscape:version="1.2 (dc2aedaf03, 2022-05-15)"
   xmlns:inkscape="http://www.inkscape.org/namespaces/inkscape"
   xmlns:sodipodi="http://sodipodi.sourceforge.net/DTD/sodipodi-0.dtd"
   xmlns="http://www.w3.org/2000/svg"
   xmlns:svg="http://www.w3.org/2000/svg">
  <defs
     id="defs604">
    <filter
       inkscape:collect="always"
       style="color-interpolation-filters:sRGB"
       id="filter2918"
       x="-0.077505999"
       y="-0.072650977"
       width="1.155012"
       height="1.145302">
      <feGaussianBlur
         inkscape:collect="always"
         stdDeviation="0.38441348"
         id="feGaussianBlur2920" />
    </filter>
  </defs>
  <sodipodi:namedview
     id="namedview602"
     pagecolor="#ffffff"
     bordercolor="#666666"
     borderopacity="1.0"
     inkscape:showpageshadow="2"
     inkscape:pageopacity="0.0"
     inkscape:pagecheckerboard="0"
     inkscape:deskcolor="#d1d1d1"
     showgrid="true"
     inkscape:zoom="19.125"
     inkscape:cx="23.24183"
     inkscape:cy="24"
     inkscape:current-layer="svg600">
    <inkscape:grid
       type="xygrid"
       id="grid1199" />
  </sodipodi:namedview>
  <g
     id="g935">
    <path
       id="path2551"
       style="stroke:none;filter:url(#filter2918);fill:#ffffff"
       d="M 5.1604087 0 A 0.7930484 0.7930484 0 0 0 4.414201 0.52554934 L 0.44545086 11.638567 A 0.7930484 0.7930484 0 0 0 1.1916586 12.698967 L 2.947107 12.698967 A 0.7930484 0.7930484 0 0 0 3.6933148 12.173934 L 4.6405438 9.5234501 L 8.0584232 9.5234501 L 9.0056522 12.173934 A 0.7930484 0.7930484 0 0 0 9.7518599 12.698967 L 11.509892 12.698967 A 0.7930484 0.7930484 0 0 0 12.2561 11.638567 L 8.2873498 0.52554934 A 0.7930484 0.7930484 0 0 0 7.5411421 0 L 5.1604087 0 z M 6.3494835 4.7382123 L 6.9256757 6.3515505 L 5.7732912 6.3515505 L 6.3494835 4.7382123 z " />
    <path
       d="M 5.1593754,0.7937502 1.1906252,11.90625 H 2.9482148 L 4.0821435,8.7312503 H 8.6178582 L 9.7517862,11.90625 H 11.509375 L 7.5406252,0.7937502 Z m 1.1906248,1.5875002 1.700893,4.7624999 H 4.6491075 Z"
       stroke="#ffffff"
       stroke-width="0.198438"
       id="path723"
       sodipodi:nodetypes="ccccccccccccc"
       style="stroke:none" />
  </g>
</svg>
