<?xml version="1.0" encoding="UTF-8" standalone="no"?>
<svg
   width="36"
   height="36"
   version="1.1"
   viewBox="0 0 36 36"
   id="svg4"
   sodipodi:docname="tcalendardialog_150.svg"
   inkscape:export-filename="tcalendardialog_150.png"
   inkscape:export-xdpi="96"
   inkscape:export-ydpi="96"
   inkscape:version="1.3.2 (091e20e, 2023-11-25, custom)"
   xmlns:inkscape="http://www.inkscape.org/namespaces/inkscape"
   xmlns:sodipodi="http://sodipodi.sourceforge.net/DTD/sodipodi-0.dtd"
   xmlns="http://www.w3.org/2000/svg"
   xmlns:svg="http://www.w3.org/2000/svg">
  <defs
     id="defs4" />
  <sodipodi:namedview
     id="namedview4"
     pagecolor="#ffffff"
     bordercolor="#000000"
     borderopacity="0.25"
     inkscape:showpageshadow="2"
     inkscape:pageopacity="0.0"
     inkscape:pagecheckerboard="0"
     inkscape:deskcolor="#d1d1d1"
     showgrid="true"
     inkscape:current-layer="svg4">
    <inkscape:grid
       id="grid4"
       units="px"
       originx="0"
       originy="0"
       spacingx="0.5"
       spacingy="0.5"
       empcolor="#0099e5"
       empopacity="0.30196078"
       color="#0099e5"
       opacity="0.14901961"
       empspacing="2"
       dotted="false"
       gridanglex="30"
       gridanglez="30"
       visible="true" />
  </sodipodi:namedview>
  <rect
     x="2.5"
     y="6.4999828"
     width="31"
     height="27"
     fill="#f9f9f9"
     stroke="#2a7efe"
     style="paint-order:normal"
     id="rect1" />
  <path
     d="M 34,3.5 V 7 H 2 V 3.5 C 2,2.8 2.7,2 3.5,2 h 29 C 33.2,2 34,2.7 34,3.5 Z"
     fill="#2a7efe"
     id="path1" />
  <rect
     x="9.375"
     y="12.874983"
     width="17.25"
     height="16.750017"
     fill="#ffffff"
     stroke="#999999"
     stroke-linecap="round"
     stroke-width="0.75"
     style="paint-order:normal"
     id="rect2" />
  <path
     d="M 10.5,10 H 25.499974 C 26.328405,10 26.999986,10.6716 27,11.5 V 14 H 9 V 11.5 C 9,10.6716 9.6715729,10 10.5,10 Z"
     fill="#d40000"
     style="paint-order:normal"
     id="path2" />
  <path
     d="M 15.628097,25.3836 V 17.6164 L 13.31644,19.0959"
     fill="none"
     stroke="#4d4d4d"
     stroke-linecap="round"
     stroke-linejoin="round"
     stroke-width="1.23288"
     id="path3" />
  <path
     d="m 21.052755,17.6164 -2.548464,4.6623 m -0.225509,0.8857 c 0,-1.0214 0.827966,-1.8493 1.849315,-1.8493 1.021349,0 1.849315,0.8279 1.849315,1.8493 v 0.3698 c 0,1.0213 -0.827966,1.8494 -1.849315,1.8494 -1.021349,0 -1.849315,-0.8281 -1.849315,-1.8494 z"
     fill="none"
     stroke="#4d4d4d"
     stroke-linecap="round"
     stroke-linejoin="round"
     stroke-width="1.23288"
     id="path4" />
</svg>
