<?xml version="1.0" encoding="UTF-8" standalone="no"?>
<svg
   height="36"
   width="36"
   version="1.1"
   id="svg296"
   sodipodi:docname="Folder_03_36.svg"
   inkscape:export-filename="Folder_03_36.png"
   inkscape:export-xdpi="96"
   inkscape:export-ydpi="96"
   inkscape:version="1.2-beta (1b65182ce9, 2022-04-05)"
   xml:space="preserve"
   xmlns:inkscape="http://www.inkscape.org/namespaces/inkscape"
   xmlns:sodipodi="http://sodipodi.sourceforge.net/DTD/sodipodi-0.dtd"
   xmlns="http://www.w3.org/2000/svg"
   xmlns:svg="http://www.w3.org/2000/svg"><defs
     id="defs300" /><sodipodi:namedview
     id="namedview298"
     pagecolor="#ffffff"
     bordercolor="#666666"
     borderopacity="1.0"
     inkscape:pageshadow="2"
     inkscape:pageopacity="0.0"
     inkscape:pagecheckerboard="0"
     inkscape:deskcolor="#d1d1d1"
     showgrid="true"
     inkscape:zoom="25.5"
     inkscape:cx="14.568627"
     inkscape:cy="18"
     inkscape:current-layer="g1474"><inkscape:grid
       type="xygrid"
       id="grid823" /></sodipodi:namedview><g
     fill="none"
     stroke="#00aad4"
     transform="matrix(1.4999917,0,0,1.4999917,6.6773543e-5,-0.9999834)"
     id="g294"><path
       d="m 0.75022518,9.2500421 -2.68e-4,-4.5000384 c 0,-1.250001 0.75013502,-2.0000016 2.00013602,-2.0000016 h 3.8499 c 1.5000014,0 2.0000115,0.7500006 2.0000115,2.0000016 V 5.4166871 H 23.250087 v 3.833355"
       id="path8"
       style="fill:none;stroke:#00aad4;stroke-width:1.5;stroke-linecap:round;stroke-linejoin:round"
       sodipodi:nodetypes="cccccccc" /><path
       d="M 23.25,12 V 9.4167077 H 0.75 V 21.25 h 8.5833405"
       stroke-linecap="round"
       id="path290"
       sodipodi:nodetypes="ccccc"
       style="stroke-width:1.5;stroke-linejoin:round" /><g
       id="g1474"
       transform="matrix(1.5000083,0,0,1.5000083,-4.4515207e-5,-0.83334901)"><circle
         style="fill:none;stroke-width:1;stroke-linecap:round;stroke-linejoin:round;stroke-dasharray:none;stroke-dashoffset:1.49998"
         id="path346"
         cx="11.5"
         cy="12.5"
         r="4" /><g
         id="g530"><path
           style="fill:none;stroke:#00aad4;stroke-width:1px;stroke-linecap:round;stroke-linejoin:miter;stroke-opacity:1"
           d="m 10,11 3,3"
           id="path1469"
           sodipodi:nodetypes="cc" /><path
           style="fill:none;stroke:#00aad4;stroke-width:1px;stroke-linecap:round;stroke-linejoin:miter;stroke-opacity:1"
           d="m 13,11 -3,3"
           id="path522"
           sodipodi:nodetypes="cc" /></g></g></g></svg>
