<?xml version="1.0" encoding="UTF-8" standalone="no"?>
<svg
   width="24"
   height="24"
   version="1.1"
   id="svg6"
   sodipodi:docname="File_18_24.svg"
   inkscape:export-filename="File_18_24.png"
   inkscape:export-xdpi="96"
   inkscape:export-ydpi="96"
   inkscape:version="1.2.1 (9c6d41e410, 2022-07-14)"
   xmlns:inkscape="http://www.inkscape.org/namespaces/inkscape"
   xmlns:sodipodi="http://sodipodi.sourceforge.net/DTD/sodipodi-0.dtd"
   xmlns="http://www.w3.org/2000/svg"
   xmlns:svg="http://www.w3.org/2000/svg">
  <defs
     id="defs10" />
  <sodipodi:namedview
     id="namedview8"
     pagecolor="#ffffff"
     bordercolor="#666666"
     borderopacity="1.0"
     inkscape:showpageshadow="2"
     inkscape:pageopacity="0.0"
     inkscape:pagecheckerboard="0"
     inkscape:deskcolor="#d1d1d1"
     showgrid="true"
     inkscape:zoom="38.25"
     inkscape:cx="12"
     inkscape:cy="12"
     inkscape:current-layer="svg6">
    <inkscape:grid
       type="xygrid"
       id="grid1192" />
  </sodipodi:namedview>
  <path
     d="M 3.6,0.60000006 H 15.054546 L 20.4,5.9200001 V 23.400001 H 3.6 Z"
     fill="none"
     stroke="#00aad4"
     stroke-width="1.5"
     id="path2"
     style="stroke-width:1.2;stroke-linecap:round;stroke-linejoin:round;stroke-dasharray:none" />
  <path
     d="M 14.6,0.60000002 V 6.3999994 l 5.8,9e-7"
     fill="none"
     stroke="#00aad4"
     stroke-width="1.5"
     id="path4"
     style="stroke-width:1.2;stroke-linecap:round;stroke-linejoin:round;stroke-dasharray:none" />
  <path
     style="fill:none;stroke:#00aad4;stroke-width:2;stroke-linecap:butt;stroke-linejoin:miter;stroke-dasharray:none;stroke-opacity:1"
     d="m 6,5 h 6"
     id="path1925" />
  <path
     style="fill:none;stroke:#00aad4;stroke-width:2;stroke-linecap:butt;stroke-linejoin:miter;stroke-dasharray:none;stroke-opacity:1"
     d="M 6,20 H 18"
     id="path2367"
     sodipodi:nodetypes="cc" />
  <path
     style="fill:none;stroke:#00aad4;stroke-width:1;stroke-linecap:butt;stroke-linejoin:miter;stroke-dasharray:none;stroke-opacity:1"
     d="M 6,17.5 H 18"
     id="path2418"
     sodipodi:nodetypes="cc" />
  <path
     style="fill:none;stroke:#00aad4;stroke-width:1;stroke-linecap:butt;stroke-linejoin:miter;stroke-dasharray:none;stroke-opacity:1"
     d="M 6,11.5 H 18"
     id="path2420"
     sodipodi:nodetypes="cc" />
  <path
     style="fill:none;stroke:#00aad4;stroke-width:1;stroke-linecap:butt;stroke-linejoin:miter;stroke-dasharray:none;stroke-opacity:1"
     d="M 6,13.5 H 18"
     id="path2422"
     sodipodi:nodetypes="cc" />
  <path
     style="fill:none;stroke:#00aad4;stroke-width:1;stroke-linecap:butt;stroke-linejoin:miter;stroke-dasharray:none;stroke-opacity:1"
     d="M 6,15.5 H 18"
     id="path2424"
     sodipodi:nodetypes="cc" />
  <path
     style="fill:none;stroke:#00aad4;stroke-width:1;stroke-linecap:butt;stroke-linejoin:miter;stroke-dasharray:none;stroke-opacity:1"
     d="m 6,7.5 h 6"
     id="path2426"
     sodipodi:nodetypes="cc" />
  <path
     style="fill:none;stroke:#00aad4;stroke-width:1;stroke-linecap:butt;stroke-linejoin:miter;stroke-dasharray:none;stroke-opacity:1"
     d="M 6,9.5 H 18"
     id="path2428"
     sodipodi:nodetypes="cc" />
</svg>
