<?xml version="1.0" encoding="UTF-8" standalone="no"?>
<svg
   height="24"
   width="24"
   version="1.1"
   id="svg2"
   sodipodi:docname="insertprintshort_150.svg"
   inkscape:export-filename="insertprintshort_150.png"
   inkscape:export-xdpi="96"
   inkscape:export-ydpi="96"
   inkscape:version="1.3.2 (091e20e, 2023-11-25, custom)"
   xmlns:inkscape="http://www.inkscape.org/namespaces/inkscape"
   xmlns:sodipodi="http://sodipodi.sourceforge.net/DTD/sodipodi-0.dtd"
   xmlns="http://www.w3.org/2000/svg"
   xmlns:svg="http://www.w3.org/2000/svg">
  <defs
     id="defs2" />
  <sodipodi:namedview
     id="namedview2"
     pagecolor="#ffffff"
     bordercolor="#000000"
     borderopacity="0.25"
     inkscape:showpageshadow="2"
     inkscape:pageopacity="0.0"
     inkscape:pagecheckerboard="0"
     inkscape:deskcolor="#d1d1d1"
     showgrid="true"
     inkscape:current-layer="svg2">
    <inkscape:grid
       id="grid2"
       units="px"
       originx="0"
       originy="0"
       spacingx="0.5"
       spacingy="0.5"
       empcolor="#0099e5"
       empopacity="0.30196078"
       color="#0099e5"
       opacity="0.14901961"
       empspacing="2"
       dotted="false"
       gridanglex="30"
       gridanglez="30"
       visible="true" />
  </sodipodi:namedview>
  <g
     fill="#2a7fff"
     stroke-width=".264583"
     id="g2">
    <path
       d="m2 5v15.000055h2.10939v-5.81838h2.95321c.894166 0 1.680496-.19009 2.361331-.568359.680879-.378267 1.203599-.912522 1.576185-1.599615.377009-.695296.56841-1.499352.56841-2.414073 0-.914722-.192766-1.718004-.56841-2.4140712-.37407-.6932102-.896775-1.2245908-1.576185-1.6054742-.682365-.3825358-1.467241-.5800808-2.361331-.5800808zm2.10939 2.0039134h3.023516c.453884 0 .849945.1104945 1.195319.3281273.342316.2156763.608311.5175213.796875.9082073.189811.393375.287086.843556.287086 1.35938 0 .508943-.0975.960143-.287086 1.353521-.188564.390693-.452984.695001-.796875.908212-.343905.2132-.741435.316403-1.195319.316403h-3.023516z"
       id="path1" />
    <path
       d="m17.455874 20.000097c-.658071 0-1.281709-.06735-1.870874-.202155-.589106-.134775-1.141271-.335589-1.654632-.606469-.508327-.268203-.984065-.60647-1.429023-1.010793l1.193979-1.576815c.520243.485178 1.093681.849058 1.720459 1.091649.626744.242589 1.306746.363878 2.040091.363878.990283 0 1.759503-.193107 2.303336-.586253.546822-.395274.768498-.958839.81797-1.677903.03375-.49011-.211772-.927307-.37608-1.22305-.191417-.344523-.558104-.546588-.958964-.667107-1.27663-.383846-2.667559-.622616-4.015525-1.020953-.582993-.172267-1.060727-.601831-1.466621-1.162404-.408867-.564763-.611151-1.376172-.611151-2.405668 0-.887661.234861-1.746067.56412-2.3349113.330416-.5908864.937019-1.1388139 1.664049-1.4757457.72705-.3369305 1.601368-.505397 2.622992-.505397.488804 0 .968239.058008 1.438409.1718368.476266.1152826.941549.2904219 1.400795.5154991.462026.226419.918145.5053935 1.363214.8490588l-1.090571 1.6374693c-.520237-.411058-1.04175-.7135788-1.560624-.9198119-.515278-.2048258-1.031001-.3133417-1.551223-.3133417-.933867 0-1.660512.2027621-2.181126.6064686-.513493.398189-.770928.91846-.770928 1.69812 0 .495569.190148.953484.394846 1.202833.242352.295257.591326.544932.996621.646904 1.344936.338353 2.696554.655962 4.081416 1.142088.574235.201589 1.014743.658921 1.391409 1.212942.510741.751297.564107 1.620845.564107 2.294447 0 .833798-.195951 1.665461-.592272 2.30459-.393369.634464-.968982 1.116969-1.720461 1.455531-.936694.42201-1.911339.495462-2.707738.495463z"
       id="path2" />
  </g>
</svg>
