<?xml version="1.0" encoding="UTF-8" standalone="no"?>
<svg
   width="24"
   height="24"
   version="1.1"
   viewBox="0 0 24 24"
   id="svg6"
   sodipodi:docname="tchartaxistransformations.svg"
   inkscape:version="1.3.2 (091e20e, 2023-11-25, custom)"
   xmlns:inkscape="http://www.inkscape.org/namespaces/inkscape"
   xmlns:sodipodi="http://sodipodi.sourceforge.net/DTD/sodipodi-0.dtd"
   xmlns="http://www.w3.org/2000/svg"
   xmlns:svg="http://www.w3.org/2000/svg">
  <defs
     id="defs6" />
  <sodipodi:namedview
     id="namedview6"
     pagecolor="#ffffff"
     bordercolor="#000000"
     borderopacity="0.25"
     inkscape:showpageshadow="2"
     inkscape:pageopacity="0.0"
     inkscape:pagecheckerboard="0"
     inkscape:deskcolor="#d1d1d1"
     showgrid="true"
     inkscape:current-layer="svg6">
    <inkscape:grid
       id="grid6"
       units="px"
       originx="0"
       originy="0"
       spacingx="0.5"
       spacingy="0.5"
       empcolor="#0099e5"
       empopacity="0.30196078"
       color="#0099e5"
       opacity="0.14901961"
       empspacing="2"
       dotted="false"
       gridanglex="30"
       gridanglez="30"
       visible="true" />
  </sodipodi:namedview>
  <rect
     x="1.25"
     y="1.25"
     width="21.5"
     height="21.5"
     fill="#ffffff"
     fill-rule="evenodd"
     stroke="#2a7efe"
     stroke-linecap="square"
     stroke-linejoin="round"
     stroke-width=".5"
     style="paint-order:normal"
     id="rect1" />
  <path
     d="m5.5 4.5v14h14"
     fill="none"
     stroke="#4d4d4d"
     stroke-linecap="round"
     stroke-linejoin="round"
     id="path1" />
  <path
     d="m10.5 6.5v7h7"
     fill="none"
     stroke="#4d4d4d"
     stroke-linecap="round"
     stroke-linejoin="round"
     id="path2" />
  <path
     d="m5.5 4.5-1 2h2l-1-2z"
     fill="#000000"
     stroke="#000000"
     stroke-linecap="round"
     stroke-linejoin="round"
     id="path3" />
  <path
     d="m10.5 6.5-1 2h2z"
     fill="#000000"
     stroke="#000000"
     stroke-linecap="round"
     stroke-linejoin="round"
     id="path4" />
  <path
     d="m17.5 13.5-2-1v2z"
     fill="#000000"
     stroke="#000000"
     stroke-linecap="round"
     stroke-linejoin="round"
     id="path5" />
  <path
     d="m19.5 18.5-2-1v2z"
     fill="#000000"
     stroke="#000000"
     stroke-linecap="round"
     stroke-linejoin="round"
     id="path6" />
</svg>
