<?xml version="1.0" encoding="UTF-8" standalone="no"?>
<svg
   height="36"
   width="36"
   version="1.1"
   id="svg597"
   sodipodi:docname="Grid_01_36.svg"
   inkscape:export-filename="Grid_01_36.png"
   inkscape:export-xdpi="96"
   inkscape:export-ydpi="96"
   inkscape:version="1.2-beta (1b65182ce9, 2022-04-05)"
   xmlns:inkscape="http://www.inkscape.org/namespaces/inkscape"
   xmlns:sodipodi="http://sodipodi.sourceforge.net/DTD/sodipodi-0.dtd"
   xmlns="http://www.w3.org/2000/svg"
   xmlns:svg="http://www.w3.org/2000/svg">
  <defs
     id="defs601" />
  <sodipodi:namedview
     id="namedview599"
     pagecolor="#ffffff"
     bordercolor="#666666"
     borderopacity="1.0"
     inkscape:pageshadow="2"
     inkscape:pageopacity="0.0"
     inkscape:pagecheckerboard="0"
     inkscape:deskcolor="#d1d1d1"
     showgrid="true"
     inkscape:zoom="25.5"
     inkscape:cx="18"
     inkscape:cy="18"
     inkscape:current-layer="svg597">
    <inkscape:grid
       type="xygrid"
       id="grid1093" />
  </sodipodi:namedview>
  <path
     d="m.765957.765957h34.468086v34.468086h-34.468086z"
     style="fill:#fff;stroke:#999;stroke-width:1.53192;stroke-linecap:round;stroke-linejoin:round;stroke-dashoffset:1.49998"
     id="path579" />
  <g
     fill="none"
     stroke="#b3b3b3"
     stroke-width="1.5"
     id="g595">
    <path
       d="m1.4999972 6.25h32.9999998"
       id="path581" />
    <path
       d="m12.25 1.499999v33"
       id="path583" />
    <path
       d="m34.499997 30.25h-32.9999998"
       id="path585" />
    <path
       d="m24.25 1.499999v33"
       id="path587" />
    <path
       d="m1.5 24.25h33"
       id="path589" />
    <path
       d="m1.5 18.25h33"
       id="path591" />
    <path
       d="m1.5 12.25h33"
       id="path593" />
  </g>
</svg>
