<svg width="48" height="48" version="1.1" viewBox="0 0 48 48" xmlns="http://www.w3.org/2000/svg">
 <path d="m35.699301 29.271653c1.091332 1.091116 1.984776 0.985166 3.075985-0.106082 1.091215-1.09123 1.462179-2.249646 0.371081-3.340996l-16.970798-16.971102c-1.088917-1.089168-2.252154-0.718015-3.341155 0.371241-1.091098 1.09135-1.197168 1.984635-0.106083 3.075985" fill="none" stroke="#1a8cff" stroke-linecap="round" stroke-width="2.25005"/>
 <path d="m18.728343 12.300699-3.182052 3.182052" fill="none" stroke="#1a8cff" stroke-linecap="round" stroke-width="2.25005"/>
 <path d="m35.699301 29.271653-3.182053 3.182056" fill="none" stroke="#1a8cff" stroke-linecap="round" stroke-width="2.25005"/>
 <path d="M 14.485608,33.514386 0,48" fill="none" stroke="#1a8cff" stroke-width="5.40012"/>
 <path d="m15.546291 15.482751c-10.606844 6.364105-7.424785 11.667533-1.06068 18.031638s11.667529 9.54616 18.031637-1.06068" fill="none" stroke="#1a8cff" stroke-linecap="round" stroke-width="2.25005"/>
 <path d="m32.517242 6.997277-5.303421 5.303422" fill="none" stroke="#1a8cff" stroke-linecap="round" stroke-width="4.5001"/>
 <path d="m41.002717 15.482751-5.303422 5.303422" fill="none" stroke="#1a8cff" stroke-linecap="round" stroke-width="4.5001"/>
</svg>
