<?xml version="1.0" encoding="UTF-8" standalone="no"?>
<svg
   width="48"
   height="48"
   version="1.1"
   viewBox="0 0 48 48"
   id="svg5"
   sodipodi:docname="tmaskedit_200.svg"
   inkscape:export-filename="tmaskedit_200.png"
   inkscape:export-xdpi="96"
   inkscape:export-ydpi="96"
   inkscape:version="1.3.2 (091e20e, 2023-11-25, custom)"
   xmlns:inkscape="http://www.inkscape.org/namespaces/inkscape"
   xmlns:sodipodi="http://sodipodi.sourceforge.net/DTD/sodipodi-0.dtd"
   xmlns="http://www.w3.org/2000/svg"
   xmlns:svg="http://www.w3.org/2000/svg">
  <defs
     id="defs5" />
  <sodipodi:namedview
     id="namedview5"
     pagecolor="#ffffff"
     bordercolor="#000000"
     borderopacity="0.25"
     inkscape:showpageshadow="2"
     inkscape:pageopacity="0.0"
     inkscape:pagecheckerboard="0"
     inkscape:deskcolor="#d1d1d1"
     showgrid="true"
     inkscape:current-layer="svg5">
    <inkscape:grid
       id="grid5"
       units="px"
       originx="0"
       originy="0"
       spacingx="0.5"
       spacingy="0.5"
       empcolor="#0099e5"
       empopacity="0.30196078"
       color="#0099e5"
       opacity="0.14901961"
       empspacing="2"
       dotted="false"
       gridanglex="30"
       gridanglez="30"
       visible="true" />
  </sodipodi:namedview>
  <rect
     x=".5"
     y="12.5"
     width="47"
     height="23"
     fill="#ffffff"
     stroke="#2a7efe"
     stroke-linecap="round"
     stroke-linejoin="round"
     style="paint-order:normal"
     id="rect1" />
  <path
     d="m40 18v12"
     fill="none"
     stroke="#4d4d4d"
     stroke-linecap="round"
     stroke-width="1.4"
     id="path1" />
  <path
     d="m38 17 2 1 2-1"
     fill="none"
     stroke="#4d4d4d"
     stroke-linecap="round"
     stroke-width="1.4"
     id="path2" />
  <path
     d="m38 31 2-1 2 1"
     fill="none"
     stroke="#4d4d4d"
     stroke-linecap="round"
     stroke-width="1.4"
     id="path3" />
  <circle
     cx="32"
     cy="24"
     r="4"
     fill="#808080"
     id="circle3" />
  <circle
     cx="10"
     cy="24"
     r="4"
     fill="#808080"
     id="circle4" />
  <circle
     cx="21"
     cy="24"
     r="4"
     fill="#808080"
     id="circle5" />
</svg>
