<?xml version="1.0" encoding="UTF-8" standalone="no"?>
<svg
   height="36"
   width="36"
   version="1.1"
   id="svg143"
   sodipodi:docname="Arrow_48_36.svg"
   inkscape:export-filename="Arrow_48_36.png"
   inkscape:export-xdpi="96"
   inkscape:export-ydpi="96"
   inkscape:version="1.2.2 (732a01da63, 2022-12-09)"
   xmlns:inkscape="http://www.inkscape.org/namespaces/inkscape"
   xmlns:sodipodi="http://sodipodi.sourceforge.net/DTD/sodipodi-0.dtd"
   xmlns="http://www.w3.org/2000/svg"
   xmlns:svg="http://www.w3.org/2000/svg">
  <defs
     id="defs147" />
  <sodipodi:namedview
     id="namedview145"
     pagecolor="#ffffff"
     bordercolor="#666666"
     borderopacity="1.0"
     inkscape:showpageshadow="2"
     inkscape:pageopacity="0.0"
     inkscape:pagecheckerboard="0"
     inkscape:deskcolor="#d1d1d1"
     showgrid="true"
     inkscape:zoom="25.5"
     inkscape:cx="16.039216"
     inkscape:cy="18"
     inkscape:current-layer="g141">
    <inkscape:grid
       type="xygrid"
       id="grid922" />
  </sodipodi:namedview>
  <g
     stroke="#2a7efe"
     stroke-linecap="round"
     stroke-linejoin="round"
     stroke-width="2"
     transform="matrix(1.5 0 0 1.5 -7.5 -6)"
     id="g141">
    <circle
       cx="17"
       cy="16"
       fill="#e0edff"
       fill-rule="evenodd"
       r="10.25"
       stroke-opacity=".954902"
       id="circle137"
       style="stroke:#2a7efe;stroke-opacity:1" />
    <path
       d="m 18.500001,20.500002 4.500001,-4.500001 -4.500001,-4.500003"
       stroke-linejoin="round"
       id="path1020"
       style="fill:none;stroke:#2a7efe;stroke-width:2"
       sodipodi:nodetypes="ccc" />
    <path
       d="M 23.000002,16.000001 H 10.999998"
       id="path1022"
       style="fill:none;stroke:#2a7efe;stroke-width:2"
       sodipodi:nodetypes="cc" />
  </g>
</svg>
