<?xml version="1.0" encoding="UTF-8" standalone="no"?>
<svg
   height="16"
   viewBox="0 0 4.2333332 4.2333335"
   width="16"
   version="1.1"
   id="svg2"
   sodipodi:docname="Flip_01_16.svg"
   inkscape:version="1.2 (dc2aedaf03, 2022-05-15)"
   xml:space="preserve"
   inkscape:export-filename="Flip_01_16.png"
   inkscape:export-xdpi="96"
   inkscape:export-ydpi="96"
   xmlns:inkscape="http://www.inkscape.org/namespaces/inkscape"
   xmlns:sodipodi="http://sodipodi.sourceforge.net/DTD/sodipodi-0.dtd"
   xmlns="http://www.w3.org/2000/svg"
   xmlns:svg="http://www.w3.org/2000/svg"><defs
     id="defs6" /><sodipodi:namedview
     id="namedview4"
     pagecolor="#ffffff"
     bordercolor="#666666"
     borderopacity="1.0"
     inkscape:showpageshadow="2"
     inkscape:pageopacity="0.0"
     inkscape:pagecheckerboard="0"
     inkscape:deskcolor="#d1d1d1"
     showgrid="true"
     inkscape:zoom="57.375"
     inkscape:cx="8"
     inkscape:cy="8"
     inkscape:current-layer="svg2"><inkscape:grid
       type="xygrid"
       id="grid1292" /></sodipodi:namedview><g
     id="g4774"
     transform="translate(0.26451083)"><path
       style="fill:none;stroke:#00aad4;stroke-width:0.264583px;stroke-linecap:round;stroke-linejoin:round;stroke-opacity:1"
       d="M 1.7197916,0.13229166 V 4.1010416 H 0.47492708 c -0.32211675,0 -0.43130566,-0.3726867 -0.26458333,-0.6614583 z"
       id="path353"
       sodipodi:nodetypes="ccccc" /><path
       style="fill:#00aad4;fill-opacity:1;stroke:#00aad4;stroke-width:0.264583px;stroke-linecap:round;stroke-linejoin:round;stroke-opacity:1"
       d="M 2.2489583,0.13229167 V 4.1010416 h 1.2448644 c 0.3221168,0 0.4313057,-0.3726867 0.2645834,-0.6614583 z"
       id="path1006"
       sodipodi:nodetypes="ccccc" /></g></svg>
