<?xml version="1.0" encoding="UTF-8" standalone="no"?>
<svg
   width="36"
   height="36"
   version="1.1"
   viewBox="0 0 36 36"
   id="svg3"
   sodipodi:docname="tfphttpwebclient_150.svg"
   inkscape:export-filename="tfphttpwebclient_150.png"
   inkscape:export-xdpi="96"
   inkscape:export-ydpi="96"
   inkscape:version="1.3.2 (091e20e, 2023-11-25, custom)"
   xmlns:inkscape="http://www.inkscape.org/namespaces/inkscape"
   xmlns:sodipodi="http://sodipodi.sourceforge.net/DTD/sodipodi-0.dtd"
   xmlns="http://www.w3.org/2000/svg"
   xmlns:svg="http://www.w3.org/2000/svg">
  <defs
     id="defs3" />
  <sodipodi:namedview
     id="namedview3"
     pagecolor="#ffffff"
     bordercolor="#000000"
     borderopacity="0.25"
     inkscape:showpageshadow="2"
     inkscape:pageopacity="0.0"
     inkscape:pagecheckerboard="0"
     inkscape:deskcolor="#d1d1d1"
     showgrid="true"
     inkscape:current-layer="svg3">
    <inkscape:grid
       id="grid3"
       units="px"
       originx="0"
       originy="0"
       spacingx="0.5"
       spacingy="0.5"
       empcolor="#0099e5"
       empopacity="0.30196078"
       color="#0099e5"
       opacity="0.14901961"
       empspacing="2"
       dotted="false"
       gridanglex="30"
       gridanglez="30"
       visible="true" />
  </sodipodi:namedview>
  <text
     x="-34"
     y="50.999969"
     font-size="18px"
     stroke-width="1.5"
     id="text1"><tspan
       x="-34"
       y="72.867157"
       stroke-width="1.5"
       id="tspan1" /></text>
  <path
     d="m18.5 5.5v17"
     fill="none"
     stroke="#008dd2"
     stroke-linecap="round"
     stroke-width="5"
     id="path1" />
  <path
     d="m25 16-6.5 6.5-6.5-6.5"
     fill="none"
     stroke="#008dd2"
     stroke-linecap="round"
     stroke-linejoin="round"
     stroke-width="5"
     id="path2" />
  <path
     d="m9.5 29.5h18"
     fill="none"
     stroke="#008dd2"
     stroke-linecap="round"
     stroke-width="5"
     id="path3" />
</svg>
