<?xml version="1.0" encoding="UTF-8" standalone="no"?>
<svg
   width="36"
   height="36"
   version="1.1"
   viewBox="0 0 36 36"
   id="svg14"
   sodipodi:docname="tsyndiffsyn_150.svg"
   inkscape:version="1.3.2 (091e20e, 2023-11-25, custom)"
   xmlns:inkscape="http://www.inkscape.org/namespaces/inkscape"
   xmlns:sodipodi="http://sodipodi.sourceforge.net/DTD/sodipodi-0.dtd"
   xmlns="http://www.w3.org/2000/svg"
   xmlns:svg="http://www.w3.org/2000/svg">
  <defs
     id="defs14" />
  <sodipodi:namedview
     id="namedview14"
     pagecolor="#ffffff"
     bordercolor="#000000"
     borderopacity="0.25"
     inkscape:showpageshadow="2"
     inkscape:pageopacity="0.0"
     inkscape:pagecheckerboard="0"
     inkscape:deskcolor="#d1d1d1"
     showgrid="true"
     inkscape:current-layer="svg14">
    <inkscape:grid
       id="grid14"
       units="px"
       originx="0"
       originy="0"
       spacingx="0.5"
       spacingy="0.5"
       empcolor="#0099e5"
       empopacity="0.30196078"
       color="#0099e5"
       opacity="0.14901961"
       empspacing="2"
       dotted="false"
       gridanglex="30"
       gridanglez="30"
       visible="true" />
  </sodipodi:namedview>
  <rect
     x="2.4999981"
     y="2.4999826"
     width="30.000004"
     height="31.000017"
     fill="#ffffff"
     fill-rule="evenodd"
     stroke="#2a7efe"
     stroke-linecap="square"
     stroke-linejoin="round"
     style="paint-order:normal"
     id="rect1" />
  <rect
     x="3"
     y="2.9999826"
     width="4"
     height="30.000017"
     fill="#b3b3b3"
     fill-rule="evenodd"
     style="paint-order:normal"
     id="rect2" />
  <path
     d="m10 6.25h16.775"
     fill="none"
     stroke="#666666"
     stroke-width="1.5"
     id="path2" />
  <path
     d="m13 9.25h6.1"
     fill="none"
     stroke="#666666"
     stroke-width="1.5"
     id="path3" />
  <path
     d="m16 12.25h9.15"
     fill="none"
     stroke="#666666"
     stroke-width="1.5"
     id="path4" />
  <path
     d="m13 15.25h3.05"
     fill="none"
     stroke="#666666"
     stroke-width="1.5"
     id="path5" />
  <path
     d="m10 18.25h6.099999"
     fill="none"
     stroke="#666666"
     stroke-width="1.5"
     id="path6" />
  <path
     d="m21 9.25h4.575"
     fill="none"
     stroke="#ff0000"
     stroke-width="1.5"
     id="path7" />
  <path
     d="m18 18.25h9.15"
     fill="none"
     stroke="#ff0000"
     stroke-width="1.5"
     id="path8" />
  <path
     d="m16 15.25h4.575"
     fill="none"
     stroke="#2a7fff"
     stroke-width="1.5"
     id="path9" />
  <path
     d="m20.5 15.25h3.05"
     fill="none"
     stroke="#666666"
     stroke-width="1.5"
     id="path10" />
  <path
     d="m17.40003 22.60003v7.799914"
     fill="none"
     stroke="#2c5aa0"
     stroke-linecap="round"
     stroke-linejoin="round"
     stroke-width="1.20006"
     id="path11" />
  <path
     d="m23.522863 26.499986h-2.922833m3.530469-3.899956h-3.530469v7.799914"
     fill="none"
     stroke="#2c5aa0"
     stroke-linecap="round"
     stroke-linejoin="round"
     stroke-width="1.20006"
     id="path12" />
  <path
     d="m29.522863 26.499986h-2.922833m3.530469-3.899956h-3.530469v7.799914"
     fill="none"
     stroke="#2c5aa0"
     stroke-linecap="round"
     stroke-linejoin="round"
     stroke-width="1.20006"
     id="path13" />
  <path
     d="m14.400271 26.50031c0 1.952741-0.900045 3.89966-2.850143 3.89966h-1.950098v-7.79994h1.950098c1.950098 0 2.850143 1.947539 2.850143 3.90028z"
     fill="none"
     stroke="#2c5aa0"
     stroke-linecap="round"
     stroke-linejoin="round"
     stroke-width="1.20006"
     id="path14" />
</svg>
