<?xml version="1.0" encoding="UTF-8" standalone="no"?>
<svg
   width="48"
   height="48"
   version="1.1"
   viewBox="0 0 48 48"
   id="svg19"
   sodipodi:docname="ttreefilteredit_200.svg"
   inkscape:version="1.3.2 (091e20e, 2023-11-25, custom)"
   xmlns:inkscape="http://www.inkscape.org/namespaces/inkscape"
   xmlns:sodipodi="http://sodipodi.sourceforge.net/DTD/sodipodi-0.dtd"
   xmlns="http://www.w3.org/2000/svg"
   xmlns:svg="http://www.w3.org/2000/svg">
  <sodipodi:namedview
     id="namedview19"
     pagecolor="#ffffff"
     bordercolor="#000000"
     borderopacity="0.25"
     inkscape:showpageshadow="2"
     inkscape:pageopacity="0.0"
     inkscape:pagecheckerboard="0"
     inkscape:deskcolor="#d1d1d1"
     showgrid="true"
     inkscape:current-layer="svg19">
    <inkscape:grid
       id="grid19"
       units="px"
       originx="0"
       originy="0"
       spacingx="0.5"
       spacingy="0.5"
       empcolor="#0099e5"
       empopacity="0.30196078"
       color="#0099e5"
       opacity="0.14901961"
       empspacing="2"
       dotted="false"
       gridanglex="30"
       gridanglez="30"
       visible="true" />
  </sodipodi:namedview>
  <defs
     id="defs9">
    <linearGradient
       id="b"
       x1="11"
       x2="21"
       y1="1032.3622"
       y2="1030.3622"
       gradientTransform="matrix(2.0714286,0,0,2.076923,2.892858,-2130.3676)"
       gradientUnits="userSpaceOnUse">
      <stop
         stop-color="#ffcc00"
         offset="0"
         id="stop1" />
      <stop
         stop-color="#fff6d5"
         offset=".33333102"
         id="stop2" />
      <stop
         stop-color="#ffcc00"
         offset="1"
         id="stop3" />
    </linearGradient>
    <linearGradient
       id="a"
       x1="13.775862"
       x2="17.224138"
       y1="1039.2141"
       y2="1039.2141"
       gradientTransform="matrix(2.0714286,0,0,2.076923,2.892858,-2130.3676)"
       gradientUnits="userSpaceOnUse">
      <stop
         stop-color="#ffcc00"
         offset="0"
         id="stop4" />
      <stop
         stop-color="#fff6d5"
         offset=".38293254"
         id="stop5" />
      <stop
         stop-color="#ffcc00"
         offset="1"
         id="stop6" />
    </linearGradient>
    <linearGradient
       id="c"
       x1="12.8125"
       x2="19"
       y1="1039.6122"
       y2="1039.6122"
       gradientTransform="matrix(2,0,0,2,2,-2068.7244)"
       gradientUnits="userSpaceOnUse">
      <stop
         stop-color="#c88e2c"
         offset="0"
         id="stop7" />
      <stop
         stop-color="#e6c790"
         offset=".41"
         id="stop8" />
      <stop
         stop-color="#c88e2c"
         offset="1"
         id="stop9" />
    </linearGradient>
  </defs>
  <rect
     x="2.5"
     y="2.4999826"
     width="43"
     height="43.000034"
     fill="#ffffff"
     stroke="#2a7efe"
     stroke-linecap="round"
     stroke-linejoin="round"
     style="paint-order:normal"
     id="rect9" />
  <rect
     x="6"
     y="7.9999828"
     width="8"
     height="4"
     fill="#d4aa00"
     style="paint-order:normal"
     id="rect10" />
  <rect
     x="6"
     y="5.9999828"
     width="4"
     height="2"
     fill="#ffd42a"
     style="paint-order:normal"
     id="rect11" />
  <rect
     x="22"
     y="37.999981"
     width="8"
     height="4"
     fill="#d4aa00"
     style="paint-order:normal"
     id="rect12" />
  <rect
     x="22"
     y="35.999981"
     width="4"
     height="2"
     fill="#ffd42a"
     style="paint-order:normal"
     id="rect13" />
  <rect
     x="14"
     y="15.999983"
     width="8"
     height="4"
     fill="#d4aa00"
     style="paint-order:normal"
     id="rect14" />
  <rect
     x="14"
     y="13.999983"
     width="4"
     height="2"
     fill="#ffd42a"
     style="paint-order:normal"
     id="rect15" />
  <path
     d="m9 12v5h5"
     fill="none"
     stroke="#999999"
     stroke-linejoin="round"
     stroke-width="2"
     id="path15" />
  <path
     d="m17 20v19h5"
     fill="none"
     stroke="#999999"
     stroke-linejoin="round"
     stroke-width="2"
     id="path16" />
  <rect
     x="14"
     y="28"
     width="8"
     height="4"
     fill="#d4aa00"
     style="paint-order:normal"
     id="rect16" />
  <rect
     x="14"
     y="26"
     width="4"
     height="2"
     fill="#ffd42a"
     style="paint-order:normal"
     id="rect17" />
  <path
     d="m22.5 10.6538 8.357144 11.8462h8.285712l8.357144-11.8462v-4.1538h-25z"
     fill="url(#b)"
     fill-rule="evenodd"
     stroke="#c88e2c"
     stroke-linecap="round"
     stroke-linejoin="round"
     id="path17" />
  <path
     d="m39.142856 22.5-1.142856 11h-6l-1.142856-11z"
     fill="url(#a)"
     fill-rule="evenodd"
     stroke="#c88e2c"
     stroke-linecap="round"
     stroke-linejoin="round"
     id="path18" />
  <path
     d="m23 10.5h24"
     fill="none"
     stroke="url(#c)"
     stroke-linecap="round"
     stroke-linejoin="round"
     id="path19" />
</svg>
