<?xml version="1.0" encoding="UTF-8" standalone="no"?>
<svg
   width="32"
   height="32"
   version="1.1"
   id="svg3660"
   sodipodi:docname="Time_08_32.svg"
   inkscape:export-filename="Time_08_32.png"
   inkscape:export-xdpi="96"
   inkscape:export-ydpi="96"
   inkscape:version="1.2.1 (9c6d41e410, 2022-07-14)"
   xmlns:inkscape="http://www.inkscape.org/namespaces/inkscape"
   xmlns:sodipodi="http://sodipodi.sourceforge.net/DTD/sodipodi-0.dtd"
   xmlns="http://www.w3.org/2000/svg"
   xmlns:svg="http://www.w3.org/2000/svg">
  <defs
     id="defs3664" />
  <sodipodi:namedview
     id="namedview3662"
     pagecolor="#ffffff"
     bordercolor="#666666"
     borderopacity="1.0"
     inkscape:showpageshadow="2"
     inkscape:pageopacity="0.0"
     inkscape:pagecheckerboard="0"
     inkscape:deskcolor="#d1d1d1"
     showgrid="true"
     inkscape:zoom="28.6875"
     inkscape:cx="14.222222"
     inkscape:cy="16"
     inkscape:current-layer="g3658">
    <inkscape:grid
       type="xygrid"
       id="grid4254" />
  </sodipodi:namedview>
  <g
     fill="none"
     stroke="#00aad4"
     id="g3658">
    <path
       d="m 16,10 0.005,9.0008 6.737719,0"
       stroke-width="1.9999"
       id="path3640"
       sodipodi:nodetypes="ccc" />
    <circle
       cx="6.999783"
       cy="28.999617"
       r="2.2498875"
       stroke-width="1.49993"
       id="circle3642"
       style="stroke-linecap:round;stroke-linejoin:round" />
    <circle
       cx="24.998882"
       cy="28.999617"
       r="2.2498875"
       stroke-width="1.49993"
       id="circle3644"
       style="stroke-linecap:round;stroke-linejoin:round" />
    <path
       d="m 18.584204,4.9530184 c 1.051587,-1.5978201 3.701015,-3.1616419 6.481476,-1.340593 2.780461,1.820989 2.39548,4.8677566 1.343892,6.4656766 z"
       id="path3650"
       style="stroke-width:1.59992" />
    <path
       d="M 13.414462,4.9530184 C 12.362875,3.3551983 9.7134473,1.7913765 6.9329863,3.6124254 4.1525254,5.4334144 4.5375061,8.480182 5.5890935,10.078102 Z"
       id="path3652"
       style="stroke-width:1.59992" />
    <circle
       cx="16.000132"
       cy="18.000166"
       r="10.99945"
       id="circle3646"
       style="stroke-width:1.9999;stroke-linecap:round;stroke-linejoin:round;stroke:#ff7f00;stroke-opacity:1" />
  </g>
</svg>
