<?xml version="1.0" encoding="UTF-8" standalone="no"?>
<svg
   height="36"
   width="36"
   version="1.1"
   id="svg163"
   sodipodi:docname="Window_08_36.svg"
   inkscape:export-filename="Window_08_36.png"
   inkscape:export-xdpi="96"
   inkscape:export-ydpi="96"
   inkscape:version="1.2.1 (9c6d41e410, 2022-07-14)"
   xmlns:inkscape="http://www.inkscape.org/namespaces/inkscape"
   xmlns:sodipodi="http://sodipodi.sourceforge.net/DTD/sodipodi-0.dtd"
   xmlns="http://www.w3.org/2000/svg"
   xmlns:svg="http://www.w3.org/2000/svg">
  <defs
     id="defs167" />
  <sodipodi:namedview
     id="namedview165"
     pagecolor="#ffffff"
     bordercolor="#666666"
     borderopacity="1.0"
     inkscape:pageshadow="2"
     inkscape:pageopacity="0.0"
     inkscape:pagecheckerboard="0"
     inkscape:deskcolor="#d1d1d1"
     showgrid="true"
     inkscape:zoom="25.5"
     inkscape:cx="14.137255"
     inkscape:cy="18"
     inkscape:current-layer="svg163"
     inkscape:showpageshadow="2">
    <inkscape:grid
       type="xygrid"
       id="grid903" />
  </sodipodi:namedview>
  <g
     id="path294"
     transform="matrix(1.4545455,0,0,1.4545455,-0.909091,-0.909092)">
    <path
       id="path377"
       style="color:#000000;fill:#00aad4;stroke-linecap:round;stroke-dashoffset:1.49998"
       d="M 2,3.3750006 V 24 H 24 V 3.3750006 Z m 1.5,3.4374999 h 19 V 22.5 h -19 z"
       sodipodi:nodetypes="cccccccccc" />
  </g>
  <path
     style="fill:none;stroke:#00aad4;stroke-width:2.8125;stroke-linecap:round;stroke-linejoin:round;stroke-dasharray:none;stroke-opacity:1"
     d="m 10.125,21.375 4.5,4.5 11.25,-11.25"
     id="path364" />
</svg>
