<?xml version="1.0" encoding="UTF-8" standalone="no"?>
<svg
   height="64"
   width="64"
   version="1.1"
   id="svg17"
   sodipodi:docname="Refresh_01_64.svg"
   inkscape:export-filename="Refresh_01_64.png"
   inkscape:export-xdpi="96"
   inkscape:export-ydpi="96"
   inkscape:version="1.2-beta (1b65182ce9, 2022-04-05)"
   xmlns:inkscape="http://www.inkscape.org/namespaces/inkscape"
   xmlns:sodipodi="http://sodipodi.sourceforge.net/DTD/sodipodi-0.dtd"
   xmlns:xlink="http://www.w3.org/1999/xlink"
   xmlns="http://www.w3.org/2000/svg"
   xmlns:svg="http://www.w3.org/2000/svg">
  <defs
     id="defs19" />
  <sodipodi:namedview
     id="namedview12"
     pagecolor="#ffffff"
     bordercolor="#666666"
     borderopacity="1.0"
     inkscape:pageshadow="2"
     inkscape:pageopacity="0.0"
     inkscape:pagecheckerboard="0"
     inkscape:deskcolor="#d1d1d1"
     showgrid="true"
     inkscape:zoom="14.34375"
     inkscape:cx="32"
     inkscape:cy="32"
     inkscape:current-layer="svg17">
    <inkscape:grid
       type="xygrid"
       id="grid139" />
  </sodipodi:namedview>
  <linearGradient
     id="a">
    <stop
       offset="0"
       stop-color="#80b3ff"
       id="stop4" />
    <stop
       offset="1"
       stop-color="#d5e5ff"
       id="stop6" />
  </linearGradient>
  <linearGradient
     id="b"
     gradientTransform="matrix(-2.0769231,0,0,-2.0685415,32.615385,33.014061)"
     gradientUnits="userSpaceOnUse"
     x1="10"
     x2="9"
     xlink:href="#a"
     y1="7"
     y2="2" />
  <linearGradient
     id="c"
     gradientTransform="matrix(2.0769231,0,0,2.0685415,-0.615385,-1.014061)"
     gradientUnits="userSpaceOnUse"
     x1="10"
     x2="9"
     xlink:href="#a"
     y1="7"
     y2="2" />
  <g
     fill-rule="evenodd"
     stroke="#3566a4"
     stroke-linejoin="round"
     stroke-opacity="0.988235"
     id="g15"
     transform="matrix(2,0,0,2,0,6.74997e-4)">
    <path
       d="M 29.5,20.602812 C 24.107891,25.366855 17.782645,26.597378 10.5,21.5 l 4,-4 h -12 v 12 l 4,-4 c 5.847756,5.172382 16.443526,7.129493 23,-4.897188 z"
       fill="url(#b)"
       id="path11"
       style="fill:url(#b)" />
    <path
       d="M 2.5000003,11.397188 C 7.8921093,6.633145 14.217355,5.402622 21.5,10.5 l -4,4 h 12 v -12 l -4,4 C 19.652244,1.327618 9.0564743,-0.629493 2.5000003,11.397188 Z"
       fill="url(#c)"
       id="path13"
       style="fill:url(#c)" />
  </g>
</svg>
