<?xml version="1.0" encoding="UTF-8" standalone="no"?>
<svg
   height="33"
   width="33"
   version="1.1"
   id="svg4870"
   sodipodi:docname="bookmark6_300.svg"
   inkscape:export-filename="bookmark6_300.png"
   inkscape:export-xdpi="96"
   inkscape:export-ydpi="96"
   inkscape:version="1.2.2 (732a01da63, 2022-12-09)"
   xmlns:inkscape="http://www.inkscape.org/namespaces/inkscape"
   xmlns:sodipodi="http://sodipodi.sourceforge.net/DTD/sodipodi-0.dtd"
   xmlns="http://www.w3.org/2000/svg"
   xmlns:svg="http://www.w3.org/2000/svg">
  <defs
     id="defs4874" />
  <sodipodi:namedview
     id="namedview4872"
     pagecolor="#ffffff"
     bordercolor="#666666"
     borderopacity="1.0"
     inkscape:showpageshadow="2"
     inkscape:pageopacity="0.0"
     inkscape:pagecheckerboard="0"
     inkscape:deskcolor="#d1d1d1"
     showgrid="true"
     inkscape:zoom="27.818182"
     inkscape:cx="16.5"
     inkscape:cy="16.5"
     inkscape:current-layer="svg4870">
    <inkscape:grid
       type="xygrid"
       id="grid4993" />
  </sodipodi:namedview>
  <radialGradient
     id="a"
     cx="16.5"
     cy="16.5"
     gradientUnits="userSpaceOnUse"
     r="16.5">
    <stop
       offset="0"
       stop-color="#4881cc"
       id="stop4859" />
    <stop
       offset=".81818181"
       stop-color="#4781cc"
       id="stop4861" />
    <stop
       offset="1"
       stop-color="#569af2"
       id="stop4863" />
  </radialGradient>
  <circle
     cx="16.5"
     cy="16.5"
     fill="url(#a)"
     r="16.5"
     id="circle4866" />
  <path
     d="m 16.494759,26.495971 c -2.280828,0.07344 -4.747072,-0.857949 -5.706033,-2.703016 -1.1749976,-2.113247 -0.8822279,-4.582307 -0.127634,-6.761144 0.777407,-1.977498 2.06276,-3.76789 3.119762,-5.64065 0.9687,-1.6303861 1.937378,-3.260776 2.906067,-4.8911622 h 3.524716 c -1.981282,3.2895534 -3.962585,6.5791142 -5.943901,9.8686682 -0.104806,-0.989371 1.142808,-1.586004 2.130116,-1.767164 2.038114,-0.301077 4.372365,0.352668 5.464335,1.916153 1.180184,1.59976 1.290603,3.592928 1.006915,5.418304 -0.294009,1.773989 -1.54882,3.534584 -3.612253,4.153311 -0.876983,0.290381 -1.823237,0.414562 -2.76223,0.406678 z m 0,-2.667942 c 1.497498,0.102577 2.970625,-0.891965 3.118579,-2.175802 0.302777,-1.3704 0.09827,-3.045332 -1.284908,-3.956432 -1.420599,-0.892721 -3.865281,-0.612715 -4.568451,0.875013 -0.654028,1.274192 -0.683289,2.81884 0.02305,4.079675 0.543527,0.793807 1.652622,1.220266 2.712065,1.177603 z"
     fill="#ffffff"
     stroke-width="0.999995"
     id="path4393"
     style="fill:#ffffff" />
</svg>
