<?xml version="1.0" encoding="UTF-8" standalone="no"?>
<svg
   height="24"
   width="24"
   version="1.1"
   id="svg1465"
   sodipodi:docname="File_17_24.svg"
   inkscape:version="1.2.1 (9c6d41e410, 2022-07-14)"
   inkscape:export-filename="File_17_24.png"
   inkscape:export-xdpi="96"
   inkscape:export-ydpi="96"
   xmlns:inkscape="http://www.inkscape.org/namespaces/inkscape"
   xmlns:sodipodi="http://sodipodi.sourceforge.net/DTD/sodipodi-0.dtd"
   xmlns:xlink="http://www.w3.org/1999/xlink"
   xmlns="http://www.w3.org/2000/svg"
   xmlns:svg="http://www.w3.org/2000/svg">
  <defs
     id="defs1469">
    <radialGradient
       id="a-0"
       cx="9.1740294"
       cy="7.8253603"
       gradientTransform="matrix(0.66909781,-2.2758851e-8,4.5190518e-8,0.58542853,1.8616763,4.291566)"
       gradientUnits="userSpaceOnUse"
       r="7.5"
       fx="9.1740294"
       fy="7.8253603">
      <stop
         offset="0"
         stop-color="#fff"
         id="stop2-7"
         style="stop-color:#ccddff;stop-opacity:1;" />
      <stop
         offset="1"
         stop-color="#8fc1c7"
         id="stop4-7"
         style="stop-color:#ffffff;stop-opacity:1" />
    </radialGradient>
    <linearGradient
       inkscape:collect="always"
       xlink:href="#a-0"
       id="linearGradient5852"
       x1="19"
       y1="22"
       x2="5"
       y2="2"
       gradientUnits="userSpaceOnUse" />
  </defs>
  <sodipodi:namedview
     id="namedview1467"
     pagecolor="#ffffff"
     bordercolor="#666666"
     borderopacity="1.0"
     inkscape:pageshadow="2"
     inkscape:pageopacity="0.0"
     inkscape:pagecheckerboard="0"
     inkscape:deskcolor="#d1d1d1"
     showgrid="true"
     inkscape:zoom="38.25"
     inkscape:cx="11.986928"
     inkscape:cy="12"
     inkscape:current-layer="svg1465"
     showguides="true"
     inkscape:showpageshadow="2">
    <inkscape:grid
       type="xygrid"
       id="grid1588" />
  </sodipodi:namedview>
  <path
     d="M 3.75,23.25 V 0.75 H 15 L 20.25,6 v 17.25 z"
     id="path1449"
     style="fill:url(#linearGradient5852);stroke:#b3b3b3;stroke-width:1.5;stroke-linecap:round;stroke-linejoin:round;stroke-opacity:1;fill-opacity:1"
     sodipodi:nodetypes="cccccc" />
  <path
     d="M 14.75,1 V 6.249999 H 20"
     id="path1453"
     style="fill:none;stroke:#b3b3b3;stroke-width:1.5;stroke-linecap:round;stroke-linejoin:round;stroke-opacity:1"
     sodipodi:nodetypes="ccc" />
  <g
     id="g2905"
     transform="matrix(1.186075,0,0,1.168687,-4.3491424,-3.9520737)"
     style="stroke-width:0.849366">
    <path
       style="fill:#ff5555;fill-opacity:1;stroke:#ffffff;stroke-width:1.01925;stroke-linecap:round;stroke-linejoin:bevel;stroke-dasharray:none;stroke-opacity:1"
       d="m 17.999979,23.407877 c 3.370025,-0.656424 5.39204,-3.282119 5.39204,-9.846361 -2.022015,0 -4.137404,-0.743226 -5.39204,-1.969275"
       id="path1107"
       sodipodi:nodetypes="ccc" />
    <path
       style="fill:#ffdd55;fill-opacity:1;stroke:#ffffff;stroke-width:1.01925;stroke-linecap:round;stroke-linejoin:bevel;stroke-dasharray:none;stroke-opacity:1"
       d="m 17.999979,11.592243 c -1.34801,1.31285 -3.370025,1.969273 -5.39204,1.969273 0,6.564242 1.989971,9.215241 5.39204,9.846361"
       id="path2905"
       sodipodi:nodetypes="ccc" />
  </g>
</svg>
