<?xml version="1.0" encoding="UTF-8" standalone="no"?>
<svg
   height="32"
   width="32"
   version="1.1"
   id="svg401"
   sodipodi:docname="Folder_17_32.svg"
   inkscape:export-filename="Folder_17_32.png"
   inkscape:export-xdpi="96"
   inkscape:export-ydpi="96"
   inkscape:version="1.2.2 (732a01da63, 2022-12-09)"
   xmlns:inkscape="http://www.inkscape.org/namespaces/inkscape"
   xmlns:sodipodi="http://sodipodi.sourceforge.net/DTD/sodipodi-0.dtd"
   xmlns="http://www.w3.org/2000/svg"
   xmlns:svg="http://www.w3.org/2000/svg">
  <defs
     id="defs405" />
  <sodipodi:namedview
     id="namedview403"
     pagecolor="#ffffff"
     bordercolor="#000000"
     borderopacity="0.25"
     inkscape:showpageshadow="2"
     inkscape:pageopacity="0.0"
     inkscape:pagecheckerboard="0"
     inkscape:deskcolor="#d1d1d1"
     showgrid="true"
     inkscape:zoom="28.4375"
     inkscape:cx="11.006593"
     inkscape:cy="16"
     inkscape:current-layer="svg401">
    <inkscape:grid
       type="xygrid"
       id="grid904" />
  </sodipodi:namedview>
  <g
     stroke="#00aad4"
     stroke-linejoin="round"
     stroke-width="1.6"
     transform="translate(0,-2)"
     id="g399">
    <path
       d="m 3.5,3.8 c -2,0 -2.7000004,1.8064945 -2.7000004,2.9429725 V 16.999998 H 31.2 V 8.7943785 C 31.2,7.6578995 30.296104,6.8 29.173333,6.8 H 12.299999 c 0,-1.136478 -0.459999,-3 -2.459999,-3 z"
       fill="#ebfcff"
       id="path395"
       sodipodi:nodetypes="ssccsscss" />
    <path
       d="M 2.8266663,14.8 H 10.84 c 0,-1.29665 1,-3 2.5,-3 h 15.134 c 1.526,0 2.72638,0.7 2.726333,2.5 L 31.2,27.148297 c -2.9e-5,1.136479 -0.903894,2.051406 -2.026667,2.051406 H 2.8266663 c -1.1227734,0 -2.0266667,-0.914927 -2.0266667,-2.051406 V 16.8 c 0,-1.136477 0.9038933,-2 2.0266667,-2 z"
       fill="#c2f3ff"
       id="path397"
       sodipodi:nodetypes="scsssssssss" />
  </g>
  <circle
     cx="23"
     cy="23"
     r="8.1999998"
     stroke-dashoffset="1.49998"
     stroke-linejoin="round"
     stroke-width="1.6"
     transform="matrix(0,1,1,0,0,0)"
     id="circle806"
     style="fill:#ffffff;stroke:#00aad4;stroke-linecap:round" />
  <path
     d="m 23,18.5 v 9"
     id="path808"
     style="fill:none;stroke:#00aad4;stroke-width:1.6;stroke-linecap:round;stroke-dasharray:none"
     sodipodi:nodetypes="cc" />
  <path
     d="m 27.5,23 h -9"
     id="path810"
     style="fill:none;stroke:#00aad4;stroke-width:1.6;stroke-linecap:round;stroke-dasharray:none"
     sodipodi:nodetypes="cc" />
</svg>
