<?xml version="1.0" encoding="UTF-8" standalone="no"?>
<svg
   height="48"
   width="48"
   version="1.1"
   id="svg459"
   sodipodi:docname="Print_05_48.svg"
   inkscape:export-filename="Print_05_48.png"
   inkscape:export-xdpi="96"
   inkscape:export-ydpi="96"
   inkscape:version="1.2.1 (9c6d41e410, 2022-07-14)"
   xmlns:inkscape="http://www.inkscape.org/namespaces/inkscape"
   xmlns:sodipodi="http://sodipodi.sourceforge.net/DTD/sodipodi-0.dtd"
   xmlns="http://www.w3.org/2000/svg"
   xmlns:svg="http://www.w3.org/2000/svg">
  <defs
     id="defs463" />
  <sodipodi:namedview
     id="namedview461"
     pagecolor="#ffffff"
     bordercolor="#666666"
     borderopacity="1.0"
     inkscape:showpageshadow="2"
     inkscape:pageopacity="0.0"
     inkscape:pagecheckerboard="0"
     inkscape:deskcolor="#d1d1d1"
     showgrid="true"
     inkscape:zoom="19.125"
     inkscape:cx="23.973856"
     inkscape:cy="24"
     inkscape:current-layer="svg459">
    <inkscape:grid
       type="xygrid"
       id="grid1004" />
  </sodipodi:namedview>
  <g
     fill="none"
     id="g457">
    <g
       stroke="#00aad4"
       stroke-width="3"
       id="g449">
      <path
         d="m11.5 19.5h-6v6"
         stroke-linejoin="round"
         id="path439" />
      <path
         d="m11.5 25v-21.5h25v13"
         id="path441" />
      <path
         d="m17 42.5h-15.5v-17h15"
         stroke-linecap="round"
         stroke-linejoin="round"
         id="path443" />
      <path
         d="m16 11.5h16"
         id="path445" />
      <path
         d="m16 17.5h8"
         id="path447" />
    </g>
    <g
       stroke="#ff7f00"
       stroke-width=".8"
       transform="scale(3)"
       id="g455">
      <path
         d="m8.7193521 6.9209069.3507038 1.3761786-.7721143.7723287-1.3779933-.3503947-.4178779 1.0088463 1.222155.7266222-.0001517 1.092086-1.2210901.72512.4179224 1.008955 1.3761786-.350704.7723287.772114-.3503946 1.377994 1.0088462.417877.7266221-1.222154 1.092086.000151.72512 1.22109 1.008955-.417922-.350704-1.376179.772114-.772329 1.377994.350395.417877-1.008846-1.222154-.726622.000151-1.092086 1.22109-.7251208-.417923-1.0089542-1.376178.3507038-.772329-.7721143.350395-1.3779934-1.008846-.4178778-.726623 1.2221549-1.092085-.0001517-.7251207-1.2210901z"
         id="path451" />
      <circle
         cx="11"
         cy="11"
         r="1.4"
         stroke-dashoffset="1.49998"
         id="circle453" />
    </g>
  </g>
</svg>
