<?xml version="1.0" encoding="UTF-8" standalone="no"?>
<svg
   height="22"
   width="22"
   version="1.1"
   id="svg153"
   sodipodi:docname="bookmark2_200.svg"
   inkscape:export-filename="bookmark2_200.png"
   inkscape:export-xdpi="96"
   inkscape:export-ydpi="96"
   inkscape:version="1.2.2 (732a01da63, 2022-12-09)"
   xmlns:inkscape="http://www.inkscape.org/namespaces/inkscape"
   xmlns:sodipodi="http://sodipodi.sourceforge.net/DTD/sodipodi-0.dtd"
   xmlns="http://www.w3.org/2000/svg"
   xmlns:svg="http://www.w3.org/2000/svg">
  <defs
     id="defs157" />
  <sodipodi:namedview
     id="namedview155"
     pagecolor="#ffffff"
     bordercolor="#666666"
     borderopacity="1.0"
     inkscape:showpageshadow="2"
     inkscape:pageopacity="0.0"
     inkscape:pagecheckerboard="0"
     inkscape:deskcolor="#d1d1d1"
     showgrid="true"
     inkscape:zoom="41.727273"
     inkscape:cx="10.988017"
     inkscape:cy="11"
     inkscape:current-layer="svg153">
    <inkscape:grid
       type="xygrid"
       id="grid672" />
  </sodipodi:namedview>
  <radialGradient
     id="a"
     cx="10.999999"
     cy="11"
     gradientUnits="userSpaceOnUse"
     r="11">
    <stop
       offset="0"
       stop-color="#4881cc"
       id="stop142" />
    <stop
       offset=".81818181"
       stop-color="#4781cc"
       id="stop144" />
    <stop
       offset="1"
       stop-color="#569af2"
       id="stop146" />
  </radialGradient>
  <circle
     cx="11"
     cy="11"
     fill="url(#a)"
     r="11"
     id="circle149" />
  <path
     d="m6.9999997 16.313765c1.6771231-2.241231 3.5451063-4.46879 5.2100243-6.7187898.554866-.8490195.968941-1.9970548.459613-2.9622898-.49619-.8277014-1.661793-.9366297-2.494145-.6196158-.7036986.2883107-1.0962388 1.037443-1.1611734 1.7646603-.6682129-.0063919-1.3620215.0127522-2.0143189-.0095244.1744328-1.4064744.9244491-2.8444055 2.2856505-3.4202763 1.1379948-.4810129 2.4692888-.4417678 3.6179888-.014589 1.166935.4174458 1.928969 1.585143 1.998062 2.7982326.172301 1.4720557-.551547 2.8626838-1.439456 3.9861212l-3.7128415 4.88231h5.2505965v1.999996h-8.0000003z"
     fill="#fff"
     stroke-width=".999995"
     id="path151" />
</svg>
