<?xml version="1.0" encoding="UTF-8" standalone="no"?>
<svg
   height="16"
   viewBox="0 0 16 16"
   width="16"
   version="1.1"
   id="svg6"
   sodipodi:docname="Return_01_16.svg"
   inkscape:export-filename="Return_01_16.png"
   inkscape:export-xdpi="96"
   inkscape:export-ydpi="96"
   inkscape:version="1.3.2 (091e20e, 2023-11-25, custom)"
   xmlns:inkscape="http://www.inkscape.org/namespaces/inkscape"
   xmlns:sodipodi="http://sodipodi.sourceforge.net/DTD/sodipodi-0.dtd"
   xmlns="http://www.w3.org/2000/svg"
   xmlns:svg="http://www.w3.org/2000/svg">
  <defs
     id="defs6" />
  <sodipodi:namedview
     id="namedview6"
     pagecolor="#ffffff"
     bordercolor="#000000"
     borderopacity="0.25"
     inkscape:showpageshadow="2"
     inkscape:pageopacity="0.0"
     inkscape:pagecheckerboard="0"
     inkscape:deskcolor="#d1d1d1"
     showgrid="true"
     inkscape:current-layer="svg6">
    <inkscape:grid
       id="grid6"
       units="px"
       originx="0"
       originy="0"
       spacingx="0.5"
       spacingy="0.5"
       empcolor="#0099e5"
       empopacity="0.30196078"
       color="#0099e5"
       opacity="0.14901961"
       empspacing="2"
       dotted="false"
       gridanglex="30"
       gridanglez="30"
       visible="true" />
  </sodipodi:namedview>
  <g
     fill="none"
     stroke-linecap="round"
     stroke-linejoin="round"
     id="g6">
    <g
       stroke="#d4aa00"
       id="g3">
      <path
         d="m1.5 2.5h13"
         id="path1" />
      <path
         d="m1.5 5.5h6"
         id="path2" />
      <path
         d="m1.5 13.5h13"
         id="path3" />
    </g>
    <g
       stroke="#2a7efe"
       stroke-width="1.25"
       id="g5">
      <path
         d="m11 5.5h1.5c2.661613 0 2.657648 4 0 4h-5"
         id="path4" />
      <path
         d="m9 7.5-2 2 2 2"
         id="path5" />
    </g>
  </g>
</svg>
