<?xml version="1.0" encoding="UTF-8" standalone="no"?>
<svg
   height="24"
   viewBox="0 0 6.3499998 6.3500003"
   width="24"
   version="1.1"
   id="svg6"
   sodipodi:docname="dddeleteobject_150.svg"
   inkscape:export-filename="dddeleteobject_150.png"
   inkscape:export-xdpi="96"
   inkscape:export-ydpi="96"
   inkscape:version="1.3-beta (cedbd6c6ff, 2023-05-28)"
   xmlns:inkscape="http://www.inkscape.org/namespaces/inkscape"
   xmlns:sodipodi="http://sodipodi.sourceforge.net/DTD/sodipodi-0.dtd"
   xmlns="http://www.w3.org/2000/svg"
   xmlns:svg="http://www.w3.org/2000/svg">
  <defs
     id="defs6" />
  <sodipodi:namedview
     id="namedview6"
     pagecolor="#ffffff"
     bordercolor="#000000"
     borderopacity="0.25"
     inkscape:showpageshadow="2"
     inkscape:pageopacity="0.0"
     inkscape:pagecheckerboard="0"
     inkscape:deskcolor="#d1d1d1"
     showgrid="true"
     inkscape:current-layer="svg6">
    <inkscape:grid
       id="grid6"
       units="px"
       originx="0"
       originy="0"
       spacingx="0.13229166"
       spacingy="0.13229167"
       empcolor="#0099e5"
       empopacity="0.30196078"
       color="#0099e5"
       opacity="0.14901961"
       empspacing="2"
       dotted="false"
       gridanglex="30"
       gridanglez="30"
       visible="true" />
  </sodipodi:namedview>
  <path
     d="M 1.1244793,1.5874997 1.4419794,6.151563 h 3.7306255 l 0.3175,-4.5640633"
     id="path1"
     style="fill:#ebfcff;stroke:#00aad4;stroke-width:0.396875;stroke-linecap:round;stroke-linejoin:round;fill-opacity:1" />
  <path
     d="M 0.72760431,1.5874997 C 2.4915562,1.2258993 4.1010425,1.190625 5.88698,1.5874997"
     id="path2"
     style="fill:#ebfcff;stroke:#00aad4;stroke-width:0.396875;stroke-linecap:round;stroke-linejoin:round;fill-opacity:1" />
  <path
     d="M 2.5135421,1.1906247 V 0.59531216 c 0.5953125,-0.19843757 0.9921875,-0.19843757 1.5875001,0 V 1.1906247"
     id="path3"
     style="fill:#ebfcff;stroke:#00aad4;stroke-width:0.396875;stroke-linecap:round;stroke-linejoin:round;fill-opacity:1" />
  <path
     d="M 3.3072918,2.1828122 V 5.3578125"
     id="path4"
     style="fill:none;stroke:#00aad4;stroke-width:0.396875;stroke-linecap:round;stroke-linejoin:round" />
  <path
     d="M 2.434167,5.3578128 2.196042,2.1828122"
     id="path5"
     style="fill:none;stroke:#00aad4;stroke-width:0.396875;stroke-linecap:round;stroke-linejoin:round" />
  <path
     d="M 4.1804173,5.3578128 4.4185423,2.1828122"
     id="path6"
     style="fill:none;stroke:#00aad4;stroke-width:0.396875;stroke-linecap:round;stroke-linejoin:round" />
</svg>
