<?xml version="1.0" encoding="UTF-8" standalone="no"?>
<svg
   height="32"
   width="32"
   version="1.1"
   id="svg1180"
   sodipodi:docname="Undo_02_32.svg"
   inkscape:export-filename="Undo_02_32.png"
   inkscape:export-xdpi="96"
   inkscape:export-ydpi="96"
   inkscape:version="1.2.1 (9c6d41e410, 2022-07-14)"
   xmlns:inkscape="http://www.inkscape.org/namespaces/inkscape"
   xmlns:sodipodi="http://sodipodi.sourceforge.net/DTD/sodipodi-0.dtd"
   xmlns="http://www.w3.org/2000/svg"
   xmlns:svg="http://www.w3.org/2000/svg">
  <defs
     id="defs1184" />
  <sodipodi:namedview
     id="namedview1182"
     pagecolor="#ffffff"
     bordercolor="#666666"
     borderopacity="1.0"
     inkscape:pageshadow="2"
     inkscape:pageopacity="0.0"
     inkscape:pagecheckerboard="0"
     inkscape:deskcolor="#d1d1d1"
     showgrid="true"
     inkscape:zoom="28.6875"
     inkscape:cx="14.291939"
     inkscape:cy="16"
     inkscape:current-layer="svg1180"
     inkscape:showpageshadow="2">
    <inkscape:grid
       type="xygrid"
       id="grid1303" />
  </sodipodi:namedview>
  <g
     fill="none"
     stroke="#00aad4"
     stroke-linecap="round"
     transform="matrix(1,0,0,-1,-6.000042,37.053624)"
     id="g1178">
    <path
       d="m 14.500042,10.683411 h 13.015286 c 4.615497,0 8.357096,3.747521 8.357096,8.370324 0,4.622803 -3.741599,8.370325 -8.357096,8.370325 H 9.485783"
       stroke-width="3.25935"
       id="path1174" />
    <path
       d="m 14.658419,20.973426 -6.526755,6.526754 6.526755,6.526754"
       stroke-linejoin="round"
       stroke-width="3.26338"
       id="path1176" />
  </g>
</svg>
