<svg width="16" height="16" version="1.1" xmlns="http://www.w3.org/2000/svg">
 <linearGradient id="a" x1="14.08446" x2="8.915541" y1="14.08446" y2="8.915541" gradientTransform="matrix(.9310458 0 0 .93104579 .792974 .792973)" gradientUnits="userSpaceOnUse">
  <stop stop-color="#009600" offset="0"/>
  <stop stop-color="#6edb39" offset="1"/>
 </linearGradient>
 <g stroke="#fff" stroke-linecap="round">
  <circle transform="matrix(0 1 1 0 0 0)" cx="11.5" cy="11.5" r="3.85" fill="url(#a)" stroke-dashoffset="1.49998" stroke-linejoin="round" stroke-width="1.3"/>
  <path d="m11.5 9.8v3.4" fill="none"/>
  <path d="m13.2 11.5h-3.4" fill="none"/>
 </g>
</svg>
