<?xml version="1.0" encoding="UTF-8" standalone="no"?>
<svg
   height="48"
   width="48"
   version="1.1"
   id="svg20"
   sodipodi:docname="Grid_01_48.svg"
   inkscape:export-filename="Grid_01_48.png"
   inkscape:export-xdpi="96"
   inkscape:export-ydpi="96"
   inkscape:version="1.2-beta (1b65182ce9, 2022-04-05)"
   xmlns:inkscape="http://www.inkscape.org/namespaces/inkscape"
   xmlns:sodipodi="http://sodipodi.sourceforge.net/DTD/sodipodi-0.dtd"
   xmlns="http://www.w3.org/2000/svg"
   xmlns:svg="http://www.w3.org/2000/svg">
  <defs
     id="defs24" />
  <sodipodi:namedview
     id="namedview22"
     pagecolor="#ffffff"
     bordercolor="#666666"
     borderopacity="1.0"
     inkscape:pageshadow="2"
     inkscape:pageopacity="0.0"
     inkscape:pagecheckerboard="0"
     inkscape:deskcolor="#d1d1d1"
     showgrid="true"
     inkscape:zoom="19.125"
     inkscape:cx="24"
     inkscape:cy="24"
     inkscape:current-layer="svg20">
    <inkscape:grid
       type="xygrid"
       id="grid1108" />
  </sodipodi:namedview>
  <path
     d="m1.021276 1.021276h45.957447v45.957447h-45.957447z"
     style="fill:#fff;stroke:#999;stroke-width:2.04256;stroke-linecap:round;stroke-linejoin:round;stroke-dashoffset:1.49998"
     id="path2" />
  <g
     fill="none"
     stroke="#b3b3b3"
     stroke-width="2"
     id="g18">
    <path
       d="m2 8h44"
       id="path4" />
    <path
       d="m16 2v44"
       id="path6" />
    <path
       d="m46 40h-44"
       id="path8" />
    <path
       d="m32 2v44"
       id="path10" />
    <path
       d="m2 16h44"
       id="path12" />
    <path
       d="m2 24h44"
       id="path14" />
    <path
       d="m2 32h44"
       id="path16" />
  </g>
</svg>
