<?xml version="1.0" encoding="UTF-8" standalone="no"?>
<svg
   height="128"
   viewBox="0 0 128 128"
   width="128"
   version="1.1"
   id="svg36"
   sodipodi:docname="lhelp128ico.svg"
   inkscape:export-filename="lhelp128ico.png"
   inkscape:export-xdpi="96"
   inkscape:export-ydpi="96"
   inkscape:version="1.2.2 (732a01da63, 2022-12-09)"
   xmlns:inkscape="http://www.inkscape.org/namespaces/inkscape"
   xmlns:sodipodi="http://sodipodi.sourceforge.net/DTD/sodipodi-0.dtd"
   xmlns="http://www.w3.org/2000/svg"
   xmlns:svg="http://www.w3.org/2000/svg">
  <defs
     id="defs40" />
  <sodipodi:namedview
     id="namedview38"
     pagecolor="#ffffff"
     bordercolor="#000000"
     borderopacity="0.25"
     inkscape:showpageshadow="2"
     inkscape:pageopacity="0.0"
     inkscape:pagecheckerboard="0"
     inkscape:deskcolor="#d1d1d1"
     showgrid="true"
     inkscape:zoom="7.109375"
     inkscape:cx="63.437363"
     inkscape:cy="64"
     inkscape:current-layer="svg36">
    <inkscape:grid
       type="xygrid"
       id="grid269" />
  </sodipodi:namedview>
  <linearGradient
     id="a"
     gradientTransform="matrix(4.0074596 0 0 3.9696702 2.202963 .010382)"
     gradientUnits="userSpaceOnUse"
     x1="14"
     x2="14"
     y1="25.5"
     y2="28">
    <stop
       offset="0"
       stop-color="#ccc"
       id="stop2" />
    <stop
       offset="1"
       stop-color="#fff"
       id="stop4" />
  </linearGradient>
  <linearGradient
     id="b"
     gradientTransform="matrix(4.0074596 0 0 3.9696702 312.38031 87.343126)"
     gradientUnits="userSpaceOnUse"
     x1="-48.723442"
     x2="-50.388226"
     y1="6.217586"
     y2="5.545676">
    <stop
       offset="0"
       stop-color="#e6e6e6"
       id="stop7" />
    <stop
       offset="1"
       stop-color="#999"
       id="stop9" />
  </linearGradient>
  <linearGradient
     id="c"
     gradientTransform="matrix(4.0074596 0 0 3.9696702 511.4057 260.02376)"
     gradientUnits="userSpaceOnUse"
     x1="-124.5"
     x2="-122"
     y1="-45"
     y2="-45">
    <stop
       offset="0"
       stop-color="#de7900"
       id="stop12" />
    <stop
       offset="1"
       stop-color="#ffa73e"
       id="stop14" />
  </linearGradient>
  <filter
     id="d"
     color-interpolation-filters="sRGB"
     height="1.3262179"
     width="1.1655315"
     x="-0.082765773"
     y="-0.16310893">
    <feGaussianBlur
       stdDeviation=".91328702"
       id="feGaussianBlur17" />
  </filter>
  <path
     d="m-156.92599-27.753407-.98846 11.086508c-.0293 1.835891 1.42426 2.329999 2.96539 2.351683h23.51721l-2.96539-13.438191z"
     filter="url(#d)"
     transform="matrix(4.0496454 0 0 3.96967 649.87584 176.12566)"
     id="path20" />
  <path
     d="m10.618625 111.16114 2.322628-42.673928c.641314-6.589759 6.011189-8.473882 12.022377-8.473882h88.15655l8.00585 40.00889"
     style="stroke:#b26f25;stroke-width:2.66794;stroke-linecap:round;stroke-linejoin:round;stroke-opacity:.994638;fill:url(#c)"
     id="path22" />
  <path
     d="m21.038022 100.02222 2.149392-39.742162"
     fill="none"
     stroke="#b26f24"
     stroke-linecap="round"
     stroke-width="2.66794"
     id="path24" />
  <path
     d="m119.79173 121.3603-2.66862-21.33808h-13.3431v21.33808z"
     fill="url(#b)"
     stroke-width=".500239"
     id="path26" />
  <path
     d="m120.42301 121.3603h-99.384988c-14.0261087 0-14.0261087-21.33808 0-21.33808h100.088008c-10.01865 0-10.72167 21.33808-.70302 21.33808z"
     fill="url(#a)"
     stroke="#b16e24"
     stroke-linecap="round"
     stroke-linejoin="round"
     stroke-width="2.66794"
     id="path28" />
  <g
     stroke-width=".06437"
     transform="matrix(7.7834239 0 0 7.7591018 4.468055 0)"
     id="g34">
    <path
       d="m8.3105469.00031511c-2.537633-.0276428-4.4634941 1.76733639-4.3769531 3.83398429.0705211 1.6840343 2.4303181 2.0124947 3.2226562.6777344.1920257-.3234833.3072321-.3935037.4277344-.4492187.1144373-.0529109.3043005-.0825054.5917968-.0976563-.0288471.0980763-.0275045.2139528-.1210937.3320313-.1596939.2014806-.5000412.4998214-.9257813.9492187-.5935864.6265705-.9667968 1.5033623-.9667968 2.4394532 0 .3347102.1821977.6361439.3515625.9316406-.5060249.4026403-.8858095.9435185-.8867188 1.5976564-.0018085 1.147413 1.0561962 2.160334 2.1855469 2.160156 1.1287398.000178 2.1862081-1.011556 2.1855469-2.158203-.0002444-.6231958-.3359313-1.162183-.8027344-1.5644532.1591075-.2615472.3548374-.511996.3652344-.8164062l-.015625.1523437c-.0005927.003471.0378318-.1089589.2617187-.3105469.2238874-.2015879.5824494-.4470116.9687504-.7304687a1.1371915 1.1371915 0 0 0 .06836-.052734c.744633-.6398864 1.77322-1.6539589 1.765624-3.1933597-.005765-1.1686188-.631117-2.1687129-1.451172-2.77929688-.820055-.61058399-1.8261975-.91074905-2.8476561-.92187501z"
       fill="#ffea00"
       stroke-linecap="round"
       stroke-linejoin="round"
       stroke-width=".032185"
       id="path30" />
    <path
       d="m8.861166 10.217886a1.0486588 1.0199205 0 0 1 -1.0486588 1.019921 1.0486588 1.0199205 0 0 1 -1.0486588-1.019921 1.0486588 1.0199205 0 0 1 1.0486588-1.0199201 1.0486588 1.0199205 0 0 1 1.0486588 1.0199201zm-.5616831-9.0815538c1.5914105.017334 3.1661121.9824109 3.1739451 2.5702028.0052 1.0537798-.667714 1.721712-1.37025 2.3254218-.7095675.5206617-1.5540027 1.0269181-1.6800399 1.7651019-.0293205.8584646-1.1249068.8853466-1.1249068-.1111285 0-.6719613.2350432-1.2134999.6571604-1.659073.7525532-.7943707 1.4063286-1.181938 1.442782-2.2565772.0239095-.7048451-.7655424-.9676919-1.2415753-.9468172-.7268286.0318725-1.4111655.1524246-1.9784674 1.1080921-.338247.5698056-1.0894832.3112079-1.1085216-.1434263-.0505611-1.2074278 1.2616452-2.6732366 3.2298735-2.6517964z"
       fill="#f50"
       id="path32" />
  </g>
</svg>
