<?xml version="1.0" encoding="UTF-8" standalone="no"?>
<svg
   height="24"
   viewBox="0 0 24 24"
   width="24"
   version="1.1"
   id="svg278"
   sodipodi:docname="Menu_01_24.svg"
   inkscape:export-filename="Menu_01_24.png"
   inkscape:export-xdpi="96"
   inkscape:export-ydpi="96"
   inkscape:version="1.2-beta (1b65182ce9, 2022-04-05)"
   xmlns:inkscape="http://www.inkscape.org/namespaces/inkscape"
   xmlns:sodipodi="http://sodipodi.sourceforge.net/DTD/sodipodi-0.dtd"
   xmlns="http://www.w3.org/2000/svg"
   xmlns:svg="http://www.w3.org/2000/svg">
  <defs
     id="defs282" />
  <sodipodi:namedview
     id="namedview280"
     pagecolor="#ffffff"
     bordercolor="#666666"
     borderopacity="1.0"
     inkscape:pageshadow="2"
     inkscape:pageopacity="0.0"
     inkscape:pagecheckerboard="0"
     inkscape:deskcolor="#d1d1d1"
     showgrid="true"
     inkscape:zoom="38.25"
     inkscape:cx="12"
     inkscape:cy="12"
     inkscape:current-layer="svg278">
    <inkscape:grid
       type="xygrid"
       id="grid777" />
  </sodipodi:namedview>
  <g
     fill="none"
     stroke="#00aad4"
     stroke-width="3"
     id="g276">
    <path
       d="m3 5.5h18"
       id="path270" />
    <path
       d="m3 12.5h18"
       id="path272" />
    <path
       d="m3 19.5h18"
       id="path274" />
  </g>
</svg>
