<?xml version="1.0" encoding="UTF-8" standalone="no"?>
<svg
   height="33"
   width="33"
   version="1.1"
   id="svg4962"
   sodipodi:docname="PendingBreakPoint_300.svg"
   inkscape:export-filename="PendingBreakPoint_300.png"
   inkscape:export-xdpi="96"
   inkscape:export-ydpi="96"
   inkscape:version="1.2.2 (732a01da63, 2022-12-09)"
   xmlns:inkscape="http://www.inkscape.org/namespaces/inkscape"
   xmlns:sodipodi="http://sodipodi.sourceforge.net/DTD/sodipodi-0.dtd"
   xmlns="http://www.w3.org/2000/svg"
   xmlns:svg="http://www.w3.org/2000/svg">
  <defs
     id="defs4966" />
  <sodipodi:namedview
     id="namedview4964"
     pagecolor="#ffffff"
     bordercolor="#666666"
     borderopacity="1.0"
     inkscape:showpageshadow="2"
     inkscape:pageopacity="0.0"
     inkscape:pagecheckerboard="0"
     inkscape:deskcolor="#d1d1d1"
     showgrid="true"
     inkscape:zoom="27.818182"
     inkscape:cx="16.482026"
     inkscape:cy="16.5"
     inkscape:current-layer="svg4962">
    <inkscape:grid
       type="xygrid"
       id="grid5085" />
  </sodipodi:namedview>
  <radialGradient
     id="a"
     cx="4"
     cy="4"
     gradientTransform="matrix(.00000012 3.8181819 -3.8181819 .00000007 27.272727 -3.272727)"
     gradientUnits="userSpaceOnUse"
     r="5.5">
    <stop
       offset="0"
       stop-color="#ff8080"
       id="stop4947" />
    <stop
       offset="1"
       stop-color="#f00"
       id="stop4949" />
  </radialGradient>
  <g
     stroke="#f00"
     stroke-linecap="round"
     stroke-linejoin="round"
     stroke-width="3"
     id="g4960">
    <circle
       cx="16.5"
       cy="16.5"
       fill="url(#a)"
       r="16.5"
       stroke="none"
       id="circle4952" />
    <g
       fill="none"
       stroke="#fff"
       stroke-linecap="butt"
       stroke-linejoin="miter"
       stroke-width="3"
       id="g4958">
      <path
         d="m19.5 8v17"
         id="path4954" />
      <path
         d="m13.5 8v17"
         id="path4956" />
    </g>
  </g>
</svg>
