<?xml version="1.0" encoding="UTF-8" standalone="no"?>
<svg
   height="48"
   width="48"
   version="1.1"
   id="svg1934"
   sodipodi:docname="Setup_06_48.svg"
   inkscape:export-filename="Setup_06_48.png"
   inkscape:export-xdpi="96"
   inkscape:export-ydpi="96"
   inkscape:version="1.2-beta (1b65182ce9, 2022-04-05)"
   xmlns:inkscape="http://www.inkscape.org/namespaces/inkscape"
   xmlns:sodipodi="http://sodipodi.sourceforge.net/DTD/sodipodi-0.dtd"
   xmlns="http://www.w3.org/2000/svg"
   xmlns:svg="http://www.w3.org/2000/svg">
  <defs
     id="defs1938" />
  <sodipodi:namedview
     id="namedview1936"
     pagecolor="#ffffff"
     bordercolor="#666666"
     borderopacity="1.0"
     inkscape:pageshadow="2"
     inkscape:pageopacity="0.0"
     inkscape:pagecheckerboard="0"
     inkscape:deskcolor="#d1d1d1"
     showgrid="true"
     inkscape:zoom="19.125"
     inkscape:cx="23.973856"
     inkscape:cy="24"
     inkscape:current-layer="svg1934">
    <inkscape:grid
       type="xygrid"
       id="grid2420" />
  </sodipodi:namedview>
  <path
     d="m 30.011955,2.1363967 -3.736264,6.5703319 -4.551162,0.00163 -3.737847,-6.5744147 -5.196268,2.1523649 2.005757,7.2918692 -3.219314,3.217005 -7.2878638,-2.003989 -2.1525953,5.196824 6.5703319,3.736264 0.00163,4.551163 -6.5744149,3.737844 2.1523647,5.19627 7.2918684,-2.005756 3.217002,3.219314 -2.003988,7.287862 5.196822,2.152595 3.736266,-6.570335 4.551162,-0.0016 3.73785,6.574417 5.196266,-2.152367 -2.005758,-7.29187 3.219314,-3.217002 7.287869,2.003992 2.152594,-5.196824 -6.570337,-3.736266 -0.0016,-4.551165 6.574415,-3.737845 -2.152364,-5.196268 -7.291873,2.005756 -3.217002,-3.219315 2.003988,-7.287863 z M 26.870115,17.07089 a 7.5000012,7.5000012 0 0 1 4.05897,9.799225 7.5000012,7.5000012 0 0 1 -9.799223,4.058972 7.5000012,7.5000012 0 0 1 -4.058971,-9.799225 7.5000012,7.5000012 0 0 1 9.799224,-4.058972 z"
     fill="none"
     stroke="#00aad4"
     stroke-linejoin="round"
     stroke-width="1.5"
     id="path1932"
     style="stroke-width:3;stroke-dasharray:none" />
</svg>
