<?xml version="1.0" encoding="UTF-8" standalone="no"?>
<svg
   height="64"
   width="64"
   version="1.1"
   id="svg695"
   sodipodi:docname="Search_06_64.svg"
   inkscape:export-filename="Search_06_64.png"
   inkscape:export-xdpi="96"
   inkscape:export-ydpi="96"
   inkscape:version="1.2.1 (9c6d41e410, 2022-07-14)"
   xmlns:inkscape="http://www.inkscape.org/namespaces/inkscape"
   xmlns:sodipodi="http://sodipodi.sourceforge.net/DTD/sodipodi-0.dtd"
   xmlns="http://www.w3.org/2000/svg"
   xmlns:svg="http://www.w3.org/2000/svg">
  <defs
     id="defs699" />
  <sodipodi:namedview
     id="namedview697"
     pagecolor="#ffffff"
     bordercolor="#666666"
     borderopacity="1.0"
     inkscape:showpageshadow="2"
     inkscape:pageopacity="0.0"
     inkscape:pagecheckerboard="0"
     inkscape:deskcolor="#d1d1d1"
     showgrid="true"
     inkscape:zoom="14.34375"
     inkscape:cx="30.989107"
     inkscape:cy="32"
     inkscape:current-layer="svg695">
    <inkscape:grid
       type="xygrid"
       id="grid818" />
  </sodipodi:namedview>
  <path
     d="M 47.4,25.999222 C 47.402,37.81712 37.820294,47.398444 26,47.398444 14.179708,47.398444 4.5980223,37.81712 4.6000003,25.999222 4.5980223,14.181324 14.179708,4.6 26,4.6 c 11.820294,0 21.40198,9.581324 21.4,21.399222 z"
     stroke-linejoin="round"
     stroke-width="3.2"
     id="path683"
     style="fill:none;stroke:#00aad4;stroke-linecap:round" />
  <path
     d="M 44,43.999064 58,58"
     stroke-width="10"
     id="path685"
     style="fill:none;stroke:#00aad4;stroke-linecap:round" />
  <path
     style="fill:none;stroke:#00aad4;stroke-width:2.5;stroke-linecap:butt;stroke-linejoin:round;stroke-dasharray:none;stroke-opacity:1"
     d="m 17.25,14.25 h 17.5 v 23.5 h -17.5 z"
     id="path914" />
  <path
     style="fill:none;stroke:#00aad4;stroke-width:2.00001;stroke-linecap:butt;stroke-linejoin:miter;stroke-dasharray:none;stroke-opacity:1"
     d="M 21,20.000005 H 31"
     id="path1545" />
  <path
     style="fill:none;stroke:#00aad4;stroke-width:2.00001;stroke-linecap:butt;stroke-linejoin:miter;stroke-dasharray:none;stroke-opacity:1"
     d="M 21,30.000005 H 31"
     id="path4021" />
  <path
     style="fill:none;stroke:#00aad4;stroke-width:2.00001;stroke-linecap:butt;stroke-linejoin:miter;stroke-dasharray:none;stroke-opacity:1"
     d="M 21,25.000005 H 31"
     id="path4023" />
</svg>
