<?xml version="1.0" encoding="UTF-8" standalone="no"?>
<svg
   width="24"
   height="24"
   viewBox="0 0 24 24"
   version="1.1"
   id="svg1"
   sodipodi:docname="tag_sup_150.svg"
   inkscape:version="1.3.2 (091e20e, 2023-11-25, custom)"
   inkscape:export-filename="tag_sup_150.png"
   inkscape:export-xdpi="96"
   inkscape:export-ydpi="96"
   xmlns:inkscape="http://www.inkscape.org/namespaces/inkscape"
   xmlns:sodipodi="http://sodipodi.sourceforge.net/DTD/sodipodi-0.dtd"
   xmlns="http://www.w3.org/2000/svg"
   xmlns:svg="http://www.w3.org/2000/svg">
  <defs
     id="defs1" />
  <sodipodi:namedview
     id="namedview1"
     pagecolor="#ffffff"
     bordercolor="#000000"
     borderopacity="0.25"
     inkscape:showpageshadow="2"
     inkscape:pageopacity="0.0"
     inkscape:pagecheckerboard="0"
     inkscape:deskcolor="#d1d1d1"
     showgrid="true"
     inkscape:current-layer="svg1">
    <inkscape:grid
       id="grid1"
       units="px"
       originx="0"
       originy="0"
       spacingx="0.5"
       spacingy="0.5"
       empcolor="#0099e5"
       empopacity="0.30196078"
       color="#0099e5"
       opacity="0.14901961"
       empspacing="2"
       dotted="false"
       gridanglex="30"
       gridanglez="30"
       visible="true" />
  </sodipodi:namedview>
  <g
     fill="#00aad4"
     id="g2"
     transform="scale(3.7795275)"
     style="fill:#008dd2;fill-opacity:1">
    <path
       d="M 5.0175585,1.6289691 5.7069294,0.73996429 C 5.7891668,0.63391279 5.8383802,0.47395643 5.7677437,0.34800515 5.7052854,0.23663397 5.5473721,0.22281067 5.4377276,0.26601988 5.3441116,0.30291218 5.2926774,0.40329022 5.2840856,0.49951308 5.1956706,0.49866732 5.1038679,0.50121208 5.0175584,0.49825308 5.0406384,0.31215353 5.1398669,0.1218657 5.3199871,0.04569478 5.4705513,-0.01797795 5.6463626,-0.01180279 5.7987058,0.04376238 5.9527648,0.09995305 6.0486868,0.2538881 6.063082,0.41401427 6.080641,0.60933306 5.987308,0.79062728 5.8726186,0.94144246 L 5.3813496,1.5874514 h 0.6947392 v 0.264632 h -1.05853 z"
       stroke-width="0.264583"
       id="path1"
       style="fill:#008dd2;fill-opacity:1" />
    <text
       stroke-linejoin="round"
       stroke-width="0.396875"
       x="-4.675056"
       y="2.711978"
       id="text1"
       style="fill:#008dd2;fill-opacity:1"><tspan
         stroke-width="0.396875"
         x="-4.675056"
         y="2.711978"
         id="tspan1"
         style="fill:#008dd2;fill-opacity:1" /></text>
    <path
       d="m 1.0970051,1.1191828 1.3660432,2.0209344 -1.4290566,2.0907 H 1.9296852 L 2.9041421,3.8062605 3.8380946,5.2308172 H 4.7337837 L 3.3227314,3.1716241 4.6707763,1.1191828 H 3.7705797 L 2.9018906,2.5302359 1.9971971,1.1191828 Z"
       stroke-width="0.264583"
       id="path2"
       style="fill:#008dd2;fill-opacity:1" />
  </g>
</svg>
