<?xml version="1.0" encoding="UTF-8" standalone="no"?>
<svg
   height="36"
   viewBox="0 0 36 36"
   width="36"
   version="1.1"
   id="svg500"
   sodipodi:docname="Import_01_36.svg"
   inkscape:version="1.3 (0e150ed6c4, 2023-07-21)"
   inkscape:export-filename="Import_01_36.png"
   inkscape:export-xdpi="96"
   inkscape:export-ydpi="96"
   xmlns:inkscape="http://www.inkscape.org/namespaces/inkscape"
   xmlns:sodipodi="http://sodipodi.sourceforge.net/DTD/sodipodi-0.dtd"
   xmlns="http://www.w3.org/2000/svg"
   xmlns:svg="http://www.w3.org/2000/svg">
  <defs
     id="defs504" />
  <sodipodi:namedview
     id="namedview502"
     pagecolor="#ffffff"
     bordercolor="#666666"
     borderopacity="1.0"
     inkscape:showpageshadow="2"
     inkscape:pageopacity="0.0"
     inkscape:pagecheckerboard="0"
     inkscape:deskcolor="#d1d1d1"
     showgrid="true"
     inkscape:zoom="25.5"
     inkscape:cx="18"
     inkscape:cy="18"
     inkscape:current-layer="svg500">
    <inkscape:grid
       id="grid1"
       units="px"
       originx="0"
       originy="0"
       spacingx="0.5"
       spacingy="0.5"
       empcolor="#0099e5"
       empopacity="0.30196078"
       color="#0099e5"
       opacity="0.14901961"
       empspacing="2"
       dotted="false"
       gridanglex="30"
       gridanglez="30"
       visible="true" />
  </sodipodi:namedview>
  <rect
     fill="#f5f7ff"
     height="30.299997"
     rx="2.0874579"
     stroke="#00aad4"
     stroke-linejoin="round"
     stroke-width="1.7"
     width="25.299999"
     x="7.8499999"
     y="2.8500021"
     id="rect516" />
  <path
     d="M 8.4999981,3.5000001 H 32.499998 V 7.7000002 H 8.4999981 Z"
     fill="#00aad4"
     fill-rule="evenodd"
     stroke-width="2.24998"
     id="path518" />
  <path
     d="M 3.3750002,19 H 23.624999"
     id="path10"
     style="fill:none;stroke:#f5f7ff;stroke-width:6.75;stroke-linecap:round;stroke-linejoin:round;stroke-dasharray:none;stroke-opacity:1" />
  <path
     d="M 18.000069,24.624999 23.625069,19 l -5.625,-5.625"
     id="path11"
     style="fill:none;stroke:#f5f7ff;stroke-width:6.75;stroke-linecap:round;stroke-linejoin:round;stroke-dasharray:none;stroke-opacity:1" />
  <path
     d="M 3.3750002,19 H 23.624999"
     id="path411"
     style="fill:none;stroke:#ccaa00;stroke-width:2.25;stroke-linecap:round;stroke-linejoin:round;stroke-opacity:1" />
  <path
     d="M 18.000069,24.624999 23.625069,19 l -5.625,-5.625"
     id="path413"
     style="fill:none;stroke:#ccaa00;stroke-width:2.25;stroke-linecap:round;stroke-linejoin:round;stroke-opacity:1" />
</svg>
