<?xml version="1.0" encoding="UTF-8" standalone="no"?>
<svg
   height="48"
   viewBox="0 0 12.7 12.7"
   width="48"
   version="1.1"
   id="svg813"
   sodipodi:docname="Secure_05_48.svg"
   inkscape:version="1.2.2 (732a01da63, 2022-12-09)"
   xmlns:inkscape="http://www.inkscape.org/namespaces/inkscape"
   xmlns:sodipodi="http://sodipodi.sourceforge.net/DTD/sodipodi-0.dtd"
   xmlns="http://www.w3.org/2000/svg"
   xmlns:svg="http://www.w3.org/2000/svg">
  <defs
     id="defs817" />
  <sodipodi:namedview
     id="namedview815"
     pagecolor="#ffffff"
     bordercolor="#000000"
     borderopacity="0.25"
     inkscape:showpageshadow="2"
     inkscape:pageopacity="0.0"
     inkscape:pagecheckerboard="0"
     inkscape:deskcolor="#d1d1d1"
     showgrid="true"
     inkscape:zoom="18.958333"
     inkscape:cx="24"
     inkscape:cy="24"
     inkscape:current-layer="svg813">
    <inkscape:grid
       type="xygrid"
       id="grid936" />
  </sodipodi:namedview>
  <linearGradient
     id="a"
     gradientTransform="matrix(2.9864783 0 0 3.0535776 .028619 -.24816)"
     gradientUnits="userSpaceOnUse"
     x1="1.499774"
     x2="3.614834"
     y1="1.322335"
     y2="2.204926">
    <stop
       offset="0"
       stop-color="#80b5fe"
       id="stop781" />
    <stop
       offset="1"
       stop-color="#2a7efe"
       id="stop783" />
  </linearGradient>
  <linearGradient
     id="b"
     gradientTransform="matrix(2.9864783 0 0 3.0535776 .028619 -.24816)"
     gradientUnits="userSpaceOnUse"
     x1=".530372"
     x2="3.879216"
     y1="1.145817"
     y2="2.557962">
    <stop
       offset="0"
       stop-color="#e7c962"
       id="stop786" />
    <stop
       offset="1"
       stop-color="#d4a41c"
       id="stop788" />
  </linearGradient>
  <filter
     id="c"
     color-interpolation-filters="sRGB"
     height="1.2100826"
     width="1.1901199"
     x="-0.095059939"
     y="-0.11882494">
    <feGaussianBlur
       stdDeviation=".15209612"
       id="feGaussianBlur791" />
  </filter>
  <linearGradient
     id="d"
     gradientTransform="matrix(2.3271349 0 0 -2.0428193 -97.142922 54.199604)"
     gradientUnits="userSpaceOnUse"
     x1="52.5"
     x2="61.5"
     y1="7"
     y2="7">
    <stop
       offset="0"
       stop-color="#fc0"
       id="stop794" />
    <stop
       offset=".37840304"
       stop-color="#f9f9f9"
       id="stop796" />
    <stop
       offset="1"
       stop-color="#ffd42a"
       id="stop798" />
  </linearGradient>
  <g
     stroke-linejoin="round"
     id="g811">
    <path
       d="m1.3493748 7.0237627-.0000002-4.8511068c1.5791444 0 3.6846709-.8085178 5.0006252-1.61703573 1.3159536.80851793 3.4214796 1.61703573 5.0006252 1.61703573v4.8511068c0 1.8919533-2.6319087 4.8511063-5.0006252 5.1206123-2.3687172-.269506-5.000625-3.228659-5.000625-5.1206123z"
       fill="url(#a)"
       stroke="url(#b)"
       stroke-linecap="round"
       stroke-width=".582083"
       id="path801" />
    <g
       transform="scale(.26458333)"
       id="g809">
      <path
         d="m27.500007 32v-5.102345c0-4.696581 3.805579-8.50391 8.5-8.50391 4.694422 0 8.500001 3.807331 8.500001 8.50391v5.102345"
         fill="none"
         stroke="#b3b3b3"
         stroke-width="3.00002"
         id="path803" />
      <path
         d="m7.5 11.321773v-1.4999996c0-1.380712 1.119288-2.5 2.5-2.5s2.5 1.119288 2.5 2.5v1.4999996"
         fill="none"
         filter="url(#c)"
         stroke="#fff"
         stroke-width=".220538"
         transform="matrix(3.4000006 0 0 3.401563 2.000004 -6.511727)"
         id="path805" />
      <path
         d="m47.25 47.25v-14.500002h-22.500001v14.500002z"
         fill="url(#d)"
         stroke="#d4aa00"
         stroke-linecap="round"
         stroke-width="1.5"
         id="path807" />
    </g>
  </g>
</svg>
