<svg width="32" height="32" version="1.1" xmlns="http://www.w3.org/2000/svg">
 <path d="m16.375 17.398438c-4.165856 0-8.4300804 0.748947-10.714844 2.621094a0.70006998 0.70006998 0 0 0-0.01172 0.0078c-1.1101844 0.9463-1.670312 2.19379-1.9179674 3.695324s-0.2304688 3.291928-0.2304688 5.578126a0.70006998 0.70006998 0 0 0 0.6992188 0.699218h16.009765a2.95 2.95 0 0 1 0.28711-1.398438h-3.240235l1.939453-7.945312 1.277344-1.548828c0.50925 0.08065 1.000898 0.175014 1.460938 0.287109 1.60395 0.390827 2.842396 0.998081 3.429688 1.632813 0.18178 0.225188 0.338384 0.438456 0.482422 0.646484l0.654296 0.654296 0.867188-0.867186c-0.25513-0.441772-0.55929-0.88319-0.929688-1.339844a0.70006998 0.70006998 0 0 0-0.02734-0.03126c-0.917856-1.002755-2.389122-1.626944-4.144536-2.054678-1.755416-0.427733-3.807696-0.636719-5.890624-0.636718zm-4.757812 1.824218 1.248046 1.433594 1.939454 7.945312h-9.8789068c0.00206-1.869964-0.00384-3.512006 0.183594-4.648438 0.215397-1.305952 0.6084154-2.137726 1.4492186-2.855468 1.0211326-0.832596 2.8852312-1.481695 5.0585942-1.875z" fill="#00aad4" fill-rule="evenodd" stroke-linecap="round" stroke-linejoin="round" stroke-width="2"/>
 <ellipse cx="15.999478" cy="10.714751" rx="6.0683937" ry="7.3832588" fill="none" stroke="#00aad4" stroke-linecap="square" stroke-linejoin="round" stroke-width="1.4" style="paint-order:normal"/>
 <path d="m9.4249268 10.340587s1.7221362-3.2131878 3.1475112-1.9265472c4.138873 3.7355772 5.488596-3.942501 10.003528 1.9265472 1.64388-5.836021-2.57077-9.4727836-6.459546-8.020991-4.149611-1.3862066-8.3353734 3.0186876-6.6914932 8.020991z" fill="#00aad4" fill-rule="evenodd" stroke-width="2"/>
 <path d="m23.141242 29.858758 6.717516-6.717516" fill="none" stroke="#00aad4" stroke-linecap="round" stroke-width="2.5"/>
 <path d="m29.858758 29.858758-6.717516-6.717516" fill="none" stroke="#00aad4" stroke-linecap="round" stroke-width="2.5"/>
</svg>
