<?xml version="1.0" encoding="UTF-8" standalone="no"?>
<svg
   width="36"
   height="36"
   version="1.1"
   viewBox="0 0 36 36"
   id="svg10"
   sodipodi:docname="tcolorlistbox_150.svg"
   inkscape:export-filename="tcolorlistbox_150.png"
   inkscape:export-xdpi="96"
   inkscape:export-ydpi="96"
   inkscape:version="1.3.2 (091e20e, 2023-11-25, custom)"
   xmlns:inkscape="http://www.inkscape.org/namespaces/inkscape"
   xmlns:sodipodi="http://sodipodi.sourceforge.net/DTD/sodipodi-0.dtd"
   xmlns="http://www.w3.org/2000/svg"
   xmlns:svg="http://www.w3.org/2000/svg">
  <defs
     id="defs10" />
  <sodipodi:namedview
     id="namedview10"
     pagecolor="#ffffff"
     bordercolor="#000000"
     borderopacity="0.25"
     inkscape:showpageshadow="2"
     inkscape:pageopacity="0.0"
     inkscape:pagecheckerboard="0"
     inkscape:deskcolor="#d1d1d1"
     showgrid="true"
     inkscape:current-layer="svg10">
    <inkscape:grid
       id="grid10"
       units="px"
       originx="0"
       originy="0"
       spacingx="0.5"
       spacingy="0.5"
       empcolor="#0099e5"
       empopacity="0.30196078"
       color="#0099e5"
       opacity="0.14901961"
       empspacing="2"
       dotted="false"
       gridanglex="30"
       gridanglez="30"
       visible="true" />
  </sodipodi:namedview>
  <rect
     x="4.5"
     y="4.5"
     width="27"
     height="27"
     fill="#f9f9f9"
     stroke="#2a7efe"
     style="stroke-width:1;paint-order:normal"
     id="rect1" />
  <path
     d="m13 15.25h10"
     fill="none"
     stroke="#b3b3b3"
     stroke-width="1.5"
     id="path1" />
  <path
     d="m13 9.25h10"
     fill="none"
     stroke="#b3b3b3"
     stroke-width="1.5"
     id="path2" />
  <path
     d="m13 21.25h10"
     fill="none"
     stroke="#b3b3b3"
     stroke-width="1.5"
     id="path3" />
  <path
     d="m13 27.25h10"
     fill="none"
     stroke="#b3b3b3"
     stroke-width="1.5"
     id="path4" />
  <rect
     x="7"
     y="7"
     width="4"
     height="4"
     fill="#ff6600"
     style="paint-order:normal"
     id="rect4" />
  <rect
     x="7"
     y="25"
     width="4"
     height="4"
     fill="#37c837"
     style="paint-order:normal"
     id="rect5" />
  <rect
     x="7"
     y="19"
     width="4"
     height="4"
     fill="#ff0000"
     style="paint-order:normal"
     id="rect6" />
  <rect
     x="7"
     y="13"
     width="4"
     height="4"
     fill="#0066ff"
     style="paint-order:normal"
     id="rect7" />
  <rect
     x="26.5"
     y="4.5"
     width="5"
     height="27"
     fill="#e6e6e6"
     stroke="#2a7efe"
     stroke-width="1"
     style="paint-order:normal"
     id="rect8" />
  <path
     style="fill:#e6e6e6;fill-opacity:1;stroke:#2a7efe;stroke-width:1.5;stroke-linecap:round;stroke-linejoin:round;stroke-dasharray:none;stroke-opacity:1"
     d="m 29,8.5 v 9"
     id="path5" />
</svg>
