<?xml version="1.0" encoding="UTF-8" standalone="no"?>
<svg
   height="40"
   width="40"
   version="1.1"
   id="svg5"
   sodipodi:docname="lazdatadesktop_40.svg"
   inkscape:export-filename="lazdatadesktop_40.png"
   inkscape:export-xdpi="96"
   inkscape:export-ydpi="96"
   inkscape:version="1.3-beta (cedbd6c6ff, 2023-05-28)"
   xmlns:inkscape="http://www.inkscape.org/namespaces/inkscape"
   xmlns:sodipodi="http://sodipodi.sourceforge.net/DTD/sodipodi-0.dtd"
   xmlns="http://www.w3.org/2000/svg"
   xmlns:svg="http://www.w3.org/2000/svg">
  <defs
     id="defs5" />
  <sodipodi:namedview
     id="namedview5"
     pagecolor="#ffffff"
     bordercolor="#000000"
     borderopacity="0.25"
     inkscape:showpageshadow="2"
     inkscape:pageopacity="0.0"
     inkscape:pagecheckerboard="0"
     inkscape:deskcolor="#d1d1d1"
     showgrid="true"
     inkscape:current-layer="g5">
    <inkscape:grid
       id="grid5"
       units="px"
       originx="0"
       originy="0"
       spacingx="0.5"
       spacingy="0.5"
       empcolor="#0099e5"
       empopacity="0.30196078"
       color="#0099e5"
       opacity="0.14901961"
       empspacing="2"
       dotted="false"
       gridanglex="30"
       gridanglez="30"
       visible="true" />
  </sodipodi:namedview>
  <g
     stroke-linejoin="round"
     id="g5">
    <g
       stroke-width="2.5"
       id="g4">
      <rect
         fill="#fff"
         height="37.5"
         ry="5.75"
         stroke="#fff"
         width="29.499998"
         x="3.25"
         y="1.25"
         id="rect1" />
      <g
         fill="none"
         stroke="#000"
         id="g3">
        <rect
           height="33.5"
           ry="3.865385"
           width="25.5"
           x="5.25"
           y="3.25"
           id="rect2" />
        <path
           d="m5 13.25h26"
           id="path2" />
        <path
           d="m5 24.25h26"
           id="path3" />
      </g>
    </g>
    <path
       d="m31.205933 27.999998a3.2059331 3.2059331 0 0 1 -3.205933 3.205934 3.2059331 3.2059331 0 0 1 -3.205934-3.205934 3.2059331 3.2059331 0 0 1 3.205934-3.205934 3.2059331 3.2059331 0 0 1 3.205933 3.205934zm-8.428508-9.340928.803096 3.151383-1.768106 1.768597-3.155538-.802389-.956921 2.310211 2.798677 1.66393-.000348 2.500824-2.796238 1.660491.957023 2.310458 3.151383-.803095 1.768597 1.768104-.802388 3.15554 2.31021.956919 1.66393-2.798674 2.500824.000346 1.660491 2.796237 2.310458-.957021-.803095-3.151385 1.768104-1.768595 3.15554.802387.956919-2.310209-2.798674-1.66393.000346-2.500825 2.796237-1.660492-.957023-2.310457-3.151383.803096-1.768595-1.768106.802387-3.155539-2.310209-.95692-1.663932 2.798677-2.500823-.000348-1.660492-2.796238z"
       fill="#00aad4"
       stroke="#fffffe"
       stroke-dashoffset="1.49998"
       stroke-width="3.4"
       id="path4"
       style="paint-order:stroke fill markers" />
  </g>
</svg>
