<?xml version="1.0" encoding="UTF-8" standalone="no"?>
<svg
   height="32"
   width="32"
   version="1.1"
   id="svg304"
   sodipodi:docname="menu_build_file_200.svg"
   inkscape:export-filename="menu_build_file_200.png"
   inkscape:export-xdpi="96"
   inkscape:export-ydpi="96"
   inkscape:version="1.2.2 (732a01da63, 2022-12-09)"
   xmlns:inkscape="http://www.inkscape.org/namespaces/inkscape"
   xmlns:sodipodi="http://sodipodi.sourceforge.net/DTD/sodipodi-0.dtd"
   xmlns="http://www.w3.org/2000/svg"
   xmlns:svg="http://www.w3.org/2000/svg">
  <defs
     id="defs308" />
  <sodipodi:namedview
     id="namedview306"
     pagecolor="#ffffff"
     bordercolor="#666666"
     borderopacity="1.0"
     inkscape:showpageshadow="2"
     inkscape:pageopacity="0.0"
     inkscape:pagecheckerboard="0"
     inkscape:deskcolor="#d1d1d1"
     showgrid="true"
     inkscape:zoom="28.6875"
     inkscape:cx="15.982571"
     inkscape:cy="16"
     inkscape:current-layer="svg304">
    <inkscape:grid
       type="xygrid"
       id="grid531" />
  </sodipodi:namedview>
  <g
     stroke-width="1.5"
     transform="translate(-4.000001 -4)"
     id="g300">
    <path
       d="m8.7500002 4.75h22.5000008v26.500001h-22.5000008z"
       fill="#fff"
       stroke="#d4aa00"
       stroke-linecap="round"
       stroke-linejoin="round"
       stroke-miterlimit="5.6"
       id="path284" />
    <g
       fill="none"
       stroke="#b2d1ff"
       id="g298">
      <path
         d="m13 9.75h14"
         id="path286" />
      <path
         d="m13 12.75h14"
         id="path288" />
      <path
         d="m13 15.75h14"
         id="path290" />
      <path
         d="m13 18.75h7.500001"
         id="path292" />
      <path
         d="m13 21.75h4.000001"
         id="path294" />
      <path
         d="m13 24.75h3.000001"
         id="path296" />
    </g>
  </g>
  <path
     d="m18.436604 14.838058.701732 2.753624-1.544941 1.54537-2.757254-.701113-.836141 2.018622 2.445435 1.453914-.000303 2.185177-2.443305 1.450907.83623 2.018837 2.753624-.701729 1.54537 1.544938-.701113 2.757254 2.01862.836141 1.453914-2.445435 2.185179.000303 1.450907 2.443307 2.018837-.836228-.701728-2.753626 1.544938-1.545368 2.757255.70111.83614-2.018622-2.445436-1.45391.000304-2.185178 2.443305-1.45091-.836229-2.018837-2.753624.701731-1.545368-1.544941.701111-2.757254-2.018621-.836141-1.453912 2.445435-2.185179-.000303-1.45091-2.443305zm3.309052 5.133688a3.2777606 3.2777605 0 0 1 4.2826 1.77391 3.2777606 3.2777605 0 0 1 -1.773911 4.282602 3.2777606 3.2777605 0 0 1 -4.2826-1.773913 3.2777606 3.2777605 0 0 1 1.773911-4.282599z"
     fill="#2a7fff"
     id="path302" />
</svg>
