<svg width="16" height="16" version="1.0" xmlns="http://www.w3.org/2000/svg">
 <rect x=".25" y="2.25" width="15.5" height="11.5" fill="#f9f9f9" stroke="#2a7efe" stroke-width=".5" style="paint-order:normal"/>
 <path d="m3 5h2" fill="none" stroke="#000000" stroke-width="2"/>
 <path d="m3 8h2" fill="none" stroke="#000000" stroke-width="2"/>
 <path d="m3 11h2" fill="none" stroke="#000000" stroke-width="2"/>
 <path d="m7 11h2" fill="none" stroke="#000000" stroke-width="2"/>
 <path d="m11 11h2" fill="none" stroke="#000000" stroke-width="2"/>
 <path d="m11 8h2" fill="none" stroke="#000000" stroke-width="2"/>
 <path d="m11 5h2" fill="none" stroke="#000000" stroke-width="2"/>
 <path d="m7 5h2" fill="none" stroke="#000000" stroke-width="2"/>
 <path d="m4.5 5.5h7v5h-7z" fill="none" stroke="#b3b3b3" stroke-linecap="round"/>
</svg>
