<?xml version="1.0" encoding="UTF-8" standalone="no"?>
<svg
   width="32"
   height="32"
   version="1.1"
   id="svg167"
   sodipodi:docname="menu_new_form_200.svg"
   inkscape:export-filename="menu_new_form_200.png"
   inkscape:export-xdpi="96"
   inkscape:export-ydpi="96"
   inkscape:version="1.2.2 (732a01da63, 2022-12-09)"
   xmlns:inkscape="http://www.inkscape.org/namespaces/inkscape"
   xmlns:sodipodi="http://sodipodi.sourceforge.net/DTD/sodipodi-0.dtd"
   xmlns="http://www.w3.org/2000/svg"
   xmlns:svg="http://www.w3.org/2000/svg">
  <defs
     id="defs171" />
  <sodipodi:namedview
     id="namedview169"
     pagecolor="#ffffff"
     bordercolor="#666666"
     borderopacity="1.0"
     inkscape:showpageshadow="2"
     inkscape:pageopacity="0.0"
     inkscape:pagecheckerboard="0"
     inkscape:deskcolor="#d1d1d1"
     showgrid="true"
     inkscape:zoom="28.6875"
     inkscape:cx="15.982571"
     inkscape:cy="16"
     inkscape:current-layer="svg167">
    <inkscape:grid
       type="xygrid"
       id="grid550" />
  </sodipodi:namedview>
  <path
     d="m6.75 4.75h24.5v22.5h-24.5z"
     fill="#fff"
     stroke="#2a7fff"
     stroke-linecap="round"
     stroke-linejoin="round"
     stroke-miterlimit="5.6"
     stroke-width="1.5"
     id="path149" />
  <g
     fill="none"
     id="g163">
    <path
       d="m7 6.5h24"
       stroke="#2a7fff"
       stroke-width="3"
       id="path151" />
    <g
       stroke="#e4b600"
       stroke-linecap="round"
       stroke-width="1.6"
       id="g161">
      <path
         d="m6.7993 0.8 4.535e-4 12.4"
         id="path153" />
      <path
         d="m2.6748 2.6748 8.25 8.25"
         id="path155" />
      <path
         d="m13.2 6.7997h-12.4"
         id="path157" />
      <path
         d="m10.925 2.6748-8.25 8.25"
         id="path159" />
    </g>
  </g>
  <circle
     cx="6.8"
     cy="6.8"
     r="1.7"
     fill="#fff"
     stroke="#ffe680"
     stroke-linejoin="round"
     stroke-miterlimit="5.6"
     id="circle165" />
</svg>
