<?xml version="1.0" encoding="UTF-8" standalone="no"?>
<svg
   height="32"
   viewBox="0 0 8.4666664 8.4666671"
   width="32"
   version="1.1"
   id="svg312"
   sodipodi:docname="Flag_04_32.svg"
   inkscape:export-filename="Flag_04_32.png"
   inkscape:export-xdpi="96"
   inkscape:export-ydpi="96"
   inkscape:version="1.2.1 (9c6d41e410, 2022-07-14)"
   xmlns:inkscape="http://www.inkscape.org/namespaces/inkscape"
   xmlns:sodipodi="http://sodipodi.sourceforge.net/DTD/sodipodi-0.dtd"
   xmlns="http://www.w3.org/2000/svg"
   xmlns:svg="http://www.w3.org/2000/svg">
  <defs
     id="defs316" />
  <sodipodi:namedview
     id="namedview314"
     pagecolor="#ffffff"
     bordercolor="#666666"
     borderopacity="1.0"
     inkscape:showpageshadow="2"
     inkscape:pageopacity="0.0"
     inkscape:pagecheckerboard="0"
     inkscape:deskcolor="#d1d1d1"
     showgrid="true"
     inkscape:zoom="28.6875"
     inkscape:cx="15.494553"
     inkscape:cy="16"
     inkscape:current-layer="svg312">
    <inkscape:grid
       type="xygrid"
       id="grid1016" />
  </sodipodi:namedview>
  <linearGradient
     id="a"
     gradientUnits="userSpaceOnUse"
     x1="2.778125"
     x2="3.174996"
     y1="4.233354"
     y2="4.233354">
    <stop
       offset="0"
       stop-color="#deaa87"
       id="stop292" />
    <stop
       offset="1"
       stop-color="#a05a2c"
       id="stop294" />
  </linearGradient>
  <linearGradient
     id="b"
     gradientTransform="matrix(-0.18751171,-0.0400511,0,0.1872361,6.46241,3.467106)"
     gradientUnits="userSpaceOnUse"
     x1="7.184878"
     x2="17.184877"
     y1="2.599694"
     y2="2.238764">
    <stop
       offset="0"
       stop-color="#0c0"
       id="stop297" />
    <stop
       offset=".25781018"
       stop-color="#090"
       id="stop299" />
    <stop
       offset=".65000004"
       stop-color="#0c0"
       id="stop301" />
    <stop
       offset="1"
       stop-color="#090"
       id="stop303" />
  </linearGradient>
  <g
     transform="matrix(2.0000211,0,0,2.0000211,-3.4396417,-3.968881)"
     id="g310">
    <path
       d="M 3.2025247,2.4503517 C 3.3988793,2.2901431 3.6185304,2.2348524 3.8937209,2.3079729 c 0.1970528,0.052359 0.5831591,0.277807 0.832906,0.3066992 0.2724438,0.031518 0.4822898,0.02163 0.6689012,-0.086307 l 8.982e-4,1.6994435 C 5.2542533,4.369258 4.9999714,4.3456336 4.7275278,4.3141157 4.477781,4.2852236 4.0916744,4.059775 3.8946219,4.0074164 3.6194312,3.9342956 3.3997801,3.9895867 3.2034253,4.1497952 Z"
       fill="url(#b)"
       fill-rule="evenodd"
       stroke="#808080"
       stroke-width="0.055041"
       id="path306"
       style="fill:url(#b)" />
    <path
       d="M 2.9765604,2.4474357 V 6.0192729"
       fill="#a0892c"
       stroke="url(#a)"
       stroke-linecap="round"
       stroke-width="0.396871"
       id="path308"
       style="stroke:url(#a)" />
  </g>
</svg>
