<?xml version="1.0" encoding="UTF-8" standalone="no"?>
<svg
   height="24"
   viewBox="0 0 6.3499998 6.3500003"
   width="24"
   version="1.1"
   id="svg6"
   sodipodi:docname="Database_13_24.svg"
   inkscape:export-filename="Database_13_24.png"
   inkscape:export-xdpi="96"
   inkscape:export-ydpi="96"
   inkscape:version="1.2.1 (9c6d41e410, 2022-07-14)"
   xmlns:inkscape="http://www.inkscape.org/namespaces/inkscape"
   xmlns:sodipodi="http://sodipodi.sourceforge.net/DTD/sodipodi-0.dtd"
   xmlns="http://www.w3.org/2000/svg"
   xmlns:svg="http://www.w3.org/2000/svg">
  <defs
     id="defs10" />
  <sodipodi:namedview
     id="namedview8"
     pagecolor="#ffffff"
     bordercolor="#666666"
     borderopacity="1.0"
     inkscape:showpageshadow="2"
     inkscape:pageopacity="0.0"
     inkscape:pagecheckerboard="0"
     inkscape:deskcolor="#d1d1d1"
     showgrid="true"
     inkscape:zoom="38.25"
     inkscape:cx="11.986928"
     inkscape:cy="12"
     inkscape:current-layer="svg6">
    <inkscape:grid
       type="xygrid"
       id="grid239" />
  </sodipodi:namedview>
  <path
     d="m2.6458334.396875c-1.3150841 0-2.38125006.41462434-2.38125006.9260417v.74104c0 .5114173 1.06616596.9260417 2.38125006.9260417.3275944 0 .6399058-.025802.9239746-.072347.026398-.024951.057711-.045312.093017-.059945l.376205-.1560625c.092883-.0384525.1949179-.0272769.2759521.0222209.439231-.167996.7121013-.4014132.7121013-.6599081v-.7312215-.00982c0-.51141736-1.0661656-.9260417-2.38125-.9260417zm0 .55552165c1.1001582 0 1.8187485.35604825 2.1564575.63613685-.3369512.2297597-1.0535834.4913158-2.1564575.4754232-1.0919123-.0157983-1.80837912-.2733167-2.14922288-.4924764.33889556-.2811163 1.05098398-.61908365 2.14922288-.61908365zm-2.38125006 1.66708175v.9260416c0 .5114178 1.06616466.9260417 2.38125006.9260417.06094 0 .1210777-.0008348.1808675-.00258l-.0310059-.0186073c-.1308563-.0775812-.1849241-.2398346-.1266073-.3803386l.1560629-.3767212c.0290575-.0702937.0818775-.1246752.1457275-.1565795-.1063158.0056459-.2147446.0087849-.3250447.0087849-1.3150854 0-2.38125006-.4146238-2.38125006-.9260416zm3.28507086.8567952c-.1106385.0176683-.2253932.0323185-.3436483.0434082l.3229777.082682.041858-.041858zm-3.28507086.6247681v.9260417c0 .5114178 1.06616466.9260416 2.38125006.9260416.3162396 0 .6179154-.024164.8940022-.067696l.031006-.1219564-.041858-.042375-.3457153.08785c-.1471844.0374083-.2989413-.0390245-.3570842-.179317l-.1560628-.3762045c-.030951-.074763-.029715-.1553901-.00258-.2263427-.00727.0000253-.014422 0-.021704 0-1.3150854 0-2.38125006-.4146239-2.38125006-.9260417zm4.58524986.350883c-.1187699.1127075-.2929857.2144113-.5095296.2997233.039121.1275669.1564778.2150092.2899048.2160075.1690266.000167.3060915-.1368979.3059245-.3059245-.0007835-.0784174-.0316809-.153533-.0862997-.2098063z"
     fill="#00aad4"
     stroke-linecap="round"
     stroke-linejoin="round"
     stroke-miterlimit="5.6"
     stroke-width=".529169"
     id="path2" />
  <path
     d="m3.7794123 3.1398636.1308606.5135031-.2881043.2881842-.5141802-.1307452-.1559255.3764378.4560311.2711297-.0000567.4074975-.4556339.2705692.1559422.376478.5135031-.1308605.2881845.2881043-.1307452.5141801.3764378.1559256.2711294-.4560311.4074977.0000566.270569.4556337.3764781-.1559422-.1308606-.5135028.2881043-.2881845.5141801.1307452.1559259-.3764378-.4560311-.2711294.0000564-.4074978.4556339-.270569-.1559422-.376478-.5135031.1308606-.2881845-.2881046.1307452-.5141801-.3764378-.1559256-.2711294.4560311-.4074975-.0000566-.2705693-.4556337zm.6170803.9573435a.6112453.6112453 0 0 1 .7986306.3308035.6112453.6112453 0 0 1 -.3308036.7986306.6112453.6112453 0 0 1 -.7986305-.3308038.6112453.6112453 0 0 1 .3308035-.7986303z"
     fill="#ff7f00"
     id="path4" />
</svg>
