<?xml version="1.0" encoding="UTF-8" standalone="no"?>
<svg
   height="48"
   width="48"
   version="1.1"
   id="svg988"
   sodipodi:docname="Exit_03_48.svg"
   inkscape:export-filename="Exit_03_48.png"
   inkscape:export-xdpi="96"
   inkscape:export-ydpi="96"
   inkscape:version="1.2.2 (732a01da63, 2022-12-09)"
   xmlns:inkscape="http://www.inkscape.org/namespaces/inkscape"
   xmlns:sodipodi="http://sodipodi.sourceforge.net/DTD/sodipodi-0.dtd"
   xmlns="http://www.w3.org/2000/svg"
   xmlns:svg="http://www.w3.org/2000/svg">
  <defs
     id="defs992" />
  <sodipodi:namedview
     id="namedview990"
     pagecolor="#ffffff"
     bordercolor="#666666"
     borderopacity="1.0"
     inkscape:pageshadow="2"
     inkscape:pageopacity="0.0"
     inkscape:pagecheckerboard="0"
     inkscape:deskcolor="#d1d1d1"
     showgrid="true"
     inkscape:zoom="19.125"
     inkscape:cx="21.437908"
     inkscape:cy="24"
     inkscape:current-layer="svg988"
     inkscape:showpageshadow="2">
    <inkscape:grid
       type="xygrid"
       id="grid2033" />
  </sodipodi:namedview>
  <g
     fill="none"
     stroke="#00aad4"
     stroke-linecap="round"
     stroke-width="2.47118"
     transform="matrix(1.8205743,0,0,1.8214073,3.9736829,0.92565042)"
     id="g986"
     style="stroke:#fa0302">
    <path
       d="m 11,1.997281 v 9"
       id="path982"
       style="stroke-width:2.47118;stroke:#fa0302" />
    <path
       d="M 15.875022,4.2247813 A 9.7500428,9.7473552 0 0 1 20.417817,15.18904 9.7500428,9.7473552 0 0 1 11.000001,22.413595 9.7500428,9.7473552 0 0 1 1.5821826,15.18904 9.7500428,9.7473552 0 0 1 6.1249792,4.224781"
       id="path984"
       style="stroke-width:2.47118;stroke:#fa0302" />
  </g>
</svg>
