<?xml version="1.0" encoding="UTF-8" standalone="no"?>
<svg
   height="24"
   viewBox="0 0 6.3499998 6.3500003"
   width="24"
   version="1.1"
   id="svg131"
   sodipodi:docname="Arrow_08_24.svg"
   inkscape:version="1.2 (dc2aedaf03, 2022-05-15)"
   inkscape:export-filename="Arrow_08_24.png"
   inkscape:export-xdpi="96"
   inkscape:export-ydpi="96"
   xmlns:inkscape="http://www.inkscape.org/namespaces/inkscape"
   xmlns:sodipodi="http://sodipodi.sourceforge.net/DTD/sodipodi-0.dtd"
   xmlns="http://www.w3.org/2000/svg"
   xmlns:svg="http://www.w3.org/2000/svg">
  <defs
     id="defs135" />
  <sodipodi:namedview
     id="namedview133"
     pagecolor="#ffffff"
     bordercolor="#666666"
     borderopacity="1.0"
     inkscape:showpageshadow="2"
     inkscape:pageopacity="0.0"
     inkscape:pagecheckerboard="0"
     inkscape:deskcolor="#d1d1d1"
     showgrid="true"
     inkscape:zoom="38.25"
     inkscape:cx="10.313725"
     inkscape:cy="12"
     inkscape:current-layer="svg131">
    <inkscape:grid
       type="xygrid"
       id="grid1286" />
  </sodipodi:namedview>
  <g
     id="g2015"
     transform="matrix(1.5000001,0,0,-1.5000001,-0.13890627,6.3500004)">
    <circle
       style="fill:none;stroke:#00aad4;stroke-width:0.343958;stroke-linecap:round;stroke-linejoin:round;stroke-dasharray:none;stroke-dashoffset:1.49998"
       id="path346"
       cx="2.2092707"
       cy="2.1166668"
       r="1.8123959" />
    <path
       style="fill:none;stroke:#00aad4;stroke-width:0.343958;stroke-linecap:round;stroke-linejoin:round;stroke-dasharray:none;stroke-opacity:1"
       d="m 1.4155207,1.984375 0.79375,-0.79375 0.79375,0.79375"
       id="path1053"
       sodipodi:nodetypes="ccc" />
    <path
       style="fill:none;stroke:#00aad4;stroke-width:0.343958;stroke-linecap:round;stroke-linejoin:miter;stroke-dasharray:none;stroke-opacity:1"
       d="m 2.2092707,1.3229167 -10e-8,1.6756944"
       id="path1469"
       sodipodi:nodetypes="cc" />
  </g>
</svg>
