<?xml version="1.0" encoding="UTF-8" standalone="no"?>
<svg
   height="36"
   viewBox="0 0 9.525 9.525"
   width="36"
   version="1.1"
   id="svg595"
   sodipodi:docname="Secure_07_36.svg"
   inkscape:version="1.2.2 (732a01da63, 2022-12-09)"
   xmlns:inkscape="http://www.inkscape.org/namespaces/inkscape"
   xmlns:sodipodi="http://sodipodi.sourceforge.net/DTD/sodipodi-0.dtd"
   xmlns="http://www.w3.org/2000/svg"
   xmlns:svg="http://www.w3.org/2000/svg">
  <defs
     id="defs599" />
  <sodipodi:namedview
     id="namedview597"
     pagecolor="#ffffff"
     bordercolor="#000000"
     borderopacity="0.25"
     inkscape:showpageshadow="2"
     inkscape:pageopacity="0.0"
     inkscape:pagecheckerboard="0"
     inkscape:deskcolor="#d1d1d1"
     showgrid="true"
     inkscape:zoom="25.277778"
     inkscape:cx="17.98022"
     inkscape:cy="18"
     inkscape:current-layer="svg595">
    <inkscape:grid
       type="xygrid"
       id="grid981" />
  </sodipodi:namedview>
  <linearGradient
     id="a"
     gradientUnits="userSpaceOnUse"
     x1="3.571875"
     x2="6.846093"
     y1="3.902604"
     y2="5.390885">
    <stop
       offset="0"
       stop-color="#f2f2f2"
       id="stop576" />
    <stop
       offset="1"
       stop-color="#d4d4d4"
       id="stop578" />
  </linearGradient>
  <linearGradient
     id="b"
     gradientTransform="matrix(2.2359079 0 0 2.3215553 .029829 -.25391)"
     gradientUnits="userSpaceOnUse"
     x1="1.499774"
     x2="3.614834"
     y1="1.322335"
     y2="2.204926">
    <stop
       offset="0"
       stop-color="#80b5fe"
       id="stop581" />
    <stop
       offset="1"
       stop-color="#2a7efe"
       id="stop583" />
  </linearGradient>
  <linearGradient
     id="c"
     gradientTransform="matrix(2.2359079 0 0 2.3215553 .029829 -.25391)"
     gradientUnits="userSpaceOnUse"
     x1=".530372"
     x2="3.879216"
     y1="1.145817"
     y2="2.557962">
    <stop
       offset="0"
       stop-color="#e7c962"
       id="stop586" />
    <stop
       offset="1"
       stop-color="#d4a41c"
       id="stop588" />
  </linearGradient>
  <path
     d="m1.0186466 5.2747436-.0000001-3.6881694c1.1822695 0 2.7586291-.61469507 3.7438538-1.22939005.9852247.61469498 2.5615841 1.22939005 3.7438536 1.22939005v3.6881694c0 1.4384023-1.9704493 3.6881696-3.7438536 3.8930683-1.7734042-.2048987-3.7438536-2.454666-3.7438537-3.8930683z"
     fill="url(#b)"
     stroke="url(#c)"
     stroke-linecap="round"
     stroke-linejoin="round"
     stroke-width=".449793"
     id="path591" />
  <path
     d="m5.3966358 4.4979159a.63413557.63413557 0 0 1 -.6341364.6341364.63413557.63413557 0 0 1 -.634135-.6341364.63413557.63413557 0 0 1 .634135-.634135.63413557.63413557 0 0 1 .6341364.634135zm-1.5281514-1.2520817-.3576694.3577691-.6383331-.1623147-.1935756.4673318.5661438.3365958-.0000704.5058915-.5656502.3359001.1935954.4673821.6374927-.1624583.3577691.3576699-.1623147.6383311.4673319.1935772.3365958-.5661423.5058915.0000684.3359001.5656493.467383-.1935932-.1624592-.6374937.3576697-.357769.6383324.1623145.1935765-.4673317-.5661427-.3365956.000069-.5058912.5656493-.3359006-.1935933-.4673816-.6374934.1624579-.3577698-.3576694.1623152-.6383334-.4673324-.1935753-.3365964.5661436-.5058903-.0000702-.3359007-.5656504-.4673817.1935958z"
     fill="url(#a)"
     id="path593" />
</svg>
