<?xml version="1.0" encoding="UTF-8" standalone="no"?>
<svg
   height="24"
   width="24"
   version="1.1"
   id="svg10"
   sodipodi:docname="Cancel_01_24.svg"
   inkscape:export-filename="Cancel_01_24.png"
   inkscape:export-xdpi="96"
   inkscape:export-ydpi="96"
   inkscape:version="1.2-beta (1b65182ce9, 2022-04-05)"
   xmlns:inkscape="http://www.inkscape.org/namespaces/inkscape"
   xmlns:sodipodi="http://sodipodi.sourceforge.net/DTD/sodipodi-0.dtd"
   xmlns="http://www.w3.org/2000/svg"
   xmlns:svg="http://www.w3.org/2000/svg">
  <defs
     id="defs14" />
  <sodipodi:namedview
     id="namedview12"
     pagecolor="#ffffff"
     bordercolor="#666666"
     borderopacity="1.0"
     inkscape:pageshadow="2"
     inkscape:pageopacity="0.0"
     inkscape:pagecheckerboard="0"
     inkscape:deskcolor="#d1d1d1"
     showgrid="true"
     inkscape:zoom="38.25"
     inkscape:cx="11.986928"
     inkscape:cy="12"
     inkscape:current-layer="svg10">
    <inkscape:grid
       type="xygrid"
       id="grid2135" />
  </sodipodi:namedview>
  <circle
     cx="12"
     cy="12"
     r="10.25"
     style="fill:#e60014;fill-rule:evenodd;stroke:#ab0000;stroke-width:1.5;stroke-linecap:round;stroke-linejoin:round;stroke-opacity:.972549"
     id="circle2" />
  <g
     fill="none"
     stroke="#fff"
     stroke-width="1.259138"
     transform="matrix(1.5883883 0 0 1.5883883 33.712836 -40.532009)"
     id="g8">
    <path
       d="m-16.502788 30.239463 5.66612 5.666121"
       id="path4" />
    <path
       d="m-16.502788 35.905584 5.66612-5.666121"
       id="path6" />
  </g>
</svg>
