<svg width="32" height="32" version="1.1" xmlns="http://www.w3.org/2000/svg">
 <defs>
  <radialGradient id="c" cx="21.957434" cy="5.9936466" r="3.105469" gradientTransform="matrix(1.0986919 .00038837098 3.0792878e-8 .90004578 -15.123742 14.785424)" gradientUnits="userSpaceOnUse">
   <stop stop-color="#803300" offset="0"/>
   <stop stop-color="#d45500" offset="1"/>
  </radialGradient>
  <linearGradient id="a" x1="25.714283" x2="25.714283" y1="15.5" y2="6.2142854" gradientTransform="matrix(1.0982843,3.3319454e-4,3.0504966e-4,1.2000001,-15.164998,13.392668)" gradientUnits="userSpaceOnUse">
   <stop stop-color="#668000" offset="0"/>
   <stop stop-color="#aad400" offset="1"/>
  </linearGradient>
  <linearGradient id="b" x1="23" x2="23" y1="6.5" y2="15" gradientTransform="matrix(1.1311029,3.2992792e-4,3.1416508e-4,1.1882353,-15.88782,13.76921)" gradientUnits="userSpaceOnUse">
   <stop stop-color="#89a02c" offset="0"/>
   <stop stop-color="#445016" offset="1"/>
  </linearGradient>
 </defs>
 <linearGradient id="e" x1="2.5" x2="13" y1="1.5" y2="14.5" gradientTransform="matrix(1.8181818,0,0,2,5.409091,0)" gradientUnits="userSpaceOnUse">
  <stop stop-color="#fff" offset="0"/>
  <stop stop-color="#dfeaf4" offset="1"/>
 </linearGradient>
 <path d="m9.5 2.5v12.402344l0.375-0.921875c0.390214-0.958881 1.517021-1.432937 2.476563-1.042969 0.959534 0.389967 1.436179 1.516121 1.046875 2.474609l-0.621094 1.525391c0.339456 0.318521 0.704839 0.622403 0.958984 0.972656 0.316644-0.616927 0.836479-1.111498 1.720703-1.111328 0.884225 1.69e-4 1.746847 0.862754 1.748047 1.896484v1.455079c-3.72e-4 0.484751-0.1869 0.953756-0.353516 1.130859l-1.298828 1.367187c0.0076 0.05716 0.01273 0.114546 0.01953 0.171875l0.773437 0.148438c0.389308 0.07447 0.745105 0.269605 0.882813 0.414062l1.457031 1.533204c0.713103 0.752184 0.679323 1.977738-0.07422 2.689453-0.654 0.616848-1.618054 0.567426-2.337891 0.07813 0.137265 0.14501 0.277483 0.289402 0.41211 0.435547 0.339557 0.358797 0.526031 0.836109 0.519531 1.330078v0.050776h12.294925v-22l-5-5z" fill="url(#e)" fill-rule="evenodd" stroke-linecap="square"/>
 <path d="m 9,2 v 13.435547 c 0.094067,-3.54e-4 0.1878208,-0.0054 0.2832031,0 L 9.875,13.980469 c 0.034008,-0.08357 0.080404,-0.15842 0.125,-0.234375 V 3 H 24.292969 L 29,7.7070312 V 29 H 17.150391 c 0.03393,0.146906 0.0567,0.296107 0.05469,0.449219 L 17.199219,30 H 30 V 7.2929687 L 24.707031,2 Z" fill="#75a4d3" fill-rule="evenodd" stroke-linecap="square"/>
 <path d="m12 6v2h10v-2z" fill="#c8ab37" fill-rule="evenodd"/>
 <path d="m12 10v2h14v-2z" fill="#d3bc5f" fill-rule="evenodd"/>
 <path d="m 13.394531,14 c 0.17545,0.441277 0.193053,0.946421 0.0039,1.412109 L 13.158203,16 H 26 v -2 z" fill="#decd87" fill-rule="evenodd"/>
 <path d="m 17.068359,18 c 0.08562,0.216256 0.136435,0.450662 0.136719,0.695312 V 20 H 26 v -2 z" fill="#e9ddaf" fill-rule="evenodd"/>
 <path d="m16.167969 22-0.615235 0.648437c0.0076 0.05716 0.01273 0.114546 0.01953 0.171875l0.773437 0.148438c0.389308 0.07447 0.745105 0.269605 0.882813 0.414062l0.585939 0.617188h8.185547v-2z" fill="#f4eed7" fill-rule="evenodd"/>
 <path d="M 10.317718,17.93945 11.635432,14.7" fill="none" stroke="#d4aa00" stroke-linecap="round" stroke-linejoin="round" stroke-width="1.4"/>
 <path d="M 7.682286,17.93945 6.36457,14.7" fill="none" stroke="#d4aa00" stroke-linecap="round" stroke-linejoin="round" stroke-width="1.4"/>
 <path d="m8.99802 16.4a7.8000022 5.5007964 89.953824 0 0-3.405966 1.695842l3.407342 3.72291 3.41403-3.730216a7.8000022 5.5007964 89.953824 0 0-3.415406-1.688536z" fill="url(#c)" stroke-linejoin="round" stroke-width="3.9268"/>
 <path d="m2.7 18.7v1.45181l1.756954 1.851114" fill="none" stroke="#aca793" stroke-linecap="round" stroke-linejoin="round" stroke-width="1.4"/>
 <path d="M 2.722954,31.299998 2.7,29.4247 4.456954,27.573584" fill="none" stroke="#aca793" stroke-linecap="round" stroke-linejoin="round" stroke-width="1.4"/>
 <path d="m0.7 26.223932 1.317716-1.388334 3.351002-0.643766" fill="none" stroke="#aca793" stroke-linecap="round" stroke-linejoin="round" stroke-width="1.4"/>
 <path d="m15.300954 18.700002 4e-6 1.451808-1.756958 1.851116" fill="none" stroke="#aca793" stroke-linecap="round" stroke-linejoin="round" stroke-width="1.4"/>
 <path d="m15.277998 31.3 0.02296-1.875298-1.756954-1.851114" fill="none" stroke="#aca793" stroke-linecap="round" stroke-linejoin="round" stroke-width="1.4"/>
 <path d="m17.3 26.223932-1.317714-1.388334-3.352464-0.641616" fill="none" stroke="#aca793" stroke-linecap="round" stroke-linejoin="round" stroke-width="1.4"/>
 <path d="M 12.396262,18.069782 8.999386,21.78125 5.611356,18.079442 A 7.8000022,5.5007964 89.953824 0 0 3.5,24.198332 7.8000022,5.5007964 89.953824 0 0 9.001984,32 7.8000022,5.5007964 89.953824 0 0 14.5,24.201668 7.8000022,5.5007964 89.953824 0 0 12.396262,18.069782 Z" fill="url(#a)" stroke-linejoin="round" stroke-width="3.9268"/>
 <path d="m9 21.3v10" fill="none" stroke="url(#b)" stroke-linecap="round" stroke-linejoin="round" stroke-width="1.4"/>
</svg>
