<svg width="64" height="64" version="1.1" viewBox="0 0 64 64" xmlns="http://www.w3.org/2000/svg">
 <path d="m28 41.424654 4.829429 2.575432v4.000001l-4.823357 2.587584 2.042001 4.915188 5.224728-1.60394 2.828424 2.828425-1.593736 5.235872 4.917233 2.036784 2.575376-4.829336 4 4e-6 2.560277 4.828868 4.919488-2.031656-1.581-5.240576 2.828424-2.828433 5.235937 1.594064 2.036776-4.91724-4.82932-2.575648 4e-6 -4.000005 4.82324-2.587556-2.042008-4.915208-5.224693 1.603984-2.828428-2.828433 1.593832-5.235992-4.917228-2.03678-2.575397 4.829432-4 4e-6 -2.560264-4.828776-4.919477 2.031652 1.5809 5.240352-2.828428 2.828429-5.236004-1.59384zm12.511006 2.301772c1.25568-3.031496 4.731116-4.471068 7.762612-3.215384 3.031501 1.255692 4.471089 4.731128 3.215393 7.762637-1.255688 3.031488-4.731125 4.471076-7.762637 3.215384-3.031488-1.2557-4.471072-4.73112-3.215368-7.762637z" fill="#2a7fff"/>
</svg>
