<?xml version="1.0" encoding="UTF-8" standalone="no"?>
<svg
   width="64"
   height="64"
   version="1.1"
   viewBox="0 0 64 64"
   id="svg33"
   sodipodi:docname="Database_22_64.svg"
   inkscape:export-filename="Database_22_64.png"
   inkscape:export-xdpi="96"
   inkscape:export-ydpi="96"
   inkscape:version="1.3.2 (091e20e, 2023-11-25, custom)"
   xmlns:inkscape="http://www.inkscape.org/namespaces/inkscape"
   xmlns:sodipodi="http://sodipodi.sourceforge.net/DTD/sodipodi-0.dtd"
   xmlns:xlink="http://www.w3.org/1999/xlink"
   xmlns="http://www.w3.org/2000/svg"
   xmlns:svg="http://www.w3.org/2000/svg">
  <sodipodi:namedview
     id="namedview33"
     pagecolor="#ffffff"
     bordercolor="#000000"
     borderopacity="0.25"
     inkscape:showpageshadow="2"
     inkscape:pageopacity="0.0"
     inkscape:pagecheckerboard="0"
     inkscape:deskcolor="#d1d1d1"
     showgrid="true"
     inkscape:current-layer="svg33">
    <inkscape:grid
       id="grid33"
       units="px"
       originx="0"
       originy="0"
       spacingx="0.5"
       spacingy="0.5"
       empcolor="#0099e5"
       empopacity="0.30196078"
       color="#0099e5"
       opacity="0.14901961"
       empspacing="2"
       dotted="false"
       gridanglex="30"
       gridanglez="30"
       visible="true" />
  </sodipodi:namedview>
  <defs
     id="defs3">
    <linearGradient
       id="o"
       x1="52.5"
       x2="61.5"
       y1="7"
       y2="7"
       gradientTransform="matrix(2.9477039,0,0,-2.3245873,-119.64769,71.158168)"
       gradientUnits="userSpaceOnUse">
      <stop
         stop-color="#fc0"
         offset="0"
         id="stop1" />
      <stop
         stop-color="#f9f9f9"
         offset=".37840304"
         id="stop2" />
      <stop
         stop-color="#ffd42a"
         offset="1"
         id="stop3" />
    </linearGradient>
    <filter
       id="p"
       x="-0.11416538"
       y="-0.15622631"
       width="1.2283308"
       height="1.259821"
       color-interpolation-filters="sRGB">
      <feGaussianBlur
         stdDeviation="0.20503125"
         id="feGaussianBlur3" />
    </filter>
  </defs>
  <linearGradient
     id="a"
     x1="9"
     x2="53"
     y1="21"
     y2="21"
     gradientTransform="translate(1)"
     gradientUnits="userSpaceOnUse"
     xlink:href="#b" />
  <linearGradient
     id="b">
    <stop
       stop-color="#2de3e3"
       offset="0"
       id="stop4" />
    <stop
       stop-color="#71ffff"
       offset=".23818764"
       id="stop5" />
    <stop
       stop-color="#08b9b9"
       offset=".48656252"
       id="stop6" />
    <stop
       stop-color="#08cfcf"
       offset=".6837101"
       id="stop7" />
    <stop
       stop-color="#079a9a"
       offset=".86378187"
       id="stop8" />
    <stop
       stop-color="#07cccc"
       offset="1"
       id="stop9" />
  </linearGradient>
  <linearGradient
     id="c"
     x1="9"
     x2="53"
     y1="33"
     y2="33"
     gradientTransform="translate(1)"
     gradientUnits="userSpaceOnUse"
     xlink:href="#b" />
  <linearGradient
     id="d"
     x1="9"
     x2="53"
     y1="41.491676"
     y2="41.491676"
     gradientTransform="translate(1)"
     gradientUnits="userSpaceOnUse"
     xlink:href="#e" />
  <linearGradient
     id="e">
    <stop
       stop-color="#999999"
       offset="0"
       id="stop10" />
    <stop
       stop-color="#f8f8f8"
       offset=".23818764"
       id="stop11" />
    <stop
       stop-color="#868684"
       offset=".48656252"
       id="stop12" />
    <stop
       stop-color="#b2b2b2"
       offset=".6837101"
       id="stop13" />
    <stop
       stop-color="#4f4f4f"
       offset=".86378187"
       id="stop14" />
    <stop
       stop-color="#858585"
       offset="1"
       id="stop15" />
  </linearGradient>
  <linearGradient
     id="f"
     x1="9"
     x2="53"
     y1="53.491676"
     y2="53.491676"
     gradientTransform="translate(1)"
     gradientUnits="userSpaceOnUse"
     xlink:href="#e" />
  <linearGradient
     id="g"
     x1="9"
     x2="53"
     y1="45"
     y2="45"
     gradientTransform="translate(1)"
     gradientUnits="userSpaceOnUse"
     xlink:href="#b" />
  <linearGradient
     id="h"
     x1="9"
     x2="53"
     y1="47"
     y2="47"
     gradientTransform="translate(1)"
     gradientUnits="userSpaceOnUse"
     xlink:href="#i" />
  <linearGradient
     id="i">
    <stop
       stop-color="#9d9d9d"
       offset="0"
       id="stop16" />
    <stop
       stop-color="#808080"
       offset="1"
       id="stop17" />
  </linearGradient>
  <linearGradient
     id="j"
     x1="9"
     x2="53"
     y1="29.491676"
     y2="29.491676"
     gradientTransform="translate(1)"
     gradientUnits="userSpaceOnUse"
     xlink:href="#e" />
  <linearGradient
     id="k"
     x1="9"
     x2="53"
     y1="35"
     y2="35"
     gradientTransform="translate(1)"
     gradientUnits="userSpaceOnUse"
     xlink:href="#i" />
  <linearGradient
     id="l"
     x1="9"
     x2="53"
     y1="17.491676"
     y2="17.491676"
     gradientTransform="translate(1)"
     gradientUnits="userSpaceOnUse"
     xlink:href="#e" />
  <linearGradient
     id="m"
     x1="9"
     x2="53"
     y1="11"
     y2="11"
     gradientTransform="translate(1)"
     gradientUnits="userSpaceOnUse">
    <stop
       stop-color="#b0b0b0"
       offset="0"
       id="stop18" />
    <stop
       stop-color="#cbcbcb"
       offset="1"
       id="stop19" />
  </linearGradient>
  <linearGradient
     id="n"
     x1="23"
     x2="29"
     y1="27"
     y2="19"
     gradientTransform="translate(1)"
     gradientUnits="userSpaceOnUse"
     xlink:href="#i" />
  <ellipse
     cx="32"
     cy="23"
     rx="22"
     ry="4"
     fill="url(#n)"
     id="ellipse19" />
  <ellipse
     cx="32"
     cy="11"
     rx="22"
     ry="4"
     fill="url(#m)"
     id="ellipse20" />
  <path
     d="m32 21c-12.150263 0-22-1.79086-22-4v-6c0 2.20914 9.849737 4 22 4 12.150266 0 22-1.79086 22-4v6c0 2.20914-9.849734 4-22 4z"
     fill="url(#l)"
     stroke-linecap="round"
     stroke-width=".1"
     id="path20" />
  <ellipse
     cx="32"
     cy="35"
     rx="22"
     ry="4"
     fill="url(#k)"
     id="ellipse21" />
  <path
     d="m32 33c-12.150266 0-22-1.79086-22-4v-6c0 2.20914 9.849737 4 22 4 12.150266 0 22-1.79086 22-4v6c-3e-6 2.20914-9.849734 4-22 4z"
     fill="url(#j)"
     stroke-linecap="round"
     stroke-width=".1"
     id="path21" />
  <ellipse
     cx="32"
     cy="47"
     rx="22"
     ry="4"
     fill="url(#h)"
     id="ellipse22" />
  <path
     d="m 12.000002,42.656252 v 4 C 16.000001,48.965652 24.000001,49.4 32,49.4 c 8.000003,0 16.000003,-0.4 20.000002,-2.743748 v -4 C 48.530049,44.036024 40.889837,45 32,45 23.110167,45 15.469952,44.036024 12.000002,42.656252 Z"
     fill="url(#g)"
     stroke-linecap="round"
     stroke-width=".1"
     id="path22" />
  <path
     d="m32 57c-12.150266 0-22-1.79086-22-4v-6c0 2.20914 9.849737 4 22 4 12.150266 0 22-1.79086 22-4v6c-3e-6 2.20914-9.849734 4-22 4z"
     fill="url(#f)"
     stroke-linecap="round"
     stroke-width=".1"
     id="path23" />
  <path
     d="m32 45c-12.150266 0-22-1.79086-22-4v-6c0 2.20914 9.849737 4 22 4 12.150266 0 22-1.79086 22-4v6c-3e-6 2.20914-9.849734 4-22 4z"
     fill="url(#d)"
     stroke-linecap="round"
     stroke-width=".1"
     id="path24" />
  <path
     d="m32 15.640016c-22 0-22-4.640016-22-4.640016s0 3.599984 22 3.599984 22-3.599984 22-3.599984 0 4.640016-22 4.640016z"
     fill="#e6e6e6"
     stroke-linecap="round"
     stroke-width=".1"
     id="path25" />
  <path
     d="m32 51.640016c-22 0-22-4.640016-22-4.640016s0 3.59998 22 3.59998 22-3.59998 22-3.59998 0 4.640016-22 4.640016z"
     fill="#e6e6e6"
     stroke-linecap="round"
     stroke-width=".1"
     id="path26" />
  <path
     d="m32 39.640016c-22 0-22-4.640016-22-4.640016s0 3.599984 22 3.599984 22-3.599984 22-3.599984 0 4.640016-22 4.640016z"
     fill="#e6e6e6"
     stroke-linecap="round"
     stroke-width=".1"
     id="path27" />
  <path
     d="m32 27.640016c-22 0-22-4.640016-22-4.640016s0 3.599984 22 3.599984 22-3.599984 22-3.599984 0 4.640016-22 4.640016z"
     fill="#e6e6e6"
     stroke-linecap="round"
     stroke-width=".1"
     id="path28" />
  <path
     d="m 12.000002,30.656252 v 4 C 16.000001,36.965652 24.000001,37.4 32,37.4 c 8.000003,0 16.000003,-0.4 20.000002,-2.743748 v -4 C 48.530049,32.036024 40.889837,33 32,33 23.110167,33 15.469952,32.036024 12.000002,30.656252 Z"
     fill="url(#c)"
     stroke-linecap="round"
     stroke-width=".1"
     id="path29" />
  <path
     d="m 12.000002,18.656252 v 4 C 16.000001,24.965652 24.000001,25.4 32,25.4 c 8.000003,0 16.000003,-0.4 20.000002,-2.743748 v -4 C 48.530049,20.036024 40.889837,21 32,21 23.110167,21 15.469952,20.036024 12.000002,18.656252 Z"
     fill="url(#a)"
     stroke-linecap="round"
     stroke-width=".1"
     id="path30" />
  <path
     d="m39.25 46v-4.529218c0-5.368637 4.365222-9.720783 9.750001-9.720783 5.384778 0 9.75 4.352146 9.75 9.720783v4.529218"
     fill="none"
     stroke="#b3b3b3"
     stroke-linejoin="round"
     stroke-width="4.5"
     id="path31" />
  <path
     transform="matrix(3.0000002,0,0,3.0000002,3.9999965,2.4999972)"
     d="m11.75 14.5v-1.509739c0-1.789546 1.455074-3.240261 3.25-3.240261s3.25 1.450715 3.25 3.240261v1.509739"
     fill="none"
     filter="url(#p)"
     stroke="#ffffff"
     stroke-linejoin="round"
     stroke-width=".5"
     id="path32" />
  <path
     d="m63.25 63.25v-16.499999h-28.499999v16.499999z"
     fill="url(#o)"
     stroke="#d4aa00"
     stroke-linecap="round"
     stroke-linejoin="round"
     stroke-width="1.5"
     id="path33" />
</svg>
