<?xml version="1.0" encoding="UTF-8" standalone="no"?>
<svg
   height="16"
   width="16"
   version="1.1"
   id="svg9"
   sodipodi:docname="Cloud_04_16.svg"
   inkscape:export-filename="Cloud_04_16.png"
   inkscape:export-xdpi="96"
   inkscape:export-ydpi="96"
   inkscape:version="1.2.1 (9c6d41e410, 2022-07-14)"
   xmlns:inkscape="http://www.inkscape.org/namespaces/inkscape"
   xmlns:sodipodi="http://sodipodi.sourceforge.net/DTD/sodipodi-0.dtd"
   xmlns="http://www.w3.org/2000/svg"
   xmlns:svg="http://www.w3.org/2000/svg">
  <defs
     id="defs13">
    <radialGradient
       id="a-9"
       cx="12.1"
       cy="10.900001"
       gradientTransform="matrix(0,1.077458,-1.0774249,1.9512501e-8,18.289408,-14.491811)"
       gradientUnits="userSpaceOnUse"
       r="4.5">
      <stop
         offset="0"
         stop-color="#ff7f2a"
         id="stop2-2" />
      <stop
         offset="1"
         stop-color="#d45500"
         id="stop4-7" />
    </radialGradient>
  </defs>
  <sodipodi:namedview
     id="namedview11"
     pagecolor="#ffffff"
     bordercolor="#666666"
     borderopacity="1.0"
     inkscape:showpageshadow="2"
     inkscape:pageopacity="0.0"
     inkscape:pagecheckerboard="0"
     inkscape:deskcolor="#d1d1d1"
     showgrid="true"
     inkscape:zoom="57.375"
     inkscape:cx="8"
     inkscape:cy="8"
     inkscape:current-layer="svg9">
    <inkscape:grid
       type="xygrid"
       id="grid838" />
  </sodipodi:namedview>
  <linearGradient
     id="a"
     gradientTransform="matrix(1 0 0 .96627912 0 .188371)"
     gradientUnits="userSpaceOnUse"
     x1="7.5"
     x2="9"
     y1="2"
     y2="13">
    <stop
       offset="0"
       stop-color="#5ab4f2"
       id="stop2" />
    <stop
       offset="1"
       stop-color="#0090ff"
       id="stop4" />
  </linearGradient>
  <path
     d="m3.2918266 12.75c-4.3402413 0-4.3402413-5.8903521-.2858606-5.8903521-.5693967-6.06642748 9.122356-5.704998 9.122356-1.4725878 4.918073-.3594726 5.574822 7.3629399-.506798 7.3629399z"
     fill="url(#a)"
     id="path7" />
  <g
     id="g4053">
    <path
       d="M 6.7500629,10.249937 8.49999,8.4999379 10.250062,10.249937"
       id="path2075"
       sodipodi:nodetypes="ccc"
       style="fill:none;stroke:#ffffff;stroke-width:3;stroke-linecap:round;stroke-linejoin:round;stroke-dasharray:none;stroke-opacity:1" />
    <path
       style="fill:none;stroke:#ffffff;stroke-width:3;stroke-linecap:round;stroke-linejoin:miter;stroke-dasharray:none;stroke-opacity:1"
       d="m 8.5,8.5 v 6"
       id="path2077"
       sodipodi:nodetypes="cc" />
    <path
       style="fill:none;stroke:#ff7f00;stroke-width:0.999998px;stroke-linecap:round;stroke-linejoin:miter;stroke-opacity:1"
       d="m 8.5,9.5 v 4"
       id="path2324" />
    <path
       d="M 6.5,10.499938 8.49999,8.4999379 10.5,10.499938"
       id="path2067"
       sodipodi:nodetypes="ccc"
       style="fill:none;stroke:#ff7f00;stroke-width:0.999998;stroke-linecap:round;stroke-linejoin:round;stroke-dasharray:none;stroke-opacity:1" />
    <path
       style="fill:none;stroke:#ff7f00;stroke-width:0.999998;stroke-linecap:round;stroke-linejoin:miter;stroke-dasharray:none;stroke-opacity:1"
       d="m 8.5,9.5 v 5"
       id="path2069"
       sodipodi:nodetypes="cc" />
  </g>
</svg>
