<?xml version="1.0" encoding="UTF-8" standalone="no"?>
<svg
   height="32"
   width="32"
   version="1.1"
   id="svg9"
   sodipodi:docname="Star_01_32.svg"
   inkscape:export-filename="Star_01_32.png"
   inkscape:export-xdpi="96"
   inkscape:export-ydpi="96"
   inkscape:version="1.2-beta (1b65182ce9, 2022-04-05)"
   xmlns:inkscape="http://www.inkscape.org/namespaces/inkscape"
   xmlns:sodipodi="http://sodipodi.sourceforge.net/DTD/sodipodi-0.dtd"
   xmlns="http://www.w3.org/2000/svg"
   xmlns:svg="http://www.w3.org/2000/svg">
  <defs
     id="defs13" />
  <sodipodi:namedview
     id="namedview11"
     pagecolor="#ffffff"
     bordercolor="#666666"
     borderopacity="1.0"
     inkscape:pageshadow="2"
     inkscape:pageopacity="0.0"
     inkscape:pagecheckerboard="0"
     inkscape:deskcolor="#d1d1d1"
     showgrid="true"
     inkscape:zoom="28.6875"
     inkscape:cx="16"
     inkscape:cy="16"
     inkscape:current-layer="svg9">
    <inkscape:grid
       type="xygrid"
       id="grid802" />
  </sodipodi:namedview>
  <linearGradient
     id="a"
     gradientUnits="userSpaceOnUse"
     x1="8"
     x2="8"
     y1="15"
     y2="4">
    <stop
       offset="0"
       stop-color="#d58914"
       stop-opacity=".956863"
       id="stop2" />
    <stop
       offset="1"
       stop-color="#f4a428"
       stop-opacity=".992157"
       id="stop4" />
  </linearGradient>
  <path
     d="m8.0000002.49986362 2.3511408 4.76393198 5.257311.7639323-3.804226 3.7082037.898056 5.2360684-4.702282-2.472136-4.7022822 2.472135.8980561-5.2360674-3.80422596-3.7082041 5.25731106-.7639318z"
     fill="url(#a)"
     fill-rule="evenodd"
     transform="matrix(1.9999812 0 0 1.9999812 .00015 .528282)"
     id="path7" />
</svg>
