<svg width="48" height="48" version="1.1" xmlns="http://www.w3.org/2000/svg">
 <rect x="2.75" y="2.75" width="42.5" height="42.5" rx="3.3" fill="#f0fcff" stroke="#00aad4" stroke-linejoin="round" stroke-width="1.5"/>
 <path d="m3.5 3h41v6h-41z" fill="#00aad4"/>
 <path d="m10 15v7h6v-7z" fill="#ff7f00" stroke-width="3.57772"/>
 <path d="m21 15v7h6v-7z" fill="#ff7f00" stroke-width="3.57772"/>
 <path d="m32 15v7h6.000002v-7z" fill="#ff7f00" stroke-width="3.57772"/>
 <path d="m10 26v7h6v-7z" fill="#ff7f00" stroke-width="3.57772"/>
 <path d="m21 26v7h6v-7z" fill="#ff7f00" stroke-width="3.57772"/>
 <path d="m32 26v7h6.000002v-7z" fill="#ff7f00" stroke-width="3.57772"/>
</svg>
