<?xml version="1.0" encoding="UTF-8" standalone="no"?>
<svg
   height="36"
   width="36"
   version="1.1"
   id="svg405"
   sodipodi:docname="Cloud_06_36.svg"
   inkscape:export-filename="Cloud_06_36.png"
   inkscape:export-xdpi="96"
   inkscape:export-ydpi="96"
   inkscape:version="1.2.1 (9c6d41e410, 2022-07-14)"
   xmlns:inkscape="http://www.inkscape.org/namespaces/inkscape"
   xmlns:sodipodi="http://sodipodi.sourceforge.net/DTD/sodipodi-0.dtd"
   xmlns="http://www.w3.org/2000/svg"
   xmlns:svg="http://www.w3.org/2000/svg">
  <defs
     id="defs409">
    <radialGradient
       id="a-2"
       cx="-11.5"
       cy="8.5"
       gradientTransform="matrix(0,1.12,-1.12,0,20.679997,24.039997)"
       gradientUnits="userSpaceOnUse"
       r="3.5">
      <stop
         offset="0"
         stop-color="#fff"
         id="stop2-4" />
      <stop
         offset="1"
         stop-color="#d5e5ff"
         id="stop4-8" />
    </radialGradient>
  </defs>
  <sodipodi:namedview
     id="namedview407"
     pagecolor="#ffffff"
     bordercolor="#666666"
     borderopacity="1.0"
     inkscape:showpageshadow="2"
     inkscape:pageopacity="0.0"
     inkscape:pagecheckerboard="0"
     inkscape:deskcolor="#d1d1d1"
     showgrid="true"
     inkscape:zoom="25.5"
     inkscape:cx="17.392157"
     inkscape:cy="18"
     inkscape:current-layer="svg405">
    <inkscape:grid
       type="xygrid"
       id="grid808" />
  </sodipodi:namedview>
  <linearGradient
     id="a"
     gradientTransform="matrix(1.0000001 0 0 .96627924 -.000186 -.239407)"
     gradientUnits="userSpaceOnUse"
     x1="7.5"
     x2="9"
     y1="2"
     y2="13">
    <stop
       offset="0"
       stop-color="#5ab4f2"
       id="stop398" />
    <stop
       offset="1"
       stop-color="#0090ff"
       id="stop400" />
  </linearGradient>
  <path
     d="m3.291641 12.322221c-4.3402418 0-4.3402418-5.8903505-.2858607-5.8903505-.5693968-6.06642815 9.1223567-5.70499845 9.1223567-1.4725879 4.918074-.3594727 5.574822 7.3629384-.506797 7.3629384z"
     fill="url(#a)"
     transform="matrix(2.2499999 0 0 2.2499999 .000418 .5)"
     id="path403" />
  <g
     id="g2638"
     transform="matrix(1.8461538,0,0,1.8461538,-0.92307596,-0.92307596)">
    <g
       id="g2626">
      <circle
         cx="12"
         cy="12"
         r="4"
         stroke="#ffffff"
         stroke-linejoin="round"
         stroke-width="0.75"
         id="circle7"
         style="fill:none;stroke:#ffffff;stroke-width:2;stroke-linecap:round;stroke-dasharray:none" />
      <path
         d="M 13.914015,13.914015 18.1,18.1"
         stroke="#ffffff"
         stroke-width="3"
         id="path9"
         style="fill:none;stroke:#ffffff;stroke-width:3.8;stroke-linecap:round;stroke-dasharray:none" />
    </g>
    <g
       id="g2630">
      <path
         d="m 13.914,13.914 4.185985,4.185985"
         stroke="#a05a2c"
         stroke-width="1.4"
         id="path11"
         style="fill:none;stroke-width:1.8;stroke-linecap:round;stroke-dasharray:none" />
      <circle
         cx="12"
         cy="12"
         fill="url(#a)"
         fill-rule="evenodd"
         r="3.5"
         stroke="#dd8703"
         stroke-linejoin="round"
         id="circle15"
         style="fill:url(#a-2);stroke-width:1;stroke-linecap:round;stroke-dasharray:none" />
    </g>
  </g>
</svg>
