<?xml version="1.0" encoding="UTF-8" standalone="no"?>
<svg
   width="64"
   height="64"
   version="1.1"
   id="svg2"
   sodipodi:docname="Exit_01_64.svg"
   inkscape:export-filename="Exit_01_64.png"
   inkscape:export-xdpi="96"
   inkscape:export-ydpi="96"
   inkscape:version="1.3.2 (091e20e, 2023-11-25, custom)"
   xmlns:inkscape="http://www.inkscape.org/namespaces/inkscape"
   xmlns:sodipodi="http://sodipodi.sourceforge.net/DTD/sodipodi-0.dtd"
   xmlns="http://www.w3.org/2000/svg"
   xmlns:svg="http://www.w3.org/2000/svg">
  <defs
     id="defs2" />
  <sodipodi:namedview
     id="namedview2"
     pagecolor="#ffffff"
     bordercolor="#000000"
     borderopacity="0.25"
     inkscape:showpageshadow="2"
     inkscape:pageopacity="0.0"
     inkscape:pagecheckerboard="0"
     inkscape:deskcolor="#d1d1d1"
     showgrid="true"
     inkscape:current-layer="svg2">
    <inkscape:grid
       id="grid2"
       units="px"
       originx="0"
       originy="0"
       spacingx="0.5"
       spacingy="0.5"
       empcolor="#0099e5"
       empopacity="0.30196078"
       color="#0099e5"
       opacity="0.14901961"
       empspacing="2"
       dotted="false"
       gridanglex="30"
       gridanglez="30"
       visible="true" />
  </sodipodi:namedview>
  <g
     transform="scale(2)"
     fill="#aaccff"
     fill-rule="evenodd"
     stroke="#355f94"
     stroke-linejoin="round"
     stroke-width=".75"
     id="g2">
    <path
       d="m21.375 5.5859375v5.9873045c1.391471 1.37808 2.25 3.29306 2.25 5.426758 0 4.24078-3.38422 7.625-7.625 7.625s-7.625-3.38422-7.625-7.625c0-2.133698 0.8585286-4.048678 2.25-5.426758v-5.9873045c-4.2746761 2.0286213-7.25 6.3904725-7.25 11.414062 0 6.94297 5.6820305 12.625 12.625 12.625 6.942969 0 12.625-5.68203 12.625-12.625 0-5.02359-2.975324-9.3854412-7.25-11.414062z"
       id="path1" />
    <path
       d="m13.375 1.875v14.25h5.25v-14.25z"
       fill="#aaccff"
       fill-rule="evenodd"
       stroke="#355f94"
       id="path2" />
  </g>
</svg>
