<?xml version="1.0" encoding="UTF-8" standalone="no"?>
<svg
   height="24"
   width="24"
   version="1.1"
   id="svg187"
   sodipodi:docname="Database_02_24.svg"
   inkscape:export-filename="Database_02_24.png"
   inkscape:export-xdpi="96"
   inkscape:export-ydpi="96"
   inkscape:version="1.2-beta (1b65182ce9, 2022-04-05)"
   xmlns:inkscape="http://www.inkscape.org/namespaces/inkscape"
   xmlns:sodipodi="http://sodipodi.sourceforge.net/DTD/sodipodi-0.dtd"
   xmlns:xlink="http://www.w3.org/1999/xlink"
   xmlns="http://www.w3.org/2000/svg"
   xmlns:svg="http://www.w3.org/2000/svg">
  <defs
     id="defs191">
    <linearGradient
       inkscape:collect="always"
       xlink:href="#b"
       id="linearGradient1246"
       gradientUnits="userSpaceOnUse"
       x1="-37.744651"
       y1="21.3936"
       x2="-24.244651"
       y2="21.3936"
       gradientTransform="translate(42.244654,-10.893583)" />
    <linearGradient
       id="a-5"
       gradientUnits="userSpaceOnUse"
       x1="14.15625"
       x2="8.84375"
       y1="14.15625"
       y2="8.84375"
       gradientTransform="matrix(1.4054054,0,0,1.4054054,1.0878401,-22.91216)">
      <stop
         offset="0"
         stop-color="#009600"
         id="stop2" />
      <stop
         offset="1"
         stop-color="#6edb39"
         id="stop4" />
    </linearGradient>
  </defs>
  <sodipodi:namedview
     id="namedview189"
     pagecolor="#ffffff"
     bordercolor="#666666"
     borderopacity="1.0"
     inkscape:pageshadow="2"
     inkscape:pageopacity="0.0"
     inkscape:pagecheckerboard="0"
     inkscape:deskcolor="#d1d1d1"
     showgrid="true"
     inkscape:zoom="38.25"
     inkscape:cx="10.352941"
     inkscape:cy="12"
     inkscape:current-layer="svg187">
    <inkscape:grid
       type="xygrid"
       id="grid1244" />
  </sodipodi:namedview>
  <linearGradient
     id="a"
     gradientUnits="userSpaceOnUse"
     x1="-37.744651"
     x2="-24.244651"
     xlink:href="#b"
     y1="21.3936"
     y2="21.3936"
     gradientTransform="translate(42.244654,-10.893583)" />
  <linearGradient
     id="b">
    <stop
       offset="0"
       stop-color="#4276c4"
       id="stop160" />
    <stop
       offset=".34375"
       stop-color="#80b3ff"
       id="stop162" />
    <stop
       offset="1"
       stop-color="#04a"
       id="stop164" />
  </linearGradient>
  <linearGradient
     id="c"
     gradientUnits="userSpaceOnUse"
     x1="-37.744651"
     x2="-24.244651"
     xlink:href="#b"
     y1="12.3938"
     y2="12.3938"
     gradientTransform="translate(42.244654,-10.893583)" />
  <linearGradient
     id="d"
     gradientUnits="userSpaceOnUse"
     x1="-37.744651"
     x2="-24.244651"
     xlink:href="#b"
     y1="16.8936"
     y2="16.8936"
     gradientTransform="translate(42.244654,-10.893583)" />
  <g
     id="g1656"
     transform="translate(-1.5)">
    <ellipse
       cx="12"
       cy="18.75"
       rx="7.5"
       ry="2.25"
       stroke="url(#a)"
       stroke-width="3"
       id="ellipse169"
       style="fill:none;fill-rule:evenodd;stroke:url(#linearGradient1246);stroke-linecap:round;stroke-linejoin:round" />
    <ellipse
       cx="12"
       cy="15.812256"
       rx="8.2414637"
       ry="2.937722"
       stroke="#ffffff"
       stroke-width="1.5"
       id="ellipse171"
       style="fill:none;fill-rule:evenodd;stroke-linecap:round;stroke-linejoin:round" />
    <ellipse
       cx="12"
       cy="14.25"
       rx="7.5"
       ry="2.25"
       stroke="url(#d)"
       stroke-width="3"
       id="ellipse173"
       style="fill:none;fill-rule:evenodd;stroke:url(#d);stroke-linecap:round;stroke-linejoin:round" />
    <ellipse
       cx="12"
       cy="11.312256"
       rx="8.2414637"
       ry="2.937722"
       stroke="#ffffff"
       stroke-width="1.5"
       id="ellipse175"
       style="fill:none;fill-rule:evenodd;stroke-linecap:round;stroke-linejoin:round" />
    <ellipse
       cx="12"
       cy="9.75"
       rx="7.5"
       ry="2.25"
       stroke="url(#c)"
       stroke-width="3"
       id="ellipse177"
       style="fill:none;fill-rule:evenodd;stroke:url(#c);stroke-linecap:round;stroke-linejoin:round" />
    <ellipse
       cx="12"
       cy="6.8121953"
       rx="8.2414637"
       ry="2.937722"
       stroke="#ffffff"
       stroke-width="1.5"
       id="ellipse179"
       style="fill:none;fill-rule:evenodd;stroke-linecap:round;stroke-linejoin:round" />
    <ellipse
       cx="12"
       cy="5.2500005"
       fill="#80b3ff"
       rx="8.25"
       ry="3"
       stroke="url(#a)"
       stroke-width="1.5"
       id="ellipse183"
       style="fill-rule:evenodd;stroke:url(#a);stroke-linecap:round;stroke-linejoin:round" />
  </g>
  <g
     id="g2333"
     transform="rotate(90,12,12.25)">
    <circle
       cx="17.250002"
       cy="-6.7499981"
       fill="url(#a)"
       r="5.9729729"
       stroke-dashoffset="1.49998"
       stroke-linejoin="round"
       stroke-width="0.5"
       transform="scale(1,-1)"
       id="circle7"
       style="fill:url(#a-5);stroke:#ffffff;stroke-width:1.05405;stroke-linecap:round;stroke-dasharray:none" />
    <g
       id="g1519"
       transform="translate(0.5,-0.5)">
      <path
         style="fill:none;stroke:#ffffff;stroke-width:2;stroke-linecap:round;stroke-linejoin:miter;stroke-miterlimit:4;stroke-dasharray:none;stroke-opacity:1"
         d="m 14.25,7.25 h 5"
         id="path1522"
         sodipodi:nodetypes="cc" />
      <path
         style="fill:none;stroke:#ffffff;stroke-width:2;stroke-linecap:round;stroke-linejoin:miter;stroke-miterlimit:4;stroke-dasharray:none;stroke-opacity:1"
         d="m 16.75,4.75 v 5"
         id="path1215"
         sodipodi:nodetypes="cc" />
    </g>
  </g>
</svg>
