<?xml version="1.0" encoding="UTF-8" standalone="no"?>
<svg
   height="24"
   width="24"
   version="1.1"
   id="svg572"
   sodipodi:docname="08 PackageType_150.svg"
   inkscape:export-filename="08 PackageType_150.png"
   inkscape:export-xdpi="96"
   inkscape:export-ydpi="96"
   inkscape:version="1.2.1 (9c6d41e410, 2022-07-14)"
   xmlns:inkscape="http://www.inkscape.org/namespaces/inkscape"
   xmlns:sodipodi="http://sodipodi.sourceforge.net/DTD/sodipodi-0.dtd"
   xmlns:xlink="http://www.w3.org/1999/xlink"
   xmlns="http://www.w3.org/2000/svg"
   xmlns:svg="http://www.w3.org/2000/svg">
  <defs
     id="defs576">
    <linearGradient
       id="linearGradient1347"
       x1="8.8369999"
       x2="15.576"
       y1="7.8053999"
       y2="10.838"
       gradientTransform="matrix(1.4839,0,0,1.4839,-0.1129,24.918)"
       gradientUnits="userSpaceOnUse"
       xlink:href="#linearGradient933-3" />
    <linearGradient
       id="linearGradient933-3">
      <stop
         stop-color="#ffe991"
         offset="0"
         id="stop316" />
      <stop
         stop-color="#f5c400"
         offset="1"
         id="stop318" />
    </linearGradient>
    <linearGradient
       id="linearGradient1351"
       x1="8.8369999"
       x2="15.576"
       y1="7.8013"
       y2="10.834"
       gradientTransform="matrix(-1.4839,0,0,1.4839,25.113,24.924)"
       gradientUnits="userSpaceOnUse"
       xlink:href="#linearGradient933-3" />
    <linearGradient
       id="linearGradient1355"
       x1="1.4239"
       x2="15.576"
       y1="4.4317002"
       y2="4.4317002"
       gradientTransform="matrix(-1.4839,0,0,1.4839,25.113,24.924)"
       gradientUnits="userSpaceOnUse">
      <stop
         stop-color="#ffe478"
         offset="0"
         id="stop323" />
      <stop
         stop-color="#fff2c0"
         offset="1"
         id="stop325" />
    </linearGradient>
  </defs>
  <sodipodi:namedview
     id="namedview574"
     pagecolor="#ffffff"
     bordercolor="#666666"
     borderopacity="1.0"
     inkscape:showpageshadow="2"
     inkscape:pageopacity="0.0"
     inkscape:pagecheckerboard="0"
     inkscape:deskcolor="#d1d1d1"
     showgrid="true"
     inkscape:zoom="38.25"
     inkscape:cx="10.326797"
     inkscape:cy="12"
     inkscape:current-layer="svg572">
    <inkscape:grid
       type="xygrid"
       id="grid1260" />
  </sodipodi:namedview>
  <linearGradient
     id="a"
     gradientUnits="userSpaceOnUse"
     x1="11"
     x2="14"
     y1="9"
     y2="11.5">
    <stop
       offset="0"
       stop-color="#ffe991"
       id="stop529" />
    <stop
       offset="1"
       stop-color="#e6b800"
       id="stop531" />
  </linearGradient>
  <linearGradient
     id="b"
     gradientUnits="userSpaceOnUse"
     x1="4"
     x2="1"
     y1="7"
     y2="10">
    <stop
       offset="0"
       stop-color="#ffea91"
       id="stop534" />
    <stop
       offset="1"
       stop-color="#e6b900"
       id="stop536" />
  </linearGradient>
  <linearGradient
     id="c"
     gradientUnits="userSpaceOnUse"
     x1="4.5"
     x2="13.5"
     y1="3"
     y2="4.5">
    <stop
       offset="0"
       stop-color="#fff2c0"
       id="stop539" />
    <stop
       offset="1"
       stop-color="#ffe478"
       id="stop541" />
  </linearGradient>
  <g
     transform="translate(0,-25.000005)"
     id="g348">
    <g
       stroke="#ccaa00"
       stroke-linejoin="round"
       id="g336">
      <path
         d="m 12.5,36.789 11,-5.2887 v 9.5 l -11,6 z"
         fill="url(#linearGradient1347)"
         id="path330"
         style="fill:url(#linearGradient1347)" />
      <path
         d="m 12.5,36.5 -11,-5 V 41 l 11,6 z"
         fill="url(#linearGradient1351)"
         id="path332"
         style="fill:url(#linearGradient1351)" />
      <path
         d="m 12.5,26.5 -11,5 11,5 11,-5 z"
         fill="url(#linearGradient1355)"
         id="path334"
         style="fill:url(#linearGradient1355)" />
    </g>
    <g
       fill="none"
       stroke="#5f8dd3"
       stroke-linecap="round"
       id="g346">
      <path
         d="M 7.4,28.9 18.5,34"
         id="path338" />
      <path
         d="M 6.5,34 17.6,28.9"
         id="path340" />
      <path
         d="m 6.5,34 v 9.7"
         id="path342" />
      <path
         d="m 18.5,34 v 9.7"
         id="path344" />
    </g>
  </g>
  <path
     d="m 11.999992,9.5 7e-6,3.25 h 0.90909 c 0.02599,-0.876143 0.219602,-1.005712 0.687473,-1.669458 0.701806,-0.07965 1.493616,-0.174512 2.49434,-0.187787 v 10.229326 c -0.415887,0.265499 -1.051392,0.445367 -1.818179,0.538291 V 22.5 H 19.72726 V 21.660372 C 18.908482,21.554177 18.363957,21.374304 17.909081,21.122081 V 10.892755 c 0.870761,0.01328 1.685906,0.113427 2.530671,0.206347 0.376896,0.570823 0.56017,0.695105 0.651143,1.650898 h 0.90909 l -8e-6,-3.25 z"
     fill="#009600"
     id="path568"
     style="stroke:#ffffff;stroke-width:3;stroke-dasharray:none;paint-order:stroke fill markers"
     sodipodi:nodetypes="ccccccccccccccccc" />
</svg>
