<?xml version="1.0" encoding="UTF-8" standalone="no"?>
<svg
   height="16"
   width="16"
   version="1.1"
   id="svg3225"
   sodipodi:docname="Window_08_16.svg"
   inkscape:version="1.2.1 (9c6d41e410, 2022-07-14)"
   inkscape:export-filename="Window_08_16.png"
   inkscape:export-xdpi="96"
   inkscape:export-ydpi="96"
   xml:space="preserve"
   xmlns:inkscape="http://www.inkscape.org/namespaces/inkscape"
   xmlns:sodipodi="http://sodipodi.sourceforge.net/DTD/sodipodi-0.dtd"
   xmlns="http://www.w3.org/2000/svg"
   xmlns:svg="http://www.w3.org/2000/svg"><defs
     id="defs3229" /><sodipodi:namedview
     id="namedview3227"
     pagecolor="#ffffff"
     bordercolor="#666666"
     borderopacity="1.0"
     inkscape:pageshadow="2"
     inkscape:pageopacity="0.0"
     inkscape:pagecheckerboard="0"
     inkscape:deskcolor="#d1d1d1"
     showgrid="true"
     inkscape:zoom="57.375"
     inkscape:cx="8"
     inkscape:cy="8"
     inkscape:current-layer="svg3225"
     inkscape:showpageshadow="2"
     showguides="true"><inkscape:grid
       type="xygrid"
       id="grid3348" /></sodipodi:namedview><g
     id="path294"
     transform="matrix(0.63636364,0,0,0.63636364,-0.27272728,-0.27272736)"><path
       id="path377"
       style="color:#000000;fill:#00aad4;stroke-linecap:round;stroke-dashoffset:1.49998"
       d="M 1.9999999,2.7857144 2,24 H 24 L 24,2.7857144 Z M 3.5714285,6.7142858 H 22.428571 l 0,15.7142852 H 3.5714286 Z"
       sodipodi:nodetypes="cccccccccc" /></g><path
     style="fill:none;stroke:#00aad4;stroke-width:1.25;stroke-linecap:round;stroke-linejoin:round;stroke-dasharray:none;stroke-opacity:1"
     d="m 4.5,9.5 2,2 5,-5"
     id="path364" /></svg>
