<?xml version="1.0" encoding="UTF-8" standalone="no"?>
<svg
   height="36"
   width="36"
   version="1.1"
   id="svg597"
   sodipodi:docname="MapMarker_02_36.svg"
   inkscape:export-filename="MapMarker_02_36.png"
   inkscape:export-xdpi="96"
   inkscape:export-ydpi="96"
   inkscape:version="1.2.1 (9c6d41e410, 2022-07-14)"
   xmlns:inkscape="http://www.inkscape.org/namespaces/inkscape"
   xmlns:sodipodi="http://sodipodi.sourceforge.net/DTD/sodipodi-0.dtd"
   xmlns:xlink="http://www.w3.org/1999/xlink"
   xmlns="http://www.w3.org/2000/svg"
   xmlns:svg="http://www.w3.org/2000/svg">
  <defs
     id="defs601">
    <linearGradient
       inkscape:collect="always"
       xlink:href="#a"
       id="linearGradient1065"
       x1="8"
       y1="3.5"
       x2="8"
       y2="14.5"
       gradientUnits="userSpaceOnUse"
       gradientTransform="matrix(2.2500044,0,0,2.2500044,-3.54e-5,-2.1211733e-6)" />
    <radialGradient
       id="a"
       cx="12.1"
       cy="10.900001"
       gradientTransform="matrix(0,2.8282832,-2.828283,0,26.049123,-51.438917)"
       gradientUnits="userSpaceOnUse"
       r="4.5">
      <stop
         offset="0"
         stop-color="#ff7f2a"
         id="stop962" />
      <stop
         offset="1"
         stop-color="#d45500"
         id="stop964" />
    </radialGradient>
  </defs>
  <sodipodi:namedview
     id="namedview599"
     pagecolor="#ffffff"
     bordercolor="#666666"
     borderopacity="1.0"
     inkscape:pageshadow="2"
     inkscape:pageopacity="0.0"
     inkscape:pagecheckerboard="0"
     inkscape:deskcolor="#d1d1d1"
     showgrid="true"
     inkscape:zoom="25.5"
     inkscape:cx="18"
     inkscape:cy="18"
     inkscape:current-layer="svg597"
     inkscape:showpageshadow="2">
    <inkscape:grid
       type="xygrid"
       id="grid3984" />
  </sodipodi:namedview>
  <path
     id="path2134"
     style="fill:url(#linearGradient1065);fill-opacity:1;stroke:#ffccaa;stroke-width:1.125;stroke-linecap:round;stroke-linejoin:round;stroke-dasharray:none;stroke-opacity:1"
     d="m 18,1.6875009 c -5.68645,0 -10.296407,4.606157 -10.296407,10.2876191 0,1.731311 0.426493,3.360464 1.168947,4.76368 L 18,34.312565 27.145037,16.708038 c 0.738049,-1.420905 1.15137,-3.029148 1.15137,-4.732918 C 28.296407,6.2936579 23.686452,1.6875009 18,1.6875009 Z m 0,6.187512 A 4.5000092,4.500009 0 0 1 22.500009,12.375022 4.5000092,4.500009 0 0 1 18,16.875031 4.5000092,4.500009 0 0 1 13.499991,12.375022 4.5000092,4.500009 0 0 1 18,7.8750129 Z" />
</svg>
