<?xml version="1.0" encoding="UTF-8" standalone="no"?>
<svg
   height="24"
   width="24"
   version="1.1"
   id="svg302"
   sodipodi:docname="Window_08_24.svg"
   inkscape:export-filename="Window_08_24.png"
   inkscape:export-xdpi="96"
   inkscape:export-ydpi="96"
   inkscape:version="1.2.1 (9c6d41e410, 2022-07-14)"
   xml:space="preserve"
   xmlns:inkscape="http://www.inkscape.org/namespaces/inkscape"
   xmlns:sodipodi="http://sodipodi.sourceforge.net/DTD/sodipodi-0.dtd"
   xmlns="http://www.w3.org/2000/svg"
   xmlns:svg="http://www.w3.org/2000/svg"><g
     id="g2220"
     transform="translate(-1,-1)"><g
       id="path294"><path
         id="path377"
         style="color:#000000;fill:#00aad4;stroke-linecap:round;stroke-dashoffset:1.49998"
         d="M 2,3 V 24 H 24 V 3 Z m 1.5,4 h 19 v 15.5 h -19 z"
         sodipodi:nodetypes="cccccccccc" /></g><path
       style="fill:none;stroke:#00aad4;stroke-width:1.875;stroke-linecap:round;stroke-linejoin:round;stroke-dasharray:none;stroke-opacity:1"
       d="m 7.75,15.25 3,3 7.5,-7.5"
       id="path364" /></g><defs
     id="defs306" /><sodipodi:namedview
     id="namedview304"
     pagecolor="#ffffff"
     bordercolor="#666666"
     borderopacity="1.0"
     inkscape:pageshadow="2"
     inkscape:pageopacity="0.0"
     inkscape:pagecheckerboard="0"
     inkscape:deskcolor="#d1d1d1"
     showgrid="true"
     inkscape:zoom="38.25"
     inkscape:cx="11.228758"
     inkscape:cy="12"
     inkscape:current-layer="g2220"
     inkscape:showpageshadow="2"><inkscape:grid
       type="xygrid"
       id="grid889" /></sodipodi:namedview></svg>
