<svg width="24" height="24" version="1.1" xmlns="http://www.w3.org/2000/svg">
 <rect x="3.375" y="4.875" width="17.25" height="16.75" fill="#ffffff" stroke="#999999" stroke-linecap="round" stroke-width=".75" style="paint-order:normal"/>
 <path d="m4.5 2h15c0.828431 0 1.5 0.6716 1.5 1.5v2.5h-18v-2.5c0-0.8284 0.6715729-1.5 1.5-1.5z" fill="#d40000" style="paint-order:normal"/>
 <path d="m9.628097 17.3836v-7.7672l-2.311657 1.4795" fill="none" stroke="#4d4d4d" stroke-linecap="round" stroke-linejoin="round" stroke-width="1.23288"/>
 <path d="m15.052755 9.6164-2.548464 4.6623m-0.225509 0.8857c0-1.0214 0.827966-1.8493 1.849315-1.8493s1.849315 0.8279 1.849315 1.8493v0.3698c0 1.0213-0.827966 1.8494-1.849315 1.8494s-1.849315-0.8281-1.849315-1.8494z" fill="none" stroke="#4d4d4d" stroke-linecap="round" stroke-linejoin="round" stroke-width="1.23288"/>
</svg>
