<?xml version="1.0" encoding="UTF-8" standalone="no"?>
<svg
   height="32"
   width="32"
   version="1.1"
   id="svg21"
   sodipodi:docname="pg_add_project_from_file_200.svg"
   inkscape:export-filename="pg_add_project_from_file_200.png"
   inkscape:export-xdpi="96"
   inkscape:export-ydpi="96"
   inkscape:version="1.3-beta (cedbd6c6ff, 2023-05-28)"
   xmlns:inkscape="http://www.inkscape.org/namespaces/inkscape"
   xmlns:sodipodi="http://sodipodi.sourceforge.net/DTD/sodipodi-0.dtd"
   xmlns="http://www.w3.org/2000/svg"
   xmlns:svg="http://www.w3.org/2000/svg">
  <defs
     id="defs21" />
  <sodipodi:namedview
     id="namedview21"
     pagecolor="#ffffff"
     bordercolor="#000000"
     borderopacity="0.25"
     inkscape:showpageshadow="2"
     inkscape:pageopacity="0.0"
     inkscape:pagecheckerboard="0"
     inkscape:deskcolor="#d1d1d1"
     showgrid="true"
     inkscape:current-layer="svg21">
    <inkscape:grid
       id="grid21"
       units="px"
       originx="0"
       originy="0"
       spacingx="0.5"
       spacingy="0.5"
       empcolor="#0099e5"
       empopacity="0.30196078"
       color="#0099e5"
       opacity="0.14901961"
       empspacing="2"
       dotted="false"
       gridanglex="30"
       gridanglez="30"
       visible="true" />
  </sodipodi:namedview>
  <linearGradient
     id="a"
     gradientTransform="matrix(1.0666667 0 0 .88888897 1 1.388888)"
     gradientUnits="userSpaceOnUse"
     x1="-11"
     x2="-5"
     y1="14.5"
     y2="18.5">
    <stop
       offset="0"
       stop-color="#f00"
       id="stop1" />
    <stop
       offset="1"
       stop-color="#fff"
       id="stop2" />
  </linearGradient>
  <linearGradient
     id="b"
     gradientTransform="matrix(1.0666667 0 0 .88888889 -.066667 3.166667)"
     gradientUnits="userSpaceOnUse"
     x1="-3"
     x2="-9"
     y1="26.5"
     y2="22.5">
    <stop
       offset="0"
       stop-color="#06f"
       id="stop3" />
    <stop
       offset="1"
       stop-color="#fff"
       id="stop4" />
  </linearGradient>
  <linearGradient
     id="c"
     gradientTransform="matrix(.88888889 0 0 1.0666667 -1.666667 -1.9)"
     gradientUnits="userSpaceOnUse"
     x1="-13"
     x2="-9"
     y1="24.5"
     y2="18.5">
    <stop
       offset="0"
       stop-color="#0c0"
       id="stop5" />
    <stop
       offset="1"
       stop-color="#fff"
       id="stop6" />
  </linearGradient>
  <linearGradient
     id="d"
     gradientTransform="matrix(.88888886 0 0 1.0666667 .111111 -.833333)"
     gradientUnits="userSpaceOnUse"
     x1="-1"
     x2="-5"
     y1="16.5"
     y2="22.5">
    <stop
       offset="0"
       stop-color="#fc0"
       id="stop7" />
    <stop
       offset="1"
       stop-color="#fff"
       id="stop8" />
  </linearGradient>
  <linearGradient
     id="e"
     gradientUnits="userSpaceOnUse"
     x1="29.000002"
     x2="19.000001"
     y1="28.999999"
     y2="18.999998">
    <stop
       offset="0"
       stop-color="#009600"
       id="stop9" />
    <stop
       offset="1"
       stop-color="#6edb39"
       id="stop10" />
  </linearGradient>
  <path
     d="m6.735655.73565501h19.52869v25.52868999h-19.52869z"
     style="fill:#fff;stroke:#d4aa00;stroke-width:1.47131;stroke-linecap:round;stroke-linejoin:round;stroke-miterlimit:5.6"
     id="path10" />
  <g
     fill="none"
     stroke="#b2d1ff"
     stroke-width="1.5"
     transform="translate(-5 -2)"
     id="g14">
    <path
       d="m16.5 7.25h10"
       id="path11" />
    <path
       d="m16.5 11.25h10"
       id="path12" />
    <path
       d="m16.5 15.25h10"
       id="path13" />
    <path
       d="m18 19.25h8.5"
       id="path14" />
  </g>
  <g
     stroke-linecap="round"
     stroke-linejoin="round"
     transform="matrix(1.125 0 0 1.125 16.875 -.0625)"
     id="g20">
    <g
       stroke-width="1.77051"
       id="g19">
      <path
         d="m-15 12.5h10.6666667v5.333333h-10.6666667z"
         fill="url(#a)"
         stroke-width="1.72401"
         id="path15" />
      <g
         stroke-width="1.724"
         id="g18">
        <path
           d="m-9.6666667 23.166667h10.6666667v5.333333h-10.6666667z"
           fill="url(#b)"
           id="path16" />
        <path
           d="m-15 28.5v-10.666667h5.3333333v10.666667z"
           fill="url(#c)"
           id="path17" />
        <path
           d="m-4.3333333 23.166667v-10.666667h5.3333333v10.666667z"
           fill="url(#d)"
           id="path18" />
      </g>
    </g>
    <path
       d="m-9.6666667 17.833333h5.3333334v5.333334h-5.3333334z"
       stroke-width="4.26666"
       id="path19" />
  </g>
  <circle
     cx="24"
     cy="24"
     fill="url(#e)"
     r="8.000001"
     stroke-width="2"
     transform="matrix(0 1 1 0 0 0)"
     id="circle20" />
  <g
     fill="none"
     stroke="#fff"
     stroke-linecap="round"
     transform="matrix(1.9999998 0 0 1.9999998 1.000002 1.000003)"
     id="g21">
    <path
       d="m11.5 9.5v4"
       id="path20" />
    <path
       d="m13.5 11.5h-4"
       id="path21" />
  </g>
</svg>
