<?xml version="1.0" encoding="UTF-8" standalone="no"?>
<svg
   height="32"
   width="32"
   version="1.1"
   id="svg260"
   sodipodi:docname="Setup_06_32.svg"
   inkscape:export-filename="Setup_06_32.png"
   inkscape:export-xdpi="96"
   inkscape:export-ydpi="96"
   inkscape:version="1.2-beta (1b65182ce9, 2022-04-05)"
   xmlns:inkscape="http://www.inkscape.org/namespaces/inkscape"
   xmlns:sodipodi="http://sodipodi.sourceforge.net/DTD/sodipodi-0.dtd"
   xmlns="http://www.w3.org/2000/svg"
   xmlns:svg="http://www.w3.org/2000/svg">
  <defs
     id="defs264" />
  <sodipodi:namedview
     id="namedview262"
     pagecolor="#ffffff"
     bordercolor="#666666"
     borderopacity="1.0"
     inkscape:pageshadow="2"
     inkscape:pageopacity="0.0"
     inkscape:pagecheckerboard="0"
     inkscape:deskcolor="#d1d1d1"
     showgrid="true"
     inkscape:zoom="28.6875"
     inkscape:cx="16"
     inkscape:cy="16"
     inkscape:current-layer="svg260">
    <inkscape:grid
       type="xygrid"
       id="grid2486" />
  </sodipodi:namedview>
  <path
     d="m20.007976 1.4242725-2.490841 4.3802203-3.034109.0010898-2.491898-4.3829415-3.4641784 1.4349082 1.3371717 4.8612464-2.1462099 2.1446692-4.8585751-1.3359925-1.4350629 3.4645486 4.3802208 2.490842.00109 3.034109-4.3829428 2.491896 1.43491 3.464179 4.8612454-1.33717 2.1446684 2.14621-1.3359929 4.858576 3.4645493 1.435063 2.490842-4.380222 3.034109-.0011 2.4919 4.382942 3.464178-1.43491-1.337173-4.861246 2.14621-2.144669 4.858578 1.335994 1.435063-3.464548-4.380224-2.490844-.0011-3.034109 4.382944-2.491897-1.43491-3.464177-4.861248 1.3371689-2.144668-2.1462095 1.335993-4.8585746zm-2.094558 9.9563275a5.0000005 5.0000005 0 0 1 2.705979 6.532816 5.0000005 5.0000005 0 0 1 -6.532814 2.705982 5.0000005 5.0000005 0 0 1 -2.70598-6.532816 5.0000005 5.0000005 0 0 1 6.532815-2.705982z"
     fill="none"
     stroke="#00aad4"
     stroke-linejoin="round"
     stroke-width="1.99999"
     id="path258" />
</svg>
