<?xml version="1.0" encoding="UTF-8" standalone="no"?>
<svg
   height="64"
   width="64"
   version="1.1"
   id="svg434"
   sodipodi:docname="Folder_12_64.svg"
   inkscape:export-filename="Folder_12_64.png"
   inkscape:export-xdpi="96"
   inkscape:export-ydpi="96"
   inkscape:version="1.2 (dc2aedaf03, 2022-05-15)"
   xml:space="preserve"
   xmlns:inkscape="http://www.inkscape.org/namespaces/inkscape"
   xmlns:sodipodi="http://sodipodi.sourceforge.net/DTD/sodipodi-0.dtd"
   xmlns="http://www.w3.org/2000/svg"
   xmlns:svg="http://www.w3.org/2000/svg"><defs
     id="defs436" /><sodipodi:namedview
     id="namedview12"
     pagecolor="#ffffff"
     bordercolor="#666666"
     borderopacity="1.0"
     inkscape:pageshadow="2"
     inkscape:pageopacity="0.0"
     inkscape:pagecheckerboard="0"
     inkscape:deskcolor="#d1d1d1"
     showgrid="true"
     inkscape:zoom="14.34375"
     inkscape:cx="28.479303"
     inkscape:cy="32"
     inkscape:current-layer="svg434"
     inkscape:showpageshadow="2"><inkscape:grid
       type="xygrid"
       id="grid139" /></sodipodi:namedview><g
     id="g1077"
     transform="translate(0,-3.0000449)"><path
       d="m 2,57 -5e-7,-44 c 0,-2 2,-4 4,-4 H 18 c 2,0 4.000007,2 4,4 v 2 h 32 v 10"
       stroke-linejoin="round"
       id="path145-1"
       style="fill:#fff3cc;stroke:#f4c025;stroke-width:3.99991;stroke-linecap:round"
       sodipodi:nodetypes="cccccccc" /><path
       d="M 62.000097,25.001436 H 9.9999744 L 1.9999556,56.999995 H 54.000078 Z"
       stroke-linejoin="round"
       id="path147"
       style="fill:#f4c025;fill-opacity:1;stroke:#f4c025;stroke-width:3.99991;stroke-linecap:round"
       sodipodi:nodetypes="ccccc" /></g></svg>
