<?xml version="1.0" encoding="UTF-8" standalone="no"?>
<svg
   width="48"
   height="48"
   version="1.1"
   viewBox="0 0 12.7 12.7"
   id="svg5"
   sodipodi:docname="Time_12_48.svg"
   inkscape:export-filename="Time_12_48.png"
   inkscape:export-xdpi="96"
   inkscape:export-ydpi="96"
   inkscape:version="1.3.2 (091e20e, 2023-11-25, custom)"
   xmlns:inkscape="http://www.inkscape.org/namespaces/inkscape"
   xmlns:sodipodi="http://sodipodi.sourceforge.net/DTD/sodipodi-0.dtd"
   xmlns="http://www.w3.org/2000/svg"
   xmlns:svg="http://www.w3.org/2000/svg">
  <defs
     id="defs5" />
  <sodipodi:namedview
     id="namedview5"
     pagecolor="#ffffff"
     bordercolor="#000000"
     borderopacity="0.25"
     inkscape:showpageshadow="2"
     inkscape:pageopacity="0.0"
     inkscape:pagecheckerboard="0"
     inkscape:deskcolor="#d1d1d1"
     showgrid="true"
     inkscape:current-layer="svg5">
    <inkscape:grid
       id="grid5"
       units="px"
       originx="0"
       originy="0"
       spacingx="0.13229167"
       spacingy="0.13229167"
       empcolor="#0099e5"
       empopacity="0.30196078"
       color="#0099e5"
       opacity="0.14901961"
       empspacing="2"
       dotted="false"
       gridanglex="30"
       gridanglez="30"
       visible="true" />
  </sodipodi:namedview>
  <path
     d="m3.1749999 1.3890626h6.3500002"
     fill="none"
     stroke="#2a7efe"
     stroke-linecap="round"
     stroke-linejoin="round"
     stroke-width="1.19062"
     id="path1" />
  <path
     d="m3.571875 1.9843751v1.190625c0 1.1906227 1.1906265 2.3812507 1.984375 2.7781249v0.7937504c-0.7937485 0.396874-1.984375 1.587502-1.984375 2.778125v1.1906246h5.5562501v-1.1906246c0-1.190623-1.190627-2.381251-1.984375-2.778125v-0.7937504c0.793748-0.3968742 1.984375-1.5875022 1.984375-2.7781249v-1.190625z"
     fill="#2a7efe"
     id="path2" />
  <path
     d="m4.2074949 1.9843751c3e-7 1.9843732 0.15813 2.7781258 1.7456302 3.5718751v1.5875002c-1.5874987 0.793749-1.7456299 1.587502-1.7456302 3.5718746h4.2850102c0-1.9843726-0.158133-2.7781256-1.7456301-3.5718746v-1.5875002c1.5874981-0.7937493 1.7456301-1.5875019 1.7456301-3.5718751z"
     fill="#ffffff"
     id="path3" />
  <path
     d="m3.1749999 11.310937h6.3500002"
     fill="none"
     stroke="#2a7efe"
     stroke-linecap="round"
     stroke-linejoin="round"
     stroke-width="1.19062"
     id="path4" />
  <path
     d="m4.3005126 3.5718749c0.1590096 0.9073462 0.5775234 1.4468308 1.6526125 1.9843753v3.1750002c-1.0750891 0.537544-1.4936029 1.077028-1.6526125 1.9843746h4.0989745c-0.15901-0.9073466-0.577523-1.4468306-1.6526121-1.9843746v-3.1750002c1.0750891-0.5375445 1.4936021-1.0770291 1.6526121-1.9843753z"
     fill="#ccaa00"
     stroke-linecap="round"
     stroke-linejoin="round"
     stroke-width=".793749"
     id="path5" />
</svg>
