<?xml version="1.0" encoding="UTF-8" standalone="no"?>
<svg
   width="32"
   height="32"
   version="1.1"
   viewBox="0 0 8.4667 8.4667"
   id="svg6"
   sodipodi:docname="tag_ul_200.svg"
   inkscape:export-filename="tag_ul_200.png"
   inkscape:export-xdpi="96"
   inkscape:export-ydpi="96"
   inkscape:version="1.3.2 (091e20e, 2023-11-25, custom)"
   xmlns:inkscape="http://www.inkscape.org/namespaces/inkscape"
   xmlns:sodipodi="http://sodipodi.sourceforge.net/DTD/sodipodi-0.dtd"
   xmlns="http://www.w3.org/2000/svg"
   xmlns:svg="http://www.w3.org/2000/svg">
  <defs
     id="defs6" />
  <sodipodi:namedview
     id="namedview6"
     pagecolor="#ffffff"
     bordercolor="#000000"
     borderopacity="0.25"
     inkscape:showpageshadow="2"
     inkscape:pageopacity="0.0"
     inkscape:pagecheckerboard="0"
     inkscape:deskcolor="#d1d1d1"
     showgrid="true"
     inkscape:current-layer="svg6">
    <inkscape:grid
       id="grid6"
       units="px"
       originx="0"
       originy="0"
       spacingx="0.13229219"
       spacingy="0.13229219"
       empcolor="#0099e5"
       empopacity="0.30196078"
       color="#0099e5"
       opacity="0.14901961"
       empspacing="2"
       dotted="false"
       gridanglex="30"
       gridanglez="30"
       visible="true" />
  </sodipodi:namedview>
  <path
     d="M 2.6463479,5.0271032 H 7.4074883"
     fill="none"
     stroke="#008dd2"
     stroke-width="0.529167"
     id="path1-0"
     sodipodi:nodetypes="cc" />
  <path
     d="m 2.646348,1.8520902 4.7611403,3e-7"
     fill="none"
     stroke="#008dd2"
     stroke-width="0.529167"
     id="path3-7"
     sodipodi:nodetypes="cc" />
  <g
     transform="matrix(1.788978,0,0,2.0000278,1.6997881,-3.1673043)"
     stroke-width="1.05734"
     id="g4-9">
    <path
       d="M 0.52910647,3.3072398 3.1904809,3.3034046"
       fill="none"
       stroke="#008dd2"
       stroke-width="0.279752"
       id="path4-5"
       sodipodi:nodetypes="cc" />
  </g>
  <circle
     style="fill:#ff7f00;fill-opacity:1;stroke:none;stroke-width:0.176389;stroke-linecap:round;stroke-linejoin:round"
     id="path7-8"
     cx="1.5875062"
     cy="1.8520906"
     r="0.52916873" />
  <circle
     style="fill:#ff7f00;fill-opacity:1;stroke:none;stroke-width:0.176389;stroke-linecap:round;stroke-linejoin:round"
     id="circle1-3"
     cx="1.5875063"
     cy="5.0271034"
     r="0.52916873" />
  <circle
     style="fill:#ff7f00;fill-opacity:1;stroke:none;stroke-width:0.176389;stroke-linecap:round;stroke-linejoin:round"
     id="circle2-5"
     cx="1.5875062"
     cy="3.4395969"
     r="0.52916873" />
  <path
     d="m 2.646348,6.6146091 4.7611403,3e-7"
     fill="none"
     stroke="#008dd2"
     stroke-width="0.529167"
     id="path2"
     sodipodi:nodetypes="cc" />
  <circle
     style="fill:#ff7f00;fill-opacity:1;stroke:none;stroke-width:0.176389;stroke-linecap:round;stroke-linejoin:round"
     id="circle3"
     cx="1.5875062"
     cy="6.6146097"
     r="0.52916873" />
</svg>
