<?xml version="1.0" encoding="UTF-8" standalone="no"?>
<svg
   width="48"
   height="48"
   version="1.1"
   viewBox="0 0 48 48"
   id="svg17"
   sodipodi:docname="tdblookuplistbox_200.svg"
   inkscape:export-filename="tdblookuplistbox_200.png"
   inkscape:export-xdpi="96"
   inkscape:export-ydpi="96"
   inkscape:version="1.3.2 (091e20e, 2023-11-25, custom)"
   xmlns:inkscape="http://www.inkscape.org/namespaces/inkscape"
   xmlns:sodipodi="http://sodipodi.sourceforge.net/DTD/sodipodi-0.dtd"
   xmlns="http://www.w3.org/2000/svg"
   xmlns:svg="http://www.w3.org/2000/svg">
  <sodipodi:namedview
     id="namedview17"
     pagecolor="#ffffff"
     bordercolor="#000000"
     borderopacity="0.25"
     inkscape:showpageshadow="2"
     inkscape:pageopacity="0.0"
     inkscape:pagecheckerboard="0"
     inkscape:deskcolor="#d1d1d1"
     showgrid="true"
     inkscape:current-layer="svg17">
    <inkscape:grid
       id="grid17"
       units="px"
       originx="0"
       originy="0"
       spacingx="0.5"
       spacingy="0.5"
       empcolor="#0099e5"
       empopacity="0.30196078"
       color="#0099e5"
       opacity="0.14901961"
       empspacing="2"
       dotted="false"
       gridanglex="30"
       gridanglez="30"
       visible="true" />
  </sodipodi:namedview>
  <defs
     id="defs3">
    <linearGradient
       id="a"
       x1="4"
       x2="28"
       y1="4"
       y2="4"
       gradientUnits="userSpaceOnUse">
      <stop
         stop-color="#4276c4"
         offset="0"
         id="stop1" />
      <stop
         stop-color="#80b3ff"
         offset=".3333333"
         id="stop2" />
      <stop
         stop-color="#04a"
         offset="1"
         id="stop3" />
    </linearGradient>
  </defs>
  <ellipse
     cx="16"
     cy="27"
     rx="10.2"
     ry="3.2"
     fill="none"
     stroke="url(#a)"
     stroke-linecap="round"
     stroke-linejoin="round"
     stroke-width="3.6"
     id="ellipse3" />
  <ellipse
     cx="16"
     cy="24.4"
     rx="9.8"
     ry="2.8"
     fill="none"
     stroke="#ffffff"
     stroke-linecap="round"
     stroke-linejoin="round"
     stroke-width="2.4"
     id="ellipse4" />
  <ellipse
     cx="16"
     cy="21"
     rx="10.2"
     ry="3.2"
     fill="none"
     stroke="url(#a)"
     stroke-linecap="round"
     stroke-linejoin="round"
     stroke-width="3.6"
     id="ellipse5" />
  <ellipse
     cx="16"
     cy="18.4"
     rx="9.8"
     ry="2.8"
     fill="none"
     stroke="#ffffff"
     stroke-linecap="round"
     stroke-linejoin="round"
     stroke-width="2.4"
     id="ellipse6" />
  <ellipse
     cx="16"
     cy="15"
     rx="10.2"
     ry="3.2"
     fill="none"
     stroke="url(#a)"
     stroke-linecap="round"
     stroke-linejoin="round"
     stroke-width="3.6"
     id="ellipse7" />
  <ellipse
     cx="16"
     cy="12.4"
     rx="9.8"
     ry="2.8"
     fill="none"
     stroke="#ffffff"
     stroke-linecap="round"
     stroke-linejoin="round"
     stroke-width="2.4"
     id="ellipse8" />
  <ellipse
     cx="16"
     cy="9"
     rx="10.8"
     ry="3.8"
     fill="#80b3ff"
     fill-rule="evenodd"
     stroke="url(#a)"
     stroke-linecap="round"
     stroke-linejoin="round"
     stroke-width="2.4"
     id="ellipse9" />
  <rect
     x="15.500002"
     y="18.5"
     width="29"
     height="29"
     fill="#f9f9f9"
     stroke="#2a7efe"
     style="paint-order:normal"
     id="rect9" />
  <rect
     x="37.5"
     y="18.5"
     width="6.9999981"
     height="29"
     fill="#e6e6e6"
     stroke="#2a7efe"
     style="paint-order:normal"
     id="rect10" />
  <path
     d="m41.000002 24v10"
     fill="#e6e6e6"
     stroke="#2a7efe"
     stroke-linecap="round"
     stroke-linejoin="round"
     stroke-width="2"
     id="path10" />
  <path
     d="m20.000002 37h10"
     fill="none"
     stroke="#b3b3b3"
     stroke-width="2px"
     id="path11" />
  <path
     d="m20.000002 33h12"
     fill="none"
     stroke="#b3b3b3"
     stroke-width="2px"
     id="path12" />
  <path
     d="m20.000002 28.999998h11.000002"
     fill="none"
     stroke="#b3b3b3"
     stroke-width="2px"
     id="path13" />
  <path
     d="m20.000002 24.999998 13 2e-6"
     fill="none"
     stroke="#b3b3b3"
     stroke-width="2px"
     id="path14" />
  <path
     d="m20.000002 41h12"
     fill="none"
     stroke="#b3b3b3"
     stroke-width="2px"
     id="path15" />
  <path
     d="m32 4 8 8h-5"
     fill="none"
     stroke="#ff6600"
     stroke-linecap="round"
     stroke-linejoin="round"
     stroke-width="2px"
     id="path16" />
  <path
     d="m42 3h-5l8 8"
     fill="none"
     stroke="#ff6600"
     stroke-linecap="round"
     stroke-linejoin="round"
     stroke-width="2"
     id="path17" />
</svg>
