<?xml version="1.0" encoding="UTF-8" standalone="no"?>
<svg
   height="48"
   viewBox="0 0 12.7 12.700001"
   width="48"
   version="1.1"
   id="svg746"
   sodipodi:docname="Health_03_48.svg"
   inkscape:version="1.2.1 (9c6d41e410, 2022-07-14)"
   inkscape:export-filename="Health_03_48.png"
   inkscape:export-xdpi="96"
   inkscape:export-ydpi="96"
   xmlns:inkscape="http://www.inkscape.org/namespaces/inkscape"
   xmlns:sodipodi="http://sodipodi.sourceforge.net/DTD/sodipodi-0.dtd"
   xmlns:xlink="http://www.w3.org/1999/xlink"
   xmlns="http://www.w3.org/2000/svg"
   xmlns:svg="http://www.w3.org/2000/svg">
  <defs
     id="defs750">
    <radialGradient
       inkscape:collect="always"
       xlink:href="#linearGradient1041"
       id="radialGradient1043"
       cx="1.9253448"
       cy="1.5859377"
       fx="1.9253448"
       fy="1.5859377"
       r="1.8520745"
       gradientTransform="matrix(0.79826018,3.3713267,-4.7312813,1.1327567,10.648129,-3.1656807)"
       gradientUnits="userSpaceOnUse" />
    <linearGradient
       inkscape:collect="always"
       id="linearGradient1041">
      <stop
         style="stop-color:#ffaaaa;stop-opacity:1"
         offset="0"
         id="stop1037" />
      <stop
         style="stop-color:#ff0000;stop-opacity:1"
         offset="1"
         id="stop1039" />
    </linearGradient>
    <linearGradient
       id="a"
       gradientUnits="userSpaceOnUse"
       x1="42.679054"
       x2="28.320946"
       y1="42.679054"
       y2="28.320946"
       gradientTransform="matrix(0.98376471,0,0,0.98376471,0.57635198,0.57635198)">
      <stop
         offset="0"
         stop-color="#009600"
         id="stop1250" />
      <stop
         offset="1"
         stop-color="#6edb39"
         id="stop1252" />
    </linearGradient>
    <linearGradient
       id="a-8"
       gradientUnits="userSpaceOnUse"
       x1="42.679054"
       x2="28.320946"
       y1="42.679054"
       y2="28.320946"
       gradientTransform="matrix(0.9576471,0,0,0.9576471,1.8035268,1.803529)">
      <stop
         offset="0"
         stop-color="#009600"
         id="stop1250-0" />
      <stop
         offset="1"
         stop-color="#6edb39"
         id="stop1252-2" />
    </linearGradient>
  </defs>
  <sodipodi:namedview
     id="namedview748"
     pagecolor="#ffffff"
     bordercolor="#666666"
     borderopacity="1.0"
     inkscape:showpageshadow="2"
     inkscape:pageopacity="0.0"
     inkscape:pagecheckerboard="0"
     inkscape:deskcolor="#d1d1d1"
     showgrid="true"
     inkscape:zoom="19.125"
     inkscape:cx="23.24183"
     inkscape:cy="24"
     inkscape:current-layer="svg746">
    <inkscape:grid
       type="xygrid"
       id="grid1256" />
  </sodipodi:namedview>
  <path
     id="path353"
     style="fill:url(#radialGradient1043);fill-opacity:1;stroke:#d40000;stroke-width:0.264583px;stroke-linecap:butt;stroke-linejoin:miter;stroke-opacity:1"
     d="M 3.5919201,0.92594876 C 0.65521514,0.93321196 -1.4910665,6.3242594 6.3498369,11.745517 16.696595,4.5916927 9.6516784,-2.5081383 6.3498369,2.7438611 5.5501721,1.4718925 4.5304549,0.92362676 3.5919201,0.92594876 Z" />
  <g
     id="g2303"
     transform="scale(0.26458334)">
    <circle
       cx="35.799999"
       cy="35.799999"
       fill="url(#a)"
       stroke-dashoffset="1.49998"
       stroke-linejoin="round"
       stroke-width="2.02703"
       transform="matrix(0,1,1,0,0,0)"
       id="circle1255"
       style="fill:url(#a-8);stroke:#ffffff;stroke-width:2.4;stroke-linecap:round;stroke-dasharray:none"
       r="11.000001" />
    <path
       d="M 35.800002,30.5 V 41.1"
       id="path1340"
       style="fill:none;stroke:#ffffff;stroke-width:2.4;stroke-linecap:round;stroke-dasharray:none" />
    <path
       d="m 41.100002,35.8 h -10.6"
       id="path1342"
       style="fill:none;stroke:#ffffff;stroke-width:2.4;stroke-linecap:round;stroke-dasharray:none" />
    <rect
       style="fill:none;stroke:none;stroke-width:1.5;stroke-linecap:round;stroke-linejoin:round;stroke-miterlimit:5.6"
       id="rect1633"
       width="25"
       height="25"
       x="23"
       y="23" />
  </g>
</svg>
