<?xml version="1.0" encoding="UTF-8" standalone="no"?>
<svg
   height="64"
   viewBox="0 0 16.933333 16.933335"
   width="64"
   version="1.1"
   id="svg457"
   sodipodi:docname="Font_10_64.svg"
   inkscape:export-filename="Font_10_64.png"
   inkscape:export-xdpi="96"
   inkscape:export-ydpi="96"
   inkscape:version="1.2 (dc2aedaf03, 2022-05-15)"
   xmlns:inkscape="http://www.inkscape.org/namespaces/inkscape"
   xmlns:sodipodi="http://sodipodi.sourceforge.net/DTD/sodipodi-0.dtd"
   xmlns="http://www.w3.org/2000/svg"
   xmlns:svg="http://www.w3.org/2000/svg">
  <defs
     id="defs461">
    <radialGradient
       id="a-8"
       cx="12.1"
       cy="10.900001"
       gradientTransform="matrix(0,2.0740741,-2.0740739,4e-8,43.307408,-4.396297)"
       gradientUnits="userSpaceOnUse"
       r="4.5">
      <stop
         offset="0"
         stop-color="#ff7f2a"
         id="stop788" />
      <stop
         offset="1"
         stop-color="#d45500"
         id="stop790" />
    </radialGradient>
    <filter
       inkscape:collect="always"
       style="color-interpolation-filters:sRGB"
       id="filter2521"
       x="-0.077506219"
       y="-0.072650787"
       width="1.1550124"
       height="1.1453016">
      <feGaussianBlur
         inkscape:collect="always"
         stdDeviation="0.51260733"
         id="feGaussianBlur2523" />
    </filter>
  </defs>
  <sodipodi:namedview
     id="namedview459"
     pagecolor="#ffffff"
     bordercolor="#666666"
     borderopacity="1.0"
     inkscape:showpageshadow="2"
     inkscape:pageopacity="0.0"
     inkscape:pagecheckerboard="0"
     inkscape:deskcolor="#d1d1d1"
     showgrid="true"
     inkscape:zoom="14.34375"
     inkscape:cx="27.572985"
     inkscape:cy="32"
     inkscape:current-layer="svg457">
    <inkscape:grid
       type="xygrid"
       id="grid1219" />
  </sodipodi:namedview>
  <g
     id="g2527">
    <path
       id="path2154"
       style="fill:#ffffff;stroke:none;filter:url(#filter2521)"
       d="M 6.8786502,0 A 1.0586996,1.0586996 0 0 0 5.8828453,0.70331627 L 0.59169517,15.519467 a 1.0586996,1.0586996 0 0 0 0.99632163,1.414384 h 2.3435263 a 1.0586996,1.0586996 0 0 0 0.9963217,-0.703317 l 1.2614217,-3.5295 h 4.5547605 l 1.261939,3.5295 a 1.0586996,1.0586996 0 0 0 0.995805,0.703317 h 2.344043 a 1.0586996,1.0586996 0 0 0 0.995805,-1.414384 L 11.051005,0.70331627 A 1.0586996,1.0586996 0 0 0 10.054684,0 Z M 8.466667,6.3205447 9.2325118,8.466667 H 7.701339 Z" />
    <path
       d="M 6.8791671,1.0583333 1.5875001,15.875001 H 3.930953 l 1.5119048,-4.233334 h 6.0476192 l 1.511905,4.233334 h 2.343452 L 10.054167,1.0583333 Z M 8.4666669,3.1750001 10.734524,9.5250007 H 6.1988099 Z"
       stroke="#ffffff"
       stroke-width="0.198438"
       id="path723"
       sodipodi:nodetypes="ccccccccccccc"
       style="stroke:none" />
  </g>
  <g
     id="g2338"
     transform="scale(0.5291667)">
    <circle
       cx="23.5"
       cy="23.5"
       style="fill:url(#a-8);stroke:#ffffff;stroke-width:1.6;stroke-linecap:round;stroke-linejoin:round;stroke-dashoffset:1.49998"
       transform="matrix(0,1,1,0,0,0)"
       id="ellipse793"
       r="7.6999998" />
    <g
       fill="none"
       stroke-width="1.25031"
       transform="matrix(1.8881996,0,0,1.8886627,0.91279074,2.6489683)"
       id="g847"
       style="fill:#ffffff;fill-opacity:1">
      <path
         d="M 11.28698,9.0599682 13.267602,11.040104 11.28698,13.02024"
         id="path843"
         style="fill:none;fill-opacity:1;stroke:#ffffff;stroke-width:1.25024;stroke-linecap:round;stroke-linejoin:round;stroke-dasharray:none"
         sodipodi:nodetypes="ccc" />
    </g>
  </g>
</svg>
