<svg width="48" height="48" version="1.1" xmlns="http://www.w3.org/2000/svg">
 <path d="m39.051798 30.841759c3.08069 3.745209 2.894849 6.24202 2.894849 13.108238h-35.896127c0-6.866218-0.075864-10.611432 2.894849-13.108238 6.0918196-4.92214 25.537567-4.92214 30.106429 0z" fill="none" stroke="#00aad4" stroke-linecap="round" stroke-linejoin="round" stroke-width="2.1"/>
 <path d="m16.020792 27.347145 3.209907 3.635815 3.209905 12.967293h3.209908l3.209906-12.967293 3.209906-3.832809z" fill="#00aad4" fill-rule="evenodd"/>
 <ellipse cx="23.999201" cy="16.07213" rx="9.2311563" ry="11.074887" fill="none" stroke="#00aad4" stroke-linecap="square" stroke-linejoin="round" stroke-width="2.1" style="paint-order:normal"/>
 <path d="m13.998083 15.510882s2.619689-4.81978 4.78795-2.88982c6.295996 5.603366 8.349176-5.913751 15.217229 2.88982 2.500648-8.7540302-3.910619-14.209174-9.826171-12.031485-6.312332-2.07931-12.679656 4.528031-10.179008 12.031485z" fill="#00aad4" fill-rule="evenodd"/>
</svg>
