<?xml version="1.0" encoding="UTF-8" standalone="no"?>
<svg
   height="32"
   width="32"
   version="1.1"
   id="svg322"
   sodipodi:docname="Grid_14_32.svg"
   inkscape:export-filename="Grid_14_32.png"
   inkscape:export-xdpi="96"
   inkscape:export-ydpi="96"
   inkscape:version="1.2.1 (9c6d41e410, 2022-07-14)"
   xmlns:inkscape="http://www.inkscape.org/namespaces/inkscape"
   xmlns:sodipodi="http://sodipodi.sourceforge.net/DTD/sodipodi-0.dtd"
   xmlns="http://www.w3.org/2000/svg"
   xmlns:svg="http://www.w3.org/2000/svg">
  <defs
     id="defs326" />
  <sodipodi:namedview
     id="namedview324"
     pagecolor="#ffffff"
     bordercolor="#666666"
     borderopacity="1.0"
     inkscape:showpageshadow="2"
     inkscape:pageopacity="0.0"
     inkscape:pagecheckerboard="0"
     inkscape:deskcolor="#d1d1d1"
     showgrid="true"
     inkscape:zoom="28.6875"
     inkscape:cx="15.494553"
     inkscape:cy="16"
     inkscape:current-layer="svg322">
    <inkscape:grid
       type="xygrid"
       id="grid1038" />
  </sodipodi:namedview>
  <g
     fill="none"
     stroke="#00aad4"
     id="g320"
     transform="rotate(90,16,16)">
    <path
       d="M 6.8,0.79999999 H 25.199999 V 31.2 H 6.8 Z"
       stroke-dashoffset="1.5"
       stroke-linecap="round"
       stroke-linejoin="round"
       stroke-width="1.6"
       id="path298" />
    <path
       d="m 6.5,6.8 h 19"
       stroke-width="1.6"
       id="path300" />
    <path
       d="m 12.799995,0.5 v 31"
       stroke-width="1.59999"
       id="path302" />
    <path
       d="M 25.5,24.8 H 6.5"
       stroke-width="1.6"
       id="path304" />
    <path
       d="m 18.799995,0.5 v 31"
       stroke-width="1.59999"
       id="path306" />
    <g
       stroke-width="1.6"
       id="g318">
      <path
         d="m 6.5,18.8 h 19"
         id="path308" />
      <path
         d="m 6.5,12.8 h 19"
         id="path310" />
      <g
         stroke-linecap="round"
         stroke-linejoin="round"
         id="g316">
        <path
           d="M 31.2,20.4 26.799967,16.000332 31.2,11.6"
           id="path312" />
        <path
           d="M 0.80000001,20.4 5.200033,16.000332 0.80000001,11.6"
           id="path314" />
      </g>
    </g>
  </g>
</svg>
