<?xml version="1.0" encoding="UTF-8" standalone="no"?>
<svg
   width="24"
   height="24"
   version="1.1"
   viewBox="0 0 24 24"
   id="svg8"
   sodipodi:docname="tticheckbox.svg"
   inkscape:version="1.3.2 (091e20e, 2023-11-25, custom)"
   xmlns:inkscape="http://www.inkscape.org/namespaces/inkscape"
   xmlns:sodipodi="http://sodipodi.sourceforge.net/DTD/sodipodi-0.dtd"
   xmlns="http://www.w3.org/2000/svg"
   xmlns:svg="http://www.w3.org/2000/svg">
  <sodipodi:namedview
     id="namedview8"
     pagecolor="#ffffff"
     bordercolor="#000000"
     borderopacity="0.25"
     inkscape:showpageshadow="2"
     inkscape:pageopacity="0.0"
     inkscape:pagecheckerboard="0"
     inkscape:deskcolor="#d1d1d1"
     showgrid="true"
     inkscape:current-layer="svg8">
    <inkscape:grid
       id="grid8"
       units="px"
       originx="0"
       originy="0"
       spacingx="0.5"
       spacingy="0.5"
       empcolor="#0099e5"
       empopacity="0.30196078"
       color="#0099e5"
       opacity="0.14901961"
       empspacing="2"
       dotted="false"
       gridanglex="30"
       gridanglez="30"
       visible="true" />
  </sodipodi:namedview>
  <defs
     id="defs6">
    <radialGradient
       id="a"
       cx="5.3999925"
       cy="1034.7039"
       r="4"
       gradientTransform="matrix(1.2499938,-1.2500079,0.75001073,0.75000232,-776.78893,-763.28024)"
       gradientUnits="userSpaceOnUse">
      <stop
         stop-color="#198d19"
         offset="0"
         id="stop1" />
      <stop
         stop-color="#ffffff"
         offset="1"
         id="stop2" />
    </radialGradient>
    <radialGradient
       id="c"
       cx="5.3999925"
       cy="1034.7039"
       r="4"
       gradientTransform="matrix(1.2499938,-1.2500079,0.75001073,0.75000232,-768.78893,-763.28022)"
       gradientUnits="userSpaceOnUse">
      <stop
         stop-color="#1a75ff"
         offset="0"
         id="stop3" />
      <stop
         stop-color="#ffffff"
         offset="1"
         id="stop4" />
    </radialGradient>
    <radialGradient
       id="b"
       cx="5.3999925"
       cy="1034.7039"
       r="4"
       gradientTransform="matrix(1.2499938,-1.2500079,0.75001073,0.75000232,-776.78893,-755.2802)"
       gradientUnits="userSpaceOnUse">
      <stop
         stop-color="#ff1919"
         offset="0"
         id="stop5" />
      <stop
         stop-color="#ffffff"
         offset="1"
         id="stop6" />
    </radialGradient>
  </defs>
  <rect
     x="10.25"
     y="10.249983"
     width="12.5"
     height="12.5"
     rx="2.3026319"
     ry="2.3026319"
     fill="#ececec"
     stroke="#2a7efe"
     stroke-linecap="round"
     stroke-width="0.5"
     style="stroke-linejoin:round;paint-order:normal"
     id="rect6" />
  <path
     d="M 13.619047,16.619 16,19 19.571429,14.2381"
     fill="none"
     stroke="#2a7efe"
     stroke-linecap="round"
     stroke-width="1.5"
     id="path6"
     style="stroke-linejoin:round" />
  <circle
     cx="5"
     cy="4.9999828"
     r="3.5"
     fill="url(#a)"
     fill-rule="evenodd"
     stroke="#198d19"
     stroke-linecap="square"
     style="fill:url(#a);stroke-linejoin:round;paint-order:normal"
     id="circle6" />
  <circle
     cx="13"
     cy="4.9999828"
     r="3.5"
     fill="url(#c)"
     fill-rule="evenodd"
     stroke="#1a75ff"
     stroke-linecap="square"
     style="fill:url(#c);stroke-linejoin:round;paint-order:normal"
     id="circle7" />
  <circle
     cx="5"
     cy="12.999983"
     r="3.5"
     fill="url(#b)"
     fill-rule="evenodd"
     stroke="#ff1a1a"
     stroke-linecap="square"
     style="fill:url(#b);stroke-linejoin:round;paint-order:normal"
     id="circle8" />
</svg>
