<svg width="24" height="24" version="1.1" viewBox="0 0 24 24" xmlns="http://www.w3.org/2000/svg">
 <defs>
  <linearGradient id="c" x1="23" x2="23" y1="6.5" y2="15" gradientTransform="matrix(.96541096 .96594741 -.96572052 .96625695 -.77739579 -17.718562)" gradientUnits="userSpaceOnUse">
   <stop stop-color="#89a02c" offset="0"/>
   <stop stop-color="#445016" offset="1"/>
  </linearGradient>
  <linearGradient id="b" x1="25.714283" x2="25.714283" y1="15.5" y2="6.2142854" gradientTransform="matrix(.96541096 .96594741 -.96572052 .96625695 -.77739579 -17.718562)" gradientUnits="userSpaceOnUse">
   <stop stop-color="#668000" offset="0"/>
   <stop stop-color="#aad400" offset="1"/>
  </linearGradient>
  <radialGradient id="a" cx="21.957434" cy="5.9936466" r="3.105469" gradientTransform="matrix(.96572494 .96635022 -.72452832 .72452838 -1.8622759 -16.561135)" gradientUnits="userSpaceOnUse">
   <stop stop-color="#803300" offset="0"/>
   <stop stop-color="#d45500" offset="1"/>
  </radialGradient>
 </defs>
 <path d="m17.999998 8.2500009 3.75-1.4999995" fill="none" stroke="#d4aa00" stroke-linecap="round" stroke-linejoin="round" stroke-width="1.5"/>
 <path d="m15.749999 6.0000014 1.499999-3.7499996" fill="none" stroke="#d4aa00" stroke-linecap="round" stroke-linejoin="round" stroke-width="1.5"/>
 <path d="m18.047344 5.9479234a6.8400402 8.879746 44.937656 0 0-4.359872-1.6295982l-9.6e-4 5.9928518 6.004612-9.61e-4a6.8400402 8.879746 44.937656 0 0-1.64378-4.3622926z" fill="url(#a)" stroke-linejoin="round" stroke-width="4.68465"/>
 <path d="m11.249999 2.2500017-1.4999996 1.5-1e-7 2.9999997" fill="none" stroke="#aca793" stroke-linecap="round" stroke-linejoin="round" stroke-width="1.5"/>
 <path d="m0.75000154 12.789195 1.4999983-1.539194h2.9999999" fill="none" stroke="#aca793" stroke-linecap="round" stroke-linejoin="round" stroke-width="1.5"/>
 <path d="m2.9999999 6.7500013 2.2499998 1e-7 3.382574 2.339262" fill="none" stroke="#aca793" stroke-linecap="round" stroke-linejoin="round" stroke-width="1.5"/>
 <path d="m21.749999 12.750001-1.500001 1.5h-2.999999" fill="none" stroke="#aca793" stroke-linecap="round" stroke-linejoin="round" stroke-width="1.5"/>
 <path d="m11.210802 23.249998 1.539197-1.499998 1e-6 -2.999999" fill="none" stroke="#aca793" stroke-linecap="round" stroke-linejoin="round" stroke-width="1.5"/>
 <path d="m17.249999 21v-2.249999l-2.342254-3.38208" fill="none" stroke="#aca793" stroke-linecap="round" stroke-linejoin="round" stroke-width="1.5"/>
 <path d="m19.691131 10.280027-5.974441 9.55e-4 9.56e-4 -5.9588873a6.8400402 8.879746 44.937656 0 0-6.782083 3.0692153 6.8400402 8.879746 44.937656 0 0-1.4425864 11.117952 6.8400402 8.879746 44.937656 0 0 11.111779-1.44339 6.8400402 8.879746 44.937656 0 0 3.086375-6.785845z" fill="url(#b)" stroke-linejoin="round" stroke-width="4.68465"/>
 <path d="m14.184462 9.8129509-8.2086238 8.2131851" fill="#c83737" stroke="url(#c)" stroke-linecap="round" stroke-linejoin="round" stroke-width="1.61535"/>
</svg>
