<?xml version="1.0" encoding="UTF-8" standalone="no"?>
<svg
   height="16"
   width="16"
   version="1.1"
   id="svg272"
   sodipodi:docname="Replace_05_16.svg"
   inkscape:export-filename="Replace_05_16.png"
   inkscape:export-xdpi="96"
   inkscape:export-ydpi="96"
   inkscape:version="1.2.1 (9c6d41e410, 2022-07-14)"
   xml:space="preserve"
   xmlns:inkscape="http://www.inkscape.org/namespaces/inkscape"
   xmlns:sodipodi="http://sodipodi.sourceforge.net/DTD/sodipodi-0.dtd"
   xmlns="http://www.w3.org/2000/svg"
   xmlns:svg="http://www.w3.org/2000/svg"><defs
     id="defs276" /><sodipodi:namedview
     id="namedview274"
     pagecolor="#ffffff"
     bordercolor="#666666"
     borderopacity="1.0"
     inkscape:pageshadow="2"
     inkscape:pageopacity="0.0"
     inkscape:pagecheckerboard="0"
     inkscape:deskcolor="#d1d1d1"
     showgrid="true"
     inkscape:zoom="57.375"
     inkscape:cx="8"
     inkscape:cy="8"
     inkscape:current-layer="g3338"
     inkscape:showpageshadow="2"><inkscape:grid
       type="xygrid"
       id="grid830" /></sodipodi:namedview><g
     id="g3338"><g
       id="g14431"><path
         d="M 15,10 H 3 l 4,3.5"
         id="path266"
         style="fill:none;stroke:#ff6600;stroke-width:2;stroke-linecap:round;stroke-opacity:1" /><path
         d="M 1,6 H 13 L 9,2.5"
         id="path268"
         style="fill:none;stroke:#3770c8;stroke-width:2;stroke-linecap:round;stroke-opacity:1" /></g></g></svg>
