<?xml version="1.0" encoding="UTF-8" standalone="no"?>
<svg
   height="36"
   viewBox="0 0 9.5249997 9.5250005"
   width="36"
   version="1.1"
   id="svg2148"
   sodipodi:docname="Picture_07_36.svg"
   inkscape:export-filename="Picture_07_36.png"
   inkscape:export-xdpi="96"
   inkscape:export-ydpi="96"
   inkscape:version="1.2 (dc2aedaf03, 2022-05-15)"
   xmlns:inkscape="http://www.inkscape.org/namespaces/inkscape"
   xmlns:sodipodi="http://sodipodi.sourceforge.net/DTD/sodipodi-0.dtd"
   xmlns="http://www.w3.org/2000/svg"
   xmlns:svg="http://www.w3.org/2000/svg">
  <defs
     id="defs2152">
    <radialGradient
       id="a-6"
       cx="-11.5"
       cy="8.5"
       gradientTransform="matrix(0,0.99200002,-0.99200002,0,16.937999,19.913999)"
       gradientUnits="userSpaceOnUse"
       r="3.5">
      <stop
         offset="0"
         stop-color="#fff"
         id="stop2" />
      <stop
         offset="1"
         stop-color="#d5e5ff"
         id="stop4" />
    </radialGradient>
  </defs>
  <sodipodi:namedview
     id="namedview2150"
     pagecolor="#ffffff"
     bordercolor="#666666"
     borderopacity="1.0"
     inkscape:showpageshadow="2"
     inkscape:pageopacity="0.0"
     inkscape:pagecheckerboard="0"
     inkscape:deskcolor="#d1d1d1"
     showgrid="true"
     inkscape:zoom="25.5"
     inkscape:cx="16.843137"
     inkscape:cy="18"
     inkscape:current-layer="svg2148">
    <inkscape:grid
       type="xygrid"
       id="grid3990" />
  </sodipodi:namedview>
  <linearGradient
     id="a"
     gradientTransform="matrix(1.0666667,0,0,1.0909091,-0.533333,-0.727273)"
     gradientUnits="userSpaceOnUse"
     x1="11.75"
     x2="12.21875"
     y1="3.416667"
     y2="7.541667">
    <stop
       offset="0"
       stop-color="#99c2ff"
       id="stop2110" />
    <stop
       offset="1"
       stop-color="#e5eeff"
       id="stop2112" />
  </linearGradient>
  <linearGradient
     id="b"
     gradientTransform="matrix(1.0666667,0,0,1.0833381,-0.533333,-1.625064)"
     gradientUnits="userSpaceOnUse"
     x1="10.34375"
     x2="9.875"
     y1="13.5"
     y2="7.500026">
    <stop
       offset="0"
       stop-color="#aade87"
       id="stop2115" />
    <stop
       offset="1"
       stop-color="#0a0"
       id="stop2117" />
  </linearGradient>
  <g
     transform="matrix(0.59531251,0,0,0.59531251,0,-0.66145835)"
     id="g2146">
    <path
       d="M 16,14 H 0 V 2 h 16 z"
       fill="url(#a)"
       id="path2120"
       style="fill:url(#a)" />
    <path
       d="M 16,10 C 14.333333,8.3333333 12.5,5 11,5 9.5,5 7.5,10.5 6.5,10.5 c -1,0 -2,-2 -3,-2 -1.1042859,0 -2.3333333,2 -3.5,3 V 14 h 16 z"
       fill="url(#b)"
       id="path2122"
       style="fill:url(#b)" />
    <g
       fill="none"
       id="g2140">
      <path
         d="m 5.5,3.5 v 1"
         stroke="#ffd42a"
         stroke-linecap="round"
         stroke-width="0.5"
         id="path2124" />
      <path
         d="M 6.9142136,4.0857864 6.2071068,4.7928932"
         stroke="#ffd42a"
         stroke-linecap="round"
         stroke-width="0.5"
         id="path2126" />
      <path
         d="M 4.0857864,4.0857864 4.7928932,4.7928932"
         stroke="#ffd42a"
         stroke-linecap="round"
         stroke-width="0.5"
         id="path2128" />
      <path
         d="m 3.5,5.5 h 1"
         stroke="#ffd42a"
         stroke-linecap="round"
         stroke-width="0.5"
         id="path2130" />
      <path
         d="M 4.0857864,6.9142136 4.7928932,6.2071068"
         stroke="#ffd42a"
         stroke-linecap="round"
         stroke-width="0.5"
         id="path2132" />
      <path
         d="m 5.5,7.5 v -1"
         stroke="#ffd42a"
         stroke-linecap="round"
         stroke-width="0.5"
         id="path2134" />
      <path
         d="M 6.9142136,6.9142136 6.2071068,6.2071068"
         stroke="#ffd42a"
         stroke-linecap="round"
         stroke-width="0.5"
         id="path2136" />
      <path
         d="m 7.5,5.5 h -1"
         stroke="#ffd42a"
         stroke-linecap="round"
         stroke-width="0.5"
         id="path2138" />
    </g>
    <circle
       cx="5.5"
       cy="5.5"
       fill="#ffe680"
       r="1.25"
       id="circle2142" />
    <path
       d="M 0.259471,2.259471 H 15.740528 V 13.740528 H 0.259471 Z"
       fill="none"
       stroke="#ffffff"
       stroke-linecap="round"
       stroke-width="0.518942"
       id="path2144" />
  </g>
  <g
     id="g928"
     transform="scale(0.59531252)">
    <g
       id="g916">
      <circle
         cx="9.25"
         cy="9.25"
         r="3.875"
         stroke="#ffffff"
         stroke-linejoin="round"
         stroke-width="0.75"
         id="circle7"
         style="fill:none;stroke:#ffffff;stroke-linecap:round" />
      <path
         d="M 11.130769,11.130769 14.5,14.5"
         stroke="#ffffff"
         stroke-width="3"
         id="path9"
         style="fill:none;stroke:#ffffff;stroke-linecap:round" />
    </g>
    <g
       id="g920">
      <path
         d="M 11.130769,11.130769 14.5,14.5"
         stroke="#a05a2c"
         stroke-width="1.4"
         id="path11"
         style="fill:none;stroke-linecap:round" />
      <circle
         cx="9.25"
         cy="9.25"
         fill="url(#a)"
         fill-rule="evenodd"
         r="3.1000001"
         stroke="#dd8703"
         stroke-linejoin="round"
         id="circle15"
         style="fill:url(#a-6);stroke-width:0.8;stroke-linecap:round;stroke-dasharray:none" />
    </g>
  </g>
</svg>
