<?xml version="1.0" encoding="UTF-8" standalone="no"?>
<svg
   height="16"
   width="16"
   version="1.1"
   id="svg17"
   sodipodi:docname="menu_information.svg"
   inkscape:export-filename="menu_information.png"
   inkscape:export-xdpi="96"
   inkscape:export-ydpi="96"
   inkscape:version="1.2.2 (732a01da63, 2022-12-09)"
   xmlns:inkscape="http://www.inkscape.org/namespaces/inkscape"
   xmlns:sodipodi="http://sodipodi.sourceforge.net/DTD/sodipodi-0.dtd"
   xmlns="http://www.w3.org/2000/svg"
   xmlns:svg="http://www.w3.org/2000/svg">
  <defs
     id="defs21" />
  <sodipodi:namedview
     id="namedview19"
     pagecolor="#ffffff"
     bordercolor="#666666"
     borderopacity="1.0"
     inkscape:showpageshadow="2"
     inkscape:pageopacity="0.0"
     inkscape:pagecheckerboard="0"
     inkscape:deskcolor="#d1d1d1"
     showgrid="true"
     inkscape:zoom="57.375"
     inkscape:cx="7.9912854"
     inkscape:cy="8"
     inkscape:current-layer="svg17">
    <inkscape:grid
       type="xygrid"
       id="grid450" />
  </sodipodi:namedview>
  <radialGradient
     id="a"
     cx="7.999999"
     cy="8"
     gradientUnits="userSpaceOnUse"
     r="7.5">
    <stop
       offset="0"
       stop-color="#2a7fff"
       id="stop2" />
    <stop
       offset=".69999999"
       stop-color="#4d94ff"
       id="stop4" />
    <stop
       offset="1"
       stop-color="#96bdff"
       id="stop6" />
  </radialGradient>
  <circle
     cx="8"
     cy="8"
     fill="url(#a)"
     r="7.5"
     stroke-width="1.25"
     id="circle9" />
  <g
     transform="translate(1 2.333333)"
     id="g15">
    <ellipse
       cx="7"
       cy="-2.166667"
       fill="#fff"
       fill-rule="evenodd"
       rx=".999904"
       ry="1"
       stroke-width=".499976"
       transform="scale(1 -1)"
       id="ellipse11" />
    <path
       d="m7 5.6666667v3.5"
       fill="none"
       stroke="#fff"
       stroke-linecap="round"
       stroke-width="2"
       id="path13" />
  </g>
</svg>
