<?xml version="1.0" encoding="UTF-8" standalone="no"?>
<svg
   width="48"
   height="48"
   version="1.1"
   viewBox="0 0 48 48"
   id="svg13"
   sodipodi:docname="tsyntexsyn_200.svg"
   inkscape:version="1.3.2 (091e20e, 2023-11-25, custom)"
   xmlns:inkscape="http://www.inkscape.org/namespaces/inkscape"
   xmlns:sodipodi="http://sodipodi.sourceforge.net/DTD/sodipodi-0.dtd"
   xmlns="http://www.w3.org/2000/svg"
   xmlns:svg="http://www.w3.org/2000/svg">
  <defs
     id="defs13" />
  <sodipodi:namedview
     id="namedview13"
     pagecolor="#ffffff"
     bordercolor="#000000"
     borderopacity="0.25"
     inkscape:showpageshadow="2"
     inkscape:pageopacity="0.0"
     inkscape:pagecheckerboard="0"
     inkscape:deskcolor="#d1d1d1"
     showgrid="true"
     inkscape:current-layer="svg13">
    <inkscape:grid
       id="grid13"
       units="px"
       originx="0"
       originy="0"
       spacingx="0.5"
       spacingy="0.5"
       empcolor="#0099e5"
       empopacity="0.30196078"
       color="#0099e5"
       opacity="0.14901961"
       empspacing="2"
       dotted="false"
       gridanglex="30"
       gridanglez="30"
       visible="true" />
  </sodipodi:namedview>
  <rect
     x="2.5"
     y="2.5"
     width="41"
     height="43"
     fill="#ffffff"
     fill-rule="evenodd"
     stroke="#2a7efe"
     stroke-linecap="square"
     stroke-linejoin="round"
     style="paint-order:normal"
     id="rect1" />
  <rect
     x="3"
     y="3"
     width="7"
     height="42"
     fill="#b3b3b3"
     fill-rule="evenodd"
     style="paint-order:normal"
     id="rect2" />
  <path
     d="m14 9h22"
     fill="none"
     stroke="#666666"
     stroke-width="2px"
     id="path2" />
  <path
     d="m18 13h8"
     fill="none"
     stroke="#666666"
     stroke-width="2px"
     id="path3" />
  <path
     d="m22 17h12"
     fill="none"
     stroke="#666666"
     stroke-width="2px"
     id="path4" />
  <path
     d="m18 21h4"
     fill="none"
     stroke="#666666"
     stroke-width="2px"
     id="path5" />
  <path
     d="m14 25h8"
     fill="none"
     stroke="#666666"
     stroke-width="2px"
     id="path6" />
  <path
     d="m28 13h6"
     fill="none"
     stroke="#ff0000"
     stroke-width="2px"
     id="path7" />
  <path
     d="m24 24.9998h12"
     fill="none"
     stroke="#ff0000"
     stroke-width="2px"
     id="path8" />
  <path
     d="m22 21h6"
     fill="none"
     stroke="#2a7fff"
     stroke-width="2px"
     id="path9" />
  <path
     d="m28 21h4"
     fill="none"
     stroke="#666666"
     stroke-width="2px"
     id="path10" />
  <path
     d="M 28.497122,35.999698 H 23.2 M 29.307266,30.8 H 23.2 v 10.399398 h 6.107266"
     fill="none"
     stroke="#2c5aa0"
     stroke-linecap="round"
     stroke-linejoin="round"
     stroke-width="1.6"
     id="path11" />
  <path
     d="m17.00002 41.2v-10.399398m-3.40002 0h6.8"
     fill="none"
     stroke="#2c5aa0"
     stroke-linecap="round"
     stroke-linejoin="round"
     stroke-width="1.6"
     id="path12" />
  <path
     d="m38.67828 30.800301-6.35656 10.399398m0-10.399398 6.35656 10.399398"
     fill="none"
     stroke="#2c5aa0"
     stroke-linecap="round"
     stroke-linejoin="round"
     stroke-width="1.6"
     id="path13" />
</svg>
