<?xml version="1.0" encoding="UTF-8" standalone="no"?>
<svg
   height="16"
   width="16"
   version="1.1"
   id="svg2671"
   sodipodi:docname="Picture_12_16.svg"
   inkscape:export-filename="Picture_12_16.png"
   inkscape:export-xdpi="96"
   inkscape:export-ydpi="96"
   inkscape:version="1.2 (dc2aedaf03, 2022-05-15)"
   xmlns:inkscape="http://www.inkscape.org/namespaces/inkscape"
   xmlns:sodipodi="http://sodipodi.sourceforge.net/DTD/sodipodi-0.dtd"
   xmlns="http://www.w3.org/2000/svg"
   xmlns:svg="http://www.w3.org/2000/svg">
  <defs
     id="defs2675" />
  <sodipodi:namedview
     id="namedview2673"
     pagecolor="#ffffff"
     bordercolor="#666666"
     borderopacity="1.0"
     inkscape:showpageshadow="2"
     inkscape:pageopacity="0.0"
     inkscape:pagecheckerboard="0"
     inkscape:deskcolor="#d1d1d1"
     showgrid="true"
     inkscape:zoom="57.375"
     inkscape:cx="8"
     inkscape:cy="8"
     inkscape:current-layer="svg2671">
    <inkscape:grid
       type="xygrid"
       id="grid2794" />
  </sodipodi:namedview>
  <g
     id="g2843">
    <g
       stroke-width="0.5"
       id="g2657"
       style="fill:none;stroke:#00aad4;stroke-linecap:round">
      <circle
         cx="4.5"
         cy="5.5"
         r="1"
         stroke-linejoin="round"
         id="circle2639" />
      <path
         d="m 4.5,3.5 v 1"
         id="path2641" />
      <path
         d="M 3.0857864,4.0857864 3.7928932,4.7928932"
         id="path2643" />
      <path
         d="m 2.5,5.5 h 1"
         id="path2645" />
      <path
         d="M 3.0857864,6.9142136 3.7928932,6.2071068"
         id="path2647" />
      <path
         d="m 4.5,7.5 v -1"
         id="path2649" />
      <path
         d="M 5.9142136,6.9142136 5.2071068,6.2071068"
         id="path2651" />
      <path
         d="m 6.5,5.5 h -1"
         id="path2653" />
      <path
         d="M 5.9142136,4.0857864 5.2071068,4.7928932"
         id="path2655" />
    </g>
    <path
       d="M 0.5,12 3,8.5 5,10 11,4 15.5,6.5"
       stroke-linejoin="round"
       stroke-width="0.75"
       id="path2659"
       style="fill:none;stroke:#00aad4;stroke-linecap:round"
       sodipodi:nodetypes="ccccc" />
    <path
       d="m 15.500002,6.5 v -4 H 0.5 v 11 h 6"
       stroke-width="0.999996"
       id="path2661"
       style="fill:none;stroke:#00aad4;stroke-linecap:round"
       sodipodi:nodetypes="ccccc" />
  </g>
  <g
     id="g1008"
     transform="matrix(-3.3070865,0,0,-3.3070865,22.062509,22.0625)"
     style="stroke-width:1.14286">
    <path
       style="fill:none;stroke:#00aad4;stroke-width:0.302381;stroke-linecap:round;stroke-linejoin:round;stroke-dasharray:none;stroke-dashoffset:1.49998;stroke-opacity:1"
       id="path346"
       sodipodi:type="arc"
       sodipodi:cx="3.042721"
       sodipodi:cy="3.0364904"
       sodipodi:rx="1.0583333"
       sodipodi:ry="1.0583333"
       sodipodi:start="2.0937985"
       sodipodi:end="4.4632499"
       sodipodi:open="true"
       sodipodi:arc-type="arc"
       d="M 2.5141013,3.9533495 A 1.0583333,1.0583333 0 0 1 1.9942943,2.8920237 1.0583333,1.0583333 0 0 1 2.7817681,2.0108331" />
    <path
       style="fill:none;stroke:#00aad4;stroke-width:0.302381px;stroke-linecap:round;stroke-linejoin:round;stroke-opacity:1"
       d="M 3.4092697,2.6458333 V 1.984375 h 0.6614584"
       id="path1053"
       sodipodi:nodetypes="ccc" />
    <path
       style="fill:none;stroke:#00aad4;stroke-width:0.302381px;stroke-linecap:round;stroke-linejoin:round;stroke-opacity:1"
       d="m 2.6761471,3.4395833 v 0.6614584 l -0.6614583,-10e-8"
       id="path295"
       sodipodi:nodetypes="ccc" />
    <path
       style="fill:none;stroke:#00aad4;stroke-width:0.302381;stroke-linecap:round;stroke-linejoin:round;stroke-dasharray:none;stroke-dashoffset:1.49998;stroke-opacity:1"
       id="path398"
       sodipodi:type="arc"
       sodipodi:cx="-3.0426955"
       sodipodi:cy="-3.0488713"
       sodipodi:rx="1.0583333"
       sodipodi:ry="1.0583333"
       sodipodi:start="2.0937985"
       sodipodi:end="4.4632499"
       sodipodi:open="true"
       sodipodi:arc-type="arc"
       d="m -3.5713153,-2.1320122 a 1.0583333,1.0583333 0 0 1 -0.519807,-1.0613258 1.0583333,1.0583333 0 0 1 0.7874738,-0.8811906"
       transform="scale(-1)" />
  </g>
</svg>
