<?xml version="1.0" encoding="UTF-8" standalone="no"?>
<svg
   height="33"
   width="33"
   version="1.1"
   id="svg503"
   sodipodi:docname="da_undefine_150.svg"
   inkscape:export-filename="da_undefine_150.png"
   inkscape:export-xdpi="96"
   inkscape:export-ydpi="96"
   inkscape:version="1.2.1 (9c6d41e410, 2022-07-14)"
   xmlns:inkscape="http://www.inkscape.org/namespaces/inkscape"
   xmlns:sodipodi="http://sodipodi.sourceforge.net/DTD/sodipodi-0.dtd"
   xmlns="http://www.w3.org/2000/svg"
   xmlns:svg="http://www.w3.org/2000/svg">
  <defs
     id="defs507" />
  <sodipodi:namedview
     id="namedview505"
     pagecolor="#ffffff"
     bordercolor="#666666"
     borderopacity="1.0"
     inkscape:showpageshadow="2"
     inkscape:pageopacity="0.0"
     inkscape:pagecheckerboard="0"
     inkscape:deskcolor="#d1d1d1"
     showgrid="true"
     inkscape:zoom="27.818182"
     inkscape:cx="16.482026"
     inkscape:cy="16.5"
     inkscape:current-layer="svg503">
    <inkscape:grid
       type="xygrid"
       id="grid2165" />
  </sodipodi:namedview>
  <linearGradient
     id="a"
     gradientTransform="matrix(-1.0020096 -.18890715 0 .8831277 23.55811 .753638)"
     gradientUnits="userSpaceOnUse"
     x1="7.184878"
     x2="17.184877"
     y1="2.599694"
     y2="2.238764">
    <stop
       offset="0"
       stop-color="#0c0"
       id="stop482" />
    <stop
       offset=".25781018"
       stop-color="#090"
       id="stop484" />
    <stop
       offset=".65000004"
       stop-color="#0c0"
       id="stop486" />
    <stop
       offset="1"
       stop-color="#090"
       id="stop488" />
  </linearGradient>
  <g
     transform="matrix(1.5 0 0 1.5 .000077 9)"
     id="g495">
    <path
       d="m6.138206-4.04204c1.0492634-.7556485 2.2230174-1.0164354 3.693558-.6715513 1.052994.246958 3.116237 1.3103193 4.450814 1.4465935 1.455863.1486593 2.57722.1020203 3.574419-.40708l.0048 8.0156856c-.759732.6671681-2.118543.5557395-3.574405.4070809-1.334576-.1362741-3.397821-1.1996373-4.450814-1.4465942-1.470541-.3448859-2.6442949-.0840965-3.6935593.6715512z"
       fill="url(#a)"
       fill-rule="evenodd"
       stroke="#808080"
       stroke-width=".276327"
       id="path491" />
    <path
       d="m5-4v18"
       fill="none"
       stroke="#c87137"
       stroke-linecap="round"
       stroke-width="2"
       id="path493" />
  </g>
  <g
     fill="none"
     stroke-linecap="round"
     transform="matrix(1.4966899 0 0 1.4995167 -17.402058 5.498597)"
     id="g501">
    <path
       d="m25.496486 10.503514 5-5.0000004m0 5.0000004-5-5.0000004"
       stroke="#fff"
       stroke-width="3.5"
       id="path497" />
    <path
       d="m25.496486 10.503514 5-5.0000004m0 5.0000004-5-5.0000004"
       stroke="#dc0000"
       stroke-width="1.5"
       id="path499" />
  </g>
</svg>
