<?xml version="1.0" encoding="UTF-8" standalone="no"?>
<svg
   height="64"
   width="64"
   version="1.1"
   id="svg743"
   sodipodi:docname="Calculator_01_64.svg"
   inkscape:export-filename="Calculator_01_64.png"
   inkscape:export-xdpi="96"
   inkscape:export-ydpi="96"
   inkscape:version="1.2-beta (1b65182ce9, 2022-04-05)"
   xmlns:inkscape="http://www.inkscape.org/namespaces/inkscape"
   xmlns:sodipodi="http://sodipodi.sourceforge.net/DTD/sodipodi-0.dtd"
   xmlns:xlink="http://www.w3.org/1999/xlink"
   xmlns="http://www.w3.org/2000/svg"
   xmlns:svg="http://www.w3.org/2000/svg">
  <defs
     id="defs747">
    <linearGradient
       inkscape:collect="always"
       xlink:href="#linearGradient2142"
       id="linearGradient2144"
       x1="2.75"
       y1="7.7499914"
       x2="2.25"
       y2="7.2499914"
       gradientUnits="userSpaceOnUse"
       gradientTransform="matrix(2,0,0,2,0,1.7e-5)" />
    <linearGradient
       inkscape:collect="always"
       id="linearGradient2142">
      <stop
         style="stop-color:#483737;stop-opacity:1;"
         offset="0"
         id="stop2138" />
      <stop
         style="stop-color:#ffffff;stop-opacity:1"
         offset="1"
         id="stop2140" />
    </linearGradient>
    <linearGradient
       inkscape:collect="always"
       xlink:href="#linearGradient3635"
       id="linearGradient2172"
       gradientUnits="userSpaceOnUse"
       x1="2.75"
       y1="7.7499747"
       x2="2.25"
       y2="7.2499747"
       gradientTransform="matrix(2,0,0,2,20,6.000051)" />
    <linearGradient
       inkscape:collect="always"
       id="linearGradient3635">
      <stop
         style="stop-color:#ff0000;stop-opacity:1"
         offset="0"
         id="stop3631" />
      <stop
         style="stop-color:#ffffff;stop-opacity:1"
         offset="1"
         id="stop3633" />
    </linearGradient>
    <linearGradient
       inkscape:collect="always"
       xlink:href="#linearGradient2142"
       id="linearGradient2170"
       gradientUnits="userSpaceOnUse"
       x1="2.75"
       y1="7.7499828"
       x2="2.25"
       y2="7.2499828"
       gradientTransform="matrix(2,0,0,2,12,6.000034)" />
    <linearGradient
       inkscape:collect="always"
       xlink:href="#linearGradient2142"
       id="linearGradient2168"
       gradientUnits="userSpaceOnUse"
       x1="2.75"
       y1="7.7499747"
       x2="2.25"
       y2="7.2499747"
       gradientTransform="matrix(2,0,0,2,6,6.000051)" />
    <linearGradient
       inkscape:collect="always"
       xlink:href="#linearGradient2142"
       id="linearGradient2166"
       gradientUnits="userSpaceOnUse"
       x1="2.75"
       y1="7.7499747"
       x2="2.25"
       y2="7.2499747"
       gradientTransform="matrix(2,0,0,2,12,5.1e-5)" />
    <linearGradient
       inkscape:collect="always"
       xlink:href="#linearGradient2142"
       id="linearGradient2164"
       gradientUnits="userSpaceOnUse"
       x1="2.75"
       y1="7.7499747"
       x2="2.25"
       y2="7.2499747"
       gradientTransform="matrix(2,0,0,2,6,5.1e-5)" />
    <linearGradient
       inkscape:collect="always"
       xlink:href="#linearGradient3917"
       id="linearGradient2162"
       gradientUnits="userSpaceOnUse"
       x1="2.75"
       y1="7.7499747"
       x2="2.25"
       y2="7.2499747"
       gradientTransform="matrix(2,0,0,2,20,5.1e-5)" />
    <linearGradient
       inkscape:collect="always"
       id="linearGradient3917">
      <stop
         style="stop-color:#d45500;stop-opacity:1"
         offset="0"
         id="stop3913" />
      <stop
         style="stop-color:#ffffff;stop-opacity:1"
         offset="1"
         id="stop3915" />
    </linearGradient>
    <linearGradient
       inkscape:collect="always"
       xlink:href="#linearGradient2142"
       id="linearGradient2160"
       gradientUnits="userSpaceOnUse"
       x1="2.75"
       y1="7.7499747"
       x2="2.25"
       y2="7.2499747"
       gradientTransform="matrix(2,0,0,2,0,6.000051)" />
  </defs>
  <sodipodi:namedview
     id="namedview745"
     pagecolor="#ffffff"
     bordercolor="#666666"
     borderopacity="1.0"
     inkscape:pageshadow="2"
     inkscape:pageopacity="0.0"
     inkscape:pagecheckerboard="0"
     inkscape:deskcolor="#d1d1d1"
     showgrid="true"
     inkscape:zoom="14.34375"
     inkscape:cx="29.455338"
     inkscape:cy="32"
     inkscape:current-layer="svg743">
    <inkscape:grid
       type="xygrid"
       id="grid6609" />
  </sodipodi:namedview>
  <g
     id="g5579"
     transform="scale(2)">
    <path
       d="m 0.75,2.75 h 30.5 v 26.5 H 0.75 Z"
       fill="#e3dedb"
       stroke="#4d4d4d"
       stroke-linecap="round"
       stroke-linejoin="round"
       id="path2"
       style="fill-rule:evenodd;stroke:#917c6f;stroke-width:1.5;stroke-dasharray:none" />
    <path
       d="M 4,5.9999999 H 28 V 11 H 4 Z"
       fill="#ffffff"
       id="path4"
       style="fill-rule:evenodd;stroke-width:0.999999" />
    <path
       d="m 4,14 h 4 v 4.000034 H 4 Z"
       fill="#483737"
       id="path584"
       style="fill:url(#linearGradient2144);fill-opacity:1;fill-rule:evenodd;stroke-width:2" />
    <path
       d="m 24,20.000017 h 4 v 4.000034 h -4 z"
       fill="#483737"
       id="path2146"
       style="fill:url(#linearGradient2172);fill-opacity:1;fill-rule:evenodd;stroke-width:2" />
    <path
       d="m 16,20 h 4 v 4.000035 h -4 z"
       fill="#483737"
       id="path2148"
       style="fill:url(#linearGradient2170);fill-opacity:1;fill-rule:evenodd;stroke-width:2" />
    <path
       d="m 10,20.000017 h 4 v 4.000034 h -4 z"
       fill="#483737"
       id="path2150"
       style="fill:url(#linearGradient2168);fill-opacity:1;fill-rule:evenodd;stroke-width:2" />
    <path
       d="m 16,14.000017 h 4 v 4.000034 h -4 z"
       fill="#483737"
       id="path2152"
       style="fill:url(#linearGradient2166);fill-opacity:1;fill-rule:evenodd;stroke-width:2" />
    <path
       d="m 10,14.000017 h 4 v 4.000034 h -4 z"
       fill="#483737"
       id="path2154"
       style="fill:url(#linearGradient2164);fill-opacity:1;fill-rule:evenodd;stroke-width:2" />
    <path
       d="m 24,14.000017 h 4 v 4.000034 h -4 z"
       fill="#483737"
       id="path2156"
       style="fill:url(#linearGradient2162);fill-opacity:1;fill-rule:evenodd;stroke-width:2" />
    <path
       d="m 4,20.000017 h 4 v 4.000034 H 4 Z"
       fill="#483737"
       id="path2158"
       style="fill:url(#linearGradient2160);fill-opacity:1;fill-rule:evenodd;stroke-width:2" />
  </g>
</svg>
