<?xml version="1.0" encoding="UTF-8" standalone="no"?>
<svg
   width="32"
   height="32"
   version="1.0"
   id="svg195"
   inkscape:export-xdpi="96"
   inkscape:export-ydpi="96"
   inkscape:version="1.2.1 (9c6d41e410, 2022-07-14)"
   sodipodi:docname="package_del_200.svg"
   inkscape:export-filename="package_del_200.png"
   xmlns:inkscape="http://www.inkscape.org/namespaces/inkscape"
   xmlns:sodipodi="http://sodipodi.sourceforge.net/DTD/sodipodi-0.dtd"
   xmlns:xlink="http://www.w3.org/1999/xlink"
   xmlns="http://www.w3.org/2000/svg"
   xmlns:svg="http://www.w3.org/2000/svg">
  <sodipodi:namedview
     id="namedview197"
     pagecolor="#ffffff"
     bordercolor="#666666"
     borderopacity="1.0"
     inkscape:showpageshadow="2"
     inkscape:pageopacity="0.0"
     inkscape:pagecheckerboard="0"
     inkscape:deskcolor="#d1d1d1"
     showgrid="true"
     inkscape:zoom="28.6875"
     inkscape:cx="15.982571"
     inkscape:cy="16"
     inkscape:current-layer="svg195">
    <inkscape:grid
       type="xygrid"
       id="grid1136" />
  </sodipodi:namedview>
  <defs
     id="defs173">
    <linearGradient
       id="linearGradient1347"
       x1="8.837"
       x2="15.576"
       y1="7.8054"
       y2="10.838"
       gradientTransform="matrix(1.983 0 0 1.983 -.35541 .68892)"
       gradientUnits="userSpaceOnUse"
       xlink:href="#linearGradient933-3" />
    <linearGradient
       id="linearGradient933-3">
      <stop
         stop-color="#ffe991"
         offset="0"
         id="stop162" />
      <stop
         stop-color="#f5c400"
         offset="1"
         id="stop164" />
    </linearGradient>
    <linearGradient
       id="linearGradient1351"
       x1="8.837"
       x2="15.576"
       y1="7.8013"
       y2="10.834"
       gradientTransform="matrix(-1.983 0 0 1.983 33.356 .69694)"
       gradientUnits="userSpaceOnUse"
       xlink:href="#linearGradient933-3" />
    <linearGradient
       id="linearGradient1355"
       x1="1.4239"
       x2="15.576"
       y1="4.4317"
       y2="4.4317"
       gradientTransform="matrix(-1.983 0 0 1.983 33.356 .69694)"
       gradientUnits="userSpaceOnUse">
      <stop
         stop-color="#ffe478"
         offset="0"
         id="stop168" />
      <stop
         stop-color="#fff2c0"
         offset="1"
         id="stop170" />
    </linearGradient>
    <radialGradient
       id="a-4"
       cx="12.1"
       cy="10.900001"
       gradientTransform="matrix(0,2.2087543,-2.2087541,4.2597404e-8,44.093604,-6.7077452)"
       gradientUnits="userSpaceOnUse"
       r="4.5">
      <stop
         offset="0"
         stop-color="#ff5555"
         id="stop788-7" />
      <stop
         offset="1"
         stop-color="#aa0000"
         id="stop790-2" />
    </radialGradient>
  </defs>
  <g
     stroke-width="1.6"
     id="g193">
    <g
       stroke="#ccaa00"
       stroke-linejoin="round"
       id="g181">
      <path
         d="m16.5 16.552 14.7-7.0674v12.695l-14.7 8.0179z"
         fill="url(#linearGradient1347)"
         id="path175" />
      <path
         d="m16.5 16.166-14.7-6.6816v12.695l14.7 8.0179z"
         fill="url(#linearGradient1351)"
         id="path177" />
      <path
         d="m16.5 2.803-14.7 6.6816 14.7 6.6816 14.7-6.6816z"
         fill="url(#linearGradient1355)"
         id="path179" />
    </g>
    <g
       fill="none"
       stroke="#5f8dd3"
       stroke-linecap="round"
       id="g191">
      <path
         d="m9.6846 6.0101 15.115 6.6157"
         id="path183" />
      <path
         d="m8.2 12.626 15.115-6.6157"
         id="path185" />
      <path
         d="m8.2 12.626v12.962"
         id="path187" />
      <path
         d="m24.8 12.626v12.962"
         id="path189" />
    </g>
  </g>
  <g
     id="g3317">
    <circle
       cx="23"
       cy="23"
       r="8.1999998"
       style="fill:url(#a-4);stroke:#ffffff;stroke-width:1.6;stroke-linecap:round;stroke-linejoin:round;stroke-dashoffset:1.49998"
       transform="matrix(0,1,1,0,0,0)"
       id="circle793" />
    <g
       id="g3333"
       transform="matrix(0.95844079,0,0,0.95844079,0.47664083,0.47664083)"
       style="stroke-width:1.04336">
      <path
         d="m 26.5,20.5 -6,6"
         id="path3550"
         style="fill:none;stroke:#ffffff;stroke-width:1.66938;stroke-linecap:round;stroke-dasharray:none"
         sodipodi:nodetypes="cc" />
      <path
         d="m 26.5,26.5 -6,-6"
         id="path3552"
         style="fill:none;stroke:#ffffff;stroke-width:1.66938;stroke-linecap:round;stroke-dasharray:none"
         sodipodi:nodetypes="cc" />
    </g>
  </g>
</svg>
