<?xml version="1.0" encoding="UTF-8" standalone="no"?>
<svg
   width="24"
   height="24"
   version="1.1"
   viewBox="0 0 24 24"
   id="svg3"
   sodipodi:docname="toracleconnection.svg"
   inkscape:version="1.3.2 (091e20e, 2023-11-25, custom)"
   xmlns:inkscape="http://www.inkscape.org/namespaces/inkscape"
   xmlns:sodipodi="http://sodipodi.sourceforge.net/DTD/sodipodi-0.dtd"
   xmlns="http://www.w3.org/2000/svg"
   xmlns:svg="http://www.w3.org/2000/svg">
  <defs
     id="defs3" />
  <sodipodi:namedview
     id="namedview3"
     pagecolor="#ffffff"
     bordercolor="#000000"
     borderopacity="0.25"
     inkscape:showpageshadow="2"
     inkscape:pageopacity="0.0"
     inkscape:pagecheckerboard="0"
     inkscape:deskcolor="#d1d1d1"
     showgrid="true"
     inkscape:current-layer="svg3">
    <inkscape:grid
       id="grid3"
       units="px"
       originx="0"
       originy="0"
       spacingx="0.5"
       spacingy="0.5"
       empcolor="#0099e5"
       empopacity="0.30196078"
       color="#0099e5"
       opacity="0.14901961"
       empspacing="2"
       dotted="false"
       gridanglex="30"
       gridanglez="30"
       visible="true" />
  </sodipodi:namedview>
  <rect
     x="3.0000007"
     y="8.9999828"
     width="18"
     height="12.000017"
     fill="#ea1c2d"
     style="fill-rule:evenodd;paint-order:normal"
     id="rect1" />
  <path
     d="m 9.985596,11.0002 c -1.917535,0 -3.4855957,1.5681 -3.4855957,3.4856 0,1.9175 1.5680607,3.4857 3.4855957,3.4857 h 4.028806 c 1.917535,0 3.485597,-1.5682 3.485597,-3.4857 0,-1.9175 -1.568062,-3.4856 -3.485597,-3.4856 z m 0,1.2675 h 4.028806 c 1.232534,0 2.218107,0.9855 2.218107,2.2181 0,1.2325 -0.985573,2.2181 -2.218107,2.2181 H 9.985596 c -1.232534,0 -2.218108,-0.9856 -2.218108,-2.2181 0,-1.2326 0.985574,-2.2181 2.218108,-2.2181 z"
     color="#000000"
     color-rendering="auto"
     dominant-baseline="auto"
     fill="#ffffff"
     image-rendering="auto"
     shape-rendering="auto"
     solid-color="#000000"
     style="font-variant-ligatures:normal;font-variant-position:normal;font-variant-caps:normal;font-variant-numeric:normal;font-variant-alternates:normal;font-feature-settings:normal;text-indent:0;text-decoration-line:none;text-decoration-style:solid;text-decoration-color:#000000;text-transform:none;text-orientation:mixed;white-space:normal;shape-padding:0;isolation:auto;mix-blend-mode:normal;fill-rule:evenodd;paint-order:normal"
     id="path1" />
  <path
     d="m 13,2.5 h 2.5 v -2 h 4 V 3"
     fill="none"
     stroke="#2a7efe"
     stroke-linejoin="round"
     stroke-width="1px"
     id="path2" />
  <path
     d="m 24,2.5 h -2.5 v 2 h -4 V 2"
     fill="none"
     stroke="#ff0000"
     stroke-linejoin="round"
     stroke-width="1px"
     id="path3" />
</svg>
