<?xml version="1.0" encoding="UTF-8" standalone="no"?>
<svg
   width="64"
   height="64"
   version="1.1"
   viewBox="0 0 64 64"
   id="svg12"
   sodipodi:docname="Firewall_01_64.svg"
   inkscape:version="1.3.2 (091e20e, 2023-11-25, custom)"
   xmlns:inkscape="http://www.inkscape.org/namespaces/inkscape"
   xmlns:sodipodi="http://sodipodi.sourceforge.net/DTD/sodipodi-0.dtd"
   xmlns:xlink="http://www.w3.org/1999/xlink"
   xmlns="http://www.w3.org/2000/svg"
   xmlns:svg="http://www.w3.org/2000/svg">
  <sodipodi:namedview
     id="namedview12"
     pagecolor="#ffffff"
     bordercolor="#000000"
     borderopacity="0.25"
     inkscape:showpageshadow="2"
     inkscape:pageopacity="0.0"
     inkscape:pagecheckerboard="0"
     inkscape:deskcolor="#d1d1d1"
     showgrid="true"
     inkscape:current-layer="svg12">
    <inkscape:grid
       id="grid12"
       units="px"
       originx="0"
       originy="0"
       spacingx="0.5"
       spacingy="0.5"
       empcolor="#0099e5"
       empopacity="0.30196078"
       color="#0099e5"
       opacity="0.14901961"
       empspacing="2"
       dotted="false"
       gridanglex="30"
       gridanglez="30"
       visible="true" />
  </sodipodi:namedview>
  <defs
     id="defs2">
    <linearGradient
       id="d"
       x1="1.058267"
       x2="3.5718081"
       y1="2.645833"
       y2="2.645833"
       gradientTransform="matrix(10.992166,0,0,10.582678,21.796294,16.599999)"
       gradientUnits="userSpaceOnUse"
       xlink:href="#a" />
    <linearGradient
       id="a">
      <stop
         stop-color="#fd5"
         offset="0"
         id="stop1" />
      <stop
         stop-color="#f60"
         offset="1"
         id="stop2" />
    </linearGradient>
    <radialGradient
       id="c"
       cx="2.073271"
       cy="3.0080271"
       r=".62227398"
       gradientTransform="matrix(16.362284,1.3757481e-6,-1.869148e-6,21.373234,12.075964,-14.091268)"
       gradientUnits="userSpaceOnUse"
       xlink:href="#a" />
    <radialGradient
       id="b"
       cx="2.643085"
       cy="2.859669"
       r=".448066"
       gradientTransform="matrix(22.182785,-4.7446496,6.4925453,28.120845,-23.924793,-20.475787)"
       gradientUnits="userSpaceOnUse"
       xlink:href="#a" />
  </defs>
  <path
     d="m4.0000002 12.000001v8.999999h26v-8.999999z"
     fill="#d38d5f"
     stroke-linejoin="round"
     stroke-width=".264582"
     id="path2" />
  <path
     d="m32.999999 12.000001v8.999999h9.210939c0.313209-1.062565 0.592653-2.225329 0.828125-3.535154l0.70117-3.882815 3.558595 1.71289c1.714243 0.825195 4.317082 2.589384 6.507813 5.705079h5.193358v-8.999999z"
     fill="#d38d5f"
     stroke-linejoin="round"
     stroke-width=".264582"
     id="path3" />
  <path
     d="m4.0000002 24v8.999999h12v-8.999999z"
     fill="#d38d5f"
     stroke-linejoin="round"
     stroke-width=".264582"
     id="path4" />
  <path
     d="m33.425782 32.999999c0.460755-0.404496 0.91993-0.798625 1.369138-1.191405 2.391409-2.09099 4.646002-4.091988 6.320314-7.808594h-22.115234v8.999999z"
     fill="#d38d5f"
     stroke-linejoin="round"
     stroke-width=".264582"
     id="path5" />
  <path
     d="m4.0000002 47.999998v9.000003h12v-9.000003z"
     fill="#d38d5f"
     stroke-linejoin="round"
     stroke-width=".264582"
     id="path6" />
  <path
     d="m31.130861 57.000001c-0.246384-0.327061-0.488943-0.657819-0.714845-0.99414-1.692378-2.519614-2.854945-5.27901-3.253908-8.005863h-8.162108v9.000003z"
     fill="#d38d5f"
     stroke-linejoin="round"
     stroke-width=".264582"
     id="path7" />
  <path
     d="m27.035157 44.999998c0.167962-3.21194 1.130347-5.838205 2.541014-7.87695 0.137726-0.199068 0.280895-0.385879 0.423829-0.57422v-0.548829h-26v8.999999z"
     fill="#d38d5f"
     stroke-linejoin="round"
     stroke-width=".264582"
     id="path8" />
  <path
     d="m 56.074218,24 2.925781,3.546874 V 24 Z"
     fill="#d38d5f"
     stroke-linejoin="round"
     stroke-width=".264582"
     id="path9" />
  <path
     d="M 40.1792,60.000001 C 34.362512,58.600004 30,50.950297 30,46.000001 30,33.312018 42.724005,36.2 45.995897,18 c 2.908338,1.400005 11.529637,7.81093 7.270858,22.399996 4.362511,-1.400001 4.03497,-5.739858 4.362511,-9.799997 7.211346,8.739405 4.982536,24.711827 -2.908346,29.400002"
     fill="url(#d)"
     stroke-width=".999999"
     id="path10" />
  <path
     d="m47.45397 33.400002c-9.322457 8.999995-14.730696 17.6-7.272729 26.599999h10.181816c-3.037719-6.432937-3.943052-12.905408-2.909087-26.599999z"
     fill="url(#c)"
     stroke-width=".999999"
     id="path11" />
  <path
     d="m50.363639 60.000001h4.363631c-0.023433-14.164633-6.50053-13.386175-7.272725-26.599999-4.551972 13.863725-2.770054 19.037592 2.909094 26.599999z"
     fill="url(#b)"
     stroke-width=".999999"
     id="path12" />
</svg>
