<?xml version="1.0" encoding="UTF-8" standalone="no"?>
<svg
   height="24"
   width="24"
   version="1.1"
   id="svg1321"
   sodipodi:docname="menu_close_all_150.svg"
   inkscape:export-filename="menu_close_all_150.png"
   inkscape:export-xdpi="96"
   inkscape:export-ydpi="96"
   inkscape:version="1.2.2 (732a01da63, 2022-12-09)"
   xmlns:inkscape="http://www.inkscape.org/namespaces/inkscape"
   xmlns:sodipodi="http://sodipodi.sourceforge.net/DTD/sodipodi-0.dtd"
   xmlns="http://www.w3.org/2000/svg"
   xmlns:svg="http://www.w3.org/2000/svg">
  <defs
     id="defs1325" />
  <sodipodi:namedview
     id="namedview1323"
     pagecolor="#ffffff"
     bordercolor="#666666"
     borderopacity="1.0"
     inkscape:showpageshadow="2"
     inkscape:pageopacity="0.0"
     inkscape:pagecheckerboard="0"
     inkscape:deskcolor="#d1d1d1"
     showgrid="true"
     inkscape:zoom="38.25"
     inkscape:cx="11.986928"
     inkscape:cy="12"
     inkscape:current-layer="svg1321">
    <inkscape:grid
       type="xygrid"
       id="grid1771" />
  </sodipodi:namedview>
  <path
     d="m.60000002.60000002h13.79999998v17.79999998h-13.79999998z"
     style="fill:#fff;stroke:#d4aa00;stroke-width:1.2;stroke-linecap:round;stroke-linejoin:round;stroke-miterlimit:5.6"
     id="path1293" />
  <path
     d="m4.6 4.6h13.8v17.8h-13.8z"
     style="fill:#fff;stroke:#d4aa00;stroke-width:1.2;stroke-linecap:round;stroke-linejoin:round;stroke-miterlimit:5.6"
     id="path1295" />
  <g
     fill="none"
     id="g1319">
    <g
       stroke="#2a7fff"
       id="g1311">
      <path
         d="m7.5 7.5h8"
         id="path1297" />
      <path
         d="m7.5 17.5h8"
         id="path1299" />
      <path
         d="m7.5 15.5h8"
         id="path1301" />
      <path
         d="m7.5 13.5h8"
         id="path1303" />
      <path
         d="m7.5 11.5h8"
         id="path1305" />
      <path
         d="m7.5 9.5h8"
         id="path1307" />
      <path
         d="m7.5 19.5h8"
         id="path1309" />
    </g>
    <g
       stroke-linecap="round"
       id="g1317">
      <path
         d="m14.625 21.375 6.75-6.75m0 6.75-6.75-6.75"
         stroke="#fff"
         stroke-width="5.25"
         id="path1313" />
      <path
         d="m14.625 21.375 6.75-6.75m0 6.75-6.75-6.75"
         stroke="#f00"
         stroke-width="2.25"
         id="path1315" />
    </g>
  </g>
</svg>
