<?xml version="1.0" encoding="UTF-8" standalone="no"?>
<svg
   height="33"
   width="33"
   version="1.1"
   id="svg147"
   sodipodi:docname="UnknownDisabledBreakPoint_300.svg"
   inkscape:export-filename="UnknownDisabledBreakPoint_300.png"
   inkscape:export-xdpi="96"
   inkscape:export-ydpi="96"
   inkscape:version="1.2.2 (732a01da63, 2022-12-09)"
   xmlns:inkscape="http://www.inkscape.org/namespaces/inkscape"
   xmlns:sodipodi="http://sodipodi.sourceforge.net/DTD/sodipodi-0.dtd"
   xmlns="http://www.w3.org/2000/svg"
   xmlns:svg="http://www.w3.org/2000/svg">
  <defs
     id="defs151">
    <radialGradient
       id="a"
       cx="4"
       cy="4"
       gradientTransform="matrix(1.2e-7,3.8181819,-3.8181819,7e-8,27.272727,-3.272728)"
       gradientUnits="userSpaceOnUse"
       r="5.5">
      <stop
         offset="0"
         stop-color="#00f23e"
         id="stop398" />
      <stop
         offset="1"
         stop-color="#00ad00"
         id="stop400" />
    </radialGradient>
  </defs>
  <sodipodi:namedview
     id="namedview149"
     pagecolor="#ffffff"
     bordercolor="#666666"
     borderopacity="1.0"
     inkscape:showpageshadow="2"
     inkscape:pageopacity="0.0"
     inkscape:pagecheckerboard="0"
     inkscape:deskcolor="#d1d1d1"
     showgrid="true"
     inkscape:zoom="27.818182"
     inkscape:cx="16.482026"
     inkscape:cy="16.5"
     inkscape:current-layer="svg147">
    <inkscape:grid
       type="xygrid"
       id="grid656" />
  </sodipodi:namedview>
  <circle
     cx="16.5"
     cy="16.5"
     fill="url(#a)"
     r="16.5"
     id="circle403"
     style="fill:url(#a)" />
  <g
     fill="#0c0"
     transform="matrix(1.1,0,0,1.1,-0.5500253,-1.1813681)"
     id="g145"
     style="fill:#ffffff;stroke-width:0.909091">
    <path
       d="m 16.70035,19.535266 h -2.75374 q -0.01078,-0.594031 -0.01078,-0.723618 0,-1.339005 0.442757,-2.202993 0.442759,-0.86378 1.771033,-1.943817 1.328275,-1.079829 1.587451,-1.414684 0.399562,-0.529132 0.399562,-1.16629 0,-0.885343 -0.712733,-1.511719 -0.701933,-0.6371572 -1.90062,-0.6371572 -1.155492,0 -1.933018,0.6587202 -0.777527,0.658721 -1.0691,2.008507 L 9.735023,12.256786 Q 9.8538084,10.323751 11.376469,8.9737574 12.909924,7.623971 15.39369,7.623971 q 2.613353,0 4.157608,1.3715571 1.544255,1.3605679 1.544255,3.1747969 0,1.004357 -0.572347,1.90069 -0.561546,0.896333 -2.418972,2.440605 -0.961108,0.79909 -1.198687,1.284889 -0.226779,0.486006 -0.205185,1.738757 z"
       id="path141"
       style="fill:#ffffff;stroke-width:0.909091" />
    <path
       d="m 14,24.599971 v -3.034427 h 3.034514 v 3.034427 z"
       id="path143"
       style="fill:#ffffff;stroke-width:0.909091" />
  </g>
</svg>
