<?xml version="1.0" encoding="UTF-8" standalone="no"?>
<svg
   width="48"
   height="48"
   version="1.1"
   viewBox="0 0 48 48"
   id="svg7"
   sodipodi:docname="tchartstyles_200.svg"
   inkscape:version="1.3.2 (091e20e, 2023-11-25, custom)"
   xmlns:inkscape="http://www.inkscape.org/namespaces/inkscape"
   xmlns:sodipodi="http://sodipodi.sourceforge.net/DTD/sodipodi-0.dtd"
   xmlns="http://www.w3.org/2000/svg"
   xmlns:svg="http://www.w3.org/2000/svg">
  <defs
     id="defs7" />
  <sodipodi:namedview
     id="namedview7"
     pagecolor="#ffffff"
     bordercolor="#000000"
     borderopacity="0.25"
     inkscape:showpageshadow="2"
     inkscape:pageopacity="0.0"
     inkscape:pagecheckerboard="0"
     inkscape:deskcolor="#d1d1d1"
     showgrid="true"
     inkscape:current-layer="svg7">
    <inkscape:grid
       id="grid7"
       units="px"
       originx="0"
       originy="0"
       spacingx="0.5"
       spacingy="0.5"
       empcolor="#0099e5"
       empopacity="0.30196078"
       color="#0099e5"
       opacity="0.14901961"
       empspacing="2"
       dotted="false"
       gridanglex="30"
       gridanglez="30"
       visible="true" />
  </sodipodi:namedview>
  <rect
     x="2.5"
     y="2.5"
     width="43"
     height="43"
     fill="#ffffff"
     fill-rule="evenodd"
     stroke="#2a7efe"
     stroke-linecap="square"
     stroke-linejoin="round"
     style="paint-order:normal"
     id="rect1" />
  <path
     d="m7.1 26.4 5.9-10.4 4 17 7-5 6.9 12.9"
     fill="none"
     stroke="#2a7efe"
     stroke-linecap="round"
     stroke-linejoin="round"
     stroke-width="2.2"
     id="path1" />
  <path
     d="m7 10v31h31"
     fill="none"
     stroke="#4d4d4d"
     stroke-linecap="round"
     stroke-linejoin="round"
     stroke-width="2"
     id="path2" />
  <path
     d="m28.746627 17.064048 1.419326-1.415501 2.085337 2.166141-1.419326 1.415501z"
     fill="#ffffff"
     fill-rule="evenodd"
     stroke-width=".802638"
     id="path3" />
  <path
     d="m19.168951 21.662413c2.00333-0.190969 3.942648-0.07155 5.108972-1.91341 0.951094-1.502306 1.415234-2.600019 2.445983-2.98851 3.903898-1.470861 6.541002 3.318443 3.231735 5.649547-2.209244 1.556298-5.745453 0.967598-10.78669-0.747627z"
     fill="#ff0000"
     fill-rule="evenodd"
     stroke-width=".802638"
     id="path4" />
  <path
     d="m30.165953 15.648547 2.085337 2.166141 3.533764-2.108956-3.440805-3.574131z"
     fill="#b3b3b3"
     fill-rule="evenodd"
     stroke-width=".802638"
     id="path5" />
  <path
     d="m47.530873 0.45335448c-0.557095-0.5769411-1.461216-0.6070355-2.05455-0.0683876l-12.421868 11.039448 3.440262 3.573567 11.308578-12.697941c0.294247-0.2980114 0.300279-1.2518298-0.272422-1.8466861z"
     fill="#c87137"
     fill-rule="evenodd"
     stroke-width=".802638"
     id="path6" />
  <path
     d="m32.344249 12.131601 0.709663-0.707751 3.440805 3.574132-0.709663 0.70775z"
     fill="#ffffff"
     fill-rule="evenodd"
     stroke-width=".802638"
     id="path7" />
</svg>
