<svg width="24" height="24" version="1.1" xmlns="http://www.w3.org/2000/svg">
 <g fill-rule="evenodd">
  <path d="m23.437174 8.1048285c-0.730488-0.7669292-2.042981-0.8072972-2.83086-0.1051695a1.1846476 1.2223538 0.32849278 0 0-0.01962-2.034e-4l-7.404462 6.6742154a1.1846476 1.2223538 0.32849278 0 0-0.04955 0.04675l-0.423109 0.42778a1.1846476 1.2223538 0.32849278 0 0-0.172367 0.221046l-1.225851 2.004603-0.241305 0.243966c-0.432884-0.0084-0.849106-0.11535-1.2929828 0.05418-0.5947815 0.227259-1.0141001 0.677357-1.2967416 1.080491-0.2826455 0.403132-0.4854746 0.795384-0.7450841 1.211103-0.1791811 0.286857-0.2896159 0.340357-0.627606 0.42736-0.3379905 0.087-0.8772685 0.10986-1.5330346 0.173247a1.1846476 1.2223538 0.32849278 0 0-0.2676123 2.375741c1.5429868 0.532215 2.8877376 0.908445 4.1156992 1.024921 1.2279612 0.11649 2.4049382-0.03975 3.3643462-0.724924 0.906279-0.64719 1.221717-1.651187 1.240252-2.623974l0.180153-0.182145 1.981772-1.198344a1.1846476 1.2223538 0.32849278 0 0 0.229227-0.181635l0.423108-0.427782a1.1846476 1.2223538 0.32849278 0 0 0.04957-0.05355l6.528873-7.452967c5.15e-4 -5.31e-4 0.0011-0.0011 0.0017-0.0017 0.764088-0.786601 0.772388-2.216086 0.0171-3.0113493a1.1846476 1.2223538 0.32849278 0 0-0.0017-0.00174z" fill="#ffffff" stroke-width=".802638"/>
  <path d="m11.306509 18.91151 0.851596-0.849301 1.251202 1.299684-0.851596 0.849301z" fill="#ffffff" stroke-width=".802639"/>
  <path d="m5.559904 21.670528c1.2019982-0.114581 2.3655887-0.04293 3.0653834-1.148046 0.5706563-0.901383 0.8491404-1.560011 1.4675896-1.793106 2.342338-0.882516 3.924601 1.991066 1.939041 3.389729-1.325546 0.933778-3.4472718 0.580558-6.472014-0.448577z" fill="#ff0000" stroke-width=".802639"/>
  <path d="m12.158105 18.062209 1.251202 1.299684 2.120259-1.265373-2.064483-2.144479z" fill="#b3b3b3" stroke-width=".802639"/>
  <path d="m22.577057 8.9450942c-0.334257-0.3461646-0.87673-0.3642213-1.23273-0.0410326l-7.45312 6.6236684 2.064157 2.14414 6.785146-7.618764c0.176548-0.178807 0.180167-0.751098-0.163453-1.1080118z" fill="#c87137" stroke-width=".802639"/>
  <path d="m13.465083 15.952041 0.425797-0.42465 2.064484 2.144479-0.425798 0.42465z" fill="#ffffff" stroke-width=".802639"/>
 </g>
</svg>
