<?xml version="1.0" encoding="UTF-8" standalone="no"?>
<svg
   height="36"
   width="36"
   version="1.1"
   id="svg18"
   sodipodi:docname="File_25_36.svg"
   inkscape:version="1.2.2 (732a01da63, 2022-12-09)"
   inkscape:export-filename="File_25_36.png"
   inkscape:export-xdpi="96"
   inkscape:export-ydpi="96"
   xmlns:inkscape="http://www.inkscape.org/namespaces/inkscape"
   xmlns:sodipodi="http://sodipodi.sourceforge.net/DTD/sodipodi-0.dtd"
   xmlns="http://www.w3.org/2000/svg"
   xmlns:svg="http://www.w3.org/2000/svg">
  <defs
     id="defs22">
    <radialGradient
       id="a"
       cx="9.1740294"
       cy="7.8253603"
       gradientTransform="matrix(0.66909781,-2.2758851e-8,4.5190518e-8,0.58542853,1.8616763,4.291566)"
       gradientUnits="userSpaceOnUse"
       r="7.5"
       fx="9.1740294"
       fy="7.8253603">
      <stop
         offset="0"
         stop-color="#fff"
         id="stop2" />
      <stop
         offset="1"
         stop-color="#8fc1c7"
         id="stop4" />
    </radialGradient>
  </defs>
  <sodipodi:namedview
     id="namedview20"
     pagecolor="#ffffff"
     bordercolor="#666666"
     borderopacity="1.0"
     inkscape:pageshadow="2"
     inkscape:pageopacity="0.0"
     inkscape:pagecheckerboard="0"
     inkscape:deskcolor="#d1d1d1"
     showgrid="true"
     inkscape:zoom="25.277778"
     inkscape:cx="12.797802"
     inkscape:cy="18"
     inkscape:current-layer="svg18"
     showguides="true"
     inkscape:showpageshadow="2">
    <inkscape:grid
       type="xygrid"
       id="grid147"
       originx="0"
       originy="0" />
  </sodipodi:namedview>
  <rect
     style="fill:#ebfcff;fill-opacity:1;stroke:#00aad4;stroke-width:1.7;stroke-linejoin:round;stroke-dasharray:none;stroke-opacity:1"
     id="rect979"
     width="24.299999"
     height="30.299999"
     x="5.8499999"
     y="2.8500011"
     ry="2.5" />
  <path
     id="circle1042"
     style="fill:#ffffff;stroke:#00aad4;stroke-width:1.5;stroke-linejoin:round;stroke-dasharray:none;stroke-dashoffset:1.49998"
     d="M 28.117812,24.999998 A 3.1178121,3.1178121 0 0 1 25,28.11781 3.1178121,3.1178121 0 0 1 21.882188,24.999998 3.1178121,3.1178121 0 0 1 25,21.882186 a 3.1178121,3.1178121 0 0 1 3.117812,3.117812 z m -8.315022,-9.295563 0.799195,3.136078 -1.759517,1.760007 -3.140214,-0.798491 -0.952274,2.298991 2.785086,1.655848 -3.46e-4,2.48868 -2.782659,1.652425 0.952375,2.299238 3.136078,-0.799196 1.760007,1.759518 -0.798491,3.140214 2.298991,0.952272 1.655848,-2.785082 2.488679,3.44e-4 1.652426,2.782657 2.299238,-0.952374 -0.799196,-3.136078 1.759518,-1.760007 3.140214,0.798491 0.952271,-2.298989 -2.785082,-1.655849 3.45e-4,-2.488679 2.782657,-1.652428 -0.952376,-2.299236 -3.136077,0.799195 -1.760006,-1.759517 0.79849,-3.140215 -2.298989,-0.952273 -1.65585,2.785086 -2.488677,-3.46e-4 -1.652428,-2.782659 z" />
</svg>
