<?xml version="1.0" encoding="UTF-8" standalone="no"?>
<svg
   width="48"
   height="48"
   version="1.1"
   viewBox="0 0 48 48"
   id="svg9"
   sodipodi:docname="tprintersetupdialog_200.svg"
   inkscape:export-filename="tprintersetupdialog_200.png"
   inkscape:export-xdpi="96"
   inkscape:export-ydpi="96"
   inkscape:version="1.3.2 (091e20e, 2023-11-25, custom)"
   xmlns:inkscape="http://www.inkscape.org/namespaces/inkscape"
   xmlns:sodipodi="http://sodipodi.sourceforge.net/DTD/sodipodi-0.dtd"
   xmlns="http://www.w3.org/2000/svg"
   xmlns:svg="http://www.w3.org/2000/svg">
  <sodipodi:namedview
     id="namedview9"
     pagecolor="#ffffff"
     bordercolor="#000000"
     borderopacity="0.25"
     inkscape:showpageshadow="2"
     inkscape:pageopacity="0.0"
     inkscape:pagecheckerboard="0"
     inkscape:deskcolor="#d1d1d1"
     showgrid="true"
     inkscape:current-layer="svg9">
    <inkscape:grid
       id="grid9"
       units="px"
       originx="0"
       originy="0"
       spacingx="0.5"
       spacingy="0.5"
       empcolor="#0099e5"
       empopacity="0.30196078"
       color="#0099e5"
       opacity="0.14901961"
       empspacing="2"
       dotted="false"
       gridanglex="30"
       gridanglez="30"
       visible="true" />
  </sodipodi:namedview>
  <defs
     id="defs3">
    <linearGradient
       id="b"
       x1="12"
       x2="12"
       y1="1046.3622"
       y2="1041.3622"
       gradientTransform="matrix(2.0769202,0,0,2.1666641,-2.9230431,-2230.6986)"
       gradientUnits="userSpaceOnUse">
      <stop
         stop-color="#cccccc"
         offset="0"
         id="stop1" />
      <stop
         stop-color="#ffffff"
         offset=".59999651"
         id="stop2" />
      <stop
         stop-color="#cccccc"
         offset="1"
         id="stop3" />
    </linearGradient>
  </defs>
  <rect
     x="2.5"
     y="8.4999828"
     width="43"
     height="37"
     fill="#f9f9f9"
     stroke="#2a7efe"
     style="paint-order:normal"
     id="rect3" />
  <path
     d="m 5,2 h 38 c 1.8,0 3,1.2 3,3 V 8 H 2 V 5 C 2,3.2 3.2,2 5,2 Z"
     fill="#2a7efe"
     id="path3" />
  <path
     d="m 11.999999,24.5 -3.4999995,5.5 1.8e-5,7.5 H 35.499982 L 35.5,30 32,24.5 Z"
     fill="url(#b)"
     fill-rule="evenodd"
     stroke="#784421"
     stroke-linecap="round"
     stroke-linejoin="round"
     stroke-width="0.999999"
     id="path4"
     style="fill:url(#b)" />
  <rect
     x="14.50001"
     y="14.499983"
     width="14.999982"
     height="14.000017"
     fill="#ffffff"
     fill-rule="evenodd"
     stroke="#808080"
     stroke-linecap="round"
     stroke-linejoin="round"
     stroke-width="0.999999"
     style="paint-order:normal"
     id="rect4" />
  <path
     d="m 12.999999,33 h 18"
     fill="none"
     stroke="#999999"
     stroke-linecap="round"
     stroke-width="2px"
     id="path5" />
  <path
     d="m 14.000011,28 h 15.99998"
     fill="none"
     stroke="#483e37"
     stroke-linecap="round"
     stroke-width="2"
     id="path6" />
  <path
     d="m 18.000006,19 h 7.999988"
     fill="none"
     stroke="#808080"
     stroke-width="2px"
     id="path7" />
  <path
     d="m 18.000006,23 h 7.999988"
     fill="none"
     stroke="#808080"
     stroke-width="2px"
     id="path8" />
  <path
     d="m 31.763672,24.3908 -2.460938,1.0157 c -0.571061,0.2354 -0.870202,0.8657 -0.691406,1.457 l 0.583984,1.9336 -0.398437,0.3965 -1.929687,-0.5879 c -0.591311,-0.1802 -1.222776,0.1182 -1.458985,0.6894 l -1.017578,2.459 c -0.235814,0.5707 -7.8e-5,1.2272 0.544922,1.5176 l 1.779297,0.9492 v 0.5606 l -1.777344,0.955 c -0.543242,0.2909 -0.777908,0.946 -0.542969,1.5157 L 25.414063,39.5 H 37.5 V 24.3908 c -0.570718,-0.2358 -1.481136,-10e-5 -1.771484,0.5449 L 34.779297,26.715 H 34.222656 L 33.28125,24.9377 C 32.991565,24.392 32.334887,24.1553 31.763672,24.3908 Z"
     fill="#f9f9f9"
     id="path9" />
  <path
     id="a"
     d="m 25.5,32.2125 2.414714,1.2877 v 2 l -2.411676,1.2938 1.020998,2.4576 2.612365,-0.8019 1.414212,1.4142 -0.796866,2.6179 2.458614,1.0184 1.287688,-2.4147 h 2 l 1.280138,2.4145 2.459745,-1.0159 -0.790501,-2.6202 1.414213,-1.4143 2.617968,0.7971 L 43.5,36.788 l -2.41466,-1.2878 2e-6,-2 2.41162,-1.2938 -1.021004,-2.4576 -2.612346,0.802 -1.414215,-1.4142 0.796917,-2.618 -2.458615,-1.0184 -1.287698,2.4147 h -2 l -1.280132,-2.4143 -2.459736,1.0158 0.790448,2.6202 -1.414214,1.4142 -2.618003,-0.7969 z m 6.255503,1.1509 c 0.62784,-1.5157 2.365558,-2.2355 3.881306,-1.6077 1.51575,0.6279 2.235544,2.3656 1.607696,3.8813 -0.627844,1.5158 -2.365562,2.2356 -3.881318,1.6077 -1.515744,-0.6278 -2.235536,-2.3655 -1.607684,-3.8813 z"
     fill="#2a7fff" />
</svg>
