<?xml version="1.0" encoding="UTF-8" standalone="no"?>
<svg
   height="24"
   width="24"
   version="1.1"
   id="svg225"
   sodipodi:docname="Grid_09_24.svg"
   inkscape:export-filename="Grid_09_24.png"
   inkscape:export-xdpi="96"
   inkscape:export-ydpi="96"
   inkscape:version="1.2-beta (1b65182ce9, 2022-04-05)"
   xmlns:inkscape="http://www.inkscape.org/namespaces/inkscape"
   xmlns:sodipodi="http://sodipodi.sourceforge.net/DTD/sodipodi-0.dtd"
   xmlns="http://www.w3.org/2000/svg"
   xmlns:svg="http://www.w3.org/2000/svg">
  <defs
     id="defs229" />
  <sodipodi:namedview
     id="namedview227"
     pagecolor="#ffffff"
     bordercolor="#666666"
     borderopacity="1.0"
     inkscape:pageshadow="2"
     inkscape:pageopacity="0.0"
     inkscape:pagecheckerboard="0"
     inkscape:deskcolor="#d1d1d1"
     showgrid="true"
     inkscape:zoom="38.25"
     inkscape:cx="12"
     inkscape:cy="12"
     inkscape:current-layer="svg225">
    <inkscape:grid
       type="xygrid"
       id="grid1116" />
  </sodipodi:namedview>
  <linearGradient
     id="a"
     gradientTransform="matrix(0 -1.5 -1.5 0 24 24)"
     gradientUnits="userSpaceOnUse"
     x1="9"
     x2="6"
     y1="10"
     y2="10.5">
    <stop
       offset="0"
       stop-color="#72cef6"
       id="stop178" />
    <stop
       offset="1"
       stop-color="#d2f5f8"
       id="stop180" />
  </linearGradient>
  <linearGradient
     id="b"
     gradientTransform="matrix(0 -1.5 -1.5 0 24 24)"
     gradientUnits="userSpaceOnUse"
     x1="10"
     x2="5"
     y1="12.5"
     y2="12.5">
    <stop
       offset="0"
       stop-color="#4674a8"
       id="stop183" />
    <stop
       offset="1"
       stop-color="#42a0ce"
       id="stop185" />
  </linearGradient>
  <linearGradient
     id="c"
     gradientUnits="userSpaceOnUse"
     x1="-8.75"
     x2="-13.75"
     y1="-1.75"
     y2="-6.75">
    <stop
       offset="0"
       stop-color="#a00"
       id="stop188" />
    <stop
       offset="1"
       stop-color="#f55"
       id="stop190" />
  </linearGradient>
  <g
     transform="matrix(1 0 0 -1 .000003 24.000001)"
     id="g223">
    <path
       d="m-23.489361-23.489361h22.978724v22.978724h-22.978724z"
       style="fill:#fff;stroke:#999;stroke-width:1.02128;stroke-linecap:round;stroke-linejoin:round;stroke-dashoffset:1.49998"
       transform="scale(-1)"
       id="path193" />
    <g
       fill="none"
       stroke="#b3b3b3"
       transform="matrix(-1 0 0 1 24 0)"
       id="g205">
      <path
         d="m1 18.5h22"
         id="path195" />
      <path
         d="m6.5 23v-22"
         id="path197" />
      <path
         d="m23 5.5h-22"
         id="path199" />
      <path
         d="m18.5 23v-22"
         id="path201" />
      <path
         d="m12.5 23v-22"
         id="path203" />
    </g>
    <path
       d="m.5-16.5h23v8h-23z"
       fill="none"
       opacity=".5"
       stroke="#fff"
       stroke-dashoffset="1.49998"
       stroke-linejoin="round"
       transform="scale(1 -1)"
       id="path207" />
    <g
       stroke-linecap="round"
       id="g219">
      <path
         d="m23.5 15.5h-23v-6h23z"
         fill="url(#a)"
         stroke="url(#b)"
         stroke-linejoin="round"
         id="path209" />
      <circle
         cx="-11.25"
         cy="-4.25"
         fill="url(#c)"
         r="4"
         stroke="#800000"
         stroke-dashoffset="1.49998"
         stroke-linejoin="round"
         stroke-width=".5"
         transform="matrix(1.5 0 0 -1.5 31.625 .875)"
         id="circle211" />
      <g
         fill="none"
         stroke="#fff"
         transform="matrix(1.06066017 -1.06066017 -1.06066017 -1.06066017 31.1902325 14.6746205)"
         id="g217">
        <path
           d="m-4.25 13.25v-4"
           id="path213" />
        <path
           d="m-2.25 11.25h-4"
           id="path215" />
      </g>
    </g>
    <circle
       cx="-4.25"
       cy="-11.25"
       r="4.5"
       style="opacity:.7;fill:none;stroke:#fff;stroke-width:.5;stroke-linejoin:round;stroke-dashoffset:1.49998"
       transform="matrix(0 -1.5 1.5 0 31.625 .875)"
       id="circle221" />
  </g>
</svg>
