<?xml version="1.0" encoding="UTF-8" standalone="no"?>
<svg
   height="64"
   width="64"
   version="1.1"
   id="svg948"
   sodipodi:docname="Repeat_01_64.svg"
   inkscape:export-filename="Repeat_01_64.png"
   inkscape:export-xdpi="96"
   inkscape:export-ydpi="96"
   inkscape:version="1.2-beta (1b65182ce9, 2022-04-05)"
   xmlns:inkscape="http://www.inkscape.org/namespaces/inkscape"
   xmlns:sodipodi="http://sodipodi.sourceforge.net/DTD/sodipodi-0.dtd"
   xmlns="http://www.w3.org/2000/svg"
   xmlns:svg="http://www.w3.org/2000/svg">
  <defs
     id="defs950" />
  <sodipodi:namedview
     id="namedview12"
     pagecolor="#ffffff"
     bordercolor="#666666"
     borderopacity="1.0"
     inkscape:pageshadow="2"
     inkscape:pageopacity="0.0"
     inkscape:pagecheckerboard="0"
     inkscape:deskcolor="#d1d1d1"
     showgrid="true"
     inkscape:zoom="14.34375"
     inkscape:cx="32"
     inkscape:cy="32"
     inkscape:current-layer="svg948">
    <inkscape:grid
       type="xygrid"
       id="grid139" />
  </sodipodi:namedview>
  <g
     fill="none"
     stroke="#00aa00"
     stroke-linecap="round"
     transform="matrix(1.9999963,0,0,1.9999963,-12.000059,-10.107438)"
     id="g946">
    <path
       d="M 29.502099,10.683411 H 16.486813 c -4.615497,0 -8.3570964,3.747521 -8.3570964,8.370324 0,4.622803 3.7415994,8.370325 8.3570964,8.370325 h 18.029545"
       stroke-width="3.25935"
       id="path942" />
    <path
       d="m 29.343722,20.973426 6.526755,6.526754 -6.526755,6.526754"
       stroke-linejoin="round"
       stroke-width="3.26338"
       id="path944" />
  </g>
</svg>
