<?xml version="1.0" encoding="UTF-8" standalone="no"?>
<svg
   width="48"
   height="48"
   version="1.1"
   viewBox="0 0 48 48"
   id="svg11"
   sodipodi:docname="tlistchartsource_200.svg"
   inkscape:version="1.3.2 (091e20e, 2023-11-25, custom)"
   xmlns:inkscape="http://www.inkscape.org/namespaces/inkscape"
   xmlns:sodipodi="http://sodipodi.sourceforge.net/DTD/sodipodi-0.dtd"
   xmlns="http://www.w3.org/2000/svg"
   xmlns:svg="http://www.w3.org/2000/svg">
  <defs
     id="defs11" />
  <sodipodi:namedview
     id="namedview11"
     pagecolor="#ffffff"
     bordercolor="#000000"
     borderopacity="0.25"
     inkscape:showpageshadow="2"
     inkscape:pageopacity="0.0"
     inkscape:pagecheckerboard="0"
     inkscape:deskcolor="#d1d1d1"
     showgrid="true"
     inkscape:current-layer="svg11">
    <inkscape:grid
       id="grid11"
       units="px"
       originx="0"
       originy="0"
       spacingx="0.5"
       spacingy="0.5"
       empcolor="#0099e5"
       empopacity="0.30196078"
       color="#0099e5"
       opacity="0.14901961"
       empspacing="2"
       dotted="false"
       gridanglex="30"
       gridanglez="30"
       visible="true" />
  </sodipodi:namedview>
  <rect
     x="2.5"
     y="2.5"
     width="43"
     height="43"
     fill="#ffffff"
     fill-rule="evenodd"
     stroke="#2a7efe"
     stroke-linecap="square"
     stroke-linejoin="round"
     style="paint-order:normal"
     id="rect1" />
  <path
     d="m7.1 26.4 5.9-10.4 4 17 7-5 6.9 12.9"
     fill="none"
     stroke="#2a7efe"
     stroke-linecap="round"
     stroke-linejoin="round"
     stroke-width="2.2"
     id="path1" />
  <path
     d="m7 10v31h31"
     fill="none"
     stroke="#4d4d4d"
     stroke-linecap="round"
     stroke-linejoin="round"
     stroke-width="2"
     id="path2" />
  <rect
     x="21.5"
     y="2.4999998"
     width="24"
     height="21.999998"
     fill="#f9f9f9"
     stroke="#2a7efe"
     stroke-linejoin="round"
     style="paint-order:normal"
     id="rect2" />
  <path
     d="m24.5 19h4"
     fill="none"
     stroke="#b3b3b3"
     stroke-width="2px"
     id="path3" />
  <path
     d="M 24.5,14.999998 30,15"
     fill="none"
     stroke="#b3b3b3"
     stroke-width="2px"
     id="path4" />
  <path
     d="m24.5 10.999998 5 2e-6"
     fill="none"
     stroke="#b3b3b3"
     stroke-width="2px"
     id="path5" />
  <path
     d="m24.5 6.999998 6 2e-6"
     fill="none"
     stroke="#b3b3b3"
     stroke-width="2px"
     id="path6" />
  <path
     d="m33.5 2.5v22"
     fill="none"
     stroke="#2a7efe"
     stroke-linecap="round"
     stroke-linejoin="round"
     id="path7" />
  <path
     d="m36.5 19h4"
     fill="none"
     stroke="#b3b3b3"
     stroke-width="2"
     id="path8" />
  <path
     d="M 36.5,14.999998 42,15"
     fill="none"
     stroke="#b3b3b3"
     stroke-width="2"
     id="path9" />
  <path
     d="m36.5 10.999998 5 2e-6"
     fill="none"
     stroke="#b3b3b3"
     stroke-width="2"
     id="path10" />
  <path
     d="m36.5 6.999998 6 2e-6"
     fill="none"
     stroke="#b3b3b3"
     stroke-width="2"
     id="path11" />
</svg>
