<?xml version="1.0" encoding="UTF-8" standalone="no"?>
<svg
   height="36"
   viewBox="0 0 36 36"
   width="36"
   version="1.1"
   id="svg13"
   sodipodi:docname="tparadox_150.svg"
   inkscape:export-filename="tparadox_150.png"
   inkscape:export-xdpi="96"
   inkscape:export-ydpi="96"
   inkscape:version="1.3-beta (cedbd6c6ff, 2023-05-28)"
   xmlns:inkscape="http://www.inkscape.org/namespaces/inkscape"
   xmlns:sodipodi="http://sodipodi.sourceforge.net/DTD/sodipodi-0.dtd"
   xmlns:xlink="http://www.w3.org/1999/xlink"
   xmlns="http://www.w3.org/2000/svg"
   xmlns:svg="http://www.w3.org/2000/svg">
  <defs
     id="defs13">
    <linearGradient
       inkscape:collect="always"
       xlink:href="#b"
       id="linearGradient1"
       gradientUnits="userSpaceOnUse"
       x1="4.5"
       y1="1026.36222"
       x2="18"
       y2="1026.36222" />
  </defs>
  <sodipodi:namedview
     id="namedview13"
     pagecolor="#ffffff"
     bordercolor="#000000"
     borderopacity="0.25"
     inkscape:showpageshadow="2"
     inkscape:pageopacity="0.0"
     inkscape:pagecheckerboard="0"
     inkscape:deskcolor="#d1d1d1"
     showgrid="true"
     inkscape:current-layer="svg13">
    <inkscape:grid
       id="grid13"
       units="px"
       originx="0"
       originy="0"
       spacingx="0.5"
       spacingy="0.5"
       empcolor="#0099e5"
       empopacity="0.30196078"
       color="#0099e5"
       opacity="0.14901961"
       empspacing="2"
       dotted="false"
       gridanglex="30"
       gridanglez="30"
       visible="true" />
  </sodipodi:namedview>
  <linearGradient
     id="a"
     gradientUnits="userSpaceOnUse"
     x1="4.5"
     x2="18"
     xlink:href="#b"
     y1="1026.36222"
     y2="1026.36222" />
  <linearGradient
     id="b">
    <stop
       offset="0"
       stop-color="#4276c4"
       id="stop1" />
    <stop
       offset=".34375"
       stop-color="#80b3ff"
       id="stop2" />
    <stop
       offset="1"
       stop-color="#04a"
       id="stop3" />
  </linearGradient>
  <linearGradient
     id="c"
     gradientUnits="userSpaceOnUse"
     x1="4.5"
     x2="18"
     xlink:href="#b"
     y1="1017.36237"
     y2="1017.36237" />
  <linearGradient
     id="d"
     gradientUnits="userSpaceOnUse"
     x1="4.5"
     x2="18"
     xlink:href="#b"
     y1="1021.86222"
     y2="1021.86222" />
  <g
     stroke-linecap="round"
     stroke-linejoin="round"
     id="g9"
     transform="translate(1.0000019,-1016.3622)"
     style="fill-rule:evenodd">
    <g
       fill="#bdd1ec"
       id="g8">
      <ellipse
         cx="11.999998"
         cy="1034.6122"
         rx="7.5"
         ry="2.25"
         stroke="url(#a)"
         stroke-width="3"
         id="ellipse3"
         style="stroke:url(#linearGradient1)" />
      <ellipse
         cx="11.999998"
         cy="1031.6744"
         rx="8.2414637"
         ry="2.937722"
         stroke="#ffffff"
         stroke-width="1.5"
         id="ellipse4" />
      <ellipse
         cx="11.999998"
         cy="1030.1122"
         rx="7.5"
         ry="2.25"
         stroke="url(#d)"
         stroke-width="3"
         id="ellipse5"
         style="stroke:url(#d)" />
      <ellipse
         cx="11.999998"
         cy="1027.1744"
         rx="8.2414637"
         ry="2.937722"
         stroke="#ffffff"
         stroke-width="1.5"
         id="ellipse6" />
      <ellipse
         cx="11.999998"
         cy="1025.6122"
         rx="7.5"
         ry="2.25"
         stroke="url(#c)"
         stroke-width="3"
         id="ellipse7"
         style="stroke:url(#c)" />
      <ellipse
         cx="11.999998"
         cy="1022.6744"
         rx="8.2414637"
         ry="2.937722"
         stroke="#ffffff"
         stroke-width="1.5"
         id="ellipse8" />
    </g>
    <ellipse
       cx="11.999998"
       cy="1021.1122"
       fill="#80b3ff"
       rx="8.25"
       ry="3"
       stroke="url(#a)"
       stroke-width="1.5"
       id="ellipse9"
       style="stroke:url(#a)" />
  </g>
  <rect
     fill="#d45500"
     height="13.000017"
     ry="3.5"
     width="30"
     x="3"
     y="20.999983"
     id="rect9"
     style="fill-rule:evenodd" />
  <g
     id="g1"
     transform="translate(1,-14)">
    <path
       d="M 15,37.999973 V 45 h 2.214853 c 0.56167,0 1.042726,-0.09743 1.441021,-0.292581 0.400884,-0.196414 0.704664,-0.48308 0.913285,-0.858596 0.208622,-0.375519 0.314457,-0.826681 0.314457,-1.356256 v -1.985163 c 0,-0.529575 -0.105835,-0.980739 -0.314457,-1.356255 -0.208623,-0.375515 -0.512569,-0.662813 -0.910551,-0.858597 -0.397984,-0.195783 -0.876616,-0.292579 -1.438287,-0.292579 z m 0.981645,0.93516 h 1.266021 c 0.516732,0 0.916391,0.133999 1.200395,0.401954 0.284099,0.268044 0.429298,0.644185 0.429298,1.132036 v 2.061727 c 0,0.487852 -0.143607,0.865216 -0.429298,1.13477 -0.282395,0.266441 -0.683659,0.399222 -1.200395,0.399222 h -1.266021 z"
       id="path8"
       style="fill:#ffffff;stroke:none;stroke-width:0.264583" />
    <path
       d="M 9,37.999973 V 45 h 0.984378 v -2.715244 h 1.728133 c 0.417275,0 0.784233,-0.08871 1.101955,-0.265236 0.317745,-0.176527 0.56168,-0.425844 0.735553,-0.746487 0.175937,-0.324473 0.265247,-0.699698 0.265247,-1.126568 0,-0.426871 -0.08995,-0.801735 -0.265247,-1.126566 -0.174576,-0.323499 -0.418492,-0.571477 -0.735553,-0.749222 -0.318425,-0.178517 -0.68471,-0.270705 -1.101955,-0.270705 z m 0.984378,0.93516 h 1.760943 c 0.211805,0 0.396642,0.05156 0.557817,0.153127 0.15976,0.100649 0.28388,0.241512 0.371867,0.42383 0.08859,0.183576 0.133985,0.39366 0.133985,0.634378 0,0.237509 -0.04551,0.448066 -0.133985,0.631643 -0.08799,0.182324 -0.211389,0.324332 -0.371867,0.423832 -0.160479,0.09949 -0.346016,0.147655 -0.557817,0.147655 H 9.984378 Z"
       id="path32"
       style="fill:#ffffff;stroke:none;stroke-width:0.264583" />
    <path
       d="M 20.85742,37.999973 22.97383,41.431627 20.8,45 h 1.10196 L 23.49337,42.282021 25.09845,45 h 1.10469 l -2.19844,-3.576576 2.0918,-3.423451 h -1.10195 l -1.50665,2.570322 -1.52579,-2.570322 z"
       id="path48"
       style="fill:#ffffff;stroke:none;stroke-width:0.264583" />
  </g>
  <path
     d="m 24.5,7.999969 v 8.000062 L 32.500061,12 Z"
     fill="#00d455"
     stroke="#008000"
     id="path9-0"
     style="fill-rule:evenodd;stroke:#00b100;stroke-width:1;stroke-linejoin:round;stroke-opacity:1"
     sodipodi:nodetypes="cccc" />
</svg>
