<?xml version="1.0" encoding="UTF-8" standalone="no"?>
<svg
   height="32"
   viewBox="0 0 8.4667 8.4667"
   width="32"
   version="1.1"
   id="svg296"
   sodipodi:docname="menu_edit_select_tobrace_200.svg"
   inkscape:export-filename="menu_edit_select_tobrace_200.png"
   inkscape:export-xdpi="96"
   inkscape:export-ydpi="96"
   inkscape:version="1.2.1 (9c6d41e410, 2022-07-14)"
   xmlns:inkscape="http://www.inkscape.org/namespaces/inkscape"
   xmlns:sodipodi="http://sodipodi.sourceforge.net/DTD/sodipodi-0.dtd"
   xmlns="http://www.w3.org/2000/svg"
   xmlns:svg="http://www.w3.org/2000/svg">
  <defs
     id="defs300" />
  <sodipodi:namedview
     id="namedview298"
     pagecolor="#ffffff"
     bordercolor="#666666"
     borderopacity="1.0"
     inkscape:showpageshadow="2"
     inkscape:pageopacity="0.0"
     inkscape:pagecheckerboard="0"
     inkscape:deskcolor="#d1d1d1"
     showgrid="true"
     inkscape:zoom="28.6875"
     inkscape:cx="15.982571"
     inkscape:cy="16"
     inkscape:current-layer="svg296">
    <inkscape:grid
       type="xygrid"
       id="grid419" />
  </sodipodi:namedview>
  <path
     d="m2.1081483 7.9375311h-.5291686c-1.5147078-2.3662802-1.5293202-5.1583259 0-7.4083621h.5405376c-1.23123 2.5230404-1.0679496 5.0696877-.011369 7.4083621z"
     fill="#2a7fff"
     id="path282" />
  <path
     d="m6.3585517 7.9375311h.5291686c1.5147079-2.36628 1.5293201-5.1583257 0-7.4083621l-.5405376-.0000002c1.2312299 2.5230408 1.0679493 5.0696881.01136 7.4083623z"
     fill="#2a7fff"
     id="path284" />
  <g
     fill="none"
     stroke="#d4aa00"
     stroke-width=".529168"
     id="g294">
    <path
       d="m2.1195173 2.3812594h4.23335"
       id="path286" />
    <path
       d="m2.1195173 3.439597h4.23335"
       id="path288" />
    <path
       d="m2.1195173 4.4979343h4.23335"
       id="path290" />
    <path
       d="m2.1195173 5.5562719h4.23335"
       id="path292" />
  </g>
</svg>
