<?xml version="1.0" encoding="UTF-8" standalone="no"?>
<svg
   width="48"
   height="48"
   version="1.1"
   viewBox="0 0 48 48"
   id="svg7"
   sodipodi:docname="TPSImport_Controls_200.svg"
   inkscape:version="1.3.2 (091e20e, 2023-11-25, custom)"
   xmlns:inkscape="http://www.inkscape.org/namespaces/inkscape"
   xmlns:sodipodi="http://sodipodi.sourceforge.net/DTD/sodipodi-0.dtd"
   xmlns="http://www.w3.org/2000/svg"
   xmlns:svg="http://www.w3.org/2000/svg">
  <sodipodi:namedview
     id="namedview7"
     pagecolor="#ffffff"
     bordercolor="#000000"
     borderopacity="0.25"
     inkscape:showpageshadow="2"
     inkscape:pageopacity="0.0"
     inkscape:pagecheckerboard="0"
     inkscape:deskcolor="#d1d1d1"
     showgrid="true"
     inkscape:current-layer="svg7">
    <inkscape:grid
       id="grid7"
       units="px"
       originx="0"
       originy="0"
       spacingx="0.5"
       spacingy="0.5"
       empcolor="#0099e5"
       empopacity="0.30196078"
       color="#0099e5"
       opacity="0.14901961"
       empspacing="2"
       dotted="false"
       gridanglex="30"
       gridanglez="30"
       visible="true" />
  </sodipodi:namedview>
  <defs
     id="defs4">
    <linearGradient
       id="a"
       x1="12.5"
       x2="24"
       y1="1043.3622"
       y2="1046.1492"
       gradientTransform="matrix(2,0,0,2,0,-2056.7244)"
       gradientUnits="userSpaceOnUse">
      <stop
         stop-color="#d7eef4"
         offset="0"
         id="stop1" />
      <stop
         stop-color="#afc6e9"
         offset="1"
         id="stop2" />
    </linearGradient>
    <linearGradient
       id="b"
       x1="10"
       x2="10"
       y1="1042.3622"
       y2="1029.8622"
       gradientTransform="matrix(1.9999996,0,0,1.9999996,3e-6,-2056.824)"
       gradientUnits="userSpaceOnUse">
      <stop
         stop-color="#00aa00"
         offset="0"
         id="stop3" />
      <stop
         stop-color="#55d400"
         offset="1"
         id="stop4" />
    </linearGradient>
  </defs>
  <rect
     x="0.49999949"
     y="30.499983"
     width="20.999987"
     height="16.999989"
     fill="#ffffff"
     fill-rule="evenodd"
     stroke="#2a7efe"
     stroke-linecap="square"
     stroke-width="0.999999"
     style="stroke-linejoin:round;paint-order:normal"
     id="rect4" />
  <path
     d="M 4.65,43.3503 V 34.65 h 2.65813 c 3.54415,0 3.54415,4.7695 0,4.7695 H 4.65"
     fill="none"
     stroke="#4d4d4d"
     stroke-linecap="round"
     stroke-width="1.3"
     id="path4"
     style="stroke-linejoin:round" />
  <path
     d="M 17.63211,35.2178 C 17.07695,34.835 16.25262,34.65 15.26779,34.65 c -1.39173,0 -2.65814,0.7319 -2.65814,2.2537 0,1.1921 1.00545,1.6822 2.65814,1.9691 2.30127,0.3993 2.65812,1.1756 2.65812,2.2238 0,1.8941 -1.57603,2.2537 -2.65812,2.2537 -0.84003,0 -1.70229,-0.1022 -2.78379,-0.6624"
     fill="none"
     stroke="#4d4d4d"
     stroke-linecap="round"
     stroke-width="1.3"
     id="path5"
     style="stroke-linejoin:round" />
  <path
     d="M 3,15 15.5,2.5 v 8 C 38.499996,10.5 39,27 39,40 39,44 35,44 35,40 35,25 29.499997,19.5 15.5,19.5 v 8 z"
     fill="url(#b)"
     fill-rule="evenodd"
     stroke="#00a300"
     id="path6"
     style="fill:url(#b);stroke-linejoin:round" />
  <path
     d="M 47,41 23,47 V 27 l 24,-3 z"
     fill="url(#a)"
     fill-rule="evenodd"
     stroke="#2a7efe"
     stroke-width="2px"
     id="path7"
     style="fill:url(#a);stroke-linejoin:round" />
</svg>
