<?xml version="1.0" encoding="UTF-8" standalone="no"?>
<svg
   height="16"
   width="16"
   version="1.1"
   id="svg3"
   sodipodi:docname="Database_15_16.svg"
   inkscape:version="1.3 (0e150ed6c4, 2023-07-21)"
   inkscape:export-filename="Database_15_16.png"
   inkscape:export-xdpi="96"
   inkscape:export-ydpi="96"
   xmlns:inkscape="http://www.inkscape.org/namespaces/inkscape"
   xmlns:sodipodi="http://sodipodi.sourceforge.net/DTD/sodipodi-0.dtd"
   xmlns="http://www.w3.org/2000/svg"
   xmlns:svg="http://www.w3.org/2000/svg">
  <defs
     id="defs3" />
  <sodipodi:namedview
     id="namedview3"
     pagecolor="#ffffff"
     bordercolor="#000000"
     borderopacity="0.25"
     inkscape:showpageshadow="2"
     inkscape:pageopacity="0.0"
     inkscape:pagecheckerboard="0"
     inkscape:deskcolor="#d1d1d1"
     showgrid="true"
     inkscape:current-layer="svg3">
    <inkscape:grid
       id="grid3"
       units="px"
       originx="0"
       originy="0"
       spacingx="0.5"
       spacingy="0.5"
       empcolor="#0099e5"
       empopacity="0.30196078"
       color="#0099e5"
       opacity="0.14901961"
       empspacing="2"
       dotted="false"
       gridanglex="30"
       gridanglez="30"
       visible="true" />
  </sodipodi:namedview>
  <g
     stroke-linecap="round"
     id="g3">
    <path
       d="m8 1c-3.3136981 0-6 1.045335-6 2.3339844v1.8652344c0 1.2886494 2.6863019 2.3339843 6 2.3339843 3.3137 0 6-1.0453349 6-2.3339843v-1.8652344c0-1.2886494-2.6863-2.3339844-6-2.3339844zm0 1.4003906c2.772225 0 4.582683.8957954 5.433594 1.6015625-.84888.5790009-2.654208 1.2373168-5.433594 1.1972657-2.7496639-.0397836-4.5545813-.6862743-5.4140625-1.2382813.8540141-.708314 2.6469732-1.5605469 5.4140625-1.5605469zm-6 4.1992188v2.3339844c0 .8295089 1.1159641 1.5567482 2.7929688 1.9707032.5709623-.568751 1.3820316-.904297 2.2070312-.904297h1c.9059536 0 1.7947019.403906 2.367188 1.078125.108127-.018086.21167-.038149.316406-.058594.573578-.638807 1.437053-1.019531 2.316406-1.019531h.335938c.423121-.3197262.664062-.6821454.664062-1.0664062v-2.3339844c0 1.2886507-2.686297 2.3339844-6 2.3339844-3.3137014 0-6-1.0453337-6-2.3339844zm0 3.7343746v2.332032c0 .69159.7786354 1.310825 2.0078125 1.738281-.0044072-.062752-.0078125-.125092-.0078125-.189453v-1.429688c0-.240057.0317607-.469264.0898438-.685547-1.2775487-.427549-2.0898438-1.058498-2.0898438-1.765625z"
       fill="#00aad4"
       stroke-linejoin="round"
       stroke-miterlimit="5.6"
       stroke-width="2"
       id="path1" />
    <g
       fill="none"
       stroke="#ff7f00"
       transform="translate(1 1)"
       id="g2">
      <rect
         height="4.000004"
         rx="1.5"
         ry="1.285716"
         stroke-linejoin="round"
         stroke-width=".999998"
         width="4"
         x="10.5"
         y="10.5"
         id="rect1" />
      <rect
         height="4.000006"
         rx="1.5"
         ry="1.285716"
         stroke-linejoin="round"
         stroke-width=".999998"
         width="4"
         x="4.5"
         y="10.5"
         id="rect2" />
      <path
         d="m7 12.5h5"
         stroke-width="1.3"
         id="path2" />
    </g>
  </g>
</svg>
