<?xml version="1.0" encoding="UTF-8" standalone="no"?>
<svg
   height="24"
   width="24"
   version="1.1"
   id="svg409"
   sodipodi:docname="state_information_150.svg"
   inkscape:export-filename="state_information_150.png"
   inkscape:export-xdpi="96"
   inkscape:export-ydpi="96"
   inkscape:version="1.2.2 (732a01da63, 2022-12-09)"
   xmlns:inkscape="http://www.inkscape.org/namespaces/inkscape"
   xmlns:sodipodi="http://sodipodi.sourceforge.net/DTD/sodipodi-0.dtd"
   xmlns="http://www.w3.org/2000/svg"
   xmlns:svg="http://www.w3.org/2000/svg">
  <defs
     id="defs413" />
  <sodipodi:namedview
     id="namedview411"
     pagecolor="#ffffff"
     bordercolor="#666666"
     borderopacity="1.0"
     inkscape:showpageshadow="2"
     inkscape:pageopacity="0.0"
     inkscape:pagecheckerboard="0"
     inkscape:deskcolor="#d1d1d1"
     showgrid="true"
     inkscape:zoom="38.25"
     inkscape:cx="10.69281"
     inkscape:cy="12"
     inkscape:current-layer="svg409">
    <inkscape:grid
       type="xygrid"
       id="grid780" />
  </sodipodi:namedview>
  <circle
     cx="12"
     cy="12"
     r="12"
     style="fill:#2a7fff;fill-opacity:1;fill-rule:evenodd;stroke:none;stroke-width:2.25;stroke-linecap:round;stroke-linejoin:round"
     id="circle401" />
  <path
     d="m 12,11.25 v 7.5"
     fill="none"
     stroke="#2a7fff"
     stroke-linecap="round"
     stroke-width="3"
     id="path405-5"
     style="fill:none;stroke:#ffffff;stroke-width:3;stroke-dasharray:none"
     sodipodi:nodetypes="cc" />
  <path
     d="M 12,5.25 V 6"
     fill="none"
     stroke="#2a7fff"
     stroke-linecap="round"
     stroke-width="3"
     id="path1602-9"
     style="fill:none;stroke:#ffffff;stroke-width:3;stroke-dasharray:none"
     sodipodi:nodetypes="cc" />
</svg>
