<?xml version="1.0" encoding="UTF-8" standalone="no"?>
<svg
   width="36"
   height="36"
   version="1.1"
   viewBox="0 0 36 36"
   id="svg27"
   sodipodi:docname="Database_17_36.svg"
   inkscape:export-filename="Database_17_36.png"
   inkscape:export-xdpi="96"
   inkscape:export-ydpi="96"
   inkscape:version="1.3.2 (091e20e, 2023-11-25, custom)"
   xmlns:inkscape="http://www.inkscape.org/namespaces/inkscape"
   xmlns:sodipodi="http://sodipodi.sourceforge.net/DTD/sodipodi-0.dtd"
   xmlns:xlink="http://www.w3.org/1999/xlink"
   xmlns="http://www.w3.org/2000/svg"
   xmlns:svg="http://www.w3.org/2000/svg">
  <defs
     id="defs27">
    <linearGradient
       id="a-9"
       gradientUnits="userSpaceOnUse"
       x1="31.906252"
       x2="20.093752"
       y1="31.90625"
       y2="20.09375">
      <stop
         offset="0"
         stop-color="#009600"
         id="stop1-7" />
      <stop
         offset="1"
         stop-color="#6edb39"
         id="stop2-7" />
    </linearGradient>
    <linearGradient
       id="a-2"
       gradientUnits="userSpaceOnUse"
       x1="31.956079"
       x2="21.043919"
       y1="31.956081"
       y2="21.043919"
       gradientTransform="matrix(1.0424148,0,0,1.0424148,-1.6239912,-1.6239912)">
      <stop
         offset="0"
         stop-color="#009600"
         id="stop974" />
      <stop
         offset="1"
         stop-color="#6edb39"
         id="stop976" />
    </linearGradient>
  </defs>
  <sodipodi:namedview
     id="namedview27"
     pagecolor="#ffffff"
     bordercolor="#000000"
     borderopacity="0.25"
     inkscape:showpageshadow="2"
     inkscape:pageopacity="0.0"
     inkscape:pagecheckerboard="0"
     inkscape:deskcolor="#d1d1d1"
     showgrid="true"
     inkscape:current-layer="svg27">
    <inkscape:grid
       id="grid27"
       units="px"
       originx="0"
       originy="0"
       spacingx="0.5"
       spacingy="0.5"
       empcolor="#0099e5"
       empopacity="0.30196078"
       color="#0099e5"
       opacity="0.14901961"
       empspacing="2"
       dotted="false"
       gridanglex="30"
       gridanglez="30"
       visible="true" />
  </sodipodi:namedview>
  <linearGradient
     id="a"
     x1="1"
     x2="12"
     y1="4.5"
     y2="4.5"
     gradientTransform="matrix(2.2727273 0 0 2.25 2.727273 .75)"
     gradientUnits="userSpaceOnUse"
     xlink:href="#b" />
  <linearGradient
     id="b">
    <stop
       stop-color="#2de3e3"
       offset="0"
       id="stop1" />
    <stop
       stop-color="#71ffff"
       offset=".23818764"
       id="stop2" />
    <stop
       stop-color="#08b9b9"
       offset=".48656252"
       id="stop3" />
    <stop
       stop-color="#08cfcf"
       offset=".6837101"
       id="stop4" />
    <stop
       stop-color="#079a9a"
       offset=".86378187"
       id="stop5" />
    <stop
       stop-color="#07cccc"
       offset="1"
       id="stop6" />
  </linearGradient>
  <linearGradient
     id="c">
    <stop
       stop-color="#999999"
       offset="0"
       id="stop7" />
    <stop
       stop-color="#f8f8f8"
       offset=".23818764"
       id="stop8" />
    <stop
       stop-color="#868684"
       offset=".48656252"
       id="stop9" />
    <stop
       stop-color="#b2b2b2"
       offset=".6837101"
       id="stop10" />
    <stop
       stop-color="#4f4f4f"
       offset=".86378187"
       id="stop11" />
    <stop
       stop-color="#858585"
       offset="1"
       id="stop12" />
  </linearGradient>
  <linearGradient
     id="d">
    <stop
       stop-color="#9d9d9d"
       offset="0"
       id="stop13" />
    <stop
       stop-color="#808080"
       offset="1"
       id="stop14" />
  </linearGradient>
  <linearGradient
     id="e"
     x1="1"
     x2="12"
     y1="3.122919"
     y2="3.122919"
     gradientTransform="matrix(2.2727273 0 0 2.25 2.727273 1.875)"
     gradientUnits="userSpaceOnUse"
     xlink:href="#c" />
  <linearGradient
     id="f"
     x1="1"
     x2="12"
     y1="1.5"
     y2="1.5"
     gradientTransform="matrix(2.2727273 0 0 2.25 2.727273 1.875)"
     gradientUnits="userSpaceOnUse">
    <stop
       stop-color="#b0b0b0"
       offset="0"
       id="stop15" />
    <stop
       stop-color="#cbcbcb"
       offset="1"
       id="stop16" />
  </linearGradient>
  <linearGradient
     id="g"
     x1="4.5"
     x2="6"
     y1="6"
     y2="4"
     gradientTransform="matrix(2.2727273 0 0 2.25 2.727273 1.000032)"
     gradientUnits="userSpaceOnUse"
     xlink:href="#d" />
  <linearGradient
     id="h"
     x1="1"
     x2="12"
     y1="4.5"
     y2="4.5"
     gradientTransform="matrix(2.2727273 0 0 2.25 2.727273 7.75)"
     gradientUnits="userSpaceOnUse"
     xlink:href="#b" />
  <linearGradient
     id="i"
     x1="1"
     x2="12"
     y1="3.122919"
     y2="3.122919"
     gradientTransform="matrix(2.2727273 0 0 2.25 2.727273 8.875)"
     gradientUnits="userSpaceOnUse"
     xlink:href="#c" />
  <linearGradient
     id="j"
     x1="4.5"
     x2="6"
     y1="6"
     y2="4"
     gradientTransform="matrix(2.2727273 0 0 2.25 2.727273 8.000032)"
     gradientUnits="userSpaceOnUse"
     xlink:href="#d" />
  <linearGradient
     id="k"
     x1="1"
     x2="12"
     y1="4.5"
     y2="4.5"
     gradientTransform="matrix(2.2727273 0 0 2.25 2.727273 14.750001)"
     gradientUnits="userSpaceOnUse"
     xlink:href="#b" />
  <linearGradient
     id="l"
     x1="1"
     x2="12"
     y1="3.122919"
     y2="3.122919"
     gradientTransform="matrix(2.2727273 0 0 2.25 2.727273 15.875001)"
     gradientUnits="userSpaceOnUse"
     xlink:href="#c" />
  <linearGradient
     id="m"
     x1="4.5"
     x2="6"
     y1="6"
     y2="4"
     gradientTransform="matrix(2.2727273 0 0 2.25 2.727273 15.000032)"
     gradientUnits="userSpaceOnUse"
     xlink:href="#d" />
  <linearGradient
     id="n"
     x1="1"
     x2="12"
     y1="3.122919"
     y2="3.122919"
     gradientTransform="matrix(2.2727273 0 0 2.25 2.727273 22.875001)"
     gradientUnits="userSpaceOnUse"
     xlink:href="#c" />
  <ellipse
     cx="17.5"
     cy="12.250032"
     rx="12.5"
     ry="2.25"
     fill="url(#g)"
     stroke-width=".999999"
     id="ellipse16" />
  <ellipse
     cx="17.5"
     cy="5.25"
     rx="12.5"
     ry="2.25"
     fill="url(#f)"
     stroke-width=".999999"
     id="ellipse17" />
  <path
     d="m17.5 11.000032c-6.903559 0-12.5-1.0073588-12.5-2.2499998l-2e-7 -3.5000319c0 1.242641 5.5964411 2.3750319 12.5 2.3750319 6.90356 0 12.5-1.1323909 12.5-2.3750319v3.5000319c0 1.242641-5.59644 2.2499998-12.5 2.2499998z"
     fill="url(#e)"
     stroke-linecap="round"
     stroke-width=".1"
     id="path17" />
  <path
     d="m17.5 7.8600093c-12.5 0-12.5-2.610009-12.5-2.610009s0 2.024991 12.5 2.024991c12.5 0 12.5-2.024991 12.5-2.024991s0 2.610009-12.5 2.610009z"
     fill="#e6e6e6"
     stroke-linecap="round"
     stroke-width=".1"
     id="path18" />
  <path
     d="m6.1363649 9.6816742v2.2499998c2.2727267 1.299037 6.8181811 1.543358 11.3636351 1.543358 4.545456 0 9.090911-.225 11.363636-1.543358v-2.2499998c-1.971564.7761208-6.312593 1.3183578-11.363636 1.3183578-5.051042 0-9.3920731-.542237-11.3636351-1.3183578z"
     fill="url(#a)"
     stroke-linecap="round"
     stroke-width=".1"
     id="path19" />
  <ellipse
     cx="17.5"
     cy="19.250031"
     rx="12.5"
     ry="2.25"
     fill="url(#j)"
     stroke-width=".999999"
     id="ellipse19" />
  <path
     d="m17.5 18.000032c-6.903559 0-12.5-1.007359-12.5-2.25l-2e-7 -3.500032c0 1.242641 5.5964411 2.375032 12.5 2.375032 6.90356 0 12.5-1.132391 12.5-2.375032v3.500032c0 1.242641-5.59644 2.25-12.5 2.25z"
     fill="url(#i)"
     stroke-linecap="round"
     stroke-width=".1"
     id="path20" />
  <path
     d="m17.5 14.860009c-12.5 0-12.5-2.610009-12.5-2.610009s0 2.024991 12.5 2.024991c12.5 0 12.5-2.024991 12.5-2.024991s0 2.610009-12.5 2.610009z"
     fill="#e6e6e6"
     stroke-linecap="round"
     stroke-width=".1"
     id="path21" />
  <path
     d="m6.1363649 16.681674v2.25c2.2727267 1.299037 6.8181811 1.543358 11.3636351 1.543358 4.545456 0 9.090911-.225 11.363636-1.543358v-2.25c-1.971564.776121-6.312593 1.318358-11.363636 1.318358-5.051042 0-9.3920731-.542237-11.3636351-1.318358z"
     fill="url(#h)"
     stroke-linecap="round"
     stroke-width=".1"
     id="path22" />
  <ellipse
     cx="17.5"
     cy="26.250034"
     rx="12.5"
     ry="2.25"
     fill="url(#m)"
     stroke-width=".999999"
     id="ellipse22" />
  <path
     d="m17.5 25.000032c-6.903559 0-12.5-1.007359-12.5-2.25l-2e-7 -3.500032c0 1.242641 5.5964411 2.375032 12.5 2.375032 6.90356 0 12.5-1.132391 12.5-2.375032v3.500032c0 1.242641-5.59644 2.25-12.5 2.25z"
     fill="url(#l)"
     stroke-linecap="round"
     stroke-width=".1"
     id="path23" />
  <path
     d="m17.5 21.860009c-12.5 0-12.5-2.610009-12.5-2.610009s0 2.024991 12.5 2.024991c12.5 0 12.5-2.024991 12.5-2.024991s0 2.610009-12.5 2.610009z"
     fill="#e6e6e6"
     stroke-linecap="round"
     stroke-width=".1"
     id="path24" />
  <path
     d="m6.1363649 23.681674v2.25c2.2727267 1.299037 6.8181811 1.543358 11.3636351 1.543358 4.545456 0 9.090911-.225 11.363636-1.543358v-2.25c-1.971564.776121-6.312593 1.318358-11.363636 1.318358-5.051042 0-9.3920731-.542237-11.3636351-1.318358z"
     fill="url(#k)"
     stroke-linecap="round"
     stroke-width=".1"
     id="path25" />
  <path
     d="m17.5 32.000032c-6.903559 0-12.5-1.007359-12.5-2.25l-2e-7 -3.500032c0 1.242641 5.5964411 2.375032 12.5 2.375032 6.90356 0 12.5-1.132391 12.5-2.375032v3.500032c0 1.242641-5.59644 2.25-12.5 2.25z"
     fill="url(#n)"
     stroke-linecap="round"
     stroke-width=".1"
     id="path26" />
  <path
     d="m17.5 28.860009c-12.5 0-12.5-2.610009-12.5-2.610009s0 2.024991 12.5 2.024991c12.5 0 12.5-2.024991 12.5-2.024991s0 2.610009-12.5 2.610009z"
     fill="#e6e6e6"
     stroke-linecap="round"
     stroke-width=".1"
     id="path27" />
  <g
     id="g1158">
    <circle
       cx="26"
       cy="26"
       fill="url(#a)"
       stroke-dashoffset="1.49998"
       stroke-linejoin="round"
       stroke-width="1.54054"
       transform="matrix(0,1,1,0,0,0)"
       id="circle979"
       style="fill:url(#a-2);stroke:#ffffff;stroke-width:1.8;stroke-linecap:round;stroke-dasharray:none"
       r="9.1000004" />
    <path
       d="m 26.003063,21.917053 v 8.199836"
       id="path1074"
       style="fill:none;stroke:#ffffff;stroke-width:1.8;stroke-linecap:round;stroke-dasharray:none"
       sodipodi:nodetypes="cc" />
    <path
       d="m 30.113989,25.999648 h -8.2"
       id="path1076"
       style="fill:none;stroke:#ffffff;stroke-width:1.8;stroke-linecap:round;stroke-dasharray:none"
       sodipodi:nodetypes="cc" />
  </g>
</svg>
