<svg width="24" height="24" version="1.1" xmlns="http://www.w3.org/2000/svg">
 <path d="m22.624541 21.693269-1e-6 -18.193269-2.110327-2.125h-17.214807c-0.5105327 0-0.924406 0.4172765-0.924406 0.9320168v19.385516c-8e-7 0.514741 0.4138733 0.932017 0.924406 0.932017h18.401189c0.510532 0 0.924406-0.417276 0.924406-0.932017z" fill="#c2f3ff" fill-rule="evenodd" stroke="#00aad4" stroke-linejoin="round" stroke-width=".75"/>
 <path d="m17.625 1.375v4.9568965c0 0.7163794-0.559776 1.2931035-1.255102 1.2931035h-7.7397958c-0.6953266 0-1.2551022-0.5767241-1.2551022-1.2931035v-4.9568965z" fill="#ebfcff" stroke="#00aad4" stroke-linejoin="round" stroke-width=".75"/>
 <path d="m15 3v3" fill="none" stroke="#00aad4" stroke-linejoin="round" stroke-width="2"/>
 <path d="m6.6141305 10.375h11.77174c0.686478 0 1.23913 0.55561 1.23913 1.245763v11.003787h-14.25v-11.003787c0-0.690153 0.5526522-1.245763 1.2391305-1.245763z" fill="#ebfcff" stroke="#00aad4" stroke-linejoin="round" stroke-width=".75"/>
 <circle transform="matrix(0,1,1,0,0,0)" cx="17.5" cy="17.5" r="5.9000001" fill="#e5ffd5" stroke="#01a901" stroke-dashoffset="1.49998" stroke-linecap="round" stroke-linejoin="round" stroke-width="1.2"/>
 <path d="m17.5 14.5v6" fill="none" stroke="#01a901" stroke-linecap="round" stroke-width="1.2"/>
 <path d="m20.5 17.5h-6" fill="none" stroke="#01a901" stroke-linecap="round" stroke-width="1.2"/>
</svg>
