<?xml version="1.0" encoding="UTF-8" standalone="no"?>
<svg
   height="24"
   viewBox="0 0 6.3499998 6.3500003"
   width="24"
   version="1.1"
   id="svg163"
   sodipodi:docname="Font_23_24.svg"
   inkscape:export-filename="Font_23_24.png"
   inkscape:export-xdpi="96"
   inkscape:export-ydpi="96"
   inkscape:version="1.2.1 (9c6d41e410, 2022-07-14)"
   xmlns:inkscape="http://www.inkscape.org/namespaces/inkscape"
   xmlns:sodipodi="http://sodipodi.sourceforge.net/DTD/sodipodi-0.dtd"
   xmlns="http://www.w3.org/2000/svg"
   xmlns:svg="http://www.w3.org/2000/svg">
  <defs
     id="defs167" />
  <sodipodi:namedview
     id="namedview165"
     pagecolor="#ffffff"
     bordercolor="#666666"
     borderopacity="1.0"
     inkscape:showpageshadow="2"
     inkscape:pageopacity="0.0"
     inkscape:pagecheckerboard="0"
     inkscape:deskcolor="#d1d1d1"
     showgrid="true"
     inkscape:zoom="38.25"
     inkscape:cx="11.986928"
     inkscape:cy="12"
     inkscape:current-layer="svg163">
    <inkscape:grid
       type="xygrid"
       id="grid898" />
  </sodipodi:namedview>
  <g
     transform="scale(.39687501)"
     id="g161">
    <g
       fill="none"
       stroke="#d4aa00"
       stroke-linecap="round"
       stroke-linejoin="round"
       transform="scale(1.25)"
       id="g157">
      <path
         d="m.5 7.5h2.5"
         id="path147" />
      <path
         d="m6 7.5h2.5"
         id="path149" />
      <path
         d="m1.5 7.5 3-7 3 7"
         id="path151" />
      <path
         d="m2.5.5h2"
         id="path153" />
      <path
         d="m2.5 5.3h4"
         id="path155" />
    </g>
    <path
       d="m10.586989 7c-.405767 0-.8695171.0410571-1.3877068.1263291a.4464734.4464734 0 0 1 -.00574.00191c-.5204854.0790648-1.0313639.1872669-1.5312655.3253976-.3705277.1042252-.6205932.2146645-.6373883.2258614a.4464734.4464734 0 0 1 -.013398.00958c-.055714.034048-.090703.069932-.1244151.1339855-.028432.05402-.049765.1299596-.049765.2507444 0 .2195882.05625.3467643.1646108.4651213.1187261.1159328.2176124.1607827.388558.1607827.1406146 0 .4034945-.036632.7522332-.1205871l-.00191.00191c1.008049-.2502812 1.8388274-.3809072 2.5170077-.3809072.794554 0 1.36953.066629 1.79732.3847298.360721.2636091.587624.6835215.587624 1.1235644v.4995751a.4464734.4464734 0 0 1 -.518716.440238c-.812706-.13323-1.52018-.199065-2.1208-.199065-1.5077051 0-2.630452.357403-3.4300298 1.029775-.8254635.693138-1.1771587 1.370591-1.1771587 2.097831 0 .577061.262337 1.101078.8957891 1.64228.6110358.515255 1.4009374.780944 2.444279.780944.4761087 0 1.0215714-.06767 1.6288804-.204806a.4464734.4464734 0 0 1 .0038 0c.59574-.128107 1.131877-.323333 1.61744-.58188a.4464734.4464734 0 0 1 .656529.394299v.04402h2.004041c.446629 0 .691299-.09861.771374-.170352.132588-.120177.181818-.225114.181818-.424926 0-.208932-.04842-.305559-.176096-.417269a.4464734.4464734 0 0 1 -.0096-.01148c-.08191-.07663-.322626-.176095-.767546-.176095h-.35598a.4464734.4464734 0 0 1 -.445983-.445981v-4.3085925c0-.8625065-.288844-1.4633352-.911102-1.9447044a.4464734.4464734 0 0 1 -.0038-.00191c-.611254-.4831635-1.507405-.7503231-2.742904-.7503231zm-.306252 4.660783c.742124 0 1.541949.08481 2.402169.252658a.4464734.4464734 0 0 1 .359848.438324v.897704a.4464734.4464734 0 0 1 -.193323.367503c-.536593.36753-1.145757.657795-1.824117.867078-.665651.207569-1.2763378.313909-1.8375162.313909-.6485334 0-1.2043475-.119314-1.6441941-.409613a.4464734.4464734 0 0 1 -.00191-.002c-.2746279-.183067-.4746897-.513922-.4746897-.849831 0-.481257.3235085-.866755.7637177-1.17333a.4464734.4464734 0 0 1 .00383-.0038c.6922524-.469218 1.5230904-.698661 2.4461883-.698661z"
       fill="#2a7fff"
       stroke-width=".9"
       id="path159" />
  </g>
</svg>
