<?xml version="1.0" encoding="UTF-8" standalone="no"?>
<svg
   height="16"
   width="16"
   version="1.1"
   id="svg169"
   sodipodi:docname="Secure_07_16.svg"
   inkscape:version="1.2.2 (732a01da63, 2022-12-09)"
   xmlns:inkscape="http://www.inkscape.org/namespaces/inkscape"
   xmlns:sodipodi="http://sodipodi.sourceforge.net/DTD/sodipodi-0.dtd"
   xmlns="http://www.w3.org/2000/svg"
   xmlns:svg="http://www.w3.org/2000/svg">
  <defs
     id="defs173" />
  <sodipodi:namedview
     id="namedview171"
     pagecolor="#ffffff"
     bordercolor="#000000"
     borderopacity="0.25"
     inkscape:showpageshadow="2"
     inkscape:pageopacity="0.0"
     inkscape:pagecheckerboard="0"
     inkscape:deskcolor="#d1d1d1"
     showgrid="true"
     inkscape:zoom="56.875"
     inkscape:cx="7.9912088"
     inkscape:cy="8"
     inkscape:current-layer="svg169">
    <inkscape:grid
       type="xygrid"
       id="grid1032" />
  </sodipodi:namedview>
  <linearGradient
     id="a"
     gradientUnits="userSpaceOnUse"
     x1="5.5"
     x2="11"
     y1="6.5"
     y2="9">
    <stop
       offset="0"
       stop-color="#f2f2f2"
       id="stop150" />
    <stop
       offset="1"
       stop-color="#d4d4d4"
       id="stop152" />
  </linearGradient>
  <linearGradient
     id="b"
     gradientTransform="matrix(3.583326 0 0 3.6889308 -.084708 .028969)"
     gradientUnits="userSpaceOnUse"
     x1="1.499774"
     x2="3.614834"
     y1="1.322335"
     y2="2.204926">
    <stop
       offset="0"
       stop-color="#80b5fe"
       id="stop155" />
    <stop
       offset="1"
       stop-color="#2a7efe"
       id="stop157" />
  </linearGradient>
  <linearGradient
     id="c"
     gradientTransform="matrix(3.583326 0 0 3.6889308 -.084708 .028969)"
     gradientUnits="userSpaceOnUse"
     x1=".530372"
     x2="3.879216"
     y1="1.145817"
     y2="2.557962">
    <stop
       offset="0"
       stop-color="#e7c962"
       id="stop160" />
    <stop
       offset="1"
       stop-color="#d4a41c"
       id="stop162" />
  </linearGradient>
  <path
     d="m1.5000003 8.8139499-.0000003-5.8604691c1.8947368 0 4.4210526-.9767448 6.000001-1.95348959 1.5789467.97674479 4.105262 1.95348959 5.999999 1.95348959v5.8604691c0 2.2856091-3.157894 5.8604681-5.999999 6.1860511-2.8421059-.325583-6.0000007-3.900442-6.0000007-6.1860511z"
     fill="url(#b)"
     stroke="url(#c)"
     stroke-linecap="round"
     stroke-linejoin="round"
     id="path165" />
  <path
     d="m8.5652148 7.499999a1.0652146 1.0652146 0 0 1 -1.0652158 1.0652158 1.0652146 1.0652146 0 0 1 -1.0652139-1.0652158 1.0652146 1.0652146 0 0 1 1.0652139-1.0652139 1.0652146 1.0652146 0 0 1 1.0652158 1.0652139zm-2.5669733-2.1032345-.6008097.6009769-1.0722656-.2726548-.3251662.7850196.9510027.5654102-.0001181.8497917-.9501737.5642414.3251997.7851041 1.070854-.2728959.6009768.6008102-.2726546 1.0722621.7850194.325169.5654102-.951.8497917.000115.5642414.950172.7851055-.325196-.2728973-1.0708554.6008097-.6009769 1.0722646.2726543.325168-.7850192-.951001-.5654098.000116-.8497908.950172-.5642426-.325196-.7851034-1.0708551.2728952-.6009782-.6008097.2726553-1.0722657-.7850202-.325166-.5654113.9510025-.8497893-.0001181-.5642426-.9501738-.7851033.3252001z"
     fill="url(#a)"
     id="path167" />
</svg>
