<?xml version="1.0" encoding="UTF-8" standalone="no"?>
<svg
   width="32"
   height="32"
   version="1.1"
   viewBox="0 0 32 32"
   id="svg27"
   sodipodi:docname="Database_16_32.svg"
   inkscape:export-filename="Database_16_32.png"
   inkscape:export-xdpi="96"
   inkscape:export-ydpi="96"
   inkscape:version="1.3.2 (091e20e, 2023-11-25, custom)"
   xmlns:inkscape="http://www.inkscape.org/namespaces/inkscape"
   xmlns:sodipodi="http://sodipodi.sourceforge.net/DTD/sodipodi-0.dtd"
   xmlns:xlink="http://www.w3.org/1999/xlink"
   xmlns="http://www.w3.org/2000/svg"
   xmlns:svg="http://www.w3.org/2000/svg">
  <defs
     id="defs27" />
  <sodipodi:namedview
     id="namedview27"
     pagecolor="#ffffff"
     bordercolor="#000000"
     borderopacity="0.25"
     inkscape:showpageshadow="2"
     inkscape:pageopacity="0.0"
     inkscape:pagecheckerboard="0"
     inkscape:deskcolor="#d1d1d1"
     showgrid="true"
     inkscape:current-layer="svg27">
    <inkscape:grid
       id="grid27"
       units="px"
       originx="0"
       originy="0"
       spacingx="0.5"
       spacingy="0.5"
       empcolor="#0099e5"
       empopacity="0.30196078"
       color="#0099e5"
       opacity="0.14901961"
       empspacing="2"
       dotted="false"
       gridanglex="30"
       gridanglez="30"
       visible="true" />
  </sodipodi:namedview>
  <linearGradient
     id="a"
     x1="4.000001"
     x2="26.000001"
     y1="10"
     y2="10"
     gradientUnits="userSpaceOnUse"
     xlink:href="#b"
     gradientTransform="translate(1)" />
  <linearGradient
     id="b">
    <stop
       stop-color="#2de3e3"
       offset="0"
       id="stop1" />
    <stop
       stop-color="#71ffff"
       offset=".23818764"
       id="stop2" />
    <stop
       stop-color="#08b9b9"
       offset=".48656252"
       id="stop3" />
    <stop
       stop-color="#08cfcf"
       offset=".6837101"
       id="stop4" />
    <stop
       stop-color="#079a9a"
       offset=".86378187"
       id="stop5" />
    <stop
       stop-color="#07cccc"
       offset="1"
       id="stop6" />
  </linearGradient>
  <linearGradient
     id="c"
     x1="4.000001"
     x2="26.000001"
     y1="16"
     y2="16"
     gradientUnits="userSpaceOnUse"
     xlink:href="#b"
     gradientTransform="translate(1)" />
  <linearGradient
     id="d"
     x1="4.000001"
     x2="26.000001"
     y1="20.245838"
     y2="20.245838"
     gradientUnits="userSpaceOnUse"
     xlink:href="#e"
     gradientTransform="translate(1)" />
  <linearGradient
     id="e">
    <stop
       stop-color="#999999"
       offset="0"
       id="stop7" />
    <stop
       stop-color="#f8f8f8"
       offset=".23818764"
       id="stop8" />
    <stop
       stop-color="#868684"
       offset=".48656252"
       id="stop9" />
    <stop
       stop-color="#b2b2b2"
       offset=".6837101"
       id="stop10" />
    <stop
       stop-color="#4f4f4f"
       offset=".86378187"
       id="stop11" />
    <stop
       stop-color="#858585"
       offset="1"
       id="stop12" />
  </linearGradient>
  <linearGradient
     id="f"
     x1="4.000001"
     x2="26.000001"
     y1="26.245838"
     y2="26.245838"
     gradientUnits="userSpaceOnUse"
     xlink:href="#e"
     gradientTransform="translate(1)" />
  <linearGradient
     id="g"
     x1="4.000001"
     x2="26.000001"
     y1="22"
     y2="22"
     gradientUnits="userSpaceOnUse"
     xlink:href="#b"
     gradientTransform="translate(1)" />
  <linearGradient
     id="h"
     x1="4.000001"
     x2="26.000001"
     y1="23"
     y2="23"
     gradientUnits="userSpaceOnUse"
     xlink:href="#i"
     gradientTransform="translate(1)" />
  <linearGradient
     id="i">
    <stop
       stop-color="#9d9d9d"
       offset="0"
       id="stop13" />
    <stop
       stop-color="#808080"
       offset="1"
       id="stop14" />
  </linearGradient>
  <linearGradient
     id="j"
     x1="4.000001"
     x2="26.000001"
     y1="14.245838"
     y2="14.245838"
     gradientUnits="userSpaceOnUse"
     xlink:href="#e"
     gradientTransform="translate(1)" />
  <linearGradient
     id="k"
     x1="4.000001"
     x2="26.000001"
     y1="17"
     y2="17"
     gradientUnits="userSpaceOnUse"
     xlink:href="#i"
     gradientTransform="translate(1)" />
  <linearGradient
     id="l"
     x1="4.000001"
     x2="26.000001"
     y1="8.245838"
     y2="8.245838"
     gradientUnits="userSpaceOnUse"
     xlink:href="#e"
     gradientTransform="translate(1)" />
  <linearGradient
     id="m"
     x1="4.000001"
     x2="26.000001"
     y1="5"
     y2="5"
     gradientUnits="userSpaceOnUse"
     gradientTransform="translate(1)">
    <stop
       stop-color="#b0b0b0"
       offset="0"
       id="stop15" />
    <stop
       stop-color="#cbcbcb"
       offset="1"
       id="stop16" />
  </linearGradient>
  <linearGradient
     id="n"
     x1="11.000001"
     x2="14.000001"
     y1="13"
     y2="9"
     gradientUnits="userSpaceOnUse"
     xlink:href="#i"
     gradientTransform="translate(1)" />
  <ellipse
     cx="16"
     cy="11"
     rx="11"
     ry="2"
     fill="url(#n)"
     id="ellipse16"
     style="fill:url(#n)" />
  <ellipse
     cx="16"
     cy="5"
     rx="11"
     ry="2"
     fill="url(#m)"
     id="ellipse17"
     style="fill:url(#m)" />
  <path
     d="M 16,10 C 9.9248687,10 5,9.10457 5,8 V 5 C 5,6.10457 9.9248687,7 16,7 22.075133,7 27,6.10457 27,5 v 3 c 0,1.10457 -4.924867,2 -11,2 z"
     fill="url(#l)"
     stroke-linecap="round"
     stroke-width="0.1"
     id="path17"
     style="fill:url(#l)" />
  <ellipse
     cx="16"
     cy="17"
     rx="11"
     ry="2"
     fill="url(#k)"
     id="ellipse18"
     style="fill:url(#k)" />
  <path
     d="M 16,16 C 9.9248669,16 5,15.10457 5,14 v -3 c 0,1.10457 4.9248687,2 11,2 6.075133,0 11,-0.89543 11,-2 v 3 c -2e-6,1.10457 -4.924867,2 -11,2 z"
     fill="url(#j)"
     stroke-linecap="round"
     stroke-width="0.1"
     id="path18"
     style="fill:url(#j)" />
  <ellipse
     cx="16"
     cy="23"
     rx="11"
     ry="2"
     fill="url(#h)"
     id="ellipse19"
     style="fill:url(#h)" />
  <path
     d="m 6.0000008,20.828126 v 2 C 8.0000007,23.982826 12,24.2 16,24.2 c 4.000002,0 8.000001,-0.2 10.000001,-1.371874 v -2 C 24.265024,21.518012 20.444919,22 16,22 11.555083,22 7.7349759,21.518012 6.0000008,20.828126 Z"
     fill="url(#g)"
     stroke-linecap="round"
     stroke-width="0.1"
     id="path19"
     style="fill:url(#g)" />
  <path
     d="M 16,28 C 9.9248669,28 5,27.10457 5,26 v -3 c 0,1.10457 4.9248687,2 11,2 6.075133,0 11,-0.89543 11,-2 v 3 c -2e-6,1.10457 -4.924867,2 -11,2 z"
     fill="url(#f)"
     stroke-linecap="round"
     stroke-width="0.1"
     id="path20"
     style="fill:url(#f)" />
  <path
     d="M 16,22 C 9.9248669,22 5,21.10457 5,20 v -3 c 0,1.10457 4.9248687,2 11,2 6.075133,0 11,-0.89543 11,-2 v 3 c -2e-6,1.10457 -4.924867,2 -11,2 z"
     fill="url(#d)"
     stroke-linecap="round"
     stroke-width="0.1"
     id="path21"
     style="fill:url(#d)" />
  <path
     d="M 16,7.320008 C 5,7.320008 5,5 5,5 5,5 5,6.799992 16,6.799992 27,6.799992 27,5 27,5 27,5 27,7.320008 16,7.320008 Z"
     fill="#e6e6e6"
     stroke-linecap="round"
     stroke-width="0.1"
     id="path22" />
  <path
     d="M 16,25.320008 C 5,25.320008 5,23 5,23 5,23 5,24.79999 16,24.79999 27,24.79999 27,23 27,23 c 0,0 0,2.320008 -11,2.320008 z"
     fill="#e6e6e6"
     stroke-linecap="round"
     stroke-width="0.1"
     id="path23" />
  <path
     d="M 16,19.320008 C 5,19.320008 5,17 5,17 5,17 5,18.799992 16,18.799992 27,18.799992 27,17 27,17 c 0,0 0,2.320008 -11,2.320008 z"
     fill="#e6e6e6"
     stroke-linecap="round"
     stroke-width="0.1"
     id="path24" />
  <path
     d="M 16,13.320008 C 5,13.320008 5,11 5,11 5,11 5,12.799992 16,12.799992 27,12.799992 27,11 27,11 c 0,0 0,2.320008 -11,2.320008 z"
     fill="#e6e6e6"
     stroke-linecap="round"
     stroke-width="0.1"
     id="path25" />
  <path
     d="m 6.0000008,14.828126 v 2 C 8.0000007,17.982826 12,18.2 16,18.2 c 4.000002,0 8.000001,-0.2 10.000001,-1.371874 v -2 C 24.265024,15.518012 20.444919,16 16,16 11.555083,16 7.7349759,15.518012 6.0000008,14.828126 Z"
     fill="url(#c)"
     stroke-linecap="round"
     stroke-width="0.1"
     id="path26"
     style="fill:url(#c)" />
  <path
     d="m 6.0000008,8.828126 v 2 C 8.0000007,11.982826 12,12.2 16,12.2 c 4.000002,0 8.000001,-0.2 10.000001,-1.371874 v -2 C 24.265024,9.518012 20.444919,10 16,10 11.555083,10 7.7349759,9.518012 6.0000008,8.828126 Z"
     fill="url(#a)"
     stroke-linecap="round"
     stroke-width="0.1"
     id="path27"
     style="fill:url(#a)" />
</svg>
