<?xml version="1.0" encoding="UTF-8" standalone="no"?>
<svg
   height="32"
   viewBox="0 0 8.4667 8.4667"
   width="32"
   version="1.1"
   id="svg461"
   sodipodi:docname="Secure_08_32.svg"
   inkscape:version="1.2.2 (732a01da63, 2022-12-09)"
   xmlns:inkscape="http://www.inkscape.org/namespaces/inkscape"
   xmlns:sodipodi="http://sodipodi.sourceforge.net/DTD/sodipodi-0.dtd"
   xmlns="http://www.w3.org/2000/svg"
   xmlns:svg="http://www.w3.org/2000/svg">
  <defs
     id="defs465" />
  <sodipodi:namedview
     id="namedview463"
     pagecolor="#ffffff"
     bordercolor="#000000"
     borderopacity="0.25"
     inkscape:showpageshadow="2"
     inkscape:pageopacity="0.0"
     inkscape:pagecheckerboard="0"
     inkscape:deskcolor="#d1d1d1"
     showgrid="true"
     inkscape:zoom="28.4375"
     inkscape:cx="15.982418"
     inkscape:cy="16"
     inkscape:current-layer="svg461">
    <inkscape:grid
       type="xygrid"
       id="grid1012" />
  </sodipodi:namedview>
  <linearGradient
     id="a"
     gradientTransform="matrix(.65733439 -.17613221 .17530755 .65425669 -2.482161 -.080498)"
     gradientUnits="userSpaceOnUse"
     x1="5.726027"
     x2="10"
     y1="7.730607"
     y2="10">
    <stop
       offset="0"
       stop-color="#f2f2f2"
       id="stop440" />
    <stop
       offset="1"
       stop-color="#d4d4d4"
       id="stop442" />
  </linearGradient>
  <linearGradient
     id="b"
     gradientTransform="matrix(1.9356879 0 0 1.9869248 .136143 -.059991)"
     gradientUnits="userSpaceOnUse"
     x1="1.499774"
     x2="3.614834"
     y1="1.322335"
     y2="2.204926">
    <stop
       offset="0"
       stop-color="#80b5fe"
       id="stop445" />
    <stop
       offset="1"
       stop-color="#2a7efe"
       id="stop447" />
  </linearGradient>
  <linearGradient
     id="c"
     gradientTransform="matrix(1.9356879 0 0 1.9869248 .136143 -.059991)"
     gradientUnits="userSpaceOnUse"
     x1=".530372"
     x2="3.879216"
     y1="1.145817"
     y2="2.557962">
    <stop
       offset="0"
       stop-color="#e7c962"
       id="stop450" />
    <stop
       offset="1"
       stop-color="#d4a41c"
       id="stop452" />
  </linearGradient>
  <g
     stroke-linecap="round"
     stroke-linejoin="round"
     id="g459">
    <path
       d="m.99219181 4.6717587-.00000019-3.1565547c1.02352358 0 2.38822188-.52609236 3.24115848-1.05218478.8529364.52609252 2.2176347 1.05218478 3.2411583 1.05218478v3.1565547c0 1.2310702-1.7058728 3.1565545-3.2411583 3.3319187-1.5352856-.1753642-3.24115829-2.1008485-3.24115829-3.3319187z"
       fill="url(#b)"
       stroke="url(#c)"
       stroke-width=".396877"
       id="path455" />
    <path
       d="m2.9192845 4.7394347 1.0406247.8168371 1.5875063-2.9104282"
       fill="none"
       stroke="url(#a)"
       stroke-width=".68792"
       id="path457" />
  </g>
</svg>
