<?xml version="1.0" encoding="UTF-8" standalone="no"?>
<svg
   height="64"
   viewBox="0 0 16.933333 16.933335"
   width="64"
   version="1.1"
   id="svg2"
   sodipodi:docname="Font_25_64.svg"
   inkscape:export-filename="Font_25_64.png"
   inkscape:export-xdpi="96"
   inkscape:export-ydpi="96"
   inkscape:version="1.3-alpha (2a5ddc9d23, 2023-03-29)"
   xmlns:inkscape="http://www.inkscape.org/namespaces/inkscape"
   xmlns:sodipodi="http://sodipodi.sourceforge.net/DTD/sodipodi-0.dtd"
   xmlns="http://www.w3.org/2000/svg"
   xmlns:svg="http://www.w3.org/2000/svg">
  <defs
     id="defs2" />
  <sodipodi:namedview
     id="namedview2"
     pagecolor="#ffffff"
     bordercolor="#000000"
     borderopacity="0.25"
     inkscape:showpageshadow="2"
     inkscape:pageopacity="0.0"
     inkscape:pagecheckerboard="0"
     inkscape:deskcolor="#d1d1d1"
     showgrid="true"
     inkscape:zoom="14.203125"
     inkscape:cx="31.964796"
     inkscape:cy="32"
     inkscape:current-layer="svg2">
    <inkscape:grid
       id="grid2"
       units="px"
       originx="0"
       originy="0"
       spacingx="0.13229166"
       spacingy="0.13229167"
       empcolor="#0099e5"
       empopacity="0.30196078"
       color="#0099e5"
       opacity="0.14901961"
       empspacing="2"
       dotted="false"
       gridanglex="30"
       gridanglez="30"
       visible="true" />
  </sodipodi:namedview>
  <g
     fill="#00aad4"
     id="g2">
    <path
       d="m13.312235 16.295983 1.969262-2.539538c.23492-.302947.375502-.75988.17372-1.119673-.17842-.318143-.629516-.357631-.942728-.234199-.267422.105388-.41435.392127-.438894.666998-.252568-.0024-.514812.0048-.761364-.0036.06594-.531613.349388-1.075191.86392-1.292781.430104-.181888.932328-.164248 1.367512-.0055.440086.160516.714098.600247.755218 1.057664.05016.557949-.216454 1.075836-.544078 1.506656l-1.40336 1.845394h1.984596v.75595h-3.023804z"
       stroke-width=".264584"
       id="path1" />
    <text
       stroke-linejoin="round"
       stroke-width=".396874"
       x="3.106738"
       y="2.645829"
       id="text1"><tspan
         stroke-width=".396874"
         x="3.106738"
         y="2.645829"
         id="tspan1" /></text>
    <path
       d="m2.8614942 2.984474 3.6427818 5.3891593-3.8108176 5.5751997h2.3885159l2.5985522-3.798817 2.4905455 3.798817h2.388504l-3.7628109-5.4911817 3.5947919-5.4731773h-2.4005254l-2.3165091 3.7628083-2.4125164-3.7628083z"
       stroke-width=".264584"
       id="path2" />
  </g>
</svg>
