<?xml version="1.0" encoding="UTF-8" standalone="no"?>
<svg
   height="64"
   width="64"
   version="1.1"
   id="svg434"
   sodipodi:docname="Folder_13_64.svg"
   inkscape:export-filename="Folder_13_64.png"
   inkscape:export-xdpi="96"
   inkscape:export-ydpi="96"
   inkscape:version="1.2 (dc2aedaf03, 2022-05-15)"
   xml:space="preserve"
   xmlns:inkscape="http://www.inkscape.org/namespaces/inkscape"
   xmlns:sodipodi="http://sodipodi.sourceforge.net/DTD/sodipodi-0.dtd"
   xmlns="http://www.w3.org/2000/svg"
   xmlns:svg="http://www.w3.org/2000/svg"><defs
     id="defs436"><radialGradient
       id="a"
       cx="4.1671958"
       cy="1041.9056"
       gradientTransform="matrix(0.09628186,-0.96268178,0.91820995,0.09182587,-933.88939,-67.612204)"
       gradientUnits="userSpaceOnUse"
       r="9"><stop
         offset="0"
         stop-color="#acf"
         id="stop1174" /><stop
         offset="1"
         stop-color="#fff"
         id="stop1176" /></radialGradient></defs><sodipodi:namedview
     id="namedview12"
     pagecolor="#ffffff"
     bordercolor="#666666"
     borderopacity="1.0"
     inkscape:pageshadow="2"
     inkscape:pageopacity="0.0"
     inkscape:pagecheckerboard="0"
     inkscape:deskcolor="#d1d1d1"
     showgrid="true"
     inkscape:zoom="14.34375"
     inkscape:cx="31.965142"
     inkscape:cy="32"
     inkscape:current-layer="svg434"
     inkscape:showpageshadow="2"><inkscape:grid
       type="xygrid"
       id="grid139" /></sodipodi:namedview><g
     id="g1077"
     transform="translate(0,-3.0000449)"><path
       d="m 2,57 -5e-7,-44 c 0,-2 2,-4 4,-4 H 18 c 2,0 4.000007,2 4,4 v 2 h 32 v 10"
       stroke-linejoin="round"
       id="path145-1"
       style="fill:#fff3cc;stroke:#f4c025;stroke-width:3.99991;stroke-linecap:round"
       sodipodi:nodetypes="cccccccc" /><path
       d="M 62.000097,25.001436 H 9.9999744 L 1.9999556,56.999995 H 54.000078 Z"
       stroke-linejoin="round"
       id="path147"
       style="fill:#f4c025;fill-opacity:1;stroke:#f4c025;stroke-width:3.99991;stroke-linecap:round"
       sodipodi:nodetypes="ccccc" /></g><g
     id="g1653"
     transform="scale(2)"><circle
       cx="21.5"
       cy="21.5"
       fill="url(#a)"
       r="8.500001"
       stroke="#4d4d4d"
       stroke-linecap="round"
       stroke-linejoin="round"
       id="circle1179"
       style="fill:url(#a)" /><path
       d="m 21.5,15 v 6.5 h 5"
       fill="none"
       stroke="#666666"
       id="path1181" /><g
       stroke-linecap="round"
       stroke-linejoin="round"
       id="g1199"><path
         d="m 14.416667,21.027779 h 0.944444 v 0.944444 h -0.944444 z"
         fill="#0088aa"
         stroke-width="0.999997"
         id="path1183" /><path
         d="m 25.75,25.75 h 0.944444 v 0.944444 H 25.75 Z"
         fill="#0088aa"
         stroke-width="0.999997"
         id="path1185" /><path
         d="m 16.305555,25.75 h 0.944444 v 0.944444 h -0.944444 z"
         fill="#0088aa"
         stroke-width="0.999997"
         id="path1187" /><path
         d="m 16.305555,16.305555 h 0.944444 v 0.944444 h -0.944444 z"
         fill="#0088aa"
         stroke-width="0.999997"
         id="path1189" /><path
         d="m 27.638889,21.027779 h 0.944444 v 0.944444 h -0.944444 z"
         fill="#0088aa"
         stroke-width="0.999997"
         id="path1191" /><path
         d="m 21.027779,27.638889 h 0.944444 v 0.944444 h -0.944444 z"
         fill="#0088aa"
         stroke-width="0.999997"
         id="path1193" /><path
         d="m 25.75,16.305555 h 0.944444 v 0.944444 H 25.75 Z"
         fill="#0088aa"
         stroke-width="0.999997"
         id="path1195" /><circle
         cx="21.5"
         cy="21.5"
         fill="none"
         r="9.75"
         stroke="#ffffff"
         stroke-width="1.5"
         id="circle1197" /></g></g></svg>
