<?xml version="1.0" encoding="UTF-8" standalone="no"?>
<svg
   height="24"
   viewBox="0 0 24 24"
   width="24"
   version="1.1"
   id="svg13"
   sodipodi:docname="Replace_07_24.svg"
   inkscape:export-filename="Replace_07_24.png"
   inkscape:export-xdpi="96"
   inkscape:export-ydpi="96"
   inkscape:version="1.3.2 (091e20e, 2023-11-25, custom)"
   xmlns:inkscape="http://www.inkscape.org/namespaces/inkscape"
   xmlns:sodipodi="http://sodipodi.sourceforge.net/DTD/sodipodi-0.dtd"
   xmlns="http://www.w3.org/2000/svg"
   xmlns:svg="http://www.w3.org/2000/svg">
  <defs
     id="defs13" />
  <sodipodi:namedview
     id="namedview13"
     pagecolor="#ffffff"
     bordercolor="#000000"
     borderopacity="0.25"
     inkscape:showpageshadow="2"
     inkscape:pageopacity="0.0"
     inkscape:pagecheckerboard="0"
     inkscape:deskcolor="#d1d1d1"
     showgrid="true"
     inkscape:current-layer="svg13">
    <inkscape:grid
       id="grid13"
       units="px"
       originx="0"
       originy="0"
       spacingx="0.5"
       spacingy="0.5"
       empcolor="#0099e5"
       empopacity="0.30196078"
       color="#0099e5"
       opacity="0.14901961"
       empspacing="2"
       dotted="false"
       gridanglex="30"
       gridanglez="30"
       visible="true" />
  </sodipodi:namedview>
  <g
     stroke-linecap="round"
     id="g13">
    <path
       d="m6.5 13v-3.5l5-5h1.5a1.5 1.5 45 0 1 1.5 1.5v7a1.5 1.5 135 0 1 -1.5 1.5h-5a1.5 1.5 45 0 1 -1.5-1.5z"
       fill="#ffe5e5"
       stroke="#d4aa00"
       stroke-linejoin="round"
       stroke-width=".666667"
       transform="matrix(1.5 0 0 1.5 -.25 1.75)"
       id="path1" />
    <path
       d="m9.5 3v3.5l-5 5h-1.5a1.5 1.5 45 0 1 -1.5-1.5v-7a1.5 1.5 135 0 1 1.5-1.5h5a1.5 1.5 45 0 1 1.5 1.5z"
       fill="#e0edff"
       stroke="#d4aa00"
       stroke-linejoin="round"
       stroke-width=".666667"
       transform="matrix(1.5 0 0 1.5 .25 -1.75)"
       id="path2" />
    <g
       fill="none"
       id="g12">
      <g
         transform="matrix(1.5 0 0 1.5 0 -1.5)"
         id="g7">
        <path
           d="m1.5 5.5h5"
           stroke="#fff"
           stroke-width="3"
           id="path3" />
        <path
           d="m4.8 3.8 1.7 1.7-1.7 1.7"
           stroke="#fff"
           stroke-linejoin="round"
           stroke-width="3"
           id="path4" />
        <g
           stroke="#2a7efe"
           id="g6">
          <path
             d="m1.5 5.5h5"
             id="path5" />
          <path
             d="m4.8 3.8 1.7 1.7-1.7 1.7"
             stroke-linejoin="round"
             id="path6" />
        </g>
      </g>
      <g
         transform="matrix(-1.5 0 0 1.5 24 9)"
         id="g11">
        <path
           d="m1.5 5.5h5"
           stroke="#fff"
           stroke-width="3"
           id="path7" />
        <path
           d="m4.8 3.8 1.7 1.7-1.7 1.7"
           stroke="#fff"
           stroke-linejoin="round"
           stroke-width="3"
           id="path8" />
        <g
           stroke="#fa0302"
           id="g10">
          <path
             d="m1.5 5.5h5"
             id="path9" />
          <path
             d="m4.8 3.8 1.7 1.7-1.7 1.7"
             stroke-linejoin="round"
             id="path10" />
        </g>
      </g>
    </g>
  </g>
</svg>
