<?xml version="1.0" encoding="UTF-8" standalone="no"?>
<svg
   height="16"
   width="16"
   version="1.1"
   id="svg51"
   sodipodi:docname="Grid_05_16.svg"
   inkscape:export-filename="Grid_05_16.png"
   inkscape:export-xdpi="96"
   inkscape:export-ydpi="96"
   inkscape:version="1.2-beta (1b65182ce9, 2022-04-05)"
   xmlns:inkscape="http://www.inkscape.org/namespaces/inkscape"
   xmlns:sodipodi="http://sodipodi.sourceforge.net/DTD/sodipodi-0.dtd"
   xmlns="http://www.w3.org/2000/svg"
   xmlns:svg="http://www.w3.org/2000/svg">
  <defs
     id="defs55" />
  <sodipodi:namedview
     id="namedview53"
     pagecolor="#ffffff"
     bordercolor="#666666"
     borderopacity="1.0"
     inkscape:pageshadow="2"
     inkscape:pageopacity="0.0"
     inkscape:pagecheckerboard="0"
     inkscape:deskcolor="#d1d1d1"
     showgrid="true"
     inkscape:zoom="57.375"
     inkscape:cx="8"
     inkscape:cy="8"
     inkscape:current-layer="svg51">
    <inkscape:grid
       type="xygrid"
       id="grid1139" />
  </sodipodi:namedview>
  <linearGradient
     id="a"
     gradientTransform="matrix(0 -1 -1 0 16 16)"
     gradientUnits="userSpaceOnUse"
     x1="9"
     x2="6"
     y1="10"
     y2="10.5">
    <stop
       offset="0"
       stop-color="#72cef6"
       id="stop2" />
    <stop
       offset="1"
       stop-color="#d2f5f8"
       id="stop4" />
  </linearGradient>
  <linearGradient
     id="b"
     gradientTransform="matrix(0 -1 -1 0 16 16)"
     gradientUnits="userSpaceOnUse"
     x1="10"
     x2="5"
     y1="12.5"
     y2="12.5">
    <stop
       offset="0"
       stop-color="#4674a8"
       id="stop7" />
    <stop
       offset="1"
       stop-color="#42a0ce"
       id="stop9" />
  </linearGradient>
  <linearGradient
     id="c"
     gradientUnits="userSpaceOnUse"
     x1="-8.75"
     x2="-13.75"
     y1="-1.75"
     y2="-6.75">
    <stop
       offset="0"
       stop-color="#a00"
       id="stop12" />
    <stop
       offset="1"
       stop-color="#f55"
       id="stop14" />
  </linearGradient>
  <g
     transform="matrix(1 0 0 -1 15.75 21.75)"
     id="g37">
    <path
       d="m6.25-15.25h15v15h-15z"
       fill="#fff"
       stroke="#999"
       stroke-dashoffset="1.49998"
       stroke-linecap="round"
       stroke-linejoin="round"
       transform="matrix(0 1 1 0 0 0)"
       id="path17" />
    <g
       fill="none"
       stroke="#b3b3b3"
       id="g29">
      <path
         d="m-12.25 6.75v14"
         id="path19" />
      <path
         d="m-14.75 10.25h14"
         id="path21" />
      <path
         d="m-3.25 20.75v-14"
         id="path23" />
      <path
         d="m-14.75 18.25h14"
         id="path25" />
      <path
         d="m-14.75 14.25h14"
         id="path27" />
    </g>
    <g
       stroke-linejoin="round"
       transform="matrix(0 -1 -1 0 .25 21.75)"
       id="g35">
      <path
         d="m.5-11.5h15v6h-15z"
         fill="none"
         opacity=".5"
         stroke="#fff"
         stroke-dashoffset="1.49998"
         transform="scale(1 -1)"
         id="path31" />
      <path
         d="m15.5 10.5h-15v-4h15z"
         fill="url(#a)"
         stroke="url(#b)"
         stroke-linecap="round"
         id="path33" />
    </g>
  </g>
  <circle
     cx="-11.25"
     cy="-4.25"
     r="4"
     style="stroke:#800000;stroke-width:.5;stroke-linecap:round;stroke-linejoin:round;stroke-dashoffset:1.49998;fill:url(#c)"
     transform="matrix(0 1 1 0 15.75 20.75)"
     id="circle39" />
  <g
     fill="none"
     stroke="#fff"
     id="g49">
    <g
       stroke-linecap="round"
       transform="matrix(.70710678 .70710678 .70710678 -.70710678 6.550253 20.460155)"
       id="g45">
      <path
         d="m-4.25 13.25v-4"
         id="path41" />
      <path
         d="m-2.25 11.25h-4"
         id="path43" />
    </g>
    <circle
       cx="11.5"
       cy="9.5"
       opacity=".7"
       r="4.5"
       stroke-dashoffset="1.49998"
       stroke-linejoin="round"
       stroke-width=".5"
       id="circle47" />
  </g>
</svg>
