<?xml version="1.0" encoding="UTF-8" standalone="no"?>
<svg
   height="24"
   viewBox="0 0 24 24"
   width="24"
   version="1.1"
   id="svg5"
   sodipodi:docname="Map_02_24.svg"
   inkscape:export-filename="Map_02_24.png"
   inkscape:export-xdpi="96"
   inkscape:export-ydpi="96"
   inkscape:version="1.3-beta (cedbd6c6ff, 2023-05-28)"
   xmlns:inkscape="http://www.inkscape.org/namespaces/inkscape"
   xmlns:sodipodi="http://sodipodi.sourceforge.net/DTD/sodipodi-0.dtd"
   xmlns="http://www.w3.org/2000/svg"
   xmlns:svg="http://www.w3.org/2000/svg">
  <defs
     id="defs5" />
  <sodipodi:namedview
     id="namedview5"
     pagecolor="#ffffff"
     bordercolor="#000000"
     borderopacity="0.25"
     inkscape:showpageshadow="2"
     inkscape:pageopacity="0.0"
     inkscape:pagecheckerboard="0"
     inkscape:deskcolor="#d1d1d1"
     showgrid="true"
     inkscape:current-layer="svg5">
    <inkscape:grid
       id="grid5"
       units="px"
       originx="0"
       originy="0"
       spacingx="0.5"
       spacingy="0.5"
       empcolor="#0099e5"
       empopacity="0.30196078"
       color="#0099e5"
       opacity="0.14901961"
       empspacing="2"
       dotted="false"
       gridanglex="30"
       gridanglez="30"
       visible="true" />
  </sodipodi:namedview>
  <circle
     cx="12"
     cy="12"
     fill="#fff"
     r="10.187906"
     stroke="#00aad4"
     stroke-linecap="round"
     stroke-linejoin="round"
     stroke-width="1.12419"
     id="circle1" />
  <g
     fill="#00aad4"
     id="g4">
    <ellipse
       cx="12"
       cy="2.866016"
       rx="1.053921"
       ry="1.405228"
       id="ellipse1" />
    <ellipse
       cx="2.866016"
       cy="12"
       rx="1.405228"
       ry="1.053921"
       id="ellipse2" />
    <ellipse
       cx="12"
       cy="21.133987"
       rx="1.053921"
       ry="1.405228"
       id="ellipse3" />
    <ellipse
       cx="21.133987"
       cy="12"
       rx="1.405228"
       ry="1.053921"
       id="ellipse4" />
    <path
       d="m6.0277797 17.972221 4.4817513-7.46269 7.46269-4.4817512-4.48175 7.4626912z"
       stroke="#00aad4"
       stroke-linejoin="round"
       stroke-width="1.12419"
       id="path4" />
  </g>
  <circle
     cx="12"
     cy="12"
     fill="#fff"
     r="1.756536"
     id="circle4" />
  <circle
     cx="12"
     cy="12"
     fill="none"
     r="7.728756"
     stroke="#00aad4"
     stroke-linecap="round"
     stroke-linejoin="round"
     stroke-width=".702614"
     id="circle5" />
</svg>
