<?xml version="1.0" encoding="UTF-8" standalone="no"?>
<svg
   width="16"
   height="16"
   version="1.1"
   id="svg8"
   sodipodi:docname="Margins_01_16.svg"
   inkscape:version="1.2.1 (9c6d41e410, 2022-07-14)"
   inkscape:export-filename="Margins_01_16.png"
   inkscape:export-xdpi="96"
   inkscape:export-ydpi="96"
   xmlns:inkscape="http://www.inkscape.org/namespaces/inkscape"
   xmlns:sodipodi="http://sodipodi.sourceforge.net/DTD/sodipodi-0.dtd"
   xmlns="http://www.w3.org/2000/svg"
   xmlns:svg="http://www.w3.org/2000/svg">
  <defs
     id="defs12" />
  <sodipodi:namedview
     id="namedview10"
     pagecolor="#ffffff"
     bordercolor="#666666"
     borderopacity="1.0"
     inkscape:showpageshadow="2"
     inkscape:pageopacity="0.0"
     inkscape:pagecheckerboard="0"
     inkscape:deskcolor="#d1d1d1"
     showgrid="true"
     inkscape:zoom="57.375"
     inkscape:cx="7.9912854"
     inkscape:cy="8"
     inkscape:current-layer="svg8">
    <inkscape:grid
       type="xygrid"
       id="grid137" />
  </sodipodi:namedview>
  <path
     style="fill:none;stroke:#00aad4;stroke-linecap:round;stroke-linejoin:round"
     d="M 4.5,15.5 V 0.5"
     id="path1010" />
  <path
     style="fill:none;stroke:#00aad4;stroke-linecap:round;stroke-linejoin:round"
     d="M 13.5,13.5 H 2.5"
     id="path1008" />
  <path
     style="fill:none;stroke:#00aad4;stroke-linecap:round;stroke-linejoin:round"
     d="m 11.5,0.5 v 15"
     id="path1006" />
  <path
     style="fill:none;stroke:#00aad4;stroke-linecap:round;stroke-linejoin:round"
     d="m 2.5,2.5 h 11"
     id="path2" />
</svg>
