<?xml version="1.0" encoding="UTF-8" standalone="no"?>
<svg
   height="36"
   viewBox="0 0 9.525 9.525"
   width="36"
   version="1.1"
   id="svg755"
   sodipodi:docname="Light_04_36.svg"
   inkscape:version="1.2.2 (732a01da63, 2022-12-09)"
   xmlns:inkscape="http://www.inkscape.org/namespaces/inkscape"
   xmlns:sodipodi="http://sodipodi.sourceforge.net/DTD/sodipodi-0.dtd"
   xmlns="http://www.w3.org/2000/svg"
   xmlns:svg="http://www.w3.org/2000/svg">
  <defs
     id="defs759" />
  <sodipodi:namedview
     id="namedview757"
     pagecolor="#ffffff"
     bordercolor="#000000"
     borderopacity="0.25"
     inkscape:showpageshadow="2"
     inkscape:pageopacity="0.0"
     inkscape:pagecheckerboard="0"
     inkscape:deskcolor="#d1d1d1"
     showgrid="true"
     inkscape:zoom="25.277778"
     inkscape:cx="17.98022"
     inkscape:cy="18"
     inkscape:current-layer="svg755">
    <inkscape:grid
       type="xygrid"
       id="grid1190" />
  </sodipodi:namedview>
  <radialGradient
     id="a"
     cx="6.497474"
     cy="3.206305"
     gradientTransform="matrix(-.00000004 1.8461535 -1.8461538 -.00000013 13.419332 -8.495334)"
     gradientUnits="userSpaceOnUse"
     r="3.25">
    <stop
       offset="0"
       stop-color="#fff"
       id="stop704" />
    <stop
       offset=".16666666"
       stop-color="#fff"
       id="stop706" />
    <stop
       offset="1"
       stop-color="#ff0"
       id="stop708" />
  </radialGradient>
  <filter
     id="b"
     color-interpolation-filters="sRGB"
     height="1.44376"
     width="1.44376"
     x="-0.22188001"
     y="-0.22188001">
    <feGaussianBlur
       stdDeviation=".600925"
       id="feGaussianBlur711" />
  </filter>
  <linearGradient
     id="c"
     gradientTransform="matrix(.42589563 0 0 .39969437 1.358488 1.807372)"
     gradientUnits="userSpaceOnUse"
     x1="6.221174"
     x2="9.764016"
     y1="11.861728"
     y2="11.861728">
    <stop
       offset="0"
       stop-color="#999"
       id="stop714" />
    <stop
       offset=".39922822"
       stop-color="#fff"
       id="stop716" />
    <stop
       offset="1"
       stop-color="#999"
       id="stop718" />
  </linearGradient>
  <radialGradient
     id="d"
     cx="31.5"
     cy="6.602212"
     gradientTransform="matrix(.61761085 0 0 .74300102 -15.001238 -.926683)"
     gradientUnits="userSpaceOnUse"
     r="2.375222">
    <stop
       offset="0"
       stop-color="#fff"
       id="stop721" />
    <stop
       offset="1"
       stop-color="#fea"
       id="stop723" />
  </radialGradient>
  <radialGradient
     id="e"
     cx="5"
     cy="11"
     gradientTransform="matrix(0 .81855439 -.81855439 -.00000002 11.980662 -1.116209)"
     gradientUnits="userSpaceOnUse"
     r="8.000001">
    <stop
       offset="0"
       stop-color="#14ccfc"
       id="stop726" />
    <stop
       offset="1"
       stop-color="#0064e0"
       id="stop728" />
  </radialGradient>
  <g
     stroke-linejoin="round"
     id="g743">
    <path
       d="m9.3756576 6.0310087-.8922826-.7883416-.0003447-.9602831.8931443-.7886748-.4541426-1.0963987-1.1892085.0738893-.6787792-.679267.0734805-1.18839845-1.0965159-.4541918-.7883413.89228335-.9602834.0003445-.7886746-.89314475-1.0963991.4541435.0738711 1.18922555-.6792663.6787792-1.1883818-.073498-.4541912 1.0965159.892283.788367.0003447.9602827-.8931446.78865.4541433 1.0963993 1.1892265-.073872.6787789.6792675-.073498 1.188381 1.0965159.454191.7883413-.892283.9602834-.000345.788675.893144 1.0963982-.454142-.073871-1.189227.6792663-.6787793 1.1883812.073498z"
       fill="url(#e)"
       stroke="#0068e0"
       stroke-width=".297657"
       id="path731" />
    <g
       fill="none"
       stroke="#fff"
       stroke-linecap="round"
       stroke-width=".595312"
       id="g741">
      <path
         d="m7.1437496 4.4648443h-4.7624991"
         id="path733" />
      <path
         d="m6.548437 6.2507814-3.571874-3.5718742"
         id="path735" />
      <path
         d="m4.7624999 3.2742195v-1.1906247"
         id="path737" />
      <path
         d="m6.548437 2.6789072-3.571874 3.5718742"
         id="path739" />
    </g>
  </g>
  <g
     fill-rule="evenodd"
     id="g753">
    <path
       d="m4.1671876 5.9531252c0-.6727859-.2577008-.5139679-.5253677-.9563135-.2837038-.4688488-.212553-.8776657-.212553-.8776657 0-.6562132.4570346-1.2914108 1.3330442-1.2914108.8760103 0 1.3330449.6351976 1.3330449 1.2914108 0 0 .07115.4088169-.2125552.8776657-.2676654.4423456-.5249879.2835276-.5249879.9563135"
       fill="url(#d)"
       stroke="#fcaf36"
       stroke-width=".297657"
       id="path745" />
    <path
       d="m4.0778907 6.0126563h1.3691959l-.0000945.9525c-.0000093.092263-.173394.238407-.2677734.238407h-.8334374c-.094378 0-.2678906-.146142-.2678906-.238407z"
       fill="url(#c)"
       stroke="#999"
       stroke-width=".119061"
       id="path747" />
    <path
       d="m4.4050744 7.2628123h.7146129l-.1785937.297656h-.3571874z"
       fill="#333"
       stroke-width=".260449"
       id="path749" />
    <circle
       cx="8.494"
       cy="4.75"
       fill="url(#a)"
       filter="url(#b)"
       r="3.25"
       stroke-width=".843532"
       transform="matrix(.30989025 0 0 .30763476 2.130391 2.919396)"
       id="circle751" />
  </g>
</svg>
