<?xml version="1.0" encoding="UTF-8" standalone="no"?>
<svg
   width="36"
   height="36"
   version="1.1"
   viewBox="0 0 36 36"
   id="svg13"
   sodipodi:docname="tlhelpconnector_150.svg"
   inkscape:export-filename="tlhelpconnector_150.png"
   inkscape:export-xdpi="96"
   inkscape:export-ydpi="96"
   inkscape:version="1.3.2 (091e20e, 2023-11-25, custom)"
   xmlns:inkscape="http://www.inkscape.org/namespaces/inkscape"
   xmlns:sodipodi="http://sodipodi.sourceforge.net/DTD/sodipodi-0.dtd"
   xmlns:xlink="http://www.w3.org/1999/xlink"
   xmlns="http://www.w3.org/2000/svg"
   xmlns:svg="http://www.w3.org/2000/svg">
  <sodipodi:namedview
     id="namedview13"
     pagecolor="#ffffff"
     bordercolor="#000000"
     borderopacity="0.25"
     inkscape:showpageshadow="2"
     inkscape:pageopacity="0.0"
     inkscape:pagecheckerboard="0"
     inkscape:deskcolor="#d1d1d1"
     showgrid="true"
     inkscape:current-layer="svg13">
    <inkscape:grid
       id="grid15"
       units="px"
       originx="0"
       originy="0"
       spacingx="0.5"
       spacingy="0.5"
       empcolor="#0099e5"
       empopacity="0.30196078"
       color="#0099e5"
       opacity="0.14901961"
       empspacing="2"
       dotted="false"
       gridanglex="30"
       gridanglez="30"
       visible="true" />
  </sodipodi:namedview>
  <defs
     id="defs3">
    <linearGradient
       id="b"
       x1="3"
       x2="21"
       y1="3"
       y2="3"
       gradientTransform="translate(-4.2372131e-8,-2)"
       gradientUnits="userSpaceOnUse"
       xlink:href="#a" />
    <linearGradient
       id="a"
       x1="3"
       x2="21"
       y1="3"
       y2="3"
       gradientUnits="userSpaceOnUse">
      <stop
         stop-color="#4276c4"
         offset="0"
         id="stop1" />
      <stop
         stop-color="#80b3ff"
         offset=".3333333"
         id="stop2" />
      <stop
         stop-color="#04a"
         offset="1"
         id="stop3" />
    </linearGradient>
    <linearGradient
       inkscape:collect="always"
       xlink:href="#a"
       id="linearGradient13"
       gradientUnits="userSpaceOnUse"
       gradientTransform="translate(-4.2372131e-8,-2)"
       x1="3"
       y1="3"
       x2="21"
       y2="3" />
    <linearGradient
       inkscape:collect="always"
       xlink:href="#a"
       id="linearGradient14"
       gradientUnits="userSpaceOnUse"
       gradientTransform="translate(-4.2372131e-8,-2)"
       x1="3"
       y1="3"
       x2="21"
       y2="3" />
    <linearGradient
       inkscape:collect="always"
       xlink:href="#a"
       id="linearGradient15"
       gradientUnits="userSpaceOnUse"
       gradientTransform="translate(-4.2372131e-8,-2)"
       x1="3"
       y1="3"
       x2="21"
       y2="3" />
  </defs>
  <rect
     x="1"
     y="21.999983"
     width="34"
     height="14"
     ry="2"
     fill="#739bdf"
     fill-rule="evenodd"
     style="paint-order:normal"
     id="rect3" />
  <ellipse
     cx="12"
     cy="18.249983"
     rx="7.6500001"
     ry="2.4000001"
     fill="none"
     fill-rule="evenodd"
     stroke="url(#b)"
     stroke-linecap="round"
     stroke-linejoin="round"
     stroke-width="2.7"
     id="ellipse3"
     style="stroke:url(#linearGradient13)" />
  <ellipse
     cx="12"
     cy="16.300032"
     rx="7.3499999"
     ry="2.0999999"
     fill="none"
     fill-rule="evenodd"
     stroke="#ffffff"
     stroke-linecap="round"
     stroke-linejoin="round"
     stroke-width="1.8"
     id="ellipse4" />
  <ellipse
     cx="12"
     cy="13.749983"
     rx="7.6500001"
     ry="2.4000001"
     fill="none"
     fill-rule="evenodd"
     stroke="url(#b)"
     stroke-linecap="round"
     stroke-linejoin="round"
     stroke-width="2.7"
     id="ellipse5"
     style="stroke:url(#linearGradient14)" />
  <ellipse
     cx="12"
     cy="11.800032"
     rx="7.3499999"
     ry="2.0999999"
     fill="none"
     fill-rule="evenodd"
     stroke="#ffffff"
     stroke-linecap="round"
     stroke-linejoin="round"
     stroke-width="1.8"
     id="ellipse6" />
  <ellipse
     cx="12"
     cy="9.2499828"
     rx="7.6500001"
     ry="2.4000001"
     fill="none"
     fill-rule="evenodd"
     stroke="url(#b)"
     stroke-linecap="round"
     stroke-linejoin="round"
     stroke-width="2.7"
     id="ellipse7"
     style="stroke:url(#linearGradient15)" />
  <ellipse
     cx="12"
     cy="7.2999706"
     rx="7.3499999"
     ry="2.0999999"
     fill="none"
     fill-rule="evenodd"
     stroke="#ffffff"
     stroke-linecap="round"
     stroke-linejoin="round"
     stroke-width="1.8"
     id="ellipse8" />
  <ellipse
     cx="12"
     cy="4.7499828"
     rx="8.1000004"
     ry="2.8499999"
     fill="#80b3ff"
     fill-rule="evenodd"
     stroke="url(#b)"
     stroke-linecap="round"
     stroke-linejoin="round"
     stroke-width="1.8"
     id="ellipse9"
     style="stroke:url(#b)" />
  <circle
     cx="26.249998"
     cy="11.749983"
     r="9"
     fill="#739bdf"
     fill-rule="evenodd"
     stroke="#ffffff"
     stroke-linecap="round"
     stroke-linejoin="round"
     stroke-width="1.5"
     style="paint-order:normal"
     id="circle9" />
  <path
     d="m 26.90605,14.336 h -1.992187 q -0.0078,-0.4298 -0.0078,-0.5235 0,-0.9687 0.320311,-1.5938 0.320314,-0.6249 1.281251,-1.4062 0.960937,-0.7812 1.148437,-1.0235 0.289062,-0.3828 0.289062,-0.8437 0,-0.6405 -0.515625,-1.0937 -0.507811,-0.4609 -1.374999,-0.4609 -0.835938,0 -1.398438,0.4765 -0.5625,0.4766 -0.773437,1.4531 L 21.867,9.0704 q 0.08593,-1.3985 1.1875,-2.3751 1.109375,-0.9765 2.90625,-0.9765 1.890624,0 3.007812,0.9922 1.117188,0.9843 1.117188,2.2968 0,0.7266 -0.414063,1.3751 -0.406249,0.6484 -1.75,1.7656 -0.695312,0.5781 -0.867188,0.9296 -0.164062,0.3516 -0.14844,1.2579 z"
     fill="#ffffff"
     id="path9" />
  <path
     d="m 24.952488,18 v -2.1952 h 2.195313 V 18 Z"
     fill="#ffffff"
     id="path10" />
  <path
     d="M 11.594427,31.139 C 11.143996,32.8281 7.45,33.2852 7.45,30.0541 V 27.946 c 0,-3.2312 3.693996,-2.774 4.144428,-1.0849"
     fill="none"
     stroke="#ffffff"
     stroke-linecap="round"
     stroke-linejoin="round"
     stroke-width="1.1"
     id="path11" />
  <path
     d="m 14.39,29 h 4.219402 m 0,-3.45 v 6.9 m -4.219401,-6.9 v 6.9"
     fill="none"
     stroke="#ffffff"
     stroke-linecap="round"
     stroke-linejoin="round"
     stroke-width="1.1"
     id="path12" />
  <path
     d="m 21.72,32.45 v -6.9 l 3.276083,5.6115 3.27608,-5.6115 v 6.9"
     fill="none"
     stroke="#ffffff"
     stroke-linecap="round"
     stroke-linejoin="round"
     stroke-width="1.1"
     id="path13" />
  <g
     id="g841"
     transform="translate(0,-1016.3622)">
    <path
       sodipodi:nodetypes="ccccccccccccc"
       inkscape:connector-curvature="0"
       id="rect853"
       d="m 7,1030.3622 v -3 h 10 v 2 h 6 v 4 h -3 v 3 H 10 v -2 H 4 v -4 z"
       style="opacity:1;fill:#ffffff;fill-opacity:1;fill-rule:evenodd;stroke:none;stroke-width:1;stroke-linecap:square;stroke-linejoin:round;stroke-miterlimit:4;stroke-dasharray:none;stroke-dashoffset:0;stroke-opacity:1;paint-order:normal" />
    <path
       sodipodi:nodetypes="ccccc"
       inkscape:connector-curvature="0"
       id="path845"
       d="m 5,1032.3622 h 4 v -3 h 6 v 3"
       style="fill:none;fill-rule:evenodd;stroke:#ff0000;stroke-width:2;stroke-linecap:butt;stroke-linejoin:miter;stroke-miterlimit:4;stroke-dasharray:none;stroke-opacity:1" />
    <path
       style="fill:none;fill-rule:evenodd;stroke:#ff0000;stroke-width:2;stroke-linecap:butt;stroke-linejoin:miter;stroke-miterlimit:4;stroke-dasharray:none;stroke-opacity:1"
       d="m 22,1031.3622 h -4 v 3 h -6 v -3"
       id="path847"
       inkscape:connector-curvature="0"
       sodipodi:nodetypes="ccccc" />
  </g>
</svg>
