<?xml version="1.0" encoding="UTF-8" standalone="no"?>
<svg
   height="24"
   width="24"
   version="1.1"
   id="svg46"
   sodipodi:docname="Grid_11_24.svg"
   inkscape:export-filename="Grid_11_24.png"
   inkscape:export-xdpi="96"
   inkscape:export-ydpi="96"
   inkscape:version="1.2-beta (1b65182ce9, 2022-04-05)"
   xmlns:inkscape="http://www.inkscape.org/namespaces/inkscape"
   xmlns:sodipodi="http://sodipodi.sourceforge.net/DTD/sodipodi-0.dtd"
   xmlns="http://www.w3.org/2000/svg"
   xmlns:svg="http://www.w3.org/2000/svg">
  <defs
     id="defs50" />
  <sodipodi:namedview
     id="namedview48"
     pagecolor="#ffffff"
     bordercolor="#666666"
     borderopacity="1.0"
     inkscape:pageshadow="2"
     inkscape:pageopacity="0.0"
     inkscape:pagecheckerboard="0"
     inkscape:deskcolor="#d1d1d1"
     showgrid="true"
     inkscape:zoom="38.25"
     inkscape:cx="12"
     inkscape:cy="12"
     inkscape:current-layer="svg46">
    <inkscape:grid
       type="xygrid"
       id="grid1070" />
  </sodipodi:namedview>
  <linearGradient
     id="a"
     gradientTransform="matrix(0 -1.5 -1.5 0 24 24)"
     gradientUnits="userSpaceOnUse"
     x1="9"
     x2="6"
     y1="10"
     y2="10.5">
    <stop
       offset="0"
       stop-color="#72cef6"
       id="stop2" />
    <stop
       offset="1"
       stop-color="#d2f5f8"
       id="stop4" />
  </linearGradient>
  <linearGradient
     id="b"
     gradientTransform="matrix(0 -1.5 -1.5 0 24 24)"
     gradientUnits="userSpaceOnUse"
     x1="10"
     x2="5"
     y1="12.5"
     y2="12.5">
    <stop
       offset="0"
       stop-color="#4674a8"
       id="stop7" />
    <stop
       offset="1"
       stop-color="#42a0ce"
       id="stop9" />
  </linearGradient>
  <path
     d="m.5.521277h22.978724v22.978724h-22.978724z"
     style="fill:#fff;stroke:#999;stroke-width:1.02128;stroke-linecap:round;stroke-linejoin:round;stroke-dashoffset:1.49998"
     id="path12" />
  <g
     fill="none"
     stroke="#b3b3b3"
     transform="matrix(1 0 0 -1 -.010638 24.010638)"
     id="g24">
    <path
       d="m1 18.5h22"
       id="path14" />
    <path
       d="m6.5 23v-22"
       id="path16" />
    <path
       d="m23 5.5h-22"
       id="path18" />
    <path
       d="m18.5 23v-22"
       id="path20" />
    <path
       d="m12.5 23v-22"
       id="path22" />
  </g>
  <g
     stroke-linejoin="round"
     transform="matrix(1 0 0 -1 -.010638 26.01064)"
     id="g30">
    <path
       d="m.5-16.5h23v8h-23z"
       fill="none"
       opacity=".5"
       stroke="#fff"
       stroke-dashoffset="1.49998"
       transform="scale(1 -1)"
       id="path26" />
    <path
       d="m23.5 15.5h-23v-6h23z"
       fill="url(#a)"
       stroke="url(#b)"
       stroke-linecap="round"
       id="path28" />
  </g>
  <g
     fill="none"
     stroke-linecap="round"
     stroke-opacity=".996078"
     transform="matrix(0 -1.5 -1.5 0 26.989363 24.510629)"
     id="g44">
    <g
       stroke="#fff"
       stroke-width="3"
       transform="translate(-19.5 11)"
       id="g36">
      <path
         d="m27.5-1h3.5"
         opacity=".7"
         id="path32" />
      <path
         d="m31.5-4 3 3-3 3"
         opacity=".7"
         stroke-linejoin="round"
         id="path34" />
    </g>
    <g
       stroke="#3771c8"
       stroke-width="2"
       id="g42">
      <path
         d="m8 10h7"
         id="path38" />
      <path
         d="m12 7 3 3-3 3"
         stroke-linejoin="round"
         id="path40" />
    </g>
  </g>
</svg>
