<svg width="24" height="24" version="1.1" viewBox="0 0 6.35 6.35" xmlns="http://www.w3.org/2000/svg">
 <defs>
  <linearGradient id="linearGradient2465" x1="2.1167" x2="2.1167" y1=".66146" y2="1.2171" gradientTransform="translate(1.125e-8,1.0319)" gradientUnits="userSpaceOnUse">
   <stop stop-color="#ff8000" offset="0"/>
   <stop stop-color="#f93" offset="1"/>
  </linearGradient>
  <linearGradient id="linearGradient2453" x1=".66146" x2=".26458" y1="1.7198" y2="1.5875" gradientTransform="translate(0 .26458)" gradientUnits="userSpaceOnUse">
   <stop stop-color="#ff8000" offset="0"/>
   <stop stop-color="#ffb366" offset="1"/>
  </linearGradient>
  <linearGradient id="linearGradient2437" x1="2.1167" x2="2.1167" y1="1.4552" y2=".97015" gradientTransform="translate(0 .26458)" gradientUnits="userSpaceOnUse">
   <stop stop-color="#ff8000" offset="0"/>
   <stop stop-color="#ffb366" offset="1"/>
  </linearGradient>
  <linearGradient id="linearGradient2608" x1=".66146" x2=".26458" y1="1.7198" y2="1.5875" gradientTransform="matrix(-1 0 0 1 4.2333 .26458)" gradientUnits="userSpaceOnUse">
   <stop stop-color="#ff8000" offset="0"/>
   <stop stop-color="#ffb366" offset="1"/>
  </linearGradient>
  <linearGradient id="linearGradient2461" x1="3.1089" x2="3.1089" y1="3.0668" y2="2.0385" gradientTransform="matrix(1.0667 0 0 1.1611 -.14111 -.12127)" gradientUnits="userSpaceOnUse">
   <stop stop-color="#ff8000" offset="0"/>
   <stop stop-color="#ffb366" offset="1"/>
  </linearGradient>
 </defs>
 <g transform="matrix(1.5 0 0 1.5 2.2196e-7 -.1323)">
  <path d="m3.5719 1.6933 0.5953 1.7463h-4.1011l0.59531-1.7463z" fill="url(#linearGradient2465)"/>
  <path d="m0.66146 0.8599v0.8599l-0.59531 1.7198 4e-6 -1.2568z" fill="url(#linearGradient2453)"/>
  <path d="m3.5719 0.8599 2e-6 0.8599-2.9104-2e-7 -9.8e-7 -0.8599z" fill="url(#linearGradient2437)"/>
  <path d="m3.5719 0.8599v0.8599l0.5953 1.7198 1e-5 -1.2568z" fill="url(#linearGradient2608)"/>
  <path d="m2.1167 3.4396h-2.1167l-7.875e-8 -1.2568h1.4111c0.28222 0.76803 1.1289 0.76803 1.4111 0h1.4111l1e-7 1.2568h-2.1167" fill="url(#linearGradient2461)"/>
  <g fill="none" stroke="#ffd5aa" stroke-width=".13229">
   <path d="m0.066145 2.1828 0.54681-1.3229h3.0074l0.5468 1.3229" stroke-linecap="round" stroke-linejoin="round"/>
   <path d="m0.066145 2.1828h1.367c0.2734 0.7276 1.0936 0.7276 1.367 0h1.367" stroke-linecap="round" stroke-linejoin="round"/>
   <path d="m0.066146 2.1828v1.2568"/>
   <path d="m4.1672 2.1828v1.2568"/>
  </g>
 </g>
</svg>
