<svg width="32" height="32" version="1.1" xmlns="http://www.w3.org/2000/svg">
 <defs>
  <radialGradient id="c" cx="21.957434" cy="5.9936466" r="3.105469" gradientTransform="matrix(1.0986919 .00038837098 3.0792878e-8 .90004578 -15.123742 14.785424)" gradientUnits="userSpaceOnUse">
   <stop stop-color="#803300" offset="0"/>
   <stop stop-color="#d45500" offset="1"/>
  </radialGradient>
  <linearGradient id="a" x1="25.714283" x2="25.714283" y1="15.5" y2="6.2142854" gradientTransform="matrix(1.0982843,3.3319454e-4,3.0504966e-4,1.2000001,-15.164998,13.392668)" gradientUnits="userSpaceOnUse">
   <stop stop-color="#668000" offset="0"/>
   <stop stop-color="#aad400" offset="1"/>
  </linearGradient>
  <linearGradient id="b" x1="23" x2="23" y1="6.5" y2="15" gradientTransform="matrix(1.1311029,3.2992792e-4,3.1416508e-4,1.1882353,-15.88782,13.76921)" gradientUnits="userSpaceOnUse">
   <stop stop-color="#89a02c" offset="0"/>
   <stop stop-color="#445016" offset="1"/>
  </linearGradient>
 </defs>
 <path d="m8.5 2.5v12.408203l0.2148438 0.529297c0.190946-0.0118 0.3769345-0.01275 0.5683593-2e-3l0.5917969-1.455031c0.390214-0.958881 1.517021-1.432937 2.476563-1.042969 0.959534 0.389967 1.436179 1.516121 1.046875 2.474609l-0.621094 1.525391c0.339456 0.318521 0.704839 0.622403 0.958984 0.972656 0.316644-0.616927 0.836479-1.111498 1.720703-1.111328 0.884225 1.69e-4 1.746847 0.862754 1.748047 1.896484v0.804688h12.294922v-17z" fill="#e3dedb" fill-rule="evenodd" stroke-linecap="round" stroke-linejoin="round"/>
 <path d="m8.5 2a0.50005 0.50005 0 0 0-0.5 0.5v11.248047c0.044231 0.07583 0.091004 0.150684 0.125 0.234375l0.5898438 1.455078c0.0958022-0.00592 0.1904387-0.001596 0.2851562-0.001953v-12.435547h20v16h-11.794922v1h12.294922a0.50005 0.50005 0 0 0 0.5-0.5v-17a0.50005 0.50005 0 0 0-0.5-0.5z" fill="#999999" fill-rule="evenodd" stroke-linecap="round" stroke-linejoin="round"/>
 <path d="m11 4h16v3.999965h-16z" fill="#d5f6ff" fill-rule="evenodd"/>
 <path d="m12 10h2v2h-2z" fill="#483737" fill-rule="evenodd"/>
 <path d="m16 10h2v2h-2z" fill="#483737" fill-rule="evenodd"/>
 <path d="m20 10h2v2h-2z" fill="#483737" fill-rule="evenodd"/>
 <path d="m16 14h2v2h-2z" fill="#483737" fill-rule="evenodd"/>
 <path d="m20 14h2v2h-2z" fill="#483737" fill-rule="evenodd"/>
 <path d="m24.000008 10h2v2h-2z" fill="#d45500" fill-rule="evenodd"/>
 <path d="m24.000008 14h2v2h-2z" fill="#ff0000" fill-rule="evenodd"/>
 <path d="M 10.317718,17.93945 11.635432,14.7" fill="none" stroke="#d4aa00" stroke-linecap="round" stroke-linejoin="round" stroke-width="1.4"/>
 <path d="M 7.682286,17.93945 6.36457,14.7" fill="none" stroke="#d4aa00" stroke-linecap="round" stroke-linejoin="round" stroke-width="1.4"/>
 <path d="m8.99802 16.4a7.8000022 5.5007964 89.953824 0 0-3.405966 1.695842l3.407342 3.72291 3.41403-3.730216a7.8000022 5.5007964 89.953824 0 0-3.415406-1.688536z" fill="url(#c)" stroke-linejoin="round" stroke-width="3.9268"/>
 <path d="m2.7 18.7v1.45181l1.756954 1.851114" fill="none" stroke="#aca793" stroke-linecap="round" stroke-linejoin="round" stroke-width="1.4"/>
 <path d="M 2.722954,31.299998 2.7,29.4247 4.456954,27.573584" fill="none" stroke="#aca793" stroke-linecap="round" stroke-linejoin="round" stroke-width="1.4"/>
 <path d="m0.7 26.223932 1.317716-1.388334 3.351002-0.643766" fill="none" stroke="#aca793" stroke-linecap="round" stroke-linejoin="round" stroke-width="1.4"/>
 <path d="m15.300954 18.700002 4e-6 1.451808-1.756958 1.851116" fill="none" stroke="#aca793" stroke-linecap="round" stroke-linejoin="round" stroke-width="1.4"/>
 <path d="m15.277998 31.3 0.02296-1.875298-1.756954-1.851114" fill="none" stroke="#aca793" stroke-linecap="round" stroke-linejoin="round" stroke-width="1.4"/>
 <path d="m17.3 26.223932-1.317714-1.388334-3.352464-0.641616" fill="none" stroke="#aca793" stroke-linecap="round" stroke-linejoin="round" stroke-width="1.4"/>
 <path d="M 12.396262,18.069782 8.999386,21.78125 5.611356,18.079442 A 7.8000022,5.5007964 89.953824 0 0 3.5,24.198332 7.8000022,5.5007964 89.953824 0 0 9.001984,32 7.8000022,5.5007964 89.953824 0 0 14.5,24.201668 7.8000022,5.5007964 89.953824 0 0 12.396262,18.069782 Z" fill="url(#a)" stroke-linejoin="round" stroke-width="3.9268"/>
 <path d="m9 21.3v10" fill="none" stroke="url(#b)" stroke-linecap="round" stroke-linejoin="round" stroke-width="1.4"/>
</svg>
