<svg width="24" height="24" version="1.1" xmlns="http://www.w3.org/2000/svg">
 <defs>
  <linearGradient id="f" x1="22.825163" x2="22.822721" y1="6.2446866" y2="15.028725" gradientTransform="matrix(1.3656766 .00037929207 .00037934511 1.3661144 -18.549158 .2103869)" gradientUnits="userSpaceOnUse">
   <stop stop-color="#89a02c" offset="0"/>
   <stop stop-color="#445016" offset="1"/>
  </linearGradient>
  <radialGradient id="a" cx="-9" cy="10.699678" r="5.9492188" gradientTransform="matrix(.75 0 0 .53578463 18.25 2.2672769)" gradientUnits="userSpaceOnUse">
   <stop stop-color="#803300" offset="0"/>
   <stop stop-color="#d45500" offset="1"/>
  </radialGradient>
  <linearGradient id="d" x1="-3" x2="-3" y1="28" y2="4" gradientTransform="matrix(.75 0 0 .75 13.75 .5)" gradientUnits="userSpaceOnUse">
   <stop stop-color="#668000" offset="0"/>
   <stop stop-color="#aad400" offset="1"/>
  </linearGradient>
  <linearGradient id="e" x1="33" x2="36" y1="1037.3622" y2="1037.3622" gradientTransform="matrix(1.0199155 1.0199151 -.90128562 .9012853 919.53882 -956.91265)" gradientUnits="userSpaceOnUse">
   <stop stop-color="#999" offset="0"/>
   <stop stop-color="#fff" offset=".49999997"/>
   <stop stop-color="#999" offset="1"/>
  </linearGradient>
  <linearGradient id="c" x1="33" x2="36" y1="1035.3622" y2="1035.3622" gradientTransform="matrix(1.0199155 1.0199151 -.90128562 .9012853 919.53882 -956.91265)" gradientUnits="userSpaceOnUse">
   <stop stop-color="#a00" offset="0"/>
   <stop stop-color="#f00" offset=".51070523"/>
   <stop stop-color="#a00" offset="1"/>
  </linearGradient>
  <linearGradient id="b" x1="33" x2="36" y1="1041.8622" y2="1041.8622" gradientTransform="matrix(1.0199155 1.0199151 -.94531245 .94531213 965.27779 -1002.6516)" gradientUnits="userSpaceOnUse">
   <stop stop-color="#a05a2c" offset="0"/>
   <stop stop-color="#ff0" offset=".26457807"/>
   <stop stop-color="#ff0" offset=".75078517"/>
   <stop stop-color="#a05a2c" offset="1"/>
  </linearGradient>
 </defs>
 <path d="m13 5.375 1.875-3.75" fill="none" stroke="#d4aa00" stroke-linecap="round" stroke-linejoin="round" stroke-width="1.5"/>
 <path d="m10 5.375-1.875-3.75" fill="none" stroke="#d4aa00" stroke-linecap="round" stroke-linejoin="round" stroke-width="1.5"/>
 <path d="m4 5.75v2.25l2.25 2.25" fill="none" stroke="#aca793" stroke-linecap="round" stroke-linejoin="round" stroke-width="1.5"/>
 <path d="m4 20.75v-2.25l2.25-2.25" fill="none" stroke="#aca793" stroke-linecap="round" stroke-linejoin="round" stroke-width="1.5"/>
 <path d="m1.375 14.75 1.5-1.5 4.125-0.75" fill="none" stroke="#aca793" stroke-linecap="round" stroke-linejoin="round" stroke-width="1.5"/>
 <path d="m19 5.75v2.25l-2.25 2.25" fill="none" stroke="#aca793" stroke-linecap="round" stroke-linejoin="round" stroke-width="1.5"/>
 <path d="m11.5 3.5a6.75 9 0 0 0-6.75 9 6.75 9 0 0 0 4.0136719 8.201172l0.9707031-2.191406 8.292969-8.294922a6.75 9 0 0 0-6.527344-6.714844z" fill="url(#d)" stroke-width=".75"/>
 <path d="M 15.961915,5.75 A 6.75,9 0 0 0 11.5,3.5 6.75,9 0 0 0 7.038087,5.7529296 L 11.5,9.875 15.958985,5.75 Z" fill="url(#a)" stroke-linecap="round" stroke-linejoin="round" stroke-width="1.80001"/>
 <path d="m10.75 17.494141 0.75-0.75v0l0.75-0.75v-6.494141a0.75 0.75 0 0 0-0.75-0.75 0.75 0.75 0 0 0-0.75 0.75z" fill="url(#f)" stroke-linecap="round" stroke-linejoin="round"/>
 <path d="m18.900428 11.03983 3.059746 3.059746-2.039832 2.03983-3.059746-3.059745z" fill="url(#e)" fill-rule="evenodd" stroke-width="1.55271"/>
 <path d="m20.940258 9.0000001 3.059741 3.0597509-2.05048 2.050479-3.049091-3.0704z" fill="url(#c)" fill-rule="evenodd" stroke-width="1.55271"/>
 <path d="m16.860596 13.079661 3.059746 3.059745-6.119492 6.11949-3.059746-3.059745z" fill="url(#b)" fill-rule="evenodd" stroke-width="1.55271"/>
 <path d="m10.741104 19.199151-1.2531849 2.826477 1.4864529 1.486452 2.826478-1.253184z" fill="#d38d5f" fill-rule="evenodd" stroke-width="1.47508"/>
 <path d="m10.231146 23.788769a0.72118917 0.72118891 0 0 1-1.0199156 0 0.72118917 0.72118891 0 0 1 0-1.019914 0.72118917 0.72118891 0 0 1 1.0199156 0 0.72118917 0.72118891 0 0 1 0 1.019914zm-0.7432268-1.763141 1.4864538 1.486453-0.960872 0.426023-0.9516056-0.951605z" fill="#333333" stroke-dashoffset="1.49998" stroke-linecap="round" stroke-linejoin="round" stroke-width="1.94677"/>
</svg>
