<?xml version="1.0" encoding="UTF-8" standalone="no"?>
<svg
   height="32"
   viewBox="0 0 8.4666664 8.4666671"
   width="32"
   version="1.1"
   id="svg299"
   sodipodi:docname="Info_02_32.svg"
   inkscape:export-filename="Info_02_32.png"
   inkscape:export-xdpi="96"
   inkscape:export-ydpi="96"
   inkscape:version="1.2 (dc2aedaf03, 2022-05-15)"
   xmlns:inkscape="http://www.inkscape.org/namespaces/inkscape"
   xmlns:sodipodi="http://sodipodi.sourceforge.net/DTD/sodipodi-0.dtd"
   xmlns="http://www.w3.org/2000/svg"
   xmlns:svg="http://www.w3.org/2000/svg">
  <defs
     id="defs303">
    <radialGradient
       id="a-8"
       cx="12.1"
       cy="10.900001"
       gradientTransform="matrix(0,0.4988777,-0.49887766,0,6.880948,-4.593239)"
       gradientUnits="userSpaceOnUse"
       r="4.5">
      <stop
         offset="0"
         stop-color="#59f"
         id="stop146" />
      <stop
         offset="1"
         stop-color="#0055d4"
         id="stop148" />
    </radialGradient>
  </defs>
  <sodipodi:namedview
     id="namedview301"
     pagecolor="#ffffff"
     bordercolor="#666666"
     borderopacity="1.0"
     inkscape:showpageshadow="2"
     inkscape:pageopacity="0.0"
     inkscape:pagecheckerboard="0"
     inkscape:deskcolor="#d1d1d1"
     showgrid="true"
     inkscape:zoom="28.6875"
     inkscape:cx="14.779956"
     inkscape:cy="16"
     inkscape:current-layer="g297">
    <inkscape:grid
       type="xygrid"
       id="grid982" />
  </sodipodi:namedview>
  <radialGradient
     id="a"
     cx="12.1"
     cy="10.900001"
     gradientTransform="matrix(0 .4988777 -.49887766 0 6.880948 -4.593239)"
     gradientUnits="userSpaceOnUse"
     r="4.5">
    <stop
       offset="0"
       stop-color="#59f"
       id="stop284" />
    <stop
       offset="1"
       stop-color="#0055d4"
       id="stop286" />
  </radialGradient>
  <g
     stroke-linecap="round"
     id="g297">
    <g
       id="g6666"
       transform="matrix(2.0000006,0,0,2.0000006,-1.9594839e-6,-1.9594839e-6)">
      <circle
         cx="2.116667"
         cy="2.116667"
         fill="url(#a)"
         r="1.852083"
         stroke="#d5e5ff"
         stroke-dashoffset="1.49998"
         stroke-linejoin="round"
         stroke-width="0.264583"
         transform="matrix(0,1,1,0,0,0)"
         id="circle151"
         style="fill:url(#a-8)" />
      <g
         id="g6401"
         style="stroke:#ffffff">
        <path
           style="fill:none;stroke:#ffffff;stroke-width:0.529167;stroke-linecap:round;stroke-linejoin:miter;stroke-dasharray:none;stroke-opacity:1"
           d="m 2.1166667,1.190625 -1e-7,0.1322916"
           id="path6395"
           sodipodi:nodetypes="cc" />
        <path
           style="fill:none;stroke:#ffffff;stroke-width:0.529167;stroke-linecap:round;stroke-linejoin:miter;stroke-dasharray:none;stroke-opacity:1"
           d="m 2.1166666,2.1166666 1e-7,0.9260417"
           id="path6397"
           sodipodi:nodetypes="cc" />
      </g>
    </g>
  </g>
</svg>
