<svg width="48" height="48" version="1.1" xmlns="http://www.w3.org/2000/svg">
 <defs>
  <linearGradient id="a" x1="8.000001" x2="8.000001" y1="13.855285" y2="4.5498314" gradientTransform="matrix(1.7480745,0,0,1.699835,19.515404,21.350168)" gradientUnits="userSpaceOnUse">
   <stop stop-color="#d58914" stop-opacity=".956863" offset="0"/>
   <stop stop-color="#f4a428" stop-opacity=".992157" offset="1"/>
  </linearGradient>
 </defs>
 <path d="m33.500003 22.199853 4.109969 8.097899 9.190171 1.29856-6.65007 6.303335 1.569869 8.90045-8.219939-4.202224-8.219942 4.202222 1.569869-8.900448-6.65007-6.303335 9.190171-1.29856z" fill="url(#a)" fill-rule="evenodd" stroke="#ffffff" stroke-linecap="round" stroke-linejoin="round" stroke-width="2.4"/>
</svg>
