<?xml version="1.0" encoding="UTF-8" standalone="no"?>
<svg
   width="32"
   height="32"
   version="1.1"
   id="svg12"
   sodipodi:docname="Filter_03_32.svg"
   inkscape:export-filename="Filter_03_32.png"
   inkscape:export-xdpi="96"
   inkscape:export-ydpi="96"
   inkscape:version="1.3.2 (091e20e, 2023-11-25, custom)"
   xmlns:inkscape="http://www.inkscape.org/namespaces/inkscape"
   xmlns:sodipodi="http://sodipodi.sourceforge.net/DTD/sodipodi-0.dtd"
   xmlns:xlink="http://www.w3.org/1999/xlink"
   xmlns="http://www.w3.org/2000/svg"
   xmlns:svg="http://www.w3.org/2000/svg">
  <sodipodi:namedview
     id="namedview12"
     pagecolor="#ffffff"
     bordercolor="#000000"
     borderopacity="0.25"
     inkscape:showpageshadow="2"
     inkscape:pageopacity="0.0"
     inkscape:pagecheckerboard="0"
     inkscape:deskcolor="#d1d1d1"
     showgrid="true"
     inkscape:current-layer="svg12">
    <inkscape:grid
       id="grid12"
       units="px"
       originx="0"
       originy="0"
       spacingx="0.5"
       spacingy="0.5"
       empcolor="#0099e5"
       empopacity="0.30196078"
       color="#0099e5"
       opacity="0.14901961"
       empspacing="2"
       dotted="false"
       gridanglex="30"
       gridanglez="30"
       visible="true" />
  </sodipodi:namedview>
  <defs
     id="defs1">
    <linearGradient
       id="f"
       x1="9"
       x2="21"
       y1="1032.3622"
       y2="1032.3622"
       gradientTransform="matrix(2.2722758,0,0,2.2504066,-17.935946,-2312.8608)"
       gradientUnits="userSpaceOnUse"
       xlink:href="#a" />
  </defs>
  <linearGradient
     id="a"
     x1="9"
     x2="21"
     y1="1032.3622"
     y2="1032.3622"
     gradientTransform="matrix(2.2722758 0 0 2.2504066 -17.935946 -2312.8608)"
     gradientUnits="userSpaceOnUse">
    <stop
       stop-color="#e0c67e"
       offset="0"
       id="stop1" />
    <stop
       stop-color="#c88e2c"
       offset=".4999288"
       id="stop2" />
    <stop
       stop-color="#d2a641"
       offset="1"
       id="stop3" />
  </linearGradient>
  <linearGradient
     id="b">
    <stop
       stop-color="#fc0"
       offset="0"
       id="stop4" />
    <stop
       stop-color="#fff6d5"
       offset=".33333102"
       id="stop5" />
    <stop
       stop-color="#fc0"
       offset="1"
       id="stop6" />
  </linearGradient>
  <linearGradient
     id="c"
     x1="13"
     x2="18"
     y1="1039.3622"
     y2="1039.3622"
     gradientTransform="matrix(2.2722758,0,0,2.2504066,-17.935946,-2312.8608)"
     gradientUnits="userSpaceOnUse"
     xlink:href="#b" />
  <linearGradient
     id="d"
     x1="11"
     x2="21"
     y1="1032.3622"
     y2="1030.3622"
     gradientTransform="matrix(2.2722758,0,0,2.2504066,-17.935946,-2312.8608)"
     gradientUnits="userSpaceOnUse"
     xlink:href="#b" />
  <linearGradient
     id="e"
     x1="8.5"
     x2="23.5"
     y1="5"
     y2="5"
     gradientUnits="userSpaceOnUse">
    <stop
       stop-color="#dfc379"
       offset="0"
       id="stop7" />
    <stop
       stop-color="#eddcb4"
       offset=".36666667"
       id="stop8" />
    <stop
       stop-color="#d1a440"
       offset="1"
       id="stop9" />
  </linearGradient>
  <g
     transform="translate(-3)"
     id="g11">
    <path
       d="m3.5 5 9 11.5h7l9.000001-11v-3h-25.000001z"
       fill="url(#d)"
       fill-rule="evenodd"
       stroke="url(#f)"
       id="path9" />
    <path
       d="m19.5 16.5-1.25 13h-4.5l-1.25-13z"
       fill="url(#c)"
       fill-rule="evenodd"
       stroke="url(#f)"
       stroke-linecap="square"
       id="path10" />
    <path
       d="m4 5.5h24"
       fill="none"
       stroke="url(#e)"
       id="path11" />
  </g>
  <path
     d="m24.617396 20a2.6173964 2.6173964 0 0 1-2.617396 2.617396 2.6173964 2.6173964 0 0 1-2.617397-2.617396 2.6173964 2.6173964 0 0 1 2.617397-2.617397 2.6173964 2.6173964 0 0 1 2.617396 2.617397zm-6.977992-7.799223 0.670545 2.631251-1.476282 1.476692-2.63472-0.669954-0.798983 1.928913 2.336758 1.389301-2.9e-4 2.088067-2.334723 1.386429 0.799068 1.929121 2.631251-0.670546 1.476693 1.476281-0.669955 2.634723 1.928913 0.798981 1.389301-2.336758 2.088067 2.9e-4 1.386429 2.334722 1.929121-0.799066-0.670546-2.631254 1.476281-1.476691 2.634723 0.669954 0.798981-1.928913-2.336758-1.3893 2.9e-4 -2.088067 2.334722-1.386431-0.799068-1.929118-2.631252 0.670545-1.476691-1.476282 0.669954-2.634721-1.928913-0.798982-1.389302 2.336757-2.088065-2.89e-4 -1.386429-2.334723z"
     fill="#3771c8"
     stroke="#fffffe"
     stroke-dashoffset="1.49998"
     stroke-linejoin="round"
     stroke-width="2.8"
     style="paint-order:stroke fill markers"
     id="path12" />
</svg>
