<?xml version="1.0" encoding="UTF-8" standalone="no"?>
<svg
   height="32"
   width="32"
   version="1.1"
   id="svg257"
   sodipodi:docname="menu_project_save_as_200.svg"
   inkscape:export-filename="menu_project_save_as_200.png"
   inkscape:export-xdpi="96"
   inkscape:export-ydpi="96"
   inkscape:version="1.2.2 (732a01da63, 2022-12-09)"
   xmlns:inkscape="http://www.inkscape.org/namespaces/inkscape"
   xmlns:sodipodi="http://sodipodi.sourceforge.net/DTD/sodipodi-0.dtd"
   xmlns="http://www.w3.org/2000/svg"
   xmlns:svg="http://www.w3.org/2000/svg">
  <defs
     id="defs261" />
  <sodipodi:namedview
     id="namedview259"
     pagecolor="#ffffff"
     bordercolor="#666666"
     borderopacity="1.0"
     inkscape:showpageshadow="2"
     inkscape:pageopacity="0.0"
     inkscape:pagecheckerboard="0"
     inkscape:deskcolor="#d1d1d1"
     showgrid="true"
     inkscape:zoom="28.6875"
     inkscape:cx="15.982571"
     inkscape:cy="16"
     inkscape:current-layer="svg257">
    <inkscape:grid
       type="xygrid"
       id="grid709" />
  </sodipodi:namedview>
  <linearGradient
     id="a"
     gradientUnits="userSpaceOnUse"
     x1="30"
     x2="10"
     y1="31"
     y2="9">
    <stop
       offset="0"
       stop-color="#2a7fff"
       id="stop193" />
    <stop
       offset="1"
       stop-color="#66a4ff"
       id="stop195" />
  </linearGradient>
  <linearGradient
     id="b"
     gradientTransform="matrix(1.3846 0 0 1.4286 2 3)"
     gradientUnits="userSpaceOnUse"
     x1="13.53"
     x2="13.53"
     y1="3.5"
     y2="8.75">
    <stop
       offset="0"
       stop-color="#ececec"
       id="stop198" />
    <stop
       offset="1"
       stop-color="#b7bec8"
       id="stop200" />
  </linearGradient>
  <radialGradient
     id="c"
     cx="7.388889"
     cy="3.048611"
     gradientTransform="matrix(-.00000005 .81632663 -.81632648 -.00000005 11.774378 1.753967)"
     gradientUnits="userSpaceOnUse"
     r="3.5">
    <stop
       offset="0"
       stop-color="#ff8080"
       id="stop203" />
    <stop
       offset="1"
       stop-color="#e50000"
       id="stop205" />
  </radialGradient>
  <radialGradient
     id="d"
     cx="10.5"
     cy="9.5"
     gradientTransform="matrix(-.00000008 .81632648 -.81632648 -.00000009 19.040818 2.714285)"
     gradientUnits="userSpaceOnUse"
     r="3.5">
    <stop
       offset="0"
       stop-color="#ffe680"
       id="stop208" />
    <stop
       offset="1"
       stop-color="#e5b800"
       id="stop210" />
  </radialGradient>
  <radialGradient
     id="e"
     cx="3"
     cy="10"
     gradientTransform="matrix(0 .81632648 -.81632648 0 15.448978 8.836734)"
     gradientUnits="userSpaceOnUse"
     r="3.5">
    <stop
       offset="0"
       stop-color="#80b2ff"
       id="stop213" />
    <stop
       offset="1"
       stop-color="#2672e5"
       id="stop215" />
  </radialGradient>
  <linearGradient
     id="f"
     gradientTransform="matrix(.96732065 0 0 .96732064 1.875813 .375812)"
     gradientUnits="userSpaceOnUse"
     x1="14.084459"
     x2="8.915541"
     y1="14.084459"
     y2="8.915541">
    <stop
       offset="0"
       stop-color="#009600"
       id="stop218" />
    <stop
       offset="1"
       stop-color="#6edb39"
       id="stop220" />
  </linearGradient>
  <g
     transform="translate(-5 -8)"
     id="g239">
    <g
       stroke-width="2.6968"
       id="g229">
      <path
         d="m9 8h19.8l2.2 2.25v21.75h-22z"
         fill="url(#a)"
         fill-rule="evenodd"
         id="path223" />
      <rect
         fill="#fff"
         height="12"
         rx=".73333"
         width="16"
         x="12"
         y="18"
         id="rect225" />
      <path
         d="m15 8v8h12v-8zm7 2h3v4h-3z"
         fill="url(#b)"
         fill-rule="evenodd"
         id="path227" />
    </g>
    <g
       fill="none"
       stroke-width="2"
       id="g237">
      <path
         d="m14 21h12"
         stroke="#e6e6e6"
         id="path231" />
      <path
         d="m14 25h12"
         stroke="#e6e6e6"
         id="path233" />
      <path
         d="m12 29h16"
         stroke="#f60"
         id="path235" />
    </g>
  </g>
  <circle
     cx="13"
     cy="11.5"
     fill="url(#f)"
     r="4.000001"
     transform="matrix(0 1.9999998 1.9999998 0 1.000002 -1.999997)"
     id="circle241" />
  <g
     fill="none"
     stroke="#fff"
     stroke-linecap="round"
     transform="matrix(1.9999998 0 0 1.9999998 1.000002 1.000003)"
     id="g247">
    <path
       d="m11.5 9.5v4"
       id="path243" />
    <path
       d="m13.5 11.5h-4"
       id="path245" />
  </g>
  <g
     stroke-width=".357143"
     transform="matrix(2 0 0 2 -11 3)"
     id="g255">
    <circle
       cx="10"
       cy="8.5"
       fill="url(#c)"
       r="2.5"
       id="circle249" />
    <circle
       cx="12"
       cy="12"
       fill="url(#d)"
       r="2.5"
       id="circle251" />
    <circle
       cx="8"
       cy="12"
       fill="url(#e)"
       r="2.5"
       id="circle253" />
  </g>
</svg>
