<?xml version="1.0" encoding="UTF-8" standalone="no"?>
<svg
   height="36"
   width="36"
   version="1.1"
   id="svg433"
   sodipodi:docname="Open_02_36.svg"
   inkscape:export-filename="Open_02_36.png"
   inkscape:export-xdpi="96"
   inkscape:export-ydpi="96"
   inkscape:version="1.2-beta (1b65182ce9, 2022-04-05)"
   xmlns:inkscape="http://www.inkscape.org/namespaces/inkscape"
   xmlns:sodipodi="http://sodipodi.sourceforge.net/DTD/sodipodi-0.dtd"
   xmlns="http://www.w3.org/2000/svg"
   xmlns:svg="http://www.w3.org/2000/svg">
  <defs
     id="defs437" />
  <sodipodi:namedview
     id="namedview435"
     pagecolor="#ffffff"
     bordercolor="#666666"
     borderopacity="1.0"
     inkscape:pageshadow="2"
     inkscape:pageopacity="0.0"
     inkscape:pagecheckerboard="0"
     inkscape:deskcolor="#d1d1d1"
     showgrid="true"
     inkscape:zoom="25.5"
     inkscape:cx="17.980392"
     inkscape:cy="18"
     inkscape:current-layer="svg433">
    <inkscape:grid
       type="xygrid"
       id="grid874" />
  </sodipodi:namedview>
  <g
     id="g883"
     transform="matrix(1.0300954,0,0,1.0300954,-0.02666925,0.37337912)">
    <g
       fill="none"
       stroke="#00aad4"
       stroke-linecap="round"
       stroke-linejoin="round"
       transform="matrix(2.1875,0,0,2.1875,1.093753,-4.154973)"
       id="g423">
      <path
         d="M 7.5,8.5000248 V 2.5"
         id="path419" />
      <path
         d="M 5,5.0000248 7.5,2.4999669 10,5.0000248"
         id="path421" />
    </g>
    <g
       stroke-width="0.927015"
       transform="matrix(2.3559561,0,0,2.3634971,-1.3476501,-1.4438074)"
       id="g431">
      <path
         d="m 12.035012,5.9711 c 2.170032,1.1881731 3.015751,3.1965117 2.107775,5.005354 -0.907976,1.808841 -3.370742,3.02193 -6.137916,3.023364 -2.7671729,0.0014 -5.232562,-1.209102 -6.1444513,-3.017 C 0.94853017,9.1749187 1.7899032,7.1657055 3.9573609,5.9752852"
         fill="none"
         stroke="#00aad4"
         stroke-dashoffset="1.49998"
         stroke-linecap="round"
         stroke-width="0.927201"
         id="path425" />
      <path
         d="m 10.185319,7.824 c 1.490909,0.48195 2.167925,1.394851 1.664007,2.243775 C 11.345409,10.9167 9.7805554,11.499492 8.0031477,11.500193 6.2257395,11.500894 4.6590364,10.919338 4.1524192,10.070811 3.645802,9.222284 4.3199139,8.308852 5.8092884,7.825726"
         fill="none"
         stroke="#00aad4"
         stroke-dashoffset="1.49998"
         stroke-linecap="round"
         stroke-width="0.927015"
         id="path427" />
      <ellipse
         cx="8"
         cy="9.4999914"
         fill="#00aad4"
         rx="1"
         ry="0.5"
         id="ellipse429" />
    </g>
  </g>
</svg>
