<?xml version="1.0" encoding="UTF-8" standalone="no"?>
<svg
   height="36"
   viewBox="0 0 24 24"
   width="36"
   version="1.1"
   id="svg409"
   sodipodi:docname="Menu_01_36.svg"
   inkscape:export-filename="Menu_01_36.png"
   inkscape:export-xdpi="96"
   inkscape:export-ydpi="96"
   inkscape:version="1.2-beta (1b65182ce9, 2022-04-05)"
   xmlns:inkscape="http://www.inkscape.org/namespaces/inkscape"
   xmlns:sodipodi="http://sodipodi.sourceforge.net/DTD/sodipodi-0.dtd"
   xmlns="http://www.w3.org/2000/svg"
   xmlns:svg="http://www.w3.org/2000/svg">
  <defs
     id="defs413" />
  <sodipodi:namedview
     id="namedview411"
     pagecolor="#ffffff"
     bordercolor="#666666"
     borderopacity="1.0"
     inkscape:pageshadow="2"
     inkscape:pageopacity="0.0"
     inkscape:pagecheckerboard="0"
     inkscape:deskcolor="#d1d1d1"
     showgrid="true"
     inkscape:zoom="25.5"
     inkscape:cx="17.72549"
     inkscape:cy="18"
     inkscape:current-layer="svg409">
    <inkscape:grid
       type="xygrid"
       id="grid797" />
  </sodipodi:namedview>
  <path
     d="M 3.3333333,5.666665 H 20.666666"
     id="path401"
     style="fill:none;stroke:#00aad4;stroke-width:3.33333;stroke-dasharray:none" />
  <path
     d="M 3.3333333,12.33333 H 20.666666"
     id="path403"
     style="fill:none;stroke:#00aad4;stroke-width:3.33333;stroke-dasharray:none" />
  <path
     d="M 3.3333333,18.999997 H 20.666666"
     id="path405"
     style="fill:none;stroke:#00aad4;stroke-width:3.33333;stroke-dasharray:none" />
</svg>
