<?xml version="1.0" encoding="UTF-8" standalone="no"?>
<svg
   width="24"
   height="24"
   version="1.1"
   id="svg272"
   sodipodi:docname="menu_jumpto_section_150.svg"
   inkscape:export-filename="menu_jumpto_section_150.png"
   inkscape:export-xdpi="96"
   inkscape:export-ydpi="96"
   inkscape:version="1.2.2 (732a01da63, 2022-12-09)"
   xmlns:inkscape="http://www.inkscape.org/namespaces/inkscape"
   xmlns:sodipodi="http://sodipodi.sourceforge.net/DTD/sodipodi-0.dtd"
   xmlns="http://www.w3.org/2000/svg"
   xmlns:svg="http://www.w3.org/2000/svg">
  <defs
     id="defs276" />
  <sodipodi:namedview
     id="namedview274"
     pagecolor="#ffffff"
     bordercolor="#666666"
     borderopacity="1.0"
     inkscape:showpageshadow="2"
     inkscape:pageopacity="0.0"
     inkscape:pagecheckerboard="0"
     inkscape:deskcolor="#d1d1d1"
     showgrid="true"
     inkscape:zoom="38.25"
     inkscape:cx="11.986928"
     inkscape:cy="12"
     inkscape:current-layer="svg272">
    <inkscape:grid
       type="xygrid"
       id="grid499" />
  </sodipodi:namedview>
  <path
     d="m1 2.5 4 3-4 3z"
     fill="#f00"
     id="path266" />
  <path
     d="m1 10.5 4 3-4 3v-3z"
     fill="#2a7fff"
     id="path268" />
  <path
     d="m21.415 0.58529v21.829h-15.829v-21.829z"
     fill="#fff"
     stroke="#d4aa00"
     stroke-linecap="round"
     stroke-linejoin="round"
     stroke-miterlimit="5.6"
     stroke-width="1.1706"
     id="path270" />
</svg>
