<?xml version="1.0" encoding="UTF-8" standalone="no"?>
<svg
   width="24"
   height="24"
   version="1.1"
   viewBox="0 0 24 24"
   id="svg6"
   sodipodi:docname="tapplicationproperties.svg"
   inkscape:export-filename="tapplicationproperties.png"
   inkscape:export-xdpi="96"
   inkscape:export-ydpi="96"
   inkscape:version="1.3.2 (091e20e, 2023-11-25, custom)"
   xmlns:inkscape="http://www.inkscape.org/namespaces/inkscape"
   xmlns:sodipodi="http://sodipodi.sourceforge.net/DTD/sodipodi-0.dtd"
   xmlns="http://www.w3.org/2000/svg"
   xmlns:svg="http://www.w3.org/2000/svg">
  <defs
     id="defs6" />
  <sodipodi:namedview
     id="namedview6"
     pagecolor="#ffffff"
     bordercolor="#000000"
     borderopacity="0.25"
     inkscape:showpageshadow="2"
     inkscape:pageopacity="0.0"
     inkscape:pagecheckerboard="0"
     inkscape:deskcolor="#d1d1d1"
     showgrid="true"
     inkscape:current-layer="svg6">
    <inkscape:grid
       id="grid6"
       units="px"
       originx="0"
       originy="0"
       spacingx="0.5"
       spacingy="0.5"
       empcolor="#0099e5"
       empopacity="0.30196078"
       color="#0099e5"
       opacity="0.14901961"
       empspacing="2"
       dotted="false"
       gridanglex="30"
       gridanglez="30"
       visible="true" />
  </sodipodi:namedview>
  <path
     d="m12.5 21.5-2 2-2-2"
     fill="none"
     stroke="#ff6600"
     stroke-linecap="round"
     stroke-linejoin="round"
     id="path1" />
  <path
     d="m10.5 17.6v5.9"
     fill="none"
     stroke="#ff6600"
     stroke-linecap="round"
     stroke-linejoin="round"
     id="path2" />
  <path
     d="m21.5 8.5 2 2-2 2"
     fill="none"
     stroke="#ff6600"
     stroke-linecap="round"
     stroke-linejoin="round"
     id="path3" />
  <path
     d="m17.6 10.5h5.9"
     fill="none"
     stroke="#ff6600"
     stroke-linecap="round"
     stroke-linejoin="round"
     id="path4" />
  <rect
     x="2.2429535"
     y="5.7429533"
     width="15.514093"
     height="12.014093"
     fill="#f9f9f9"
     stroke="#2a7efe"
     stroke-width=".485907"
     style="paint-order:normal"
     id="rect4" />
  <path
     transform="matrix(1.1111111,0,0,1,-1.3333332,0)"
     d="M 4.3499999,3 H 15.9 c 0.828427,0 1.5,0.6715729 1.5,1.5 V 6 H 3.0000001 L 3,4.3499999 C 3,3.6044155 3.6044155,3 4.3499999,3 Z"
     fill="#2a7efe"
     stroke-width=".664078"
     id="path5" />
  <path
     d="m6 9.5 2 2-2 2"
     fill="none"
     stroke="#666666"
     stroke-linecap="round"
     stroke-linejoin="round"
     stroke-width="1px"
     id="path6" />
  <rect
     x="9"
     y="14"
     width="4"
     height="1"
     fill="#666666"
     style="paint-order:normal"
     id="rect6" />
</svg>
