<?xml version="1.0" encoding="UTF-8" standalone="no"?>
<svg
   height="64"
   viewBox="0 0 64 64"
   width="64"
   version="1.1"
   id="svg623"
   sodipodi:docname="Export_05_64.svg"
   inkscape:version="1.3 (0e150ed6c4, 2023-07-21)"
   inkscape:export-filename="Export_05_64.png"
   inkscape:export-xdpi="96"
   inkscape:export-ydpi="96"
   xmlns:inkscape="http://www.inkscape.org/namespaces/inkscape"
   xmlns:sodipodi="http://sodipodi.sourceforge.net/DTD/sodipodi-0.dtd"
   xmlns="http://www.w3.org/2000/svg"
   xmlns:svg="http://www.w3.org/2000/svg">
  <defs
     id="defs627" />
  <sodipodi:namedview
     id="namedview625"
     pagecolor="#ffffff"
     bordercolor="#666666"
     borderopacity="1.0"
     inkscape:showpageshadow="2"
     inkscape:pageopacity="0.0"
     inkscape:pagecheckerboard="0"
     inkscape:deskcolor="#d1d1d1"
     showgrid="true"
     inkscape:zoom="14.34375"
     inkscape:cx="32"
     inkscape:cy="32"
     inkscape:current-layer="svg623">
    <inkscape:grid
       id="grid1"
       units="px"
       originx="0"
       originy="0"
       spacingx="0.5"
       spacingy="0.5"
       empcolor="#0099e5"
       empopacity="0.30196078"
       color="#0099e5"
       opacity="0.14901961"
       empspacing="2"
       dotted="false"
       gridanglex="30"
       gridanglez="30"
       visible="true" />
  </sodipodi:namedview>
  <rect
     fill="#f5f7ff"
     height="53.099998"
     rx="3.7371006"
     stroke="#00aad4"
     stroke-linejoin="round"
     stroke-width="2.9"
     width="45.099998"
     x="5.4500012"
     y="5.4500012"
     id="rect2" />
  <path
     d="m 6.5,5.9999999 h 43 V 13.9 h -43 z"
     fill="#00aad4"
     fill-rule="evenodd"
     stroke-width="3.9772"
     id="path4" />
  <path
     d="M 18,35 H 54"
     id="path2"
     style="fill:none;stroke:#f5f7ff;stroke-width:12;stroke-linecap:round;stroke-linejoin:round;stroke-dasharray:none;stroke-opacity:1" />
  <path
     d="m 44.000124,45 10,-10 -10,-10"
     id="path3"
     style="fill:none;stroke:#f5f7ff;stroke-width:12;stroke-linecap:round;stroke-linejoin:round;stroke-dasharray:none;stroke-opacity:1" />
  <path
     d="M 18,35 H 54"
     id="path4-2"
     style="fill:none;stroke:#ccaa00;stroke-width:4;stroke-linecap:round;stroke-linejoin:round;stroke-opacity:1" />
  <path
     d="m 44.000124,45 10,-10 -10,-10"
     id="path5"
     style="fill:none;stroke:#ccaa00;stroke-width:4;stroke-linecap:round;stroke-linejoin:round;stroke-opacity:1" />
</svg>
