<?xml version="1.0" encoding="UTF-8" standalone="no"?>
<svg
   height="32"
   width="32"
   version="1.1"
   id="svg1636"
   sodipodi:docname="Pause_01_32.svg"
   inkscape:export-filename="Pause_01_32.png"
   inkscape:export-xdpi="96"
   inkscape:export-ydpi="96"
   inkscape:version="1.2-beta (1b65182ce9, 2022-04-05)"
   xmlns:inkscape="http://www.inkscape.org/namespaces/inkscape"
   xmlns:sodipodi="http://sodipodi.sourceforge.net/DTD/sodipodi-0.dtd"
   xmlns="http://www.w3.org/2000/svg"
   xmlns:svg="http://www.w3.org/2000/svg">
  <defs
     id="defs1640" />
  <sodipodi:namedview
     id="namedview1638"
     pagecolor="#ffffff"
     bordercolor="#666666"
     borderopacity="1.0"
     inkscape:pageshadow="2"
     inkscape:pageopacity="0.0"
     inkscape:pagecheckerboard="0"
     inkscape:deskcolor="#d1d1d1"
     showgrid="true"
     inkscape:zoom="28.6875"
     inkscape:cx="12.217865"
     inkscape:cy="16"
     inkscape:current-layer="g1110">
    <inkscape:grid
       type="xygrid"
       id="grid1759" />
  </sodipodi:namedview>
  <g
     id="g404"
     transform="matrix(2,0,0,2,-1,0)">
    <g
       id="g1110">
      <g
         id="g1318"
         transform="translate(0.25)">
        <circle
           style="fill:none;stroke:#00aad4;stroke-linecap:round;stroke-linejoin:round;stroke-dashoffset:1.49998"
           id="path355"
           cx="8.5"
           cy="8"
           r="7" />
        <g
           id="g1312"
           transform="translate(-0.25)">
          <rect
             style="fill:#00aad4;stroke:none;stroke-width:1.2;stroke-linecap:round;stroke-linejoin:round;stroke-dasharray:none;stroke-dashoffset:1.49998"
             id="rect438"
             width="1.5"
             height="6"
             x="6.5"
             y="5" />
          <rect
             style="fill:#00aad4;stroke:none;stroke-width:1.2;stroke-linecap:round;stroke-linejoin:round;stroke-dasharray:none;stroke-dashoffset:1.49998"
             id="rect337"
             width="1.5"
             height="6"
             x="9.5"
             y="5" />
        </g>
      </g>
    </g>
  </g>
</svg>
