<?xml version="1.0" encoding="UTF-8" standalone="no"?>
<svg
   height="64"
   viewBox="0 0 16.933 16.933"
   width="64"
   version="1.1"
   id="svg14"
   sodipodi:docname="Window_15_64.svg"
   inkscape:version="1.2.2 (732a01da63, 2022-12-09)"
   xmlns:inkscape="http://www.inkscape.org/namespaces/inkscape"
   xmlns:sodipodi="http://sodipodi.sourceforge.net/DTD/sodipodi-0.dtd"
   xmlns="http://www.w3.org/2000/svg"
   xmlns:svg="http://www.w3.org/2000/svg">
  <defs
     id="defs18" />
  <sodipodi:namedview
     id="namedview16"
     pagecolor="#ffffff"
     bordercolor="#000000"
     borderopacity="0.25"
     inkscape:showpageshadow="2"
     inkscape:pageopacity="0.0"
     inkscape:pagecheckerboard="0"
     inkscape:deskcolor="#d1d1d1"
     showgrid="true"
     inkscape:zoom="14.21875"
     inkscape:cx="31.964835"
     inkscape:cy="32"
     inkscape:current-layer="svg14">
    <inkscape:grid
       type="xygrid"
       id="grid982" />
  </sodipodi:namedview>
  <rect
     fill="#f5f7ff"
     height="14.049098"
     rx="1.164144"
     stroke="#00aad4"
     stroke-linejoin="round"
     stroke-width=".767277"
     width="14.049099"
     x="1.441951"
     y="1.441951"
     id="rect2" />
  <path
     d="m1.7197578 1.5874687h13.4934842v2.0901672h-13.4934842z"
     fill="#00aad4"
     fill-rule="evenodd"
     stroke-width="1.05228"
     id="path4" />
  <g
     fill="none"
     stroke="#00aad4"
     stroke-linecap="round"
     stroke-linejoin="round"
     stroke-width=".846651"
     id="g12">
    <path
       d="m10.900617 7.9373422 1.904996 1.3228886-1.904996 1.3228882"
       id="path6" />
    <path
       d="m9.4132089 6.5086224-1.893416 5.5032166"
       id="path8" />
    <path
       d="m6.0323821 7.9373422-1.904995 1.3228886 1.904995 1.3228882"
       id="path10" />
  </g>
</svg>
