<?xml version="1.0" encoding="UTF-8" standalone="no"?>
<svg
   height="64"
   viewBox="0 0 64 64"
   width="64"
   version="1.1"
   id="svg8"
   sodipodi:docname="Key_04_64.svg"
   inkscape:export-filename="Key_04_64.png"
   inkscape:export-xdpi="96"
   inkscape:export-ydpi="96"
   inkscape:version="1.3.2 (091e20e, 2023-11-25, custom)"
   xmlns:inkscape="http://www.inkscape.org/namespaces/inkscape"
   xmlns:sodipodi="http://sodipodi.sourceforge.net/DTD/sodipodi-0.dtd"
   xmlns="http://www.w3.org/2000/svg"
   xmlns:svg="http://www.w3.org/2000/svg">
  <defs
     id="defs8" />
  <sodipodi:namedview
     id="namedview8"
     pagecolor="#ffffff"
     bordercolor="#000000"
     borderopacity="0.25"
     inkscape:showpageshadow="2"
     inkscape:pageopacity="0.0"
     inkscape:pagecheckerboard="0"
     inkscape:deskcolor="#d1d1d1"
     showgrid="true"
     inkscape:current-layer="svg8">
    <inkscape:grid
       id="grid8"
       units="px"
       originx="0"
       originy="0"
       spacingx="0.5"
       spacingy="0.5"
       empcolor="#0099e5"
       empopacity="0.30196078"
       color="#0099e5"
       opacity="0.14901961"
       empspacing="2"
       dotted="false"
       gridanglex="30"
       gridanglez="30"
       visible="true" />
  </sodipodi:namedview>
  <radialGradient
     id="a"
     cx="12.934444"
     cy="-2.386543"
     gradientTransform="matrix(6.2500001 -.00000032 .00000039 4.5000007 -41.840279 38.739451)"
     gradientUnits="userSpaceOnUse"
     r="4">
    <stop
       offset="0"
       stop-color="#b89900"
       id="stop1" />
    <stop
       offset="1"
       stop-color="#e5bf00"
       id="stop2" />
  </radialGradient>
  <linearGradient
     id="b"
     gradientUnits="userSpaceOnUse"
     x1="22"
     x2="16"
     y1="48"
     y2="42">
    <stop
       offset="0"
       stop-color="#b29400"
       id="stop3" />
    <stop
       offset="1"
       stop-color="#e0ba00"
       id="stop4" />
  </linearGradient>
  <linearGradient
     id="c"
     gradientUnits="userSpaceOnUse"
     x1="24"
     x2="16"
     y1="60"
     y2="52">
    <stop
       offset="0"
       stop-color="#ccaa00"
       id="stop5" />
    <stop
       offset="1"
       stop-color="#b89900"
       id="stop6" />
  </linearGradient>
  <path
     d="m46 4c-7.731972 0-14 6.268028-14 14s6.268028 14 14 14 14-6.268028 14-14-6.268028-14-14-14zm0 6c5.522848 0 8 2.477152 8 8-.0172 9.535028-17.68672-7.982536-8-8z"
     fill="url(#a)"
     stroke-linecap="round"
     stroke-linejoin="round"
     stroke-width="4"
     id="path6" />
  <path
     d="m22 58-4-4 8-8 4 4"
     fill="none"
     stroke="url(#c)"
     stroke-linecap="round"
     stroke-width="6"
     id="path7" />
  <path
     d="m10 54 26.5-26.5"
     fill="none"
     stroke="url(#b)"
     stroke-linecap="round"
     stroke-linejoin="round"
     stroke-width="8"
     id="path8" />
</svg>
