<?xml version="1.0" encoding="UTF-8" standalone="no"?>
<svg
   height="24"
   width="24"
   version="1.1"
   id="svg967"
   sodipodi:docname="menu_toggle_bookmark2_150.svg"
   inkscape:export-filename="menu_toggle_bookmark2_150.png"
   inkscape:export-xdpi="96"
   inkscape:export-ydpi="96"
   inkscape:version="1.2.2 (732a01da63, 2022-12-09)"
   xmlns:inkscape="http://www.inkscape.org/namespaces/inkscape"
   xmlns:sodipodi="http://sodipodi.sourceforge.net/DTD/sodipodi-0.dtd"
   xmlns="http://www.w3.org/2000/svg"
   xmlns:svg="http://www.w3.org/2000/svg">
  <defs
     id="defs971" />
  <sodipodi:namedview
     id="namedview969"
     pagecolor="#ffffff"
     bordercolor="#666666"
     borderopacity="1.0"
     inkscape:showpageshadow="2"
     inkscape:pageopacity="0.0"
     inkscape:pagecheckerboard="0"
     inkscape:deskcolor="#d1d1d1"
     showgrid="true"
     inkscape:zoom="38.25"
     inkscape:cx="11.594771"
     inkscape:cy="12"
     inkscape:current-layer="svg967">
    <inkscape:grid
       type="xygrid"
       id="grid1343" />
  </sodipodi:namedview>
  <radialGradient
     id="a"
     cx="10.5"
     cy="12"
     gradientUnits="userSpaceOnUse"
     r="6">
    <stop
       offset="0"
       stop-color="#2a7fff"
       id="stop954" />
    <stop
       offset=".69999999"
       stop-color="#4d94ff"
       id="stop956" />
    <stop
       offset="1"
       stop-color="#96bdff"
       id="stop958" />
  </radialGradient>
  <g
     stroke-width=".666667"
     transform="matrix(1.5 0 0 1.5 -3.75 -6.5)"
     id="g965">
    <circle
       cx="10.5"
       cy="12"
       fill="url(#a)"
       r="6"
       id="circle961" />
    <path
       d="m8.4992242 14.692871c.8578056-1.148705 1.7253408-2.290404 2.5769038-3.443603.283807-.43516.49559-1.023579.235081-1.5183039-.253789-.4242246-.849965-.4800541-1.275692-.3175736-.3599274.1477714-.5607085.5317326-.59391.9044625-.3417682-.0033-.6966796.0066-1.0302734-.0049.089228-.7208531.4728458-1.4578216 1.1690521-1.7529707.5820563-.2465354 1.2629783-.2264211 1.8505093-.00748.596857.2139549.986619.8124385 1.021958 1.4341877.08813.7544848-.282094 1.4672368-.736246 2.0430398-.633008.860044-1.266015 1.720087-1.8990234 2.58013h2.6855464v.947266c-1.334635 0-2.6692705 0-4.0039058 0 0-.288086 0-.576172 0-.864258z"
       fill="#fff"
       id="path963" />
  </g>
  <g
     id="g1579">
    <path
       d="M 5.7499999,0.74999998 H 0.74999998 V 5.7499999"
       stroke="#00cc00"
       id="path155"
       style="fill:none;stroke-width:1.5;stroke-linecap:round" />
    <path
       d="M 18.250001,22.249999 H 23.25 V 17.25"
       stroke="#ff0000"
       id="path157"
       style="fill:none;stroke-width:1.5;stroke-linecap:round" />
  </g>
</svg>
