<?xml version="1.0" encoding="UTF-8" standalone="no"?>
<svg
   xmlns:dc="http://purl.org/dc/elements/1.1/"
   xmlns:cc="http://creativecommons.org/ns#"
   xmlns:rdf="http://www.w3.org/1999/02/22-rdf-syntax-ns#"
   xmlns:svg="http://www.w3.org/2000/svg"
   xmlns="http://www.w3.org/2000/svg"
   xmlns:xlink="http://www.w3.org/1999/xlink"
   xmlns:sodipodi="http://sodipodi.sourceforge.net/DTD/sodipodi-0.dtd"
   xmlns:inkscape="http://www.inkscape.org/namespaces/inkscape"
   version="1.1"
   id="svg2"
   width="32"
   height="32"
   viewBox="0 0 32 32"
   sodipodi:docname="lhelp_200.svg"
   inkscape:version="1.0.2 (e86c870879, 2021-01-15, custom)"
   inkscape:export-filename="lhelp_200.png"
   inkscape:export-xdpi="96"
   inkscape:export-ydpi="96">
  <metadata
     id="metadata8">
    <rdf:RDF>
      <cc:Work
         rdf:about="">
        <dc:format>image/svg+xml</dc:format>
        <dc:type
           rdf:resource="http://purl.org/dc/dcmitype/StillImage" />
        <dc:title />
      </cc:Work>
    </rdf:RDF>
  </metadata>
  <defs
     id="defs6">
    <linearGradient
       inkscape:collect="always"
       id="linearGradient1052">
      <stop
         style="stop-color:#cccccc;stop-opacity:1"
         offset="0"
         id="stop1048" />
      <stop
         style="stop-color:#ffffff;stop-opacity:1"
         offset="1"
         id="stop1050" />
    </linearGradient>
    <linearGradient
       inkscape:collect="always"
       id="linearGradient888">
      <stop
         style="stop-color:#de7900;stop-opacity:1"
         offset="0"
         id="stop884" />
      <stop
         style="stop-color:#ffa73e;stop-opacity:1"
         offset="1"
         id="stop886" />
    </linearGradient>
    <linearGradient
       inkscape:collect="always"
       id="linearGradient872">
      <stop
         style="stop-color:#e6e6e6;stop-opacity:1"
         offset="0"
         id="stop868" />
      <stop
         style="stop-color:#999999;stop-opacity:1"
         offset="1"
         id="stop870" />
    </linearGradient>
    <linearGradient
       inkscape:collect="always"
       xlink:href="#linearGradient872"
       id="linearGradient862"
       gradientUnits="userSpaceOnUse"
       x1="-49.009357"
       y1="6.5220971"
       x2="-49.633709"
       y2="3.7157669"
       gradientTransform="translate(77.699999,21.75)" />
    <linearGradient
       inkscape:collect="always"
       xlink:href="#linearGradient888"
       id="linearGradient890"
       x1="-124.5"
       y1="-45"
       x2="-122"
       y2="-45"
       gradientUnits="userSpaceOnUse"
       gradientTransform="translate(127.36373,65.25)" />
    <filter
       inkscape:collect="always"
       style="color-interpolation-filters:sRGB"
       id="filter1025"
       x="-0.030365547"
       width="1.0607311"
       y="-0.054029904"
       height="1.1080598">
      <feGaussianBlur
         inkscape:collect="always"
         stdDeviation="0.3602005"
         id="feGaussianBlur1027" />
    </filter>
    <linearGradient
       inkscape:collect="always"
       xlink:href="#linearGradient1052"
       id="linearGradient1054"
       x1="14"
       y1="25.5"
       x2="14"
       y2="28"
       gradientUnits="userSpaceOnUse"
       gradientTransform="translate(0.29999954,-0.2499995)" />
    <filter
       inkscape:collect="always"
       style="color-interpolation-filters:sRGB"
       id="filter1178"
       x="-0.10268106"
       width="1.2053621"
       y="-0.076199334"
       height="1.1523987">
      <feGaussianBlur
         inkscape:collect="always"
         stdDeviation="0.68460339"
         id="feGaussianBlur1180" />
    </filter>
  </defs>
  <sodipodi:namedview
     pagecolor="#ffffff"
     bordercolor="#666666"
     borderopacity="1"
     objecttolerance="10"
     gridtolerance="10"
     guidetolerance="10"
     inkscape:pageopacity="0"
     inkscape:pageshadow="2"
     inkscape:window-width="640"
     inkscape:window-height="480"
     id="namedview4"
     showgrid="true"
     fit-margin-top="0"
     fit-margin-left="0"
     fit-margin-right="0"
     fit-margin-bottom="0"
     inkscape:snap-global="false"
     showguides="true"
     inkscape:guide-bbox="true"
     inkscape:zoom="28.84375"
     inkscape:cx="16"
     inkscape:cy="16"
     inkscape:current-layer="g10"
     inkscape:document-rotation="0"
     inkscape:snap-bbox="true"
     inkscape:bbox-paths="true"
     inkscape:bbox-nodes="true"
     inkscape:snap-bbox-edge-midpoints="true"
     inkscape:snap-bbox-midpoints="true">
    <inkscape:grid
       type="xygrid"
       id="grid851" />
  </sodipodi:namedview>
  <g
     inkscape:groupmode="layer"
     inkscape:label="Image"
     id="g10">
    <path
       id="path934"
       style="color:#000000;font-style:normal;font-variant:normal;font-weight:normal;font-stretch:normal;font-size:medium;line-height:normal;font-family:sans-serif;font-variant-ligatures:normal;font-variant-position:normal;font-variant-caps:normal;font-variant-numeric:normal;font-variant-alternates:normal;font-variant-east-asian:normal;font-feature-settings:normal;font-variation-settings:normal;text-indent:0;text-align:start;text-decoration:none;text-decoration-line:none;text-decoration-style:solid;text-decoration-color:#000000;letter-spacing:normal;word-spacing:normal;text-transform:none;writing-mode:lr-tb;direction:ltr;text-orientation:mixed;dominant-baseline:auto;baseline-shift:baseline;text-anchor:start;white-space:normal;shape-padding:0;shape-margin:0;inline-size:0;clip-rule:nonzero;display:inline;overflow:visible;visibility:visible;isolation:auto;mix-blend-mode:normal;color-interpolation:sRGB;color-interpolation-filters:linearRGB;solid-color:#000000;solid-opacity:1;vector-effect:none;fill:#999999;fill-opacity:0.994638;fill-rule:nonzero;stroke:none;stroke-width:0.994778;stroke-linecap:round;stroke-linejoin:round;stroke-miterlimit:4;stroke-dasharray:none;stroke-dashoffset:0;stroke-opacity:1;filter:url(#filter1025);color-rendering:auto;image-rendering:auto;shape-rendering:auto;text-rendering:auto;enable-background:accumulate;stop-color:#000000"
       d="m -157.26136,-27.634485 -1.31283,11.298594 c -0.0293,1.835891 1.57019,2.814254 3.11132,2.835938 h 25.41504 l -3.46354,-15.134532 z"
       sodipodi:nodetypes="cccccc"
       transform="matrix(1.0105268,0,0,1,161.91682,44.634485)" />
    <path
       style="fill:url(#linearGradient890);fill-opacity:1;stroke:#b26f25;stroke-width:0.5;stroke-linecap:round;stroke-linejoin:round;stroke-miterlimit:4;stroke-dasharray:none;stroke-opacity:0.994638"
       d="m 2.3999995,27.75 0.6,-10.5 c 0.16003,-1.660027 1.5,-2 3,-2 H 28 l 1.777356,10"
       id="path851"
       sodipodi:nodetypes="ccccc" />
    <path
       style="fill:none;stroke:#b26f24;stroke-width:0.5;stroke-linecap:round;stroke-linejoin:miter;stroke-miterlimit:4;stroke-dasharray:none;stroke-opacity:1"
       d="m 4.9999995,25.25 0.5,-9.71875"
       id="path854"
       sodipodi:nodetypes="cc" />
    <path
       style="fill:url(#linearGradient862);fill-opacity:1;stroke:none;stroke-width:0.5;stroke-linecap:round;stroke-linejoin:round;stroke-miterlimit:4;stroke-dasharray:none;stroke-opacity:1"
       d="M 29.799999,30.25 29,25.25 h -3.5 v 5 z"
       id="path856"
       sodipodi:nodetypes="ccccc" />
    <path
       style="fill:url(#linearGradient1054);fill-opacity:1;stroke:#b16e24;stroke-width:0.5;stroke-linecap:butt;stroke-linejoin:round;stroke-miterlimit:4;stroke-dasharray:none;stroke-opacity:1"
       d="M 29.799999,30.25 H 4.9999995 c -3.5,0 -3.5,-5 0,-5 H 29.777356 c -2.499999,0 -2.477356,5 0.02264,5 z"
       id="path858"
       sodipodi:nodetypes="ccccc" />
    <path
       id="path1186"
       style="fill:#ffff00;fill-opacity:1;stroke:none;stroke-width:0.476808;stroke-linecap:round;stroke-linejoin:round;stroke-miterlimit:4;stroke-dasharray:none;stroke-opacity:1;filter:url(#filter1178)"
       d="m -69.919316,-13.396524 c 0,1.85451 0.533007,4.7188713 1.406444,6.1955025 -0.614045,4.1188511 2.469662,8.5488458 6.222937,8.5488458 3.753275,0 7.476093,-4.9867634 7.180311,-8.5488458 1.056485,-1.565082 2.372779,-4.2230725 2.372872,-6.1883005 2.34e-4,-4.970563 -2.842269,-7.109904 -9.074496,-7.109904 -6.232227,0 -8.108068,3.324551 -8.108068,7.102702 z"
       sodipodi:nodetypes="sczcszs"
       transform="matrix(1.0445229,0,0,1.0527737,80.563264,23.081046)" />
    <path
       id="path1188"
       style="fill:#ff6a00;fill-opacity:1;stroke:none;stroke-width:0.5;stroke-linecap:round;stroke-linejoin:round;stroke-miterlimit:4;stroke-dasharray:none;stroke-opacity:1"
       d="m 17.5,20.5 a 2,2 0 0 1 -2,2 2,2 0 0 1 -2,-2 2,2 0 0 1 2,-2 2,2 0 0 1 2,2 z M 16.428759,2.691643 c 3.035135,0.03399 6.038402,1.926446 6.053341,5.040006 0.0099,2.066396 -1.273463,3.376169 -2.613337,4.560006 -1.353286,1.020985 -2.963791,2.013722 -3.204169,3.461254 -0.05592,1.683395 -2.14542,1.736109 -2.14542,-0.217916 0,-1.317674 0.448274,-2.379597 1.253335,-3.253338 C 17.207777,10.723944 18.454656,9.963949 18.52418,7.856649 18.56978,6.474492 17.064139,5.959066 16.15625,6 14.770044,6.0625 13.464878,6.298895 12.382921,8.172899 11.737817,9.290252 10.305061,8.783158 10.268751,7.891649 10.172321,5.523959 12.674958,2.6496 16.428759,2.691643 Z" />
  </g>
</svg>
