<?xml version="1.0" encoding="UTF-8" standalone="no"?>
<svg
   width="24"
   height="24"
   version="1.1"
   viewBox="0 0 24 24"
   id="svg5"
   sodipodi:docname="tmysql50connection.svg"
   inkscape:version="1.3.2 (091e20e, 2023-11-25, custom)"
   inkscape:export-filename="tmysql50connection.png"
   inkscape:export-xdpi="96"
   inkscape:export-ydpi="96"
   xmlns:inkscape="http://www.inkscape.org/namespaces/inkscape"
   xmlns:sodipodi="http://sodipodi.sourceforge.net/DTD/sodipodi-0.dtd"
   xmlns="http://www.w3.org/2000/svg"
   xmlns:svg="http://www.w3.org/2000/svg">
  <defs
     id="defs5" />
  <sodipodi:namedview
     id="namedview5"
     pagecolor="#ffffff"
     bordercolor="#000000"
     borderopacity="0.25"
     inkscape:showpageshadow="2"
     inkscape:pageopacity="0.0"
     inkscape:pagecheckerboard="0"
     inkscape:deskcolor="#d1d1d1"
     showgrid="true"
     inkscape:current-layer="svg5">
    <inkscape:grid
       id="grid5"
       units="px"
       originx="0"
       originy="0"
       spacingx="0.5"
       spacingy="0.5"
       empcolor="#0099e5"
       empopacity="0.30196078"
       color="#0099e5"
       opacity="0.14901961"
       empspacing="2"
       dotted="false"
       gridanglex="30"
       gridanglez="30"
       visible="true" />
  </sodipodi:namedview>
  <path
     d="m 13,2.5 h 2.5 v -2 h 4 V 3"
     fill="none"
     stroke="#2a7efe"
     stroke-linejoin="round"
     stroke-width="1px"
     id="path1" />
  <path
     d="m 24,2.5 h -2.5 v 2 h -4 V 2"
     fill="none"
     stroke="#ff0000"
     stroke-linejoin="round"
     stroke-width="1px"
     id="path2" />
  <path
     d="M 1.1764338,1.0055 C 0.8917046,1.0385 0.58471402,1.1475 0.40596989,1.2998 0.1246004,1.5393 -0.03110352,1.9554 0.00520745,2.3705 0.04611725,2.8383 0.29382907,3.229 1.1570032,4.1871 c 0.8049373,0.8935 0.8909711,1.0165 1.1136441,1.591 0.5045516,1.3018 1.318653,2.7475 1.8039771,3.2034 0.3278481,0.3081 0.3792069,0.4008 0.3021912,0.5471 -0.083188,0.1578 -0.3227301,1.7009 -0.3482183,2.2433 -0.025498,0.5429 0.1234274,1.7613 0.2750715,2.2502 0.2959754,0.9544 0.6933927,1.6286 1.2229226,2.075 0.5123795,0.4318 0.9027733,0.4856 1.3203942,0.1816 0.2274926,-0.1655 0.311383,-0.4662 0.3802462,-1.3631 0.034321,-0.4471 0.07341,-0.8346 0.086806,-0.8612 0.013358,-0.026 0.212898,0.2542 0.4433811,0.6236 0.2304747,0.3693 0.4932238,0.7542 0.5839017,0.8553 0.2667622,0.2975 1.1255329,1.022 1.5914002,1.3427 0.2374202,0.1634 0.6033902,0.4341 0.8132642,0.6014 0.592475,0.4725 0.678062,0.4555 0.111798,-0.022 C 9.813637,16.5748 8.3163256,14.5358 7.4575282,12.8253 7.3109221,12.5332 7.1696765,12.29 7.1436318,12.2848 c -0.064526,-0.013 -0.4707735,0.6205 -0.5954466,0.9286 -0.1462431,0.3613 -0.2158429,0.8348 -0.244068,1.6609 -0.013682,0.3995 -0.046606,0.7438 -0.07314,0.7648 C 6.1658822,15.6901 5.9462939,15.5941 5.764916,15.4335 5.6038662,15.2911 5.3351518,14.8421 5.1288124,14.3708 4.8150051,13.6541 4.6104261,12.2781 4.6864601,11.3959 4.7071571,11.1555 4.8080353,10.6131 4.9106073,10.19 5.1709715,9.1165 5.1596823,9.0573 4.5965689,8.5416 4.119025,8.1044 3.7537884,7.4921 3.201664,6.2025 2.9603308,5.6388 2.6821192,5.0479 2.5833604,4.8893 2.3847904,4.5704 1.7027047,3.7425 1.2907009,3.3205 0.91263757,2.9329 0.66805766,2.4971 0.68035817,2.2329 0.69329847,1.9549 0.77997287,1.8684 1.0999683,1.8147 1.3258974,1.7767 1.449538,1.7947 1.8594136,1.9164 2.5600788,2.1268 3.2281067,2.417 3.5836081,2.6655 3.9066997,2.8913 3.9740351,2.9428 4.0712017,3.005 4.1926167,3.0043 4.3686648,2.995 4.979592,2.988 5.9423596,2.972 6.2546457,3.031 7.2337667,3.4122 c 2.6454782,1.0303 5.2723283,3.3619 6.5150793,5.783 0.140958,0.2747 0.493401,0.9118 0.783253,1.4156 0.289861,0.5042 0.687832,1.2023 0.884371,1.5515 0.629672,1.1193 0.990952,1.5886 1.327769,1.7256 0.115812,0.047 0.558712,0.1688 0.984281,0.2705 0.425574,0.1018 0.925973,0.2389 1.111972,0.3048 0.415886,0.1473 2.75099,1.4459 2.916684,1.6221 l 0.120121,0.1279 -0.643335,0.091 c -0.353825,0.05 -0.855663,0.1432 -1.114943,0.2081 -0.578035,0.1428 -1.65575,0.5951 -1.707666,0.716 -0.05936,0.1385 0.313253,0.7194 0.68038,1.0606 0.530457,0.493 1.329102,0.9492 2.365809,1.3515 0.901729,0.3499 1.669788,0.7541 2.242882,1.1804 0.149578,0.1114 0.281628,0.1911 0.2934,0.1771 0.05738,-0.068 -0.29178,-0.4895 -0.768734,-0.9281 -0.997996,-0.9179 -1.376387,-1.1852 -2.314017,-1.6347 -0.568413,-0.2725 -1.194128,-0.7161 -1.205121,-0.8545 -0.0071,-0.088 1.112018,-0.4662 1.797257,-0.6067 0.591018,-0.1211 1.359123,-0.4049 1.350925,-0.4985 -0.01075,-0.1231 -0.70849,-0.8061 -1.127695,-1.1039 -0.539409,-0.3835 -1.515653,-0.9888 -2.084188,-1.2923 -0.392936,-0.2098 -1.934716,-0.7996 -2.275404,-0.8706 -0.05891,-0.013 -0.173785,-0.08 -0.255279,-0.1523 C 16.865264,12.8404 15.513175,10.5728 14.654838,8.9361 14.166769,8.0056 13.831493,7.5145 13.104263,6.6652 11.846931,5.197 10.54711,4.1706 8.629104,3.1313 7.6226231,2.5859 7.2540252,2.4455 6.4320291,2.2934 5.9270541,2.2004 5.6287761,2.1758 5.1574937,2.1899 4.8191179,2.2009 4.5285336,2.1739 4.437105,2.1659 4.2867704,2.0699 4.2104267,2.0382 4.0618994,1.9345 3.3498008,1.4372 2.2097069,1.0415 1.3685886,1 1.3067856,1 1.2421768,1 1.1764432,1.01 Z M 5.0592709,4.4574 C 4.6416064,4.5014 4.6268826,4.5354 4.9179788,4.8224 5.0599672,4.9618 5.2729986,5.2423 5.3913305,5.4454 5.5207059,5.6679 5.6299462,5.8039 5.6653329,5.7869 5.7636089,5.7399 5.9086099,5.3648 5.8938787,5.1965 5.8588667,4.7961 5.4339006,4.4198 5.0592709,4.4574 Z"
     fill="#2a7efe"
     id="path3" />
  <path
     d="m 6.9999995,18.4 c 0.683334,0 1.233454,0.5522 1.233454,1.2381 v 2.7238 c 0,0.6859 -0.55012,1.2381 -1.233454,1.2381 -0.683333,0 -1.233453,-0.5522 -1.233453,-1.2381 v -2.7238 c 0,-0.6859 0.55012,-1.2381 1.233453,-1.2381 z"
     fill="none"
     stroke="#ff0000"
     stroke-linecap="round"
     stroke-linejoin="round"
     stroke-width="0.8"
     id="path4" />
  <path
     d="m 3.866907,21.4952 c 0,-0.6837 -0.552236,-1.2381 -1.233454,-1.2381 C 2.057709,20.2571 1.56321,20.5877 1.4,21 M 3.866907,18.4 H 1.4 V 21 m 2.466907,0.619 v 0.6191 m 0,0.1238 C 3.866907,23.0457 3.314671,23.6 2.633453,23.6 2.057709,23.6 1.63135,23.3926 1.4,22.8571"
     fill="none"
     stroke="#ff0000"
     stroke-linecap="round"
     stroke-linejoin="round"
     stroke-width="0.8"
     id="path5" />
</svg>
