<?xml version="1.0" encoding="UTF-8" standalone="no"?>
<svg
   height="24"
   width="24"
   version="1.1"
   id="svg272"
   sodipodi:docname="Folder_17_24.svg"
   inkscape:export-filename="Folder_17_24.png"
   inkscape:export-xdpi="96"
   inkscape:export-ydpi="96"
   inkscape:version="1.2.2 (732a01da63, 2022-12-09)"
   xmlns:inkscape="http://www.inkscape.org/namespaces/inkscape"
   xmlns:sodipodi="http://sodipodi.sourceforge.net/DTD/sodipodi-0.dtd"
   xmlns="http://www.w3.org/2000/svg"
   xmlns:svg="http://www.w3.org/2000/svg">
  <defs
     id="defs276" />
  <sodipodi:namedview
     id="namedview274"
     pagecolor="#ffffff"
     bordercolor="#000000"
     borderopacity="0.25"
     inkscape:showpageshadow="2"
     inkscape:pageopacity="0.0"
     inkscape:pagecheckerboard="0"
     inkscape:deskcolor="#d1d1d1"
     showgrid="true"
     inkscape:zoom="37.916667"
     inkscape:cx="8.254945"
     inkscape:cy="12"
     inkscape:current-layer="svg272">
    <inkscape:grid
       type="xygrid"
       id="grid913" />
  </sodipodi:namedview>
  <g
     stroke="#00aad4"
     stroke-linejoin="round"
     stroke-width="1.2"
     id="g270">
    <path
       d="m 2.4,1.6 c -1,0 -1.79999998,0.9263704 -1.79999998,2 V 11 H 23.4 V 5.4 C 23.4,4.5525866 22.442079,3.6 21.6,3.6 H 9 c 0,-1 -0.8,-2 -1.8,-2 z"
       fill="#ebfcff"
       id="path266" />
    <path
       d="M 2.1,9.6 H 8 c 0,-0.966845 0.573981,-2 1.5,-2 h 12 c 0.84208,0 1.9,1.152587 1.9,2 v 9.3 c 0,0.847415 -0.65792,1.499555 -1.5,1.499555 H 2.1 c -0.84208,0 -1.49999998,-0.65214 -1.49999998,-1.499555 l -10e-9,-7.8 C 0.60000001,10.252586 1.25792,9.6 2.1,9.6 Z"
       fill="#c2f3ff"
       id="path268"
       sodipodi:nodetypes="scsssssssss" />
  </g>
  <circle
     cx="17.5"
     cy="17.5"
     r="5.8999996"
     stroke-dashoffset="1.49998"
     stroke-linejoin="round"
     stroke-width="1.2"
     transform="matrix(0,1,1,0,0,0)"
     id="circle274"
     style="fill:#ffffff;stroke:#00aad4;stroke-linecap:round" />
  <path
     d="m 17.5,14.5 v 6"
     id="path276"
     style="fill:none;stroke:#00aad4;stroke-width:1.2;stroke-linecap:round;stroke-dasharray:none"
     sodipodi:nodetypes="cc" />
  <path
     d="m 20.5,17.5 h -6"
     id="path278"
     style="fill:none;stroke:#00aad4;stroke-width:1.2;stroke-linecap:round;stroke-dasharray:none"
     sodipodi:nodetypes="cc" />
</svg>
