<?xml version="1.0" encoding="UTF-8" standalone="no"?>
<svg
   width="36"
   height="36"
   version="1.1"
   viewBox="0 0 36 36"
   id="svg12"
   sodipodi:docname="tsqlquery_150.svg"
   inkscape:version="1.3.2 (091e20e, 2023-11-25, custom)"
   xmlns:inkscape="http://www.inkscape.org/namespaces/inkscape"
   xmlns:sodipodi="http://sodipodi.sourceforge.net/DTD/sodipodi-0.dtd"
   xmlns:xlink="http://www.w3.org/1999/xlink"
   xmlns="http://www.w3.org/2000/svg"
   xmlns:svg="http://www.w3.org/2000/svg">
  <sodipodi:namedview
     id="namedview12"
     pagecolor="#ffffff"
     bordercolor="#000000"
     borderopacity="0.25"
     inkscape:showpageshadow="2"
     inkscape:pageopacity="0.0"
     inkscape:pagecheckerboard="0"
     inkscape:deskcolor="#d1d1d1"
     showgrid="true"
     inkscape:current-layer="svg12">
    <inkscape:grid
       id="grid14"
       units="px"
       originx="0"
       originy="0"
       spacingx="0.5"
       spacingy="0.5"
       empcolor="#0099e5"
       empopacity="0.30196078"
       color="#0099e5"
       opacity="0.14901961"
       empspacing="2"
       dotted="false"
       gridanglex="30"
       gridanglez="30"
       visible="true" />
  </sodipodi:namedview>
  <defs
     id="defs3">
    <linearGradient
       id="b"
       x1="3"
       x2="21"
       y1="3"
       y2="3"
       gradientTransform="translate(-4.2372131e-8,-2)"
       gradientUnits="userSpaceOnUse"
       xlink:href="#a" />
    <linearGradient
       id="a"
       x1="3"
       x2="21"
       y1="3"
       y2="3"
       gradientUnits="userSpaceOnUse">
      <stop
         stop-color="#4276c4"
         offset="0"
         id="stop1" />
      <stop
         stop-color="#80b3ff"
         offset=".3333333"
         id="stop2" />
      <stop
         stop-color="#04a"
         offset="1"
         id="stop3" />
    </linearGradient>
    <linearGradient
       inkscape:collect="always"
       xlink:href="#a"
       id="linearGradient12"
       gradientUnits="userSpaceOnUse"
       gradientTransform="translate(-4.2372131e-8,-2)"
       x1="3"
       y1="3"
       x2="21"
       y2="3" />
    <linearGradient
       inkscape:collect="always"
       xlink:href="#a"
       id="linearGradient13"
       gradientUnits="userSpaceOnUse"
       gradientTransform="translate(-4.2372131e-8,-2)"
       x1="3"
       y1="3"
       x2="21"
       y2="3" />
    <linearGradient
       inkscape:collect="always"
       xlink:href="#a"
       id="linearGradient14"
       gradientUnits="userSpaceOnUse"
       gradientTransform="translate(-4.2372131e-8,-2)"
       x1="3"
       y1="3"
       x2="21"
       y2="3" />
  </defs>
  <path
     d="m 28.83005,14.336 h -1.992187 q -0.0078,-0.4298 -0.0078,-0.5235 0,-0.9687 0.320311,-1.5938 0.320314,-0.6249 1.281251,-1.4062 0.960937,-0.7812 1.148437,-1.0235 0.289062,-0.3828 0.289062,-0.8437 0,-0.6405 -0.515625,-1.0937 -0.507811,-0.4609 -1.374999,-0.4609 -0.835938,0 -1.398438,0.4765 -0.5625,0.4766 -0.773437,1.4531 L 23.791,9.0704 q 0.08593,-1.3985 1.1875,-2.3751 1.109375,-0.9765 2.90625,-0.9765 1.890624,0 3.007812,0.9922 1.117188,0.9843 1.117188,2.2968 0,0.7266 -0.414063,1.3751 -0.406249,0.6484 -1.75,1.7656 -0.695312,0.5781 -0.867188,0.9296 -0.164062,0.3516 -0.14844,1.2579 z"
     id="path3"
     style="fill:#d40000" />
  <path
     d="m 26.876488,18 v -2.1952 h 2.195313 V 18 Z"
     id="path4"
     style="fill:#d40000" />
  <rect
     x="2"
     y="21.999983"
     width="29"
     height="14"
     ry="2"
     fill="#739bdf"
     fill-rule="evenodd"
     style="paint-order:normal"
     id="rect4" />
  <ellipse
     cx="12"
     cy="18.249983"
     rx="7.6500001"
     ry="2.4000001"
     fill="none"
     fill-rule="evenodd"
     stroke="url(#b)"
     stroke-linecap="round"
     stroke-linejoin="round"
     stroke-width="2.7"
     id="ellipse4"
     style="stroke:url(#linearGradient12)" />
  <ellipse
     cx="12"
     cy="16.300032"
     rx="7.3499999"
     ry="2.0999999"
     fill="none"
     fill-rule="evenodd"
     stroke="#ffffff"
     stroke-linecap="round"
     stroke-linejoin="round"
     stroke-width="1.8"
     id="ellipse5" />
  <ellipse
     cx="12"
     cy="13.749983"
     rx="7.6500001"
     ry="2.4000001"
     fill="none"
     fill-rule="evenodd"
     stroke="url(#b)"
     stroke-linecap="round"
     stroke-linejoin="round"
     stroke-width="2.7"
     id="ellipse6"
     style="stroke:url(#linearGradient13)" />
  <ellipse
     cx="12"
     cy="11.800032"
     rx="7.3499999"
     ry="2.0999999"
     fill="none"
     fill-rule="evenodd"
     stroke="#ffffff"
     stroke-linecap="round"
     stroke-linejoin="round"
     stroke-width="1.8"
     id="ellipse7" />
  <ellipse
     cx="12"
     cy="9.2499828"
     rx="7.6500001"
     ry="2.4000001"
     fill="none"
     fill-rule="evenodd"
     stroke="url(#b)"
     stroke-linecap="round"
     stroke-linejoin="round"
     stroke-width="2.7"
     id="ellipse8"
     style="stroke:url(#linearGradient14)" />
  <ellipse
     cx="12"
     cy="7.2999706"
     rx="7.3499999"
     ry="2.0999999"
     fill="none"
     fill-rule="evenodd"
     stroke="#ffffff"
     stroke-linecap="round"
     stroke-linejoin="round"
     stroke-width="1.8"
     id="ellipse9" />
  <ellipse
     cx="12"
     cy="4.7499828"
     rx="8.1000004"
     ry="2.8499999"
     fill="#80b3ff"
     fill-rule="evenodd"
     stroke="url(#b)"
     stroke-linecap="round"
     stroke-linejoin="round"
     stroke-width="1.8"
     id="ellipse10"
     style="stroke:url(#b)" />
  <path
     d="m 22.469,25.55 v 6.9 h 3.888467"
     fill="none"
     stroke="#ffffff"
     stroke-linecap="round"
     stroke-linejoin="round"
     stroke-width="1.1"
     id="path10" />
  <path
     d="m 17.87226,30.6429 2.45706,1.8072 M 17.05323,25.55 c 1.27047,0 2.29326,0.9455 2.29326,2.1199 v 2.6602 c 0,1.1745 -1.02279,2.1199 -2.29326,2.1199 -1.27046,0 -2.29326,-0.9454 -2.29326,-2.1199 v -2.6602 c 0,-1.1744 1.0228,-2.1199 2.29326,-2.1199 z"
     fill="none"
     stroke="#ffffff"
     stroke-linecap="round"
     stroke-linejoin="round"
     stroke-width="1.1"
     id="path11" />
  <path
     d="M 12.02795,26.0003 C 11.58733,25.6968 10.93307,25.55 10.15143,25.55 c -1.10459,0 -2.10971,0.5805 -2.10971,1.7874 0,0.9454 0.79799,1.3341 2.10971,1.5616 1.82647,0.3167 2.1097,0.9323 2.1097,1.7637 0,1.5021 -1.25088,1.7873 -2.1097,1.7873 -0.66674,0 -1.35108,-0.081 -2.20943,-0.5254"
     fill="none"
     stroke="#ffffff"
     stroke-linecap="round"
     stroke-linejoin="round"
     stroke-width="1.1"
     id="path12" />
</svg>
