<svg width="16" height="16" version="1.0" xmlns="http://www.w3.org/2000/svg">
 <defs>
  <radialGradient id="a" cx="8" cy="7.5" r="6" gradientTransform="matrix(1.1666667 0 0 1.1666667 -1.3333335 -.74999998)" gradientUnits="userSpaceOnUse">
   <stop stop-color="#2a7fff" offset="0"/>
   <stop stop-color="#4d94ff" offset=".69999999"/>
   <stop stop-color="#96bdff" offset="1"/>
  </radialGradient>
 </defs>
 <g>
  <circle cx="8" cy="8" r="7" fill="url(#a)"/>
  <path d="m5 6.5 3 3.5 3-3.5" fill="none" stroke="#ffffff" stroke-linecap="round" stroke-linejoin="round" stroke-width="1.8"/>
 </g>
</svg>
