<svg width="32" height="32" version="1.1" xmlns="http://www.w3.org/2000/svg">
 <g fill="none" stroke-linecap="round">
  <path d="m14 25.999986h10" stroke="#ffffff" stroke-width="6"/>
  <rect x="21" y="22.999985" width="8" height="6.00001" rx="3" ry="2.5714321" stroke="#ffffff" stroke-linejoin="round" stroke-width="6"/>
  <rect x="9" y="22.99999" width="8" height="6.00001" rx="3" ry="2.5714321" stroke="#ffffff" stroke-linejoin="round" stroke-width="6"/>
  <path d="m14 25.999986h10" stroke="#00aad4" stroke-width="2.4"/>
  <rect x="21" y="22.999985" width="8" height="6.00001" rx="3" ry="2.5714321" stroke="#00aad4" stroke-linejoin="round" stroke-width="2"/>
  <rect x="9" y="22.999985" width="8" height="6.00001" rx="3" ry="2.5714321" stroke="#00aad4" stroke-linejoin="round" stroke-width="2"/>
 </g>
</svg>
