<svg width="32" height="32" version="1.1" xmlns="http://www.w3.org/2000/svg">
 <g transform="matrix(2.0000645 0 0 2.0000645 -1.0000748 -.00177576)" stroke-linecap="round">
  <path transform="matrix(1.0408423,0,0,1.0415198,24.632819,9.9739195)" d="m-9.2550021 4.1055513-12.489996-1e-7 6.245225-11.281526z" fill="#fff6d5" stroke="#d4aa00" stroke-dashoffset="1.49998" stroke-linejoin="round" stroke-width="1.44068"/>
  <path d="M 8.4997633,6.7506702 8.5,9.9999997" fill="none" stroke="#aa8800" stroke-width="1px"/>
  <path d="M 8.4997633,11.750509 8.5,12" fill="none" stroke="#aa8800" stroke-width="1px"/>
 </g>
</svg>
