<?xml version="1.0" encoding="UTF-8" standalone="no"?>
<svg
   height="36"
   width="36"
   version="1.1"
   id="svg8"
   sodipodi:docname="Arrow_04_36.svg"
   inkscape:export-filename="Arrow_04_36.png"
   inkscape:export-xdpi="96"
   inkscape:export-ydpi="96"
   inkscape:version="1.2 (dc2aedaf03, 2022-05-15)"
   xmlns:inkscape="http://www.inkscape.org/namespaces/inkscape"
   xmlns:sodipodi="http://sodipodi.sourceforge.net/DTD/sodipodi-0.dtd"
   xmlns="http://www.w3.org/2000/svg"
   xmlns:svg="http://www.w3.org/2000/svg">
  <defs
     id="defs12" />
  <sodipodi:namedview
     id="namedview10"
     pagecolor="#ffffff"
     bordercolor="#666666"
     borderopacity="1.0"
     inkscape:pageshadow="2"
     inkscape:pageopacity="0.0"
     inkscape:pagecheckerboard="0"
     inkscape:deskcolor="#d1d1d1"
     showgrid="true"
     inkscape:zoom="25.5"
     inkscape:cx="15.392157"
     inkscape:cy="18"
     inkscape:current-layer="svg8"
     inkscape:showpageshadow="2">
    <inkscape:grid
       type="xygrid"
       id="grid137" />
  </sodipodi:namedview>
  <g
     fill="none"
     stroke="#00aad4"
     stroke-linecap="round"
     stroke-linejoin="round"
     stroke-width="2.4"
     transform="matrix(0,1.5000033,-1.5000033,0,36.000002,1.5000265)"
     id="g6">
    <path
       d="M 0.95000828,12 H 20.000008"
       id="path2" />
    <path
       d="m 14.300008,5.25 6.75,6.75 -6.75,6.75"
       id="path4" />
  </g>
</svg>
