<?xml version="1.0" encoding="UTF-8" standalone="no"?>
<svg
   width="48"
   height="48"
   version="1.1"
   viewBox="0 0 48 48"
   id="svg8"
   sodipodi:docname="tlazintegeredit_200.svg"
   inkscape:version="1.3.2 (091e20e, 2023-11-25, custom)"
   xmlns:inkscape="http://www.inkscape.org/namespaces/inkscape"
   xmlns:sodipodi="http://sodipodi.sourceforge.net/DTD/sodipodi-0.dtd"
   xmlns="http://www.w3.org/2000/svg"
   xmlns:svg="http://www.w3.org/2000/svg">
  <defs
     id="defs8" />
  <sodipodi:namedview
     id="namedview8"
     pagecolor="#ffffff"
     bordercolor="#000000"
     borderopacity="0.25"
     inkscape:showpageshadow="2"
     inkscape:pageopacity="0.0"
     inkscape:pagecheckerboard="0"
     inkscape:deskcolor="#d1d1d1"
     showgrid="true"
     inkscape:current-layer="svg8">
    <inkscape:grid
       id="grid8"
       units="px"
       originx="0"
       originy="0"
       spacingx="0.5"
       spacingy="0.5"
       empcolor="#0099e5"
       empopacity="0.30196078"
       color="#0099e5"
       opacity="0.14901961"
       empspacing="2"
       dotted="false"
       gridanglex="30"
       gridanglez="30"
       visible="true" />
  </sodipodi:namedview>
  <rect
     x=".5"
     y="12.5"
     width="47"
     height="23"
     fill="#ffffff"
     stroke="#2a7efe"
     stroke-linecap="round"
     stroke-linejoin="round"
     style="paint-order:normal"
     id="rect1" />
  <path
     d="m41 18v12"
     fill="none"
     stroke="#4d4d4d"
     stroke-linecap="round"
     stroke-width="1.4"
     id="path1" />
  <path
     d="m39 16.7 2 1 2-1"
     fill="none"
     stroke="#4d4d4d"
     stroke-linecap="round"
     stroke-width="1.4"
     id="path2" />
  <path
     d="m39 31.299624 2-1 2 1"
     fill="none"
     stroke="#4d4d4d"
     stroke-linecap="round"
     stroke-width="1.4"
     id="path3" />
  <path
     d="M 25.949735,29.049921 V 18.95 L 23.627,20.436082"
     fill="none"
     stroke="#4d4d4d"
     stroke-linecap="round"
     stroke-linejoin="round"
     stroke-width="1.9"
     id="path4" />
  <path
     d="m32.455519 18.95c1.332657 0 2.405519 1.072524 2.405519 2.404762v5.290476c0 1.332238-1.072862 2.404762-2.405519 2.404762-1.332658 0-2.405519-1.072524-2.405519-2.404762v-5.290476c0-1.332238 1.072861-2.404762 2.405519-2.404762z"
     fill="none"
     stroke="#4d4d4d"
     stroke-linecap="round"
     stroke-linejoin="round"
     stroke-width="1.9"
     id="path5" />
  <path
     d="m20.05 29.049921v-10.099921l-2.322735 1.486082"
     fill="none"
     stroke="#4d4d4d"
     stroke-linecap="round"
     stroke-linejoin="round"
     stroke-width="1.9"
     id="path6" />
  <path
     d="m7.200001 29.05 6.599998-10.1"
     fill="none"
     stroke="#4d4d4d"
     stroke-linecap="round"
     stroke-linejoin="round"
     stroke-width="1.9"
     id="path7" />
  <circle
     cx="14"
     cy="27.1"
     r="1.7"
     fill="none"
     stroke="#4d4d4d"
     stroke-linejoin="round"
     stroke-width="1.4"
     id="circle7" />
  <circle
     cx="7"
     cy="20.9"
     r="1.7"
     fill="none"
     stroke="#4d4d4d"
     stroke-linejoin="round"
     stroke-width="1.4"
     id="circle8" />
</svg>
