<?xml version="1.0" encoding="UTF-8" standalone="no"?>
<svg
   height="12"
   width="12"
   version="1.1"
   id="svg151"
   sodipodi:docname="state_error_75.svg"
   inkscape:export-filename="state_error_75.png"
   inkscape:export-xdpi="96"
   inkscape:export-ydpi="96"
   inkscape:version="1.2.2 (732a01da63, 2022-12-09)"
   xmlns:inkscape="http://www.inkscape.org/namespaces/inkscape"
   xmlns:sodipodi="http://sodipodi.sourceforge.net/DTD/sodipodi-0.dtd"
   xmlns="http://www.w3.org/2000/svg"
   xmlns:svg="http://www.w3.org/2000/svg">
  <defs
     id="defs155" />
  <sodipodi:namedview
     id="namedview153"
     pagecolor="#ffffff"
     bordercolor="#666666"
     borderopacity="1.0"
     inkscape:showpageshadow="2"
     inkscape:pageopacity="0.0"
     inkscape:pagecheckerboard="0"
     inkscape:deskcolor="#d1d1d1"
     showgrid="true"
     inkscape:zoom="76.5"
     inkscape:cx="5.9934641"
     inkscape:cy="6"
     inkscape:current-layer="svg151">
    <inkscape:grid
       type="xygrid"
       id="grid810" />
  </sodipodi:namedview>
  <g
     fill-rule="evenodd"
     stroke-width="1.33333"
     transform="scale(.75)"
     id="g149">
    <circle
       cx="8"
       cy="8"
       fill="#f00"
       r="8"
       id="circle141" />
    <g
       fill="#fff"
       stroke-width="1.00091"
       transform="matrix(.66660296 0 0 .66552018 -2.665648 -2.639151)"
       id="g147">
      <path
         d="m15.970703 7.9726562c-1.103799.0161762-1.985802.9235292-1.970703 2.0273438l.5 6.5c-.03825 2.704645 3.03825 2.704645 3 0l.5-6.5c.015413-1.1267609-.902551-2.0438418-2.029297-2.0273438z"
         id="path143" />
      <circle
         cx="16"
         cy="22"
         r="2"
         id="circle145" />
    </g>
  </g>
</svg>
