<svg width="16" height="16" version="1.0" xmlns="http://www.w3.org/2000/svg">
 <defs>
  <linearGradient id="a" x1="3.25" x2="12.75" y1="3.25" y2="12.75" gradientUnits="userSpaceOnUse">
   <stop stop-color="#ffd5d5" offset="0"/>
   <stop stop-color="#ff0000" offset="1"/>
  </linearGradient>
 </defs>
 <rect x="3.25" y="3.25" width="9.5" height="9.5" fill="url(#a)" stroke="#aa0000" stroke-linecap="round" stroke-linejoin="round" stroke-width=".5" style="paint-order:normal"/>
</svg>
