<?xml version="1.0" encoding="UTF-8" standalone="no"?>
<svg
   height="16"
   width="16"
   version="1.1"
   id="svg155"
   sodipodi:docname="Sort_01_16.svg"
   inkscape:export-filename="Sort_01_16.png"
   inkscape:export-xdpi="96"
   inkscape:export-ydpi="96"
   inkscape:version="1.2-beta (1b65182ce9, 2022-04-05)"
   xmlns:inkscape="http://www.inkscape.org/namespaces/inkscape"
   xmlns:sodipodi="http://sodipodi.sourceforge.net/DTD/sodipodi-0.dtd"
   xmlns="http://www.w3.org/2000/svg"
   xmlns:svg="http://www.w3.org/2000/svg">
  <defs
     id="defs159" />
  <sodipodi:namedview
     id="namedview157"
     pagecolor="#ffffff"
     bordercolor="#666666"
     borderopacity="1.0"
     inkscape:pageshadow="2"
     inkscape:pageopacity="0.0"
     inkscape:pagecheckerboard="0"
     inkscape:deskcolor="#d1d1d1"
     showgrid="true"
     inkscape:zoom="57.375"
     inkscape:cx="8"
     inkscape:cy="8"
     inkscape:current-layer="svg155">
    <inkscape:grid
       type="xygrid"
       id="grid885" />
  </sodipodi:namedview>
  <linearGradient
     id="a"
     gradientUnits="userSpaceOnUse"
     x1="12"
     x2="12"
     y1="11.999999"
     y2="1.499999">
    <stop
       offset="0"
       stop-color="#006cbd"
       id="stop144" />
    <stop
       offset="1"
       stop-color="#6bc0ff"
       id="stop146" />
  </linearGradient>
  <g
     id="g1040">
    <path
       d="m8.4237758 7h-1.4674478l-.5833333-1.6391062h-2.6705729l-.5514322 1.6391062h-1.4309896l2.6022135-7.21600443h1.4264322zm-2.4837238-2.8548995-.9205729-2.6776986-.9023437 2.6776986z"
       fill="#177ecb"
       transform="matrix(.97006591 0 0 .97006591 .131487 .209539)"
       id="path149" />
    <path
       d="M 2.4868851,14.999999 V 13.783202 L 6.1168698,9.3523927 H 2.7545053 V 8.2221844 h 4.8899738 v 1.0481771 l -3.6674854,4.6039865 3.954868,0 v 1.125651 z"
       fill="#d40000"
       transform="matrix(1.1019331,0,0,1.0327812,-0.740381,-0.491717)"
       id="path151"
       sodipodi:nodetypes="ccccccccccc" />
    <path
       d="m11 .99999917v9.00000003h-2l3 3.9999998 3-3.9999998h-2v-9.00000003z"
       fill="url(#a)"
       fill-rule="evenodd"
       id="path153" />
  </g>
</svg>
