<?xml version="1.0" encoding="UTF-8" standalone="no"?>
<svg
   height="48"
   width="48"
   version="1.1"
   id="svg570"
   sodipodi:docname="Folder_14_48.svg"
   inkscape:export-filename="Folder_14_48.png"
   inkscape:export-xdpi="96"
   inkscape:export-ydpi="96"
   inkscape:version="1.2.1 (9c6d41e410, 2022-07-14)"
   xml:space="preserve"
   xmlns:inkscape="http://www.inkscape.org/namespaces/inkscape"
   xmlns:sodipodi="http://sodipodi.sourceforge.net/DTD/sodipodi-0.dtd"
   xmlns="http://www.w3.org/2000/svg"
   xmlns:svg="http://www.w3.org/2000/svg"><defs
     id="defs574"><radialGradient
       id="a-0"
       cx="12.1"
       cy="10.900001"
       gradientTransform="matrix(0,3.0437711,-3.0437707,5e-8,64.568011,-5.438724)"
       gradientUnits="userSpaceOnUse"
       r="4.5"><stop
         offset="0"
         stop-color="#ff7f2a"
         id="stop1178" /><stop
         offset="1"
         stop-color="#d45500"
         id="stop1180" /></radialGradient><linearGradient
       id="a"
       gradientUnits="userSpaceOnUse"
       x1="42.679054"
       x2="28.320946"
       y1="42.679054"
       y2="28.320946"
       gradientTransform="matrix(1.0708235,0,0,1.0708235,-3.5142345,-3.514232)"><stop
         offset="0"
         stop-color="#009600"
         id="stop1250" /><stop
         offset="1"
         stop-color="#6edb39"
         id="stop1252" /></linearGradient></defs><sodipodi:namedview
     id="namedview572"
     pagecolor="#ffffff"
     bordercolor="#666666"
     borderopacity="1.0"
     inkscape:pageshadow="2"
     inkscape:pageopacity="0.0"
     inkscape:pagecheckerboard="0"
     inkscape:deskcolor="#d1d1d1"
     showgrid="true"
     inkscape:zoom="19.125"
     inkscape:cx="23.189542"
     inkscape:cy="24"
     inkscape:current-layer="g1008"
     inkscape:showpageshadow="2"><inkscape:grid
       type="xygrid"
       id="grid797" /></sodipodi:namedview><g
     id="g1008"
     transform="translate(0,1.9999983)"><g
       id="g1576"
       transform="translate(0,-2.000005)"><path
         d="M 1.500262,16.500002 1.499995,8.4999837 c 0,-2.4999891 1.50026,-3.999982 4.000248,-3.999982 h 6.999735 c 2.999986,0 4.000044,1.4999929 4.000044,3.999982 h 30.00024 v 8.0000183"
         id="path8"
         style="fill:#fff3cc;fill-opacity:1;stroke:#f4c025;stroke-width:2.99999;stroke-linecap:round;stroke-linejoin:round"
         sodipodi:nodetypes="ccccccc" /><path
         d="M 46.499875,16.499925 H 1.5001252 V 41.499786 L 46.5,41.5 Z"
         stroke-linecap="round"
         id="path564"
         style="fill:#f4c025;fill-opacity:1;stroke:#f4c025;stroke-width:2.99998;stroke-linejoin:round;stroke-opacity:1"
         sodipodi:nodetypes="ccccc" /></g><g
       id="g5015"
       transform="translate(2.3841858e-7,-1.9999985)"><circle
         cx="34.5"
         cy="34.5"
         fill="url(#a)"
         stroke-dashoffset="1.49998"
         stroke-linejoin="round"
         stroke-width="2.02703"
         transform="matrix(0,1,1,0,0,0)"
         id="circle1255"
         style="fill:url(#a);stroke:#ffffff;stroke-width:2.4;stroke-linecap:round;stroke-dasharray:none"
         r="12.3" /><path
         style="fill:none;stroke:#ffffff;stroke-width:3;stroke-linecap:round;stroke-linejoin:round;stroke-dasharray:none;stroke-opacity:1"
         d="M 39.47755,29.499903 33,39.5 29.47755,34.260274"
         id="path1953"
         sodipodi:nodetypes="ccc" /></g></g></svg>
