<?xml version="1.0" encoding="UTF-8" standalone="no"?>
<svg
   height="32"
   width="32"
   version="1.1"
   id="svg18"
   sodipodi:docname="Window_02_32.svg"
   inkscape:export-filename="Window_02_32.png"
   inkscape:export-xdpi="96"
   inkscape:export-ydpi="96"
   inkscape:version="1.2-beta (1b65182ce9, 2022-04-05)"
   xmlns:inkscape="http://www.inkscape.org/namespaces/inkscape"
   xmlns:sodipodi="http://sodipodi.sourceforge.net/DTD/sodipodi-0.dtd"
   xmlns="http://www.w3.org/2000/svg"
   xmlns:svg="http://www.w3.org/2000/svg">
  <defs
     id="defs22" />
  <sodipodi:namedview
     id="namedview20"
     pagecolor="#ffffff"
     bordercolor="#666666"
     borderopacity="1.0"
     inkscape:pageshadow="2"
     inkscape:pageopacity="0.0"
     inkscape:pagecheckerboard="0"
     inkscape:deskcolor="#d1d1d1"
     showgrid="true"
     inkscape:zoom="28.6875"
     inkscape:cx="15.511983"
     inkscape:cy="16"
     inkscape:current-layer="svg18">
    <inkscape:grid
       type="xygrid"
       id="grid1577" />
  </sodipodi:namedview>
  <g
     id="g1007">
    <path
       d="M 1,1 H 31 V 31 H 1 Z"
       stroke-dashoffset="1.49998"
       stroke-linecap="round"
       id="path6"
       style="fill:none;stroke:#00aad4;stroke-width:2" />
    <path
       d="M 1,1 H 31 V 4 H 1 Z"
       fill="#00aad4"
       stroke-dashoffset="1.49998"
       stroke-linecap="round"
       id="path10"
       style="stroke:#00aad4;stroke-width:2" />
  </g>
</svg>
