<?xml version="1.0" encoding="UTF-8" standalone="no"?>
<svg
   height="16"
   viewBox="0 0 4.2333332 4.2333335"
   width="16"
   version="1.1"
   id="svg2"
   sodipodi:docname="Font_06_16.svg"
   inkscape:version="1.2 (dc2aedaf03, 2022-05-15)"
   xml:space="preserve"
   inkscape:export-filename="Font_06_16.png"
   inkscape:export-xdpi="96"
   inkscape:export-ydpi="96"
   xmlns:inkscape="http://www.inkscape.org/namespaces/inkscape"
   xmlns:sodipodi="http://sodipodi.sourceforge.net/DTD/sodipodi-0.dtd"
   xmlns="http://www.w3.org/2000/svg"
   xmlns:svg="http://www.w3.org/2000/svg"><defs
     id="defs6" /><sodipodi:namedview
     id="namedview4"
     pagecolor="#ffffff"
     bordercolor="#666666"
     borderopacity="1.0"
     inkscape:showpageshadow="2"
     inkscape:pageopacity="0.0"
     inkscape:pagecheckerboard="0"
     inkscape:deskcolor="#d1d1d1"
     showgrid="true"
     inkscape:zoom="57.375"
     inkscape:cx="8"
     inkscape:cy="8"
     inkscape:current-layer="svg2"
     showguides="true"><inkscape:grid
       type="xygrid"
       id="grid1292" /></sodipodi:namedview><path
     id="path2-6"
     style="fill:#00aad4;stroke:none;stroke-width:0.997515"
     d="M 1.5167033,0.1984375 0.13229167,4.0348958 H 0.48627523 L 0.87126465,2.9729452 c 0.0121907,-0.034767 0.0450954,-0.058152 0.0821655,-0.058394 l 0.63816615,-10e-8 0.09044,-0.3260787 -0.5487716,10e-8 C 1.0728222,2.5882364 1.0307696,2.528728 1.0510986,2.4722005 L 1.6376261,0.83354086 c 0.012191,-0.0347673 0.045096,-0.0581525 0.082166,-0.0583944 0.03707,2.4235e-4 0.069975,0.0236274 0.082165,0.0583944 L 2.184515,1.8918538 2.4791246,1.7401438 1.9228801,0.1984375 Z"
     sodipodi:nodetypes="cccccccccccccccc" /><g
     id="g1474"
     transform="matrix(0.26458333,0,0,0.26458333,6.9999995e-8,-0.26458326)"
     style="fill:none;stroke:#00aad4;stroke-opacity:1"><circle
       style="fill:none;stroke:#00aad4;stroke-width:1;stroke-linecap:round;stroke-linejoin:round;stroke-dasharray:none;stroke-dashoffset:1.49998;stroke-opacity:1"
       id="path346"
       cx="11.5"
       cy="12.5"
       r="4" /><path
       style="fill:none;stroke:#00aad4;stroke-width:1px;stroke-linecap:round;stroke-linejoin:round;stroke-opacity:1"
       d="m 9.75,12.25 1.75,-1.75 1.75,1.75"
       id="path1053"
       sodipodi:nodetypes="ccc" /><path
       style="fill:none;stroke:#00aad4;stroke-width:1px;stroke-linecap:round;stroke-linejoin:miter;stroke-opacity:1"
       d="m 11.5,11 v 3.5"
       id="path1469"
       sodipodi:nodetypes="cc" /></g></svg>
