<?xml version="1.0" encoding="UTF-8" standalone="no"?>
<svg
   width="16"
   height="16"
   version="1.1"
   viewBox="0 0 4.2333 4.2333"
   id="svg4"
   sodipodi:docname="Health_12_16.svg"
   inkscape:export-filename="Health_12_16.png"
   inkscape:export-xdpi="96"
   inkscape:export-ydpi="96"
   inkscape:version="1.2.1 (9c6d41e410, 2022-07-14)"
   xmlns:inkscape="http://www.inkscape.org/namespaces/inkscape"
   xmlns:sodipodi="http://sodipodi.sourceforge.net/DTD/sodipodi-0.dtd"
   xmlns="http://www.w3.org/2000/svg"
   xmlns:svg="http://www.w3.org/2000/svg">
  <defs
     id="defs8" />
  <sodipodi:namedview
     id="namedview6"
     pagecolor="#ffffff"
     bordercolor="#666666"
     borderopacity="1.0"
     inkscape:showpageshadow="2"
     inkscape:pageopacity="0.0"
     inkscape:pagecheckerboard="0"
     inkscape:deskcolor="#d1d1d1"
     showgrid="true"
     inkscape:zoom="57.375"
     inkscape:cx="8"
     inkscape:cy="8"
     inkscape:current-layer="svg4">
    <inkscape:grid
       type="xygrid"
       id="grid897" />
  </sodipodi:namedview>
  <path
     style="fill:none;stroke:#00aad4;stroke-width:0.264581;stroke-dasharray:none;stroke-opacity:1"
     d="M 1.6072568,3.4224597 C -0.91192212,1.3093994 1.1297849,-0.5916052 2.11665,0.96982628 2.8317584,-0.16162808 4.1007467,0.52498497 3.7868912,1.7929308"
     id="path2228" />
  <g
     fill="none"
     stroke="#00aad4"
     stroke-linecap="round"
     id="g10"
     transform="scale(0.26458125)">
    <circle
       cx="11.5"
       cy="11.5"
       r="4.0999999"
       stroke-dashoffset="1.49998"
       stroke-linejoin="round"
       stroke-width="0.8"
       transform="matrix(0,1,1,0,0,0)"
       id="circle2" />
    <g
       id="g8">
      <path
         d="m 11.5,9.5 v 4"
         id="path4" />
      <path
         d="m 13.5,11.5 h -4"
         id="path6" />
    </g>
  </g>
</svg>
