<?xml version="1.0" encoding="UTF-8" standalone="no"?>
<svg
   width="16"
   height="16"
   version="1.1"
   viewBox="0 0 4.2333 4.2333"
   id="svg8"
   sodipodi:docname="Health_11_16.svg"
   inkscape:export-filename="Health_11_16.png"
   inkscape:export-xdpi="96"
   inkscape:export-ydpi="96"
   inkscape:version="1.2.1 (9c6d41e410, 2022-07-14)"
   xmlns:inkscape="http://www.inkscape.org/namespaces/inkscape"
   xmlns:sodipodi="http://sodipodi.sourceforge.net/DTD/sodipodi-0.dtd"
   xmlns="http://www.w3.org/2000/svg"
   xmlns:svg="http://www.w3.org/2000/svg">
  <defs
     id="defs12" />
  <sodipodi:namedview
     id="namedview10"
     pagecolor="#ffffff"
     bordercolor="#666666"
     borderopacity="1.0"
     inkscape:showpageshadow="2"
     inkscape:pageopacity="0.0"
     inkscape:pagecheckerboard="0"
     inkscape:deskcolor="#d1d1d1"
     showgrid="true"
     inkscape:zoom="57.375"
     inkscape:cx="7.9912854"
     inkscape:cy="8"
     inkscape:current-layer="svg8">
    <inkscape:grid
       type="xygrid"
       id="grid982" />
  </sodipodi:namedview>
  <g
     fill="none"
     stroke="#00aad4"
     id="g6">
    <path
       d="m1.1881 3.0311c0.24242 0.25478 0.5484 0.5158 0.92835 0.77705 0.36247-0.24923 0.65761-0.49824 0.89447-0.74182m0.59808-0.80767c0.79556-1.5485-0.69388-2.552-1.4926-1.2886-0.25353-0.40104-0.57682-0.5739-0.87437-0.57317-0.60146 0.00148-1.0983 0.71133-0.7046 1.6745"
       stroke-width=".26458"
       id="path2" />
    <path
       d="m0.26458 2.7782h0.27002l0.39143-0.39688 0.26458 0.26458 0.52917-1.0526 0.79375 1.3172 0.52917-0.66146 0.39688 0.52917 0.52917-5.4e-5"
       stroke-linecap="round"
       stroke-linejoin="round"
       stroke-width=".26458"
       id="path4" />
  </g>
</svg>
