<?xml version="1.0" encoding="UTF-8" standalone="no"?>
<svg
   width="24"
   height="24"
   version="1.1"
   viewBox="0 0 24 24"
   id="svg7"
   sodipodi:docname="tchartcombobox.svg"
   inkscape:version="1.3.2 (091e20e, 2023-11-25, custom)"
   xmlns:inkscape="http://www.inkscape.org/namespaces/inkscape"
   xmlns:sodipodi="http://sodipodi.sourceforge.net/DTD/sodipodi-0.dtd"
   xmlns="http://www.w3.org/2000/svg"
   xmlns:svg="http://www.w3.org/2000/svg">
  <defs
     id="defs7" />
  <sodipodi:namedview
     id="namedview7"
     pagecolor="#ffffff"
     bordercolor="#000000"
     borderopacity="0.25"
     inkscape:showpageshadow="2"
     inkscape:pageopacity="0.0"
     inkscape:pagecheckerboard="0"
     inkscape:deskcolor="#d1d1d1"
     showgrid="true"
     inkscape:current-layer="svg7">
    <inkscape:grid
       id="grid7"
       units="px"
       originx="0"
       originy="0"
       spacingx="0.5"
       spacingy="0.5"
       empcolor="#0099e5"
       empopacity="0.30196078"
       color="#0099e5"
       opacity="0.14901961"
       empspacing="2"
       dotted="false"
       gridanglex="30"
       gridanglez="30"
       visible="true" />
  </sodipodi:namedview>
  <rect
     x="1.25"
     y="1.25"
     width="21.5"
     height="21.5"
     fill="#ffffff"
     fill-rule="evenodd"
     stroke="#2a7efe"
     stroke-linecap="square"
     stroke-linejoin="round"
     stroke-width=".5"
     style="paint-order:normal"
     id="rect1" />
  <rect
     x="9.249999"
     y="1.25"
     width="13.500001"
     height="12"
     fill="#f9f9f9"
     stroke="#2a7efe"
     stroke-linejoin="round"
     stroke-width=".499999"
     style="paint-order:normal"
     id="rect2" />
  <path
     d="m3.55 13.2 2.95-5.2 2 8.5 3.5-2.5 3.45 6.45"
     fill="none"
     stroke="#2a7efe"
     stroke-linecap="round"
     stroke-linejoin="round"
     stroke-width="1.1"
     id="path2" />
  <path
     d="m11 10.5 8 1e-6"
     fill="none"
     stroke="#b3b3b3"
     stroke-width=".999998px"
     id="path3" />
  <path
     d="m3.5 5v15.5h15.5"
     fill="none"
     stroke="#4d4d4d"
     stroke-linecap="round"
     stroke-linejoin="round"
     id="path4" />
  <path
     d="m11 8.5 9 1e-6"
     fill="none"
     stroke="#b3b3b3"
     stroke-width=".999998px"
     id="path5" />
  <rect
     transform="rotate(90)"
     x="1.2500007"
     y="-18.222973"
     width="4.5"
     height="8.9729729"
     fill="#f9f9f9"
     stroke="#2a7efe"
     stroke-linejoin="round"
     stroke-width=".5"
     style="paint-order:normal"
     id="rect5" />
  <path
     d="m11 3.5000005h6.000001"
     fill="none"
     stroke="#b3b3b3"
     stroke-linejoin="round"
     stroke-width=".999997px"
     id="path6" />
  <rect
     x="18.25"
     y="1.25"
     width="4.500001"
     height="4.500001"
     fill="#ffffff"
     stroke="#2a7efe"
     stroke-linejoin="round"
     stroke-width=".499999"
     style="paint-order:normal"
     id="rect6" />
  <path
     d="M 19.5,3 20.486487,4.2474994 21.5,3"
     fill="none"
     stroke="#666666"
     stroke-linecap="round"
     stroke-linejoin="round"
     stroke-width=".7"
     id="path7" />
</svg>
