<?xml version="1.0" encoding="UTF-8" standalone="no"?>
<svg
   height="16"
   width="16"
   version="1.1"
   id="svg315"
   sodipodi:docname="Grid_01_16.svg"
   inkscape:export-filename="Grid_01_16.png"
   inkscape:export-xdpi="96"
   inkscape:export-ydpi="96"
   inkscape:version="1.2-beta (1b65182ce9, 2022-04-05)"
   xmlns:inkscape="http://www.inkscape.org/namespaces/inkscape"
   xmlns:sodipodi="http://sodipodi.sourceforge.net/DTD/sodipodi-0.dtd"
   xmlns="http://www.w3.org/2000/svg"
   xmlns:svg="http://www.w3.org/2000/svg">
  <defs
     id="defs319" />
  <sodipodi:namedview
     id="namedview317"
     pagecolor="#ffffff"
     bordercolor="#666666"
     borderopacity="1.0"
     inkscape:pageshadow="2"
     inkscape:pageopacity="0.0"
     inkscape:pagecheckerboard="0"
     inkscape:deskcolor="#d1d1d1"
     showgrid="true"
     inkscape:zoom="57.375"
     inkscape:cx="8"
     inkscape:cy="8"
     inkscape:current-layer="svg315">
    <inkscape:grid
       type="xygrid"
       id="grid983" />
  </sodipodi:namedview>
  <path
     d="m.5.5h15v15h-15z"
     fill="#fff"
     stroke="#999"
     stroke-dashoffset="1.5"
     stroke-linecap="round"
     stroke-linejoin="round"
     id="path299" />
  <g
     fill="none"
     stroke="#b3b3b3"
     id="g313">
    <path
       d="m1 3.5h14"
       id="path301" />
    <path
       d="m5.5 1v14"
       id="path303" />
    <path
       d="m15 12.5h-14"
       id="path305" />
    <path
       d="m10.5 1v14"
       id="path307" />
    <path
       d="m1 9.5h14"
       id="path309" />
    <path
       d="m1 6.5h14"
       id="path311" />
  </g>
</svg>
