<?xml version="1.0" encoding="UTF-8" standalone="no"?>
<svg
   height="24"
   width="24"
   version="1.1"
   id="svg18"
   sodipodi:docname="Lock_03_24.svg"
   inkscape:export-filename="Lock_03_24.png"
   inkscape:export-xdpi="96"
   inkscape:export-ydpi="96"
   inkscape:version="1.2 (dc2aedaf03, 2022-05-15)"
   xmlns:inkscape="http://www.inkscape.org/namespaces/inkscape"
   xmlns:sodipodi="http://sodipodi.sourceforge.net/DTD/sodipodi-0.dtd"
   xmlns="http://www.w3.org/2000/svg"
   xmlns:svg="http://www.w3.org/2000/svg">
  <defs
     id="defs22" />
  <sodipodi:namedview
     id="namedview20"
     pagecolor="#ffffff"
     bordercolor="#666666"
     borderopacity="1.0"
     inkscape:showpageshadow="2"
     inkscape:pageopacity="0.0"
     inkscape:pagecheckerboard="0"
     inkscape:deskcolor="#d1d1d1"
     showgrid="true"
     inkscape:zoom="38.25"
     inkscape:cx="11.594771"
     inkscape:cy="12"
     inkscape:current-layer="svg18">
    <inkscape:grid
       type="xygrid"
       id="grid464" />
  </sodipodi:namedview>
  <linearGradient
     id="a"
     gradientTransform="matrix(1.7503236 0 0 1.4957189 -88.180133 7.794953)"
     gradientUnits="userSpaceOnUse"
     x1="52.5"
     x2="61.5"
     y1="7"
     y2="7">
    <stop
       offset="0"
       stop-color="#fc0"
       id="stop2" />
    <stop
       offset=".37840304"
       stop-color="#f9f9f9"
       id="stop4" />
    <stop
       offset="1"
       stop-color="#ffd42a"
       id="stop6" />
  </linearGradient>
  <radialGradient
     id="b"
     cx="33.463123"
     cy="-1.059664"
     gradientTransform="matrix(1.2587404 -.9651516 .97902133 1.2409088 -29.122411 42.711931)"
     gradientUnits="userSpaceOnUse"
     r="5.5">
    <stop
       offset="0"
       id="stop9" />
    <stop
       offset="1"
       stop-color="#e6e6e6"
       id="stop11" />
  </radialGradient>
  <g
     id="g538">
    <path
       d="m3.5 12.5h17v11h-17z"
       fill="url(#a)"
       stroke="#d4aa00"
       stroke-linejoin="round"
       id="path14" />
    <path
       d="M 11.961538,0 C 7.7297608,0 4.2692307,3.411506 4.2692307,7.583334 V 12 H 7.0664336 V 7.583334 c 0,-2.681524 2.1750475,-4.825758 4.8951044,-4.825758 2.720057,0 4.895105,2.144234 4.895105,4.825758 V 8 h 2.797203 V 7.583334 C 19.653846,3.411506 16.193317,0 11.961538,0 Z"
       fill="url(#b)"
       id="path16"
       sodipodi:nodetypes="ssccsssccss" />
  </g>
</svg>
