<?xml version="1.0" encoding="UTF-8" standalone="no"?>
<svg
   width="24"
   height="24"
   version="1.1"
   id="svg272"
   sodipodi:docname="menu_jumpto_implementation_150.svg"
   inkscape:export-filename="menu_jumpto_implementation_150.png"
   inkscape:export-xdpi="96"
   inkscape:export-ydpi="96"
   inkscape:version="1.2.2 (732a01da63, 2022-12-09)"
   xmlns:inkscape="http://www.inkscape.org/namespaces/inkscape"
   xmlns:sodipodi="http://sodipodi.sourceforge.net/DTD/sodipodi-0.dtd"
   xmlns="http://www.w3.org/2000/svg"
   xmlns:svg="http://www.w3.org/2000/svg">
  <defs
     id="defs276" />
  <sodipodi:namedview
     id="namedview274"
     pagecolor="#ffffff"
     bordercolor="#666666"
     borderopacity="1.0"
     inkscape:showpageshadow="2"
     inkscape:pageopacity="0.0"
     inkscape:pagecheckerboard="0"
     inkscape:deskcolor="#d1d1d1"
     showgrid="true"
     inkscape:zoom="38.25"
     inkscape:cx="12"
     inkscape:cy="12"
     inkscape:current-layer="svg272">
    <inkscape:grid
       type="xygrid"
       id="grid499" />
  </sodipodi:namedview>
  <path
     d="m 1,8.5 4,3 -4,3 z"
     fill="#ff0000"
     id="path266" />
  <path
     d="m21.415 0.58529v21.829h-15.829v-21.829z"
     fill="#fff"
     stroke="#d4aa00"
     stroke-linecap="round"
     stroke-linejoin="round"
     stroke-miterlimit="5.6"
     stroke-width="1.1706"
     id="path270" />
  <path
     style="fill:none;stroke:#ff0000;stroke-width:1.2;stroke-linecap:butt;stroke-linejoin:miter;stroke-dasharray:none;stroke-opacity:1"
     d="M 19,11.4 H 8"
     id="path608"
     sodipodi:nodetypes="cc" />
  <path
     style="fill:none;stroke:#2a7fff;stroke-width:1.2;stroke-linecap:butt;stroke-linejoin:miter;stroke-dasharray:none;stroke-opacity:1"
     d="M 13,15.4 H 8"
     id="path1440"
     sodipodi:nodetypes="cc" />
  <path
     style="fill:none;stroke:#2a7fff;stroke-width:1.2;stroke-linecap:butt;stroke-linejoin:miter;stroke-dasharray:none;stroke-opacity:1"
     d="M 17,4.4 H 8"
     id="path1442"
     sodipodi:nodetypes="cc" />
  <path
     style="fill:none;stroke:#2a7fff;stroke-width:1.2;stroke-linecap:butt;stroke-linejoin:miter;stroke-dasharray:none;stroke-opacity:1"
     d="M 13,7.4 H 7.9999985"
     id="path1444"
     sodipodi:nodetypes="cc" />
  <path
     style="fill:none;stroke:#2a7fff;stroke-width:1.2;stroke-linecap:butt;stroke-linejoin:miter;stroke-dasharray:none;stroke-opacity:1"
     d="M 19,18.4 H 8"
     id="path2162"
     sodipodi:nodetypes="cc" />
</svg>
