<?xml version="1.0" encoding="UTF-8" standalone="no"?>
<svg
   height="48"
   viewBox="0 0 12.7 12.7"
   width="48"
   version="1.1"
   id="svg803"
   sodipodi:docname="Secure_06_48.svg"
   inkscape:version="1.2.2 (732a01da63, 2022-12-09)"
   xmlns:inkscape="http://www.inkscape.org/namespaces/inkscape"
   xmlns:sodipodi="http://sodipodi.sourceforge.net/DTD/sodipodi-0.dtd"
   xmlns="http://www.w3.org/2000/svg"
   xmlns:svg="http://www.w3.org/2000/svg">
  <defs
     id="defs807" />
  <sodipodi:namedview
     id="namedview805"
     pagecolor="#ffffff"
     bordercolor="#000000"
     borderopacity="0.25"
     inkscape:showpageshadow="2"
     inkscape:pageopacity="0.0"
     inkscape:pagecheckerboard="0"
     inkscape:deskcolor="#d1d1d1"
     showgrid="true"
     inkscape:zoom="18.958333"
     inkscape:cx="20.123077"
     inkscape:cy="24"
     inkscape:current-layer="svg803">
    <inkscape:grid
       type="xygrid"
       id="grid926" />
  </sodipodi:namedview>
  <filter
     id="a"
     color-interpolation-filters="sRGB"
     height="1.1801321"
     width="1.190248"
     x="-0.095123999"
     y="-0.10785206">
    <feGaussianBlur
       stdDeviation=".1328125"
       id="feGaussianBlur773" />
  </filter>
  <linearGradient
     id="b"
     gradientTransform="matrix(.45152856 0 0 -.39139348 -19.483411 10.128988)"
     gradientUnits="userSpaceOnUse"
     x1="52.5"
     x2="61.5"
     y1="7"
     y2="7">
    <stop
       offset="0"
       stop-color="#fc0"
       id="stop776" />
    <stop
       offset=".37840304"
       stop-color="#f9f9f9"
       id="stop778" />
    <stop
       offset="1"
       stop-color="#ffd42a"
       id="stop780" />
  </linearGradient>
  <linearGradient
     id="c"
     gradientTransform="matrix(2.9864783 0 0 3.0535776 .028619 -.24816)"
     gradientUnits="userSpaceOnUse"
     x1="1.499774"
     x2="3.614834"
     y1="1.322335"
     y2="2.204926">
    <stop
       offset="0"
       stop-color="#80b5fe"
       id="stop783" />
    <stop
       offset="1"
       stop-color="#2a7efe"
       id="stop785" />
  </linearGradient>
  <linearGradient
     id="d"
     gradientTransform="matrix(2.9864783 0 0 3.0535776 .028619 -.24816)"
     gradientUnits="userSpaceOnUse"
     x1=".530372"
     x2="3.879216"
     y1="1.145817"
     y2="2.557962">
    <stop
       offset="0"
       stop-color="#e7c962"
       id="stop788" />
    <stop
       offset="1"
       stop-color="#d4a41c"
       id="stop790" />
  </linearGradient>
  <g
     stroke-linejoin="round"
     id="g801">
    <path
       d="m1.3493748 7.0237627-.0000002-4.8511068c1.5791444 0 3.6846709-.8085178 5.0006252-1.61703573 1.3159536.80851793 3.4214796 1.61703573 5.0006252 1.61703573v4.8511068c0 1.8919533-2.6319087 4.8511063-5.0006252 5.1206123-2.3687172-.269506-5.000625-3.228659-5.000625-5.1206123z"
       fill="url(#c)"
       stroke="url(#d)"
       stroke-linecap="round"
       stroke-width=".582083"
       id="path793" />
    <path
       d="m4.7624986 5.8209189v-1.2032371c0-.8698352.7107485-1.5749755 1.5875011-1.5749755.8767529 0 1.5875017.7051403 1.5875017 1.5749755v1.2032371"
       fill="none"
       stroke="#b3b3b3"
       stroke-width=".793746"
       id="path795" />
    <path
       d="m5 7.8021661v-1.9099298c0-1.380712 1.119288-2.5 2.5-2.5s2.5 1.119288 2.5 2.5v1.9099298"
       fill="none"
       filter="url(#a)"
       stroke="#fff"
       stroke-width=".31374"
       transform="matrix(.63500044 0 0 .62999014 1.587496 .905631)"
       id="path797" />
    <path
       d="m8.532812 8.7974797v-2.7781231h-4.365624v2.7781231z"
       fill="url(#b)"
       stroke="#d4aa00"
       stroke-linecap="round"
       stroke-width=".396876"
       id="path799" />
  </g>
</svg>
