<?xml version="1.0" encoding="UTF-8" standalone="no"?>
<svg
   height="22"
   width="22"
   version="1.1"
   id="svg4736"
   sodipodi:docname="bookmark5_200.svg"
   inkscape:export-filename="bookmark5_200.png"
   inkscape:export-xdpi="96"
   inkscape:export-ydpi="96"
   inkscape:version="1.2.2 (732a01da63, 2022-12-09)"
   xmlns:inkscape="http://www.inkscape.org/namespaces/inkscape"
   xmlns:sodipodi="http://sodipodi.sourceforge.net/DTD/sodipodi-0.dtd"
   xmlns="http://www.w3.org/2000/svg"
   xmlns:svg="http://www.w3.org/2000/svg">
  <defs
     id="defs4740" />
  <sodipodi:namedview
     id="namedview4738"
     pagecolor="#ffffff"
     bordercolor="#666666"
     borderopacity="1.0"
     inkscape:showpageshadow="2"
     inkscape:pageopacity="0.0"
     inkscape:pagecheckerboard="0"
     inkscape:deskcolor="#d1d1d1"
     showgrid="true"
     inkscape:zoom="41.727273"
     inkscape:cx="11"
     inkscape:cy="11"
     inkscape:current-layer="svg4736">
    <inkscape:grid
       type="xygrid"
       id="grid5005" />
  </sodipodi:namedview>
  <radialGradient
     id="a"
     cx="10.999999"
     cy="11"
     gradientUnits="userSpaceOnUse"
     r="11">
    <stop
       offset="0"
       stop-color="#4881cc"
       id="stop4725" />
    <stop
       offset=".81818181"
       stop-color="#4781cc"
       id="stop4727" />
    <stop
       offset="1"
       stop-color="#569af2"
       id="stop4729" />
  </radialGradient>
  <circle
     cx="11"
     cy="11"
     fill="url(#a)"
     r="11"
     id="circle4732" />
  <path
     d="M 10.981271,17.998506 C 9.4527882,18.035545 7.8772203,17.388233 7.1434704,16.197331 6.8049759,15.677891 6.6011838,15.098425 6.499968,14.510792 c 0.7467591,0.0064 1.5232366,-0.0127 2.2516574,0.0095 0.075591,0.807833 0.8381934,1.512189 1.7825726,1.584239 0.916135,0.143433 1.973443,-0.16887 2.374454,-0.939224 0.482797,-0.847786 0.30017,-1.808119 0.332977,-2.718038 0.0042,-0.876236 -0.46337,-1.882619 -1.518958,-2.145758 -0.982889,-0.29051 -2.0636188,0.11486 -2.6586677,0.812965 -0.1133858,0.28639 -0.4676031,0.157009 -0.7320189,0.184924 -0.4929297,0 -0.9858557,0 -1.4787893,0 0,-2.4331373 0,-4.8662742 0,-7.299412 h 8.1788369 v 1.8486758 c -1.975721,0 -3.951443,0 -5.927172,0 v 3.1160789 c 1.12633,-0.813402 2.771607,-0.74704 4.053921,-0.26663 1.436463,0.534728 2.172197,1.8795513 2.295795,3.1628673 0.06198,0.842876 0.05669,1.691491 0.0076,2.534848 -0.104013,1.284621 -0.832664,2.62226 -2.235942,3.19569 -0.693925,0.296579 -1.476234,0.407591 -2.245315,0.406971 z"
     fill="#ffffff"
     stroke-width="0.999995"
     id="path3066"
     style="fill:#ffffff" />
</svg>
