<?xml version="1.0" encoding="UTF-8" standalone="no"?>
<svg
   height="36"
   width="36"
   version="1.1"
   id="svg18"
   sodipodi:docname="Export_03_36.svg"
   inkscape:version="1.2-beta (1b65182ce9, 2022-04-05)"
   inkscape:export-filename="Export_03_36.png"
   inkscape:export-xdpi="96"
   inkscape:export-ydpi="96"
   xmlns:inkscape="http://www.inkscape.org/namespaces/inkscape"
   xmlns:sodipodi="http://sodipodi.sourceforge.net/DTD/sodipodi-0.dtd"
   xmlns="http://www.w3.org/2000/svg"
   xmlns:svg="http://www.w3.org/2000/svg">
  <defs
     id="defs22" />
  <sodipodi:namedview
     id="namedview20"
     pagecolor="#ffffff"
     bordercolor="#666666"
     borderopacity="1.0"
     inkscape:pageshadow="2"
     inkscape:pageopacity="0.0"
     inkscape:pagecheckerboard="0"
     inkscape:deskcolor="#d1d1d1"
     showgrid="true"
     inkscape:zoom="25.5"
     inkscape:cx="15.980392"
     inkscape:cy="18"
     inkscape:current-layer="svg18">
    <inkscape:grid
       type="xygrid"
       id="grid147"
       originx="0"
       originy="0" />
  </sodipodi:namedview>
  <g
     id="g137"
     transform="scale(2.25)">
    <circle
       style="opacity:1;fill:none;stroke:#00aad4;stroke-width:0.5;stroke-linecap:round;stroke-linejoin:round;stroke-dasharray:none;stroke-dashoffset:1.49998"
       id="path355"
       cx="-8"
       cy="8"
       r="7.5"
       transform="scale(-1,1)" />
    <path
       style="opacity:1;fill:#00aad4;fill-opacity:1;stroke:none;stroke-width:1px;stroke-linecap:butt;stroke-linejoin:miter;stroke-opacity:1"
       d="M 10.835192,1.170271 C 11.32185,1.8085374 8.5221157,4.0226521 7.876757,4.1475655 6.7639115,3.2729411 7.7871403,1.4911884 5.3551198,1.0345323 7.7897525,0.1630678 9.1857071,0.37907005 10.835192,1.170271 Z"
       id="path915"
       sodipodi:nodetypes="cccc" />
    <path
       style="opacity:1;fill:#00aad4;fill-opacity:1;stroke:none;stroke-width:1px;stroke-linecap:butt;stroke-linejoin:miter;stroke-opacity:1"
       d="M 5.5,15 C 6.5398204,13.523229 8.4534681,12.55619 8.5,10.5 6.9269087,10.301582 5.7984414,7.9158297 4.5009818,8.6398118 3.875004,8.9891073 3.4508783,7.8446939 3.3344877,7.4577307 3.7185425,7.2101068 4.8280378,7.7462115 4.7974176,7.3510443 4.7129958,6.2615436 5.7202102,5.7559231 6.5,5.5 8.0888036,5.046598 6.5231299,4.5188444 6.130271,3.5915665 L 5.4705882,1.0294118 C 3.8076733,1.1537539 0.55192281,3.9180048 0.62324301,6.4154615 1.190884,7.9871124 2.8870807,9.4012281 3.8943776,9.4753514 L 3.7218374,11 c 1.2154422,0.33116 1.0357507,1.562633 0.2433042,3.174292 z"
       id="path917"
       sodipodi:nodetypes="ccscscccccccc" />
    <path
       style="opacity:1;fill:#00aad4;fill-opacity:1;stroke:none;stroke-width:1px;stroke-linecap:butt;stroke-linejoin:miter;stroke-opacity:1"
       d="m 12.901241,13.549297 c 0,0 -1.191385,-1.813803 -0.5,-3 C 12.747283,9.9555989 11.004037,10.46691 10.499835,10 10.113129,9.6418986 9.6673333,10.025123 9.9998346,8.5 10.091437,8.0798383 10.679899,7.1942832 11.252865,7.1189139 c 0.375099,-0.049341 -0.640224,-0.6984583 -0.51572,-0.8814963 0.287936,-0.4233081 0.74919,-3.775e-4 0.984443,-0.7277085 0.08021,-0.2479988 -0.488253,-1.2854658 -0.295186,-1.506868 0.570501,-0.6542293 1.298002,0.3881295 1.891231,0.5964842 0.375288,0.1318089 0.602145,-0.2310271 0.821636,-0.7039005 0.592717,0.8834225 1.979159,2.8066433 1.048046,2.7138473 -0.281857,-0.02809 -0.820224,0.4024405 -1.015024,0.1780114 -0.610556,-0.7034236 -3.005879,-0.1413338 -2.078011,0.20422 0.312727,0.1164651 2.183431,1.0298017 1.887738,0.8038128 -0.179085,-0.1368689 1.155722,-0.997285 1.400887,-0.42584 0.653525,1.5232762 -0.737478,5.0192007 -2.481664,6.1798207 z"
       id="path921"
       sodipodi:nodetypes="csssssssscsssssc" />
  </g>
</svg>
