<?xml version="1.0" encoding="UTF-8" standalone="no"?>
<svg
   height="16"
   width="16"
   version="1.1"
   id="svg30"
   sodipodi:docname="Color_01_16.svg"
   inkscape:export-filename="Color_01_16.png"
   inkscape:export-xdpi="96"
   inkscape:export-ydpi="96"
   inkscape:version="1.2-beta (1b65182ce9, 2022-04-05)"
   xmlns:inkscape="http://www.inkscape.org/namespaces/inkscape"
   xmlns:sodipodi="http://sodipodi.sourceforge.net/DTD/sodipodi-0.dtd"
   xmlns="http://www.w3.org/2000/svg"
   xmlns:svg="http://www.w3.org/2000/svg">
  <defs
     id="defs34" />
  <sodipodi:namedview
     id="namedview32"
     pagecolor="#ffffff"
     bordercolor="#666666"
     borderopacity="1.0"
     inkscape:pageshadow="2"
     inkscape:pageopacity="0.0"
     inkscape:pagecheckerboard="0"
     inkscape:deskcolor="#d1d1d1"
     showgrid="true"
     inkscape:zoom="57.375"
     inkscape:cx="8"
     inkscape:cy="8"
     inkscape:current-layer="svg30">
    <inkscape:grid
       type="xygrid"
       id="grid1118" />
  </sodipodi:namedview>
  <g
     fill-rule="evenodd"
     id="g28">
    <path
       d="m1 3h15v11h-15z"
       fill="#fff"
       id="path2" />
    <path
       d="m1 3h3v3.000017h-3z"
       fill="#008000"
       id="path4" />
    <path
       d="m13 3h2.999999v3.000017h-2.999999z"
       fill="#00f"
       id="path6" />
    <path
       d="m9 3h3v3.000017h-3z"
       fill="#efef00"
       id="path8" />
    <path
       d="m5 3h3v3.000017h-3z"
       fill="#f00"
       id="path10" />
    <path
       d="m1 7h3v3.000017h-3z"
       fill="#00d400"
       id="path12" />
    <path
       d="m13 7h2.999999v3.000017h-2.999999z"
       fill="#6868ff"
       id="path14" />
    <path
       d="m9 7h3v3.000017h-3z"
       fill="#ffff51"
       id="path16" />
    <path
       d="m5 7h3v3.000017h-3z"
       fill="#ff6868"
       id="path18" />
    <path
       d="m1 11h3v3.000017h-3z"
       fill="#0f0"
       id="path20" />
    <path
       d="m13 11h2.999999v3.000017h-2.999999z"
       fill="#acf"
       id="path22" />
    <path
       d="m9 11h3v3.000017h-3z"
       fill="#ffffb3"
       id="path24" />
    <path
       d="m5 11h3v3.000017h-3z"
       fill="#ffc9c9"
       id="path26" />
  </g>
</svg>
