<?xml version="1.0" encoding="UTF-8" standalone="no"?>
<svg
   height="16"
   width="16"
   version="1.1"
   id="svg16"
   sodipodi:docname="landscape_16.svg"
   inkscape:version="1.2 (dc2aedaf03, 2022-05-15)"
   inkscape:export-filename="landscape_16.png"
   inkscape:export-xdpi="96"
   inkscape:export-ydpi="96"
   xmlns:inkscape="http://www.inkscape.org/namespaces/inkscape"
   xmlns:sodipodi="http://sodipodi.sourceforge.net/DTD/sodipodi-0.dtd"
   xmlns="http://www.w3.org/2000/svg"
   xmlns:svg="http://www.w3.org/2000/svg">
  <defs
     id="defs20">
    <radialGradient
       id="a"
       cx="9.1740294"
       cy="7.8253603"
       gradientTransform="matrix(0.66909781,-2.2758851e-8,4.5190518e-8,0.58542853,1.8616763,4.291566)"
       gradientUnits="userSpaceOnUse"
       r="7.5"
       fx="9.1740294"
       fy="7.8253603">
      <stop
         offset="0"
         stop-color="#fff"
         id="stop2" />
      <stop
         offset="1"
         stop-color="#8fc1c7"
         id="stop4" />
    </radialGradient>
  </defs>
  <sodipodi:namedview
     id="namedview18"
     pagecolor="#ffffff"
     bordercolor="#666666"
     borderopacity="1.0"
     inkscape:pageshadow="2"
     inkscape:pageopacity="0.0"
     inkscape:pagecheckerboard="0"
     inkscape:deskcolor="#d1d1d1"
     showgrid="true"
     showguides="true"
     inkscape:zoom="40.570252"
     inkscape:cx="10.463332"
     inkscape:cy="8.7132809"
     inkscape:current-layer="svg16"
     inkscape:showpageshadow="2"
     inkscape:window-width="2560"
     inkscape:window-height="1009"
     inkscape:window-x="-8"
     inkscape:window-y="-8"
     inkscape:window-maximized="1">
    <inkscape:grid
       type="xygrid"
       id="grid249" />
  </sodipodi:namedview>
  <g
     id="g1166"
     transform="matrix(0,-1,-1,0,16,16)">
    <path
       d="m 2.5,15.5 v -15 h 7 l 4,4 v 11 z"
       id="path2"
       style="fill:none;stroke:#00aad4;stroke-linecap:round;stroke-linejoin:round"
       sodipodi:nodetypes="cccccc" />
    <path
       d="m 9.5,0.5 v 4 h 4"
       id="path6"
       style="fill:none;stroke:#00aad4;stroke-linecap:round;stroke-linejoin:round"
       sodipodi:nodetypes="ccc" />
  </g>
</svg>
