<?xml version="1.0" encoding="UTF-8" standalone="no"?>
<svg
   width="24"
   height="24"
   version="1.1"
   viewBox="0 0 24 24"
   id="svg7"
   sodipodi:docname="toauth2handler.svg"
   inkscape:export-filename="toauth2handler.png"
   inkscape:export-xdpi="96"
   inkscape:export-ydpi="96"
   inkscape:version="1.3.2 (091e20e, 2023-11-25, custom)"
   xmlns:inkscape="http://www.inkscape.org/namespaces/inkscape"
   xmlns:sodipodi="http://sodipodi.sourceforge.net/DTD/sodipodi-0.dtd"
   xmlns="http://www.w3.org/2000/svg"
   xmlns:svg="http://www.w3.org/2000/svg">
  <defs
     id="defs7" />
  <sodipodi:namedview
     id="namedview7"
     pagecolor="#ffffff"
     bordercolor="#000000"
     borderopacity="0.25"
     inkscape:showpageshadow="2"
     inkscape:pageopacity="0.0"
     inkscape:pagecheckerboard="0"
     inkscape:deskcolor="#d1d1d1"
     showgrid="true"
     inkscape:current-layer="svg7">
    <inkscape:grid
       id="grid7"
       units="px"
       originx="0"
       originy="0"
       spacingx="0.5"
       spacingy="0.5"
       empcolor="#0099e5"
       empopacity="0.30196078"
       color="#0099e5"
       opacity="0.14901961"
       empspacing="2"
       dotted="false"
       gridanglex="30"
       gridanglez="30"
       visible="true" />
  </sodipodi:namedview>
  <rect
     x=".5"
     y="15.5"
     width="23"
     height="8"
     rx="4"
     fill="#008dd2"
     stroke="#b3b3b3"
     stroke-dashoffset="1.49998"
     stroke-linecap="round"
     stroke-linejoin="round"
     id="rect1" />
  <text
     x="-19"
     y="32.499981"
     id="text1"><tspan
       x="-19"
       y="47.078106"
       id="tspan1" /></text>
  <circle
     cx="8.25"
     cy="7.7500648"
     r="5.7692308"
     fill="#ffffff"
     stroke="#b3b3b3"
     stroke-dashoffset="1.49998"
     stroke-linecap="square"
     stroke-linejoin="round"
     stroke-width=".961538"
     id="circle1" />
  <text
     x="5.7181358"
     y="11"
     font-family="Bahnschrift"
     font-size="9.75902px"
     font-weight="bold"
     stroke-width=".914894"
     id="text2"><tspan
       x="5.7181358"
       y="11"
       stroke-width=".914894"
       id="tspan2">2</tspan></text>
  <g
     fill="#ffffff"
     id="g5">
    <path
       d="m6.9757011 17.000001h1.024299v4.999999h-1.024299zm-2.975701 0h1.024299v4.999999h-1.024299zm0.4747663 2.066712h3.1663552v0.90784h-3.1663552z"
       stroke-width="1.37681"
       id="path2" />
    <path
       d="m10.057772 17.409216h0.942228v4.590784h-0.942228zm-1.3617609-0.409215h3.6657489v0.90784h-3.6657489z"
       stroke-width="1.3205"
       id="path3" />
    <path
       d="m14 17.409216h0.942228v4.590784h-0.942228zm-1.361761-0.409215h3.665749v0.90784h-3.665749z"
       stroke-width="1.3205"
       id="path4" />
    <path
       d="m17.429808 19.152683h1.598884q0.168486 0 0.295708-0.07565 0.130662-0.07909 0.202869-0.220082 0.0722-0.140991 0.0722-0.323246 0-0.185695-0.0722-0.326685-0.06878-0.14443-0.19943-0.220083-0.127223-0.07909-0.299147-0.07909h-1.598884v-0.90784h1.574815q0.467631 0 0.821793 0.192572 0.3576 0.189133 0.553592 0.536451t0.195992 0.804677q0 0.457358-0.195992 0.804676-0.195992 0.343879-0.553592 0.533013-0.354162 0.189133-0.821793 0.189133h-1.574815zm-0.429808-2.152682h0.942139v4.999999h-0.942139z"
       stroke-width="1.32043"
       id="path5" />
  </g>
  <g
     transform="matrix(1,0,0,-1,2,25)"
     fill="none"
     stroke="#ff0000"
     stroke-linecap="round"
     id="g7">
    <path
       d="m16.5 20.5v-6.5"
       id="path6" />
    <path
       d="m18.5 15-2-2-2 2"
       stroke-linejoin="round"
       id="path7" />
  </g>
</svg>
