<?xml version="1.0" encoding="UTF-8" standalone="no"?>
<svg
   height="16"
   width="16"
   version="1.1"
   id="svg2"
   sodipodi:docname="qrybtn_open.svg"
   inkscape:export-filename="qrybtn_open.png"
   inkscape:export-xdpi="96"
   inkscape:export-ydpi="96"
   inkscape:version="1.3-beta (cedbd6c6ff, 2023-05-28)"
   xmlns:inkscape="http://www.inkscape.org/namespaces/inkscape"
   xmlns:sodipodi="http://sodipodi.sourceforge.net/DTD/sodipodi-0.dtd"
   xmlns="http://www.w3.org/2000/svg"
   xmlns:svg="http://www.w3.org/2000/svg">
  <defs
     id="defs2" />
  <sodipodi:namedview
     id="namedview2"
     pagecolor="#ffffff"
     bordercolor="#000000"
     borderopacity="0.25"
     inkscape:showpageshadow="2"
     inkscape:pageopacity="0.0"
     inkscape:pagecheckerboard="0"
     inkscape:deskcolor="#d1d1d1"
     showgrid="true"
     inkscape:current-layer="svg2">
    <inkscape:grid
       id="grid2"
       units="px"
       originx="0"
       originy="0"
       spacingx="0.5"
       spacingy="0.5"
       empcolor="#0099e5"
       empopacity="0.30196078"
       color="#0099e5"
       opacity="0.14901961"
       empspacing="2"
       dotted="false"
       gridanglex="30"
       gridanglez="30"
       visible="true" />
  </sodipodi:namedview>
  <g
     stroke="#00aad4"
     stroke-linejoin="round"
     id="g2">
    <path
       d="m1.5 1.5c-.55399938 0-1 .4460007-1 1v5h15v-4c0-.5539994-.446001-1-1-1h-8.5c0-.5539993-.4460007-1-1-1z"
       fill="#ebfcff"
       id="path1" />
    <path
       d="m1.5 6.5h4c0-.6320783.3907767-1 1-1h8c.554 0 1 .446 1 1v6c0 .554-.446 1-1 1h-13c-.554 0-1-.446-1-1v-5c0-.554.446-1 1-1z"
       fill="#c2f3ff"
       stroke-width=".999997"
       id="path2" />
  </g>
</svg>
