<svg width="32" height="32" version="1.1" xmlns="http://www.w3.org/2000/svg">
 <rect x="2.75" y="2.75" width="22.5" height="26.500002" ry="3.3254905" fill="#f5f7ff" stroke="#00aad4" stroke-linejoin="round" stroke-width="1.5"/>
 <path d="m3.5 5h21" fill="none" stroke="#00aad4" stroke-linejoin="round" stroke-width="4"/>
 <path d="m9.0000007 16.999998h18.000001" fill="none" stroke="#f5f7ff" stroke-linecap="round" stroke-linejoin="round" stroke-width="6"/>
 <path d="m22.000064 21.999999 5.000001-5.000001-5.000001-5" fill="none" stroke="#f5f7ff" stroke-linecap="round" stroke-linejoin="round" stroke-width="6"/>
 <path d="m9.0000007 16.999998h18.000001" fill="none" stroke="#ccaa00" stroke-linecap="round" stroke-linejoin="round" stroke-width="2"/>
 <path d="m22.000064 21.999999 5.000001-5.000001-5.000001-5" fill="none" stroke="#ccaa00" stroke-linecap="round" stroke-linejoin="round" stroke-width="2"/>
</svg>
