<?xml version="1.0" encoding="UTF-8" standalone="no"?>
<svg
   width="36"
   height="36"
   version="1.1"
   viewBox="0 0 36 36"
   id="svg12"
   sodipodi:docname="ttifloatspinedit_150.svg"
   inkscape:version="1.3.2 (091e20e, 2023-11-25, custom)"
   xmlns:inkscape="http://www.inkscape.org/namespaces/inkscape"
   xmlns:sodipodi="http://sodipodi.sourceforge.net/DTD/sodipodi-0.dtd"
   xmlns="http://www.w3.org/2000/svg"
   xmlns:svg="http://www.w3.org/2000/svg">
  <sodipodi:namedview
     id="namedview12"
     pagecolor="#ffffff"
     bordercolor="#000000"
     borderopacity="0.25"
     inkscape:showpageshadow="2"
     inkscape:pageopacity="0.0"
     inkscape:pagecheckerboard="0"
     inkscape:deskcolor="#d1d1d1"
     showgrid="true"
     inkscape:current-layer="svg12">
    <inkscape:grid
       id="grid12"
       units="px"
       originx="0"
       originy="0"
       spacingx="0.5"
       spacingy="0.5"
       empcolor="#0099e5"
       empopacity="0.30196078"
       color="#0099e5"
       opacity="0.14901961"
       empspacing="2"
       dotted="false"
       gridanglex="30"
       gridanglez="30"
       visible="true" />
  </sodipodi:namedview>
  <defs
     id="defs6">
    <radialGradient
       id="a"
       cx="5.3999925"
       cy="1034.7039"
       r="4"
       gradientTransform="matrix(1.9642759,-1.9642982,1.1785882,1.1785751,-1221.5255,-1200.2975)"
       gradientUnits="userSpaceOnUse">
      <stop
         stop-color="#198d19"
         offset="0"
         id="stop1" />
      <stop
         stop-color="#ffffff"
         offset="1"
         id="stop2" />
    </radialGradient>
    <radialGradient
       id="c"
       cx="5.3999925"
       cy="1034.7039"
       r="4"
       gradientTransform="matrix(1.9642759,-1.9660222,1.1785882,1.1796095,-1209.5255,-1201.357)"
       gradientUnits="userSpaceOnUse">
      <stop
         stop-color="#1a75ff"
         offset="0"
         id="stop3" />
      <stop
         stop-color="#ffffff"
         offset="1"
         id="stop4" />
    </radialGradient>
    <radialGradient
       id="b"
       cx="5.3999925"
       cy="1034.7039"
       r="4"
       gradientTransform="matrix(1.9642759,-1.9660222,1.1785882,1.1796095,-1221.5255,-1189.3522)"
       gradientUnits="userSpaceOnUse">
      <stop
         stop-color="#ff1919"
         offset="0"
         id="stop5" />
      <stop
         stop-color="#ffffff"
         offset="1"
         id="stop6" />
    </radialGradient>
  </defs>
  <circle
     cx="7"
     cy="6.9999828"
     r="5.5"
     fill="url(#a)"
     fill-rule="evenodd"
     stroke="#198d19"
     stroke-linecap="square"
     style="fill:url(#a);stroke-linejoin:round;paint-order:normal"
     id="circle6" />
  <ellipse
     cx="19"
     cy="6.9999828"
     rx="5.5"
     ry="5.504827"
     fill="url(#c)"
     fill-rule="evenodd"
     stroke="#1a75ff"
     stroke-linecap="square"
     style="fill:url(#c);stroke-linejoin:round;paint-order:normal"
     id="ellipse6" />
  <ellipse
     cx="7"
     cy="19.004866"
     rx="5.5"
     ry="5.504827"
     fill="url(#b)"
     fill-rule="evenodd"
     stroke="#ff1a1a"
     stroke-linecap="square"
     style="fill:url(#b);stroke-linejoin:round;paint-order:normal"
     id="ellipse7" />
  <rect
     x="6.5"
     y="19.499983"
     width="18"
     height="16"
     fill="#ffffff"
     stroke="#2a7efe"
     stroke-width="0.999998"
     id="rect7"
     style="stroke-linejoin:round" />
  <rect
     x="24.5"
     y="19.499983"
     width="11"
     height="8.0000181"
     fill="#ffffff"
     stroke="#2a7efe"
     stroke-linecap="round"
     style="stroke-linejoin:round;paint-order:normal"
     id="rect8" />
  <path
     d="m 30,22.0003 -2.5,2.5 h 5 z"
     fill="#666666"
     fill-rule="evenodd"
     stroke="#666666"
     stroke-width="1px"
     id="path8"
     style="stroke-linejoin:round" />
  <rect
     transform="scale(1,-1)"
     x="24.5"
     y="-35.499981"
     width="11"
     height="8.0000181"
     fill="#ffffff"
     stroke="#2a7efe"
     stroke-linecap="round"
     style="stroke-linejoin:round;paint-order:normal"
     id="rect9" />
  <path
     d="m 30,33 -2.5,-2.5 h 5 z"
     fill="#666666"
     fill-rule="evenodd"
     stroke="#666666"
     stroke-width="1px"
     id="path9"
     style="stroke-linejoin:round" />
  <path
     d="M 12.399725,31.3999 V 23.6 L 10.087,25.0857"
     fill="none"
     stroke="#666666"
     stroke-linecap="round"
     stroke-width="1.2"
     id="path10"
     style="stroke-linejoin:round" />
  <path
     d="m 19.424996,23.6 -2.549656,4.682 m -0.225615,0.8894 c 0,-1.0256 0.828354,-1.8571 1.85018,-1.8571 1.021827,0 1.850181,0.8315 1.850181,1.8571 v 0.3715 c 0,1.0256 -0.828354,1.8571 -1.850181,1.8571 -1.021826,0 -1.85018,-0.8315 -1.85018,-1.8571 z"
     fill="none"
     stroke="#666666"
     stroke-linecap="round"
     stroke-width="1.2"
     id="path11"
     style="stroke-linejoin:round" />
  <path
     d="m 14.499725,31.5 v 1"
     fill="#666666"
     stroke="#666666"
     stroke-linecap="round"
     stroke-width="1.3"
     id="path12"
     style="stroke-linejoin:round" />
</svg>
