<?xml version="1.0" encoding="UTF-8" standalone="no"?>
<svg
   height="16"
   width="16"
   version="1.1"
   id="svg175"
   sodipodi:docname="item_project.svg"
   inkscape:export-filename="item_project.png"
   inkscape:export-xdpi="96"
   inkscape:export-ydpi="96"
   inkscape:version="1.2.2 (732a01da63, 2022-12-09)"
   xmlns:inkscape="http://www.inkscape.org/namespaces/inkscape"
   xmlns:sodipodi="http://sodipodi.sourceforge.net/DTD/sodipodi-0.dtd"
   xmlns="http://www.w3.org/2000/svg"
   xmlns:svg="http://www.w3.org/2000/svg">
  <defs
     id="defs179" />
  <sodipodi:namedview
     id="namedview177"
     pagecolor="#ffffff"
     bordercolor="#666666"
     borderopacity="1.0"
     inkscape:showpageshadow="2"
     inkscape:pageopacity="0.0"
     inkscape:pagecheckerboard="0"
     inkscape:deskcolor="#d1d1d1"
     showgrid="true"
     inkscape:zoom="57.375"
     inkscape:cx="7.9912854"
     inkscape:cy="8"
     inkscape:current-layer="svg175">
    <inkscape:grid
       type="xygrid"
       id="grid567" />
  </sodipodi:namedview>
  <radialGradient
     id="a"
     cx="7.388889"
     cy="3.048611"
     gradientTransform="matrix(-.00000007 1.1428573 -1.1428571 -.00000007 10.484128 -4.944445)"
     gradientUnits="userSpaceOnUse"
     r="3.5">
    <stop
       offset="0"
       stop-color="#ff8080"
       id="stop154" />
    <stop
       offset="1"
       stop-color="#e50000"
       id="stop156" />
  </radialGradient>
  <radialGradient
     id="b"
     cx="3"
     cy="10"
     gradientTransform="matrix(0 1.1428571 -1.1428571 0 14.928571 6.071429)"
     gradientUnits="userSpaceOnUse"
     r="3.5">
    <stop
       offset="0"
       stop-color="#80b2ff"
       id="stop159" />
    <stop
       offset="1"
       stop-color="#2672e5"
       id="stop161" />
  </radialGradient>
  <radialGradient
     id="c"
     cx="10.5"
     cy="9.5"
     gradientTransform="matrix(-.00000012 1.1428571 -1.1428571 -.00000013 21.357144 -2.499999)"
     gradientUnits="userSpaceOnUse"
     r="3.5">
    <stop
       offset="0"
       stop-color="#ffe680"
       id="stop164" />
    <stop
       offset="1"
       stop-color="#e5b800"
       id="stop166" />
  </radialGradient>
  <circle
     cx="8"
     cy="4.5"
     fill="url(#a)"
     r="3.5"
     id="circle169" />
  <circle
     cx="11.5"
     cy="10.5"
     fill="url(#c)"
     r="3.5"
     id="circle171" />
  <circle
     cx="4.5"
     cy="10.5"
     fill="url(#b)"
     r="3.5"
     id="circle173" />
</svg>
