<?xml version="1.0" encoding="UTF-8" standalone="no"?>
<svg
   height="24"
   viewBox="0 0 6.3499998 6.3500003"
   width="24"
   version="1.1"
   id="svg151"
   sodipodi:docname="Database_08_24.svg"
   inkscape:export-filename="Database_08_24.png"
   inkscape:export-xdpi="96"
   inkscape:export-ydpi="96"
   inkscape:version="1.2.1 (9c6d41e410, 2022-07-14)"
   xmlns:inkscape="http://www.inkscape.org/namespaces/inkscape"
   xmlns:sodipodi="http://sodipodi.sourceforge.net/DTD/sodipodi-0.dtd"
   xmlns="http://www.w3.org/2000/svg"
   xmlns:svg="http://www.w3.org/2000/svg">
  <defs
     id="defs155" />
  <sodipodi:namedview
     id="namedview153"
     pagecolor="#ffffff"
     bordercolor="#666666"
     borderopacity="1.0"
     inkscape:showpageshadow="2"
     inkscape:pageopacity="0.0"
     inkscape:pagecheckerboard="0"
     inkscape:deskcolor="#d1d1d1"
     showgrid="true"
     inkscape:zoom="38.25"
     inkscape:cx="11.594771"
     inkscape:cy="12"
     inkscape:current-layer="svg151">
    <inkscape:grid
       type="xygrid"
       id="grid850" />
  </sodipodi:namedview>
  <path
     id="path141"
     style="fill:#00aad4;stroke-width:0.529169;stroke-linecap:round;stroke-linejoin:round;stroke-miterlimit:5.6"
     d="M 3.175 0.396875 C 1.8599146 0.396875 0.79375001 0.81149885 0.79375001 1.3229167 L 0.79375001 2.0639567 C 0.79375001 2.5753745 1.8599146 2.9899984 3.175 2.9899984 C 4.4900858 2.9899984 5.55625 2.5753745 5.55625 2.0639567 L 5.55625 1.3327352 L 5.55625 1.3229167 C 5.55625 0.81149885 4.4900858 0.396875 3.175 0.396875 z M 3.175 0.95239665 C 4.2751593 0.95239665 4.9937483 1.3084446 5.3314576 1.5885335 C 4.9945061 1.8182934 4.2778752 2.0798493 3.175 2.0639567 C 2.0830867 2.0481584 1.3666213 1.7906402 1.0257772 1.5714803 C 1.3646731 1.2903637 2.07676 0.95239665 3.175 0.95239665 z M 0.79375001 2.6194784 L 0.79375001 3.54552 C 0.79375001 4.0569383 1.8599133 4.4715617 3.175 4.4715617 C 4.4900871 4.4715617 5.55625 4.0569383 5.55625 3.54552 L 5.55625 2.6194784 C 5.55625 3.1308967 4.4900871 3.54552 3.175 3.54552 C 1.8599133 3.54552 0.79375001 3.1308967 0.79375001 2.6194784 z M 0.79375001 4.1010417 L 0.79375001 5.0270834 C 0.79375001 5.5385017 1.8599133 5.953125 3.175 5.953125 C 4.4900871 5.953125 5.55625 5.5385017 5.55625 5.0270834 L 5.55625 4.1010417 C 5.55625 4.61246 4.4900871 5.0270834 3.175 5.0270834 C 1.8599133 5.0270834 0.79375001 4.61246 0.79375001 4.1010417 z " />
</svg>
