<?xml version="1.0" encoding="UTF-8" standalone="no"?>
<svg
   height="32"
   width="32"
   version="1.1"
   id="svg272"
   sodipodi:docname="Arrow_48_32.svg"
   inkscape:export-filename="Arrow_48_32.png"
   inkscape:export-xdpi="96"
   inkscape:export-ydpi="96"
   inkscape:version="1.2.2 (732a01da63, 2022-12-09)"
   xmlns:inkscape="http://www.inkscape.org/namespaces/inkscape"
   xmlns:sodipodi="http://sodipodi.sourceforge.net/DTD/sodipodi-0.dtd"
   xmlns="http://www.w3.org/2000/svg"
   xmlns:svg="http://www.w3.org/2000/svg">
  <defs
     id="defs276" />
  <sodipodi:namedview
     id="namedview274"
     pagecolor="#ffffff"
     bordercolor="#666666"
     borderopacity="1.0"
     inkscape:showpageshadow="2"
     inkscape:pageopacity="0.0"
     inkscape:pagecheckerboard="0"
     inkscape:deskcolor="#d1d1d1"
     showgrid="true"
     inkscape:zoom="28.6875"
     inkscape:cx="14.291939"
     inkscape:cy="16"
     inkscape:current-layer="svg272">
    <inkscape:grid
       type="xygrid"
       id="grid913" />
  </sodipodi:namedview>
  <circle
     cx="16"
     cy="16"
     fill="#e0edff"
     fill-rule="evenodd"
     r="13.5"
     stroke-opacity="0.954902"
     id="circle266"
     style="stroke:#2a7efe;stroke-width:3;stroke-linecap:round;stroke-linejoin:round" />
  <path
     d="m 18,22 6,-6 -6,-6"
     stroke-linejoin="round"
     id="path1153"
     style="fill:none;stroke:#2a7efe;stroke-width:3;stroke-linecap:round;stroke-linejoin:round;stroke-dasharray:none;stroke-opacity:1" />
  <path
     d="M 24,16 H 7.5"
     id="path1155"
     style="fill:none;stroke:#2a7efe;stroke-width:3;stroke-linecap:round;stroke-linejoin:round;stroke-dasharray:none;stroke-opacity:1" />
</svg>
