<?xml version="1.0" encoding="UTF-8" standalone="no"?>
<svg
   height="24"
   width="24"
   version="1.1"
   id="svg36"
   sodipodi:docname="Database_06_24.svg"
   inkscape:version="1.2-beta (1b65182ce9, 2022-04-05)"
   xmlns:inkscape="http://www.inkscape.org/namespaces/inkscape"
   xmlns:sodipodi="http://sodipodi.sourceforge.net/DTD/sodipodi-0.dtd"
   xmlns:xlink="http://www.w3.org/1999/xlink"
   xmlns="http://www.w3.org/2000/svg"
   xmlns:svg="http://www.w3.org/2000/svg">
  <defs
     id="defs40" />
  <sodipodi:namedview
     id="namedview38"
     pagecolor="#ffffff"
     bordercolor="#666666"
     borderopacity="1.0"
     inkscape:pageshadow="2"
     inkscape:pageopacity="0.0"
     inkscape:pagecheckerboard="0"
     inkscape:deskcolor="#d1d1d1"
     showgrid="true"
     inkscape:zoom="38.25"
     inkscape:cx="12"
     inkscape:cy="12"
     inkscape:current-layer="svg36">
    <inkscape:grid
       type="xygrid"
       id="grid1176" />
  </sodipodi:namedview>
  <linearGradient
     id="a"
     gradientUnits="userSpaceOnUse"
     x1="4.500003"
     x2="18.000003"
     xlink:href="#b"
     y1="10.500017"
     y2="10.500017" />
  <linearGradient
     id="b">
    <stop
       offset="0"
       stop-color="#4276c4"
       id="stop3" />
    <stop
       offset=".34375"
       stop-color="#80b3ff"
       id="stop5" />
    <stop
       offset="1"
       stop-color="#04a"
       id="stop7" />
  </linearGradient>
  <linearGradient
     id="c"
     gradientUnits="userSpaceOnUse"
     x1="4.500003"
     x2="18.000003"
     xlink:href="#b"
     y1="1.500217"
     y2="1.500217" />
  <linearGradient
     id="d"
     gradientUnits="userSpaceOnUse"
     x1="4.500003"
     x2="18.000003"
     xlink:href="#b"
     y1="6.000017"
     y2="6.000017" />
  <g
     stroke-linecap="round"
     stroke-linejoin="round"
     transform="translate(-1.5)"
     id="g28">
    <g
       fill="none"
       id="g24">
      <ellipse
         cx="12"
         cy="18.75"
         rx="7.5"
         ry="2.25"
         stroke="url(#a)"
         stroke-width="3"
         id="ellipse12" />
      <ellipse
         cx="12"
         cy="15.812256"
         rx="8.241464"
         ry="2.937722"
         stroke="#fff"
         stroke-width="1.5"
         id="ellipse14" />
      <ellipse
         cx="12"
         cy="14.25"
         rx="7.5"
         ry="2.25"
         stroke="url(#d)"
         stroke-width="3"
         id="ellipse16" />
      <ellipse
         cx="12"
         cy="11.312256"
         rx="8.241464"
         ry="2.937722"
         stroke="#fff"
         stroke-width="1.5"
         id="ellipse18" />
      <ellipse
         cx="12"
         cy="9.75"
         rx="7.5"
         ry="2.25"
         stroke="url(#c)"
         stroke-width="3"
         id="ellipse20" />
      <ellipse
         cx="12"
         cy="6.812195"
         rx="8.241464"
         ry="2.937722"
         stroke="#fff"
         stroke-width="1.5"
         id="ellipse22" />
    </g>
    <ellipse
       cx="12"
       cy="5.250001"
       fill="#80b3ff"
       fill-rule="evenodd"
       rx="8.25"
       ry="3"
       stroke="url(#a)"
       stroke-width="1.5"
       id="ellipse26" />
  </g>
  <g
     stroke-width=".444411"
     transform="matrix(1.5000557 0 0 1.5000557 8.999443 9)"
     id="g34">
    <path
       d="m6.2192367.00035783c-.2733136-.0083479-.5392157.12972208-.6858206.3770008l-.4592191.77405477-.1503993-.0020053-.4572136-.77004415c-.1955796-.32887411-.6030024-.46520635-.9565394-.31884643l-.9485179.39304339c-.3534805.14649623-.5454512.52954552-.4511978.90039029l.2205855.8703103-.1062821.1062821-.8703103-.2225908c-.37135699-.0949164-.75596918.096974-.90239559.4511978l-.39304339.9485179c-.14693482.354013-.01085852.7630714.31884643.9585447l.77405485.459219-.0020053.1503993-.77204955.4572136c-.32887387.1955798-.46320102.6030025-.31684111.9565394l.39304339.9485179c.14649623.3534805.52954552.5454512.90039027.4511978l.8703103-.2205855.1062821.1062821-.2225908.8703103c-.0949167.371357.0969743.7559691.4511978.9023956l.9485179.3930434c.3540132.1469339.7630716.0108588.9585447-.3188465l.459219-.7740547.1503993.00201.4572137.7720494c.1955797.3288695.6030024.4631967.9565393.3168365l.948518-.3930434c.3534804-.1464962.5454511-.5295455.4511977-.9003903l-.2205855-.8703103.1062821-.1062821.8703103.2225908c.371357.0949165.7559691-.0969741.9023956-.4511978l.3930434-.9485179c.146935-.354013.0108586-.7630714-.3188464-.9585447l-.7740548-.459219.0020053-.1483939.7720495-.459219c.3288738-.1955799.4632014-.6030025.3168411-.9565394l-.3930434-.9485179c-.1464962-.3534805-.5295455-.5454512-.9003903-.4511978l-.8703103.2205855-.1062821-.1062821.2225908-.8703103c.0949164-.37135701-.096974-.7559692-.4511977-.90239561l-.948518-.39304339c-.0885032-.03673371-.1816194-.05537175-.272724-.05815437zm-1.2192366 4.22922707a.7700442.7700442 0 0 1 .7700442.7700442.7700442.7700442 0 0 1 -.7700442.7700442.7700442.7700442 0 0 1 -.7700442-.7700442.7700442.7700442 0 0 1 .7700442-.7700442z"
       fill="#fff"
       id="path30" />
    <path
       d="m2.8558434 1.1646588.329715 1.2938178-.7259052.7261068-1.2955239-.3294245-.39286888.9484694 1.14901208.6831355-.0001426 1.0267275-1.14801103.6817237.39291083.9485708 1.2938178-.329715.7261068.7259052-.3294244 1.2955239.9484693.3928689.6831355-1.149012 1.0267276.0001426.6817236 1.1480109.9485708-.3929108-.3297149-1.2938178.7259051-.7261068 1.2955239.3294245.3928689-.9484694-1.149012-.6831355.0001426-1.0267275 1.1480109-.6817237-.3929108-.9485708-1.2938178.329715-.7261068-.7259052.3294245-1.2955239-.9484694-.3928689-.6831355 1.149012-1.0267275-.0001426-.6817237-1.14801095zm1.5547904 2.4121142a1.5400884 1.5400884 0 0 1 2.0122224.8334899 1.5400884 1.5400884 0 0 1 -.8334899 2.0122224 1.5400884 1.5400884 0 0 1 -2.0122224-.8334899 1.5400884 1.5400884 0 0 1 .8334899-2.0122224z"
       fill="#666"
       id="path32" />
  </g>
</svg>
