<?xml version="1.0" encoding="UTF-8" standalone="no"?>
<svg
   height="64"
   viewBox="0 0 16.933 16.933"
   width="64"
   version="1.1"
   id="svg32"
   sodipodi:docname="Secure_06_64.svg"
   inkscape:version="1.2.2 (732a01da63, 2022-12-09)"
   xmlns:inkscape="http://www.inkscape.org/namespaces/inkscape"
   xmlns:sodipodi="http://sodipodi.sourceforge.net/DTD/sodipodi-0.dtd"
   xmlns="http://www.w3.org/2000/svg"
   xmlns:svg="http://www.w3.org/2000/svg">
  <defs
     id="defs36" />
  <sodipodi:namedview
     id="namedview34"
     pagecolor="#ffffff"
     bordercolor="#000000"
     borderopacity="0.25"
     inkscape:showpageshadow="2"
     inkscape:pageopacity="0.0"
     inkscape:pagecheckerboard="0"
     inkscape:deskcolor="#d1d1d1"
     showgrid="true"
     inkscape:zoom="14.21875"
     inkscape:cx="26.830769"
     inkscape:cy="32"
     inkscape:current-layer="svg32">
    <inkscape:grid
       type="xygrid"
       id="grid1145" />
  </sodipodi:namedview>
  <filter
     id="a"
     color-interpolation-filters="sRGB"
     height="1.1801321"
     width="1.190248"
     x="-0.095123999"
     y="-0.10785206">
    <feGaussianBlur
       stdDeviation=".1328125"
       id="feGaussianBlur2" />
  </filter>
  <linearGradient
     id="b"
     gradientTransform="matrix(.60202641 0 0 -.52184784 -25.97738 13.681441)"
     gradientUnits="userSpaceOnUse"
     x1="52.5"
     x2="61.5"
     y1="7"
     y2="7">
    <stop
       offset="0"
       stop-color="#fc0"
       id="stop5" />
    <stop
       offset=".37840304"
       stop-color="#f9f9f9"
       id="stop7" />
    <stop
       offset="1"
       stop-color="#ffd42a"
       id="stop9" />
  </linearGradient>
  <linearGradient
     id="c"
     gradientTransform="matrix(4.0371968 0 0 4.0504417 -.078902 -.285682)"
     gradientUnits="userSpaceOnUse"
     x1="1.499774"
     x2="3.614834"
     y1="1.322335"
     y2="2.204926">
    <stop
       offset="0"
       stop-color="#80b5fe"
       id="stop12" />
    <stop
       offset="1"
       stop-color="#2a7efe"
       id="stop14" />
  </linearGradient>
  <linearGradient
     id="d"
     gradientTransform="matrix(4.0371968 0 0 4.0504417 -.078902 -.285682)"
     gradientUnits="userSpaceOnUse"
     x1=".530372"
     x2="3.879216"
     y1="1.145817"
     y2="2.557962">
    <stop
       offset="0"
       stop-color="#e7c962"
       id="stop17" />
    <stop
       offset="1"
       stop-color="#d4a41c"
       id="stop19" />
  </linearGradient>
  <g
     stroke-linejoin="round"
     id="g30">
    <path
       d="m1.7065288 9.3602168-.0000003-6.4347883c2.1347273 0 4.981031-1.0724647 6.759971-2.14492945 1.7789395 1.07246475 4.6252425 2.14492945 6.7599715 2.14492945v6.4347883c0 2.5095962-3.55788 6.4347892-6.7599715 6.7922782-3.2020912-.357489-6.7599707-4.282682-6.7599707-6.7922782z"
       fill="url(#c)"
       stroke="url(#d)"
       stroke-linecap="round"
       stroke-width=".767276"
       id="path22" />
    <path
       d="m6.3498723 7.9374608v-1.604284c0-1.159756.9476461-2.099928 2.1166271-2.099928 1.1689809 0 2.1166276.940172 2.1166276 2.099928v1.604284"
       fill="none"
       stroke="#b3b3b3"
       stroke-width="1.05831"
       id="path24" />
    <path
       d="m5 7.8021661v-1.9099298c0-1.380712 1.119288-2.5 2.5-2.5s2.5 1.119288 2.5 2.5v1.9099298"
       fill="none"
       filter="url(#a)"
       stroke="#fff"
       stroke-width=".31374"
       transform="matrix(.84665081 0 0 .83997057 2.116618 1.383872)"
       id="path26" />
    <path
       d="m11.376859 11.906134v-3.7040932h-5.8207184v3.7040932z"
       fill="url(#b)"
       stroke="#d4aa00"
       stroke-linecap="round"
       stroke-width=".529156"
       id="path28" />
  </g>
</svg>
