<?xml version="1.0" encoding="UTF-8" standalone="no"?>
<svg
   width="48"
   height="48"
   version="1.1"
   viewBox="0 0 48 48"
   id="svg13"
   sodipodi:docname="teventlog_200.svg"
   inkscape:export-filename="teventlog_200.png"
   inkscape:export-xdpi="96"
   inkscape:export-ydpi="96"
   inkscape:version="1.3.2 (091e20e, 2023-11-25, custom)"
   xmlns:inkscape="http://www.inkscape.org/namespaces/inkscape"
   xmlns:sodipodi="http://sodipodi.sourceforge.net/DTD/sodipodi-0.dtd"
   xmlns="http://www.w3.org/2000/svg"
   xmlns:svg="http://www.w3.org/2000/svg">
  <sodipodi:namedview
     id="namedview13"
     pagecolor="#ffffff"
     bordercolor="#000000"
     borderopacity="0.25"
     inkscape:showpageshadow="2"
     inkscape:pageopacity="0.0"
     inkscape:pagecheckerboard="0"
     inkscape:deskcolor="#d1d1d1"
     showgrid="true"
     inkscape:current-layer="svg13">
    <inkscape:grid
       id="grid13"
       units="px"
       originx="0"
       originy="0"
       spacingx="0.5"
       spacingy="0.5"
       empcolor="#0099e5"
       empopacity="0.30196078"
       color="#0099e5"
       opacity="0.14901961"
       empspacing="2"
       dotted="false"
       gridanglex="30"
       gridanglez="30"
       visible="true" />
  </sodipodi:namedview>
  <defs
     id="defs4">
    <radialGradient
       id="a"
       cx="8.8011074"
       cy="1036.9969"
       r="9"
       gradientTransform="matrix(0.30245597,1.3611161,-1.3611054,0.30246683,1439.3973,-294.53935)"
       gradientUnits="userSpaceOnUse">
      <stop
         stop-color="#cccccc"
         offset="0"
         id="stop1" />
      <stop
         stop-color="#ffffff"
         offset="1"
         id="stop2" />
    </radialGradient>
    <linearGradient
       id="b"
       x1="20"
       x2="-3"
       y1="1048.3622"
       y2="1025.3622"
       gradientTransform="matrix(1.8472225,0,0,1.952778,2.8333372,-2008.5963)"
       gradientUnits="userSpaceOnUse">
      <stop
         stop-color="#f2f2f2"
         offset="0"
         id="stop3" />
      <stop
         stop-color="#ffffff"
         offset="1"
         id="stop4" />
    </linearGradient>
  </defs>
  <rect
     x="7.5"
     y="4.4999828"
     width="35"
     height="37"
     fill="url(#b)"
     stroke="#2a7efe"
     stroke-linecap="round"
     stroke-linejoin="round"
     style="fill:url(#b);paint-order:normal"
     id="rect4" />
  <rect
     x="23"
     y="10.999983"
     width="14.999998"
     height="1.999999"
     fill="#808080"
     style="paint-order:normal"
     id="rect5" />
  <rect
     x="23"
     y="18.999983"
     width="14.999999"
     height="1.999999"
     fill="#808080"
     style="paint-order:normal"
     id="rect6" />
  <circle
     cx="34"
     cy="34.499981"
     r="12.25"
     fill="url(#a)"
     stroke="#999999"
     stroke-linecap="round"
     stroke-linejoin="round"
     stroke-width="1.5"
     style="fill:url(#a);paint-order:normal"
     id="circle6" />
  <path
     d="m 33,28 h 2 v 6 h 4 v 2 h -6 z"
     fill="#000000"
     fill-rule="evenodd"
     stroke-width="0"
     id="path6" />
  <path
     d="m 35.027027,25 v 2.0245 H 33 V 25"
     fill="#2a7fff"
     fill-rule="evenodd"
     stroke-width="0"
     id="path7" />
  <path
     d="m 43.027027,34 v 2.0245 H 41 V 34"
     fill="#2a7fff"
     fill-rule="evenodd"
     stroke-width="0"
     id="path8" />
  <path
     d="m 27.027027,34 v 2.0245 H 25 V 34"
     fill="#2a7fff"
     fill-rule="evenodd"
     stroke-width="0"
     id="path9" />
  <path
     d="m 35.027027,42 v 2.0245 H 33 V 42"
     fill="#2a7fff"
     fill-rule="evenodd"
     stroke-width="0"
     id="path10" />
  <path
     d="M 12.999997,13 15,15 20.000007,10"
     fill="none"
     stroke="#00a300"
     stroke-linecap="round"
     stroke-linejoin="round"
     stroke-width="2px"
     id="path11" />
  <path
     d="m 11.999996,19 6.000008,6"
     fill="none"
     stroke="#f00000"
     stroke-linecap="round"
     stroke-width="2px"
     id="path12" />
  <path
     d="m 11.999996,25 6.000008,-6"
     fill="none"
     stroke="#f00000"
     stroke-linecap="round"
     stroke-width="2px"
     id="path13" />
  <circle
     cx="15"
     cy="32.999981"
     r="3.000005"
     fill="none"
     stroke="#f06000"
     stroke-width="1.99999"
     id="circle13" />
</svg>
