<?xml version="1.0" encoding="UTF-8" standalone="no"?>
<svg
   height="33"
   width="33"
   version="1.1"
   id="svg359"
   sodipodi:docname="da_ifndef_150.svg"
   inkscape:export-filename="da_ifndef_150.png"
   inkscape:export-xdpi="96"
   inkscape:export-ydpi="96"
   inkscape:version="1.2.1 (9c6d41e410, 2022-07-14)"
   xmlns:inkscape="http://www.inkscape.org/namespaces/inkscape"
   xmlns:sodipodi="http://sodipodi.sourceforge.net/DTD/sodipodi-0.dtd"
   xmlns="http://www.w3.org/2000/svg"
   xmlns:svg="http://www.w3.org/2000/svg">
  <defs
     id="defs363" />
  <sodipodi:namedview
     id="namedview361"
     pagecolor="#ffffff"
     bordercolor="#666666"
     borderopacity="1.0"
     inkscape:showpageshadow="2"
     inkscape:pageopacity="0.0"
     inkscape:pagecheckerboard="0"
     inkscape:deskcolor="#d1d1d1"
     showgrid="true"
     inkscape:zoom="27.818182"
     inkscape:cx="16.482026"
     inkscape:cy="16.5"
     inkscape:current-layer="svg359">
    <inkscape:grid
       type="xygrid"
       id="grid2182" />
  </sodipodi:namedview>
  <linearGradient
     id="a"
     gradientTransform="matrix(-1.0020096 -.18890715 0 .8831277 23.55811 .753638)"
     gradientUnits="userSpaceOnUse"
     x1="7.184878"
     x2="17.184877"
     y1="2.599694"
     y2="2.238764">
    <stop
       offset="0"
       stop-color="#0c0"
       id="stop324" />
    <stop
       offset=".25781018"
       stop-color="#090"
       id="stop326" />
    <stop
       offset=".65000004"
       stop-color="#0c0"
       id="stop328" />
    <stop
       offset="1"
       stop-color="#090"
       id="stop330" />
  </linearGradient>
  <path
     d="m9 15.5h-3c-.00749-.411784-.011235-.478715-.011235-.568559 0-.928385.1534831-1.692057.4604493-2.291015.3069661-.598959.9208983-1.272787 1.8417967-2.021485.920898-.748698 1.471191-1.239095 1.650879-1.471191.277018-.366862.415527-.771159.415527-1.21289 0-.613933-.24707-1.138021-.741211-1.572266-.486653-.441732-1.1455074-.662598-1.976562-.662598-.8011068 0-1.4711915.228353-2.010254.685059-.5390625.456705-.9096679 1.152995-1.1118163 2.088867l-2.8974564-.359375c.082357-1.340169.6513672-2.47819 1.7070312-3.414062 1.063151-.9358728 2.4557291-1.403809 4.1777343-1.403809 1.8118492 0 3.2530922.4754231 4.3237302 1.426269 1.070638.94336 1.605957 2.043946 1.605957 3.301758 0 .696289-.198405 1.355144-.595215 1.976563-.389323.621419-1.227864 1.467448-2.515625 2.538086-.666341.554036-.945638.999511-1.110351 1.336425-.157227.336914-.228353.755733-.213379 1.624223zm-3 4.5v-3h3v3z"
     fill="#f00000"
     stroke-width="1.5"
     id="path333" />
  <g
     fill="none"
     stroke="#00aad4"
     stroke-linecap="round"
     stroke-linejoin="round"
     transform="matrix(1.5 0 0 1.5 -3 0)"
     id="g339">
    <path
       d="m20.5 17.5h-3.5c-1.5 0-2.5-.5-2.5-2v-1.333333"
       id="path335" />
    <path
       d="m18.5 15.5 2 2-2 2"
       id="path337" />
  </g>
  <g
     fill="none"
     stroke="#d38d5f"
     stroke-width="1.5"
     transform="translate(-7 -10)"
     id="g345">
    <path
       d="m18 24.75h7"
       id="path341" />
    <path
       d="m18 27.75h7"
       id="path343" />
  </g>
  <g
     transform="matrix(.82382667 0 0 .82382667 16.704776 7.630867)"
     id="g351">
    <path
       d="m6.138206-4.04204c1.0492634-.7556485 2.2230174-1.0164354 3.693558-.6715513 1.052994.246958 3.116237 1.3103193 4.450814 1.4465935 1.455863.1486593 2.57722.1020203 3.574419-.40708l.0048 8.0156856c-.759732.6671681-2.118543.5557395-3.574405.4070809-1.334576-.1362741-3.397821-1.1996373-4.450814-1.4465942-1.470541-.3448859-2.6442949-.0840965-3.6935593.6715512z"
       fill="url(#a)"
       fill-rule="evenodd"
       stroke="#808080"
       stroke-width=".276327"
       id="path347" />
    <path
       d="m5-4v18"
       fill="none"
       stroke="#c87137"
       stroke-linecap="round"
       stroke-width="2"
       id="path349" />
  </g>
  <g
     fill="none"
     stroke-linecap="round"
     transform="translate(14.732325 1.767675)"
     id="g357">
    <path
       d="m9.267675 14.232325 5-5.0000008m0 5.0000008-5-5.0000008"
       stroke="#fff"
       stroke-width="3.5"
       id="path353" />
    <path
       d="m9.267675 14.232325 5-5.0000008m0 5.0000008-5-5.0000008"
       stroke="#dc0000"
       stroke-width="1.5"
       id="path355" />
  </g>
</svg>
