<?xml version="1.0" encoding="UTF-8" standalone="no"?>
<svg
   height="32"
   width="32"
   version="1.1"
   id="svg456"
   sodipodi:docname="Warning_02_32.svg"
   inkscape:export-filename="Warning_02_32.png"
   inkscape:export-xdpi="96"
   inkscape:export-ydpi="96"
   inkscape:version="1.2 (dc2aedaf03, 2022-05-15)"
   xmlns:inkscape="http://www.inkscape.org/namespaces/inkscape"
   xmlns:sodipodi="http://sodipodi.sourceforge.net/DTD/sodipodi-0.dtd"
   xmlns="http://www.w3.org/2000/svg"
   xmlns:svg="http://www.w3.org/2000/svg">
  <defs
     id="defs460" />
  <sodipodi:namedview
     id="namedview458"
     pagecolor="#ffffff"
     bordercolor="#666666"
     borderopacity="1.0"
     inkscape:pageshadow="2"
     inkscape:pageopacity="0.0"
     inkscape:pagecheckerboard="0"
     inkscape:deskcolor="#d1d1d1"
     showgrid="true"
     inkscape:zoom="28.6875"
     inkscape:cx="15.982571"
     inkscape:cy="16"
     inkscape:current-layer="g1960"
     inkscape:showpageshadow="2">
    <inkscape:grid
       type="xygrid"
       id="grid997" />
  </sodipodi:namedview>
  <g
     id="g1960"
     transform="matrix(2.0000645,0,0,2.0000645,-1.0000748,-0.00177576)">
    <g
       id="g6449"
       transform="matrix(0.99996775,0,0,0.99996775,3.7407634e-5,-0.9990799)">
      <path
         style="fill:#ffffff;stroke:none;stroke-width:1px;stroke-linecap:butt;stroke-linejoin:miter;stroke-opacity:1"
         d="m 14.5,16 c 0.828427,0 1.5,-0.671573 1.5,-1.5 0,-0.258427 -0.06808,-0.506003 -0.183157,-0.718278 L 9.8213459,2.7897827 C 9.5739805,2.3232402 9.0747386,2 8.5,2 7.9303912,2 7.4349375,2.3174958 7.1820557,2.7834467 L 1.1804323,13.786134 C 1.0653525,13.998409 1,14.241573 1,14.5 1,15.328427 1.6715729,16 2.5,16"
         id="path6413"
         sodipodi:nodetypes="csccsccsc" />
      <path
         id="path1062"
         style="fill:#ffd42a;fill-opacity:1;stroke:#000000;stroke-width:0.999997;stroke-linecap:round;stroke-linejoin:round;stroke-dasharray:none;stroke-dashoffset:1.49998;stroke-opacity:1"
         inkscape:transform-center-y="-1.6957108"
         d="m 14.5,14.5 h -12 l 6,-11 z"
         sodipodi:nodetypes="cccc" />
      <path
         style="fill:none;stroke:#000000;stroke-width:1;stroke-linecap:round;stroke-linejoin:miter;stroke-dasharray:none;stroke-opacity:1"
         d="m 8.5,7.5 v 3"
         id="path1006"
         sodipodi:nodetypes="cc" />
      <path
         style="fill:none;stroke:#000000;stroke-width:1;stroke-linecap:round;stroke-linejoin:miter;stroke-dasharray:none;stroke-opacity:1"
         d="m 8.5,12.5 v 0"
         id="path1008"
         sodipodi:nodetypes="cc" />
    </g>
  </g>
</svg>
