<svg width="48" height="48" version="1.1" xmlns="http://www.w3.org/2000/svg">
 <linearGradient id="a" x1="42.679053" x2="28.320945" y1="42.679053" y2="28.320945" gradientTransform="matrix(1.0708235,0,0,1.0708235,-3.5142345,-3.514232)" gradientUnits="userSpaceOnUse">
  <stop stop-color="#009600" offset="0"/>
  <stop stop-color="#6edb39" offset="1"/>
 </linearGradient>
 <g stroke="#ffffff" stroke-linecap="round" stroke-width="2.4">
  <circle transform="matrix(0,1,1,0,0,0)" cx="34.5" cy="34.5" r="12.3" fill="url(#a)" stroke-dashoffset="1.49998" stroke-linejoin="round"/>
  <path d="m34.5 29v11" fill="none"/>
  <path d="m40 34.5h-11" fill="none"/>
 </g>
</svg>
