<?xml version="1.0" encoding="UTF-8" standalone="no"?>
<svg
   height="36"
   viewBox="0 0 9.525 9.525"
   width="36"
   version="1.1"
   id="svg3"
   sodipodi:docname="Layer_03_36.svg"
   inkscape:export-filename="Layer_03_36.png"
   inkscape:export-xdpi="96"
   inkscape:export-ydpi="96"
   inkscape:version="1.3.2 (091e20e, 2023-11-25, custom)"
   xmlns:inkscape="http://www.inkscape.org/namespaces/inkscape"
   xmlns:sodipodi="http://sodipodi.sourceforge.net/DTD/sodipodi-0.dtd"
   xmlns="http://www.w3.org/2000/svg"
   xmlns:svg="http://www.w3.org/2000/svg">
  <defs
     id="defs3" />
  <sodipodi:namedview
     id="namedview3"
     pagecolor="#ffffff"
     bordercolor="#000000"
     borderopacity="0.25"
     inkscape:showpageshadow="2"
     inkscape:pageopacity="0.0"
     inkscape:pagecheckerboard="0"
     inkscape:deskcolor="#d1d1d1"
     showgrid="true"
     inkscape:current-layer="svg3">
    <inkscape:grid
       id="grid3"
       units="px"
       originx="0"
       originy="0"
       spacingx="0.13229167"
       spacingy="0.13229167"
       empcolor="#0099e5"
       empopacity="0.30196078"
       color="#0099e5"
       opacity="0.14901961"
       empspacing="2"
       dotted="false"
       gridanglex="30"
       gridanglez="30"
       visible="true" />
  </sodipodi:namedview>
  <path
     d="m6.3996099 6.2011716-1.6371096.5457032-1.6371097-.5457032-2.827734.942578 4.4648435 1.4882814 4.4648438-1.4882814z"
     fill="#ff7f00"
     stroke-linecap="round"
     stroke-linejoin="round"
     stroke-width=".264582"
     id="path1" />
  <path
     d="m.29765625 2.38125025 4.46484375-1.48828125 4.46484375 1.48828125-4.46484375 1.48828125z"
     fill="#2a7efe"
     stroke-width=".595313"
     id="path2" />
  <path
     d="m6.3996099 3.8199221-1.6371096.5457032-1.6371097-.5457032-2.827734.942578 4.4648435 1.4882814 4.4648438-1.4882814z"
     fill="#2a7efe"
     stroke-linecap="round"
     stroke-linejoin="round"
     stroke-width=".264582"
     id="path3" />
</svg>
