<?xml version="1.0" encoding="UTF-8" standalone="no"?>
<svg
   height="64"
   viewBox="0 0 16.933333 16.933335"
   width="64"
   version="1.1"
   id="svg623"
   sodipodi:docname="Font_21_64.svg"
   inkscape:version="1.2.1 (9c6d41e410, 2022-07-14)"
   inkscape:export-filename="Font_21_64.png"
   inkscape:export-xdpi="96"
   inkscape:export-ydpi="96"
   xmlns:inkscape="http://www.inkscape.org/namespaces/inkscape"
   xmlns:sodipodi="http://sodipodi.sourceforge.net/DTD/sodipodi-0.dtd"
   xmlns="http://www.w3.org/2000/svg"
   xmlns:svg="http://www.w3.org/2000/svg">
  <defs
     id="defs627" />
  <sodipodi:namedview
     id="namedview625"
     pagecolor="#ffffff"
     bordercolor="#666666"
     borderopacity="1.0"
     inkscape:showpageshadow="2"
     inkscape:pageopacity="0.0"
     inkscape:pagecheckerboard="0"
     inkscape:deskcolor="#d1d1d1"
     showgrid="true"
     inkscape:zoom="14.34375"
     inkscape:cx="28.583878"
     inkscape:cy="32"
     inkscape:current-layer="svg623">
    <inkscape:grid
       type="xygrid"
       id="grid1262" />
  </sodipodi:namedview>
  <path
     d="m 8.3590458,4.2333335 c -0.477152,0 -1.022491,0.048281 -1.631845,0.1485549 a 0.52502148,0.52502148 0 0 1 -0.0068,0.00221 c -0.612053,0.092977 -1.212811,0.2202151 -1.800661,0.3826474 -0.435713,0.1225629 -0.729773,0.2524304 -0.749523,0.265597 a 0.52502148,0.52502148 0 0 1 -0.01576,0.011256 c -0.06552,0.040036 -0.10666,0.082233 -0.146302,0.1575562 -0.03343,0.06352 -0.05852,0.152822 -0.05852,0.294858 0,0.258221 0.06615,0.407771 0.19357,0.54695 0.139615,0.13633 0.255897,0.18907 0.456918,0.18907 0.165367,0 0.474481,-0.04308 0.884574,-0.141809 l -0.0022,0.0022 c 1.185394,-0.294265 2.162331,-0.447872 2.959824,-0.447872 0.934338,0 1.6104712,0.07835 2.1135212,0.452414 0.424181,0.309989 0.691004,0.803774 0.691004,1.321234 V 8.005666 A 0.52502148,0.52502148 0 0 1 10.636873,8.523355 C 9.6811878,8.366691 8.8492478,8.289268 8.1429608,8.289268 c -1.772954,0 -3.093227,0.420282 -4.033475,1.210946 -0.9707084,0.81508 -1.3842774,1.611716 -1.3842774,2.466899 0,0.678585 0.3084902,1.294791 1.0533854,1.931208 0.718535,0.605904 1.647404,0.918334 2.874302,0.918334 0.55987,0 1.201295,-0.07958 1.915449,-0.240836 a 0.52502148,0.52502148 0 0 1 0.0044,0 c 0.700549,-0.150633 1.331008,-0.380218 1.9019982,-0.68425 a 0.52502148,0.52502148 0 0 1 0.772031,0.463669 v 0.05176 h 2.356611 c 0.525204,0 0.812919,-0.11596 0.907082,-0.200322 0.15594,-0.141327 0.213828,-0.264716 0.213828,-0.499683 0,-0.245689 -0.05694,-0.359315 -0.207074,-0.490678 a 0.52502148,0.52502148 0 0 1 -0.01126,-0.01367 c -0.09632,-0.09009 -0.379386,-0.207076 -0.90258,-0.207076 H 13.184774 A 0.52502148,0.52502148 0 0 1 12.660331,12.471134 V 7.40453 c 0,-1.014248 -0.339659,-1.720779 -1.071392,-2.286836 a 0.52502148,0.52502148 0 0 1 -0.0044,-0.00221 C 10.865718,4.5474946 9.8119058,4.2333335 8.3590458,4.2333335 Z M 7.9989148,9.714088 c 0.872687,0 1.813222,0.09972 2.8247832,0.297107 a 0.52502148,0.52502148 0 0 1 0.423156,0.51544 v 1.055637 a 0.52502148,0.52502148 0 0 1 -0.227335,0.432158 c -0.630993,0.432189 -1.3473282,0.77352 -2.1450352,1.019623 -0.782757,0.244086 -1.500882,0.369136 -2.160788,0.369136 -0.762632,0 -1.416229,-0.140302 -1.933457,-0.481679 a 0.52502148,0.52502148 0 0 1 -0.0022,-0.0024 c -0.322945,-0.215297 -0.558204,-0.604359 -0.558204,-0.999366 0,-0.565922 0.380425,-1.019243 0.898079,-1.379752 a 0.52502148,0.52502148 0 0 1 0.0046,-0.0044 c 0.814041,-0.551768 1.791047,-0.821575 2.876545,-0.821575 z"
     fill="#2a7fff"
     stroke-width="1.05834"
     id="path258" />
</svg>
