<?xml version="1.0" encoding="UTF-8" standalone="no"?>
<svg
   height="16"
   width="16"
   version="1.1"
   id="svg24"
   sodipodi:docname="menu_tool_syntax_check.svg"
   inkscape:export-filename="menu_tool_syntax_check.png"
   inkscape:export-xdpi="96"
   inkscape:export-ydpi="96"
   inkscape:version="1.2.2 (732a01da63, 2022-12-09)"
   xmlns:inkscape="http://www.inkscape.org/namespaces/inkscape"
   xmlns:sodipodi="http://sodipodi.sourceforge.net/DTD/sodipodi-0.dtd"
   xmlns="http://www.w3.org/2000/svg"
   xmlns:svg="http://www.w3.org/2000/svg">
  <defs
     id="defs28" />
  <sodipodi:namedview
     id="namedview26"
     pagecolor="#ffffff"
     bordercolor="#666666"
     borderopacity="1.0"
     inkscape:showpageshadow="2"
     inkscape:pageopacity="0.0"
     inkscape:pagecheckerboard="0"
     inkscape:deskcolor="#d1d1d1"
     showgrid="true"
     inkscape:zoom="57.375"
     inkscape:cx="7.5119826"
     inkscape:cy="8"
     inkscape:current-layer="svg24">
    <inkscape:grid
       type="xygrid"
       id="grid587" />
  </sodipodi:namedview>
  <path
     d="m2.5.5h11v14h-11z"
     fill="#fff"
     stroke="#2a7fff"
     stroke-linecap="round"
     stroke-linejoin="round"
     stroke-miterlimit="5.6"
     id="path2"
     style="stroke:#d4aa00;stroke-opacity:1" />
  <path
     d="m 5,5.5 h 6"
     id="path4"
     style="fill:none;stroke:#2a7fff;stroke-opacity:1" />
  <path
     d="m 5,3.5 h 6"
     id="path6"
     style="fill:none;stroke:#2a7fff;stroke-opacity:1" />
  <g
     id="g294"
     transform="translate(0,0.90000002)">
    <path
       d="m 7,9 2.5,2.5 4.9,-6"
       stroke="#ffffff"
       stroke-width="3.2"
       id="path16"
       sodipodi:nodetypes="ccc"
       style="fill:none;stroke-linecap:round;stroke-linejoin:round" />
    <path
       d="m 7,9 2.5,2.5 4.9,-6"
       stroke="#008000"
       stroke-width="1.2"
       id="path18"
       style="fill:none;stroke:#008000;stroke-linecap:round;stroke-linejoin:round;stroke-opacity:1"
       sodipodi:nodetypes="ccc" />
  </g>
  <path
     d="m 5,7.5 h 6"
     id="path296"
     style="fill:none;stroke:#2a7fff;stroke-opacity:1" />
</svg>
