<?xml version="1.0" encoding="UTF-8" standalone="no"?>
<svg
   height="16"
   width="16"
   version="1.1"
   id="svg16"
   sodipodi:docname="Zoom_03_16.svg"
   inkscape:version="1.2.1 (9c6d41e410, 2022-07-14)"
   inkscape:export-filename="Zoom_03_16.png"
   inkscape:export-xdpi="96"
   inkscape:export-ydpi="96"
   xmlns:inkscape="http://www.inkscape.org/namespaces/inkscape"
   xmlns:sodipodi="http://sodipodi.sourceforge.net/DTD/sodipodi-0.dtd"
   xmlns="http://www.w3.org/2000/svg"
   xmlns:svg="http://www.w3.org/2000/svg">
  <defs
     id="defs20">
    <radialGradient
       id="a"
       cx="9.1740294"
       cy="7.8253603"
       gradientTransform="matrix(0.66909781,-2.2758851e-8,4.5190518e-8,0.58542853,1.8616763,4.291566)"
       gradientUnits="userSpaceOnUse"
       r="7.5"
       fx="9.1740294"
       fy="7.8253603">
      <stop
         offset="0"
         stop-color="#fff"
         id="stop2" />
      <stop
         offset="1"
         stop-color="#8fc1c7"
         id="stop4" />
    </radialGradient>
  </defs>
  <sodipodi:namedview
     id="namedview18"
     pagecolor="#ffffff"
     bordercolor="#666666"
     borderopacity="1.0"
     inkscape:pageshadow="2"
     inkscape:pageopacity="0.0"
     inkscape:pagecheckerboard="0"
     inkscape:deskcolor="#d1d1d1"
     showgrid="true"
     showguides="true"
     inkscape:zoom="57.375"
     inkscape:cx="7.9912854"
     inkscape:cy="8"
     inkscape:current-layer="svg16"
     inkscape:showpageshadow="2">
    <inkscape:grid
       type="xygrid"
       id="grid249" />
  </sodipodi:namedview>
  <path
     style="fill:none;stroke:#00aad4;stroke-linecap:round;stroke-linejoin:round"
     d="m 2.5,13.5 v -11 h 7 l 4,4 v 7"
     id="path2"
     sodipodi:nodetypes="ccccc" />
  <path
     d="m 9.5,2.5 v 4 h 4"
     id="path6"
     style="fill:none;stroke:#00aad4;stroke-linecap:round;stroke-linejoin:round"
     sodipodi:nodetypes="ccc" />
  <g
     id="g2065"
     transform="rotate(90,0.74999995,14.75)">
    <path
       style="fill:none;stroke:#00aad4;stroke-width:1px;stroke-linecap:round;stroke-linejoin:round;stroke-opacity:1"
       d="M -3.5000001,3.9999999 -3.5,11"
       id="path928"
       sodipodi:nodetypes="cc" />
    <path
       style="fill:none;stroke:#00aad4;stroke-width:1px;stroke-linecap:round;stroke-linejoin:round;stroke-opacity:1"
       d="m -5.0000001,5.4999999 1.5,-1.5 1.5,1.5"
       id="path988"
       sodipodi:nodetypes="ccc" />
    <path
       style="fill:none;stroke:#00aad4;stroke-width:1px;stroke-linecap:round;stroke-linejoin:round;stroke-opacity:1"
       d="M -5,9.5000002 -3.5,11 -2,9.5000002"
       id="path2054"
       sodipodi:nodetypes="ccc" />
  </g>
</svg>
