<?xml version="1.0" encoding="UTF-8" standalone="no"?>
<svg
   width="36"
   height="36"
   version="1.1"
   viewBox="0 0 36 36"
   id="svg21"
   sodipodi:docname="Chip_01_36.svg"
   inkscape:version="1.3.2 (091e20e, 2023-11-25, custom)"
   xmlns:inkscape="http://www.inkscape.org/namespaces/inkscape"
   xmlns:sodipodi="http://sodipodi.sourceforge.net/DTD/sodipodi-0.dtd"
   xmlns="http://www.w3.org/2000/svg"
   xmlns:svg="http://www.w3.org/2000/svg">
  <defs
     id="defs21" />
  <sodipodi:namedview
     id="namedview21"
     pagecolor="#ffffff"
     bordercolor="#000000"
     borderopacity="0.25"
     inkscape:showpageshadow="2"
     inkscape:pageopacity="0.0"
     inkscape:pagecheckerboard="0"
     inkscape:deskcolor="#d1d1d1"
     showgrid="true"
     inkscape:current-layer="svg21">
    <inkscape:grid
       id="grid21"
       units="px"
       originx="0"
       originy="0"
       spacingx="0.5"
       spacingy="0.5"
       empcolor="#0099e5"
       empopacity="0.30196078"
       color="#0099e5"
       opacity="0.14901961"
       empspacing="2"
       dotted="false"
       gridanglex="30"
       gridanglez="30"
       visible="true" />
  </sodipodi:namedview>
  <path
     d="m8.5 3v3"
     fill="none"
     stroke="#aa8800"
     stroke-width="2.25"
     id="path1" />
  <path
     d="m26.5 3v3"
     fill="none"
     stroke="#aa8800"
     stroke-width="2.25"
     id="path2" />
  <path
     d="m22 3v3"
     fill="none"
     stroke="#aa8800"
     stroke-width="2.25"
     id="path3" />
  <path
     d="m17.5 3v3"
     fill="none"
     stroke="#aa8800"
     stroke-width="2.25"
     id="path4" />
  <path
     d="m13 3v3"
     fill="none"
     stroke="#aa8800"
     stroke-width="2.25"
     id="path5" />
  <path
     d="m8.5 30v3"
     fill="#ffffff"
     stroke="#aa8800"
     stroke-width="2.25"
     id="path6" />
  <path
     d="m26.5 30v3"
     fill="#ffffff"
     stroke="#aa8800"
     stroke-width="2.25"
     id="path7" />
  <path
     d="m22 30v3"
     fill="#ffffff"
     stroke="#aa8800"
     stroke-width="2.25"
     id="path8" />
  <path
     d="m17.5 30v3"
     fill="#ffffff"
     stroke="#aa8800"
     stroke-width="2.25"
     id="path9" />
  <path
     d="m13 30v3"
     fill="#ffffff"
     stroke="#aa8800"
     stroke-width="2.25"
     id="path10" />
  <path
     d="m33 8.5h-3"
     fill="#ffffff"
     stroke="#aa8800"
     stroke-width="2.25"
     id="path11" />
  <path
     d="m33 26.5h-3"
     fill="#ffffff"
     stroke="#aa8800"
     stroke-width="2.25"
     id="path12" />
  <path
     d="m33 22h-3"
     fill="#ffffff"
     stroke="#aa8800"
     stroke-width="2.25"
     id="path13" />
  <path
     d="m33 17.5h-3"
     fill="#ffffff"
     stroke="#aa8800"
     stroke-width="2.25"
     id="path14" />
  <path
     d="m33 13h-3"
     fill="#ffffff"
     stroke="#aa8800"
     stroke-width="2.25"
     id="path15" />
  <path
     d="m6 8.5h-3"
     fill="#ffffff"
     stroke="#aa8800"
     stroke-width="2.25"
     id="path16" />
  <path
     d="m6 26.5h-3"
     fill="#ffffff"
     stroke="#aa8800"
     stroke-width="2.25"
     id="path17" />
  <path
     d="m6 22h-3"
     fill="#ffffff"
     stroke="#aa8800"
     stroke-width="2.25"
     id="path18" />
  <path
     d="m6 17.5h-3"
     fill="#ffffff"
     stroke="#aa8800"
     stroke-width="2.25"
     id="path19" />
  <path
     d="m6 13h-3"
     fill="#ffffff"
     stroke="#aa8800"
     stroke-width="2.25"
     id="path20" />
  <rect
     x="5.75"
     y="5.75"
     width="24.5"
     height="24.5"
     ry="2.4499996"
     fill="#999999"
     stroke="#000000"
     stroke-linejoin="round"
     stroke-width="1.5"
     id="rect20" />
  <rect
     x="12.500001"
     y="12.500001"
     width="11"
     height="11"
     fill="#b3b3b3"
     stroke="#808080"
     stroke-linejoin="round"
     id="rect21" />
</svg>
