<?xml version="1.0" encoding="UTF-8" standalone="no"?>
<svg
   height="48"
   viewBox="0 0 12.7 12.700001"
   width="48"
   version="1.1"
   id="svg550"
   sodipodi:docname="Database_10_48.svg"
   inkscape:export-filename="Database_10_48.png"
   inkscape:export-xdpi="96"
   inkscape:export-ydpi="96"
   inkscape:version="1.2.1 (9c6d41e410, 2022-07-14)"
   xmlns:inkscape="http://www.inkscape.org/namespaces/inkscape"
   xmlns:sodipodi="http://sodipodi.sourceforge.net/DTD/sodipodi-0.dtd"
   xmlns="http://www.w3.org/2000/svg"
   xmlns:svg="http://www.w3.org/2000/svg">
  <defs
     id="defs554" />
  <sodipodi:namedview
     id="namedview552"
     pagecolor="#ffffff"
     bordercolor="#666666"
     borderopacity="1.0"
     inkscape:showpageshadow="2"
     inkscape:pageopacity="0.0"
     inkscape:pagecheckerboard="0"
     inkscape:deskcolor="#d1d1d1"
     showgrid="true"
     inkscape:zoom="19.125"
     inkscape:cx="20.941176"
     inkscape:cy="24"
     inkscape:current-layer="svg550">
    <inkscape:grid
       type="xygrid"
       id="grid817" />
  </sodipodi:namedview>
  <path
     id="path540"
     style="fill:#00aad4;stroke-width:0.529168;stroke-linecap:round;stroke-linejoin:round;stroke-miterlimit:5.6"
     d="m 5.5562502,0.79375003 c -2.6301681,0 -4.76250017,0.82924897 -4.76250017,1.85208337 v 1.4815634 c 0,1.0228346 2.13233207,1.8520834 4.76250017,1.8520834 0.8109687,0 1.5744274,-0.079036 2.2427573,-0.2180745 C 8.1355352,5.6132196 8.4910242,5.5125209 8.8552738,5.4621991 9.7564552,5.125209 10.318234,4.6519962 10.318234,4.1273968 v -1.4624431 -0.01912 c 0,-1.0228344 -2.1318147,-1.85208277 -4.7619838,-1.85208337 z m 0,1.11156007 c 2.2006443,0 3.6376249,0.7115412 4.3129152,1.2717571 C 9.1952594,3.6365844 7.7619862,4.1591818 5.5562502,4.1273968 3.372035,4.0957946 1.9388284,3.5818483 1.2572876,3.1434775 1.93497,2.5812002 3.3594797,1.9053101 5.5562502,1.9053101 Z M 0.79375003,5.2389569 v 1.8520834 c 0,1.0092815 2.07661627,1.8289703 4.65863057,1.8505331 0.077241,-0.6736379 0.3257828,-1.3162532 0.7219198,-1.8665528 -0.2025094,0.010217 -0.4083792,0.01602 -0.6180502,0.01602 -2.6301708,0 -4.76250017,-0.8292478 -4.76250017,-1.8520834 z m 0,2.9631268 v 1.8520833 c 0,1.022836 2.13232937,1.852083 4.76250017,1.852083 0.2545432,0 0.5040308,-0.0078 0.747758,-0.02274 C 5.877507,11.353937 5.5942215,10.723662 5.4813194,10.053134 2.8858686,10.037488 0.79375003,9.2151409 0.79375003,8.2020837 Z"
     sodipodi:nodetypes="ssssccscssscccscsccsccssccc" />
  <g
     fill="none"
     stroke="#ff7f00"
     stroke-linecap="round"
     stroke-linejoin="round"
     id="g1306"
     transform="scale(0.26458334)">
    <circle
       cx="35.5"
       cy="35.5"
       r="11.3"
       stroke-dashoffset="1.49998"
       stroke-width="2.4"
       transform="matrix(0,1,1,0,0,0)"
       id="circle1302" />
    <path
       d="M 33.624796,30.000281 39.124516,35.5 33.624796,40.999719"
       stroke-width="3.47224"
       id="path1304" />
  </g>
</svg>
