<?xml version="1.0" encoding="UTF-8" standalone="no"?>
<svg
   height="16"
   viewBox="0 0 4.2333332 4.2333335"
   width="16"
   version="1.1"
   id="svg32"
   sodipodi:docname="User_06_16.svg"
   inkscape:export-filename="User_06_16.png"
   inkscape:export-xdpi="96"
   inkscape:export-ydpi="96"
   inkscape:version="1.2.1 (9c6d41e410, 2022-07-14)"
   xmlns:inkscape="http://www.inkscape.org/namespaces/inkscape"
   xmlns:sodipodi="http://sodipodi.sourceforge.net/DTD/sodipodi-0.dtd"
   xmlns="http://www.w3.org/2000/svg"
   xmlns:svg="http://www.w3.org/2000/svg">
  <defs
     id="defs36" />
  <sodipodi:namedview
     id="namedview34"
     pagecolor="#ffffff"
     bordercolor="#666666"
     borderopacity="1.0"
     inkscape:showpageshadow="2"
     inkscape:pageopacity="0.0"
     inkscape:pagecheckerboard="0"
     inkscape:deskcolor="#d1d1d1"
     showgrid="true"
     inkscape:zoom="57.375"
     inkscape:cx="7.9912854"
     inkscape:cy="8"
     inkscape:current-layer="svg32">
    <inkscape:grid
       type="xygrid"
       id="grid1150" />
  </sodipodi:namedview>
  <g
     stroke-width=".176389"
     id="g22">
    <path
       d="m1.7639017.88194438h2.3812501"
       fill="none"
       stroke="#ff7f2a"
       id="path2" />
    <path
       d="m2.6458462 1.4111111h1.4993056"
       fill="none"
       stroke="#ff7f2a"
       id="path4" />
    <path
       d="m2.8222351 1.9402778h1.3229167"
       fill="none"
       stroke="#ff7f2a"
       id="path6" />
    <path
       d="m2.8222351 2.4694445h1.3229167"
       fill="none"
       stroke="#ff7f2a"
       id="path8" />
    <path
       d="m3.6159851.35277768v2.64583352"
       fill="none"
       stroke="#ff7f2a"
       id="path10" />
    <path
       d="m3.0868184.35277768v2.64583352"
       fill="none"
       stroke="#ff7f2a"
       id="path12" />
    <path
       d="m2.5576517.35277768v.88194452"
       fill="none"
       stroke="#ff7f2a"
       id="path14" />
    <path
       d="m2.028485.35277768v.79375002"
       fill="none"
       stroke="#ff7f2a"
       id="path16" />
    <path
       d="m1.4993183.35277768v.26458335"
       fill="none"
       stroke="#ff7f2a"
       id="path18" />
    <path
       d="m1.0890074 2.3368082c-.34896285 0-.70795231.07326-.90606017.267684-.00046214.0003351-.00092266.0006867-.001377.00104-.09597091.0979563-.14214098.2237731-.16260931.3724076-.02047267.1486209-.018948.3247288-.018948.5498373.00000466.0487047.03948733.0881873.08819447.0881945h.80167373l.0227372-.1763894h-.73346047c.0003175-.1730827-.00019402-.3310298.01446934-.4375273.01757626-.1276306.04943347-.2063261.11368816-.2721625.06944736-.0678859.19455619-.1242782.34416506-.1626083l.0957734.10921.17638893.7165799.37620286-.4106771.0775142-.3083357c-.0628805-.0965724-.1077874-.2092998-.1288445-.3310518-.052531-.00396-.1059192-.0062-.1595079-.0062z"
       fill="#ff7f2a"
       fill-rule="evenodd"
       id="path20" />
  </g>
  <path
     d="m1.2553046.79374991c-.0609642-.00104579-.1236015.00931506-.1853462.03169488-.39178942-.12706892-.78657025.23890431-.70658902.68729661-.006967.045969-.0106798.092957-.0106798.1409044 0 .4417288.30738067.8157986.70555552.8157986.073783 0 .144326-.013123.2104954-.036863-.01577-.056682-.026641-.1158572-.03135-.1767336-.056405.024894-.1168351.038585-.179145.038585-.28295874 0-.52813312-.2779303-.52813312-.6407876 0-.084464.0136005-.1641516.0375515-.2370226.0460037-.025712.095691-.030841.14228245.00999.28914838.2533741.44430787-.025643.66214737-.036518.040826-.00204.083993.00581.1305691.027905.0773143-.0510216.1662838-.0819224.2597598-.0875038-.0170767-.3253462-.2476341-.53229464-.507118-.53674589z"
     fill="#00aad4"
     fill-rule="evenodd"
     stroke-linecap="square"
     stroke-linejoin="round"
     stroke-width=".352779"
     id="path24" />
  <path
     d="m1.9710339 2.8659749c-.3489639 0-.7079989.07326-.9061074.267684a.0882075.08820291 0 0 0 -.00138.00104c-.09596575.0979715-.14214448.2237805-.16261282.3724155-.02047258.1486208-.01895115.324721-.01895115.5498301a.0882075.08820291 0 0 0 .088199.088194h1.94003427a.0882075.08820291 0 0 0 .088199-.088194c0-.2247214.00332-.3805649-.016538-.5195203-.0198599-.1389557-.0662206-.2591806-.1550373-.3903295a.0882075.08820291 0 0 0 -.00276-.00413c-.080059-.1047684-.2087277-.1694598-.3576169-.2129114-.1488891-.0434516-.3209486-.0640789-.4954305-.0640789zm.3872489.2184192c.020175.00475.039967.00963.058914.015159.1270756.037085.2211417.093094.2649416.1495171.076018.1129887.108486.1975148.1250634.3135037.013757.096253.012063.2412844.012058.4061768h-.7493471l.1874229-.7630887zm-.8247989.012058.095779.1092097.1877675.7630885h-.7558936c.0003175-.1730833-.000194-.3310297.0144699-.4375271.0175763-.1276311.0494393-.2063262.1136942-.2721626.0694476-.0678865.1945738-.1242778.344183-.1626085z"
     fill="#06f"
     fill-rule="evenodd"
     stroke-width=".176389"
     id="path26" />
  <path
     d="m2.1373504 1.3229884c-.060964-.00105-.1236013.00932-.1853461.031695-.3917899-.127069-.7865705.2389039-.706589.6872966-.00697.045969-.01068.092957-.01068.1409045 0 .4417293.3073802.8157985.7055556.8157985.3981753 0 .7055556-.3740692.7055556-.8157985 0-.05057-.00398-.1001388-.011714-.1484836.070609-.4242549-.1934587-.7062092-.4967821-.7114125zm.1167888.5963462c.05686-.00284.118175.012727.1870688.060633.017374.063393.026871.1315078.026871.2029162 0 .3628576-.2448295.6407877-.5277886.6407877s-.5281332-.2779301-.5281332-.6407877c0-.084464.0136-.1641515.037552-.2370226.046004-.025712.095691-.030841.1422824.00999.2891486.2533745.4443077-.025643.6621477-.036518z"
     fill="#00aad4"
     fill-rule="evenodd"
     stroke-linecap="square"
     stroke-linejoin="round"
     stroke-width=".352779"
     id="path28" />
  <path
     d="m1.1465405.61736101v-.26458334h2.9986112v2.64583343h-1.1465278"
     fill="none"
     stroke="#00aad4"
     stroke-width=".176389"
     id="path30" />
</svg>
