<?xml version="1.0" encoding="UTF-8" standalone="no"?>
<svg
   width="24"
   height="24"
   version="1.1"
   viewBox="0 0 24 24"
   id="svg4"
   sodipodi:docname="Mouse_01_24.svg"
   inkscape:export-filename="Mouse_01_24.png"
   inkscape:export-xdpi="96"
   inkscape:export-ydpi="96"
   inkscape:version="1.3.2 (091e20e, 2023-11-25, custom)"
   xmlns:inkscape="http://www.inkscape.org/namespaces/inkscape"
   xmlns:sodipodi="http://sodipodi.sourceforge.net/DTD/sodipodi-0.dtd"
   xmlns="http://www.w3.org/2000/svg"
   xmlns:svg="http://www.w3.org/2000/svg">
  <defs
     id="defs4" />
  <sodipodi:namedview
     id="namedview4"
     pagecolor="#ffffff"
     bordercolor="#000000"
     borderopacity="0.25"
     inkscape:showpageshadow="2"
     inkscape:pageopacity="0.0"
     inkscape:pagecheckerboard="0"
     inkscape:deskcolor="#d1d1d1"
     showgrid="true"
     inkscape:current-layer="svg4">
    <inkscape:grid
       id="grid4"
       units="px"
       originx="0"
       originy="0"
       spacingx="0.5"
       spacingy="0.5"
       empcolor="#0099e5"
       empopacity="0.30196078"
       color="#0099e5"
       opacity="0.14901961"
       empspacing="2"
       dotted="false"
       gridanglex="30"
       gridanglez="30"
       visible="true" />
  </sodipodi:namedview>
  <path
     transform="matrix(1.410387 0 0 1.4231051 0 .04094598)"
     d="m2.875521 6.124479 3.248958-3.248958a2.0935496 2.0935496 2.3177325 0 1 3.0755209 0.1244791l5.8000001 6.8235295a1.2896695 1.2896695 92.317732 0 1-0.07072 1.7471864l-3.358568 3.358568a1.2896695 1.2896695 177.68227 0 1-1.7471824 0.070716l-6.8235295-5.8000001a2.0935496 2.0935496 87.682268 0 1-0.1244791-3.0755209z"
     fill="#f4eed7"
     stroke="#808080"
     stroke-width=".56468"
     id="path1" />
  <path
     d="m6.746987 15.291248 8.367025-8.4424753"
     fill="none"
     stroke="#808080"
     stroke-width=".8"
     id="path2" />
  <path
     d="m6.346742 6.4449188 4.583757 4.6250922"
     fill="none"
     stroke="#808080"
     stroke-width=".8"
     id="path3" />
  <path
     d="M 6.346742,6.4449188 C 3.9038796,5.0218137 3.8772304,2.1756035 0,2.1756035"
     fill="none"
     stroke="#808080"
     stroke-width="1.3"
     id="path4" />
</svg>
