<?xml version="1.0" encoding="UTF-8" standalone="no"?>
<svg
   width="48"
   height="48"
   version="1.1"
   viewBox="0 0 48 48"
   id="svg5"
   sodipodi:docname="tbevel_200.svg"
   inkscape:export-filename="tbevel_200.png"
   inkscape:export-xdpi="96"
   inkscape:export-ydpi="96"
   inkscape:version="1.3.2 (091e20e, 2023-11-25, custom)"
   xmlns:inkscape="http://www.inkscape.org/namespaces/inkscape"
   xmlns:sodipodi="http://sodipodi.sourceforge.net/DTD/sodipodi-0.dtd"
   xmlns="http://www.w3.org/2000/svg"
   xmlns:svg="http://www.w3.org/2000/svg">
  <sodipodi:namedview
     id="namedview5"
     pagecolor="#ffffff"
     bordercolor="#000000"
     borderopacity="0.25"
     inkscape:showpageshadow="2"
     inkscape:pageopacity="0.0"
     inkscape:pagecheckerboard="0"
     inkscape:deskcolor="#d1d1d1"
     showgrid="true"
     inkscape:current-layer="svg5">
    <inkscape:grid
       id="grid5"
       units="px"
       originx="0"
       originy="0"
       spacingx="0.5"
       spacingy="0.5"
       empcolor="#0099e5"
       empopacity="0.30196078"
       color="#0099e5"
       opacity="0.14901961"
       empspacing="2"
       dotted="false"
       gridanglex="30"
       gridanglez="30"
       visible="true" />
  </sodipodi:namedview>
  <defs
     id="defs2">
    <linearGradient
       id="a"
       x1="20"
       x2="-3"
       y1="1048.3622"
       y2="1025.3622"
       gradientTransform="matrix(2.0583333 0 0 2.0583333 -.69999974 -1113.05)"
       gradientUnits="userSpaceOnUse">
      <stop
         stop-color="#cccccc"
         offset="0"
         id="stop1" />
      <stop
         stop-color="#ffffff"
         offset="1"
         id="stop2" />
    </linearGradient>
  </defs>
  <g
     transform="translate(0,-1004.3622)"
     id="g5">
    <rect
       x="4.5"
       y="1008.8622"
       width="39"
       height="39"
       fill="url(#a)"
       stroke="#2a7efe"
       stroke-linecap="round"
       stroke-linejoin="round"
       style="paint-order:normal"
       id="rect2" />
    <path
       d="m24 1015.3621h-13v11"
       fill="none"
       stroke="#ffffff"
       stroke-width="2"
       id="path2" />
    <path
       d="m37.997436 1031.3621h-14.923076v9"
       fill="none"
       stroke="#808080"
       stroke-width="2"
       id="path3" />
    <path
       d="m12 1025.3621h11v-9"
       fill="none"
       stroke="#808080"
       stroke-width="2"
       id="path4" />
    <path
       d="m24 1039.3621h13v-7"
       fill="none"
       stroke="#ffffff"
       stroke-width="2"
       id="path5" />
  </g>
</svg>
