<?xml version="1.0" encoding="UTF-8" standalone="no"?>
<svg
   height="32"
   width="32"
   version="1.1"
   id="svg11"
   sodipodi:docname="Replace_06_32.svg"
   inkscape:export-filename="Replace_06_32.png"
   inkscape:export-xdpi="96"
   inkscape:export-ydpi="96"
   inkscape:version="1.3.2 (091e20e, 2023-11-25, custom)"
   xmlns:inkscape="http://www.inkscape.org/namespaces/inkscape"
   xmlns:sodipodi="http://sodipodi.sourceforge.net/DTD/sodipodi-0.dtd"
   xmlns="http://www.w3.org/2000/svg"
   xmlns:svg="http://www.w3.org/2000/svg">
  <defs
     id="defs11" />
  <sodipodi:namedview
     id="namedview11"
     pagecolor="#ffffff"
     bordercolor="#000000"
     borderopacity="0.25"
     inkscape:showpageshadow="2"
     inkscape:pageopacity="0.0"
     inkscape:pagecheckerboard="0"
     inkscape:deskcolor="#d1d1d1"
     showgrid="true"
     inkscape:current-layer="svg11">
    <inkscape:grid
       id="grid11"
       units="px"
       originx="0"
       originy="0"
       spacingx="0.5"
       spacingy="0.5"
       empcolor="#0099e5"
       empopacity="0.30196078"
       color="#0099e5"
       opacity="0.14901961"
       empspacing="2"
       dotted="false"
       gridanglex="30"
       gridanglez="30"
       visible="true" />
  </sodipodi:namedview>
  <rect
     fill="#c2f3ff"
     height="25.5"
     ry="3.2"
     stroke="#00aad4"
     stroke-linejoin="round"
     stroke-width="1.50001"
     width="20.49999"
     x=".750005"
     y=".75"
     id="rect1" />
  <rect
     fill="#ebfcff"
     height="25.5"
     ry="3.2"
     stroke="#00aad4"
     stroke-linejoin="round"
     stroke-width="1.5"
     width="20.5"
     x="10.75"
     y="5.75"
     id="rect2" />
  <g
     fill="none"
     stroke-linecap="round"
     id="g11">
    <g
       transform="matrix(2 0 0 2 -.5 0)"
       id="g6">
      <g
         stroke="#fff"
         stroke-width="3"
         transform="matrix(-1 0 0 1 34 -6)"
         id="g3">
        <path
           d="m31.5 11.5h-6"
           id="path2" />
        <path
           d="m27.5 9.5-2 2 2 2"
           stroke-linejoin="round"
           id="path3" />
      </g>
      <g
         stroke="#2a7efe"
         id="g5">
        <path
           d="m2.5 5.5h6"
           id="path4" />
        <path
           d="m6.5 3.5 2 2-2 2"
           stroke-linejoin="round"
           id="path5" />
      </g>
    </g>
    <g
       transform="matrix(2 0 0 2 -35.5 -2)"
       id="g10">
      <g
         stroke="#fff"
         stroke-width="3"
         id="g7">
        <path
           d="m31.5 11.5h-6"
           id="path6" />
        <path
           d="m27.5 9.5-2 2 2 2"
           stroke-linejoin="round"
           id="path7" />
      </g>
      <g
         stroke="#2a7efe"
         id="g9">
        <path
           d="m31.5 11.5h-6"
           id="path8" />
        <path
           d="m27.5 9.5-2 2 2 2"
           stroke-linejoin="round"
           id="path9" />
      </g>
    </g>
  </g>
</svg>
