<svg width="16" height="16" version="1.1" viewBox="0 0 16 16" xmlns="http://www.w3.org/2000/svg">
 <path d="m8 3.25v9.5" fill="none" stroke="#2a7efe" stroke-linecap="round" stroke-width="2.5"/>
 <path d="m12.75 8h-9.5" fill="none" stroke="#2a7efe" stroke-linecap="round" stroke-width="2.5"/>
</svg>
