<?xml version="1.0" encoding="UTF-8" standalone="no"?>
<svg
   height="32"
   width="32"
   version="1.1"
   id="svg2"
   sodipodi:docname="ddindex_options_200.svg"
   inkscape:export-filename="ddindex_options_200.png"
   inkscape:export-xdpi="96"
   inkscape:export-ydpi="96"
   inkscape:version="1.3 (0e150ed6c4, 2023-07-21)"
   xmlns:inkscape="http://www.inkscape.org/namespaces/inkscape"
   xmlns:sodipodi="http://sodipodi.sourceforge.net/DTD/sodipodi-0.dtd"
   xmlns="http://www.w3.org/2000/svg"
   xmlns:svg="http://www.w3.org/2000/svg">
  <defs
     id="defs2" />
  <sodipodi:namedview
     id="namedview2"
     pagecolor="#ffffff"
     bordercolor="#000000"
     borderopacity="0.25"
     inkscape:showpageshadow="2"
     inkscape:pageopacity="0.0"
     inkscape:pagecheckerboard="0"
     inkscape:deskcolor="#d1d1d1"
     showgrid="true"
     inkscape:current-layer="svg2">
    <inkscape:grid
       id="grid2"
       units="px"
       originx="0"
       originy="0"
       spacingx="0.5"
       spacingy="0.5"
       empcolor="#0099e5"
       empopacity="0.30196078"
       color="#0099e5"
       opacity="0.14901961"
       empspacing="2"
       dotted="false"
       gridanglex="30"
       gridanglez="30"
       visible="true" />
  </sodipodi:namedview>
  <rect
     fill="#ebfcff"
     height="20.620499"
     ry="2.5876706"
     stroke-width="1.3795"
     width="24.620495"
     x="0.68975222"
     y="0.68975222"
     id="rect2-5"
     style="stroke:#00aad4;stroke-linejoin:round" />
  <rect
     style="fill:#00aad4;fill-opacity:1;stroke:none;stroke-width:1;stroke-linejoin:round"
     id="rect3"
     width="2.029068"
     height="2.0157087"
     x="4"
     y="15.984291" />
  <rect
     style="fill:#00aad4;fill-opacity:1;stroke:none;stroke-width:1;stroke-linejoin:round"
     id="rect4"
     width="2.029068"
     height="2.0157087"
     x="20.232544"
     y="15.984291" />
  <rect
     style="fill:#00aad4;fill-opacity:1;stroke:none;stroke-width:1;stroke-linejoin:round"
     id="rect5"
     width="2.029068"
     height="2.0157087"
     x="16.174408"
     y="15.984291" />
  <rect
     style="fill:#00aad4;fill-opacity:1;stroke:none;stroke-width:1;stroke-linejoin:round"
     id="rect6"
     width="2.029068"
     height="2.0157087"
     x="12.116272"
     y="15.984291" />
  <rect
     style="fill:#00aad4;fill-opacity:1;stroke:none;stroke-width:1;stroke-linejoin:round"
     id="rect7"
     width="2.029068"
     height="2.0157087"
     x="8.058136"
     y="15.984291" />
  <path
     d="M 7.40234,4 3.71483,14.000037 h 1.51172 l 0.75391,-2.19532 h 4.03518 l 0.7539,2.19532 h 1.51564 L 8.59766,4 Z M 8,5.9336 9.5586,10.47268 H 6.4375 Z"
     id="path2-6"
     style="fill:#00aad4;fill-opacity:1;stroke-width:0.264583" />
  <path
     d="m 22.0798,5.210421 -4.35352,7.455324 h 4.49107 V 14 H 16 V 12.789542 L 20.3879,5.334218 H 16.1238 V 3.999962 h 5.956 z"
     id="path52"
     style="fill:#00aad4;fill-opacity:1;stroke-width:0.264583" />
  <path
     id="circle784"
     style="fill:#e5efff;fill-opacity:1;stroke:#2a7fff;stroke-width:1.2;stroke-linecap:round;stroke-linejoin:round;stroke-dasharray:none;stroke-dashoffset:1.49998;stroke-opacity:1"
     d="M 24.860868,22 A 2.8608678,2.8608678 0 0 1 22,24.860868 2.8608678,2.8608678 0 0 1 19.139133,22 2.8608678,2.8608678 0 0 1 22,19.139133 2.8608678,2.8608678 0 0 1 24.860868,22 Z m -7.627088,-8.52471 0.732919,2.876012 -1.613606,1.614054 -2.879804,-0.732273 -0.873304,2.108341 2.554125,1.518535 -3.17e-4,2.2823 -2.5519,1.515394 0.873397,2.108569 2.876012,-0.73292 1.614055,1.613605 -0.732274,2.879806 2.108341,0.873302 1.518535,-2.554124 2.2823,3.17e-4 1.515394,2.551899 2.108569,-0.873395 -0.73292,-2.876014 1.613605,-1.614054 2.879806,0.732274 0.873302,-2.108342 -2.554124,-1.518533 3.17e-4,-2.2823 2.551899,-1.515398 -0.873397,-2.108565 -2.876012,0.732919 -1.614054,-1.613606 0.732274,-2.879805 -2.108342,-0.873303 -1.518535,2.554124 -2.282298,-3.16e-4 -1.515396,-2.5519 z" />
</svg>
