<?xml version="1.0" encoding="UTF-8" standalone="no"?>
<svg
   width="48"
   height="48"
   version="1.1"
   viewBox="0 0 48 48"
   id="svg15"
   sodipodi:docname="tstatusbar_200.svg"
   inkscape:export-filename="tstatusbar_200.png"
   inkscape:export-xdpi="96"
   inkscape:export-ydpi="96"
   inkscape:version="1.3.2 (091e20e, 2023-11-25, custom)"
   xmlns:inkscape="http://www.inkscape.org/namespaces/inkscape"
   xmlns:sodipodi="http://sodipodi.sourceforge.net/DTD/sodipodi-0.dtd"
   xmlns="http://www.w3.org/2000/svg"
   xmlns:svg="http://www.w3.org/2000/svg">
  <defs
     id="defs15" />
  <sodipodi:namedview
     id="namedview15"
     pagecolor="#ffffff"
     bordercolor="#000000"
     borderopacity="0.25"
     inkscape:showpageshadow="2"
     inkscape:pageopacity="0.0"
     inkscape:pagecheckerboard="0"
     inkscape:deskcolor="#d1d1d1"
     showgrid="true"
     inkscape:current-layer="svg15">
    <inkscape:grid
       id="grid15"
       units="px"
       originx="0"
       originy="0"
       spacingx="0.5"
       spacingy="0.5"
       empcolor="#0099e5"
       empopacity="0.30196078"
       color="#0099e5"
       opacity="0.14901961"
       empspacing="2"
       dotted="false"
       gridanglex="30"
       gridanglez="30"
       visible="true" />
  </sodipodi:namedview>
  <g
     transform="translate(0,-1004.3622)"
     id="g15">
    <path
       d="m1.999844 1012.8622h43.500312v31h-43.500312"
       fill="#f2f2f2"
       stroke="#2a7efe"
       stroke-linejoin="round"
       id="path1" />
    <path
       d="m8.75 1013.3622v30"
       fill="#ffffff"
       fill-rule="evenodd"
       stroke="#ffffff"
       stroke-width="1.5"
       id="path2" />
    <path
       d="m7.25 1013.3622v30"
       fill="none"
       stroke="#cccccc"
       stroke-width="1.5"
       id="path3" />
    <path
       d="m39.250001 1036.3622v2.5"
       fill="none"
       stroke="#ffffff"
       stroke-linejoin="round"
       stroke-width="2.5"
       id="path4" />
    <path
       d="m40.750001 1037.8622v2.5"
       fill="none"
       stroke="#999999"
       stroke-linejoin="round"
       stroke-width="2.5"
       id="path5" />
    <path
       d="m39.25 1030.3622v2.5"
       fill="none"
       stroke="#ffffff"
       stroke-linejoin="round"
       stroke-width="2.5"
       id="path6" />
    <path
       d="m40.75 1031.8622v2.5"
       fill="none"
       stroke="#999999"
       stroke-linejoin="round"
       stroke-width="2.5"
       id="path7" />
    <path
       d="m39.25 1024.3622v2.5"
       fill="none"
       stroke="#ffffff"
       stroke-linejoin="round"
       stroke-width="2.5"
       id="path8" />
    <path
       d="m40.75 1025.8622v2.5"
       fill="none"
       stroke="#999999"
       stroke-linejoin="round"
       stroke-width="2.5"
       id="path9" />
    <path
       d="m33.25 1036.3622v2.5"
       fill="none"
       stroke="#ffffff"
       stroke-linejoin="round"
       stroke-width="2.5"
       id="path10" />
    <path
       d="m34.75 1037.8622v2.5"
       fill="none"
       stroke="#999999"
       stroke-linejoin="round"
       stroke-width="2.5"
       id="path11" />
    <path
       d="m33.249999 1030.3622v2.5"
       fill="none"
       stroke="#ffffff"
       stroke-linejoin="round"
       stroke-width="2.5"
       id="path12" />
    <path
       d="m34.749999 1031.8622v2.5"
       fill="none"
       stroke="#999999"
       stroke-linejoin="round"
       stroke-width="2.5"
       id="path13" />
    <path
       d="m27.25 1036.3622v2.5"
       fill="none"
       stroke="#ffffff"
       stroke-linejoin="round"
       stroke-width="2.5"
       id="path14" />
    <path
       d="m28.75 1037.8622v2.5"
       fill="none"
       stroke="#999999"
       stroke-linejoin="round"
       stroke-width="2.5"
       id="path15" />
  </g>
</svg>
