<?xml version="1.0" encoding="UTF-8" standalone="no"?>
<svg
   height="64"
   width="64"
   version="1.1"
   id="svg665"
   sodipodi:docname="Cloud_06_64.svg"
   inkscape:export-filename="Cloud_06_64.png"
   inkscape:export-xdpi="96"
   inkscape:export-ydpi="96"
   inkscape:version="1.2.1 (9c6d41e410, 2022-07-14)"
   xmlns:inkscape="http://www.inkscape.org/namespaces/inkscape"
   xmlns:sodipodi="http://sodipodi.sourceforge.net/DTD/sodipodi-0.dtd"
   xmlns="http://www.w3.org/2000/svg"
   xmlns:svg="http://www.w3.org/2000/svg">
  <defs
     id="defs669">
    <radialGradient
       id="a-2"
       cx="-11.5"
       cy="8.5"
       gradientTransform="matrix(0,1.12,-1.12,0,20.679997,24.039997)"
       gradientUnits="userSpaceOnUse"
       r="3.5">
      <stop
         offset="0"
         stop-color="#fff"
         id="stop2-4" />
      <stop
         offset="1"
         stop-color="#d5e5ff"
         id="stop4-8" />
    </radialGradient>
  </defs>
  <sodipodi:namedview
     id="namedview667"
     pagecolor="#ffffff"
     bordercolor="#666666"
     borderopacity="1.0"
     inkscape:showpageshadow="2"
     inkscape:pageopacity="0.0"
     inkscape:pagecheckerboard="0"
     inkscape:deskcolor="#d1d1d1"
     showgrid="true"
     inkscape:zoom="14.34375"
     inkscape:cx="28.583878"
     inkscape:cy="32"
     inkscape:current-layer="svg665">
    <inkscape:grid
       type="xygrid"
       id="grid788" />
  </sodipodi:namedview>
  <linearGradient
     id="a"
     gradientTransform="matrix(1.0000001 0 0 .96627925 -.000186 -.011629)"
     gradientUnits="userSpaceOnUse"
     x1="7.5"
     x2="9"
     y1="2"
     y2="13">
    <stop
       offset="0"
       stop-color="#5ab4f2"
       id="stop658" />
    <stop
       offset="1"
       stop-color="#0090ff"
       id="stop660" />
  </linearGradient>
  <path
     d="m3.2916407 12.550001c-4.3402419 0-4.3402419-5.8903523-.28586-5.8903523-.5693973-6.0664286 9.1223563-5.70499896 9.1223563-1.4725883 4.918074-.359472 5.574823 7.3629406-.506798 7.3629406z"
     fill="url(#a)"
     transform="matrix(3.9999997 0 0 3.9999997 .000744 .000001)"
     id="path663" />
  <g
     id="g2638"
     transform="matrix(3.2307692,0,0,3.2307692,-0.61538392,-0.61538392)">
    <g
       id="g2626">
      <circle
         cx="12"
         cy="12"
         r="4"
         stroke="#ffffff"
         stroke-linejoin="round"
         stroke-width="0.75"
         id="circle7"
         style="fill:none;stroke:#ffffff;stroke-width:2;stroke-linecap:round;stroke-dasharray:none" />
      <path
         d="M 13.914015,13.914015 18.1,18.1"
         stroke="#ffffff"
         stroke-width="3"
         id="path9"
         style="fill:none;stroke:#ffffff;stroke-width:3.8;stroke-linecap:round;stroke-dasharray:none" />
    </g>
    <g
       id="g2630">
      <path
         d="m 13.914,13.914 4.185985,4.185985"
         stroke="#a05a2c"
         stroke-width="1.4"
         id="path11"
         style="fill:none;stroke-width:1.8;stroke-linecap:round;stroke-dasharray:none" />
      <circle
         cx="12"
         cy="12"
         fill="url(#a)"
         fill-rule="evenodd"
         r="3.5"
         stroke="#dd8703"
         stroke-linejoin="round"
         id="circle15"
         style="fill:url(#a-2);stroke-width:1;stroke-linecap:round;stroke-dasharray:none" />
    </g>
  </g>
</svg>
