<?xml version="1.0" encoding="UTF-8" standalone="no"?>
<svg
   height="48"
   viewBox="0 0 48 48"
   width="48"
   version="1.1"
   id="svg6"
   sodipodi:docname="Piggybank_01_48.svg"
   inkscape:export-filename="Piggybank_01_48.png"
   inkscape:export-xdpi="96"
   inkscape:export-ydpi="96"
   inkscape:version="1.3.2 (091e20e, 2023-11-25, custom)"
   xmlns:inkscape="http://www.inkscape.org/namespaces/inkscape"
   xmlns:sodipodi="http://sodipodi.sourceforge.net/DTD/sodipodi-0.dtd"
   xmlns="http://www.w3.org/2000/svg"
   xmlns:svg="http://www.w3.org/2000/svg">
  <defs
     id="defs6" />
  <sodipodi:namedview
     id="namedview6"
     pagecolor="#ffffff"
     bordercolor="#000000"
     borderopacity="0.25"
     inkscape:showpageshadow="2"
     inkscape:pageopacity="0.0"
     inkscape:pagecheckerboard="0"
     inkscape:deskcolor="#d1d1d1"
     showgrid="true"
     inkscape:current-layer="svg6">
    <inkscape:grid
       id="grid6"
       units="px"
       originx="0"
       originy="0"
       spacingx="0.5"
       spacingy="0.5"
       empcolor="#0099e5"
       empopacity="0.30196078"
       color="#0099e5"
       opacity="0.14901961"
       empspacing="2"
       dotted="false"
       gridanglex="30"
       gridanglez="30"
       visible="true" />
  </sodipodi:namedview>
  <circle
     cx="42.5"
     cy="16.500017"
     fill="#d694ac"
     r="3"
     stroke-linecap="round"
     stroke-width="1.5"
     id="circle1" />
  <path
     d="m26 9.000015c-8.536002.0084-15.882669 5.030367-17.589843 12h-6.410157v6h41.625c.25746-.985959.373341-1.990935.375-3 .0135-8.28426-8.058879-15.0098854-18-15z"
     fill="#dea8bd"
     stroke-linecap="round"
     stroke-width="1.5"
     id="path1" />
  <path
     d="m21.5 13.500015c-1.650081 3.585972-3.035448 7.993482-6 7.5-4.047522-3.524559-5.986914-8.053434-6-13.5000004 4.017288-.0063 8.017032 2.0234944 12 6.0000004z"
     fill="#d694ac"
     stroke-linecap="round"
     stroke-width="1.5"
     id="path2" />
  <path
     d="m 2,24.000015 v 6 h 7.5 c 1.093566,2.08626 2.742645,3.87912 4.822266,5.355468 L 11,42.000015 h 6 l 3.703125,-3.703125 c 1.713579,0.453507 3.498984,0.697476 5.296875,0.703125 1.634172,0.0051 3.260448,-0.18909 4.833984,-0.556641 L 33.5,42.000015 h 6 L 38.316407,34.880874 C 41.016095,32.771184 44,29 44,24.000015 c -14.170083,5.442633 -28.070843,2.266962 -42,0 z"
     fill="#d694ac"
     stroke-linecap="round"
     stroke-width="1.5"
     id="path3"
     sodipodi:nodetypes="cccccccccccccc" />
  <ellipse
     cx="12.5"
     cy="22.500015"
     fill="#803300"
     rx="1.5"
     ry="2.427051"
     stroke-linecap="round"
     stroke-width="1.5"
     id="ellipse3" />
  <path
     d="m39.248048 40.500015h-6.873048l1.125 1.5h6z"
     fill="#803300"
     stroke-linecap="round"
     stroke-width="1.5"
     id="path4" />
  <path
     d="m18.5 40.500015h-6.75l-.75 1.5h6z"
     fill="#803300"
     stroke-linecap="round"
     stroke-width="1.5"
     id="path5" />
  <path
     d="m26 9.000015c-1.548513.0015-3.056334.1731-4.5.486327v1.013673h10.5v-.644532c-1.877037-.551844-3.896808-.8575594-6-.855468z"
     fill="#803300"
     stroke-linecap="round"
     stroke-width="1.5"
     id="path6" />
</svg>
