<?xml version="1.0" encoding="UTF-8" standalone="no"?>
<svg
   height="24"
   width="24"
   version="1.1"
   id="svg346"
   sodipodi:docname="Grid_03_24.svg"
   inkscape:export-filename="Grid_03_24.png"
   inkscape:export-xdpi="96"
   inkscape:export-ydpi="96"
   inkscape:version="1.2-beta (1b65182ce9, 2022-04-05)"
   xmlns:inkscape="http://www.inkscape.org/namespaces/inkscape"
   xmlns:sodipodi="http://sodipodi.sourceforge.net/DTD/sodipodi-0.dtd"
   xmlns="http://www.w3.org/2000/svg"
   xmlns:svg="http://www.w3.org/2000/svg">
  <defs
     id="defs350" />
  <sodipodi:namedview
     id="namedview348"
     pagecolor="#ffffff"
     bordercolor="#666666"
     borderopacity="1.0"
     inkscape:pageshadow="2"
     inkscape:pageopacity="0.0"
     inkscape:pagecheckerboard="0"
     inkscape:deskcolor="#d1d1d1"
     showgrid="true"
     inkscape:zoom="38.249994"
     inkscape:cx="12.000002"
     inkscape:cy="12.000002"
     inkscape:current-layer="svg346">
    <inkscape:grid
       type="xygrid"
       id="grid1052" />
  </sodipodi:namedview>
  <linearGradient
     id="a"
     gradientTransform="matrix(0 -1.5 -1.5 0 24 24)"
     gradientUnits="userSpaceOnUse"
     x1="9"
     x2="6"
     y1="10"
     y2="10.5">
    <stop
       offset="0"
       stop-color="#72cef6"
       id="stop316" />
    <stop
       offset="1"
       stop-color="#d2f5f8"
       id="stop318" />
  </linearGradient>
  <linearGradient
     id="b"
     gradientTransform="matrix(0 -1.5 -1.5 0 24 24)"
     gradientUnits="userSpaceOnUse"
     x1="10"
     x2="5"
     y1="12.5"
     y2="12.5">
    <stop
       offset="0"
       stop-color="#4674a8"
       id="stop321" />
    <stop
       offset="1"
       stop-color="#42a0ce"
       id="stop323" />
  </linearGradient>
  <g
     transform="matrix(1 0 0 -1 0 24)"
     id="g344">
    <path
       d="m.51064-23.489361h22.978724v22.978724h-22.978724z"
       style="fill:#fff;stroke:#999;stroke-width:1.02128;stroke-linecap:round;stroke-linejoin:round;stroke-dashoffset:1.49998"
       transform="scale(1 -1)"
       id="path326" />
    <g
       fill="none"
       id="g340">
      <path
         d="m1 18.5h22"
         stroke="#b3b3b3"
         id="path328" />
      <path
         d="m6.5 23v-22"
         stroke="#b3b3b3"
         id="path330" />
      <path
         d="m23 5.5h-22"
         stroke="#b3b3b3"
         id="path332" />
      <path
         d="m18.5 23v-22"
         stroke="#b3b3b3"
         id="path334" />
      <path
         d="m12.5 23v-22"
         stroke="#b3b3b3"
         id="path336" />
      <path
         d="m.5-16.5h23v8h-23z"
         opacity=".5"
         stroke="#fff"
         stroke-dashoffset="1.49998"
         stroke-linejoin="round"
         transform="scale(1 -1)"
         id="path338" />
    </g>
    <path
       d="m23.5 15.5h-23v-6h23z"
       fill="url(#a)"
       stroke="url(#b)"
       stroke-linecap="round"
       stroke-linejoin="round"
       id="path342" />
  </g>
</svg>
