<?xml version="1.0" encoding="UTF-8" standalone="no"?>
<svg
   height="36"
   viewBox="0 0 36 36"
   width="36"
   version="1.1"
   id="svg6"
   sodipodi:docname="Connection_04_36.svg"
   inkscape:version="1.3 (0e150ed6c4, 2023-07-21)"
   xmlns:inkscape="http://www.inkscape.org/namespaces/inkscape"
   xmlns:sodipodi="http://sodipodi.sourceforge.net/DTD/sodipodi-0.dtd"
   xmlns="http://www.w3.org/2000/svg"
   xmlns:svg="http://www.w3.org/2000/svg">
  <defs
     id="defs6" />
  <sodipodi:namedview
     id="namedview6"
     pagecolor="#ffffff"
     bordercolor="#000000"
     borderopacity="0.25"
     inkscape:showpageshadow="2"
     inkscape:pageopacity="0.0"
     inkscape:pagecheckerboard="0"
     inkscape:deskcolor="#d1d1d1"
     showgrid="true"
     inkscape:current-layer="svg6">
    <inkscape:grid
       id="grid6"
       units="px"
       originx="0"
       originy="0"
       spacingx="0.5"
       spacingy="0.5"
       empcolor="#0099e5"
       empopacity="0.30196078"
       color="#0099e5"
       opacity="0.14901961"
       empspacing="2"
       dotted="false"
       gridanglex="30"
       gridanglez="30"
       visible="true" />
  </sodipodi:namedview>
  <linearGradient
     id="a"
     gradientUnits="userSpaceOnUse"
     x1="30.999648"
     x2="20.99965"
     y1="31.003064"
     y2="21.003065">
    <stop
       offset="0"
       stop-color="#009600"
       id="stop1" />
    <stop
       offset="1"
       stop-color="#6edb39"
       id="stop2" />
  </linearGradient>
  <g
     fill="none"
     stroke-linecap="round"
     stroke-linejoin="round"
     stroke-width="1.79996"
     transform="matrix(1.5000361 0 0 1.5000361 -1.001386 -1.000945)"
     id="g3">
    <path
       d="m13.167063 10.833372-2.12127-2.1212688-4.8789177 4.8789178 2.1212686 2.12127-4.5375795 4.537579"
       stroke="#00aad4"
       id="path2" />
    <path
       d="m10.833667 13.166769 2.121269 2.121268 4.878918-4.878919-2.121268-2.1212688 4.537578-4.5375788"
       stroke="#00c1f0"
       id="path3" />
  </g>
  <g
     transform="translate(1.996937 2.000353)"
     id="g6">
    <circle
       cx="25.999647"
       cy="26.003063"
       fill="url(#a)"
       r="8"
       transform="matrix(0 1 1 0 0 0)"
       id="circle3" />
    <g
       fill="none"
       stroke="#fff"
       stroke-linecap="round"
       stroke-width="2"
       id="g5">
      <path
         d="m26 21.5v9"
         id="path4" />
      <path
         d="m30.5 26h-9"
         id="path5" />
    </g>
  </g>
</svg>
