<?xml version="1.0" encoding="UTF-8" standalone="no"?>
<svg
   height="32"
   viewBox="0 0 8.4666664 8.4666671"
   width="32"
   version="1.1"
   id="svg377"
   sodipodi:docname="Flame_01_32.svg"
   inkscape:version="1.2 (dc2aedaf03, 2022-05-15)"
   inkscape:export-filename="Flame_01_32.png"
   inkscape:export-xdpi="96"
   inkscape:export-ydpi="96"
   xmlns:inkscape="http://www.inkscape.org/namespaces/inkscape"
   xmlns:sodipodi="http://sodipodi.sourceforge.net/DTD/sodipodi-0.dtd"
   xmlns="http://www.w3.org/2000/svg"
   xmlns:svg="http://www.w3.org/2000/svg">
  <defs
     id="defs381" />
  <sodipodi:namedview
     id="namedview379"
     pagecolor="#ffffff"
     bordercolor="#666666"
     borderopacity="1.0"
     inkscape:showpageshadow="2"
     inkscape:pageopacity="0.0"
     inkscape:pagecheckerboard="0"
     inkscape:deskcolor="#d1d1d1"
     showgrid="true"
     inkscape:zoom="28.6875"
     inkscape:cx="16"
     inkscape:cy="16"
     inkscape:current-layer="svg377">
    <inkscape:grid
       type="xygrid"
       id="grid1274" />
  </sodipodi:namedview>
  <path
     style="fill:none;stroke:#00aad4;stroke-width:0.529167;stroke-linecap:round;stroke-linejoin:round;stroke-dasharray:none;stroke-opacity:1"
     d="M 5.7228658,4.2333313 C 6.5166177,3.9687473 6.5166177,3.4395794 6.7657173,2.6458239 7.3200596,4.7928209 6.7769973,7.6787728 5.1936977,8.202091 5.7228658,5.8208351 4.4419971,6.3500082 4.3999458,3.9687473 3.0810118,5.2916701 2.8156308,6.8791681 3.8707779,8.202091 1.7604836,7.937506 1.4744497,6.491679 1.4895222,5.5562511 1.5263028,3.2735608 3.0770262,3.4395794 4.1353619,0.26457183 5.7228658,1.1200022 5.9874496,2.6458275 5.7228658,4.2333313 Z"
     id="path353"
     sodipodi:nodetypes="cccccscc" />
</svg>
