<?xml version="1.0" encoding="UTF-8" standalone="no"?>
<svg
   height="16"
   viewBox="0 0 4.2333332 4.2333335"
   width="16"
   version="1.1"
   id="svg2"
   sodipodi:docname="Box_01_16.svg"
   inkscape:version="1.2.1 (9c6d41e410, 2022-07-14)"
   xml:space="preserve"
   inkscape:export-filename="Box_01_16.png"
   inkscape:export-xdpi="96"
   inkscape:export-ydpi="96"
   xmlns:inkscape="http://www.inkscape.org/namespaces/inkscape"
   xmlns:sodipodi="http://sodipodi.sourceforge.net/DTD/sodipodi-0.dtd"
   xmlns="http://www.w3.org/2000/svg"
   xmlns:svg="http://www.w3.org/2000/svg"><defs
     id="defs6" /><sodipodi:namedview
     id="namedview4"
     pagecolor="#ffffff"
     bordercolor="#666666"
     borderopacity="1.0"
     inkscape:showpageshadow="2"
     inkscape:pageopacity="0.0"
     inkscape:pagecheckerboard="0"
     inkscape:deskcolor="#d1d1d1"
     showgrid="true"
     inkscape:zoom="57.375"
     inkscape:cx="7.9912854"
     inkscape:cy="8"
     inkscape:current-layer="g1998"><inkscape:grid
       type="xygrid"
       id="grid1292" /></sodipodi:namedview><g
     id="g1998"><g
       id="g2005"><path
         style="fill:none;stroke:#00aad4;stroke-width:0.132292;stroke-linecap:butt;stroke-linejoin:miter;stroke-dasharray:none;stroke-opacity:1"
         d="M 0.79374999,0.66145814 V 1.4552081 L 0.66145832,1.9843748 H 0.13229166 L 0.66145832,0.66145814 Z"
         id="path2834" /><path
         style="fill:none;stroke:#00aad4;stroke-width:0.132292;stroke-linecap:butt;stroke-linejoin:miter;stroke-dasharray:none;stroke-opacity:1"
         d="M 3.4395834,0.6614582 V 1.4552081 L 3.571875,1.9843748 H 4.1010417 L 3.571875,0.6614582 Z"
         id="path2838" /><path
         style="fill:none;stroke:#00aad4;stroke-width:0.132292;stroke-linecap:butt;stroke-linejoin:miter;stroke-dasharray:none;stroke-opacity:1"
         d="M 0.79374999,0.66145814 H 3.4395833 V 1.4552081 H 0.79374999 V 0.66145814"
         id="path2836" /><path
         style="fill:none;stroke:#00aad4;stroke-width:0.264583px;stroke-linecap:round;stroke-linejoin:round;stroke-opacity:1"
         d="M 2.1166667,3.3072915 H 0.13229174 l -8e-8,-1.3229167 H 1.4552083 c 0.2645834,0.6614584 1.0583334,0.6614584 1.3229167,0 h 1.3229166 l 10e-8,1.3229167 h -1.984375"
         id="path365"
         sodipodi:nodetypes="cccccccc" /><path
         style="fill:none;stroke:#00aad4;stroke-width:0.264583px;stroke-linecap:round;stroke-linejoin:round;stroke-opacity:1"
         d="M 0.13229166,1.9843748 0.66145834,0.66145816 H 3.571875 L 4.1010416,1.9843748"
         id="path463"
         sodipodi:nodetypes="cccc" /></g></g></svg>
