<?xml version="1.0" encoding="UTF-8" standalone="no"?>
<svg
   height="48"
   width="48"
   version="1.1"
   id="svg159"
   sodipodi:docname="dialog_confirmation_150.svg"
   inkscape:export-filename="dialog_confirmation_150.png"
   inkscape:export-xdpi="96"
   inkscape:export-ydpi="96"
   inkscape:version="1.2.1 (9c6d41e410, 2022-07-14)"
   xmlns:inkscape="http://www.inkscape.org/namespaces/inkscape"
   xmlns:sodipodi="http://sodipodi.sourceforge.net/DTD/sodipodi-0.dtd"
   xmlns="http://www.w3.org/2000/svg"
   xmlns:svg="http://www.w3.org/2000/svg">
  <defs
     id="defs163" />
  <sodipodi:namedview
     id="namedview161"
     pagecolor="#ffffff"
     bordercolor="#666666"
     borderopacity="1.0"
     inkscape:showpageshadow="2"
     inkscape:pageopacity="0.0"
     inkscape:pagecheckerboard="0"
     inkscape:deskcolor="#d1d1d1"
     showgrid="true"
     inkscape:zoom="19.125"
     inkscape:cx="23.973856"
     inkscape:cy="24"
     inkscape:current-layer="svg159">
    <inkscape:grid
       type="xygrid"
       id="grid1882" />
  </sodipodi:namedview>
  <linearGradient
     id="a"
     gradientUnits="userSpaceOnUse"
     x1="16.0000008"
     x2="23.53846317692"
     y1="9.53846247692"
     y2="26.76923133846">
    <stop
       offset="0"
       stop-color="#fff"
       id="stop144" />
    <stop
       offset="1"
       stop-color="#acf"
       id="stop146" />
  </linearGradient>
  <g
     transform="matrix(1.53333334 0 0 1.53333334 -.533334 -.53334)"
     id="g157">
    <circle
       cx="16"
       cy="16"
       r="14"
       style="fill-rule:evenodd;stroke:#0055d4;stroke-width:2;stroke-linecap:round;stroke-linejoin:round;stroke-opacity:.954902;fill:url(#a)"
       id="circle149" />
    <g
       fill="#0055d4"
       id="g155">
      <path
         d="m17.480776 20h-2.965566c-.01556.000451-.01126-1.186695-.01126-1.279732 0-.961337.158939-1.752155.476816-2.372454.317878-.62015.953633-1.317931 1.907266-2.093342.953633-.775262 1.523488-1.283097 1.709563-1.523506.286865-.379889.430297-.798557.430297-1.256004 0-.635631-.255853-1.1783-.767558-1.628006-.503952-.4574457-1.186226-.6861686-2.046822-.6861686-.829584 0-1.523488.2364635-2.081712.7093906-.558225.472928-.942004 1.193931-1.151338 2.163008l-3.000462-.372001c.085282-1.38782.674519-2.566343 1.767711-3.5355689 1.100943-.9690774 2.543022-1.4536161 4.326239-1.4536161 1.876253 0 3.368728.4923538 4.477424 1.4770615 1.108696.9768183 1.663044 2.1164885 1.663044 3.4190115 0 .721077-.205458 1.403376-.616374 2.046897-.403161.643521-1.27151 1.519636-2.605047 2.628344-.690026.573706-1.120324 1.034948-1.290894 1.383727-.162815.348927-.236817 1.473548-.221314 2.372959z"
         id="path151" />
      <path
         d="m14.5 25v-2.998592h2.998679v2.998592z"
         id="path153" />
    </g>
  </g>
</svg>
