<?xml version="1.0" encoding="UTF-8" standalone="no"?>
<svg
   height="16"
   width="16"
   version="1.1"
   id="svg27"
   sodipodi:docname="menu_project_options.svg"
   inkscape:export-filename="menu_project_options.png"
   inkscape:export-xdpi="96"
   inkscape:export-ydpi="96"
   inkscape:version="1.2.2 (732a01da63, 2022-12-09)"
   xmlns:inkscape="http://www.inkscape.org/namespaces/inkscape"
   xmlns:sodipodi="http://sodipodi.sourceforge.net/DTD/sodipodi-0.dtd"
   xmlns="http://www.w3.org/2000/svg"
   xmlns:svg="http://www.w3.org/2000/svg">
  <defs
     id="defs31" />
  <sodipodi:namedview
     id="namedview29"
     pagecolor="#ffffff"
     bordercolor="#666666"
     borderopacity="1.0"
     inkscape:showpageshadow="2"
     inkscape:pageopacity="0.0"
     inkscape:pagecheckerboard="0"
     inkscape:deskcolor="#d1d1d1"
     showgrid="true"
     inkscape:zoom="57.375"
     inkscape:cx="7.9912854"
     inkscape:cy="8"
     inkscape:current-layer="svg27">
    <inkscape:grid
       type="xygrid"
       id="grid492" />
  </sodipodi:namedview>
  <radialGradient
     id="a"
     cx="7.388889"
     cy="3.048611"
     gradientTransform="matrix(-.00000006 .97959197 -.9795918 -.00000006 12.129253 -1.095239)"
     gradientUnits="userSpaceOnUse"
     r="3.5">
    <stop
       offset="0"
       stop-color="#ff8080"
       id="stop2" />
    <stop
       offset="1"
       stop-color="#e50000"
       id="stop4" />
  </radialGradient>
  <radialGradient
     id="b"
     cx="3"
     cy="10"
     gradientTransform="matrix(0 .9795918 -.9795918 0 15.938775 8.204081)"
     gradientUnits="userSpaceOnUse"
     r="3.5">
    <stop
       offset="0"
       stop-color="#80b2ff"
       id="stop7" />
    <stop
       offset="1"
       stop-color="#2672e5"
       id="stop9" />
  </radialGradient>
  <radialGradient
     id="c"
     cx="10.5"
     cy="9.5"
     gradientTransform="matrix(-.0000001 .9795918 -.9795918 -.00000011 21.448981 .857143)"
     gradientUnits="userSpaceOnUse"
     r="3.5">
    <stop
       offset="0"
       stop-color="#ffe680"
       id="stop12" />
    <stop
       offset="1"
       stop-color="#e5b800"
       id="stop14" />
  </radialGradient>
  <g
     stroke-width=".857143"
     id="g23">
    <circle
       cx="10"
       cy="7"
       fill="url(#a)"
       r="3"
       id="circle17" />
    <circle
       cx="13"
       cy="12"
       fill="url(#c)"
       r="3"
       id="circle19" />
    <circle
       cx="7"
       cy="12"
       fill="url(#b)"
       r="3"
       id="circle21" />
  </g>
  <path
     d="m2.2183023.4190284.3508653 1.376812-.7724697.7726844-1.3786277-.3505561-.4180702 1.0093103 1.2227176.726957-.0001518 1.092589-1.2216522.725455.4181147 1.009419 1.3768121-.350867.7726844.77247-.350556 1.378628 1.0093103.418071.726957-1.222718 1.092589.000151.725455 1.221652 1.009419-.418113-.350867-1.376813.77247-.772684 1.378628.350556.41807-1.009311-1.222717-.726956.000151-1.09259 1.221652-.725454-.418114-1.0094187-1.376812.3508653-.772684-.7724697.350556-1.3786277-1.009311-.4180702-.726957 1.2227175-1.092589-.0001518-.725454-1.2216522zm1.6545258 2.5668436a1.6388802 1.6388802 0 0 1 2.1413.886956 1.6388802 1.6388802 0 0 1 -.886955 2.1413 1.6388802 1.6388802 0 0 1 -2.1413011-.886955 1.6388802 1.6388802 0 0 1 .8869561-2.141301z"
     fill="#2a7fff"
     id="path25" />
</svg>
