<?xml version="1.0" encoding="UTF-8" standalone="no"?>
<svg
   height="32"
   width="32"
   version="1.1"
   id="svg348"
   sodipodi:docname="Grid_02_32.svg"
   inkscape:export-filename="Grid_02_32.png"
   inkscape:export-xdpi="96"
   inkscape:export-ydpi="96"
   inkscape:version="1.2-beta (1b65182ce9, 2022-04-05)"
   xmlns:inkscape="http://www.inkscape.org/namespaces/inkscape"
   xmlns:sodipodi="http://sodipodi.sourceforge.net/DTD/sodipodi-0.dtd"
   xmlns="http://www.w3.org/2000/svg"
   xmlns:svg="http://www.w3.org/2000/svg">
  <defs
     id="defs352" />
  <sodipodi:namedview
     id="namedview350"
     pagecolor="#ffffff"
     bordercolor="#666666"
     borderopacity="1.0"
     inkscape:pageshadow="2"
     inkscape:pageopacity="0.0"
     inkscape:pagecheckerboard="0"
     inkscape:deskcolor="#d1d1d1"
     showgrid="true"
     inkscape:zoom="28.6875"
     inkscape:cx="16"
     inkscape:cy="16"
     inkscape:current-layer="svg348">
    <inkscape:grid
       type="xygrid"
       id="grid1131" />
  </sodipodi:namedview>
  <linearGradient
     id="a"
     gradientTransform="matrix(0 -.9375 -1.0166667 0 84.133336 49.78125)"
     gradientUnits="userSpaceOnUse"
     x1="9"
     x2="6"
     y1="10"
     y2="10.5">
    <stop
       offset="0"
       stop-color="#72cef6"
       id="stop316" />
    <stop
       offset="1"
       stop-color="#d2f5f8"
       id="stop318" />
  </linearGradient>
  <linearGradient
     id="b"
     gradientTransform="matrix(0 -.9375 -1.0166667 0 84.133336 49.78125)"
     gradientUnits="userSpaceOnUse"
     x1="10"
     x2="5"
     y1="12.5"
     y2="12.5">
    <stop
       offset="0"
       stop-color="#4674a8"
       id="stop321" />
    <stop
       offset="1"
       stop-color="#42a0ce"
       id="stop323" />
  </linearGradient>
  <g
     stroke-width=".75"
     transform="matrix(0 2 -2 0 100 -136)"
     id="g346">
    <path
       d="m-83.625-49.625h15.250001v15.250001h-15.250001z"
       fill="#fff"
       stroke="#999"
       stroke-dashoffset="1.49998"
       stroke-linecap="round"
       stroke-linejoin="round"
       transform="scale(-1)"
       id="path326" />
    <g
       fill="none"
       stroke="#b3b3b3"
       transform="matrix(-1 0 0 1 152 0)"
       id="g338">
      <path
         d="m68.75 46.625h14.5"
         id="path328" />
      <path
         d="m72.125 49.25v-14.5"
         id="path330" />
      <path
         d="m83.25 37.375h-14.5"
         id="path332" />
      <path
         d="m80.125 49.25v-14.5"
         id="path334" />
      <path
         d="m76.125 49.25v-14.5"
         id="path336" />
    </g>
    <g
       stroke-linejoin="round"
       id="g344">
      <path
         d="m68.375-45.375h15.25v5.25h-15.25z"
         fill="none"
         opacity=".5"
         stroke="#fff"
         stroke-dashoffset="1.49998"
         transform="scale(1 -1)"
         id="path340" />
      <path
         d="m83.625003 44.625h-15.250001v-3.75h15.250001z"
         fill="url(#a)"
         stroke="url(#b)"
         stroke-linecap="round"
         id="path342" />
    </g>
  </g>
</svg>
