<?xml version="1.0" encoding="UTF-8" standalone="no"?>
<svg
   height="16"
   width="16"
   version="1.1"
   id="svg315"
   xml:space="preserve"
   xmlns="http://www.w3.org/2000/svg"
   xmlns:svg="http://www.w3.org/2000/svg"><defs
     id="defs319" /><g
     id="g951"><path
       style="fill:none;stroke:#00aad4;stroke-width:1.25;stroke-linecap:butt;stroke-linejoin:round;stroke-dasharray:none;stroke-opacity:1"
       d="M 3.2819784,13.375 C 1.5262446,13.358744 -0.25961773,9.7493783 2.7235769,8.3763171 1.5006839,1.4768556 12.014358,1.996337 11.706778,6.3591893 15.979127,7.4806684 15.949908,13.375 11.499952,13.375 Z"
       id="path353" /><g
       id="g1457"
       transform="translate(0,-0.25)"
       style="stroke:#00aad4;stroke-opacity:1"><path
         style="fill:none;stroke:#00aad4;stroke-width:1px;stroke-linecap:round;stroke-linejoin:round;stroke-opacity:1"
         d="m 5.5,8.5 2,-2 2,2"
         id="path1453" /><path
         style="fill:none;stroke:#00aad4;stroke-width:1px;stroke-linecap:round;stroke-linejoin:round;stroke-opacity:1"
         d="m 7.5,11.5 v -5"
         id="path1447" /></g></g></svg>
