<?xml version="1.0" encoding="UTF-8" standalone="no"?>
<svg
   height="64"
   viewBox="0 0 16.933333 16.933335"
   width="64"
   version="1.1"
   id="svg6"
   sodipodi:docname="Delete_04_64.svg"
   inkscape:export-filename="Delete_04_64.png"
   inkscape:export-xdpi="96"
   inkscape:export-ydpi="96"
   inkscape:version="1.3 (0e150ed6c4, 2023-07-21)"
   xmlns:inkscape="http://www.inkscape.org/namespaces/inkscape"
   xmlns:sodipodi="http://sodipodi.sourceforge.net/DTD/sodipodi-0.dtd"
   xmlns="http://www.w3.org/2000/svg"
   xmlns:svg="http://www.w3.org/2000/svg">
  <defs
     id="defs6" />
  <sodipodi:namedview
     id="namedview6"
     pagecolor="#ffffff"
     bordercolor="#000000"
     borderopacity="0.25"
     inkscape:showpageshadow="2"
     inkscape:pageopacity="0.0"
     inkscape:pagecheckerboard="0"
     inkscape:deskcolor="#d1d1d1"
     showgrid="true"
     inkscape:current-layer="svg6">
    <inkscape:grid
       id="grid6"
       units="px"
       originx="0"
       originy="0"
       spacingx="0.13229166"
       spacingy="0.13229168"
       empcolor="#0099e5"
       empopacity="0.30196078"
       color="#0099e5"
       opacity="0.14901961"
       empspacing="2"
       dotted="false"
       gridanglex="30"
       gridanglez="30"
       visible="true" />
  </sodipodi:namedview>
  <path
     d="M 2.6458325,4.2333328 3.4924994,16.404168 H 13.440834 L 14.287501,4.2333328"
     id="path1"
     style="fill:#f5f7ff;stroke:#00aad4;stroke-width:1.05833;stroke-linecap:round;stroke-linejoin:round;fill-opacity:1" />
  <path
     d="m 1.5874992,4.2333328 c 4.7038718,-0.9642675 8.9958348,-1.0583326 13.7583348,0"
     id="path2"
     style="fill:#f5f7ff;stroke:#00aad4;stroke-width:1.05833;stroke-linecap:round;stroke-linejoin:round;fill-opacity:1" />
  <path
     d="M 6.3499998,3.1749995 V 1.5874992 c 1.5875003,-0.5291667 2.6458336,-0.5291667 4.2333342,0 v 1.5875003"
     id="path3"
     style="fill:#f5f7ff;stroke:#00aad4;stroke-width:1.05833;stroke-linecap:round;stroke-linejoin:round;fill-opacity:1" />
  <path
     d="M 8.4666657,5.8208327 V 14.2875"
     id="path4"
     style="fill:none;stroke:#75d4f0;stroke-width:1.05833;stroke-linecap:round;stroke-linejoin:round;stroke-opacity:1" />
  <path
     d="M 6.138333,14.287501 5.5033329,5.8208327"
     id="path5"
     style="fill:none;stroke:#75d4f0;stroke-width:1.05833;stroke-linecap:round;stroke-linejoin:round;stroke-opacity:1" />
  <path
     d="M 10.795,14.287501 11.430001,5.8208327"
     id="path6"
     style="fill:none;stroke:#75d4f0;stroke-width:1.05833;stroke-linecap:round;stroke-linejoin:round;stroke-opacity:1" />
</svg>
