<?xml version="1.0" encoding="UTF-8" standalone="no"?>
<svg
   height="48"
   viewBox="0 0 12.7 12.700001"
   width="48"
   version="1.1"
   id="svg600"
   sodipodi:docname="Font_09_48.svg"
   inkscape:export-filename="Font_09_48.png"
   inkscape:export-xdpi="96"
   inkscape:export-ydpi="96"
   inkscape:version="1.2 (dc2aedaf03, 2022-05-15)"
   xmlns:inkscape="http://www.inkscape.org/namespaces/inkscape"
   xmlns:sodipodi="http://sodipodi.sourceforge.net/DTD/sodipodi-0.dtd"
   xmlns="http://www.w3.org/2000/svg"
   xmlns:svg="http://www.w3.org/2000/svg">
  <defs
     id="defs604">
    <linearGradient
       id="a"
       gradientUnits="userSpaceOnUse"
       x1="42.679054"
       x2="28.320946"
       y1="42.679054"
       y2="28.320946"
       gradientTransform="matrix(0.98376471,0,0,0.98376471,0.57635198,0.57635198)">
      <stop
         offset="0"
         stop-color="#009600"
         id="stop1250" />
      <stop
         offset="1"
         stop-color="#6edb39"
         id="stop1252" />
    </linearGradient>
    <filter
       inkscape:collect="always"
       style="color-interpolation-filters:sRGB"
       id="filter2918"
       x="-0.077505999"
       y="-0.072650977"
       width="1.155012"
       height="1.145302">
      <feGaussianBlur
         inkscape:collect="always"
         stdDeviation="0.38441348"
         id="feGaussianBlur2920" />
    </filter>
  </defs>
  <sodipodi:namedview
     id="namedview602"
     pagecolor="#ffffff"
     bordercolor="#666666"
     borderopacity="1.0"
     inkscape:showpageshadow="2"
     inkscape:pageopacity="0.0"
     inkscape:pagecheckerboard="0"
     inkscape:deskcolor="#d1d1d1"
     showgrid="true"
     inkscape:zoom="19.125"
     inkscape:cx="20.679739"
     inkscape:cy="24"
     inkscape:current-layer="svg600">
    <inkscape:grid
       type="xygrid"
       id="grid1199" />
  </sodipodi:namedview>
  <g
     id="g935">
    <path
       id="path2551"
       style="fill:#ffffff;stroke:none;filter:url(#filter2918)"
       d="M 5.1604087,0 A 0.7930484,0.7930484 0 0 0 4.414201,0.52554934 L 0.44545086,11.638567 a 0.7930484,0.7930484 0 0 0 0.74620774,1.0604 H 2.947107 a 0.7930484,0.7930484 0 0 0 0.7462078,-0.525033 l 0.947229,-2.6504839 h 3.4178794 l 0.947229,2.6504839 a 0.7930484,0.7930484 0 0 0 0.7462077,0.525033 h 1.7580321 a 0.7930484,0.7930484 0 0 0 0.746208,-1.0604 L 8.2873498,0.52554934 A 0.7930484,0.7930484 0 0 0 7.5411421,0 Z M 6.3494835,4.7382123 6.9256757,6.3515505 H 5.7732912 Z" />
    <path
       d="M 5.1593754,0.7937502 1.1906252,11.90625 H 2.9482148 L 4.0821435,8.7312503 H 8.6178582 L 9.7517862,11.90625 H 11.509375 L 7.5406252,0.7937502 Z m 1.1906248,1.5875002 1.700893,4.7624999 H 4.6491075 Z"
       stroke="#ffffff"
       stroke-width="0.198438"
       id="path723"
       sodipodi:nodetypes="ccccccccccccc"
       style="stroke:none" />
  </g>
  <g
     id="g6670"
     transform="scale(0.26458334)">
    <circle
       cx="35.5"
       cy="35.5"
       fill="url(#a)"
       stroke-dashoffset="1.49998"
       stroke-linejoin="round"
       stroke-width="2.02703"
       transform="matrix(0,1,1,0,0,0)"
       id="circle1255"
       style="fill:url(#a);stroke:#ffffff;stroke-width:2.4;stroke-linecap:round;stroke-dasharray:none"
       r="11.3" />
    <g
       fill="none"
       stroke-width="3"
       id="g1261"
       style="stroke:#ffffff;stroke-linecap:round">
      <path
         d="m 35.5,29.5 v 12"
         id="path1257" />
      <path
         d="m 41.5,35.5 h -12"
         id="path1259" />
    </g>
  </g>
</svg>
