<?xml version="1.0" encoding="UTF-8" standalone="no"?>
<svg
   height="48"
   width="48"
   version="1.1"
   id="svg686"
   sodipodi:docname="Paste_02_48.svg"
   inkscape:export-filename="Paste_02_48.png"
   inkscape:export-xdpi="96"
   inkscape:export-ydpi="96"
   inkscape:version="1.2-beta (1b65182ce9, 2022-04-05)"
   xmlns:inkscape="http://www.inkscape.org/namespaces/inkscape"
   xmlns:sodipodi="http://sodipodi.sourceforge.net/DTD/sodipodi-0.dtd"
   xmlns="http://www.w3.org/2000/svg"
   xmlns:svg="http://www.w3.org/2000/svg">
  <defs
     id="defs690" />
  <sodipodi:namedview
     id="namedview688"
     pagecolor="#ffffff"
     bordercolor="#666666"
     borderopacity="1.0"
     inkscape:pageshadow="2"
     inkscape:pageopacity="0.0"
     inkscape:pagecheckerboard="0"
     inkscape:deskcolor="#d1d1d1"
     showgrid="true"
     inkscape:zoom="19.125"
     inkscape:cx="24"
     inkscape:cy="24"
     inkscape:current-layer="svg686">
    <inkscape:grid
       type="xygrid"
       id="grid3577" />
  </sodipodi:namedview>
  <linearGradient
     id="a"
     gradientTransform="matrix(1.2692308,0,0,0.77272722,7.846158,-59.18182)"
     gradientUnits="userSpaceOnUse"
     x1="5.399997"
     x2="5.399997"
     y1="4.333334"
     y2="11.666667">
    <stop
       offset="0"
       stop-color="#fc0"
       id="stop648" />
    <stop
       offset="1"
       stop-color="#fff6d5"
       id="stop650" />
  </linearGradient>
  <linearGradient
     id="b"
     gradientTransform="matrix(1.2692308,0,0,0.77272722,7.846158,-59.18182)"
     gradientUnits="userSpaceOnUse"
     x1="7.999997"
     x2="7.999997"
     y1="13.500001"
     y2="2.5">
    <stop
       offset="0"
       stop-color="#744b18"
       id="stop653" />
    <stop
       offset="1"
       stop-color="#ca7f26"
       id="stop655" />
  </linearGradient>
  <linearGradient
     id="c"
     gradientTransform="matrix(1.8871795,0,0,2.4947838,19.635896,61.321132)"
     gradientUnits="userSpaceOnUse"
     x1="3.666667"
     x2="3.666667"
     y1="3.722222"
     y2="12.277779">
    <stop
       offset="0"
       stop-color="#fff"
       id="stop658" />
    <stop
       offset="1"
       stop-color="#e0ebf4"
       id="stop660" />
  </linearGradient>
  <linearGradient
     id="d"
     gradientTransform="matrix(1.8871795,0,0,2.4947838,19.635896,61.321132)"
     gradientUnits="userSpaceOnUse"
     x1="7.277778"
     x2="7.277778"
     y1="13.500001"
     y2="2.5">
    <stop
       offset="0"
       stop-color="#3a7ab7"
       id="stop663" />
    <stop
       offset="1"
       stop-color="#75a5d3"
       id="stop665" />
  </linearGradient>
  <g
     id="g3949">
    <path
       d="M 28,26.5 H 39"
       id="path668"
       style="fill:none;stroke:#00aad4;stroke-width:3" />
    <path
       d="M 28,38.5 H 42"
       id="path670"
       style="fill:none;stroke:#00aad4;stroke-width:3;stroke-opacity:1" />
    <path
       d="M 28,32.5 H 42"
       id="path672"
       style="fill:none;stroke:#00aad4;stroke-width:3;stroke-opacity:1" />
    <path
       d="M 19,42.5 H 3 C 2.296846,42.5 1.5,41.982092 1.5,41 V 7 C 1.5,6.0179092 2.296846,5.5 3,5.5 h 8"
       id="path674"
       style="fill:none;stroke:#00aad4;stroke-width:3;stroke-opacity:1" />
    <path
       d="m 25,5.5 h 8 c 0.703154,0 1.5,0.5179092 1.5,1.5 v 8"
       id="path676"
       style="fill:none;stroke:#00aad4;stroke-width:3;stroke-opacity:1" />
    <rect
       fill="url(#a)"
       fill-rule="evenodd"
       height="8"
       rx="0.499998"
       ry="0.36363599"
       stroke="url(#b)"
       stroke-linecap="square"
       transform="scale(1,-1)"
       width="13"
       x="11.5"
       y="-9.5000019"
       id="rect680"
       style="fill:none;stroke:#00aad4;stroke-width:3;stroke-opacity:1" />
    <path
       d="m 23.5,19.5 h 17 l 6,6 v 21 h -23 z"
       fill="url(#c)"
       fill-rule="evenodd"
       stroke="url(#d)"
       stroke-linecap="square"
       id="path682"
       style="fill:none;stroke:#00aad4;stroke-width:3;stroke-opacity:1" />
  </g>
</svg>
