<svg width="16" height="16" version="1.1" xmlns="http://www.w3.org/2000/svg">
 <radialGradient id="a" cx="6.933635" cy="3.590763" r="1.984375" gradientTransform="matrix(0 4.0818897 -4.0818897 -5.4e-7 22.5571 -20.402331)" gradientUnits="userSpaceOnUse">
  <stop stop-color="#fcfc80" offset="0"/>
  <stop stop-color="#ecd454" offset=".62962961"/>
  <stop stop-color="#cc980c" offset="1"/>
 </radialGradient>
 <path d="m12.737253 7.000504-.768916 1.3521654-.936624.0003357-.769243-1.3530051-1.0693851.4429539.4127823 1.5006564-.6625305.6620544-1.499832-.4124178-.4430007 1.0694991 1.3521654.768917.0003357.936624-1.3530051.769243.4429539 1.069384 1.5006555-.412781.6620553.662529-.4124187 1.499833 1.0695.443002.768916-1.352166.936623-.000336.769245 1.353005 1.069385-.442953-.412783-1.500657.662531-.662055 1.499832.412418.443001-1.069499-1.352165-.768918-.000337-.936623 1.353006-.769243-.442953-1.0693851-1.500658.4127823-.662055-.6625305.412419-1.499832zm-.646586 3.073497a1.5434896 1.5434896 0 0 1 .835331 2.016666 1.5434896 1.5434896 0 0 1 -2.016666.835331 1.5434896 1.5434896 0 0 1 -.835331-2.016665 1.5434896 1.5434896 0 0 1 2.016666-.835332z" fill="url(#a)" stroke-linejoin="round" stroke-width=".99999"/>
</svg>
