<?xml version="1.0" encoding="UTF-8" standalone="no"?>
<svg
   width="36"
   height="36"
   version="1.1"
   viewBox="0 0 36 36"
   id="svg5"
   sodipodi:docname="tmysql41connection_150.svg"
   inkscape:version="1.3.2 (091e20e, 2023-11-25, custom)"
   inkscape:export-filename="tmysql41connection_150.png"
   inkscape:export-xdpi="96"
   inkscape:export-ydpi="96"
   xmlns:inkscape="http://www.inkscape.org/namespaces/inkscape"
   xmlns:sodipodi="http://sodipodi.sourceforge.net/DTD/sodipodi-0.dtd"
   xmlns="http://www.w3.org/2000/svg"
   xmlns:svg="http://www.w3.org/2000/svg">
  <defs
     id="defs5" />
  <sodipodi:namedview
     id="namedview5"
     pagecolor="#ffffff"
     bordercolor="#000000"
     borderopacity="0.25"
     inkscape:showpageshadow="2"
     inkscape:pageopacity="0.0"
     inkscape:pagecheckerboard="0"
     inkscape:deskcolor="#d1d1d1"
     showgrid="true"
     inkscape:current-layer="svg5">
    <inkscape:grid
       id="grid5"
       units="px"
       originx="0"
       originy="0"
       spacingx="0.5"
       spacingy="0.5"
       empcolor="#0099e5"
       empopacity="0.30196078"
       color="#0099e5"
       opacity="0.14901961"
       empspacing="2"
       dotted="false"
       gridanglex="30"
       gridanglez="30"
       visible="true" />
  </sodipodi:namedview>
  <path
     d="M 5.400064,32.2429 V 35.4 M 4.879701,27.6 1.699703,33.9143 h 5.234752"
     fill="none"
     stroke="#ff0000"
     stroke-linecap="round"
     stroke-linejoin="round"
     stroke-width="1.2"
     id="path1" />
  <path
     d="m 1.7646519,1.5077 c -0.427094,0.049 -0.88758002,0.213 -1.155696,0.4415 -0.422055,0.3592 -0.655611,0.9834 -0.601144,1.606 0.06137,0.7017 0.432933,1.2878 1.727693,2.7249 1.207406,1.3403 1.336456,1.5248 1.670466,2.3865 0.756828,1.9527 1.977979,4.1213 2.705965,4.8051 0.491772,0.4622 0.56881,0.6012 0.453288,0.8207 -0.124785,0.2367 -0.484095,2.5513 -0.522329,3.3649 -0.03825,0.8144 0.185142,2.642 0.412608,3.3753 0.443963,1.4316 1.04009,2.4429 1.834383,3.1125 0.76857,0.6477 1.354161,0.7284 1.9805921,0.2724 0.341238,-0.2482 0.467074,-0.6993 0.570369,-2.0446 0.05148,-0.6707 0.110115,-1.2519 0.130215,-1.2918 0.02004,-0.039 0.319347,0.3813 0.665071,0.9354 0.345711,0.5539 0.739835,1.1313 0.875852,1.2829 0.400144,0.4463 1.688299,1.533 2.387101,2.0141 0.35613,0.2451 0.905084,0.6511 1.219895,0.9021 0.888713,0.7087 1.017093,0.6832 0.167697,-0.033 -1.566218,-1.3209 -3.812186,-4.3794 -5.100381,-6.9452 -0.219909,-0.4381 -0.431778,-0.8029 -0.470844,-0.8107 -0.0968,-0.019 -0.706161,0.9307 -0.8931701,1.3929 -0.219365,0.5419 -0.323765,1.2522 -0.366102,2.4913 -0.02052,0.5993 -0.06992,1.1157 -0.10971,1.1472 -0.09764,0.077 -0.427025,-0.067 -0.699092,-0.3084 -0.241575,-0.2136 -0.644646,-0.8871 -0.954155,-1.594 -0.470711,-1.0751 -0.777579,-3.1391 -0.663528,-4.4624 0.03105,-0.3606 0.182362,-1.1742 0.33622,-1.8088 0.390546,-1.6103 0.373613,-1.6991 -0.471057,-2.4726 C 6.1785429,12.1561 5.6306879,11.2376 4.8025019,9.3032 4.4405009,8.4577 4.0231849,7.5713 3.8750459,7.3334 3.5771909,6.8551 2.5540629,5.6132 1.9360579,4.9802 1.3689619,4.3988 1.0020919,3.7451 1.0205439,3.3488 c 0.01941,-0.417 0.14943,-0.5467 0.629415,-0.6273 0.338893,-0.057 0.524355,-0.03 1.139167,0.1526 1.050999,0.3156 2.053039,0.7509 2.586292,1.1236 0.484636,0.3387 0.58564,0.416 0.731391,0.5093 0.182122,0 0.446194,-0.015 1.362585,-0.025 1.44415,-0.024 1.912579,0.064 3.3812601,0.6363 3.968218,1.5454 7.908492,5.0428 9.772618,8.6745 0.211437,0.412 0.740101,1.3677 1.174879,2.1234 0.434792,0.7563 1.031748,1.8034 1.326556,2.3272 0.944508,1.679 1.486428,2.3829 1.991654,2.5884 0.173718,0.071 0.838067,0.2532 1.476421,0.4058 0.638361,0.1527 1.388959,0.3583 1.667957,0.4572 0.623829,0.2209 4.126484,2.1688 4.375025,2.4331 l 0.180182,0.1919 -0.965002,0.1365 c -0.530738,0.075 -1.283495,0.2148 -1.672415,0.3121 -0.867052,0.2142 -2.483624,0.8927 -2.561498,1.074 -0.08904,0.2078 0.469879,1.0791 1.02057,1.5909 0.795685,0.7395 1.993652,1.4238 3.548713,2.0273 1.352593,0.5248 2.504681,1.1311 3.364322,1.7706 0.224367,0.1671 0.422442,0.2866 0.4401,0.2656 0.08607,-0.102 -0.43767,-0.7342 -1.153101,-1.3921 -1.496994,-1.3769 -2.06458,-1.7778 -3.471025,-2.4521 -0.852619,-0.4087 -1.791191,-1.0741 -1.807681,-1.2817 -0.01065,-0.132 1.668027,-0.6993 2.695885,-0.9101 0.886527,-0.1816 2.038684,-0.6073 2.026387,-0.7477 -0.01613,-0.1847 -1.062735,-1.2092 -1.691542,-1.6559 -0.809113,-0.5752 -2.273479,-1.4832 -3.126281,-1.9384 -0.589404,-0.3147 -2.902074,-1.1994 -3.413106,-1.3059 -0.08836,-0.019 -0.260677,-0.12 -0.382918,-0.2285 C 25.297898,19.2606 23.269765,15.8592 21.98226,13.4041 21.250156,12.0084 20.747242,11.2717 19.656398,9.9978 17.7704,7.7955 15.820669,6.2559 12.943661,4.6969 11.433939,3.8788 10.881042,3.6682 9.6480489,3.4401 8.8905859,3.3006 8.4431689,3.2637 7.7362449,3.2848 7.2286829,3.3008 6.7928049,3.2608 6.6556629,3.2488 6.4301609,3.1048 6.3156449,3.0573 6.0928539,2.9017 5.0247079,2.1558 3.3145669,1.5622 2.0528889,1.5 c -0.0927,0 -0.189617,0 -0.288218,0.015 z m 5.824254,5.1779 c -0.626497,0.066 -0.648582,0.117 -0.211938,0.5475 0.212982,0.2091 0.53253,0.6298 0.710028,0.9345 0.194062,0.3337 0.357922,0.5377 0.411003,0.5122 0.14742,-0.071 0.364915,-0.6331 0.342819,-0.8856 -0.05251,-0.6006 -0.689967,-1.165 -1.251912,-1.1086 z"
     fill="#2a7efe"
     id="path2" />
  <path
     d="m 36,2.5 h -4.5 v 2 h -4 V 2"
     fill="none"
     stroke="#ff0000"
     stroke-linejoin="round"
     id="path3" />
  <path
     d="m 21,2.5 h 4.5 v -2 h 4 V 3"
     fill="none"
     stroke="#2a7efe"
     stroke-linejoin="round"
     id="path4" />
  <path
     d="M 10.412725,35.3999 V 27.6 L 8.1,29.0857"
     fill="none"
     stroke="#ff0000"
     stroke-linecap="round"
     stroke-linejoin="round"
     stroke-width="1.2"
     id="path5" />
</svg>
