<?xml version="1.0" encoding="UTF-8" standalone="no"?>
<svg
   height="64"
   width="64"
   version="1.1"
   id="svg626"
   sodipodi:docname="Lock_04_64.svg"
   inkscape:export-filename="Lock_04_64.png"
   inkscape:export-xdpi="96"
   inkscape:export-ydpi="96"
   inkscape:version="1.2 (dc2aedaf03, 2022-05-15)"
   xmlns:inkscape="http://www.inkscape.org/namespaces/inkscape"
   xmlns:sodipodi="http://sodipodi.sourceforge.net/DTD/sodipodi-0.dtd"
   xmlns="http://www.w3.org/2000/svg"
   xmlns:svg="http://www.w3.org/2000/svg">
  <defs
     id="defs630" />
  <sodipodi:namedview
     id="namedview628"
     pagecolor="#ffffff"
     bordercolor="#666666"
     borderopacity="1.0"
     inkscape:showpageshadow="2"
     inkscape:pageopacity="0.0"
     inkscape:pagecheckerboard="0"
     inkscape:deskcolor="#d1d1d1"
     showgrid="true"
     inkscape:zoom="14.34375"
     inkscape:cx="30.013072"
     inkscape:cy="32"
     inkscape:current-layer="g951">
    <inkscape:grid
       type="xygrid"
       id="grid1038" />
  </sodipodi:namedview>
  <g
     id="g951"
     transform="matrix(4,0,0,4,0,-3)">
    <g
       id="g426">
      <path
         d="m 2.625,8.625 h 10.75 v 6.75 H 2.625 Z"
         stroke-linejoin="round"
         id="path2-2"
         style="fill:none;stroke:#00aad4;stroke-width:1.25;stroke-dasharray:none"
         sodipodi:nodetypes="ccccc" />
      <path
         d="M 4.125,8 V 5.44991 c 0,-5.36601309 7.75,-5.50000002 7.75,0"
         id="path4-7"
         sodipodi:nodetypes="csc"
         style="fill:none;stroke:#00aad4;stroke-width:1.25;stroke-dasharray:none" />
      <path
         d="m 8,11 v 2.5"
         stroke-linecap="round"
         stroke-width="1px"
         id="path6-8"
         style="fill:none;stroke:#00aad4"
         sodipodi:nodetypes="cc" />
      <path
         d="m 8,11 v 0"
         stroke-linecap="round"
         stroke-width="2"
         id="path8-9"
         style="fill:none;stroke:#00aad4"
         sodipodi:nodetypes="cc" />
    </g>
  </g>
</svg>
