<svg width="16" height="16" version="1.0" xmlns="http://www.w3.org/2000/svg">
 <defs>
  <linearGradient id="a" x1="-10" x2="-11.5" y1="1047.3622" y2="1040.3622" gradientTransform="matrix(1.2587413,0,0,1.187495,21.243007,-1230.5811)" gradientUnits="userSpaceOnUse">
   <stop stop-color="#d5f6ff" offset="0"/>
   <stop stop-color="#ffffff" offset="1"/>
  </linearGradient>
 </defs>
 <rect x=".25" y="2.25" width="15.5" height="13.5" fill="#f9f9f9" stroke="#2a7efe" stroke-width=".5" style="paint-order:normal"/>
 <path d="m1.1-1e-7h13.8c0.6 0 1.1 0.5000002 1.1 1.1000002v1.3999998h-16l2e-7 -1.3999998c1e-7 -0.60000002 0.5-1.1000002 1.0999998-1.1000002z" fill="#2a7efe" stroke-width=".999997"/>
 <path d="M 4.2499999,4.2500022 9.5,4.2500546 11.75,6.5 v 7.25 H 4.2499999 Z" fill="url(#a)" fill-rule="evenodd" stroke="#999999" stroke-width=".5"/>
 <path d="m9.25 4.2500546v2.4999454h2.5" fill="none" stroke="#999999" stroke-width=".5"/>
 <path d="m6 9.3h4" fill="none" stroke="#b3b3b3" stroke-linejoin="round" stroke-width=".6"/>
 <path d="m6 7.3h2" fill="none" stroke="#b3b3b3" stroke-linejoin="round" stroke-width=".6"/>
 <path d="m6 11.3h4" fill="none" stroke="#b3b3b3" stroke-linejoin="round" stroke-width=".6"/>
</svg>
