<?xml version="1.0" encoding="UTF-8" standalone="no"?>
<svg
   width="32"
   height="32"
   version="1.1"
   id="svg18"
   sodipodi:docname="menu_run_withdebugging_200.svg"
   inkscape:export-filename="menu_run_withdebugging_200.png"
   inkscape:export-xdpi="96"
   inkscape:export-ydpi="96"
   inkscape:version="1.3.2 (091e20e, 2023-11-25, custom)"
   xmlns:inkscape="http://www.inkscape.org/namespaces/inkscape"
   xmlns:sodipodi="http://sodipodi.sourceforge.net/DTD/sodipodi-0.dtd"
   xmlns="http://www.w3.org/2000/svg"
   xmlns:svg="http://www.w3.org/2000/svg">
  <sodipodi:namedview
     id="namedview18"
     pagecolor="#ffffff"
     bordercolor="#000000"
     borderopacity="0.25"
     inkscape:showpageshadow="2"
     inkscape:pageopacity="0.0"
     inkscape:pagecheckerboard="0"
     inkscape:deskcolor="#d1d1d1"
     showgrid="true"
     inkscape:current-layer="svg18">
    <inkscape:grid
       id="grid18"
       units="px"
       originx="0"
       originy="0"
       spacingx="0.5"
       spacingy="0.5"
       empcolor="#0099e5"
       empopacity="0.30196078"
       color="#0099e5"
       opacity="0.14901961"
       empspacing="2"
       dotted="false"
       gridanglex="30"
       gridanglez="30"
       visible="true" />
  </sodipodi:namedview>
  <defs
     id="defs6">
    <radialGradient
       id="c"
       cx="21.957434"
       cy="5.9936466"
       r="3.105469"
       gradientTransform="matrix(1.0986919 .00038837098 3.0792878e-8 .90004578 -1.123742 14.785424)"
       gradientUnits="userSpaceOnUse">
      <stop
         stop-color="#803300"
         offset="0"
         id="stop1" />
      <stop
         stop-color="#d45500"
         offset="1"
         id="stop2" />
    </radialGradient>
    <linearGradient
       id="a"
       x1="25.714283"
       x2="25.714283"
       y1="15.5"
       y2="6.2142854"
       gradientTransform="matrix(1.0982843,3.3319454e-4,3.0504966e-4,1.2000001,-1.1649982,13.392668)"
       gradientUnits="userSpaceOnUse">
      <stop
         stop-color="#668000"
         offset="0"
         id="stop3" />
      <stop
         stop-color="#aad400"
         offset="1"
         id="stop4" />
    </linearGradient>
    <linearGradient
       id="b"
       x1="23"
       x2="23"
       y1="6.5"
       y2="15"
       gradientTransform="matrix(1.1311029,3.2992792e-4,3.1416508e-4,1.1882353,-1.8878202,13.76921)"
       gradientUnits="userSpaceOnUse">
      <stop
         stop-color="#89a02c"
         offset="0"
         id="stop5" />
      <stop
         stop-color="#445016"
         offset="1"
         id="stop6" />
    </linearGradient>
  </defs>
  <path
     d="m8.5 3v24l6.865234-5.492188-0.216796-0.226562c-0.167604-0.177099-0.35315-0.646086-0.353516-1.130859v-1.455079c0.0012-1.03373 0.864152-1.895284 1.898437-1.896484 0.736572-0.0012 1.26077 0.49864 1.576172 1.123047 0.325107-0.439324 0.61853-0.731172 0.939453-1.021484l-0.607422-1.488282c-0.390182-0.959037 0.08717-2.084676 1.046875-2.474609 0.387054-0.157263 0.802064-0.169073 1.1875-0.06836z"
     fill="#00cc00"
     fill-rule="evenodd"
     stroke-linejoin="round"
     id="path6" />
  <path
     d="m8.5566406 2.5019531a0.50005 0.50005 0 0 0-0.2734375 0.046875 0.50005 0.50005 0 0 0-0.2832031 0.4511719v24a0.50005 0.50005 0 0 0 0.8125 0.390625l6.898438-5.519531-0.5625-0.589844c-0.03556-0.03758-0.07018-0.0951-0.105469-0.15625l-6.042969 4.833984v-21.917968l10.992187 8.7949224c0.862886-0.167646 1.783609 0.286823 2.132813 1.146484l0.333984 0.826172 0.240235 0.191406-0.123047 0.09766 0.138672 0.339844c0.190946-0.0118 0.376934-0.01275 0.568359-2e-3l0.382813-0.943316-14.853516-11.882813a0.50005 0.50005 0 0 0-0.2558594-0.1074219z"
     fill="#008000"
     fill-rule="evenodd"
     stroke-linejoin="round"
     id="path7" />
  <g
     stroke-linejoin="round"
     id="g18">
    <path
       d="M 24.317718,17.93945 25.635432,14.7"
       fill="none"
       stroke="#d4aa00"
       stroke-linecap="round"
       stroke-width="1.4"
       id="path8" />
    <path
       d="M 21.682286,17.93945 20.36457,14.7"
       fill="none"
       stroke="#d4aa00"
       stroke-linecap="round"
       stroke-width="1.4"
       id="path9" />
    <path
       d="m22.99802 16.4a7.8000022 5.5007964 89.953824 0 0-3.405966 1.695842l3.407342 3.72291 3.41403-3.730216a7.8000022 5.5007964 89.953824 0 0-3.415406-1.688536z"
       fill="url(#c)"
       stroke-width="3.9268"
       id="path10" />
    <path
       d="m16.7 18.7v1.45181l1.756954 1.851114"
       fill="none"
       stroke="#aca793"
       stroke-linecap="round"
       stroke-width="1.4"
       id="path11" />
    <path
       d="M 16.722954,31.299998 16.7,29.4247 18.456954,27.573584"
       fill="none"
       stroke="#aca793"
       stroke-linecap="round"
       stroke-width="1.4"
       id="path12" />
    <path
       d="m14.7 26.223932 1.317716-1.388334 3.351002-0.643766"
       fill="none"
       stroke="#aca793"
       stroke-linecap="round"
       stroke-width="1.4"
       id="path13" />
    <path
       d="m29.300954 18.700002 4e-6 1.451808-1.756958 1.851116"
       fill="none"
       stroke="#aca793"
       stroke-linecap="round"
       stroke-width="1.4"
       id="path14" />
    <path
       d="m29.277998 31.3 0.02296-1.875298-1.756954-1.851114"
       fill="none"
       stroke="#aca793"
       stroke-linecap="round"
       stroke-width="1.4"
       id="path15" />
    <path
       d="m31.3 26.223932-1.317714-1.388334-3.352464-0.641616"
       fill="none"
       stroke="#aca793"
       stroke-linecap="round"
       stroke-width="1.4"
       id="path16" />
    <path
       d="m 26.396262,18.069782 -3.396876,3.711468 -3.38803,-3.701808 A 7.8000022,5.5007964 89.953824 0 0 17.5,24.198332 7.8000022,5.5007964 89.953824 0 0 23.001984,32 7.8000022,5.5007964 89.953824 0 0 28.5,24.201668 7.8000022,5.5007964 89.953824 0 0 26.396262,18.069782 Z"
       fill="url(#a)"
       stroke-width="3.9268"
       id="path17" />
    <path
       d="m23 21.3v10"
       fill="none"
       stroke="url(#b)"
       stroke-linecap="round"
       stroke-width="1.4"
       id="path18" />
  </g>
</svg>
