<?xml version="1.0" encoding="UTF-8" standalone="no"?>
<svg
   height="64"
   width="64"
   version="1.1"
   id="svg665"
   sodipodi:docname="Cloud_10_64.svg"
   inkscape:export-filename="Cloud_10_64.png"
   inkscape:export-xdpi="96"
   inkscape:export-ydpi="96"
   inkscape:version="1.2.1 (9c6d41e410, 2022-07-14)"
   xmlns:inkscape="http://www.inkscape.org/namespaces/inkscape"
   xmlns:sodipodi="http://sodipodi.sourceforge.net/DTD/sodipodi-0.dtd"
   xmlns="http://www.w3.org/2000/svg"
   xmlns:svg="http://www.w3.org/2000/svg">
  <defs
     id="defs669" />
  <sodipodi:namedview
     id="namedview667"
     pagecolor="#ffffff"
     bordercolor="#666666"
     borderopacity="1.0"
     inkscape:showpageshadow="2"
     inkscape:pageopacity="0.0"
     inkscape:pagecheckerboard="0"
     inkscape:deskcolor="#d1d1d1"
     showgrid="true"
     inkscape:zoom="14.34375"
     inkscape:cx="30.989107"
     inkscape:cy="32"
     inkscape:current-layer="svg665">
    <inkscape:grid
       type="xygrid"
       id="grid788" />
  </sodipodi:namedview>
  <linearGradient
     id="a"
     gradientTransform="matrix(1.0000001 0 0 .96627925 -.000186 -.011629)"
     gradientUnits="userSpaceOnUse"
     x1="7.5"
     x2="9"
     y1="2"
     y2="13">
    <stop
       offset="0"
       stop-color="#5ab4f2"
       id="stop658" />
    <stop
       offset="1"
       stop-color="#0090ff"
       id="stop660" />
  </linearGradient>
  <path
     d="m3.2916407 12.550001c-4.3402419 0-4.3402419-5.8903523-.28586-5.8903523-.5693973-6.0664286 9.1223563-5.70499896 9.1223563-1.4725883 4.918074-.359472 5.574823 7.3629406-.506798 7.3629406z"
     fill="url(#a)"
     transform="matrix(3.9999997 0 0 3.9999997 .000744 .000001)"
     id="path663" />
  <g
     id="g6082"
     transform="matrix(15.49415,0,0,15.455797,-83.034612,-86.85916)"
     style="stroke-width:0.244235">
    <path
       style="fill:#ff5555;fill-opacity:1;stroke:#ffffff;stroke-width:0.206785;stroke-linecap:round;stroke-linejoin:bevel;stroke-dasharray:none;stroke-opacity:1"
       d="M 8.0697919,9.657292 C 8.7312502,9.5250003 9.1281252,8.9958337 9.1281252,7.672917 c -0.396875,0 -0.8120771,-0.149785 -1.0583333,-0.3968753"
       id="path1107"
       sodipodi:nodetypes="ccc" />
    <path
       style="fill:#ffdd55;fill-opacity:1;stroke:#ffffff;stroke-width:0.206785;stroke-linecap:round;stroke-linejoin:bevel;stroke-dasharray:none;stroke-opacity:1"
       d="M 8.0697919,7.276042 C 7.8052086,7.5406257 7.4083336,7.672917 7.0114586,7.672917 c 0,1.3229167 0.3905853,1.8571829 1.0583333,1.984375"
       id="path2905"
       sodipodi:nodetypes="ccc" />
  </g>
</svg>
