<?xml version="1.0" encoding="UTF-8" standalone="no"?>
<svg
   height="24"
   viewBox="0 0 6.3499998 6.3500003"
   width="24"
   version="1.1"
   id="svg131"
   sodipodi:docname="Flip_02_24.svg"
   inkscape:version="1.2 (dc2aedaf03, 2022-05-15)"
   inkscape:export-filename="Flip_02_24.png"
   inkscape:export-xdpi="96"
   inkscape:export-ydpi="96"
   xmlns:inkscape="http://www.inkscape.org/namespaces/inkscape"
   xmlns:sodipodi="http://sodipodi.sourceforge.net/DTD/sodipodi-0.dtd"
   xmlns="http://www.w3.org/2000/svg"
   xmlns:svg="http://www.w3.org/2000/svg">
  <defs
     id="defs135" />
  <sodipodi:namedview
     id="namedview133"
     pagecolor="#ffffff"
     bordercolor="#666666"
     borderopacity="1.0"
     inkscape:showpageshadow="2"
     inkscape:pageopacity="0.0"
     inkscape:pagecheckerboard="0"
     inkscape:deskcolor="#d1d1d1"
     showgrid="true"
     inkscape:zoom="38.25"
     inkscape:cx="11.986928"
     inkscape:cy="12"
     inkscape:current-layer="svg131">
    <inkscape:grid
       type="xygrid"
       id="grid1286" />
  </sodipodi:namedview>
  <g
     id="g5432"
     transform="rotate(90,3.1749612,3.1749643)">
    <path
       style="fill:none;stroke:#00aad4;stroke-width:0.396879px;stroke-linecap:round;stroke-linejoin:round;stroke-opacity:1"
       d="M 2.7118996,0.19836817 V 6.1515605 H 0.84458163 c -0.4831806,0 -0.6469659,-0.5590363 -0.3968795,-0.9921986 z"
       id="path353"
       sodipodi:nodetypes="ccccc" />
    <path
       style="fill:#00aad4;fill-opacity:1;stroke:#00aad4;stroke-width:0.396879px;stroke-linecap:round;stroke-linejoin:round;stroke-opacity:1"
       d="M 3.6380229,0.19836816 V 6.1515604 h 1.8673178 c 0.4831806,0 0.6469658,-0.5590363 0.3968796,-0.9921986 z"
       id="path1006"
       sodipodi:nodetypes="ccccc" />
  </g>
</svg>
