<?xml version="1.0" encoding="UTF-8" standalone="no"?>
<svg
   height="16"
   viewBox="0 0 4.2333332 4.2333335"
   width="16"
   version="1.1"
   id="svg20"
   sodipodi:docname="Flag_04_16.svg"
   inkscape:export-filename="Flag_04_16.png"
   inkscape:export-xdpi="96"
   inkscape:export-ydpi="96"
   inkscape:version="1.2.1 (9c6d41e410, 2022-07-14)"
   xmlns:inkscape="http://www.inkscape.org/namespaces/inkscape"
   xmlns:sodipodi="http://sodipodi.sourceforge.net/DTD/sodipodi-0.dtd"
   xmlns="http://www.w3.org/2000/svg"
   xmlns:svg="http://www.w3.org/2000/svg">
  <defs
     id="defs24" />
  <sodipodi:namedview
     id="namedview22"
     pagecolor="#ffffff"
     bordercolor="#666666"
     borderopacity="1.0"
     inkscape:showpageshadow="2"
     inkscape:pageopacity="0.0"
     inkscape:pagecheckerboard="0"
     inkscape:deskcolor="#d1d1d1"
     showgrid="true"
     inkscape:zoom="57.375"
     inkscape:cx="7.7298475"
     inkscape:cy="8"
     inkscape:current-layer="svg20">
    <inkscape:grid
       type="xygrid"
       id="grid1050" />
  </sodipodi:namedview>
  <linearGradient
     id="a"
     gradientTransform="matrix(-0.18751171,-0.0400511,0,0.1872361,4.7426184,1.482731)"
     gradientUnits="userSpaceOnUse"
     x1="7.184878"
     x2="17.184877"
     y1="2.599694"
     y2="2.238764">
    <stop
       offset="0"
       stop-color="#0c0"
       id="stop2" />
    <stop
       offset=".25781018"
       stop-color="#090"
       id="stop4" />
    <stop
       offset=".65000004"
       stop-color="#0c0"
       id="stop6" />
    <stop
       offset="1"
       stop-color="#090"
       id="stop8" />
  </linearGradient>
  <linearGradient
     id="b"
     gradientUnits="userSpaceOnUse"
     x1=".79375"
     x2="1.190621"
     y1="2.248979"
     y2="2.248979"
     gradientTransform="translate(0.26458344)">
    <stop
       offset="0"
       stop-color="#deaa87"
       id="stop11" />
    <stop
       offset="1"
       stop-color="#a05a2c"
       id="stop13" />
  </linearGradient>
  <path
     d="M 1.4827331,0.46597669 C 1.6790877,0.30576806 1.8987388,0.2504774 2.1739293,0.32359791 c 0.1970528,0.0523587 0.5831591,0.277807 0.832906,0.30669914 0.2724438,0.031518 0.4822898,0.0216298 0.6689012,-0.086307 L 3.6766347,2.2434336 C 3.5344617,2.384883 3.2801798,2.3612586 3.0077362,2.3297407 2.7579894,2.3008486 2.3718828,2.0754 2.1748303,2.0230414 1.8996396,1.9499206 1.6799885,2.0052117 1.4836337,2.1654202 Z"
     fill="url(#a)"
     fill-rule="evenodd"
     stroke="#808080"
     stroke-width="0.055041"
     id="path16"
     style="fill:url(#a)" />
  <path
     d="M 1.2567688,0.4630607 V 4.0348979"
     fill="#a0892c"
     stroke="url(#b)"
     stroke-linecap="round"
     stroke-width="0.396871"
     id="path18"
     style="stroke:url(#b)" />
</svg>
