<svg width="16" height="16" version="1.1" xmlns="http://www.w3.org/2000/svg">
 <rect x=".25" y="4.25" width="15.5" height="8.5" rx="1.3115385" fill="#ebfcff" stroke="#00aad4" stroke-linejoin="round" stroke-width=".5"/>
 <path d="M 5.375273,10.649967 V 6.35 L 4.256,7.0688768" fill="none" stroke="#0088aa" stroke-linecap="round" stroke-linejoin="round" stroke-width=".7"/>
 <path d="m7.5536045 7.1024245c0.118621-0.4337242 0.514631-0.7524244 0.984885-0.7524244 0.563965 0 1.021148 0.4583752 1.021148 1.0238095 0 0.2164463-0.06698 0.4172048-0.181511 0.5827608l-1.860784 2.6934296h2.042295" fill="none" stroke="#0088aa" stroke-linecap="round" stroke-linejoin="round" stroke-width=".7"/>
 <path d="m11.334 7.1201721c0.112559-0.4427501 0.512928-0.7701721 0.989573-0.7701721 0.563965 0 1.021147 0.4583752 1.021147 1.0238095v0.1023811c0 0.5654342-0.457182 1.0238095-1.021147 1.0238095 0.563965 0 1.021147 0.4583752 1.021147 1.0238094v0.1023808c0 0.5654347-0.457182 1.0238097-1.021147 1.0238097-0.476645 0-0.877014-0.327422-0.989573-0.7701718" fill="none" stroke="#0088aa" stroke-linecap="round" stroke-linejoin="round" stroke-width=".7"/>
</svg>
