<?xml version="1.0" encoding="UTF-8" standalone="no"?>
<svg
   width="48"
   height="48"
   version="1.1"
   viewBox="0 0 48 48"
   id="svg13"
   sodipodi:docname="textjsjsondataformatter_200.svg"
   inkscape:export-filename="textjsjsondataformatter_200.png"
   inkscape:export-xdpi="96"
   inkscape:export-ydpi="96"
   inkscape:version="1.3.2 (091e20e, 2023-11-25, custom)"
   xmlns:inkscape="http://www.inkscape.org/namespaces/inkscape"
   xmlns:sodipodi="http://sodipodi.sourceforge.net/DTD/sodipodi-0.dtd"
   xmlns:xlink="http://www.w3.org/1999/xlink"
   xmlns="http://www.w3.org/2000/svg"
   xmlns:svg="http://www.w3.org/2000/svg">
  <defs
     id="defs13" />
  <sodipodi:namedview
     id="namedview13"
     pagecolor="#ffffff"
     bordercolor="#000000"
     borderopacity="0.25"
     inkscape:showpageshadow="2"
     inkscape:pageopacity="0.0"
     inkscape:pagecheckerboard="0"
     inkscape:deskcolor="#d1d1d1"
     showgrid="true"
     inkscape:current-layer="svg13">
    <inkscape:grid
       id="grid13"
       units="px"
       originx="0"
       originy="0"
       spacingx="0.5"
       spacingy="0.5"
       empcolor="#0099e5"
       empopacity="0.30196078"
       color="#0099e5"
       opacity="0.14901961"
       empspacing="2"
       dotted="false"
       gridanglex="30"
       gridanglez="30"
       visible="true" />
  </sodipodi:namedview>
  <linearGradient
     id="a"
     x1="-19.723961"
     x2="-10.72396"
     y1="1026.8741"
     y2="1026.8741"
     gradientUnits="userSpaceOnUse"
     xlink:href="#b" />
  <linearGradient
     id="b">
    <stop
       stop-color="#4276c4"
       offset="0"
       id="stop1" />
    <stop
       stop-color="#80b3ff"
       offset=".34375"
       id="stop2" />
    <stop
       stop-color="#04a"
       offset="1"
       id="stop3" />
  </linearGradient>
  <linearGradient
     id="c"
     x1="-19.723961"
     x2="-10.72396"
     y1="1023.8741"
     y2="1023.8741"
     gradientUnits="userSpaceOnUse"
     xlink:href="#b" />
  <linearGradient
     id="d"
     x1="-19.723961"
     x2="-10.72396"
     y1="1020.8742"
     y2="1020.8742"
     gradientUnits="userSpaceOnUse"
     xlink:href="#b" />
  <path
     d="m39.5 7.5v16"
     fill="none"
     stroke="#0097bd"
     stroke-linecap="round"
     stroke-width="3"
     id="path3" />
  <path
     d="m43.5 19.5-4 4-4-4"
     fill="none"
     stroke="#0097bd"
     stroke-linecap="round"
     stroke-linejoin="round"
     stroke-width="3"
     id="path4" />
  <g
     transform="matrix(2.5 0 0 2.5 53.309897 -2550.1852)"
     fill-rule="evenodd"
     stroke-linecap="round"
     stroke-linejoin="round"
     id="g10">
    <g
       fill="#bdd1ec"
       id="g9">
      <ellipse
         cx="-14.72396"
         cy="1032.3741"
         rx="5"
         ry="1.5"
         stroke="url(#a)"
         stroke-width="2"
         id="ellipse4" />
      <ellipse
         cx="-14.72396"
         cy="1030.4156"
         rx="5.494309"
         ry="1.958482"
         stroke="#fff"
         id="ellipse5" />
      <ellipse
         cx="-14.72396"
         cy="1029.3741"
         rx="5"
         ry="1.5"
         stroke="url(#c)"
         stroke-width="2"
         id="ellipse6" />
      <ellipse
         cx="-14.72396"
         cy="1027.4156"
         rx="5.494309"
         ry="1.958482"
         stroke="#fff"
         id="ellipse7" />
      <ellipse
         cx="-14.72396"
         cy="1026.3741"
         rx="5"
         ry="1.5"
         stroke="url(#d)"
         stroke-width="2"
         id="ellipse8" />
      <ellipse
         cx="-14.72396"
         cy="1024.4156"
         rx="5.494309"
         ry="1.958482"
         stroke="#fff"
         id="ellipse9" />
    </g>
    <ellipse
       cx="-14.72396"
       cy="1023.3741"
       rx="5.5"
       ry="2"
       fill="#80b3ff"
       stroke="url(#a)"
       id="ellipse10" />
  </g>
  <text
     x="-38.500004"
     y="64.999954"
     stroke-width="2"
     id="text10"><tspan
       x="-38.500004"
       y="94.156204"
       stroke-width="2"
       id="tspan10" /></text>
  <path
     d="m11 29.000002h34v16h-34z"
     fill="#fff"
     stroke="#b3b3b3"
     stroke-dashoffset="1.49998"
     stroke-linecap="square"
     stroke-linejoin="round"
     stroke-width="2"
     id="path10" />
  <g
     fill="#f00"
     id="g13">
    <path
       d="m23.467776 42h-2.670848l-1.722454-3.256622q-.09763-.18132-.202232-.669456h-.02789q-.04881.230126-.230125.69735l-1.729431 3.228728h-2.684796l3.186888-4.999996-2.914922-4.999998h2.740584l1.429567 2.998604q.167364.355648.29986.843792h.02789q.08368-.292886.313808-.871686l1.589957-2.97071h2.510458l-2.998602 4.958156z"
       stroke-width="1.33891"
       id="path11" />
    <path
       d="m33.953994 42h-1.95109v-5.98326q0-.969316.07338-2.140864h-.04892q-.1529.920502-.275234 1.324966l-2.055074 6.799158h-1.614704l-2.09177-6.729424q-.08558-.271966-.275232-1.3947h-.05506q.07948 1.478382.07948 2.594142v5.529982h-1.77977v-9.999994h2.893004l1.792064 5.927472q.21407.711296.311932 1.429566h.03666q.16516-.829846.348632-1.443512l1.792104-5.913526h2.819604z"
       stroke-width="1.25393"
       id="path12" />
    <path
       d="m41.883366 41.999994h-5.955366v-9.999994h2.25244v8.172938h3.702926z"
       stroke-width="1.33891"
       id="path13" />
  </g>
</svg>
