<svg width="32" height="32" version="1.1" xmlns="http://www.w3.org/2000/svg">
 <defs>
  <radialGradient id="c" cx="21.957434" cy="5.9936466" r="3.105469" gradientTransform="matrix(1.0986919 .00038837098 3.0792878e-8 .90004578 -12.623742 8.785424)" gradientUnits="userSpaceOnUse">
   <stop stop-color="#803300" offset="0"/>
   <stop stop-color="#d45500" offset="1"/>
  </radialGradient>
  <linearGradient id="a" x1="25.714283" x2="25.714283" y1="15.5" y2="6.2142854" gradientTransform="matrix(1.0982843,3.3319454e-4,3.0504966e-4,1.2000001,-12.664998,7.392668)" gradientUnits="userSpaceOnUse">
   <stop stop-color="#668000" offset="0"/>
   <stop stop-color="#aad400" offset="1"/>
  </linearGradient>
  <linearGradient id="b" x1="23" x2="23" y1="6.5" y2="15" gradientTransform="matrix(1.1311029,3.2992792e-4,3.1416508e-4,1.1882353,-13.38782,7.76921)" gradientUnits="userSpaceOnUse">
   <stop stop-color="#89a02c" offset="0"/>
   <stop stop-color="#445016" offset="1"/>
  </linearGradient>
 </defs>
 <rect x=".5" y="6.5" width="28" height="23" fill="#f9f9f9" stroke="#2a7efe" style="paint-order:normal"/>
 <path d="m2.2 2h24.6c1.2 0 2.2 1 2.2 2.2v2.8h-29l1e-6 -2.8c0-1.2 1-2.2 2.199999-2.2z" fill="#2a7efe" stroke-width="2"/>
 <path d="m29 12v10l-2 2v-14z" fill="#f9f9f9"/>
 <path d="m20 17 10.999983-1e-6" fill="none" stroke="#ff0000" stroke-linecap="round" stroke-linejoin="round" stroke-opacity=".996078" stroke-width="2.00003"/>
 <path d="M 27,13.000001 30.999983,16.999999 27,21" fill="none" stroke="#ff0000" stroke-linecap="round" stroke-linejoin="round" stroke-opacity=".996078" stroke-width="2.00003"/>
 <path d="M 12.817718,11.93945 14.135432,8.7" fill="none" stroke="#d4aa00" stroke-linecap="round" stroke-linejoin="round" stroke-width="1.4"/>
 <path d="M 10.182286,11.93945 8.86457,8.7" fill="none" stroke="#d4aa00" stroke-linecap="round" stroke-linejoin="round" stroke-width="1.4"/>
 <path d="m11.49802 10.4a7.8000022 5.5007964 89.953824 0 0-3.405966 1.695842l3.407342 3.72291 3.41403-3.730216a7.8000022 5.5007964 89.953824 0 0-3.415406-1.688536z" fill="url(#c)" stroke-linejoin="round" stroke-width="3.9268"/>
 <path d="m5.2 12.7v1.45181l1.756954 1.851114" fill="none" stroke="#aca793" stroke-linecap="round" stroke-linejoin="round" stroke-width="1.4"/>
 <path d="M 5.222954,25.299998 5.2,23.4247 6.956954,21.573584" fill="none" stroke="#aca793" stroke-linecap="round" stroke-linejoin="round" stroke-width="1.4"/>
 <path d="m3.2 20.223932 1.317716-1.388334 3.351002-0.643766" fill="none" stroke="#aca793" stroke-linecap="round" stroke-linejoin="round" stroke-width="1.4"/>
 <path d="m17.800954 12.700002 4e-6 1.451808-1.756958 1.851116" fill="none" stroke="#aca793" stroke-linecap="round" stroke-linejoin="round" stroke-width="1.4"/>
 <path d="m17.777998 25.3 0.02296-1.875298-1.756954-1.851114" fill="none" stroke="#aca793" stroke-linecap="round" stroke-linejoin="round" stroke-width="1.4"/>
 <path d="m19.8 20.223932-1.317714-1.388334-3.352464-0.641616" fill="none" stroke="#aca793" stroke-linecap="round" stroke-linejoin="round" stroke-width="1.4"/>
 <path d="M 14.896262,12.069782 11.499386,15.78125 8.111356,12.079442 A 7.8000022,5.5007964 89.953824 0 0 6,18.198332 7.8000022,5.5007964 89.953824 0 0 11.501984,26 7.8000022,5.5007964 89.953824 0 0 17,18.201668 7.8000022,5.5007964 89.953824 0 0 14.896262,12.069782 Z" fill="url(#a)" stroke-linejoin="round" stroke-width="3.9268"/>
 <path d="m11.5 15.3v10" fill="none" stroke="url(#b)" stroke-linecap="round" stroke-linejoin="round" stroke-width="1.4"/>
</svg>
