<svg width="32" height="32" version="1.1" xmlns="http://www.w3.org/2000/svg">
 <circle transform="matrix(0,1,1,0,0,0)" cx="23" cy="23" r="8.1999998" fill="#fffffe" stroke="#00aad4" stroke-dashoffset="1.49998" stroke-linecap="round" stroke-linejoin="round" stroke-width="1.6"/>
 <path d="m23 18.5v9" fill="none" stroke="#00aad4" stroke-linecap="round" stroke-width="1.6"/>
 <path d="m27.5 23h-9" fill="none" stroke="#00aad4" stroke-linecap="round" stroke-width="1.6"/>
</svg>
