<?xml version="1.0" encoding="UTF-8" standalone="no"?>
<svg
   width="64"
   height="64"
   version="1.1"
   viewBox="0 0 64 64"
   id="svg36"
   sodipodi:docname="Grid_19_64.svg"
   inkscape:export-filename="Grid_19_64.png"
   inkscape:export-xdpi="96"
   inkscape:export-ydpi="96"
   inkscape:version="1.3.2 (091e20e, 2023-11-25, custom)"
   xmlns:inkscape="http://www.inkscape.org/namespaces/inkscape"
   xmlns:sodipodi="http://sodipodi.sourceforge.net/DTD/sodipodi-0.dtd"
   xmlns="http://www.w3.org/2000/svg"
   xmlns:svg="http://www.w3.org/2000/svg">
  <sodipodi:namedview
     id="namedview36"
     pagecolor="#ffffff"
     bordercolor="#000000"
     borderopacity="0.25"
     inkscape:showpageshadow="2"
     inkscape:pageopacity="0.0"
     inkscape:pagecheckerboard="0"
     inkscape:deskcolor="#d1d1d1"
     showgrid="true"
     inkscape:current-layer="svg36">
    <inkscape:grid
       id="grid36"
       units="px"
       originx="0"
       originy="0"
       spacingx="0.5"
       spacingy="0.5"
       empcolor="#0099e5"
       empopacity="0.30196078"
       color="#0099e5"
       opacity="0.14901961"
       empspacing="2"
       dotted="false"
       gridanglex="30"
       gridanglez="30"
       visible="true" />
  </sodipodi:namedview>
  <defs
     id="defs24">
    <linearGradient
       id="e"
       x1="1.5"
       x2="3.5"
       y1="15.5"
       y2="13.5"
       gradientTransform="matrix(4,0,0,4,32,-32)"
       gradientUnits="userSpaceOnUse">
      <stop
         stop-color="#d42aff"
         offset="0"
         id="stop1" />
      <stop
         stop-color="#00aad4"
         offset="1"
         id="stop2" />
    </linearGradient>
    <linearGradient
       id="j"
       x1="5.5"
       x2="7.5"
       y1="11.5"
       y2="9.5"
       gradientTransform="matrix(4,0,0,4,3.4e-5,0)"
       gradientUnits="userSpaceOnUse">
      <stop
         stop-color="#ffcc00"
         offset="0"
         id="stop3" />
      <stop
         stop-color="#aaaaff"
         offset="1"
         id="stop4" />
    </linearGradient>
    <linearGradient
       id="c"
       x1="5.5"
       x2="7.5"
       y1="3.5"
       y2="1.5"
       gradientTransform="matrix(4,0,0,4,3.4e-5,0)"
       gradientUnits="userSpaceOnUse">
      <stop
         stop-color="#aaccff"
         offset="0"
         id="stop5" />
      <stop
         stop-color="#ffc9c9"
         offset="1"
         id="stop6" />
    </linearGradient>
    <linearGradient
       id="f"
       x1="9.5"
       x2="11.5"
       y1="15.5"
       y2="13.5"
       gradientTransform="matrix(4,0,0,4,3.4e-5,0)"
       gradientUnits="userSpaceOnUse">
      <stop
         stop-color="#ff6868"
         offset="0"
         id="stop7" />
      <stop
         stop-color="#00ff00"
         offset="1"
         id="stop8" />
    </linearGradient>
    <linearGradient
       id="l"
       x1="5.5"
       x2="7.5"
       y1="5.5"
       y2="7.5"
       gradientTransform="matrix(4,0,0,4,3.4e-5,0)"
       gradientUnits="userSpaceOnUse">
      <stop
         stop-color="#d45500"
         offset="0"
         id="stop9" />
      <stop
         stop-color="#aaffaa"
         offset="1"
         id="stop10" />
    </linearGradient>
    <linearGradient
       id="k"
       x1="1.5"
       x2="3.5"
       y1="11.5"
       y2="9.5"
       gradientTransform="matrix(4,0,0,4,3.4e-5,0)"
       gradientUnits="userSpaceOnUse">
      <stop
         stop-color="#6868ff"
         offset="0"
         id="stop11" />
      <stop
         stop-color="#aaccff"
         offset="1"
         id="stop12" />
    </linearGradient>
    <linearGradient
       id="h"
       x1="5.5"
       x2="7.5"
       y1="15.5"
       y2="13.5"
       gradientTransform="matrix(4,0,0,4,3.4e-5,0)"
       gradientUnits="userSpaceOnUse">
      <stop
         stop-color="#00d400"
         offset="0"
         id="stop13" />
      <stop
         stop-color="#ffc9c9"
         offset="1"
         id="stop14" />
    </linearGradient>
    <linearGradient
       id="b"
       x1="11.5"
       x2="9.5"
       y1="3.5"
       y2="1.5"
       gradientTransform="matrix(4,0,0,4,3.4e-5,0)"
       gradientUnits="userSpaceOnUse">
      <stop
         stop-color="#ff0000"
         offset="0"
         id="stop15" />
      <stop
         stop-color="#ffff51"
         offset="1"
         id="stop16" />
    </linearGradient>
    <linearGradient
       id="a"
       x1="2.5"
       x2="3"
       y1="7"
       y2="5.5"
       gradientTransform="matrix(4,0,0,4,3.4e-5,0)"
       gradientUnits="userSpaceOnUse">
      <stop
         stop-color="#efef00"
         offset="0"
         id="stop17" />
      <stop
         stop-color="#00ff00"
         offset="1"
         id="stop18" />
    </linearGradient>
    <linearGradient
       id="g"
       x1="3"
       x2="1.5"
       y1="3.5"
       y2="1.5"
       gradientTransform="matrix(4,0,0,4,3.4e-5,0)"
       gradientUnits="userSpaceOnUse">
      <stop
         stop-color="#0000ff"
         offset="0"
         id="stop19" />
      <stop
         stop-color="#ff7171"
         offset="1"
         id="stop20" />
    </linearGradient>
    <linearGradient
       id="i"
       x1="1.5"
       x2="3.5"
       y1="15.5"
       y2="13.5"
       gradientTransform="matrix(4,0,0,4,3.4e-5,0)"
       gradientUnits="userSpaceOnUse">
      <stop
         stop-color="#008000"
         offset="0"
         id="stop21" />
      <stop
         stop-color="#6868ff"
         offset="1"
         id="stop22" />
    </linearGradient>
    <linearGradient
       id="d"
       x1="14.156251"
       x2="8.843751"
       y1="14.15625"
       y2="8.84375"
       gradientTransform="scale(4)"
       gradientUnits="userSpaceOnUse">
      <stop
         stop-color="#d40000"
         offset="0"
         id="stop23" />
      <stop
         stop-color="#ff3333"
         offset="1"
         id="stop24" />
    </linearGradient>
  </defs>
  <path
     d="m4.000036 63.999996v-12h12.000068v12z"
     fill="url(#i)"
     fill-rule="evenodd"
     id="path24" />
  <path
     d="M 4.000036,15.999996 V 4 h 12.000068 v 11.999996 z"
     fill="url(#g)"
     fill-rule="evenodd"
     id="path25" />
  <path
     d="m4.000036 31.999996v-12h12.000068v12z"
     fill="url(#a)"
     fill-rule="evenodd"
     id="path26" />
  <path
     d="m36.000032 4v12h12v-12z"
     fill="url(#b)"
     fill-rule="evenodd"
     id="path27" />
  <path
     d="M 32,59.15625 A 19.25,19.25 0 0 1 27.712891,52 H 20 v 12 h 12 z"
     fill="url(#h)"
     fill-rule="evenodd"
     id="path28" />
  <path
     d="m4 48v-12h12.000068v12z"
     fill="url(#k)"
     fill-rule="evenodd"
     id="path29" />
  <path
     d="m20 20v12h12v-12z"
     fill="url(#l)"
     fill-rule="evenodd"
     id="path30" />
  <path
     d="M 39.306641,64 A 19.25,19.25 0 0 1 36,62.380859 V 64 Z"
     fill="url(#f)"
     fill-rule="evenodd"
     id="path31" />
  <path
     d="M 20,16 V 4.000002 H 32.000064 V 16 Z"
     fill="url(#c)"
     fill-rule="evenodd"
     id="path32" />
  <path
     d="m26.90625 48a19.25 19.25 0 0 1-0.15625-2 19.25 19.25 0 0 1 2.869141-10h-9.619141v12z"
     fill="url(#j)"
     fill-rule="evenodd"
     id="path33" />
  <path
     d="m36 20v9.619141a19.25 19.25 0 0 1 10-2.869141 19.25 19.25 0 0 1 2 0.107422v-6.857422z"
     fill="url(#e)"
     fill-rule="evenodd"
     id="path34" />
  <g
     stroke-linecap="round"
     id="g36">
    <circle
       transform="matrix(0,1,1,0,0,0)"
       cx="46"
       cy="46"
       r="17"
       fill="url(#d)"
       stroke="#ff6666"
       stroke-dashoffset="1.49998"
       stroke-linejoin="round"
       stroke-width="2"
       id="circle34" />
    <path
       d="m53 39-14 14"
       fill="none"
       stroke="#ffffff"
       stroke-width="4"
       id="path35" />
    <path
       d="m53 53-14-14"
       fill="none"
       stroke="#ffffff"
       stroke-width="4"
       id="path36" />
  </g>
</svg>
