<?xml version="1.0" encoding="UTF-8" standalone="no"?>
<svg
   width="36"
   height="36"
   version="1.1"
   viewBox="0 0 36 36"
   id="svg8"
   sodipodi:docname="timagelist_150.svg"
   inkscape:export-filename="timagelist_150.png"
   inkscape:export-xdpi="96"
   inkscape:export-ydpi="96"
   inkscape:version="1.3.2 (091e20e, 2023-11-25, custom)"
   xmlns:inkscape="http://www.inkscape.org/namespaces/inkscape"
   xmlns:sodipodi="http://sodipodi.sourceforge.net/DTD/sodipodi-0.dtd"
   xmlns="http://www.w3.org/2000/svg"
   xmlns:svg="http://www.w3.org/2000/svg">
  <sodipodi:namedview
     id="namedview8"
     pagecolor="#ffffff"
     bordercolor="#000000"
     borderopacity="0.25"
     inkscape:showpageshadow="2"
     inkscape:pageopacity="0.0"
     inkscape:pagecheckerboard="0"
     inkscape:deskcolor="#d1d1d1"
     showgrid="true"
     inkscape:current-layer="svg8">
    <inkscape:grid
       id="grid8"
       units="px"
       originx="0"
       originy="0"
       spacingx="0.5"
       spacingy="0.5"
       empcolor="#0099e5"
       empopacity="0.30196078"
       color="#0099e5"
       opacity="0.14901961"
       empspacing="2"
       dotted="false"
       gridanglex="30"
       gridanglez="30"
       visible="true" />
  </sodipodi:namedview>
  <defs
     id="defs5">
    <linearGradient
       id="b"
       x1="7.9999995"
       x2="7.9999995"
       y1="1.4999998"
       y2="11.238683"
       gradientTransform="matrix(1.7333333,0,0,1.3846128,6.133333,7.9233)"
       gradientUnits="userSpaceOnUse">
      <stop
         stop-color="#80b4fe"
         offset="0"
         id="stop1" />
      <stop
         stop-color="#e7f6fe"
         offset="1"
         id="stop2" />
    </linearGradient>
    <radialGradient
       id="a"
       cx="16"
       cy="10"
       r="2.5999999"
       gradientTransform="matrix(1.4857143,0,0,1.4399971,2.264285,1.4501)"
       gradientUnits="userSpaceOnUse">
      <stop
         stop-color="#ffffff"
         offset="0"
         id="stop3" />
      <stop
         stop-color="#ffe680"
         offset=".57692301"
         id="stop4" />
      <stop
         stop-color="#ffcc00"
         offset="1"
         id="stop5" />
    </radialGradient>
  </defs>
  <rect
     x="1.4999995"
     y="4.4999828"
     width="29.000002"
     height="21.000006"
     fill="#f9f9f9"
     stroke="#2a7efe"
     stroke-width="0.999995"
     style="paint-order:normal"
     id="rect5" />
  <rect
     x="3.4999971"
     y="6.4999828"
     width="29.000002"
     height="21.000006"
     fill="#f9f9f9"
     stroke="#2a7efe"
     stroke-width="0.999995"
     style="paint-order:normal"
     id="rect6" />
  <rect
     x="5.499999"
     y="8.4999828"
     width="29.000002"
     height="21.000006"
     fill="#f9f9f9"
     stroke="#2a7efe"
     stroke-width="0.999995"
     style="paint-order:normal"
     id="rect7" />
  <rect
     x="6.999999"
     y="9.9999828"
     width="26"
     height="17.999966"
     fill="url(#b)"
     stroke-width="0.999998"
     id="rect8"
     style="fill:url(#b)" />
  <path
     d="m 6.999999,28.0001 6.087744,-7.4999 c 1.774364,-2.186 4.752087,-1.8924 6.554503,0 l 5.00061,5.25 3.271741,-2.2501 c 0.997082,-0.6856 1.662472,-0.5993 2.639601,0 l 2.445801,1.5001 v 2.9999 z"
     fill="#01a901"
     stroke-width="0.999998"
     id="path8" />
  <ellipse
     cx="26.035713"
     cy="15.85008"
     rx="3.7142859"
     ry="3.599993"
     fill="url(#a)"
     stroke-width="0.999998"
     id="ellipse8"
     style="fill:url(#a)" />
</svg>
