<?xml version="1.0" encoding="UTF-8" standalone="no"?>
<svg
   width="16"
   height="16"
   version="1.1"
   id="svg29"
   sodipodi:docname="menu_search_procedure_list.svg"
   inkscape:export-filename="menu_search_procedure_list.png"
   inkscape:export-xdpi="96"
   inkscape:export-ydpi="96"
   inkscape:version="1.2.2 (732a01da63, 2022-12-09)"
   xml:space="preserve"
   xmlns:inkscape="http://www.inkscape.org/namespaces/inkscape"
   xmlns:sodipodi="http://sodipodi.sourceforge.net/DTD/sodipodi-0.dtd"
   xmlns="http://www.w3.org/2000/svg"
   xmlns:svg="http://www.w3.org/2000/svg"><sodipodi:namedview
     id="namedview31"
     pagecolor="#ffffff"
     bordercolor="#666666"
     borderopacity="1.0"
     inkscape:showpageshadow="2"
     inkscape:pageopacity="0.0"
     inkscape:pagecheckerboard="0"
     inkscape:deskcolor="#d1d1d1"
     showgrid="true"
     inkscape:zoom="57.375"
     inkscape:cx="7.372549"
     inkscape:cy="8"
     inkscape:current-layer="svg29"><inkscape:grid
       type="xygrid"
       id="grid597" /></sodipodi:namedview><defs
     id="defs9" /><path
     d="m 13.5,0.5 v 14 h -11 v -14 z"
     style="fill:#ffffff;stroke:#d4aa00;stroke-width:1;stroke-linecap:round;stroke-linejoin:round;stroke-miterlimit:5.6;stroke-dasharray:none"
     id="path1270"
     sodipodi:nodetypes="ccccc" /><g
     id="g304"
     transform="translate(14)"
     style="stroke-width:0.75;stroke-dasharray:none"><path
       style="fill:none;stroke:#2a7fff;stroke-width:0.75;stroke-linecap:round;stroke-linejoin:round;stroke-opacity:1;stroke-dasharray:none"
       d="M -6,3.5 -9.5,5 -6,6.5 -2.5,5 Z"
       id="path294"
       sodipodi:nodetypes="ccccc" /><path
       style="fill:none;stroke:#2a7fff;stroke-width:0.75;stroke-linecap:round;stroke-linejoin:round;stroke-opacity:1;stroke-dasharray:none"
       d="M -9.5,8.8 -6,10.5 -2.5,8.8"
       id="path296"
       sodipodi:nodetypes="ccc" /><path
       style="fill:none;stroke:#2a7fff;stroke-width:0.75;stroke-linecap:round;stroke-linejoin:round;stroke-opacity:1;stroke-dasharray:none"
       d="M -9.5,5 V 8.8"
       id="path298"
       sodipodi:nodetypes="cc" /><path
       style="fill:none;stroke:#2a7fff;stroke-width:0.75;stroke-linecap:round;stroke-linejoin:round;stroke-opacity:1;stroke-dasharray:none"
       d="M -2.5,5 V 8.8"
       id="path300"
       sodipodi:nodetypes="cc" /><path
       style="fill:none;stroke:#2a7fff;stroke-width:0.75;stroke-linecap:round;stroke-linejoin:round;stroke-opacity:1;stroke-dasharray:none"
       d="m -6,6.5 v 4"
       id="path302"
       sodipodi:nodetypes="cc" /></g></svg>
