<?xml version="1.0" encoding="UTF-8" standalone="no"?>
<svg
   width="24"
   height="24"
   version="1.1"
   viewBox="0 0 24 24"
   id="svg3"
   sodipodi:docname="tpagecontrol.svg"
   inkscape:export-filename="tpagecontrol.png"
   inkscape:export-xdpi="96"
   inkscape:export-ydpi="96"
   inkscape:version="1.3.2 (091e20e, 2023-11-25, custom)"
   xmlns:inkscape="http://www.inkscape.org/namespaces/inkscape"
   xmlns:sodipodi="http://sodipodi.sourceforge.net/DTD/sodipodi-0.dtd"
   xmlns="http://www.w3.org/2000/svg"
   xmlns:svg="http://www.w3.org/2000/svg">
  <defs
     id="defs3" />
  <sodipodi:namedview
     id="namedview3"
     pagecolor="#ffffff"
     bordercolor="#000000"
     borderopacity="0.25"
     inkscape:showpageshadow="2"
     inkscape:pageopacity="0.0"
     inkscape:pagecheckerboard="0"
     inkscape:deskcolor="#d1d1d1"
     showgrid="true"
     inkscape:current-layer="svg3">
    <inkscape:grid
       id="grid3"
       units="px"
       originx="0"
       originy="0"
       spacingx="0.5"
       spacingy="0.5"
       empcolor="#0099e5"
       empopacity="0.30196078"
       color="#0099e5"
       opacity="0.14901961"
       empspacing="2"
       dotted="false"
       gridanglex="30"
       gridanglez="30"
       visible="true" />
  </sodipodi:namedview>
  <path
     d="M 2,4.25 H 7 A 0.75,0.75 0 0 1 7.75,5 v 2.25 h 15 v 13.5 H 1.25 L 1.2500001,5 A 0.7499999,0.7499999 0 0 1 2,4.25 Z"
     fill="#ffffff"
     style="stroke:#2a7efe;stroke-width:0.5;stroke-linecap:round;stroke-linejoin:round;paint-order:normal"
     id="path1" />
  <path
     d="m 7.75,5.25 h 5 v 2 h -5 z"
     fill="#e6e6e6"
     id="path2"
     style="stroke:#2a7efe;stroke-width:0.5;stroke-linecap:round;stroke-linejoin:round" />
  <path
     d="M 12.75,5.25 H 17 A 0.75,0.75 0 0 1 17.75,6 v 1.25 h -5 z"
     fill="#e6e6e6"
     id="path3"
     style="stroke:#2a7efe;stroke-width:0.5;stroke-linecap:round;stroke-linejoin:round" />
</svg>
