<?xml version="1.0" encoding="UTF-8" standalone="no"?>
<svg
   height="48"
   width="48"
   version="1.1"
   id="svg18"
   sodipodi:docname="File_14_48.svg"
   inkscape:export-filename="File_14_48.png"
   inkscape:export-xdpi="96"
   inkscape:export-ydpi="96"
   inkscape:version="1.2 (dc2aedaf03, 2022-05-15)"
   xmlns:inkscape="http://www.inkscape.org/namespaces/inkscape"
   xmlns:sodipodi="http://sodipodi.sourceforge.net/DTD/sodipodi-0.dtd"
   xmlns:xlink="http://www.w3.org/1999/xlink"
   xmlns="http://www.w3.org/2000/svg"
   xmlns:svg="http://www.w3.org/2000/svg">
  <defs
     id="defs22">
    <radialGradient
       id="a-4"
       cx="9.1740294"
       cy="7.8253603"
       gradientTransform="matrix(0.66909781,-2.2758851e-8,4.5190518e-8,0.58542853,1.8616763,4.291566)"
       gradientUnits="userSpaceOnUse"
       r="7.5"
       fx="9.1740294"
       fy="7.8253603">
      <stop
         offset="0"
         stop-color="#fff"
         id="stop2-0"
         style="stop-color:#ccddff;stop-opacity:1;" />
      <stop
         offset="1"
         stop-color="#8fc1c7"
         id="stop4-1"
         style="stop-color:#ffffff;stop-opacity:1" />
    </radialGradient>
    <linearGradient
       inkscape:collect="always"
       xlink:href="#a-4"
       id="linearGradient4775"
       x1="39"
       y1="45"
       x2="9"
       y2="3"
       gradientUnits="userSpaceOnUse" />
    <radialGradient
       id="a"
       cx="-11.5"
       cy="8.5"
       gradientTransform="matrix(0,0.99200002,-0.99200002,0,16.937999,19.913999)"
       gradientUnits="userSpaceOnUse"
       r="3.5">
      <stop
         offset="0"
         stop-color="#fff"
         id="stop2" />
      <stop
         offset="1"
         stop-color="#d5e5ff"
         id="stop4" />
    </radialGradient>
  </defs>
  <sodipodi:namedview
     id="namedview20"
     pagecolor="#ffffff"
     bordercolor="#666666"
     borderopacity="1.0"
     inkscape:pageshadow="2"
     inkscape:pageopacity="0.0"
     inkscape:pagecheckerboard="0"
     inkscape:deskcolor="#d1d1d1"
     showgrid="true"
     inkscape:zoom="19.125"
     inkscape:cx="22.457516"
     inkscape:cy="24"
     inkscape:current-layer="svg18"
     inkscape:showpageshadow="2">
    <inkscape:grid
       type="xygrid"
       id="grid147"
       originx="0"
       originy="0" />
  </sodipodi:namedview>
  <path
     d="M 7.5,46.5 V 1.5 H 30 L 40.5,12 v 34.5 z"
     id="path1449"
     style="fill:url(#linearGradient4775);stroke:#b3b3b3;stroke-width:3;stroke-linecap:round;stroke-linejoin:round;stroke-opacity:1;fill-opacity:1"
     sodipodi:nodetypes="cccccc" />
  <path
     d="M 29.5,2 V 12.499998 H 40"
     id="path1453"
     style="fill:none;stroke:#b3b3b3;stroke-width:3;stroke-linecap:round;stroke-linejoin:round;stroke-opacity:1"
     sodipodi:nodetypes="ccc" />
  <g
     id="g928"
     transform="scale(3)">
    <g
       id="g916">
      <circle
         cx="9.25"
         cy="9.25"
         r="3.875"
         stroke="#ffffff"
         stroke-linejoin="round"
         stroke-width="0.75"
         id="circle7"
         style="fill:none;stroke:#ffffff;stroke-linecap:round" />
      <path
         d="M 11.130769,11.130769 14.5,14.5"
         stroke="#ffffff"
         stroke-width="3"
         id="path9"
         style="fill:none;stroke:#ffffff;stroke-linecap:round" />
    </g>
    <g
       id="g920">
      <path
         d="M 11.130769,11.130769 14.5,14.5"
         stroke="#a05a2c"
         stroke-width="1.4"
         id="path11"
         style="fill:none;stroke-linecap:round" />
      <circle
         cx="9.25"
         cy="9.25"
         fill="url(#a)"
         fill-rule="evenodd"
         r="3.1000001"
         stroke="#dd8703"
         stroke-linejoin="round"
         id="circle15"
         style="fill:url(#a);stroke-width:0.8;stroke-linecap:round;stroke-dasharray:none" />
    </g>
  </g>
</svg>
