<?xml version="1.0" encoding="UTF-8" standalone="no"?>
<svg
   height="36"
   width="36"
   version="1.1"
   id="svg39"
   sodipodi:docname="Setup_04_36.svg"
   inkscape:export-filename="Setup_04_36.png"
   inkscape:export-xdpi="96"
   inkscape:export-ydpi="96"
   inkscape:version="1.2-beta (1b65182ce9, 2022-04-05)"
   xmlns:inkscape="http://www.inkscape.org/namespaces/inkscape"
   xmlns:sodipodi="http://sodipodi.sourceforge.net/DTD/sodipodi-0.dtd"
   xmlns="http://www.w3.org/2000/svg"
   xmlns:svg="http://www.w3.org/2000/svg">
  <defs
     id="defs43" />
  <sodipodi:namedview
     id="namedview41"
     pagecolor="#ffffff"
     bordercolor="#666666"
     borderopacity="1.0"
     inkscape:pageshadow="2"
     inkscape:pageopacity="0.0"
     inkscape:pagecheckerboard="0"
     inkscape:deskcolor="#d1d1d1"
     showgrid="true"
     inkscape:zoom="25.5"
     inkscape:cx="17.980392"
     inkscape:cy="18"
     inkscape:current-layer="svg39">
    <inkscape:grid
       type="xygrid"
       id="grid168" />
  </sodipodi:namedview>
  <linearGradient
     id="a"
     gradientUnits="userSpaceOnUse"
     x1="5.8857573"
     x2="7.9333947"
     y1="11.90781903314"
     y2="13.95545643314">
    <stop
       offset="0"
       stop-color="#0055d4"
       id="stop2" />
    <stop
       offset=".15760632"
       stop-color="#89b8ff"
       id="stop4" />
    <stop
       offset=".88542914"
       stop-color="#0055d4"
       id="stop6" />
    <stop
       offset="1"
       stop-color="#003d97"
       id="stop8" />
  </linearGradient>
  <radialGradient
     id="b"
     cx="14.868617"
     cy="1032.8518"
     gradientTransform="matrix(1.7376055,-0.06155808,-0.05032945,1.4217328,37.147073,-1460.024)"
     gradientUnits="userSpaceOnUse"
     r="3.487286">
    <stop
       offset="0"
       stop-color="#fff"
       id="stop11" />
    <stop
       offset="1"
       stop-color="#ccc"
       id="stop13" />
  </radialGradient>
  <linearGradient
     id="c"
     gradientUnits="userSpaceOnUse"
     x1="4.5"
     x2="19.5"
     y1="25.5"
     y2="43.5"
     gradientTransform="matrix(1.4722222,0,0,1.5,-0.4027778,-35.999999)">
    <stop
       offset="0"
       stop-color="#fff"
       id="stop16" />
    <stop
       offset="1"
       stop-color="#dfeaf4"
       id="stop18" />
  </linearGradient>
  <path
     d="m 4.75,0.750001 h 21.347222 l 5.152778,5.25 v 26.25 H 4.75 Z"
     fill="url(#c)"
     stroke="#75a5d3"
     stroke-linecap="square"
     stroke-opacity="0.984314"
     id="path21"
     style="fill:url(#c);fill-rule:evenodd;stroke-width:1.5" />
  <path
     d="m 9,9 v 2 H 20.25 V 9 Z"
     fill="#80c1fb"
     id="path23"
     style="fill-rule:evenodd;stroke-width:1.5"
     sodipodi:nodetypes="ccccc" />
  <path
     d="M 9,5 V 7 H 25 V 5 Z"
     fill="#80c1fb"
     id="path25"
     style="fill-rule:evenodd;stroke-width:1.5"
     sodipodi:nodetypes="ccccc" />
  <path
     d="m 9,13 v 2 h 11.25 v -2 z"
     fill="#a7d4fb"
     id="path27"
     style="fill-rule:evenodd;stroke-width:1.5"
     sodipodi:nodetypes="ccccc" />
  <path
     d="m 9,17 v 2 h 18 v -2 z"
     fill="#d7eafb"
     id="path29"
     style="fill-rule:evenodd;stroke-width:1.5"
     sodipodi:nodetypes="ccccc" />
  <g
     transform="matrix(2.25,0,0,2.25,-6.7570098,8.5e-6)"
     id="g35"
     style="fill-rule:evenodd">
    <path
       d="M 10.354964,7.8396144 A 1.5358815,1.5358815 0 0 0 9.3051516,8.315485 l -4.9351274,5.03514 a 1.5358815,1.5358815 0 1 0 2.1916121,2.149609 l 4.9351267,-5.03514 A 1.5358815,1.5358815 0 0 0 10.354964,7.8396144 Z"
       fill="url(#a)"
       id="path31"
       style="fill:url(#a)" />
    <path
       d="M 13.359657,4.7391559 C 12.586958,4.1274277 11.56825,3.8434522 10.396335,5.0153659 8.8811385,6.5305636 8.8811385,8.3219712 10.225585,9.6664174 11.56825,11.009083 13.359657,11.009083 14.877729,9.4910049 16.046764,8.3219666 15.762917,7.3031785 15.151065,6.5305636 L 13.807509,7.8741193 12.463953,7.4262674 12.016101,6.0827116 Z"
       fill="url(#b)"
       stroke="#5a5a5a"
       stroke-width="0.53553"
       id="path33"
       style="fill:url(#b)" />
  </g>
</svg>
