<svg width="32" height="32" version="1.1" xmlns="http://www.w3.org/2000/svg">
 <g stroke="#ffffff" stroke-linecap="round" stroke-linejoin="round">
  <circle transform="matrix(0,1,1,0,0,0)" cx="23" cy="23" r="8.1999998" fill="url(#a)" stroke-dashoffset="1.49998" stroke-width="1.6"/>
  <path d="M 26.210407,19.999933 22,26.5 19.710407,23.094176" fill="none" stroke-width="2"/>
 </g>
 <linearGradient id="a" x1="28.381756" x2="18.618243" y1="28.381755" y2="18.618242" gradientTransform="matrix(1.049827,0,0,1.049827,-1.6709351,-1.6709345)" gradientUnits="userSpaceOnUse">
  <stop stop-color="#009600" offset="0"/>
  <stop stop-color="#6edb39" offset="1"/>
 </linearGradient>
</svg>
