<svg width="32" height="32" version="1.0" xmlns="http://www.w3.org/2000/svg">
 <rect x="8.5" y="4.5" width="5" height="23" fill="#aaccff" stroke="#3465a4" stroke-linecap="round" stroke-linejoin="round" style="paint-order:normal"/>
 <rect x="18.5" y="4.5" width="5" height="23" fill="#aaccff" stroke="#3465a4" stroke-linecap="round" stroke-linejoin="round" style="paint-order:normal"/>
</svg>
