<?xml version="1.0" encoding="UTF-8" standalone="no"?>
<svg
   height="32"
   width="32"
   version="1.1"
   id="svg913"
   sodipodi:docname="SaveAs_01_32.svg"
   inkscape:export-filename="SaveAs_01_32.png"
   inkscape:export-xdpi="96"
   inkscape:export-ydpi="96"
   inkscape:version="1.2-beta (1b65182ce9, 2022-04-05)"
   xmlns:inkscape="http://www.inkscape.org/namespaces/inkscape"
   xmlns:sodipodi="http://sodipodi.sourceforge.net/DTD/sodipodi-0.dtd"
   xmlns="http://www.w3.org/2000/svg"
   xmlns:svg="http://www.w3.org/2000/svg">
  <defs
     id="defs917" />
  <sodipodi:namedview
     id="namedview915"
     pagecolor="#ffffff"
     bordercolor="#666666"
     borderopacity="1.0"
     inkscape:pageshadow="2"
     inkscape:pageopacity="0.0"
     inkscape:pagecheckerboard="0"
     inkscape:deskcolor="#d1d1d1"
     showgrid="true"
     inkscape:zoom="28.6875"
     inkscape:cx="15.982571"
     inkscape:cy="16"
     inkscape:current-layer="svg913">
    <inkscape:grid
       type="xygrid"
       id="grid1430" />
  </sodipodi:namedview>
  <linearGradient
     id="a"
     gradientTransform="matrix(1 0 0 .88368658 -52 -914.05199)"
     gradientUnits="userSpaceOnUse"
     x1="33"
     x2="36"
     y1="1037.3622"
     y2="1037.3622">
    <stop
       offset="0"
       stop-color="#999"
       id="stop855" />
    <stop
       offset=".49999997"
       stop-color="#fff"
       id="stop857" />
    <stop
       offset="1"
       stop-color="#999"
       id="stop859" />
  </linearGradient>
  <linearGradient
     id="b"
     gradientTransform="matrix(1 0 0 .88368658 -52 -914.05199)"
     gradientUnits="userSpaceOnUse"
     x1="33"
     x2="36"
     y1="1035.3622"
     y2="1035.3622">
    <stop
       offset="0"
       stop-color="#a00"
       id="stop862" />
    <stop
       offset=".51070523"
       stop-color="#f00"
       id="stop864" />
    <stop
       offset="1"
       stop-color="#a00"
       id="stop866" />
  </linearGradient>
  <linearGradient
     id="c"
     gradientTransform="matrix(1 0 0 .92685372 -52 -958.89784)"
     gradientUnits="userSpaceOnUse"
     x1="33"
     x2="36"
     y1="1041.8622"
     y2="1041.8622">
    <stop
       offset="0"
       stop-color="#a05a2c"
       id="stop869" />
    <stop
       offset=".26457807"
       stop-color="#ff0"
       id="stop871" />
    <stop
       offset=".75078517"
       stop-color="#ff0"
       id="stop873" />
    <stop
       offset="1"
       stop-color="#a05a2c"
       id="stop875" />
  </linearGradient>
  <linearGradient
     id="d"
     gradientUnits="userSpaceOnUse"
     x1="14"
     x2="15.5"
     y1="9"
     y2="14">
    <stop
       offset="0"
       stop-color="#ccc"
       id="stop878" />
    <stop
       offset="1"
       stop-color="#f2f2f2"
       id="stop880" />
  </linearGradient>
  <g
     fill-rule="evenodd"
     transform="matrix(2 0 0 2 -16 -16)"
     id="g891">
    <path
       d="m23 24v-14.5l-1.5-1.5h-13.5v16z"
       fill="#0062f5"
       id="path883" />
    <path
       d="m-21-23h11v1.5h-11z"
       fill="#f00"
       transform="scale(-1)"
       id="path885" />
    <path
       d="m-21-21.5h11v6.500002h-11z"
       fill="#fff"
       transform="scale(-1)"
       id="path887" />
    <path
       d="m20 14v-6h-8v6zm-1-1h-2v-4h2z"
       fill="url(#d)"
       id="path889" />
  </g>
  <g
     stroke-width=".559487"
     transform="matrix(1.2637538 1.2639444 -1.2637538 1.2639444 50.805946 30.429272)"
     id="g911">
    <path
       d="m-19 0v10l1.033203 2.67969c.07409.192396.260677.319587.466844.32031.206167-.000723.390753-.127916.464844-.320312.003859.015625 1.035109-2.679688 1.035109-2.679688v-10z"
       fill="none"
       stroke="#fff"
       stroke-dashoffset="1.49998"
       stroke-linecap="square"
       stroke-width="1.11898"
       id="path893" />
    <g
       stroke-width=".559487"
       id="g909">
      <g
         fill-rule="evenodd"
         id="g905">
        <g
           stroke-width=".595165"
           id="g901">
          <path
             d="m-19 2h3v2h-3z"
             fill="url(#a)"
             id="path895" />
          <path
             d="m-19 0 3 .000005v2.0104412l-3-.0104462z"
             fill="url(#b)"
             id="path897" />
          <path
             d="m-19 4h3v6h-3z"
             fill="url(#c)"
             id="path899" />
        </g>
        <path
           d="m-19 10 .771286 2h1.457428l.771286-2z"
           fill="#d38d5f"
           stroke-width=".565411"
           id="path903" />
      </g>
      <path
         d="m-17 12.5a.5.5 0 0 1 -.5.5.5.5 0 0 1 -.5-.5.5.5 0 0 1 .5-.5.5.5 0 0 1 .5.5zm-1.228714-.5h1.457428l-.262202.679907h-.933024z"
         fill="#333"
         stroke-dashoffset="1.49998"
         stroke-linecap="round"
         stroke-linejoin="round"
         stroke-width=".74621"
         id="path907" />
    </g>
  </g>
</svg>
