<svg width="32" height="32" version="1.0" xmlns="http://www.w3.org/2000/svg">
 <path d="m16 28v-20" fill="none" stroke="#2a7efe" stroke-linecap="round" stroke-linejoin="round" stroke-width="3.6"/>
 <path d="m22 14-6-6-6 6" fill="none" stroke="#2a7efe" stroke-linecap="round" stroke-linejoin="round" stroke-width="3.6"/>
 <path d="m4 11h4" fill="none" stroke="#d4aa00" stroke-linejoin="round" stroke-width="2"/>
 <path d="m24 11h4" fill="none" stroke="#d4aa00" stroke-linejoin="round" stroke-width="2"/>
 <path d="m20 19h8" fill="none" stroke="#d4aa00" stroke-linejoin="round" stroke-width="2"/>
 <path d="m4 19h8" fill="none" stroke="#d4aa00" stroke-linejoin="round" stroke-width="2"/>
 <path d="m20 25h8" fill="none" stroke="#d4aa00" stroke-linejoin="round" stroke-width="2"/>
 <path d="m4 25h8" fill="none" stroke="#d4aa00" stroke-linejoin="round" stroke-width="2"/>
 <path d="m4 4.5h24" fill="none" stroke="#fa0302" stroke-linejoin="round" stroke-width="3"/>
</svg>
