<?xml version="1.0" encoding="UTF-8" standalone="no"?>
<svg
   width="32"
   height="32"
   version="1.1"
   xml:space="preserve"
   id="svg2"
   sodipodi:docname="items_save_200.svg"
   inkscape:export-filename="items_save_200.png"
   inkscape:export-xdpi="96"
   inkscape:export-ydpi="96"
   inkscape:version="1.3.2 (091e20e, 2023-11-25, custom)"
   xmlns:inkscape="http://www.inkscape.org/namespaces/inkscape"
   xmlns:sodipodi="http://sodipodi.sourceforge.net/DTD/sodipodi-0.dtd"
   xmlns="http://www.w3.org/2000/svg"
   xmlns:svg="http://www.w3.org/2000/svg"><defs
     id="defs2" /><sodipodi:namedview
     id="namedview2"
     pagecolor="#ffffff"
     bordercolor="#000000"
     borderopacity="0.25"
     inkscape:showpageshadow="2"
     inkscape:pageopacity="0.0"
     inkscape:pagecheckerboard="0"
     inkscape:deskcolor="#d1d1d1"
     showgrid="true"
     inkscape:current-layer="svg2"><inkscape:grid
       id="grid2"
       units="px"
       originx="0"
       originy="0"
       spacingx="0.5"
       spacingy="0.5"
       empcolor="#0099e5"
       empopacity="0.30196078"
       color="#0099e5"
       opacity="0.14901961"
       empspacing="2"
       dotted="false"
       gridanglex="30"
       gridanglez="30"
       visible="true" /></sodipodi:namedview><path
     d="m29.249786 28.75v-23.95l-3.053572-3.0500001h-22.946214c-0.8284271 0-1.5 0.6715729-1.5 1.5v25.500001c0 0.828427 0.6715729 1.5 1.5 1.5l24.499786-1e-6c0.828427-1e-6 1.5-0.671573 1.5-1.5z"
     fill="#e0edff"
     fill-rule="evenodd"
     stroke="#2a7efe"
     stroke-linejoin="round"
     stroke-width="1.5"
     id="path1" /><rect
     x="8.75"
     y="1.75"
     width="13.5"
     height="8.5"
     rx="1.4999999"
     ry="1.5"
     fill="#ebf3ff"
     stroke="#2a7efe"
     stroke-linejoin="round"
     stroke-width="1.5"
     id="rect1" /><path
     d="m18 3.5v5"
     fill="none"
     stroke="#2a7efe"
     stroke-width="3"
     id="path2" /><rect
     x="5.75"
     y="13.75"
     width="19.5"
     height="16.5"
     rx="1.5"
     ry="1.5"
     fill="#ebf3ff"
     stroke="#2a7efe"
     stroke-linejoin="round"
     stroke-width="1.5"
     id="rect2" /></svg>
