<?xml version="1.0" encoding="UTF-8" standalone="no"?>
<svg
   height="48"
   width="48"
   version="1.1"
   id="svg560"
   sodipodi:docname="Link_01_48.svg"
   inkscape:version="1.2 (dc2aedaf03, 2022-05-15)"
   xmlns:inkscape="http://www.inkscape.org/namespaces/inkscape"
   xmlns:sodipodi="http://sodipodi.sourceforge.net/DTD/sodipodi-0.dtd"
   xmlns="http://www.w3.org/2000/svg"
   xmlns:svg="http://www.w3.org/2000/svg">
  <defs
     id="defs564" />
  <sodipodi:namedview
     id="namedview562"
     pagecolor="#ffffff"
     bordercolor="#666666"
     borderopacity="1.0"
     inkscape:showpageshadow="2"
     inkscape:pageopacity="0.0"
     inkscape:pagecheckerboard="0"
     inkscape:deskcolor="#d1d1d1"
     showgrid="true"
     inkscape:zoom="19.125"
     inkscape:cx="23.973856"
     inkscape:cy="24"
     inkscape:current-layer="svg560">
    <inkscape:grid
       type="xygrid"
       id="grid934" />
  </sodipodi:namedview>
  <g
     stroke-linecap="round"
     transform="matrix(2.9999766 0 0 2.9999766 0 .000187)"
     id="g558">
    <path
       d="m8 .625c-4.068646 0-7.375 3.306354-7.375 7.375 0 2.629475 1.3818007 4.94013 3.4570312 6.246094-.0533718-.240636-.0820312-.490734-.0820312-.746094 0-.07167.00149-.142211.00586-.212891-.5546149-.4196-1.0407355-.92531-1.4394532-1.496093.6381857-.09696 1.2767997-.177137 1.9160157-.240235.014478.03951.029917.07799.044922.117188.2268049-.364052.5178574-.684987.8574211-.945313-.1236983.008914-.2474433.01716-.3710937.027344-.2217802-.7528574-.348249-1.5580965-.3789063-2.375h2.9902344v1.625h.375c.1260412 0 .2515901.0062.375.01953v-1.64453h2.990234c-.02875.7662124-.144816 1.5203467-.341796 2.232422.269138-.18194.565723-.328308.880859-.431641.119942-.5885489.190001-1.1940711.210937-1.800781h2.5c-.03319.5974254-.146909 1.1723389-.328125 1.716797.24573.05769.481523.14092.705079.248047.246716-.7358325.382812-1.5216726.382812-2.339844 0-4.068646-3.306354-7.375-7.375-7.375zm-1.6445312.9570312c-.845492.740859-1.4683661 1.7412417-1.8789063 2.8671876-.6372782-.0630095-1.2739021-.1435683-1.9101563-.2402344.8946802-1.2807766 2.2306153-2.2296895 3.7890626-2.6269532zm3.2890624 0c1.5584468.3972637 2.8943828 1.3461766 3.7890628 2.6269532-.636468.0974202-1.273035.1773247-1.908203.2402344-.410538-1.1262019-1.035211-2.1261906-1.8808598-2.8671876zm-2.0195312.0136719v3.0253907c-.7898892-.0085814-1.5790127-.0427457-2.3671875-.1035157.5010185-1.2642366 1.2951545-2.3161323 2.3671875-2.921875zm.75 0c1.0726972.6061181 1.868175 1.6585454 2.369141 2.9238281-.7907579.0608521-1.5802507.0935166-2.369141.1015626zm-6.2324219 3.3046875c.6992267.1121337 1.3987196.2069692 2.0996094.2792969-.2148254.7859799-.3304706 1.6143641-.3574219 2.4453125h-2.5c.0544981-.9808704.3232996-1.9038798.7578125-2.7246094zm11.7148439 0c.434512.8207296.703314 1.743739.757812 2.7246094h-2.5c-.02693-.8303053-.142909-1.6579214-.357422-2.4433594.699518-.072254 1.398874-.1679745 2.09961-.28125zm-8.8496095.3496094c.8711494.0717082 1.7436851.1117762 2.6171875.1210938v2.2539062h-2.9902344c.0287912-.8169672.153157-1.6225797.3730469-2.375zm5.9863285.00195c.219466.7517546.342332 1.5569288.371093 2.37305h-2.990234v-2.2539062c.8722478-.00867 1.744776-.047281 2.619141-.1191407zm-9.6093754 3.12305h2.5c.02867.8308419.1468842 1.659117.3632813 2.445312-.7029438.07256-1.4042936.166834-2.1054688.279297-.4345129-.820729-.7033144-1.7437385-.7578125-2.724609z"
       fill="#00aad4"
       stroke-dashoffset="1.49998"
       stroke-linejoin="round"
       stroke-width=".75"
       id="path548" />
    <g
       fill="none"
       stroke="#00aad4"
       stroke-width="1.00001"
       id="g556">
      <path
         d="m11.590652 14.919052c.36155.359031.859542.580858 1.409348.580903l.500012.000023c1.104634-.000023 2.000108-.895434 2.000108-1.999978s-.895474-1.999955-2.000108-1.999977l-.500012-.000023c-.556843 0-1.060537.227541-1.423162.59471"
         stroke-linejoin="round"
         id="path550" />
      <path
         d="m7.499736 13.5h6.000264"
         id="path552" />
      <path
         d="m9.409468 14.919052c-.36155.359031-.859542.580858-1.409348.580903l-.500012.000023c-1.104634-.000023-2.000108-.895434-2.000108-1.999978s.895474-1.999955 2.000108-1.999977l.500012-.000023c.556843 0 1.060537.227541 1.423162.59471"
         stroke-linejoin="round"
         id="path554" />
    </g>
  </g>
</svg>
