<?xml version="1.0" encoding="UTF-8" standalone="no"?>
<svg
   height="16"
   width="16"
   version="1.1"
   id="svg16"
   sodipodi:docname="File_25_16.svg"
   inkscape:version="1.2.2 (732a01da63, 2022-12-09)"
   inkscape:export-filename="File_25_16.png"
   inkscape:export-xdpi="96"
   inkscape:export-ydpi="96"
   xmlns:inkscape="http://www.inkscape.org/namespaces/inkscape"
   xmlns:sodipodi="http://sodipodi.sourceforge.net/DTD/sodipodi-0.dtd"
   xmlns="http://www.w3.org/2000/svg"
   xmlns:svg="http://www.w3.org/2000/svg">
  <defs
     id="defs20">
    <radialGradient
       id="a"
       cx="9.1740294"
       cy="7.8253603"
       gradientTransform="matrix(0.66909781,-2.2758851e-8,4.5190518e-8,0.58542853,1.8616763,4.291566)"
       gradientUnits="userSpaceOnUse"
       r="7.5"
       fx="9.1740294"
       fy="7.8253603">
      <stop
         offset="0"
         stop-color="#fff"
         id="stop2" />
      <stop
         offset="1"
         stop-color="#8fc1c7"
         id="stop4" />
    </radialGradient>
  </defs>
  <sodipodi:namedview
     id="namedview18"
     pagecolor="#ffffff"
     bordercolor="#666666"
     borderopacity="1.0"
     inkscape:pageshadow="2"
     inkscape:pageopacity="0.0"
     inkscape:pagecheckerboard="0"
     inkscape:deskcolor="#d1d1d1"
     showgrid="true"
     showguides="true"
     inkscape:zoom="56.875"
     inkscape:cx="5.6879121"
     inkscape:cy="8"
     inkscape:current-layer="svg16"
     inkscape:showpageshadow="2">
    <inkscape:grid
       type="xygrid"
       id="grid249" />
  </sodipodi:namedview>
  <rect
     style="fill:#ebfcff;fill-opacity:1;stroke:#00aad4;stroke-width:0.999995;stroke-linejoin:round;stroke-dasharray:none;stroke-opacity:1"
     id="rect979"
     width="10.000001"
     height="13.000001"
     x="2.4999976"
     y="1.4999995"
     ry="1.5" />
  <path
     id="circle4"
     style="fill:#ffffff;stroke:#00aad4;stroke-width:0.8;stroke-linejoin:round;stroke-dashoffset:1.49998"
     d="M 12.4,11 A 1.4,1.4 0 0 1 11,12.4 1.4,1.4 0 0 1 9.6,11 1.4,1.4 0 0 1 11,9.6 1.4,1.4 0 0 1 12.4,11 Z M 9.0262559,8.2357418 8.2366184,9.0255986 6.8273514,8.6672516 6.3999897,9.6989938 l 1.2498919,0.7431132 -1.551e-4,1.116871 -1.2488029,0.741576 0.4274072,1.031854 1.4074111,-0.358664 0.7898568,0.789638 -0.3583469,1.409267 1.0317421,0.427361 0.7431131,-1.249891 1.116871,1.55e-4 0.741576,1.248802 1.031854,-0.427407 -0.358664,-1.407411 0.789638,-0.789857 1.409267,0.358347 0.427361,-1.031742 -1.249891,-0.743112 1.55e-4,-1.116871 L 15.599076,9.6994452 15.171668,8.6675927 13.764258,9.0262558 12.974401,8.2366183 13.332748,6.8273512 12.301006,6.3999896 11.557892,7.6498814 10.441023,7.6497263 9.6994453,6.4009234 8.6675928,6.8283307 Z" />
</svg>
