<?xml version="1.0" encoding="UTF-8" standalone="no"?>
<svg
   height="32"
   width="32"
   version="1.1"
   id="svg157"
   sodipodi:docname="next_word_200.svg"
   inkscape:export-filename="next_word_200.png"
   inkscape:export-xdpi="96"
   inkscape:export-ydpi="96"
   inkscape:version="1.2.2 (732a01da63, 2022-12-09)"
   xmlns:inkscape="http://www.inkscape.org/namespaces/inkscape"
   xmlns:sodipodi="http://sodipodi.sourceforge.net/DTD/sodipodi-0.dtd"
   xmlns="http://www.w3.org/2000/svg"
   xmlns:svg="http://www.w3.org/2000/svg">
  <defs
     id="defs161" />
  <sodipodi:namedview
     id="namedview159"
     pagecolor="#ffffff"
     bordercolor="#666666"
     borderopacity="1.0"
     inkscape:showpageshadow="2"
     inkscape:pageopacity="0.0"
     inkscape:pagecheckerboard="0"
     inkscape:deskcolor="#d1d1d1"
     showgrid="true"
     inkscape:zoom="28.6875"
     inkscape:cx="15.982571"
     inkscape:cy="16"
     inkscape:current-layer="svg157">
    <inkscape:grid
       type="xygrid"
       id="grid534" />
  </sodipodi:namedview>
  <g
     stroke-linecap="round"
     id="g155">
    <path
       d="m2.79969 18.79969h12.400628v4.400623h-12.400628z"
       fill="#fff"
       stroke="#f00"
       stroke-miterlimit="5.6"
       stroke-width="1.59938"
       id="path145" />
    <g
       fill="none"
       stroke="#00cc00"
       stroke-width="3"
       transform="translate(31 .5)"
       id="g151">
      <path
         d="m-8.5 21.00009 4 5 4-5"
         stroke-linejoin="round"
         id="path147" />
      <path
         d="m-4.5 25.20009v-20.2000899"
         id="path149" />
    </g>
    <path
       d="m2.79969 6.79969h12.400628v4.400623h-12.400628z"
       fill="#fff"
       stroke="#2a7fff"
       stroke-miterlimit="5.6"
       stroke-width="1.59938"
       id="path153" />
  </g>
</svg>
