<svg width="16" height="16" version="1.1" xmlns="http://www.w3.org/2000/svg">
 <defs>
  <radialGradient id="c" cx="21.957434" cy="5.9936466" r="3.105469" gradientTransform="matrix(.54934594 .00019418549 1.5396439e-8 .45002289 -7.5623494 .3929805)" gradientUnits="userSpaceOnUse">
   <stop stop-color="#803300" offset="0"/>
   <stop stop-color="#d45500" offset="1"/>
  </radialGradient>
  <linearGradient id="a" x1="25.714283" x2="25.714283" y1="15.5" y2="6.2142854" gradientTransform="matrix(.54914214 .00016659727 .00015252483 .60000003 -7.5829775 -.3033965)" gradientUnits="userSpaceOnUse">
   <stop stop-color="#668000" offset="0"/>
   <stop stop-color="#aad400" offset="1"/>
  </linearGradient>
  <linearGradient id="b" x1="23" x2="23" y1="6.5" y2="15" gradientTransform="matrix(.56555147 .00016496396 .00015708254 .59411766 -7.9443885 -.1151262)" gradientUnits="userSpaceOnUse">
   <stop stop-color="#89a02c" offset="0"/>
   <stop stop-color="#445016" offset="1"/>
  </linearGradient>
  <radialGradient id="d" cx="-11.5" cy="8.5" r="3.5" gradientTransform="rotate(90,-1.9998905,18.250108)" gradientUnits="userSpaceOnUse">
   <stop stop-color="#fff" offset="0"/>
   <stop stop-color="#d5e5ff" offset="1"/>
  </radialGradient>
 </defs>
 <path d="m9 0v4.828125c2.346341 0.2526742 4.199219 2.2632787 4.199219 4.671875 0 0.523726-0.09055 1.027801-0.251953 1.5h3.052734v-11z" fill="#d5f6ff" stroke-linecap="round" stroke-linejoin="round" stroke-width="5.6"/>
 <path d="m13.171875 9c0.01782 0.1647641 0.02734 0.3308443 0.02734 0.5 0 0.1685889-0.0095 0.3357176-0.02734 0.5h1.828125v-1z" fill="#b3b3b3"/>
 <path d="m9.9802318 3.5h5.0395362" fill="none" stroke="#b3b3b3"/>
 <path d="m9.9804688 5.0449219c0.6113602 0.2057669 1.1683072 0.5328467 1.6406252 0.9550781h3.398437v-1h-5.0390622z" fill="#b3b3b3"/>
 <path d="m12.46875 7c0.197944 0.3114261 0.359522 0.6457766 0.480469 1h2.070312v-1z" fill="#b3b3b3"/>
 <path d="m9.9802318 1.5h5.0395362" fill="none" stroke="#b3b3b3"/>
 <path d="m5.1583806 1.9699937 0.658857-1.6197247" fill="none" stroke="#d4aa00" stroke-linecap="round" stroke-linejoin="round" stroke-width=".7"/>
 <path d="m3.8406646 1.9699937-0.658858-1.6197245" fill="none" stroke="#d4aa00" stroke-linecap="round" stroke-linejoin="round" stroke-width=".7"/>
 <path d="m4.4985316 1.2002687a3.9000011 2.7503982 89.953824 0 0-1.7029835 0.8479215l1.7036715 1.8614548 1.707015-1.8651079a3.9000011 2.7503982 89.953824 0 0-1.707703-0.8442684z" fill="url(#c)" stroke-linejoin="round" stroke-width="1.9634"/>
 <path d="m1.3495219 2.350269-3e-7 0.725905 0.8784773 0.925557" fill="none" stroke="#aca793" stroke-linecap="round" stroke-linejoin="round" stroke-width=".7"/>
 <path d="m1.3609984 8.650268-0.011477-0.937649 0.878477-0.925558" fill="none" stroke="#aca793" stroke-linecap="round" stroke-linejoin="round" stroke-width=".7"/>
 <path d="m0.3495216 6.112235 0.6588578-0.694167 1.675501-0.321883" fill="none" stroke="#aca793" stroke-linecap="round" stroke-linejoin="round" stroke-width=".7"/>
 <path d="m7.6499986 2.3502696 2e-6 0.7259044-0.878479 0.925558" fill="none" stroke="#aca793" stroke-linecap="round" stroke-linejoin="round" stroke-width=".7"/>
 <path d="m6.1972656 2.0351563-1.697266 1.8554687-1.6953121-1.8515625a3.9000011 2.7503982 89.953824 0 0-1.0546875 3.0605465 3.9000011 2.7503982 89.953824 0 0 2.0957036 3.775391c0.253144-1.865318 1.617255-3.399358 3.396484-3.900391a3.9000011 2.7503982 89.953824 0 0-1.044922-2.9394527z" fill="url(#a)" stroke-linejoin="round" stroke-width="1.9634"/>
 <path d="m4.4999996 3.300781a0.34999999 0.34999999 0 0 0-0.349609 0.34961v4.082031c0.175308-0.426159 0.412797-0.821891 0.699219-1.175781v-2.90625a0.34999999 0.34999999 0 0 0-0.34961-0.34961z" fill="url(#b)" stroke-linecap="round" stroke-linejoin="round"/>
 <path d="m7.069 10.931219-4.269 4.269" fill="none" stroke="#ff7f00" stroke-linecap="round" stroke-width="1.6"/>
 <circle cx="8.5002193" cy="9.5" r="3.125" fill="url(#d)" fill-rule="evenodd" stroke="#b3b3b3" stroke-linecap="round" stroke-linejoin="round" stroke-width=".75"/>
</svg>
