<?xml version="1.0" encoding="UTF-8" standalone="no"?>
<svg
   height="24"
   width="24"
   version="1.1"
   id="svg6"
   sodipodi:docname="Align_08_24.svg"
   inkscape:export-filename="Align_08_24.png"
   inkscape:export-xdpi="96"
   inkscape:export-ydpi="96"
   inkscape:version="1.3-beta (cedbd6c6ff, 2023-05-28)"
   xmlns:inkscape="http://www.inkscape.org/namespaces/inkscape"
   xmlns:sodipodi="http://sodipodi.sourceforge.net/DTD/sodipodi-0.dtd"
   xmlns="http://www.w3.org/2000/svg"
   xmlns:svg="http://www.w3.org/2000/svg">
  <defs
     id="defs6" />
  <sodipodi:namedview
     id="namedview6"
     pagecolor="#ffffff"
     bordercolor="#000000"
     borderopacity="0.25"
     inkscape:showpageshadow="2"
     inkscape:pageopacity="0.0"
     inkscape:pagecheckerboard="0"
     inkscape:deskcolor="#d1d1d1"
     showgrid="true"
     inkscape:zoom="37.875"
     inkscape:cx="12"
     inkscape:cy="12"
     inkscape:current-layer="g6">
    <inkscape:grid
       id="grid6"
       units="px"
       originx="0"
       originy="0"
       spacingx="0.5"
       spacingy="0.5"
       empcolor="#0099e5"
       empopacity="0.30196078"
       color="#0099e5"
       opacity="0.14901961"
       empspacing="2"
       dotted="false"
       gridanglex="30"
       gridanglez="30"
       visible="true" />
  </sodipodi:namedview>
  <g
     fill="none"
     stroke="#00aad4"
     stroke-width="1.2"
     id="g6">
    <path
       d="M 10,16.599997 H 20"
       id="path2"
       sodipodi:nodetypes="cc" />
    <path
       d="M 10,7.6 H 20"
       id="path6"
       sodipodi:nodetypes="cc" />
    <path
       d="M 4,19.156723 6.6050122,15.796708 C 6.9157741,15.395878 7.1017408,14.791324 6.8348189,14.315289 6.5987953,13.894358 6.0020732,13.842115 5.5877459,14.005424 5.2339905,14.144857 5.0396267,14.524241 5.0071595,14.887917 4.673053,14.884717 4.3261487,14.894297 4,14.883157 4.087216,14.17979 4.4621826,13.460592 5.1428252,13.172702 c 0.5689558,-0.24065 1.2333147,-0.217313 1.8089946,-0.0073 0.5821599,0.212381 0.9446336,0.794176 0.9990308,1.399375 0.066353,0.738214 -0.2863332,1.423419 -0.7197279,1.99343 L 5.3747019,18.999815 H 8 v 1.000182 H 4 Z"
       fill="#ffffff"
       id="path829"
       style="fill:#00aad4;fill-opacity:1;stroke:none;stroke-width:0.999995"
       sodipodi:nodetypes="csssccssssccccc" />
    <path
       d="M 6.9980469,11 H 6.0019531 V 5.083984 L 4.5089195,6.0000002 4.4980345,4.9999999 6.0019406,4 h 0.9960938 z"
       fill="#ffffff"
       id="path153-7"
       sodipodi:nodetypes="cccccccc"
       style="fill:#00aad4;fill-opacity:1;stroke:none;stroke-width:0.999999" />
  </g>
</svg>
