<?xml version="1.0" encoding="UTF-8" standalone="no"?>
<svg
   height="24"
   viewBox="0 0 24 24"
   width="24"
   version="1.1"
   id="svg211"
   sodipodi:docname="05 LazCompatibility_150.svg"
   inkscape:export-filename="05 LazCompatibility_150.png"
   inkscape:export-xdpi="96"
   inkscape:export-ydpi="96"
   inkscape:version="1.2.1 (9c6d41e410, 2022-07-14)"
   xmlns:inkscape="http://www.inkscape.org/namespaces/inkscape"
   xmlns:sodipodi="http://sodipodi.sourceforge.net/DTD/sodipodi-0.dtd"
   xmlns="http://www.w3.org/2000/svg"
   xmlns:svg="http://www.w3.org/2000/svg">
  <defs
     id="defs215" />
  <sodipodi:namedview
     id="namedview213"
     pagecolor="#ffffff"
     bordercolor="#666666"
     borderopacity="1.0"
     inkscape:showpageshadow="2"
     inkscape:pageopacity="0.0"
     inkscape:pagecheckerboard="0"
     inkscape:deskcolor="#d1d1d1"
     showgrid="true"
     inkscape:zoom="38.25"
     inkscape:cx="11.986928"
     inkscape:cy="12"
     inkscape:current-layer="svg211">
    <inkscape:grid
       type="xygrid"
       id="grid625" />
  </sodipodi:namedview>
  <radialGradient
     id="a"
     cx="11.999836"
     cy="11.999909"
     gradientUnits="userSpaceOnUse"
     r="13.5005">
    <stop
       offset="0"
       stop-color="#b3c9ec"
       id="stop171" />
    <stop
       offset="1"
       stop-color="#fff"
       id="stop173" />
  </radialGradient>
  <radialGradient
     id="b"
     cx="11.999336"
     cy="11.999409"
     gradientUnits="userSpaceOnUse"
     r="11.4995">
    <stop
       offset="0"
       stop-color="#598bd4"
       id="stop176" />
    <stop
       offset=".56522"
       stop-color="#9ab8e5"
       id="stop178" />
    <stop
       offset="1"
       stop-color="#fff"
       id="stop180" />
  </radialGradient>
  <path
     d="m19.666 19.312c.34393.11129.98447.02608 1.3428-.26067.35833-.28678.7006-.8689.95059-1.3018.25002-.43298.58301-1.0204.65222-1.4741.06918-.45375-.17731-1.051-.44568-1.2932-1.0839-.9783-1.4484-1.2101-1.4481-2.9823-.000283-1.7722.36416-2.004 1.4481-2.9823.26837-.2422.51486-.8395.44568-1.2932-.06921-.4537-.40224-1.0411-.65222-1.4741-.24998-.43298-.59226-1.0151-.95059-1.3018-.35837-.28677-.9989-.37196-1.3428-.26068-1.3892.44949-1.7722.6492-3.307-.23716-1.535-.88585-1.5535-1.3173-1.8589-2.7451-.075562-.35348-.46961-.8656-.89719-1.0325-.42754-.16694-1.1028-.17227-1.6028-.17227s-1.1753.005329-1.6028.17227c-.42754.16693-.82163.67905-.89722 1.0325-.30532 1.4278-.32389 1.8593-1.8589 2.7451-1.5347.88635-1.9177.68665-3.3069.23716-.34393-.11128-.9845-.026117-1.3428.26068-.35837.28677-.70061.86885-.95059 1.3018-.25002.43298-.58301 1.0204-.65222 1.4741-.06921.45375.17731 1.051.44565 1.2932 1.0839.9783 1.4484 1.2101 1.4481 2.9823.0002823 1.7722-.36416 2.004-1.4481 2.9823-.26833.2422-.51482.8395-.44565 1.2932.06921.4537.4022 1.0411.65222 1.4741.24998.43298.59222 1.0151.95059 1.3018.35833.28677.9989.37195 1.3428.26067 1.3892-.44949 1.7722-.6492 3.3069.23716 1.535.88585 1.5536 1.3173 1.8589 2.7451.075598.35348.46965.8656.89722 1.0325.42754.16693 1.1028.17227 1.6028.17227s1.1753-.0053 1.6028-.17227c.42754-.16694.82159-.67905.89719-1.0325.30536-1.4278.32389-1.8593 1.8589-2.7451 1.5347-.88635 1.9177-.68665 3.307-.23716z"
     fill="url(#a)"
     stroke-width=".5"
     id="path183" />
  <path
     d="m20.012 9.0004c-1.1116.86785-5.512.99945-7.512 1.9994-1.5996.7998-1.7787 1.4956-3 4-.65469 1.3425-3.4268 1.9378-3.7721 2.1395-.36253.21174-1.6783 1.488-2.2929 2.238.47498-.006 3.415-.28492 4.2066.17229 1.535.88584 1.553 1.3173 1.8584 2.7451.075598.35349.46993.8653.89744 1.0322.42754.16693 1.1026.17187 1.6026.17187s1.175-.0049 1.6026-.17187c.42754-.16693.82184-.67875.89744-1.0322.30532-1.4278.32339-1.8593 1.8584-2.7451 1.5347-.88635 1.9184-.6868 3.3076-.2373.34393.11128.98443.02605 1.3427-.26074.35837-.28678.70022-.86875.9502-1.3017.25002-.43298.58315-1.0209.65236-1.4746.06917-.4537-.17696-1.0507-.44533-1.2929-1.0839-.9783-1.4485-1.2102-1.4482-2.9824-.000318-1.7722.3643-2.0041 1.4482-2.9824.26837-.2422.5145-.83925.44533-1.2929-.032823-.21589-.335-1.1208-.45002-1.3662-.4309.71155-1.3997 2.057-2.1492 2.6421z"
     fill="url(#b)"
     stroke-width=".5"
     id="path185" />
  <path
     d="m19.666 19.312c.34393.11129.98445.02608 1.3428-.26067.35831-.28677.70056-.86887.95058-1.3019.24998-.43299.58301-1.0204.65219-1.4741s-.17731-1.051-.44566-1.2932c-1.0838-.97832-1.4483-1.2101-1.4481-2.9823-.000281-1.7722.36418-2.004 1.448-2.9823.26835-.2422.51484-.83949.44562-1.2932-.069183-.45371-.40218-1.0412-.65219-1.4741-.24998-.43299-.59219-1.0151-.95058-1.3019-.35831-.28677-.99884-.37196-1.3428-.26068-1.3892.44949-1.7722.64919-3.3068-.23716-1.5349-.88585-1.5535-1.3174-1.8588-2.7452-.075575-.35348-.46961-.86561-.89714-1.0325-.4275-.16693-1.1027-.17227-1.6028-.17227-.5 0-1.1752.005343-1.6028.17227-.4275.16693-.82154.67903-.89714 1.0325-.3053 1.4278-.32388 1.8593-1.8588 2.7452-1.5346.88634-1.9176.68665-3.3068.23716-.34396-.11129-.98449-.026089-1.3428.26067-.35831.28677-.70056.86887-.95058 1.3019-.24998.43299-.58297 1.0204-.65219 1.4741-.069183.4537.17731 1.051.44566 1.2932 1.0838.97832 1.4483 1.2101 1.448 2.9823.0003142 1.7722-.36414 2.004-1.448 2.9823-.26835.2422-.51484.83949-.44566 1.2932.069218.4537.40221 1.0412.65219 1.4741.25002.43299.59223 1.0151.95058 1.3019.35835.28677.99888.37196 1.3428.26067 1.3892-.4495 1.7722-.64919 3.3068.23716 1.5349.88584 1.5535 1.3174 1.8588 2.7452.075609.35349.46965.86561.89714 1.0325.42753.16693 1.1028.17226 1.6028.17226.50003.000003 1.1753-.0054 1.6028-.17226.42753-.16693.82157-.67903.89714-1.0325.30533-1.4278.32388-1.8593 1.8588-2.7452 1.5346-.88634 1.9176-.68665 3.3068-.23717z"
     fill="none"
     stroke="#253f5b"
     stroke-linejoin="round"
     id="path187" />
  <g
     stroke-width=".483137"
     id="g199">
    <path
       d="m7.5654562 6.8143388c.9563466 0 1.6871249.2517423 1.7691621 1.2094802.1387771 1.6201449.2356756 2.6642-.03667 3.467846-.1362841.402162-.5250379 1.328235-1.2344227 2.162996-.444682.523216-.7478234 1.073526-.6441705 1.816684.090395.648126.1467103 1.549897.6720284 1.70479-.054749.29363-.1138471.321072-.3718825.534357-.6288361-.244746-.7855668-1.3636-.864048-2.233533-.0684706-.758928.1333853-1.563811.7892865-2.26542 1.2681458-1.356546 1.6025754-2.538198 1.1956748-3.7422671-.1344192-.3977747-.0676009-.3677237-1.2069803-.3123081-1.1394374.0554156-1.759306-.818421-2.0220375-1.5666136-.2834486-.1569125-.9103614.0467028-1.3442888.1551154.3706264-.6341147 2.2667963-.9310398 3.2983968-.9310398z"
       fill="#333"
       id="path189" />
    <ellipse
       cx="8.493061"
       cy="7.036523"
       fill="#fff"
       rx="1.284953"
       ry=".747557"
       transform="matrix(.99248464 .12236931 -.12137091 .99260722 0 0)"
       id="ellipse191" />
    <path
       d="m11.999715 4.6380089-.241551 2.1741075.241551 1.6909725.241589-1.6909725z"
       fill="#333"
       id="path193" />
    <path
       d="m16.43494 6.8143388c-.956346 0-1.687125.2517423-1.769162 1.2094802-.138777 1.6201449-.235675 2.6642.03667 3.467846.136284.402162.525037 1.328235 1.234422 2.162996.444682.523216.747824 1.073526.644171 1.816684-.0904.648126-.14671 1.549897-.672029 1.70479.05475.29363.113848.321072.371883.534357.628836-.244746.785566-1.3636.864048-2.233533.06847-.758928-.133386-1.563811-.789287-2.26542-1.268242-1.356546-1.602575-2.538198-1.195675-3.7422671.134419-.3977747.0676-.3677237 1.206981-.3123081 1.139438.0554156 1.759307-.818421 2.022038-1.5666136.283449-.1569125.910371.0467028 1.344289.1551154-.370627-.6341147-2.266796-.9310398-3.298397-.9310398z"
       fill="#333"
       id="path195" />
    <ellipse
       cx="-15.3291"
       cy="9.972652"
       fill="#fff"
       rx="1.284953"
       ry=".747557"
       transform="matrix(-.99248464 .12236931 .12137091 .99260722 0 0)"
       id="ellipse197" />
  </g>
  <ellipse
     cx="7.736487"
     cy="7.704273"
     fill="#500"
     fill-opacity=".97647"
     rx=".682058"
     ry=".511543"
     stroke-width=".483147"
     id="ellipse201" />
  <ellipse
     cx="-16.262943"
     cy="7.704273"
     fill="#500"
     fill-opacity=".97647"
     rx=".682058"
     ry=".511543"
     stroke-width=".483137"
     transform="scale(-1 1)"
     id="ellipse203" />
  <ellipse
     cx="7.430177"
     cy="7.567933"
     fill="#fff"
     rx=".204619"
     ry=".204617"
     stroke-width=".966275"
     id="ellipse205" />
  <ellipse
     cx="15.955665"
     cy="7.567933"
     fill="#fff"
     rx=".204619"
     ry=".204617"
     stroke-width=".966275"
     id="ellipse207" />
  <path
     d="m10.264045 13.947253c-.7669394-.01306-.8967554 1.279042-.152096 1.60974 1.083087.480992 1.37913 1.070212 1.65873 1.42581l.04598.689914c-.336768.109816-2.1262014.534648-1.9317944.873844.8147714-.06761 1.2654214-.275864 2.1155474-.275894v.0016c.850126.000029 1.300777.208279 2.115548.275894.194406-.339196-1.595027-.764028-1.931794-.873844l.04598-.689914c.2796-.355598.575642-.944819 1.658729-1.42581.74466-.330698.614844-1.622804-.152096-1.609741-.766855.01306-1.184531.09195-1.736369.09197v-.0016c-.551837-.000017-.969513-.0789-1.736369-.09197z"
     fill="#333"
     stroke-width=".482936"
     id="path209" />
</svg>
