<?xml version="1.0" encoding="UTF-8" standalone="no"?>
<svg
   width="36"
   height="36"
   version="1.1"
   viewBox="0 0 36 36"
   id="svg8"
   sodipodi:docname="tmultipropertylink_150.svg"
   inkscape:version="1.3.2 (091e20e, 2023-11-25, custom)"
   xmlns:inkscape="http://www.inkscape.org/namespaces/inkscape"
   xmlns:sodipodi="http://sodipodi.sourceforge.net/DTD/sodipodi-0.dtd"
   xmlns="http://www.w3.org/2000/svg"
   xmlns:svg="http://www.w3.org/2000/svg">
  <sodipodi:namedview
     id="namedview8"
     pagecolor="#ffffff"
     bordercolor="#000000"
     borderopacity="0.25"
     inkscape:showpageshadow="2"
     inkscape:pageopacity="0.0"
     inkscape:pagecheckerboard="0"
     inkscape:deskcolor="#d1d1d1"
     showgrid="true"
     inkscape:current-layer="svg8">
    <inkscape:grid
       id="grid8"
       units="px"
       originx="0"
       originy="0"
       spacingx="0.5"
       spacingy="0.5"
       empcolor="#0099e5"
       empopacity="0.30196078"
       color="#0099e5"
       opacity="0.14901961"
       empspacing="2"
       dotted="false"
       gridanglex="30"
       gridanglez="30"
       visible="true" />
  </sodipodi:namedview>
  <defs
     id="defs6">
    <radialGradient
       id="a"
       cx="5.3999925"
       cy="1034.7039"
       r="4"
       gradientTransform="matrix(1.9642759,-1.9642982,1.1785882,1.1785751,-1221.5255,-1200.2975)"
       gradientUnits="userSpaceOnUse">
      <stop
         stop-color="#198d19"
         offset="0"
         id="stop1" />
      <stop
         stop-color="#ffffff"
         offset="1"
         id="stop2" />
    </radialGradient>
    <radialGradient
       id="c"
       cx="5.3999925"
       cy="1034.7039"
       r="4"
       gradientTransform="matrix(1.9642759,-1.9660222,1.1785882,1.1796095,-1209.5255,-1201.357)"
       gradientUnits="userSpaceOnUse">
      <stop
         stop-color="#1a75ff"
         offset="0"
         id="stop3" />
      <stop
         stop-color="#ffffff"
         offset="1"
         id="stop4" />
    </radialGradient>
    <radialGradient
       id="b"
       cx="5.3999925"
       cy="1034.7039"
       r="4"
       gradientTransform="matrix(1.9642759,-1.9660222,1.1785882,1.1796095,-1221.5255,-1189.3522)"
       gradientUnits="userSpaceOnUse">
      <stop
         stop-color="#ff1919"
         offset="0"
         id="stop5" />
      <stop
         stop-color="#ffffff"
         offset="1"
         id="stop6" />
    </radialGradient>
  </defs>
  <circle
     cx="7"
     cy="6.9999828"
     r="5.5"
     fill="url(#a)"
     fill-rule="evenodd"
     stroke="#198d19"
     stroke-linecap="square"
     style="fill:url(#a);stroke-linejoin:round;paint-order:normal"
     id="circle6" />
  <ellipse
     cx="19"
     cy="6.9999828"
     rx="5.5"
     ry="5.504827"
     fill="url(#c)"
     fill-rule="evenodd"
     stroke="#1a75ff"
     stroke-linecap="square"
     style="fill:url(#c);stroke-linejoin:round;paint-order:normal"
     id="ellipse6" />
  <ellipse
     cx="7"
     cy="19.004866"
     rx="5.5"
     ry="5.504827"
     fill="url(#b)"
     fill-rule="evenodd"
     stroke="#ff1a1a"
     stroke-linecap="square"
     style="fill:url(#b);stroke-linejoin:round;paint-order:normal"
     id="ellipse7" />
  <path
     d="M 16.075279,16.0753 20.317976,20.318 23.5,17.136 29.864046,23.5 26.682022,26.6821"
     fill="none"
     stroke="#2a7efe"
     stroke-linecap="round"
     stroke-width="2.70004"
     id="path7"
     style="stroke-linejoin:round" />
  <path
     d="m 34.106743,34.1068 -4.242697,-4.2427 -3.182024,3.182 -6.364046,-6.364 L 23.5,23.5"
     fill="none"
     stroke="#ff1a1a"
     stroke-linecap="round"
     stroke-width="2.70004"
     id="path8"
     style="stroke-linejoin:round" />
</svg>
