<?xml version="1.0" encoding="UTF-8" standalone="no"?>
<svg
   height="32"
   viewBox="0 0 8.4666664 8.4666671"
   width="32"
   version="1.1"
   id="svg159"
   sodipodi:docname="Chart_11_32.svg"
   inkscape:export-filename="Chart_11_32.png"
   inkscape:export-xdpi="96"
   inkscape:export-ydpi="96"
   inkscape:version="1.2 (dc2aedaf03, 2022-05-15)"
   xmlns:inkscape="http://www.inkscape.org/namespaces/inkscape"
   xmlns:sodipodi="http://sodipodi.sourceforge.net/DTD/sodipodi-0.dtd"
   xmlns:xlink="http://www.w3.org/1999/xlink"
   xmlns="http://www.w3.org/2000/svg"
   xmlns:svg="http://www.w3.org/2000/svg">
  <defs
     id="defs163">
    <linearGradient
       inkscape:collect="always"
       id="linearGradient5087">
      <stop
         style="stop-color:#ffffff;stop-opacity:1"
         offset="0"
         id="stop5085" />
      <stop
         style="stop-color:#ffd42a;stop-opacity:1;"
         offset="1"
         id="stop5083" />
    </linearGradient>
    <linearGradient
       inkscape:collect="always"
       id="linearGradient5077">
      <stop
         style="stop-color:#ffffff;stop-opacity:1"
         offset="0"
         id="stop5075" />
      <stop
         style="stop-color:#ff5555;stop-opacity:1;"
         offset="1"
         id="stop5073" />
    </linearGradient>
    <linearGradient
       inkscape:collect="always"
       id="linearGradient5067">
      <stop
         style="stop-color:#ffffff;stop-opacity:1"
         offset="0"
         id="stop5065" />
      <stop
         style="stop-color:#87decd;stop-opacity:1;"
         offset="1"
         id="stop5063" />
    </linearGradient>
    <linearGradient
       inkscape:collect="always"
       xlink:href="#linearGradient5067"
       id="linearGradient5069"
       x1="1.058334"
       y1="5.8208331"
       x2="3.1750004"
       y2="5.8208331"
       gradientUnits="userSpaceOnUse" />
    <linearGradient
       inkscape:collect="always"
       xlink:href="#linearGradient5077"
       id="linearGradient5079"
       x1="3.1750004"
       y1="5.0270832"
       x2="5.2916671"
       y2="5.0270832"
       gradientUnits="userSpaceOnUse" />
    <linearGradient
       inkscape:collect="always"
       xlink:href="#linearGradient5087"
       id="linearGradient5089"
       x1="5.2916675"
       y1="4.2333333"
       x2="7.4083342"
       y2="4.2333333"
       gradientUnits="userSpaceOnUse" />
    <radialGradient
       id="a"
       cx="-11.5"
       cy="8.5"
       gradientTransform="rotate(90,-11.5,8.5)"
       gradientUnits="userSpaceOnUse"
       r="3.5">
      <stop
         offset="0"
         stop-color="#fff"
         id="stop1128" />
      <stop
         offset="1"
         stop-color="#d5e5ff"
         id="stop1130" />
    </radialGradient>
    <linearGradient
       id="b"
       gradientTransform="matrix(0.62056934,0,0,0.56353613,-23.504776,9.082872)"
       gradientUnits="userSpaceOnUse"
       x1="52.5"
       x2="61.5"
       y1="7"
       y2="7">
      <stop
         offset="0"
         stop-color="#fc0"
         id="stop1133" />
      <stop
         offset=".37840304"
         stop-color="#f9f9f9"
         id="stop1135" />
      <stop
         offset="1"
         stop-color="#ffd42a"
         id="stop1137" />
    </linearGradient>
    <radialGradient
       id="c"
       cx="33.463123"
       cy="-1.059664"
       gradientTransform="matrix(0.43551876,-0.33713307,0.33873716,0.43345666,-2.118107,21.63975)"
       gradientUnits="userSpaceOnUse"
       r="5.5">
      <stop
         offset="0"
         id="stop1140" />
      <stop
         offset="1"
         stop-color="#ccc"
         id="stop1142" />
    </radialGradient>
  </defs>
  <sodipodi:namedview
     id="namedview161"
     pagecolor="#ffffff"
     bordercolor="#666666"
     borderopacity="1.0"
     inkscape:showpageshadow="2"
     inkscape:pageopacity="0.0"
     inkscape:pagecheckerboard="0"
     inkscape:deskcolor="#d1d1d1"
     showgrid="true"
     inkscape:zoom="28.6875"
     inkscape:cx="15.982571"
     inkscape:cy="16"
     inkscape:current-layer="svg159">
    <inkscape:grid
       type="xygrid"
       id="grid5456" />
  </sodipodi:namedview>
  <path
     d="M 3.0427084,3.3072918 H 1.190626 v 5.0270826 h 1.8520824 z"
     fill="#87decd"
     stroke="#5fd3bc"
     id="path145"
     style="stroke-width:0.264584;stroke-linecap:round;stroke-dashoffset:1.49998;fill-opacity:1;fill:url(#linearGradient5069)" />
  <path
     d="M 7.2760422,0.13229197 H 5.4239595 V 8.3343746 h 1.8520827 z"
     fill="#ffd42a"
     stroke="#ffcc00"
     id="path147"
     style="stroke-width:0.264584;stroke-linecap:round;stroke-dashoffset:1.49998;fill-opacity:1;fill:url(#linearGradient5089)" />
  <path
     d="M 5.1593751,1.7197919 H 3.3072924 v 6.6145825 h 1.8520827 z"
     fill="#ff5555"
     stroke="#ff5252"
     id="path149"
     style="stroke-width:0.264584;stroke-linecap:round;stroke-dashoffset:1.49998;fill-opacity:1;fill:url(#linearGradient5079)" />
  <g
     transform="scale(0.52916668)"
     id="g1155">
    <path
       d="m 9,11 h 6 v 4 H 9 Z"
       fill="url(#a)"
       stroke="#ffffff"
       stroke-linejoin="round"
       stroke-width="2"
       id="path1145"
       style="fill:url(#a)" />
    <path
       d="m 9,11 h 6 v 4 H 9 Z"
       fill="url(#b)"
       stroke="#d4aa00"
       stroke-linejoin="round"
       stroke-width="0.5"
       id="path1147"
       style="fill:url(#b)" />
    <g
       transform="translate(-0.096763)"
       id="g1153">
      <path
         d="M 9.9675596,10.746555 V 9.4353494 c 0,-1.2069325 0.9532764,-2.1853444 2.1292044,-2.1853444 1.175927,0 2.129203,0.9784119 2.129203,2.1853444 v 1.3112056"
         fill="none"
         stroke="#ffffff"
         stroke-width="2.50001"
         id="path1149" />
      <path
         d="m 12.096764,6.7202245 c -1.464178,0 -2.6615064,1.1916583 -2.6615062,2.6489023 V 10.75 H 10.322427 V 9.3691268 c 0,-0.9366719 0.833209,-1.7659349 1.774337,-1.7659349 0.941127,0 1.774337,0.829263 1.774337,1.7659349 V 10.75 h 0.887167 V 9.3691268 c 0,-1.457244 -1.197327,-2.6489023 -2.661504,-2.6489023 z"
         fill="url(#c)"
         stroke-width="0.599999"
         id="path1151"
         style="fill:url(#c)" />
    </g>
  </g>
</svg>
