<svg width="36" height="36" version="1.1" viewBox="0 0 36 36" xmlns="http://www.w3.org/2000/svg">
 <defs>
  <linearGradient id="a" x1="33" x2="36" y1="1037.3622" y2="1037.3622" gradientTransform="matrix(1.5477481,1.5452875,-1.3677242,1.3655499,1392.527,-1455.9736)" gradientUnits="userSpaceOnUse">
   <stop stop-color="#999" offset="0"/>
   <stop stop-color="#fff" offset=".49999997"/>
   <stop stop-color="#999" offset="1"/>
  </linearGradient>
  <linearGradient id="b" x1="33" x2="36" y1="1035.3622" y2="1035.3622" gradientTransform="matrix(1.5477481,1.5452875,-1.3677242,1.3655499,1392.527,-1455.9736)" gradientUnits="userSpaceOnUse">
   <stop stop-color="#a00" offset="0"/>
   <stop stop-color="#f00" offset=".51070523"/>
   <stop stop-color="#a00" offset="1"/>
  </linearGradient>
  <linearGradient id="c" x1="33" x2="36" y1="1041.8622" y2="1041.8622" gradientTransform="matrix(1.5477481,1.5452875,-1.434536,1.4322555,1461.9371,-1525.2734)" gradientUnits="userSpaceOnUse">
   <stop stop-color="#a05a2c" offset="0"/>
   <stop stop-color="#ff0" offset=".26457807"/>
   <stop stop-color="#ff0" offset=".75078517"/>
   <stop stop-color="#a05a2c" offset="1"/>
  </linearGradient>
 </defs>
 <g transform="translate(0,3.9999994)">
  <path d="m28.880533 5-16.946358 16.916682-2.6800673 6.0192c-0.4861147 1.093425-0.2666099 2.321824 0.5885018 3.178557 0.8551155 0.856728 2.1842565 1.168558 3.1849675 0.591715l6.028782-2.684077 16.943641-16.913929z" color="#000000" fill="#ffffff" style="-inkscape-stroke:none"/>
  <path d="m25.784982 10.584601 4.643243 4.635863-3.095497 3.090575-4.643243-4.635863z" fill="url(#a)" fill-rule="evenodd" stroke-width="1.65953"/>
  <path d="m28.880476 7.4940259 4.643237 4.6358701-3.111657 3.10671-4.627074-4.652005z" fill="url(#b)" fill-rule="evenodd" stroke-width="1.65953"/>
  <path d="m22.689485 13.675176 4.643243 4.635863-9.286487 9.271724-4.643244-4.635862z" fill="url(#c)" fill-rule="evenodd" stroke-width="1.65953"/>
  <path d="m13.402997 22.946901-1.90174 4.282434 2.255731 2.252145 4.289253-1.898717z" fill="#d38d5f" fill-rule="evenodd" stroke-width="1.57657"/>
  <path d="m12.629123 29.900695a1.0944232 1.0926833 0 0 1-1.547749 0 1.0944232 1.0926833 0 0 1 0-1.545286 1.0944232 1.0926833 0 0 1 1.547749 0 1.0944232 1.0926833 0 0 1 0 1.545286zm-1.127866-2.67136 2.255731 2.252145-1.458147 0.645475-1.444086-1.441789z" fill="#333333" stroke-dashoffset="1.49998" stroke-linecap="round" stroke-linejoin="round" stroke-width="2.0807"/>
 </g>
</svg>
