<?xml version="1.0" encoding="UTF-8" standalone="no"?>
<svg
   width="24"
   height="24"
   version="1.1"
   viewBox="0 0 24 24"
   id="svg10"
   sodipodi:docname="tticalendar.svg"
   inkscape:version="1.3.2 (091e20e, 2023-11-25, custom)"
   xmlns:inkscape="http://www.inkscape.org/namespaces/inkscape"
   xmlns:sodipodi="http://sodipodi.sourceforge.net/DTD/sodipodi-0.dtd"
   xmlns="http://www.w3.org/2000/svg"
   xmlns:svg="http://www.w3.org/2000/svg">
  <sodipodi:namedview
     id="namedview10"
     pagecolor="#ffffff"
     bordercolor="#000000"
     borderopacity="0.25"
     inkscape:showpageshadow="2"
     inkscape:pageopacity="0.0"
     inkscape:pagecheckerboard="0"
     inkscape:deskcolor="#d1d1d1"
     showgrid="true"
     inkscape:current-layer="svg10">
    <inkscape:grid
       id="grid10"
       units="px"
       originx="0"
       originy="0"
       spacingx="0.5"
       spacingy="0.5"
       empcolor="#0099e5"
       empopacity="0.30196078"
       color="#0099e5"
       opacity="0.14901961"
       empspacing="2"
       dotted="false"
       gridanglex="30"
       gridanglez="30"
       visible="true" />
  </sodipodi:namedview>
  <defs
     id="defs6">
    <radialGradient
       id="a"
       cx="5.3999925"
       cy="1034.7039"
       r="4"
       gradientTransform="matrix(1.2499938,-1.2500079,0.75001073,0.75000232,-776.78893,-763.28024)"
       gradientUnits="userSpaceOnUse">
      <stop
         stop-color="#198d19"
         offset="0"
         id="stop1" />
      <stop
         stop-color="#ffffff"
         offset="1"
         id="stop2" />
    </radialGradient>
    <radialGradient
       id="c"
       cx="5.3999925"
       cy="1034.7039"
       r="4"
       gradientTransform="matrix(1.2499938,-1.2500079,0.75001073,0.75000232,-768.78893,-763.28022)"
       gradientUnits="userSpaceOnUse">
      <stop
         stop-color="#1a75ff"
         offset="0"
         id="stop3" />
      <stop
         stop-color="#ffffff"
         offset="1"
         id="stop4" />
    </radialGradient>
    <radialGradient
       id="b"
       cx="5.3999925"
       cy="1034.7039"
       r="4"
       gradientTransform="matrix(1.2499938,-1.2500079,0.75001073,0.75000232,-776.78893,-755.2802)"
       gradientUnits="userSpaceOnUse">
      <stop
         stop-color="#ff1919"
         offset="0"
         id="stop5" />
      <stop
         stop-color="#ffffff"
         offset="1"
         id="stop6" />
    </radialGradient>
  </defs>
  <rect
     x="10.244734"
     y="12.244734"
     width="11.510531"
     height="11.010549"
     fill="#ffffff"
     stroke="#999999"
     stroke-linecap="round"
     stroke-width="0.489468"
     style="paint-order:normal"
     id="rect6" />
  <path
     d="m 11,10 h 9.999983 A 1.0000174,1.0000174 0 0 1 22,11 v 2 H 10 v -2 a 1,1 0 0 1 1,-1 z"
     fill="#d40000"
     style="paint-order:normal"
     id="path6" />
  <path
     d="m 14.402066,20.589 v -5.1781 l -1.541105,0.9863"
     fill="none"
     stroke="#4d4d4d"
     stroke-linecap="round"
     stroke-linejoin="round"
     stroke-width="0.821922"
     id="path7" />
  <path
     d="m 18.160274,15.411 -1.698976,3.1081 m -0.150339,0.5905 c 0,-0.6809 0.551977,-1.2329 1.232877,-1.2329 0.680899,0 1.232876,0.552 1.232876,1.2329 v 0.2466 c 0,0.6808 -0.551977,1.2328 -1.232876,1.2328 -0.6809,0 -1.232877,-0.552 -1.232877,-1.2328 z"
     fill="none"
     stroke="#4d4d4d"
     stroke-linecap="round"
     stroke-linejoin="round"
     stroke-width="0.821918"
     id="path8" />
  <circle
     cx="5"
     cy="4.9999828"
     r="3.5"
     fill="url(#a)"
     fill-rule="evenodd"
     stroke="#198d19"
     stroke-linecap="square"
     stroke-linejoin="round"
     style="fill:url(#a);paint-order:normal"
     id="circle8" />
  <circle
     cx="13"
     cy="4.9999828"
     r="3.5"
     fill="url(#c)"
     fill-rule="evenodd"
     stroke="#1a75ff"
     stroke-linecap="square"
     stroke-linejoin="round"
     style="fill:url(#c);paint-order:normal"
     id="circle9" />
  <circle
     cx="5"
     cy="12.999983"
     r="3.5"
     fill="url(#b)"
     fill-rule="evenodd"
     stroke="#ff1a1a"
     stroke-linecap="square"
     stroke-linejoin="round"
     style="fill:url(#b);paint-order:normal"
     id="circle10" />
</svg>
