<?xml version="1.0" encoding="UTF-8" standalone="no"?>
<svg
   height="36"
   viewBox="0 0 9.5249997 9.5250005"
   width="36"
   version="1.1"
   id="svg500"
   sodipodi:docname="Cube_01_36.svg"
   inkscape:version="1.2 (dc2aedaf03, 2022-05-15)"
   inkscape:export-filename="Cube_01_36.png"
   inkscape:export-xdpi="96"
   inkscape:export-ydpi="96"
   xmlns:inkscape="http://www.inkscape.org/namespaces/inkscape"
   xmlns:sodipodi="http://sodipodi.sourceforge.net/DTD/sodipodi-0.dtd"
   xmlns="http://www.w3.org/2000/svg"
   xmlns:svg="http://www.w3.org/2000/svg">
  <defs
     id="defs504" />
  <sodipodi:namedview
     id="namedview502"
     pagecolor="#ffffff"
     bordercolor="#666666"
     borderopacity="1.0"
     inkscape:showpageshadow="2"
     inkscape:pageopacity="0.0"
     inkscape:pagecheckerboard="0"
     inkscape:deskcolor="#d1d1d1"
     showgrid="true"
     inkscape:zoom="25.5"
     inkscape:cx="16.039216"
     inkscape:cy="18"
     inkscape:current-layer="svg500">
    <inkscape:grid
       type="xygrid"
       id="grid1268" />
  </sodipodi:namedview>
  <g
     id="g1000"
     transform="matrix(11.792692,0,0,11.78804,0.34024055,0.46101338)"
     style="stroke:#00aad4;stroke-width:1.07714;stroke-opacity:1">
    <path
       style="fill:none;stroke:#00aad4;stroke-width:0.0504907px;stroke-linecap:round;stroke-linejoin:round;stroke-opacity:1"
       d="M 0.046875,0.1875 0.375,0.05180081 0.703125,0.1875 0.375,0.29924904 Z"
       id="path436"
       sodipodi:nodetypes="ccccc" />
    <path
       style="fill:none;stroke:#00aad4;stroke-width:0.0504907px;stroke-linecap:round;stroke-linejoin:round;stroke-opacity:1"
       d="m 0.046875,0.1875 v 0.375 L 0.375,0.67800422 0.703125,0.5625 v -0.375"
       id="path438"
       sodipodi:nodetypes="ccccc" />
    <path
       style="fill:none;stroke:#00aad4;stroke-width:0.0504907px;stroke-linecap:round;stroke-linejoin:round;stroke-opacity:1"
       d="M 0.375,0.29924904 V 0.67800422"
       id="path440"
       sodipodi:nodetypes="cc" />
  </g>
</svg>
