<?xml version="1.0" encoding="UTF-8" standalone="no"?>
<svg
   height="24"
   viewBox="0 0 6.3499998 6.3500003"
   width="24"
   version="1.1"
   id="svg151"
   sodipodi:docname="Database_11_24.svg"
   inkscape:export-filename="Database_11_24.png"
   inkscape:export-xdpi="96"
   inkscape:export-ydpi="96"
   inkscape:version="1.2.1 (9c6d41e410, 2022-07-14)"
   xmlns:inkscape="http://www.inkscape.org/namespaces/inkscape"
   xmlns:sodipodi="http://sodipodi.sourceforge.net/DTD/sodipodi-0.dtd"
   xmlns="http://www.w3.org/2000/svg"
   xmlns:svg="http://www.w3.org/2000/svg">
  <defs
     id="defs155" />
  <sodipodi:namedview
     id="namedview153"
     pagecolor="#ffffff"
     bordercolor="#666666"
     borderopacity="1.0"
     inkscape:showpageshadow="2"
     inkscape:pageopacity="0.0"
     inkscape:pagecheckerboard="0"
     inkscape:deskcolor="#d1d1d1"
     showgrid="true"
     inkscape:zoom="38.25"
     inkscape:cx="10.052288"
     inkscape:cy="12"
     inkscape:current-layer="svg151">
    <inkscape:grid
       type="xygrid"
       id="grid850" />
  </sodipodi:namedview>
  <path
     id="path141"
     style="fill:#00aad4;stroke-width:0.529169;stroke-linecap:round;stroke-linejoin:round;stroke-miterlimit:5.6"
     d="M 2.9104167 0.396875 C 1.5953326 0.396875 0.52916667 0.81149934 0.52916667 1.3229167 L 0.52916667 2.0639567 C 0.52916667 2.575374 1.5953326 2.9899984 2.9104167 2.9899984 C 3.046203 2.9899984 3.1792629 2.9850534 3.308842 2.9765625 A 2.1166668 2.1166668 0 0 1 4.6302084 2.5135417 A 2.1166668 2.1166668 0 0 1 4.9547364 2.5388631 C 5.1685815 2.3999748 5.2916667 2.2376057 5.2916667 2.0639567 L 5.2916667 1.3327352 L 5.2916667 1.3229167 C 5.2916667 0.81149934 4.2255012 0.396875 2.9104167 0.396875 z M 2.9104167 0.95239665 C 4.0105749 0.95239665 4.7291653 1.3084449 5.0668742 1.5885335 C 4.7299231 1.8182932 4.0132908 2.0798493 2.9104167 2.0639567 C 1.8185045 2.0481584 1.1020377 1.79064 0.76119385 1.5714803 C 1.1000895 1.290364 1.8121778 0.95239665 2.9104167 0.95239665 z M 0.52916667 2.6194784 L 0.52916667 3.54552 C 0.52916667 4.0053334 1.3910366 4.3868373 2.5207764 4.4591594 A 2.1166668 2.1166668 0 0 1 2.8142985 3.5444865 C 1.5438568 3.5248339 0.52916667 3.1183532 0.52916667 2.6194784 z M 0.52916667 4.1010417 L 0.52916667 5.0270834 C 0.52916667 5.5385012 1.5953313 5.953125 2.9104167 5.953125 C 2.9329589 5.953125 2.9552042 5.9528503 2.9775961 5.9526083 A 2.1166668 2.1166668 0 0 1 2.5507487 5.0162313 C 1.4062609 4.948814 0.52916667 4.5649281 0.52916667 4.1010417 z " />
  <g
     fill="none"
     stroke="#ff2828"
     stroke-linecap="round"
     stroke-width="1.5"
     transform="matrix(0.25478396,0,0,0.25478396,0.36257707,0.23518522)"
     id="g276">
    <circle
       cx="16.75"
       cy="17.25"
       r="6"
       stroke-dashoffset="1.49998"
       stroke-linejoin="round"
       id="circle270" />
    <path
       d="m 14.5,14.75 4.5,4.5"
       id="path272" />
    <path
       d="m 19,14.75 -4.5,4.5"
       id="path274" />
  </g>
</svg>
