<?xml version="1.0" encoding="UTF-8" standalone="no"?>
<svg
   width="36"
   height="36"
   version="1.1"
   viewBox="0 0 36 36"
   id="svg14"
   sodipodi:docname="tlazcomponentqueue_150.svg"
   inkscape:export-filename="tlazcomponentqueue_150.png"
   inkscape:export-xdpi="96"
   inkscape:export-ydpi="96"
   inkscape:version="1.3.2 (091e20e, 2023-11-25, custom)"
   xmlns:inkscape="http://www.inkscape.org/namespaces/inkscape"
   xmlns:sodipodi="http://sodipodi.sourceforge.net/DTD/sodipodi-0.dtd"
   xmlns:xlink="http://www.w3.org/1999/xlink"
   xmlns="http://www.w3.org/2000/svg"
   xmlns:svg="http://www.w3.org/2000/svg">
  <sodipodi:namedview
     id="namedview14"
     pagecolor="#ffffff"
     bordercolor="#000000"
     borderopacity="0.25"
     inkscape:showpageshadow="2"
     inkscape:pageopacity="0.0"
     inkscape:pagecheckerboard="0"
     inkscape:deskcolor="#d1d1d1"
     showgrid="true"
     inkscape:current-layer="svg14">
    <inkscape:grid
       id="grid14"
       units="px"
       originx="0"
       originy="0"
       spacingx="0.5"
       spacingy="0.5"
       empcolor="#0099e5"
       empopacity="0.30196078"
       color="#0099e5"
       opacity="0.14901961"
       empspacing="2"
       dotted="false"
       gridanglex="30"
       gridanglez="30"
       visible="true" />
  </sodipodi:namedview>
  <defs
     id="defs6">
    <radialGradient
       id="i"
       cx="5.3999925"
       cy="1034.7039"
       r="4"
       gradientTransform="matrix(2.0089187,-2.0089413,1.2053744,1.2053609,-1226.4465,-1219.2359)"
       gradientUnits="userSpaceOnUse"
       xlink:href="#b" />
    <linearGradient
       id="b">
      <stop
         stop-color="#1a75ff"
         offset="0"
         id="stop1" />
      <stop
         stop-color="#ffffff"
         offset="1"
         id="stop2" />
    </linearGradient>
    <radialGradient
       id="h"
       cx="5.3999925"
       cy="1034.7039"
       r="4"
       gradientTransform="matrix(2.0089187,-2.0089413,1.2053744,1.2053609,-1227.9465,-1226.736)"
       gradientUnits="userSpaceOnUse"
       xlink:href="#c" />
    <linearGradient
       id="c">
      <stop
         stop-color="#ff1919"
         offset="0"
         id="stop3" />
      <stop
         stop-color="#ffffff"
         offset="1"
         id="stop4" />
    </linearGradient>
    <radialGradient
       id="g"
       cx="5.3999925"
       cy="1034.7039"
       r="4"
       gradientTransform="matrix(2.0089187,-2.0089413,1.2053744,1.2053609,-1232.4465,-1222.2359)"
       gradientUnits="userSpaceOnUse"
       xlink:href="#a" />
    <linearGradient
       id="a">
      <stop
         stop-color="#198d19"
         offset="0"
         id="stop5" />
      <stop
         stop-color="#ffffff"
         offset="1"
         id="stop6" />
    </linearGradient>
    <radialGradient
       id="f"
       cx="5.3999925"
       cy="1034.7039"
       r="4"
       gradientTransform="matrix(2.0089187,-2.0089413,1.2053744,1.2053609,-1244.4465,-1219.2359)"
       gradientUnits="userSpaceOnUse"
       xlink:href="#b" />
    <radialGradient
       id="e"
       cx="5.3999925"
       cy="1034.7039"
       r="4"
       gradientTransform="matrix(2.0089187,-2.0089413,1.2053744,1.2053609,-1245.9465,-1226.736)"
       gradientUnits="userSpaceOnUse"
       xlink:href="#c" />
    <radialGradient
       id="d"
       cx="5.3999925"
       cy="1034.7039"
       r="4"
       gradientTransform="matrix(2.0089187,-2.0089413,1.2053744,1.2053609,-1250.4465,-1222.2359)"
       gradientUnits="userSpaceOnUse"
       xlink:href="#a" />
  </defs>
  <path
     d="M 8.5,24.5 4,29 8.5,33.5"
     fill="none"
     stroke="#2a7efe"
     stroke-linecap="round"
     stroke-width="2"
     id="path6" />
  <path
     d="M 16.5,24.5 12,29 l 4.5,4.5"
     fill="none"
     stroke="#2a7efe"
     stroke-linecap="round"
     stroke-width="2"
     id="path7" />
  <path
     d="M 24.5,24.5 20,29 l 4.5,4.5"
     fill="none"
     stroke="#2a7efe"
     stroke-linecap="round"
     stroke-width="2"
     id="path8" />
  <path
     d="M 32.5,24.5 28,29 l 4.5,4.5"
     fill="none"
     stroke="#2a7efe"
     stroke-linecap="round"
     stroke-width="2"
     id="path9" />
  <circle
     cx="6"
     cy="12.499983"
     r="5.625"
     fill="url(#d)"
     fill-rule="evenodd"
     stroke="#198d19"
     stroke-linecap="square"
     stroke-linejoin="round"
     stroke-width="0.75"
     style="fill:url(#d);paint-order:normal"
     id="circle9" />
  <circle
     cx="10.5"
     cy="7.9999828"
     r="5.625"
     fill="url(#e)"
     fill-rule="evenodd"
     stroke="#ff1a1a"
     stroke-linecap="square"
     stroke-linejoin="round"
     stroke-opacity="0.92549"
     stroke-width="0.75"
     style="fill:url(#e);paint-order:normal"
     id="circle10" />
  <circle
     cx="12"
     cy="15.499983"
     r="5.625"
     fill="url(#f)"
     fill-rule="evenodd"
     stroke="#1a75ff"
     stroke-linecap="square"
     stroke-linejoin="round"
     stroke-width="0.75"
     style="fill:url(#f);paint-order:normal"
     id="circle11" />
  <circle
     cx="24"
     cy="12.499983"
     r="5.625"
     fill="url(#g)"
     fill-rule="evenodd"
     stroke="#198d19"
     stroke-linecap="square"
     stroke-linejoin="round"
     stroke-width="0.75"
     style="fill:url(#g);paint-order:normal"
     id="circle12" />
  <circle
     cx="28.5"
     cy="7.9999828"
     r="5.625"
     fill="url(#h)"
     fill-rule="evenodd"
     stroke="#ff1a1a"
     stroke-linecap="square"
     stroke-linejoin="round"
     stroke-opacity="0.92549"
     stroke-width="0.75"
     style="fill:url(#h);paint-order:normal"
     id="circle13" />
  <circle
     cx="30"
     cy="15.499983"
     r="5.625"
     fill="url(#i)"
     fill-rule="evenodd"
     stroke="#1a75ff"
     stroke-linecap="square"
     stroke-linejoin="round"
     stroke-width="0.75"
     style="fill:url(#i);paint-order:normal"
     id="circle14" />
</svg>
