<?xml version="1.0" encoding="UTF-8" standalone="no"?>
<svg
   height="16"
   width="16"
   version="1.1"
   id="svg13"
   sodipodi:docname="menu_goto_bookmark6.svg"
   inkscape:export-filename="menu_goto_bookmark6.png"
   inkscape:export-xdpi="96"
   inkscape:export-ydpi="96"
   inkscape:version="1.2.2 (732a01da63, 2022-12-09)"
   xmlns:inkscape="http://www.inkscape.org/namespaces/inkscape"
   xmlns:sodipodi="http://sodipodi.sourceforge.net/DTD/sodipodi-0.dtd"
   xmlns="http://www.w3.org/2000/svg"
   xmlns:svg="http://www.w3.org/2000/svg">
  <defs
     id="defs17" />
  <sodipodi:namedview
     id="namedview15"
     pagecolor="#ffffff"
     bordercolor="#666666"
     borderopacity="1.0"
     inkscape:showpageshadow="2"
     inkscape:pageopacity="0.0"
     inkscape:pagecheckerboard="0"
     inkscape:deskcolor="#d1d1d1"
     showgrid="true"
     inkscape:zoom="57.375"
     inkscape:cx="7.9912854"
     inkscape:cy="8"
     inkscape:current-layer="svg13">
    <inkscape:grid
       type="xygrid"
       id="grid1533" />
  </sodipodi:namedview>
  <radialGradient
     id="a"
     cx="8"
     cy="7.5"
     gradientUnits="userSpaceOnUse"
     r="6">
    <stop
       offset="0"
       stop-color="#2a7fff"
       id="stop2" />
    <stop
       offset=".69999999"
       stop-color="#4d94ff"
       id="stop4" />
    <stop
       offset="1"
       stop-color="#96bdff"
       id="stop6" />
  </radialGradient>
  <circle
     cx="8"
     cy="7.5"
     fill="url(#a)"
     r="6"
     id="circle9" />
  <path
     d="m7.4569035 11.75341c-.7341937.027593-1.5280777-.325073-1.8367642-1.024112-.3782291-.8006628-.2839769-1.7361395-.0410544-2.5616518.2502557-.7492288.6639987-1.4275691 1.0042463-2.1371176.3118199-.6177188.6236398-1.2354375.9354597-1.8531562h1.1346006c-.6377831 1.2463416-1.2755662 2.4926832-1.9133493 3.7390248-.0340123-.3748338.3678706-.6009018.6856839-.6695405.656067-.1140812 1.4074597.1336404 1.7589602.725989.3798993.6061111.4154427 1.3612813.3241525 2.0528753-.0946253.672124-.4985634 1.339177-1.1627774 1.573601-.2822877.110009-.5868971.157088-.8891579.154088zm0-1.010826c.4820413.039031.9562441-.337951 1.0038657-.8243632.0974429-.5192142.0319198-1.1538102-.4136092-1.4990065-.4572889-.3382326-1.2442288-.2321333-1.4705772.3315001-.2105007.4827651-.2199425 1.067997.00731 1.5456996.1749331.300733.531975.462334.87301.44617z"
     fill="#fff"
     stroke-width=".999996"
     transform="scale(1.0711211 .93360125)"
     id="path11" />
</svg>
