<?xml version="1.0" encoding="UTF-8" standalone="no"?>
<svg
   width="48"
   height="48"
   version="1.1"
   viewBox="0 0 48 48"
   id="svg11"
   sodipodi:docname="ttispinedit_200.svg"
   inkscape:version="1.3.2 (091e20e, 2023-11-25, custom)"
   xmlns:inkscape="http://www.inkscape.org/namespaces/inkscape"
   xmlns:sodipodi="http://sodipodi.sourceforge.net/DTD/sodipodi-0.dtd"
   xmlns="http://www.w3.org/2000/svg"
   xmlns:svg="http://www.w3.org/2000/svg">
  <sodipodi:namedview
     id="namedview11"
     pagecolor="#ffffff"
     bordercolor="#000000"
     borderopacity="0.25"
     inkscape:showpageshadow="2"
     inkscape:pageopacity="0.0"
     inkscape:pagecheckerboard="0"
     inkscape:deskcolor="#d1d1d1"
     showgrid="true"
     inkscape:current-layer="svg11">
    <inkscape:grid
       id="grid11"
       units="px"
       originx="0"
       originy="0"
       spacingx="0.5"
       spacingy="0.5"
       empcolor="#0099e5"
       empopacity="0.30196078"
       color="#0099e5"
       opacity="0.14901961"
       empspacing="2"
       dotted="false"
       gridanglex="30"
       gridanglez="30"
       visible="true" />
  </sodipodi:namedview>
  <defs
     id="defs6">
    <radialGradient
       id="a"
       cx="5.3999925"
       cy="1034.7039"
       r="4"
       gradientTransform="matrix(2.4999876,-2.5000158,1.5000215,1.5000046,-1553.5779,-1526.5605)"
       gradientUnits="userSpaceOnUse">
      <stop
         stop-color="#198d19"
         offset="0"
         id="stop1" />
      <stop
         stop-color="#ffffff"
         offset="1"
         id="stop2" />
    </radialGradient>
    <radialGradient
       id="c"
       cx="5.3999925"
       cy="1034.7039"
       r="4"
       gradientTransform="matrix(2.4999876,-2.5000158,1.5000215,1.5000046,-1537.5779,-1526.5604)"
       gradientUnits="userSpaceOnUse">
      <stop
         stop-color="#1a75ff"
         offset="0"
         id="stop3" />
      <stop
         stop-color="#ffffff"
         offset="1"
         id="stop4" />
    </radialGradient>
    <radialGradient
       id="b"
       cx="5.3999925"
       cy="1034.7039"
       r="4"
       gradientTransform="matrix(2.4999876,-2.5000158,1.5000215,1.5000046,-1553.5779,-1510.5604)"
       gradientUnits="userSpaceOnUse">
      <stop
         stop-color="#ff1919"
         offset="0"
         id="stop5" />
      <stop
         stop-color="#ffffff"
         offset="1"
         id="stop6" />
    </radialGradient>
  </defs>
  <circle
     cx="10"
     cy="9.9999828"
     r="7"
     fill="url(#a)"
     fill-rule="evenodd"
     stroke="#198d19"
     stroke-linecap="square"
     stroke-width="2"
     style="fill:url(#a);stroke-linejoin:round;paint-order:normal"
     id="circle6" />
  <circle
     cx="26"
     cy="9.9999828"
     r="7"
     fill="url(#c)"
     fill-rule="evenodd"
     stroke="#1a75ff"
     stroke-linecap="square"
     stroke-width="2"
     style="fill:url(#c);stroke-linejoin:round;paint-order:normal"
     id="circle7" />
  <circle
     cx="10"
     cy="25.999983"
     r="7"
     fill="url(#b)"
     fill-rule="evenodd"
     stroke="#ff1a1a"
     stroke-linecap="square"
     stroke-width="2"
     style="fill:url(#b);stroke-linejoin:round;paint-order:normal"
     id="circle8" />
  <rect
     x="10.499998"
     y="27.499983"
     width="22.000002"
     height="20.000006"
     fill="#ffffff"
     stroke="#2a7efe"
     stroke-linecap="round"
     stroke-width="0.999988"
     style="stroke-linejoin:round;paint-order:normal"
     id="rect8" />
  <rect
     x="32.5"
     y="27.499983"
     width="15"
     height="10.000017"
     fill="#ffffff"
     stroke="#2a7efe"
     stroke-linecap="round"
     style="stroke-linejoin:round;paint-order:normal"
     id="rect9" />
  <path
     d="m 40.000001,31.0004 -3,3 h 6 z"
     fill="#666666"
     fill-rule="evenodd"
     stroke="#666666"
     stroke-width="2px"
     id="path9"
     style="stroke-linejoin:round" />
  <rect
     transform="scale(1,-1)"
     x="32.5"
     y="-47.499737"
     width="15"
     height="9.9997387"
     fill="#ffffff"
     stroke="#2a7efe"
     stroke-linecap="round"
     stroke-width="0.999998"
     style="stroke-linejoin:round;paint-order:normal"
     id="rect10" />
  <path
     d="m 40.000001,44 -3,-3 h 6 z"
     fill="#666666"
     fill-rule="evenodd"
     stroke="#666666"
     stroke-width="2px"
     id="path10"
     style="stroke-linejoin:round" />
  <path
     d="m 26.699998,31.8 -3.39954,6.2426 m -0.30082,1.186 c 0,-1.3676 1.104471,-2.4762 2.466907,-2.4762 1.362436,0 2.466907,1.1086 2.466907,2.4762 v 0.4952 c 0,1.3676 -1.104471,2.4762 -2.466907,2.4762 -1.362436,0 -2.466907,-1.1086 -2.466907,-2.4762 z"
     fill="none"
     stroke="#4d4d4d"
     stroke-linecap="round"
     stroke-width="1.6"
     id="path11"
     style="stroke-linejoin:round" />
</svg>
