<?xml version="1.0" encoding="UTF-8" standalone="no"?>
<svg
   height="24"
   width="24"
   version="1.1"
   id="svg135"
   sodipodi:docname="btn_ok_150.svg"
   inkscape:export-filename="btn_ok_150.png"
   inkscape:export-xdpi="96"
   inkscape:export-ydpi="96"
   inkscape:version="1.2.2 (732a01da63, 2022-12-09)"
   xmlns:inkscape="http://www.inkscape.org/namespaces/inkscape"
   xmlns:sodipodi="http://sodipodi.sourceforge.net/DTD/sodipodi-0.dtd"
   xmlns="http://www.w3.org/2000/svg"
   xmlns:svg="http://www.w3.org/2000/svg">
  <defs
     id="defs139" />
  <sodipodi:namedview
     id="namedview137"
     pagecolor="#ffffff"
     bordercolor="#666666"
     borderopacity="1.0"
     inkscape:showpageshadow="2"
     inkscape:pageopacity="0.0"
     inkscape:pagecheckerboard="0"
     inkscape:deskcolor="#d1d1d1"
     showgrid="true"
     inkscape:zoom="38.25"
     inkscape:cx="11.594771"
     inkscape:cy="12"
     inkscape:current-layer="svg135">
    <inkscape:grid
       type="xygrid"
       id="grid390" />
  </sodipodi:namedview>
  <path
     d="m4.5 35.5 4.5 4.5 10.5-10.5"
     fill="none"
     stroke="#0c0"
     stroke-linecap="round"
     stroke-linejoin="round"
     stroke-width="3"
     transform="translate(0 -24)"
     id="path133"
     style="stroke:#01a901" />
</svg>
