<svg width="24" height="24" version="1.1" xmlns="http://www.w3.org/2000/svg">
 <g fill="none" stroke-linecap="round" stroke-linejoin="round" stroke-miterlimit="5.6">
  <path d="m20.00005 20.249962c-0.722626 0.950415-1.857967 1.500015-3.000031 1.500015-2.066588 0-3.750038-1.653974-3.750038-3.750038 0-2.120616 1.692418-3.750038 3.750038-3.750038h4.749958m-3.000324-2.999879 3.000324 2.999879-4.250019 4.250019" stroke="#ffffff" stroke-width="4.50005"/>
  <path d="m20.00005 20.249962c-0.722626 0.950415-1.857967 1.500015-3.000031 1.500015-2.066588 0-3.750038-1.653974-3.750038-3.750038 0-2.120616 1.692418-3.750038 3.750038-3.750038h4.750102m-3.000325-2.999879 3.000325 2.999879-3.000031 3.00003" stroke="#fa0302" stroke-width="1.50002"/>
 </g>
</svg>
