<?xml version="1.0" encoding="UTF-8" standalone="no"?>
<svg
   height="36"
   viewBox="0 0 9.5249997 9.5250005"
   width="36"
   version="1.1"
   id="svg500"
   sodipodi:docname="Print_06_36.svg"
   inkscape:version="1.2.2 (732a01da63, 2022-12-09)"
   inkscape:export-filename="Print_06_36.png"
   inkscape:export-xdpi="96"
   inkscape:export-ydpi="96"
   xmlns:inkscape="http://www.inkscape.org/namespaces/inkscape"
   xmlns:sodipodi="http://sodipodi.sourceforge.net/DTD/sodipodi-0.dtd"
   xmlns="http://www.w3.org/2000/svg"
   xmlns:svg="http://www.w3.org/2000/svg">
  <defs
     id="defs504" />
  <sodipodi:namedview
     id="namedview502"
     pagecolor="#ffffff"
     bordercolor="#666666"
     borderopacity="1.0"
     inkscape:showpageshadow="2"
     inkscape:pageopacity="0.0"
     inkscape:pagecheckerboard="0"
     inkscape:deskcolor="#d1d1d1"
     showgrid="true"
     inkscape:zoom="25.5"
     inkscape:cx="14.705882"
     inkscape:cy="18"
     inkscape:current-layer="svg500">
    <inkscape:grid
       type="xygrid"
       id="grid1268" />
  </sodipodi:namedview>
  <rect
     style="fill:#ebfcff;fill-opacity:1;stroke:#00aad4;stroke-width:0.449792;stroke-linejoin:round;stroke-dasharray:none"
     id="rect1372"
     width="1.3229167"
     height="1.3229167"
     x="7.3157291"
     y="3.6644793"
     ry="0.34395832" />
  <rect
     style="fill:#ebfcff;fill-opacity:1;stroke:#00aad4;stroke-width:0.449792;stroke-linejoin:round;stroke-dasharray:none"
     id="rect1091"
     width="1.3229167"
     height="1.3229167"
     x="0.88635403"
     y="3.6644793"
     ry="0.34395832" />
  <rect
     style="fill:#ffffff;stroke:#00aad4;stroke-width:0.449792;stroke-linejoin:round;stroke-dasharray:none"
     id="rect292"
     width="5.1064582"
     height="4.2333336"
     x="2.2092707"
     y="0.75406235"
     ry="0.4497917" />
  <rect
     style="fill:#c2f3ff;fill-opacity:1;stroke:#00aad4;stroke-width:0.449792;stroke-linejoin:round;stroke-dasharray:none"
     id="rect954"
     width="9.0752077"
     height="3.5189586"
     x="0.224896"
     y="4.9873958"
     ry="0.44979167" />
  <path
     d="M 6.7468748,7.14375 H 7.8052084"
     stroke-linecap="round"
     stroke-linejoin="round"
     id="path10"
     style="fill:none;stroke:#00aad4;stroke-width:0.529167;stroke-miterlimit:4;stroke-dasharray:none" />
  <path
     d="M 3.3072916,2.0769791 H 6.2177084"
     id="path12"
     style="fill:none;stroke:#00aad4;stroke-width:0.449792;stroke-miterlimit:4;stroke-dasharray:none" />
  <path
     d="M 3.3072916,3.3998958 H 6.2177084"
     id="path16"
     style="fill:none;stroke:#00aad4;stroke-width:0.449792;stroke-miterlimit:4;stroke-dasharray:none" />
</svg>
