<?xml version="1.0" encoding="UTF-8" standalone="no"?>
<svg
   height="32"
   width="32"
   version="1.1"
   id="svg24"
   sodipodi:docname="pg_open_recent_200.svg"
   inkscape:export-filename="pg_open_recent_200.png"
   inkscape:export-xdpi="96"
   inkscape:export-ydpi="96"
   inkscape:version="1.3-beta (cedbd6c6ff, 2023-05-28)"
   xmlns:inkscape="http://www.inkscape.org/namespaces/inkscape"
   xmlns:sodipodi="http://sodipodi.sourceforge.net/DTD/sodipodi-0.dtd"
   xmlns="http://www.w3.org/2000/svg"
   xmlns:svg="http://www.w3.org/2000/svg">
  <defs
     id="defs24" />
  <sodipodi:namedview
     id="namedview24"
     pagecolor="#ffffff"
     bordercolor="#000000"
     borderopacity="0.25"
     inkscape:showpageshadow="2"
     inkscape:pageopacity="0.0"
     inkscape:pagecheckerboard="0"
     inkscape:deskcolor="#d1d1d1"
     showgrid="true"
     inkscape:current-layer="svg24">
    <inkscape:grid
       id="grid24"
       units="px"
       originx="0"
       originy="0"
       spacingx="0.5"
       spacingy="0.5"
       empcolor="#0099e5"
       empopacity="0.30196078"
       color="#0099e5"
       opacity="0.14901961"
       empspacing="2"
       dotted="false"
       gridanglex="30"
       gridanglez="30"
       visible="true" />
  </sodipodi:namedview>
  <radialGradient
     id="a"
     cx="4.1672"
     cy="1041.9"
     gradientTransform="matrix(.09149 -.91477 .87251 .087255 -898.34 -62.177)"
     gradientUnits="userSpaceOnUse"
     r="9">
    <stop
       offset="0"
       stop-color="#acf"
       id="stop1" />
    <stop
       offset="1"
       stop-color="#fff"
       id="stop2" />
  </radialGradient>
  <linearGradient
     id="b"
     gradientTransform="matrix(1 0 0 .83333346 29 -10.416668)"
     gradientUnits="userSpaceOnUse"
     x1="-11"
     x2="-5"
     y1="14.5"
     y2="18.5">
    <stop
       offset="0"
       stop-color="#f00"
       id="stop3" />
    <stop
       offset="1"
       stop-color="#fff"
       id="stop4" />
  </linearGradient>
  <linearGradient
     id="c"
     gradientTransform="matrix(1 0 0 .83333339 28 -8.750001)"
     gradientUnits="userSpaceOnUse"
     x1="-3"
     x2="-9"
     y1="26.5"
     y2="22.5">
    <stop
       offset="0"
       stop-color="#06f"
       id="stop5" />
    <stop
       offset="1"
       stop-color="#fff"
       id="stop6" />
  </linearGradient>
  <linearGradient
     id="d"
     gradientTransform="matrix(.83333334 0 0 1 26.5 -13.499999)"
     gradientUnits="userSpaceOnUse"
     x1="-13"
     x2="-9"
     y1="24.5"
     y2="18.5">
    <stop
       offset="0"
       stop-color="#0c0"
       id="stop7" />
    <stop
       offset="1"
       stop-color="#fff"
       id="stop8" />
  </linearGradient>
  <linearGradient
     id="e"
     gradientTransform="matrix(.83333332 0 0 1 28.166667 -12.499999)"
     gradientUnits="userSpaceOnUse"
     x1="-1"
     x2="-5"
     y1="16.5"
     y2="22.5">
    <stop
       offset="0"
       stop-color="#fc0"
       id="stop9" />
    <stop
       offset="1"
       stop-color="#fff"
       id="stop10" />
  </linearGradient>
  <linearGradient
     id="f"
     gradientUnits="userSpaceOnUse"
     x1="14"
     x2="15.5"
     y1="18"
     y2="26">
    <stop
       offset="0"
       stop-color="#f4e1a6"
       id="stop11" />
    <stop
       offset="1"
       stop-color="#f4c731"
       id="stop12" />
  </linearGradient>
  <g
     stroke-linecap="round"
     stroke-linejoin="round"
     id="g13">
    <path
       d="m.999977 27-.00009698-20.00012c0-1.0000001.99999998-2 1.99999998-2h5.9999995c1 0 2.0000015.9999999 2.0000015 2v.9999999h16.000119v7.0001201"
       fill="#fff3cc"
       stroke="#d4aa00"
       stroke-width="1.99976"
       id="path12" />
    <path
       d="m31 15h-26.0000234l-3.9999996 12h26.000023z"
       fill="url(#f)"
       stroke="#d4aa00"
       stroke-width="2"
       id="path13" />
    <circle
       cx="9.5"
       cy="22.5"
       fill="url(#a)"
       r="8.0769"
       stroke="#999"
       stroke-width="1.6"
       id="circle13" />
  </g>
  <path
     d="m9.5 16v6.5h4.5"
     fill="none"
     stroke="#666"
     id="path14" />
  <g
     stroke-linecap="round"
     stroke-linejoin="round"
     id="g24">
    <g
       fill="#08a"
       id="g20">
      <g
         stroke-width="1.724"
         id="g18">
        <circle
           cx="5.5"
           cy="18.5"
           r=".5"
           id="circle14" />
        <circle
           cx="9.5"
           cy="28.75"
           r=".5"
           id="circle15" />
        <circle
           cx="13.5"
           cy="26.5"
           r=".5"
           id="circle16" />
        <circle
           cx="5.5"
           cy="26.5"
           r=".5"
           id="circle17" />
        <circle
           cx="3.5"
           cy="22.5"
           r=".5"
           id="circle18" />
      </g>
      <circle
         cx="15.5"
         cy="22.5"
         r=".5"
         stroke-width="1.14933"
         id="circle19" />
      <circle
         cx="13.5"
         cy="18.5"
         r=".5"
         stroke-width="1.724"
         id="circle20" />
    </g>
    <path
       d="m14 0h10v5h-10z"
       fill="url(#b)"
       stroke-width="1.61626"
       id="path20" />
    <g
       stroke-width="1.61625"
       id="g23">
      <path
         d="m19 10h10v5h-10z"
         fill="url(#c)"
         id="path21" />
      <path
         d="m14 15v-10h5v10z"
         fill="url(#d)"
         id="path22" />
      <path
         d="m24 10v-10h5v10z"
         fill="url(#e)"
         id="path23" />
    </g>
    <path
       d="m19 5h5v5h-5z"
       stroke-width="4"
       id="path24" />
  </g>
</svg>
