<?xml version="1.0" encoding="UTF-8" standalone="no"?>
<svg
   height="36"
   viewBox="0 0 9.5249997 9.5250005"
   width="36"
   version="1.1"
   id="svg500"
   sodipodi:docname="Arrow_44_36.svg"
   inkscape:version="1.2.1 (9c6d41e410, 2022-07-14)"
   inkscape:export-filename="Arrow_44_36.png"
   inkscape:export-xdpi="96"
   inkscape:export-ydpi="96"
   xmlns:inkscape="http://www.inkscape.org/namespaces/inkscape"
   xmlns:sodipodi="http://sodipodi.sourceforge.net/DTD/sodipodi-0.dtd"
   xmlns="http://www.w3.org/2000/svg"
   xmlns:svg="http://www.w3.org/2000/svg">
  <defs
     id="defs504" />
  <sodipodi:namedview
     id="namedview502"
     pagecolor="#ffffff"
     bordercolor="#666666"
     borderopacity="1.0"
     inkscape:showpageshadow="2"
     inkscape:pageopacity="0.0"
     inkscape:pagecheckerboard="0"
     inkscape:deskcolor="#d1d1d1"
     showgrid="true"
     inkscape:zoom="25.5"
     inkscape:cx="17.980392"
     inkscape:cy="18"
     inkscape:current-layer="svg500">
    <inkscape:grid
       type="xygrid"
       id="grid1268" />
  </sodipodi:namedview>
  <g
     id="g3677"
     transform="matrix(1.5000322,0,0,1.5000322,-1.2768829e-5,-2.1281091e-5)">
    <path
       style="fill:none;stroke:#00aad4;stroke-width:0.396875;stroke-linecap:round;stroke-linejoin:round;stroke-miterlimit:5.6;stroke-dasharray:none;stroke-opacity:1"
       id="path1741"
       sodipodi:type="arc"
       sodipodi:cx="-4.6963544"
       sodipodi:cy="1.9182292"
       sodipodi:rx="1.0583334"
       sodipodi:ry="1.0583334"
       sodipodi:start="1.5707963"
       sodipodi:end="4.712389"
       sodipodi:arc-type="arc"
       d="m -4.6963544,2.9765626 a 1.0583334,1.0583334 0 0 1 -0.9165436,-0.5291667 1.0583334,1.0583334 0 0 1 0,-1.0583334 1.0583334,1.0583334 0 0 1 0.9165436,-0.52916667"
       sodipodi:open="true"
       transform="scale(-1,1)" />
    <path
       style="fill:none;stroke:#00aad4;stroke-width:0.396875;stroke-linecap:round;stroke-linejoin:round;stroke-dasharray:none;stroke-opacity:1"
       d="M 0.85989583,0.85989779 H 4.696252"
       id="path1790"
       sodipodi:nodetypes="cc" />
    <path
       style="fill:none;stroke:#00aad4;stroke-width:0.396875;stroke-linecap:round;stroke-linejoin:round;stroke-dasharray:none;stroke-opacity:1"
       d="m 1.6536459,5.0932312 4.0630439,-2e-7"
       id="path1792"
       sodipodi:nodetypes="cc" />
    <path
       style="fill:none;stroke:#00aad4;stroke-width:0.396875;stroke-linecap:round;stroke-linejoin:round;stroke-dasharray:none;stroke-opacity:1"
       d="M 4.8717308,4.2461491 5.7165695,5.093231 4.8717308,5.9403131"
       id="path1794"
       sodipodi:nodetypes="ccc" />
    <path
       style="fill:none;stroke:#00aad4;stroke-width:0.396875;stroke-linecap:round;stroke-linejoin:round;stroke-dasharray:none;stroke-opacity:1"
       d="M 1.6536459,2.9765645 H 4.696252"
       id="path1796"
       sodipodi:nodetypes="cc" />
    <path
       style="fill:none;stroke:#00aad4;stroke-width:0.396875;stroke-linecap:round;stroke-linejoin:round;stroke-miterlimit:5.6;stroke-dasharray:none;stroke-opacity:1"
       id="path1677"
       sodipodi:type="arc"
       sodipodi:cx="1.6535264"
       sodipodi:cy="4.0348978"
       sodipodi:rx="1.0583334"
       sodipodi:ry="1.0583334"
       sodipodi:start="1.5707963"
       sodipodi:end="4.712389"
       sodipodi:arc-type="arc"
       d="m 1.6535264,5.0932312 a 1.0583334,1.0583334 0 0 1 -0.91654358,-0.5291667 1.0583334,1.0583334 0 0 1 0,-1.0583334 1.0583334,1.0583334 0 0 1 0.91654358,-0.5291667"
       sodipodi:open="true" />
  </g>
</svg>
