<?xml version="1.0" encoding="UTF-8" standalone="no"?>
<svg
   width="36"
   height="36"
   version="1.1"
   viewBox="0 0 36 36"
   id="svg15"
   sodipodi:docname="tsyncppsyn_150.svg"
   inkscape:version="1.3.2 (091e20e, 2023-11-25, custom)"
   inkscape:export-filename="tsyncppsyn_150.png"
   inkscape:export-xdpi="96"
   inkscape:export-ydpi="96"
   xmlns:inkscape="http://www.inkscape.org/namespaces/inkscape"
   xmlns:sodipodi="http://sodipodi.sourceforge.net/DTD/sodipodi-0.dtd"
   xmlns="http://www.w3.org/2000/svg"
   xmlns:svg="http://www.w3.org/2000/svg">
  <defs
     id="defs15" />
  <sodipodi:namedview
     id="namedview15"
     pagecolor="#ffffff"
     bordercolor="#000000"
     borderopacity="0.25"
     inkscape:showpageshadow="2"
     inkscape:pageopacity="0.0"
     inkscape:pagecheckerboard="0"
     inkscape:deskcolor="#d1d1d1"
     showgrid="true"
     inkscape:current-layer="svg15">
    <inkscape:grid
       id="grid15"
       units="px"
       originx="0"
       originy="0"
       spacingx="0.5"
       spacingy="0.5"
       empcolor="#0099e5"
       empopacity="0.30196078"
       color="#0099e5"
       opacity="0.14901961"
       empspacing="2"
       dotted="false"
       gridanglex="30"
       gridanglez="30"
       visible="true" />
  </sodipodi:namedview>
  <rect
     x="2.4999981"
     y="2.4999826"
     width="30.000004"
     height="31.000017"
     fill="#ffffff"
     fill-rule="evenodd"
     stroke="#2a7efe"
     stroke-linecap="square"
     stroke-linejoin="round"
     style="paint-order:normal"
     id="rect1" />
  <rect
     x="3"
     y="2.9999826"
     width="4"
     height="30.000017"
     fill="#b3b3b3"
     fill-rule="evenodd"
     style="paint-order:normal"
     id="rect2" />
  <path
     d="M 10,6.25 H 26.775"
     stroke="#666666"
     stroke-width="1px"
     id="path2"
     style="fill:none;stroke-width:1.5;stroke-dasharray:none" />
  <path
     d="m 13,9.25 h 6.1"
     stroke="#666666"
     stroke-width="1px"
     id="path3"
     style="fill:none;stroke-width:1.5;stroke-dasharray:none" />
  <path
     d="m 16,12.25 h 9.15"
     stroke="#666666"
     stroke-width="1px"
     id="path4"
     style="fill:none;stroke-width:1.5;stroke-dasharray:none" />
  <path
     d="m 13,15.25 h 3.05"
     stroke="#666666"
     stroke-width="1px"
     id="path5"
     style="fill:none;stroke-width:1.5;stroke-dasharray:none" />
  <path
     d="m 10,18.25 h 6.099999"
     stroke="#666666"
     stroke-width="1px"
     id="path6"
     style="fill:none;stroke-width:1.5;stroke-dasharray:none" />
  <path
     d="m 21,9.25 h 4.575"
     stroke="#ff0000"
     stroke-width="1px"
     id="path7"
     style="fill:none;stroke-width:1.5;stroke-dasharray:none" />
  <path
     d="m 18,18.25 h 9.15"
     stroke="#ff0000"
     stroke-width="1px"
     id="path8"
     style="fill:none;stroke-width:1.5;stroke-dasharray:none" />
  <path
     d="m 16,15.25 h 4.575"
     stroke="#2a7fff"
     stroke-width="1px"
     id="path9"
     style="fill:none;stroke-width:1.5;stroke-dasharray:none" />
  <path
     d="m 20.5,15.25 h 3.05"
     stroke="#666666"
     stroke-width="1px"
     id="path10"
     style="fill:none;stroke-width:1.5;stroke-dasharray:none" />
  <path
     d="M 16.283263,28.9182 C 15.774271,30.8278 11.6,31.3446 11.6,27.6917 v -2.3833 c 0,-3.6528 4.174271,-3.136 4.683263,-1.2264"
     fill="none"
     stroke="#2c5aa0"
     stroke-linecap="round"
     stroke-linejoin="round"
     stroke-width="1.2"
     id="path11" />
  <path
     d="m 20.5,25 v 5"
     fill="none"
     stroke="#2c5aa0"
     stroke-linejoin="round"
     id="path12" />
  <path
     d="m 18,27.5 h 5"
     fill="none"
     stroke="#2c5aa0"
     stroke-linejoin="round"
     id="path13" />
  <path
     d="m 26.5,25 v 5"
     fill="none"
     stroke="#2c5aa0"
     stroke-linejoin="round"
     id="path14" />
  <path
     d="m 24,27.5 h 5"
     fill="none"
     stroke="#2c5aa0"
     stroke-linejoin="round"
     id="path15" />
</svg>
