<?xml version="1.0" encoding="UTF-8" standalone="no"?>
<svg
   height="36"
   viewBox="0 0 9.5249997 9.5250005"
   width="36"
   version="1.1"
   id="svg500"
   sodipodi:docname="Math_01_36.svg"
   inkscape:version="1.2.1 (9c6d41e410, 2022-07-14)"
   inkscape:export-filename="Math_01_36.png"
   inkscape:export-xdpi="96"
   inkscape:export-ydpi="96"
   xmlns:inkscape="http://www.inkscape.org/namespaces/inkscape"
   xmlns:sodipodi="http://sodipodi.sourceforge.net/DTD/sodipodi-0.dtd"
   xmlns="http://www.w3.org/2000/svg"
   xmlns:svg="http://www.w3.org/2000/svg">
  <defs
     id="defs504" />
  <sodipodi:namedview
     id="namedview502"
     pagecolor="#ffffff"
     bordercolor="#666666"
     borderopacity="1.0"
     inkscape:showpageshadow="2"
     inkscape:pageopacity="0.0"
     inkscape:pagecheckerboard="0"
     inkscape:deskcolor="#d1d1d1"
     showgrid="true"
     inkscape:zoom="25.5"
     inkscape:cx="18"
     inkscape:cy="18"
     inkscape:current-layer="svg500">
    <inkscape:grid
       type="xygrid"
       id="grid1268" />
  </sodipodi:namedview>
  <g
     id="g1169"
     transform="matrix(2.250021,0,0,2.250021,-5.5597455,-5.9201273)">
    <path
       style="fill:none;stroke:#00aad4;stroke-width:0.264583px;stroke-linecap:round;stroke-linejoin:round;stroke-opacity:1"
       d="M 6.35,3.7041666 H 4.365625 L 3.4395834,5.8208333 3.0427084,4.7624999 H 2.778125"
       id="path353"
       sodipodi:nodetypes="ccccc" />
    <path
       style="fill:none;stroke:#00aad4;stroke-width:0.264583px;stroke-linecap:round;stroke-linejoin:miter;stroke-opacity:1"
       d="M 4.7625,4.4979166 5.8208333,5.5562499"
       id="path1794" />
    <path
       style="fill:none;stroke:#00aad4;stroke-width:0.264583px;stroke-linecap:round;stroke-linejoin:miter;stroke-opacity:1"
       d="M 5.8208333,4.4979166 4.7625,5.5562499"
       id="path1805" />
  </g>
</svg>
