<?xml version="1.0" encoding="UTF-8" standalone="no"?>
<svg
   width="24"
   height="24"
   version="1.1"
   viewBox="0 0 24 24"
   id="svg14"
   sodipodi:docname="tdbgroupbox.svg"
   inkscape:export-filename="tdbgroupbox.png"
   inkscape:export-xdpi="96"
   inkscape:export-ydpi="96"
   inkscape:version="1.3.2 (091e20e, 2023-11-25, custom)"
   xmlns:inkscape="http://www.inkscape.org/namespaces/inkscape"
   xmlns:sodipodi="http://sodipodi.sourceforge.net/DTD/sodipodi-0.dtd"
   xmlns="http://www.w3.org/2000/svg"
   xmlns:svg="http://www.w3.org/2000/svg">
  <sodipodi:namedview
     id="namedview14"
     pagecolor="#ffffff"
     bordercolor="#000000"
     borderopacity="0.25"
     inkscape:showpageshadow="2"
     inkscape:pageopacity="0.0"
     inkscape:pagecheckerboard="0"
     inkscape:deskcolor="#d1d1d1"
     showgrid="true"
     inkscape:current-layer="svg14">
    <inkscape:grid
       id="grid14"
       units="px"
       originx="0"
       originy="0"
       spacingx="0.5"
       spacingy="0.5"
       empcolor="#0099e5"
       empopacity="0.30196078"
       color="#0099e5"
       opacity="0.14901961"
       empspacing="2"
       dotted="false"
       gridanglex="30"
       gridanglez="30"
       visible="true" />
  </sodipodi:namedview>
  <defs
     id="defs3">
    <linearGradient
       id="a"
       x1="2"
       x2="14"
       y1="2"
       y2="2"
       gradientUnits="userSpaceOnUse">
      <stop
         stop-color="#4276c4"
         offset="0"
         id="stop1" />
      <stop
         stop-color="#80b3ff"
         offset=".3333333"
         id="stop2" />
      <stop
         stop-color="#04a"
         offset="1"
         id="stop3" />
    </linearGradient>
  </defs>
  <ellipse
     cx="8"
     cy="13.5"
     rx="5.1"
     ry="1.6"
     fill="none"
     stroke="url(#a)"
     stroke-linecap="round"
     stroke-linejoin="round"
     stroke-width="1.8"
     id="ellipse3" />
  <ellipse
     cx="8"
     cy="12.2"
     rx="4.9"
     ry="1.4"
     fill="none"
     stroke="#ffffff"
     stroke-linecap="round"
     stroke-linejoin="round"
     stroke-width="1.2"
     id="ellipse4" />
  <ellipse
     cx="8"
     cy="10.5"
     rx="5.1"
     ry="1.6"
     fill="none"
     stroke="url(#a)"
     stroke-linecap="round"
     stroke-linejoin="round"
     stroke-width="1.8"
     id="ellipse5" />
  <ellipse
     cx="8"
     cy="9.2"
     rx="4.9"
     ry="1.4"
     fill="none"
     stroke="#ffffff"
     stroke-linecap="round"
     stroke-linejoin="round"
     stroke-width="1.2"
     id="ellipse6" />
  <ellipse
     cx="8"
     cy="7.5"
     rx="5.1"
     ry="1.6"
     fill="none"
     stroke="url(#a)"
     stroke-linecap="round"
     stroke-linejoin="round"
     stroke-width="1.8"
     id="ellipse7" />
  <ellipse
     cx="8"
     cy="6.2"
     rx="4.9"
     ry="1.4"
     fill="none"
     stroke="#ffffff"
     stroke-linecap="round"
     stroke-linejoin="round"
     stroke-width="1.2"
     id="ellipse8" />
  <ellipse
     cx="8"
     cy="4.5"
     rx="5.4"
     ry="1.9"
     fill="#80b3ff"
     fill-rule="evenodd"
     stroke="url(#a)"
     stroke-linecap="round"
     stroke-linejoin="round"
     stroke-width="1.2"
     id="ellipse9" />
  <rect
     x="8.25"
     y="8.25"
     width="14.5"
     height="15.5"
     fill="#f9f9f9"
     stroke="#2a7efe"
     stroke-width=".5"
     style="paint-order:normal"
     id="rect9" />
  <rect
     x="9.5"
     y="8"
     width="9"
     height="1.8098586"
     fill="#f9f9f9"
     stroke-width="1.02899"
     style="paint-order:normal"
     id="rect10" />
  <path
     d="m11.5 8h5"
     fill="#2a7efe"
     stroke="#2a7efe"
     stroke-linecap="round"
     stroke-width="2"
     id="path10" />
</svg>
