<?xml version="1.0" encoding="UTF-8" standalone="no"?>
<svg
   height="64"
   viewBox="0 0 16.933333 16.933335"
   width="64"
   version="1.1"
   id="svg713"
   sodipodi:docname="Help_04_64.svg"
   inkscape:export-filename="Help_04_64.png"
   inkscape:export-xdpi="96"
   inkscape:export-ydpi="96"
   inkscape:version="1.2 (dc2aedaf03, 2022-05-15)"
   xmlns:inkscape="http://www.inkscape.org/namespaces/inkscape"
   xmlns:sodipodi="http://sodipodi.sourceforge.net/DTD/sodipodi-0.dtd"
   xmlns="http://www.w3.org/2000/svg"
   xmlns:svg="http://www.w3.org/2000/svg">
  <defs
     id="defs717" />
  <sodipodi:namedview
     id="namedview715"
     pagecolor="#ffffff"
     bordercolor="#666666"
     borderopacity="1.0"
     inkscape:showpageshadow="2"
     inkscape:pageopacity="0.0"
     inkscape:pagecheckerboard="0"
     inkscape:deskcolor="#d1d1d1"
     showgrid="true"
     inkscape:zoom="14.34375"
     inkscape:cx="31.965142"
     inkscape:cy="32"
     inkscape:current-layer="g711">
    <inkscape:grid
       type="xygrid"
       id="grid940" />
  </sodipodi:namedview>
  <radialGradient
     id="a"
     cx="12.1"
     cy="10.900001"
     gradientTransform="matrix(0 .4988777 -.49887766 0 6.880948 -4.593239)"
     gradientUnits="userSpaceOnUse"
     r="4.5">
    <stop
       offset="0"
       stop-color="#59f"
       id="stop698" />
    <stop
       offset="1"
       stop-color="#0055d4"
       id="stop700" />
  </radialGradient>
  <g
     stroke-linecap="round"
     id="g711">
    <circle
       cx="2.116667"
       cy="2.116667"
       fill="url(#a)"
       r="1.852083"
       stroke="#d5e5ff"
       stroke-dashoffset="1.49998"
       stroke-linejoin="round"
       stroke-width=".264583"
       transform="matrix(0 4.0000003 4.0000003 0 0 0)"
       id="circle703" />
    <g
       fill="#ffffff"
       id="g702"
       transform="scale(0.52916669)">
      <path
         d="m 17.227854,19.500028 h -2.75374 q -0.01078,-0.598454 -0.01078,-0.729006 0,-1.348977 0.442757,-2.219399 0.442759,-0.870213 1.771033,-1.958293 1.328275,-1.087871 1.587451,-1.425219 0.399562,-0.533073 0.399562,-1.174976 0,-0.891936 -0.712733,-1.522977 -0.701933,-0.6419021 -1.90062,-0.6419021 -1.155492,0 -1.933018,0.6636261 -0.777527,0.663626 -1.0691,2.023464 l -2.786139,-0.348001 q 0.118785,-1.947431 1.641446,-3.3074778 1.533455,-1.3598384 4.017221,-1.3598384 2.613353,0 4.157608,1.3817712 1.544255,1.3707 1.544255,3.19844 0,1.011836 -0.572347,1.914845 -0.561546,0.903008 -2.418972,2.45878 -0.961108,0.805041 -1.198687,1.294458 -0.226779,0.489625 -0.205185,1.751705 z"
         id="path698" />
      <path
         d="m 14.491372,24.5 v -3 h 3.017256 v 3 z"
         id="path700" />
    </g>
  </g>
</svg>
