<?xml version="1.0" encoding="UTF-8" standalone="no"?>
<svg
   width="36"
   height="36"
   viewBox="0 0 36 36"
   version="1.1"
   id="svg1"
   sodipodi:docname="tmainmenu_150.svg"
   inkscape:version="1.3.2 (091e20e, 2023-11-25, custom)"
   inkscape:export-filename="tmainmenu_150.png"
   inkscape:export-xdpi="96"
   inkscape:export-ydpi="96"
   xmlns:inkscape="http://www.inkscape.org/namespaces/inkscape"
   xmlns:sodipodi="http://sodipodi.sourceforge.net/DTD/sodipodi-0.dtd"
   xmlns="http://www.w3.org/2000/svg"
   xmlns:svg="http://www.w3.org/2000/svg">
  <defs
     id="defs1" />
  <sodipodi:namedview
     id="namedview1"
     pagecolor="#ffffff"
     bordercolor="#000000"
     borderopacity="0.25"
     inkscape:showpageshadow="2"
     inkscape:pageopacity="0.0"
     inkscape:pagecheckerboard="0"
     inkscape:deskcolor="#d1d1d1"
     showgrid="true"
     inkscape:current-layer="svg1">
    <inkscape:grid
       id="grid1"
       units="px"
       originx="0"
       originy="0"
       spacingx="0.5"
       spacingy="0.5"
       empcolor="#0099e5"
       empopacity="0.30196078"
       color="#0099e5"
       opacity="0.14901961"
       empspacing="2"
       dotted="false"
       gridanglex="30"
       gridanglez="30"
       visible="true" />
  </sodipodi:namedview>
  <path
     d="M 1.5000001,3.5000003 H 35.500002 v 5 H 1.5000001 Z"
     fill="#f9f9f9"
     fill-rule="evenodd"
     stroke="#b3b3b3"
     id="path1"
     style="stroke:#2a7efe;stroke-opacity:1" />
  <rect
     x="1.4999995"
     y="8.4999828"
     width="16"
     height="24.000017"
     fill="#f2f2f2"
     stroke="#b3b3b3"
     stroke-width="0.999999"
     style="paint-order:normal;stroke:#2a7efe;stroke-opacity:1;fill:#f9f9f9"
     id="rect1" />
  <path
     d="M 2.0000001,23.5 H 17.000001"
     fill="#4d4d4d"
     fill-rule="evenodd"
     stroke="#cccccc"
     stroke-width="1.05409px"
     id="path2" />
  <path
     d="m 4,20.25 h 7.613636"
     fill="none"
     stroke="#808080"
     stroke-width="1.5"
     id="path3"
     style="stroke:#b3b3b3" />
  <path
     d="m 4,17.25 h 6.090909"
     fill="none"
     stroke="#808080"
     stroke-width="1.5"
     id="path4"
     style="stroke:#b3b3b3" />
  <path
     d="m 4,14.25 h 9.136363"
     fill="none"
     stroke="#808080"
     stroke-width="1.5"
     id="path5"
     style="stroke:#b3b3b3" />
  <path
     d="m 4,29.25 h 9.136363"
     fill="none"
     stroke="#808080"
     stroke-width="1.5"
     id="path6"
     style="stroke:#b3b3b3" />
  <path
     d="m 4,11.25 h 7.613636"
     fill="none"
     stroke="#808080"
     stroke-width="1.5"
     id="path7"
     style="stroke:#b3b3b3" />
  <path
     d="m 4,26.25 h 7.613636"
     fill="none"
     stroke="#808080"
     stroke-width="1.5"
     id="path8"
     style="stroke:#b3b3b3" />
  <path
     d="m 18,6.2500003 h 6"
     fill="none"
     stroke="#808080"
     stroke-width="1.5"
     id="path9"
     style="stroke:#b3b3b3" />
  <path
     d="m 11,6.2500003 h 5"
     fill="none"
     stroke="#808080"
     stroke-width="1.5"
     id="path10"
     style="stroke:#b3b3b3" />
  <path
     d="M 4,6.2500003 H 9"
     fill="none"
     stroke="#808080"
     stroke-width="1.5"
     id="path11"
     style="stroke:#b3b3b3" />
</svg>
