<?xml version="1.0" encoding="UTF-8" standalone="no"?>
<svg
   height="32"
   width="32"
   version="1.1"
   id="svg456"
   sodipodi:docname="Bell_01_32.svg"
   inkscape:export-filename="Bell_01_32.png"
   inkscape:export-xdpi="96"
   inkscape:export-ydpi="96"
   inkscape:version="1.2 (dc2aedaf03, 2022-05-15)"
   xmlns:inkscape="http://www.inkscape.org/namespaces/inkscape"
   xmlns:sodipodi="http://sodipodi.sourceforge.net/DTD/sodipodi-0.dtd"
   xmlns="http://www.w3.org/2000/svg"
   xmlns:svg="http://www.w3.org/2000/svg">
  <defs
     id="defs460" />
  <sodipodi:namedview
     id="namedview458"
     pagecolor="#ffffff"
     bordercolor="#666666"
     borderopacity="1.0"
     inkscape:pageshadow="2"
     inkscape:pageopacity="0.0"
     inkscape:pagecheckerboard="0"
     inkscape:deskcolor="#d1d1d1"
     showgrid="true"
     inkscape:zoom="28.6875"
     inkscape:cx="16"
     inkscape:cy="16"
     inkscape:current-layer="svg456"
     inkscape:showpageshadow="2">
    <inkscape:grid
       type="xygrid"
       id="grid997" />
  </sodipodi:namedview>
  <g
     id="g2010"
     transform="matrix(1.9999885,0,0,1.9999885,5.4757724e-4,-8.1979296e-8)">
    <path
       id="rect467"
       style="fill:none;stroke:#00aad4;stroke-width:1.25;stroke-linecap:round;stroke-linejoin:round;stroke-dasharray:none;stroke-dashoffset:1.49998"
       d="m 8,2.5 c 2.5,0.014431 3.828,2.1477686 3.828,3 0,2.2971646 0.672,4 1.672,5.5 0.346968,0.520453 0.567177,1.884822 0,2 -3.111786,0.631923 -8.0011094,0.592977 -11,0 C 1.9323398,12.887755 2.1522735,11.52159 2.5,11 3.5,9.5 4.165,7.7971646 4.165,5.5 4.165,4.6477686 5.5,2.4855686 8,2.5 Z"
       sodipodi:nodetypes="zssssssz" />
    <path
       style="fill:none;stroke:#00aad4;stroke-width:1;stroke-linecap:butt;stroke-linejoin:miter;stroke-dasharray:none;stroke-opacity:1"
       d="m 6.3309059,13.747112 c 0.062359,2.377157 3.3311389,2.297164 3.3311389,0"
       id="path1175"
       sodipodi:nodetypes="cc" />
    <path
       style="fill:none;stroke:#00aad4;stroke-width:1;stroke-linecap:round;stroke-linejoin:miter;stroke-dasharray:none;stroke-opacity:1"
       d="M 4.2489441,10.665 C 6.4877686,11.089575 9.5,11 11.744006,10.665"
       id="path1522"
       sodipodi:nodetypes="cc" />
    <path
       style="fill:none;stroke:#00aad4;stroke-width:2;stroke-linecap:round;stroke-linejoin:miter;stroke-dasharray:none;stroke-opacity:1"
       d="M 8,1 V 1.5"
       id="path1548"
       sodipodi:nodetypes="cc" />
  </g>
</svg>
