<svg width="24" height="24" version="1.0" xmlns="http://www.w3.org/2000/svg">
 <path d="m16.25 19.5-8.5-7.5 8.5-7.5" fill="none" stroke="#36cd36" stroke-linecap="round" stroke-linejoin="round" stroke-width="2.7"/>
</svg>
