<?xml version="1.0" encoding="UTF-8" standalone="no"?>
<svg
   height="64"
   width="64"
   version="1.1"
   id="svg1386"
   sodipodi:docname="dialog_warning_200.svg"
   inkscape:export-filename="dialog_warning_200.png"
   inkscape:export-xdpi="96"
   inkscape:export-ydpi="96"
   inkscape:version="1.2.1 (9c6d41e410, 2022-07-14)"
   xmlns:inkscape="http://www.inkscape.org/namespaces/inkscape"
   xmlns:sodipodi="http://sodipodi.sourceforge.net/DTD/sodipodi-0.dtd"
   xmlns="http://www.w3.org/2000/svg"
   xmlns:svg="http://www.w3.org/2000/svg">
  <defs
     id="defs1390" />
  <sodipodi:namedview
     id="namedview1388"
     pagecolor="#ffffff"
     bordercolor="#666666"
     borderopacity="1.0"
     inkscape:showpageshadow="2"
     inkscape:pageopacity="0.0"
     inkscape:pagecheckerboard="0"
     inkscape:deskcolor="#d1d1d1"
     showgrid="true"
     inkscape:zoom="14.34375"
     inkscape:cx="31.965142"
     inkscape:cy="32"
     inkscape:current-layer="svg1386">
    <inkscape:grid
       type="xygrid"
       id="grid1658" />
  </sodipodi:namedview>
  <linearGradient
     id="a"
     gradientUnits="userSpaceOnUse"
     x1="49.5666665"
     x2="30.9666662"
     y1="223.8666643"
     y2="190.7999971">
    <stop
       offset="0"
       stop-color="#fc0"
       id="stop1373" />
    <stop
       offset="1"
       stop-color="#fea"
       id="stop1375" />
  </linearGradient>
  <g
     fill-rule="evenodd"
     transform="translate(0 -165)"
     id="g1384">
    <path
       d="m60.933462 225.93333h-57.8669238l28.9334618-57.86692z"
       fill="url(#a)"
       stroke="#a80"
       stroke-linejoin="round"
       stroke-width="4.13333"
       id="path1378" />
    <path
       d="m29 191v17h6v-17z"
       id="path1380" />
    <path
       d="m29 212v6h6v-6z"
       id="path1382" />
  </g>
</svg>
