<?xml version="1.0" encoding="UTF-8" standalone="no"?>
<svg
   width="16"
   height="16"
   version="1.1"
   viewBox="0 0 16 16"
   id="svg4"
   sodipodi:docname="line_wrap_1_16.svg"
   inkscape:export-filename="line_wrap_1_16.png"
   inkscape:export-xdpi="96"
   inkscape:export-ydpi="96"
   inkscape:version="1.3.2 (091e20e, 2023-11-25, custom)"
   xmlns:inkscape="http://www.inkscape.org/namespaces/inkscape"
   xmlns:sodipodi="http://sodipodi.sourceforge.net/DTD/sodipodi-0.dtd"
   xmlns="http://www.w3.org/2000/svg"
   xmlns:svg="http://www.w3.org/2000/svg">
  <defs
     id="defs4" />
  <sodipodi:namedview
     id="namedview4"
     pagecolor="#ffffff"
     bordercolor="#000000"
     borderopacity="0.25"
     inkscape:showpageshadow="2"
     inkscape:pageopacity="0.0"
     inkscape:pagecheckerboard="0"
     inkscape:deskcolor="#d1d1d1"
     showgrid="true"
     inkscape:current-layer="svg4">
    <inkscape:grid
       id="grid4"
       units="px"
       originx="0"
       originy="0"
       spacingx="0.5"
       spacingy="0.5"
       empcolor="#0099e5"
       empopacity="0.30196078"
       color="#0099e5"
       opacity="0.14901961"
       empspacing="2"
       dotted="false"
       gridanglex="30"
       gridanglez="30"
       visible="true" />
  </sodipodi:namedview>
  <path
     d="m1.5 3.5h13"
     fill="none"
     stroke="#d4aa00"
     stroke-linecap="round"
     stroke-linejoin="round"
     stroke-width="1.25"
     id="path1" />
  <path
     d="m1.5 11.5h5"
     fill="none"
     stroke="#d4aa00"
     stroke-linecap="round"
     stroke-linejoin="round"
     stroke-width="1.25"
     id="path2" />
  <path
     d="m1.5 7.5h11c2.661613 0 2.657648 4 0 4h-3"
     fill="none"
     stroke="#2a7efe"
     stroke-linecap="round"
     stroke-linejoin="round"
     stroke-width="1.25"
     id="path3" />
  <path
     d="m11 9.5-2 2 2 2"
     fill="none"
     stroke="#2a7efe"
     stroke-linecap="round"
     stroke-linejoin="round"
     stroke-width="1.25"
     id="path4" />
</svg>
