<?xml version="1.0" encoding="UTF-8" standalone="no"?>
<svg
   height="24"
   width="24"
   version="1.1"
   id="svg4"
   sodipodi:docname="issue_qt6_150.svg"
   inkscape:export-filename="issue_qt6_150.png"
   inkscape:export-xdpi="96"
   inkscape:export-ydpi="96"
   inkscape:version="1.3-alpha (2a5ddc9d23, 2023-03-29)"
   xmlns:inkscape="http://www.inkscape.org/namespaces/inkscape"
   xmlns:sodipodi="http://sodipodi.sourceforge.net/DTD/sodipodi-0.dtd"
   xmlns="http://www.w3.org/2000/svg"
   xmlns:svg="http://www.w3.org/2000/svg">
  <defs
     id="defs4" />
  <sodipodi:namedview
     id="namedview4"
     pagecolor="#ffffff"
     bordercolor="#000000"
     borderopacity="0.25"
     inkscape:showpageshadow="2"
     inkscape:pageopacity="0.0"
     inkscape:pagecheckerboard="0"
     inkscape:deskcolor="#d1d1d1"
     showgrid="true"
     inkscape:zoom="37.875"
     inkscape:cx="12"
     inkscape:cy="12"
     inkscape:current-layer="svg4">
    <inkscape:grid
       id="grid4"
       units="px"
       originx="0"
       originy="0"
       spacingx="0.5"
       spacingy="0.5"
       empcolor="#0099e5"
       empopacity="0.30196078"
       color="#0099e5"
       opacity="0.14901961"
       empspacing="2"
       dotted="false"
       gridanglex="30"
       gridanglez="30"
       visible="true" />
  </sodipodi:namedview>
  <path
     d="M 1,16 V 4 L 3,2 h 16 l 2,2 v 12 l -2,2 H 3 Z"
     fill="#88aa00"
     fill-rule="evenodd"
     id="path1" />
  <path
     d="M 10.690049,10.000991 C 10.691449,8.786707 10.419898,7.387305 9.373305,6.640518 8.2524163,5.840718 6.472971,6.123714 5.7340852,7.328842 5.0119689,8.506619 4.9598428,9.974498 5.1916655,11.298843 c 0.1814216,1.036416 0.8280722,2.087664 1.8943311,2.396056 1.0439696,0.301946 2.2791224,-0.03035 2.8993764,-0.957335 0.536752,-0.802187 0.703595,-1.7897 0.704676,-2.736573 z m 0.190055,3.890625 c 0.635925,-0.187422 1.30302,-0.246846 1.963896,-0.242184 v 1.664062 C 11.393114,15.165388 9.933315,15.235543 8.4835239,15.358044 7.2720963,15.460405 5.9765125,15.248814 5.0167334,14.444568 3.7283943,13.365005 3.2932417,11.616441 3.292,10.000991 3.29075,8.37049 3.752876,6.603911 5.0558611,5.527145 6.2741541,4.520367 8.0315927,4.342928 9.496434,4.842147 c 1.359074,0.463174 2.333412,1.699661 2.702283,3.062897 0.461358,1.705041 0.374363,3.650051 -0.605445,5.166016 -0.195916,0.303123 -0.50491,0.576733 -0.713168,0.820556 z"
     fill="#ffffff"
     id="path2" />
  <path
     d="m 16.365484,15.25111 c -0.707273,-0.207447 -1.262446,-0.844258 -1.323029,-1.583678 -0.06357,-0.775878 -0.02249,-1.556327 -0.03439,-2.334396 V 9.180304 H 13.594003 V 7.656866 h 1.414062 V 5.539679 h 1.851562 v 2.117187 h 2.187501 v 1.523438 h -2.187501 c 0.0053,1.294689 0.0063,2.589829 0.0083,3.884278 6.6e-4,0.418298 0.329467,0.741247 0.735349,0.780761 0.52301,0.05092 1.049945,-0.0197 1.553222,-0.157219 l 2e-6,1.531245 c -0.905651,0.229012 -1.884433,0.297646 -2.791016,0.03174 z"
     fill="#ffffff"
     id="path3" />
  <path
     d="m 17.465411,21.682633 c -0.510603,-0.957753 -0.411761,-2.069047 -0.05681,-3.042878 0.326997,-0.897128 0.89949,-1.706375 1.388455,-2.538593 l 1.293354,-2.201287 h 1.568686 c -0.768703,1.29063 -2.306124,3.871891 -2.306124,3.871891 0,0 0.206967,-0.165804 0.608787,-0.225778 0.907087,-0.135382 1.936706,0.165211 2.431918,0.862373 0.516095,0.726559 0.578415,1.617639 0.448127,2.438525 -0.126803,0.799037 -0.691733,1.58286 -1.607641,1.869214 -0.392847,0.122823 -0.811509,0.174508 -1.229306,0.183034 -1.01537,0.02071 -2.100234,-0.392651 -2.539449,-1.216501 z M 20.820977,18.9386 c -0.627908,-0.40851 -1.710187,-0.270943 -2.033201,0.393778 -0.281083,0.578418 -0.324132,1.280208 0.01021,1.836072 0.222388,0.369702 0.735247,0.518737 1.206962,0.529985 0.667835,0.01591 1.291582,-0.405731 1.392002,-1.003773 0.100419,-0.598042 0.04399,-1.352707 -0.575973,-1.756062 z"
     stroke="#ffffff"
     stroke-width="2.2"
     id="path4"
     style="fill:#000000;paint-order:stroke fill markers" />
</svg>
