<?xml version="1.0" encoding="UTF-8" standalone="no"?>
<svg
   width="24"
   height="24"
   version="1.1"
   viewBox="0 0 24 24"
   id="svg4"
   sodipodi:docname="TPSScript.svg"
   inkscape:version="1.3.2 (091e20e, 2023-11-25, custom)"
   xmlns:inkscape="http://www.inkscape.org/namespaces/inkscape"
   xmlns:sodipodi="http://sodipodi.sourceforge.net/DTD/sodipodi-0.dtd"
   xmlns="http://www.w3.org/2000/svg"
   xmlns:svg="http://www.w3.org/2000/svg">
  <sodipodi:namedview
     id="namedview4"
     pagecolor="#ffffff"
     bordercolor="#000000"
     borderopacity="0.25"
     inkscape:showpageshadow="2"
     inkscape:pageopacity="0.0"
     inkscape:pagecheckerboard="0"
     inkscape:deskcolor="#d1d1d1"
     showgrid="true"
     inkscape:current-layer="svg4">
    <inkscape:grid
       id="grid4"
       units="px"
       originx="0"
       originy="0"
       spacingx="0.5"
       spacingy="0.5"
       empcolor="#0099e5"
       empopacity="0.30196078"
       color="#0099e5"
       opacity="0.14901961"
       empspacing="2"
       dotted="false"
       gridanglex="30"
       gridanglez="30"
       visible="true" />
  </sodipodi:namedview>
  <defs
     id="defs2">
    <linearGradient
       id="a"
       x1="2.5"
       x2="21.5"
       y1="1030.8622"
       y2="1049.8622"
       gradientUnits="userSpaceOnUse"
       gradientTransform="translate(0,-1028.3622)">
      <stop
         stop-color="#dbe2e3"
         offset="0"
         id="stop1" />
      <stop
         stop-color="#2c5aa0"
         offset="1"
         id="stop2" />
    </linearGradient>
  </defs>
  <rect
     x="1.5"
     y="1.4999826"
     width="21"
     height="21"
     ry="3"
     fill="url(#a)"
     fill-rule="evenodd"
     stroke="#2f5da1"
     stroke-linecap="square"
     stroke-linejoin="round"
     style="fill:url(#a);paint-order:normal"
     id="rect2" />
  <path
     d="m 17.208334,5.6667 v 1.5208 h -2.416667 l -0.208333,3.1667 q -0.0625,0.8229 -0.0625,1.4271 0,1.4479 0.333333,1.7708 0.34375,0.3125 0.822917,0.3125 1,0 1.1875,-1.2604 h 0.375 q -0.34375,2.8958 -2.3125,2.8958 -0.916667,0 -1.479167,-0.5625 -0.552083,-0.5625 -0.552083,-1.6666 0,-0.7292 0.21875,-3.0834 l 0.28125,-3 H 11.1875 q -0.21875,3.7917 -0.53125,5.5417 -0.302083,1.75 -0.6770831,2.2604 -0.3645833,0.5104 -1,0.5104 -0.4791667,0 -0.8125,-0.2812 -0.3229167,-0.2813 -0.3229167,-0.7396 0,-0.4375 0.5625,-1.1979 Q 9.2291669,12.1771 9.6354169,10.9896 10.041667,9.7917 10.25,7.1875 H 9.5416669 q -0.8541667,0 -1.3125,0.3854 -0.4479167,0.375 -0.8541667,1.0834 h -0.375 Q 7.3020835,7.5417 7.7812502,6.8229 8.2604169,6.1042 8.7604169,5.8854 9.2708336,5.6667 10.5625,5.6667 Z"
     id="path2"
     style="fill:#ffffff;stroke-width:1px" />
  <rect
     x="0.25"
     y="15.249983"
     width="10.5"
     height="8.5"
     fill="#ffffff"
     fill-rule="evenodd"
     stroke="#2a7efe"
     stroke-linecap="square"
     stroke-linejoin="round"
     stroke-width="0.5"
     style="paint-order:normal"
     id="rect3" />
  <path
     d="M 2.4,21.5999 V 17.4 h 1.288359 c 1.717811,0 1.717811,2.3023 0,2.3023 H 2.4"
     fill="none"
     stroke="#4d4d4d"
     stroke-linecap="round"
     stroke-linejoin="round"
     stroke-width="0.8"
     id="path3" />
  <path
     d="M 9.000493,17.6741 C 8.73141,17.4893 8.331859,17.4 7.854528,17.4 c -0.674552,0 -1.288359,0.3533 -1.288359,1.0879 0,0.5755 0.487318,0.8121 1.288359,0.9505 1.115397,0.1928 1.288359,0.5676 1.288359,1.0736 10e-7,0.9143 -0.763884,1.0879 -1.288359,1.0879 -0.407156,0 -0.825073,-0.049 -1.349257,-0.3198"
     fill="none"
     stroke="#4d4d4d"
     stroke-linecap="round"
     stroke-linejoin="round"
     stroke-width="0.8"
     id="path4" />
</svg>
