<?xml version="1.0" encoding="UTF-8" standalone="no"?>
<svg
   height="64"
   viewBox="0 0 16.933333 16.933335"
   width="64"
   version="1.1"
   id="svg623"
   sodipodi:docname="Arrow_45_64.svg"
   inkscape:version="1.2.1 (9c6d41e410, 2022-07-14)"
   inkscape:export-filename="Arrow_45_64.png"
   inkscape:export-xdpi="96"
   inkscape:export-ydpi="96"
   xmlns:inkscape="http://www.inkscape.org/namespaces/inkscape"
   xmlns:sodipodi="http://sodipodi.sourceforge.net/DTD/sodipodi-0.dtd"
   xmlns="http://www.w3.org/2000/svg"
   xmlns:svg="http://www.w3.org/2000/svg">
  <defs
     id="defs627" />
  <sodipodi:namedview
     id="namedview625"
     pagecolor="#ffffff"
     bordercolor="#666666"
     borderopacity="1.0"
     inkscape:showpageshadow="2"
     inkscape:pageopacity="0.0"
     inkscape:pagecheckerboard="0"
     inkscape:deskcolor="#d1d1d1"
     showgrid="true"
     inkscape:zoom="14.34375"
     inkscape:cx="30.989107"
     inkscape:cy="32"
     inkscape:current-layer="svg623">
    <inkscape:grid
       type="xygrid"
       id="grid1262" />
  </sodipodi:namedview>
  <g
     id="g3398"
     transform="matrix(0,2.000026,2.000026,0,-2.7262464e-5,-1.386032e-5)">
    <path
       style="fill:none;stroke:#00aad4;stroke-width:0.529167;stroke-linecap:round;stroke-linejoin:round;stroke-miterlimit:5.6;stroke-dasharray:none;stroke-opacity:1"
       id="circle1633"
       sodipodi:type="arc"
       sodipodi:cx="2.0912619"
       sodipodi:cy="5.291666"
       sodipodi:rx="1.297425"
       sodipodi:ry="1.3229167"
       sodipodi:start="1.5707963"
       sodipodi:end="4.712389"
       sodipodi:arc-type="arc"
       d="m 2.0912619,6.6145828 a 1.297425,1.3229167 0 0 1 -1.12360307,-0.6614584 1.297425,1.3229167 0 0 1 0,-1.3229167 1.297425,1.3229167 0 0 1 1.12360307,-0.6614584"
       sodipodi:open="true" />
    <path
       style="fill:none;stroke:#00aad4;stroke-width:0.529167;stroke-linecap:round;stroke-linejoin:round;stroke-miterlimit:5.6;stroke-dasharray:none;stroke-opacity:1"
       id="path1741"
       sodipodi:type="arc"
       sodipodi:cx="-6.2430191"
       sodipodi:cy="2.6458335"
       sodipodi:rx="1.297425"
       sodipodi:ry="1.3229167"
       sodipodi:start="1.5707963"
       sodipodi:end="4.712389"
       sodipodi:arc-type="arc"
       d="m -6.2430191,3.9687502 a 1.297425,1.3229167 0 0 1 -1.123603,-0.6614583 1.297425,1.3229167 0 0 1 0,-1.3229168 1.297425,1.3229167 0 0 1 1.123603,-0.6614584"
       sodipodi:open="true"
       transform="scale(-1,1)" />
    <path
       style="fill:none;stroke:#00aad4;stroke-width:0.529167;stroke-linecap:round;stroke-linejoin:round;stroke-dasharray:none;stroke-opacity:1"
       d="M 1.0533212,1.3229174 H 6.2430198"
       id="path1790"
       sodipodi:nodetypes="cc" />
    <path
       style="fill:none;stroke:#00aad4;stroke-width:0.529167;stroke-linecap:round;stroke-linejoin:round;stroke-dasharray:none;stroke-opacity:1"
       d="M 2.0912612,6.6145827 H 7.28096"
       id="path1792"
       sodipodi:nodetypes="cc" />
    <path
       style="fill:none;stroke:#00aad4;stroke-width:0.529166;stroke-linecap:round;stroke-linejoin:round;stroke-dasharray:none;stroke-opacity:1"
       d="M 6.0462452,5.5562496 7.28096,6.6145827 6.0462452,7.672916"
       id="path1794"
       sodipodi:nodetypes="ccc" />
    <path
       style="fill:none;stroke:#00aad4;stroke-width:0.529167;stroke-linecap:round;stroke-linejoin:round;stroke-dasharray:none;stroke-opacity:1"
       d="m 2.0912612,3.9687501 h 4.151759"
       id="path1796"
       sodipodi:nodetypes="cc" />
  </g>
</svg>
