<?xml version="1.0" encoding="UTF-8" standalone="no"?>
<svg
   width="36"
   height="36"
   version="1.1"
   id="svg3"
   sodipodi:docname="File_27_36.svg"
   inkscape:export-filename="File_27_36.png"
   inkscape:export-xdpi="96"
   inkscape:export-ydpi="96"
   inkscape:version="1.3.2 (091e20e, 2023-11-25, custom)"
   xmlns:inkscape="http://www.inkscape.org/namespaces/inkscape"
   xmlns:sodipodi="http://sodipodi.sourceforge.net/DTD/sodipodi-0.dtd"
   xmlns="http://www.w3.org/2000/svg"
   xmlns:svg="http://www.w3.org/2000/svg">
  <defs
     id="defs3" />
  <sodipodi:namedview
     id="namedview3"
     pagecolor="#ffffff"
     bordercolor="#000000"
     borderopacity="0.25"
     inkscape:showpageshadow="2"
     inkscape:pageopacity="0.0"
     inkscape:pagecheckerboard="0"
     inkscape:deskcolor="#d1d1d1"
     showgrid="true"
     inkscape:current-layer="svg3">
    <inkscape:grid
       id="grid3"
       units="px"
       originx="0"
       originy="0"
       spacingx="0.5"
       spacingy="0.5"
       empcolor="#0099e5"
       empopacity="0.30196078"
       color="#0099e5"
       opacity="0.14901961"
       empspacing="2"
       dotted="false"
       gridanglex="30"
       gridanglez="30"
       visible="true" />
  </sodipodi:namedview>
  <path
     d="m30.149999 30.65c0 1.385-1.115 2.5-2.5 2.5h-19.299999c-1.385 0-2.5-1.115-2.5-2.5v-25.299999c0-1.385 1.115-2.5 2.5-2.5h19.299999c1.385 0 2.5 1.115 2.5 2.5v15.630391"
     fill="#ebfcff"
     stroke="#00aad4"
     stroke-linejoin="round"
     stroke-width="1.7"
     id="path1" />
  <g
     transform="translate(14.625003,14.624664)"
     fill="none"
     stroke="#ff7f2a"
     stroke-linecap="round"
     id="g3">
    <path
       d="m15.923839 8.7503376a7.1738395 7.1723848 0 1 1-14.347679 0 7.1738395 7.1723848 0 1 1 14.347679 0z"
       stroke-linejoin="round"
       stroke-width="2.15232"
       id="path2" />
    <path
       d="m14.749999 14.750337 4.625 4.625"
       stroke-width="3.75"
       id="path3" />
  </g>
</svg>
