<?xml version="1.0" encoding="UTF-8" standalone="no"?>
<svg
   height="64"
   viewBox="0 0 64 64"
   width="64"
   version="1.1"
   id="svg5"
   sodipodi:docname="Connection_05_64.svg"
   inkscape:version="1.3 (0e150ed6c4, 2023-07-21)"
   xmlns:inkscape="http://www.inkscape.org/namespaces/inkscape"
   xmlns:sodipodi="http://sodipodi.sourceforge.net/DTD/sodipodi-0.dtd"
   xmlns="http://www.w3.org/2000/svg"
   xmlns:svg="http://www.w3.org/2000/svg">
  <defs
     id="defs5" />
  <sodipodi:namedview
     id="namedview5"
     pagecolor="#ffffff"
     bordercolor="#000000"
     borderopacity="0.25"
     inkscape:showpageshadow="2"
     inkscape:pageopacity="0.0"
     inkscape:pagecheckerboard="0"
     inkscape:deskcolor="#d1d1d1"
     showgrid="true"
     inkscape:current-layer="svg5">
    <inkscape:grid
       id="grid5"
       units="px"
       originx="0"
       originy="0"
       spacingx="0.5"
       spacingy="0.5"
       empcolor="#0099e5"
       empopacity="0.30196078"
       color="#0099e5"
       opacity="0.14901961"
       empspacing="2"
       dotted="false"
       gridanglex="30"
       gridanglez="30"
       visible="true" />
  </sodipodi:namedview>
  <linearGradient
     id="a"
     gradientUnits="userSpaceOnUse"
     x1="58.749998"
     x2="41.249994"
     y1="58.749998"
     y2="41.249994">
    <stop
       offset="0"
       stop-color="#d40000"
       id="stop1" />
    <stop
       offset="1"
       stop-color="#ff2a2a"
       id="stop2" />
  </linearGradient>
  <g
     fill="none"
     stroke-linecap="round"
     stroke-linejoin="round"
     stroke-width="2.39994"
     transform="matrix(1.9999667 0 0 1.9999667 -1.001356 -1.000568)"
     id="g3">
    <path
       d="m17.556085 14.444496-2.828359-2.828359-6.5052241 6.505224 2.8283571 2.828359-6.0501051 6.050106"
       stroke="#00aad4"
       id="path2" />
    <path
       d="m14.444891 17.555691 2.828357 2.828357 6.505224-6.505224-2.828357-2.828359 6.050105-6.0501049"
       stroke="#00c1f0"
       id="path3" />
  </g>
  <circle
     cx="50"
     cy="50"
     fill="url(#a)"
     r="14"
     transform="matrix(0 1 1 0 0 0)"
     id="circle3" />
  <g
     fill="none"
     stroke="#fff"
     stroke-linecap="round"
     stroke-width="3.2"
     id="g5">
    <path
       d="m44.696699 44.696699 10.606602 10.606602"
       id="path4" />
    <path
       d="m55.303301 44.696699-10.606602 10.606602"
       id="path5" />
  </g>
</svg>
