<svg width="36" height="36" version="1.1" xmlns="http://www.w3.org/2000/svg">
 <path d="m18.435547 19.599609c-4.83324 0-9.7792284 0.853982-12.427734 2.990235a0.80008001 0.80008001 0 0 0-0.0117187 0.009765c-1.2871237 1.079845-1.9426654 2.508905-2.2304688 4.226563s-0.265625 3.760296-0.265625 6.373047a0.80008001 0.80008001 0 0 0 0.8007812 0.800781h18.265625a3.25 3.25 0 0 1 0.03125-1.599609h-3.140625l2.251953-9.080079 1.486328-1.769531c0.592536 0.09261 1.163799 0.201656 1.699219 0.330078 1.866119 0.447596 3.313763 1.141834 3.996094 1.869141 0.293565 0.358146 0.537527 0.691794 0.748047 1.015625l1.15039-1.150391c-0.206153-0.301113-0.428982-0.603115-0.683593-0.912109a0.80008001 0.80008001 0 0 0-0.03125-0.035156c-1.06448-1.144795-2.770958-1.853531-4.806641-2.341797-2.035682-0.488266-4.415411-0.726563-6.832031-0.726563zm-5.525391 2.082032 1.449219 1.638671 2.253906 9.080079h-11.482422c0.00241-2.137023-0.00449-4.013172 0.2128906-5.310547 0.2495863-1.489573 0.6995944-2.43652 1.6757812-3.257813 1.1882699-0.955186 3.3595278-1.69966 5.8906248-2.15039z" fill="#00aad4" fill-rule="evenodd" stroke-linecap="round" stroke-linejoin="round"/>
 <ellipse cx="17.999388" cy="11.959716" rx="7.0455046" ry="8.4380093" fill="none" stroke="#00aad4" stroke-linecap="square" stroke-linejoin="round" stroke-width="1.6" style="paint-order:normal"/>
 <path d="m10.366226 11.532099s1.999428-3.6722124 3.654312-2.2017661c4.805299 4.2692301 6.372349-4.5057151 11.614259 2.2017661 1.908573-6.6697359-2.984704-10.826035-7.499637-9.166844-4.817767-1.5842362-9.6775056 3.4499283-7.768934 9.166844z" fill="#00aad4" fill-rule="evenodd"/>
 <path d="m25.721398 33.278602 7.557204-7.557204" fill="none" stroke="#00aad4" stroke-linecap="round" stroke-width="2.8125"/>
 <path d="m33.278602 33.278602-7.557204-7.557204" fill="none" stroke="#00aad4" stroke-linecap="round" stroke-width="2.8125"/>
</svg>
