<?xml version="1.0" encoding="UTF-8" standalone="no"?>
<svg
   height="24"
   width="24"
   version="1.1"
   id="svg18"
   sodipodi:docname="Open_01_24.svg"
   inkscape:export-filename="Open_01_24.png"
   inkscape:export-xdpi="96"
   inkscape:export-ydpi="96"
   inkscape:version="1.2-beta (1b65182ce9, 2022-04-05)"
   xmlns:inkscape="http://www.inkscape.org/namespaces/inkscape"
   xmlns:sodipodi="http://sodipodi.sourceforge.net/DTD/sodipodi-0.dtd"
   xmlns="http://www.w3.org/2000/svg"
   xmlns:svg="http://www.w3.org/2000/svg">
  <defs
     id="defs22" />
  <sodipodi:namedview
     id="namedview20"
     pagecolor="#ffffff"
     bordercolor="#666666"
     borderopacity="1.0"
     inkscape:pageshadow="2"
     inkscape:pageopacity="0.0"
     inkscape:pagecheckerboard="0"
     inkscape:deskcolor="#d1d1d1"
     showgrid="true"
     inkscape:zoom="38.25"
     inkscape:cx="11.986928"
     inkscape:cy="12"
     inkscape:current-layer="svg18">
    <inkscape:grid
       type="xygrid"
       id="grid1550" />
  </sodipodi:namedview>
  <linearGradient
     id="a"
     gradientUnits="userSpaceOnUse"
     x1="6.25"
     x2="7.75"
     y1="30.2"
     y2="37.7">
    <stop
       offset="0"
       stop-color="#ffeaa6"
       id="stop2" />
    <stop
       offset="1"
       stop-color="#e0ba58"
       id="stop4" />
  </linearGradient>
  <linearGradient
     id="b"
     gradientUnits="userSpaceOnUse"
     x1="9.25"
     x2="10"
     y1="36.2"
     y2="43.7">
    <stop
       offset="0"
       stop-color="#ffe9a3"
       id="stop7" />
    <stop
       offset="1"
       stop-color="#e3ba59"
       id="stop9" />
  </linearGradient>
  <g
     stroke="#d8872d"
     stroke-linejoin="round"
     stroke-width=".75"
     transform="translate(0 -24)"
     id="g16">
    <path
       d="m1.375 44.617494v-16.241713h6.7773438l1.8476562 2.003125h10.620055l-.0053 14.238588z"
       fill="url(#a)"
       id="path12" />
    <path
       d="m22.620401 33.385123-18.90625-.007813-2.339151 11.240184h19.239817z"
       fill="url(#b)"
       id="path14" />
  </g>
</svg>
