<?xml version="1.0" encoding="UTF-8" standalone="no"?>
<svg
   height="64"
   width="64"
   version="1.1"
   id="svg176"
   sodipodi:docname="User_02_64.svg"
   inkscape:export-filename="User_02_64.png"
   inkscape:export-xdpi="96"
   inkscape:export-ydpi="96"
   inkscape:version="1.2-beta (1b65182ce9, 2022-04-05)"
   xmlns:inkscape="http://www.inkscape.org/namespaces/inkscape"
   xmlns:sodipodi="http://sodipodi.sourceforge.net/DTD/sodipodi-0.dtd"
   xmlns:xlink="http://www.w3.org/1999/xlink"
   xmlns="http://www.w3.org/2000/svg"
   xmlns:svg="http://www.w3.org/2000/svg">
  <defs
     id="defs180">
    <linearGradient
       inkscape:collect="always"
       xlink:href="#linearGradient868"
       id="linearGradient870"
       x1="12.461551"
       y1="1035.4017"
       x2="11"
       y2="1039.7219"
       gradientUnits="userSpaceOnUse"
       gradientTransform="matrix(0.77770963,0,0,0.88978197,-0.5553438,-916.15432)" />
    <linearGradient
       inkscape:collect="always"
       id="linearGradient868">
      <stop
         style="stop-color:#fcd58b;stop-opacity:1"
         offset="0"
         id="stop864" />
      <stop
         style="stop-color:#f08a19;stop-opacity:1"
         offset="1"
         id="stop866" />
    </linearGradient>
  </defs>
  <sodipodi:namedview
     id="namedview178"
     pagecolor="#ffffff"
     bordercolor="#666666"
     borderopacity="1.0"
     inkscape:pageshadow="2"
     inkscape:pageopacity="0.0"
     inkscape:pagecheckerboard="0"
     inkscape:deskcolor="#d1d1d1"
     showgrid="true"
     inkscape:zoom="14.34375"
     inkscape:cx="28.479303"
     inkscape:cy="32"
     inkscape:current-layer="svg176">
    <inkscape:grid
       type="xygrid"
       id="grid1029" />
  </sodipodi:namedview>
  <radialGradient
     id="a"
     cx="5.988626"
     cy="7.28811"
     gradientTransform="matrix(-.00000055 3.4666666 -3.2000002 -.0000005 31.296708 -14.760566)"
     gradientUnits="userSpaceOnUse"
     r="3.75">
    <stop
       offset="0"
       stop-color="#f8fbff"
       id="stop149" />
    <stop
       offset=".66666657"
       stop-color="#d1e3ff"
       id="stop151" />
    <stop
       offset="1"
       stop-color="#f8fbff"
       id="stop153" />
  </radialGradient>
  <g
     id="g1162"
     transform="matrix(3.9999999,0,0,3.9999999,9.6563134e-8,1.2808103e-5)">
    <path
       style="fill:#0066ff;fill-rule:evenodd;stroke:#5599ff;stroke-width:0.499946;stroke-linecap:round;stroke-linejoin:round;stroke-miterlimit:4;stroke-dasharray:none;stroke-opacity:1"
       d="m 14.498887,10.500697 c 1.33013,1.499807 1.249891,2.499678 1.249891,5.249324 H 0.25013578 c 0,-2.749646 -0.0327553,-4.249453 1.24989052,-5.249324 2.6302262,-1.9711196 11.0261917,-1.9711196 12.9988607,0 z"
       id="path817"
       inkscape:connector-curvature="0"
       sodipodi:nodetypes="ccccc" />
    <path
       style="fill:#ffffff;fill-rule:evenodd;stroke:none;stroke-width:1.28138px;stroke-linecap:butt;stroke-linejoin:miter;stroke-opacity:1"
       d="m 4.8181675,9.2643109 1.281406,1.4370811 1.2814059,5.125414 H 8.6623856 L 9.9437916,10.701392 11.225197,9.1864469 C 9.3030885,8.1386855 6.7402765,8.1386855 4.8181675,9.2643109 Z"
       id="path872"
       inkscape:connector-curvature="0"
       sodipodi:nodetypes="ccccccc" />
    <ellipse
       ry="4.8938003"
       rx="3.9996495"
       cy="5.0922813"
       cx="7.9994617"
       id="ellipse849"
       style="fill:#b8690e;fill-opacity:1;fill-rule:evenodd;stroke:none;stroke-width:0;stroke-linecap:square;stroke-linejoin:round;stroke-miterlimit:4;stroke-dasharray:none;stroke-dashoffset:0;stroke-opacity:1;paint-order:normal" />
    <ellipse
       style="fill:url(#linearGradient870);fill-opacity:1;fill-rule:evenodd;stroke:#deaa87;stroke-width:0;stroke-linecap:square;stroke-linejoin:round;stroke-miterlimit:4;stroke-dasharray:none;stroke-dashoffset:0;stroke-opacity:1;paint-order:normal"
       id="ellipse851"
       cx="7.9994617"
       cy="5.2257705"
       ry="4.4273462"
       rx="3.6911829" />
    <path
       style="fill:#a05a2c;fill-rule:evenodd;stroke:none;stroke-width:1.41019px;stroke-linecap:butt;stroke-linejoin:miter;stroke-opacity:1"
       d="m 3.9998123,5.0014043 c 0,0 1.0475131,-1.926777 1.9145169,-1.1552472 C 8.4318546,6.0861833 9.2528421,1.4820497 11.999111,5.0014043 12.999024,1.5018545 10.435406,-0.67891801 8.0700043,0.19164467 5.5459472,-0.63958964 2.9998999,2.0017902 3.9998123,5.0014043 Z"
       id="path820"
       inkscape:connector-curvature="0"
       sodipodi:nodetypes="csccc" />
  </g>
</svg>
