<?xml version="1.0" encoding="UTF-8" standalone="no"?>
<svg
   height="32"
   viewBox="0 0 8.4666664 8.4666671"
   width="32"
   version="1.1"
   id="svg377"
   sodipodi:docname="Anchor_01_32.svg"
   inkscape:version="1.2 (dc2aedaf03, 2022-05-15)"
   inkscape:export-filename="Anchor_01_32.png"
   inkscape:export-xdpi="96"
   inkscape:export-ydpi="96"
   xmlns:inkscape="http://www.inkscape.org/namespaces/inkscape"
   xmlns:sodipodi="http://sodipodi.sourceforge.net/DTD/sodipodi-0.dtd"
   xmlns="http://www.w3.org/2000/svg"
   xmlns:svg="http://www.w3.org/2000/svg">
  <defs
     id="defs381" />
  <sodipodi:namedview
     id="namedview379"
     pagecolor="#ffffff"
     bordercolor="#666666"
     borderopacity="1.0"
     inkscape:showpageshadow="2"
     inkscape:pageopacity="0.0"
     inkscape:pagecheckerboard="0"
     inkscape:deskcolor="#d1d1d1"
     showgrid="true"
     inkscape:zoom="28.6875"
     inkscape:cx="16"
     inkscape:cy="16"
     inkscape:current-layer="svg377">
    <inkscape:grid
       type="xygrid"
       id="grid1274" />
  </sodipodi:namedview>
  <g
     id="g2427"
     transform="matrix(1.9999291,0,0,1.9999291,0.00190638,1.8732379e-5)">
    <circle
       style="fill:none;stroke:#00aad4;stroke-width:0.264583;stroke-linecap:round;stroke-dasharray:none;stroke-dashoffset:1.49998;stroke-opacity:1"
       id="path351"
       cx="2.1166668"
       cy="0.82020819"
       r="0.42333335" />
    <path
       style="fill:none;stroke:#00aad4;stroke-width:0.264583;stroke-linecap:round;stroke-dashoffset:1.49998;stroke-opacity:1"
       d="M 3.7898944,2.5159713 C 3.6098958,3.2732941 2.9290637,3.8365899 2.1166668,3.8365899 c -0.812724,0 -1.49377734,-0.5637495 -1.67344484,-1.3215335"
       id="path908" />
    <path
       style="fill:none;stroke:#00aad4;stroke-width:0.264583;stroke-linecap:round;stroke-linejoin:miter;stroke-dasharray:none;stroke-opacity:1"
       d="M 1.4552083,1.984375 H 2.778125"
       id="path1016" />
    <path
       style="fill:none;stroke:#00aad4;stroke-width:0.264583px;stroke-linecap:round;stroke-linejoin:miter;stroke-opacity:1"
       d="m 2.1166666,1.3229166 1e-7,2.5135417"
       id="path1018"
       sodipodi:nodetypes="cc" />
    <path
       style="fill:none;stroke:#00aad4;stroke-width:0.264583px;stroke-linecap:round;stroke-linejoin:round;stroke-opacity:1"
       d="M 0.3672415,3.2773718 0.44144702,2.5095628 1.0840052,2.9363602"
       id="path1020"
       inkscape:transform-center-y="0.77666902"
       sodipodi:nodetypes="ccc"
       inkscape:transform-center-x="1.3901652" />
    <path
       style="fill:none;stroke:#00aad4;stroke-width:0.264583px;stroke-linecap:round;stroke-linejoin:round;stroke-opacity:1"
       d="M 3.8643355,3.2773718 3.79013,2.5095628 3.1475718,2.9363602"
       id="path1120"
       inkscape:transform-center-y="0.77666902"
       sodipodi:nodetypes="ccc"
       inkscape:transform-center-x="-1.3901652" />
  </g>
</svg>
