<?xml version="1.0" encoding="UTF-8" standalone="no"?>
<svg
   width="48"
   height="48"
   version="1.1"
   viewBox="0 0 48 48"
   id="svg9"
   sodipodi:docname="TDBDateTimePicker_200.svg"
   inkscape:export-filename="TDBDateTimePicker_200.png"
   inkscape:export-xdpi="96"
   inkscape:export-ydpi="96"
   inkscape:version="1.3.2 (091e20e, 2023-11-25, custom)"
   xmlns:inkscape="http://www.inkscape.org/namespaces/inkscape"
   xmlns:sodipodi="http://sodipodi.sourceforge.net/DTD/sodipodi-0.dtd"
   xmlns="http://www.w3.org/2000/svg"
   xmlns:svg="http://www.w3.org/2000/svg">
  <sodipodi:namedview
     id="namedview9"
     pagecolor="#ffffff"
     bordercolor="#000000"
     borderopacity="0.25"
     inkscape:showpageshadow="2"
     inkscape:pageopacity="0.0"
     inkscape:pagecheckerboard="0"
     inkscape:deskcolor="#d1d1d1"
     showgrid="true"
     inkscape:current-layer="svg9">
    <inkscape:grid
       id="grid9"
       units="px"
       originx="0"
       originy="0"
       spacingx="0.5"
       spacingy="0.5"
       empcolor="#0099e5"
       empopacity="0.30196078"
       color="#0099e5"
       opacity="0.14901961"
       empspacing="2"
       dotted="false"
       gridanglex="30"
       gridanglez="30"
       visible="true" />
  </sodipodi:namedview>
  <defs
     id="defs3">
    <linearGradient
       id="a"
       x1="4"
       x2="28"
       y1="4"
       y2="4"
       gradientUnits="userSpaceOnUse">
      <stop
         stop-color="#4276c4"
         offset="0"
         id="stop1" />
      <stop
         stop-color="#80b3ff"
         offset=".3333333"
         id="stop2" />
      <stop
         stop-color="#04a"
         offset="1"
         id="stop3" />
    </linearGradient>
  </defs>
  <ellipse
     cx="16"
     cy="27"
     rx="10.2"
     ry="3.2"
     fill="none"
     stroke="url(#a)"
     stroke-linecap="round"
     stroke-linejoin="round"
     stroke-width="3.6"
     id="ellipse3" />
  <ellipse
     cx="16"
     cy="24.4"
     rx="9.8"
     ry="2.8"
     fill="none"
     stroke="#ffffff"
     stroke-linecap="round"
     stroke-linejoin="round"
     stroke-width="2.4"
     id="ellipse4" />
  <ellipse
     cx="16"
     cy="21"
     rx="10.2"
     ry="3.2"
     fill="none"
     stroke="url(#a)"
     stroke-linecap="round"
     stroke-linejoin="round"
     stroke-width="3.6"
     id="ellipse5" />
  <ellipse
     cx="16"
     cy="18.4"
     rx="9.8"
     ry="2.8"
     fill="none"
     stroke="#ffffff"
     stroke-linecap="round"
     stroke-linejoin="round"
     stroke-width="2.4"
     id="ellipse6" />
  <ellipse
     cx="16"
     cy="15"
     rx="10.2"
     ry="3.2"
     fill="none"
     stroke="url(#a)"
     stroke-linecap="round"
     stroke-linejoin="round"
     stroke-width="3.6"
     id="ellipse7" />
  <ellipse
     cx="16"
     cy="12.4"
     rx="9.8"
     ry="2.8"
     fill="none"
     stroke="#ffffff"
     stroke-linecap="round"
     stroke-linejoin="round"
     stroke-width="2.4"
     id="ellipse8" />
  <ellipse
     cx="16"
     cy="9"
     rx="10.8"
     ry="3.8"
     fill="#80b3ff"
     fill-rule="evenodd"
     stroke="url(#a)"
     stroke-linecap="round"
     stroke-linejoin="round"
     stroke-width="2.4"
     id="ellipse9" />
  <rect
     x="15.5"
     y="18.499973"
     width="29"
     height="29.000027"
     fill="#f9f9f9"
     stroke="#2a7efe"
     stroke-width="1"
     style="paint-order:normal"
     id="rect1" />
  <rect
     style="fill:none;stroke:#96b5e7;stroke-width:1.09002;stroke-linecap:round;stroke-linejoin:round;stroke-dasharray:none;stroke-opacity:1"
     id="rect9"
     width="20.909985"
     height="15.909981"
     x="19.545008"
     y="28.545008" />
  <rect
     transform="rotate(90)"
     x="18.499973"
     y="-37.5"
     width="7"
     height="22"
     fill="#f9f9f9"
     stroke="#2a7efe"
     stroke-width="1"
     style="paint-order:normal"
     id="rect2" />
  <path
     d="M 20,21.999997 H 33.999999"
     fill="none"
     stroke="#b3b3b3"
     stroke-width="2px"
     id="path2"
     sodipodi:nodetypes="cc" />
  <rect
     x="37.5"
     y="18.499973"
     width="7.0000019"
     height="7.0000019"
     fill="#ffffff"
     stroke="#2a7efe"
     stroke-width="0.999998"
     style="paint-order:normal"
     id="rect3" />
  <path
     d="m 39.310331,21.004189 1.66264,1.662562 1.662642,-1.662562"
     fill="none"
     stroke="#808080"
     stroke-width="1.4"
     id="path3"
     sodipodi:nodetypes="ccc" />
  <path
     d="M 20,32.5 H 39.999999"
     fill="none"
     stroke="#96b5e7"
     stroke-width="2px"
     id="path4"
     sodipodi:nodetypes="cc"
     style="stroke-width:1;stroke-dasharray:none" />
  <path
     d="M 20,36.5 H 39.999999"
     fill="none"
     stroke="#96b5e7"
     stroke-width="2px"
     id="path7"
     sodipodi:nodetypes="cc"
     style="stroke-width:1;stroke-dasharray:none" />
  <path
     d="M 23.5,29 V 44"
     fill="none"
     stroke="#96b5e7"
     stroke-width="2px"
     id="path10"
     sodipodi:nodetypes="cc"
     style="stroke-width:1.0351;stroke-dasharray:none" />
  <path
     d="M 27.5,29 V 44"
     fill="none"
     stroke="#96b5e7"
     stroke-width="2px"
     id="path12"
     sodipodi:nodetypes="cc"
     style="stroke-width:1.0351;stroke-dasharray:none" />
  <path
     d="M 31.5,29 V 44"
     fill="none"
     stroke="#96b5e7"
     stroke-width="2px"
     id="path13"
     sodipodi:nodetypes="cc"
     style="stroke-width:1.0351;stroke-dasharray:none" />
  <path
     d="M 35.5,29 V 44"
     fill="none"
     stroke="#96b5e7"
     stroke-width="2px"
     id="path14"
     sodipodi:nodetypes="cc"
     style="stroke-width:1.0351;stroke-dasharray:none" />
  <path
     d="m 31.5,32.5 h 4.000006 v 4.000005 H 31.5 Z"
     fill="none"
     stroke="#ff0000"
     stroke-width="1.99999px"
     id="path16"
     sodipodi:nodetypes="ccccc"
     style="stroke-width:1;stroke-dasharray:none" />
  <path
     d="M 20,40.5 H 39.999999"
     fill="none"
     stroke="#96b5e7"
     stroke-width="2px"
     id="path9"
     sodipodi:nodetypes="cc"
     style="stroke-width:1;stroke-dasharray:none" />
  <path
     d="m 23.5,36.5 h 4.000004 v 4 H 23.5 Z"
     fill="none"
     stroke="#ff0000"
     stroke-width="1.99999px"
     id="path17"
     sodipodi:nodetypes="ccccc"
     style="stroke-width:1;stroke-dasharray:none" />
</svg>
