<?xml version="1.0" encoding="UTF-8" standalone="no"?>
<svg
   height="36"
   viewBox="0 0 9.5249997 9.5250005"
   width="36"
   version="1.1"
   id="svg500"
   sodipodi:docname="Secure_02_36.svg"
   inkscape:version="1.2 (dc2aedaf03, 2022-05-15)"
   inkscape:export-filename="Secure_02_36.png"
   inkscape:export-xdpi="96"
   inkscape:export-ydpi="96"
   xmlns:inkscape="http://www.inkscape.org/namespaces/inkscape"
   xmlns:sodipodi="http://sodipodi.sourceforge.net/DTD/sodipodi-0.dtd"
   xmlns="http://www.w3.org/2000/svg"
   xmlns:svg="http://www.w3.org/2000/svg">
  <defs
     id="defs504" />
  <sodipodi:namedview
     id="namedview502"
     pagecolor="#ffffff"
     bordercolor="#666666"
     borderopacity="1.0"
     inkscape:showpageshadow="2"
     inkscape:pageopacity="0.0"
     inkscape:pagecheckerboard="0"
     inkscape:deskcolor="#d1d1d1"
     showgrid="true"
     inkscape:zoom="25.5"
     inkscape:cx="12.705882"
     inkscape:cy="18"
     inkscape:current-layer="g2582">
    <inkscape:grid
       type="xygrid"
       id="grid1268" />
  </sodipodi:namedview>
  <g
     id="g2582"
     transform="matrix(2.2959603,0,0,2.2506634,-0.09728233,0.03420484)"
     style="stroke-width:0.989776">
    <path
       style="fill:#da121a;fill-opacity:1;stroke:#f99e20;stroke-width:0.261879;stroke-linecap:round;stroke-linejoin:bevel;stroke-dasharray:none;stroke-opacity:1"
       d="M 2.1166665,3.8214414 C 2.8938802,3.4243808 3.6710938,3.02732 3.6710937,1.0420166 c -0.6476778,0 -1.1658203,-0.26470709 -1.5544272,-0.66176777"
       id="path1107" />
    <path
       style="fill:#fcdd09;fill-opacity:1;stroke:#f99e20;stroke-width:0.261879;stroke-linecap:round;stroke-linejoin:bevel;stroke-dasharray:none;stroke-opacity:1"
       d="M 2.1166665,0.38024883 C 1.7280597,0.77730951 1.2099173,1.0420166 0.56223941,1.0420166 0.56223943,3.02732 1.339453,3.4243808 2.1166665,3.8214414"
       id="path2905" />
  </g>
</svg>
