<?xml version="1.0" encoding="UTF-8" standalone="no"?>
<svg
   width="24"
   height="24"
   version="1.1"
   viewBox="0 0 24 24"
   id="svg6"
   sodipodi:docname="tfbeventmonitor.svg"
   inkscape:version="1.3.2 (091e20e, 2023-11-25, custom)"
   xmlns:inkscape="http://www.inkscape.org/namespaces/inkscape"
   xmlns:sodipodi="http://sodipodi.sourceforge.net/DTD/sodipodi-0.dtd"
   xmlns="http://www.w3.org/2000/svg"
   xmlns:svg="http://www.w3.org/2000/svg">
  <defs
     id="defs6" />
  <sodipodi:namedview
     id="namedview6"
     pagecolor="#ffffff"
     bordercolor="#000000"
     borderopacity="0.25"
     inkscape:showpageshadow="2"
     inkscape:pageopacity="0.0"
     inkscape:pagecheckerboard="0"
     inkscape:deskcolor="#d1d1d1"
     showgrid="true"
     inkscape:current-layer="svg6">
    <inkscape:grid
       id="grid6"
       units="px"
       originx="0"
       originy="0"
       spacingx="0.5"
       spacingy="0.5"
       empcolor="#0099e5"
       empopacity="0.30196078"
       color="#0099e5"
       opacity="0.14901961"
       empspacing="2"
       dotted="false"
       gridanglex="30"
       gridanglez="30"
       visible="true" />
  </sodipodi:namedview>
  <linearGradient
     id="a"
     x1="11"
     x2="11"
     y1="1051.3622"
     y2="1033.8622"
     gradientUnits="userSpaceOnUse"
     gradientTransform="translate(0,-1028.3622)">
    <stop
       stop-color="#f00"
       offset="0"
       id="stop1" />
    <stop
       stop-color="#d4aa00"
       offset="1"
       id="stop2" />
  </linearGradient>
  <path
     d="m 12.5,3.6 c 4.4088,1.3471 8.61,3.853 7.0664,9.8047 -0.65965,2.5434 -2.8876,3.8398 -5.1113,3.8398 -1.2499,0 -1.7239,-1.1751 -0.97852,-2.0761 0.73566,-0.8893 1.1619,-1.5394 1.3652,-2.1192 0.51621,-1.4722 0.1948,-1.9349 -0.0332,-2.2402 -0.51158,-0.685 -1.2755,-1.0544 -2.0098,-1.4473 0.33379,-0.3049 0.97183,-0.2155 1.6621,-0.1445 0.59199,0.061 0.70381,-0.4663 0.48047,-0.9766 0.0776,0.4909 -0.28493,0.6228 -0.89453,0.5489 -1.2032,-0.1459 -3.3509,-1.009 -3.4922,-1.0469 -0.83914,-0.2253 -1.3112,0.1521 -1.0508,1.125 l -0.66406,0.022 c -0.37695,0.012 -0.49841,0.078 -0.78125,0.25 -0.11013,0.067 -0.32931,0.2247 -0.5293,0.4414 -0.2452,0.2657 -0.37905,0.6374 -0.13672,0.9629 0.26362,0.3541 0.66433,0.5468 1,0.7109 0.37449,-0.9856 1.8034,-0.6633 2.125,-0.3769 1.3466,1.1992 -0.22102,1.7489 -1.3301,2.1816 -1.5411,0.6012 -2.645,2.2876 -2.5898,4.1211 0.060515,2.0113 0.33216,2.3348 0.76367,3.3164 0.55966,1.2731 2.7967,3.003 4.6387,3.003 5.5,0 9.9998,-4.4763 10,-9.9991 2.11e-4,-5.3288 -4.1779,-9.7345 -9.5,-10.001 z m -1,-0.1 C 6.1869,3.766 2.0013,8.1803 2,13.5 1.9990529,17.2332 4.0982,20.65 7.416,22.3613 6.60918,21.3409 5.7058,19.8035 5.5273,18.2285 -0.29889998,10.536 6.7281,4.6025 11.5,3.5995 Z m -0.75781,4.9961 c 0.16423,0.068 0.47517,0.223 0.68359,0.3691 h -1.0547 c 0,0 -0.03169,-0.1742 -0.01953,-0.2422 0.03984,-0.2227 0.31424,-0.1588 0.39062,-0.1269 z"
     fill="url(#a)"
     stroke-linecap="round"
     stroke-width="1.2"
     id="path2"
     style="fill:url(#a)" />
  <path
     d="M 14.966225,8.4306 C 15.993701,7.2501 16.87696,5.825 16.87696,3.76 c 0,-1.4862 0.636912,-2.3354 2.12304,-2.3354 1.486127,0 2.123039,0.8492 2.123039,2.3354 0,2.065 0.883259,3.4901 1.910736,4.6706 z"
     id="path3"
     style="fill:#ffcc00;fill-rule:evenodd;stroke:#554400;stroke-width:0.424608" />
  <path
     d="M 17.755783,8.4306 A 1.2442006,1.2442006 0 0 0 19,9.6748 1.2442006,1.2442006 0 0 0 20.244217,8.4306 Z"
     id="path4"
     style="fill:#ffcc00;fill-rule:evenodd;stroke:#554400;stroke-width:0.424608;stroke-linejoin:round" />
  <circle
     cx="19"
     cy="0.9999826"
     r="0.42460799"
     id="circle4"
     style="fill:#ffcc00;fill-rule:evenodd;stroke:#554400;stroke-width:0.424608;stroke-linejoin:round" />
</svg>
