<?xml version="1.0" encoding="UTF-8" standalone="no"?>
<svg
   width="48"
   height="48"
   version="1.1"
   viewBox="0 0 48 48"
   id="svg15"
   sodipodi:docname="tjsonpropstorage_200.svg"
   inkscape:export-filename="tjsonpropstorage_200.png"
   inkscape:export-xdpi="96"
   inkscape:export-ydpi="96"
   inkscape:version="1.3.2 (091e20e, 2023-11-25, custom)"
   xmlns:inkscape="http://www.inkscape.org/namespaces/inkscape"
   xmlns:sodipodi="http://sodipodi.sourceforge.net/DTD/sodipodi-0.dtd"
   xmlns:xlink="http://www.w3.org/1999/xlink"
   xmlns="http://www.w3.org/2000/svg"
   xmlns:svg="http://www.w3.org/2000/svg">
  <sodipodi:namedview
     id="namedview15"
     pagecolor="#ffffff"
     bordercolor="#000000"
     borderopacity="0.25"
     inkscape:showpageshadow="2"
     inkscape:pageopacity="0.0"
     inkscape:pagecheckerboard="0"
     inkscape:deskcolor="#d1d1d1"
     showgrid="true"
     inkscape:current-layer="svg15">
    <inkscape:grid
       id="grid15"
       units="px"
       originx="0"
       originy="0"
       spacingx="0.5"
       spacingy="0.5"
       empcolor="#0099e5"
       empopacity="0.30196078"
       color="#0099e5"
       opacity="0.14901961"
       empspacing="2"
       dotted="false"
       gridanglex="30"
       gridanglez="30"
       visible="true" />
  </sodipodi:namedview>
  <defs
     id="defs2">
    <linearGradient
       id="b"
       x1="11.5"
       x2="11.5"
       y1="1039.8622"
       y2="1033.8622"
       gradientTransform="matrix(2,0,0,2,1.0000004,-2055.7244)"
       gradientUnits="userSpaceOnUse"
       xlink:href="#a" />
    <linearGradient
       id="a">
      <stop
         stop-color="#c1d3f1"
         offset="0"
         id="stop1" />
      <stop
         stop-color="#eaf2fa"
         offset="1"
         id="stop2" />
    </linearGradient>
    <linearGradient
       id="c"
       x1="11"
       x2="11"
       y1="1030.3622"
       y2="1033.3622"
       gradientTransform="matrix(2,0,0,2,1.0000004,-2055.7244)"
       gradientUnits="userSpaceOnUse"
       xlink:href="#a" />
  </defs>
  <rect
     x="3"
     y="27.999983"
     width="41"
     height="18.000019"
     ry="3.0000172"
     fill="#739bdf"
     fill-rule="evenodd"
     style="paint-order:normal"
     id="rect2" />
  <path
     d="m 35,4.5 5.500001,7 H 7.499998 L 13,4.5 Z"
     fill="url(#c)"
     fill-rule="evenodd"
     stroke="#2a7efe"
     stroke-linejoin="round"
     id="path2"
     style="fill:url(#c)" />
  <path
     d="M 7.5391004,24.5 H 40.500001 v -13 H 7.4999984 Z"
     fill="url(#b)"
     fill-rule="evenodd"
     stroke="#2a7efe"
     stroke-linejoin="round"
     stroke-width="0.999998"
     id="path3"
     style="fill:url(#b)" />
  <path
     d="m 10.5,15 v 6"
     fill="#c1d3f1"
     stroke="#2a7efe"
     stroke-linejoin="round"
     id="path4" />
  <path
     d="m 37.5,15 v 6"
     fill="#c1d3f1"
     stroke="#2a7efe"
     stroke-linejoin="round"
     id="path5" />
  <path
     d="m 33.5,15 v 6"
     fill="#c1d3f1"
     stroke="#2a7efe"
     stroke-linejoin="round"
     id="path6" />
  <path
     d="m 29.5,15 v 6"
     fill="#c1d3f1"
     stroke="#2a7efe"
     stroke-linejoin="round"
     id="path7" />
  <path
     d="M 26.000001,16 H 22"
     fill="none"
     stroke="#00ff00"
     stroke-linejoin="round"
     stroke-width="1.99999"
     id="path8" />
  <path
     d="m 18.5,15 v 6"
     fill="#c1d3f1"
     stroke="#2a7efe"
     stroke-linejoin="round"
     id="path9" />
  <path
     d="m 14.5,15 v 6"
     fill="#c1d3f1"
     stroke="#2a7efe"
     stroke-linejoin="round"
     id="path10" />
  <path
     d="M 26.000001,20 H 22"
     fill="none"
     stroke="#ff0000"
     stroke-linejoin="round"
     stroke-width="1.99999"
     id="path11" />
  <path
     d="m 25.41438,32.65 c 1.60073,0 2.88941,1.1922 2.88941,2.673 v 3.3544 c 0,1.4808 -1.28868,2.673 -2.88941,2.673 -1.60073,0 -2.88938,-1.1922 -2.88938,-2.673 V 35.323 c 0,-1.4808 1.28865,-2.673 2.88938,-2.673 z"
     fill="none"
     stroke="#ffffff"
     stroke-linecap="round"
     stroke-linejoin="round"
     stroke-width="1.3"
     id="path12" />
  <path
     d="m 10.685607,32.65 v 5.8302 c 0,3.4865 -3.146619,3.1347 -3.935607,2.3426"
     fill="none"
     stroke="#ffffff"
     stroke-linecap="round"
     stroke-linejoin="round"
     stroke-width="1.3"
     id="path13" />
  <path
     d="M 31.89,41.3504 V 32.65 l 6.2023,8.7004 V 32.65"
     fill="none"
     stroke="#ffffff"
     stroke-linecap="round"
     stroke-linejoin="round"
     stroke-width="1.3"
     id="path14" />
  <path
     d="M 19.12011,33.2178 C 18.56495,32.8351 17.74062,32.65 16.75579,32.65 c -1.39173,0 -2.65814,0.732 -2.65814,2.2537 0,1.1921 1.00545,1.6823 2.65814,1.9691 2.30127,0.3994 2.65812,1.1756 2.65812,2.2239 0,1.8941 -1.57603,2.2537 -2.65812,2.2537 -0.84003,0 -1.70229,-0.1023 -2.78379,-0.6625"
     fill="none"
     stroke="#ffffff"
     stroke-linecap="round"
     stroke-linejoin="round"
     stroke-width="1.3"
     id="path15" />
</svg>
