<?xml version="1.0" encoding="UTF-8" standalone="no"?>
<svg
   height="32"
   width="32"
   version="1.1"
   id="svg18"
   sodipodi:docname="File_05_32.svg"
   inkscape:export-filename="File_05_32.png"
   inkscape:export-xdpi="96"
   inkscape:export-ydpi="96"
   inkscape:version="1.2-beta (1b65182ce9, 2022-04-05)"
   xmlns:inkscape="http://www.inkscape.org/namespaces/inkscape"
   xmlns:sodipodi="http://sodipodi.sourceforge.net/DTD/sodipodi-0.dtd"
   xmlns="http://www.w3.org/2000/svg"
   xmlns:svg="http://www.w3.org/2000/svg">
  <defs
     id="defs22" />
  <sodipodi:namedview
     id="namedview20"
     pagecolor="#ffffff"
     bordercolor="#666666"
     borderopacity="1.0"
     inkscape:pageshadow="2"
     inkscape:pageopacity="0.0"
     inkscape:pagecheckerboard="0"
     inkscape:deskcolor="#d1d1d1"
     showgrid="true"
     inkscape:zoom="28.6875"
     inkscape:cx="16"
     inkscape:cy="16"
     inkscape:current-layer="svg18">
    <inkscape:grid
       type="xygrid"
       id="grid1022" />
  </sodipodi:namedview>
  <g
     fill="none"
     stroke="#00aad4"
     stroke-linecap="round"
     id="g16">
    <path
       d="m14.5 31h-9.5v-30h14.5l7.5 7.5v3.964251"
       stroke-linejoin="round"
       stroke-width="2"
       id="path2" />
    <path
       d="m19 1v8h8"
       stroke-linejoin="round"
       stroke-width="2"
       id="path4" />
    <g
       id="g14">
      <circle
         cx="23"
         cy="23"
         r="8"
         stroke-dashoffset="2.99996"
         stroke-linejoin="round"
         stroke-width="2"
         id="circle6" />
      <g
         stroke="#00aad4"
         transform="matrix(1.41421356 1.41421356 -1.41421356 1.41421356 24.414214 -10.941126)"
         id="g12">
        <path
           d="m10.085786 11.085786 2.828428 2.828428"
           id="path8" />
        <path
           d="m12.914214 11.085786-2.828428 2.828428"
           id="path10" />
      </g>
    </g>
  </g>
</svg>
