<?xml version="1.0" encoding="UTF-8" standalone="no"?>
<svg
   height="33"
   width="33"
   version="1.1"
   id="svg4870"
   sodipodi:docname="bookmark8_300.svg"
   inkscape:export-filename="bookmark8_300.png"
   inkscape:export-xdpi="96"
   inkscape:export-ydpi="96"
   inkscape:version="1.2.2 (732a01da63, 2022-12-09)"
   xmlns:inkscape="http://www.inkscape.org/namespaces/inkscape"
   xmlns:sodipodi="http://sodipodi.sourceforge.net/DTD/sodipodi-0.dtd"
   xmlns="http://www.w3.org/2000/svg"
   xmlns:svg="http://www.w3.org/2000/svg">
  <defs
     id="defs4874" />
  <sodipodi:namedview
     id="namedview4872"
     pagecolor="#ffffff"
     bordercolor="#666666"
     borderopacity="1.0"
     inkscape:showpageshadow="2"
     inkscape:pageopacity="0.0"
     inkscape:pagecheckerboard="0"
     inkscape:deskcolor="#d1d1d1"
     showgrid="true"
     inkscape:zoom="27.818182"
     inkscape:cx="16.5"
     inkscape:cy="16.5"
     inkscape:current-layer="svg4870">
    <inkscape:grid
       type="xygrid"
       id="grid4993" />
  </sodipodi:namedview>
  <radialGradient
     id="a"
     cx="16.5"
     cy="16.5"
     gradientUnits="userSpaceOnUse"
     r="16.5">
    <stop
       offset="0"
       stop-color="#4881cc"
       id="stop4859" />
    <stop
       offset=".81818181"
       stop-color="#4781cc"
       id="stop4861" />
    <stop
       offset="1"
       stop-color="#569af2"
       id="stop4863" />
  </radialGradient>
  <circle
     cx="16.5"
     cy="16.5"
     fill="url(#a)"
     r="16.5"
     id="circle4866" />
  <path
     d="m 16.498783,26.498551 c -2.254106,0.0421 -4.685076,-0.832577 -5.791525,-2.729292 -0.8161658,-1.407344 -0.8694498,-3.113941 -0.447118,-4.632487 0.424188,-1.298181 1.371292,-2.477586 2.69187,-3.118258 -1.696562,-0.8221 -2.646776,-2.617795 -2.501809,-4.344748 -0.07313,-1.9033442 1.100546,-3.8310652 3.04252,-4.5971192 1.877,-0.7688617 4.134917,-0.7688617 6.011928,0 1.969758,0.775234 3.137821,2.742195 3.042535,4.6677882 0.131981,1.712727 -0.865629,3.476999 -2.545965,4.274079 1.987944,0.984726 3.130416,3.100418 2.98665,5.139451 0.03061,1.953679 -1.189081,3.905393 -3.167387,4.708498 -1.030719,0.454299 -2.184208,0.633554 -3.321793,0.632042 z m 0,-2.640216 c 1.447408,0.05722 2.982599,-0.731176 3.362831,-2.06767 0.379325,-1.278621 0.06002,-2.863808 -1.238196,-3.612714 -1.486798,-0.83938 -3.696971,-0.721028 -4.889964,0.512719 -0.854491,0.925981 -0.911486,2.29742 -0.497125,3.403027 0.503569,1.193835 1.924169,1.801031 3.262454,1.764638 z m 0,-8.850111 c 1.333996,0.06372 2.631663,-0.786248 2.925245,-1.990197 0.315893,-1.212246 0.09717,-2.728525 -1.167772,-3.4304052 -1.515829,-0.882248 -3.943601,-0.43756 -4.588573,1.2102462 -0.465903,1.284143 -0.254967,2.967001 1.073628,3.764784 0.514813,0.315741 1.143397,0.447065 1.757472,0.445553 z"
     fill="#ffffff"
     stroke-width="0.999995"
     id="path1387"
     style="fill:#ffffff" />
</svg>
