<?xml version="1.0" encoding="UTF-8" standalone="no"?>
<svg
   width="36"
   height="36"
   version="1.1"
   viewBox="0 0 36 36"
   id="svg17"
   sodipodi:docname="thtmldatasetformgridproducer_150.svg"
   inkscape:export-filename="thtmldatasetformgridproducer_150.png"
   inkscape:export-xdpi="96"
   inkscape:export-ydpi="96"
   inkscape:version="1.3.2 (091e20e, 2023-11-25, custom)"
   xmlns:inkscape="http://www.inkscape.org/namespaces/inkscape"
   xmlns:sodipodi="http://sodipodi.sourceforge.net/DTD/sodipodi-0.dtd"
   xmlns:xlink="http://www.w3.org/1999/xlink"
   xmlns="http://www.w3.org/2000/svg"
   xmlns:svg="http://www.w3.org/2000/svg">
  <defs
     id="defs17" />
  <sodipodi:namedview
     id="namedview17"
     pagecolor="#ffffff"
     bordercolor="#000000"
     borderopacity="0.25"
     inkscape:showpageshadow="2"
     inkscape:pageopacity="0.0"
     inkscape:pagecheckerboard="0"
     inkscape:deskcolor="#d1d1d1"
     showgrid="true"
     inkscape:current-layer="svg17">
    <inkscape:grid
       id="grid17"
       units="px"
       originx="0"
       originy="0"
       spacingx="0.5"
       spacingy="0.5"
       empcolor="#0099e5"
       empopacity="0.30196078"
       color="#0099e5"
       opacity="0.14901961"
       empspacing="2"
       dotted="false"
       gridanglex="30"
       gridanglez="30"
       visible="true" />
  </sodipodi:namedview>
  <linearGradient
     id="a"
     x1="-19.723961"
     x2="-10.72396"
     y1="1026.8741"
     y2="1026.8741"
     gradientUnits="userSpaceOnUse"
     xlink:href="#b" />
  <linearGradient
     id="b">
    <stop
       stop-color="#4276c4"
       offset="0"
       id="stop1" />
    <stop
       stop-color="#80b3ff"
       offset=".34375"
       id="stop2" />
    <stop
       stop-color="#04a"
       offset="1"
       id="stop3" />
  </linearGradient>
  <linearGradient
     id="c"
     x1="-19.723961"
     x2="-10.72396"
     y1="1023.8741"
     y2="1023.8741"
     gradientUnits="userSpaceOnUse"
     xlink:href="#b" />
  <linearGradient
     id="d"
     x1="-19.723961"
     x2="-10.72396"
     y1="1020.8742"
     y2="1020.8742"
     gradientUnits="userSpaceOnUse"
     xlink:href="#b" />
  <g
     transform="matrix(1.875 0 0 1.875 40.857425 -1912.1389)"
     fill-rule="evenodd"
     stroke-linecap="round"
     stroke-linejoin="round"
     id="g9">
    <g
       fill="#bdd1ec"
       id="g8">
      <ellipse
         cx="-14.72396"
         cy="1032.3741"
         rx="5"
         ry="1.5"
         stroke="url(#a)"
         stroke-width="2"
         id="ellipse3" />
      <ellipse
         cx="-14.72396"
         cy="1030.4156"
         rx="5.494309"
         ry="1.958482"
         stroke="#fff"
         id="ellipse4" />
      <ellipse
         cx="-14.72396"
         cy="1029.3741"
         rx="5"
         ry="1.5"
         stroke="url(#c)"
         stroke-width="2"
         id="ellipse5" />
      <ellipse
         cx="-14.72396"
         cy="1027.4156"
         rx="5.494309"
         ry="1.958482"
         stroke="#fff"
         id="ellipse6" />
      <ellipse
         cx="-14.72396"
         cy="1026.3741"
         rx="5"
         ry="1.5"
         stroke="url(#d)"
         stroke-width="2"
         id="ellipse7" />
      <ellipse
         cx="-14.72396"
         cy="1024.4156"
         rx="5.494309"
         ry="1.958482"
         stroke="#fff"
         id="ellipse8" />
    </g>
    <ellipse
       cx="-14.72396"
       cy="1023.3741"
       rx="5.5"
       ry="2"
       fill="#80b3ff"
       stroke="url(#a)"
       id="ellipse9" />
  </g>
  <text
     x="-28"
     y="49.249962"
     stroke-width="1.5"
     id="text9"><tspan
       x="-28"
       y="71.117149"
       stroke-width="1.5"
       id="tspan9" /></text>
  <path
     d="m12.750003 17.75h22.499997v17.5h-22.499997z"
     fill="#ffffff"
     stroke="#d3bc5f"
     stroke-dashoffset="1.49998"
     stroke-linecap="square"
     stroke-linejoin="round"
     stroke-width="1.5"
     id="path9" />
  <path
     d="m13.5 22.5h21"
     fill="none"
     stroke="#999999"
     id="path10" />
  <path
     d="m18.5 18.5v16"
     fill="none"
     stroke="#999999"
     id="path11" />
  <path
     d="m30.5 18.5v16"
     fill="none"
     stroke="#999999"
     id="path12" />
  <path
     d="m24.5 18.5v16"
     fill="none"
     stroke="#999999"
     id="path13" />
  <path
     d="m13.5 30.5h21"
     fill="none"
     stroke="#999999"
     id="path14" />
  <path
     d="m13.5 26.5h21"
     fill="none"
     stroke="#999999"
     id="path15" />
  <g
     transform="translate(6,-87)"
     fill="none"
     stroke="#0097bd"
     stroke-linecap="round"
     stroke-width="2"
     id="g17">
    <path
       d="m24 91v10"
       id="path16" />
    <path
       d="m27 98-3 3-3-3"
       stroke-linejoin="round"
       id="path17" />
  </g>
</svg>
