<?xml version="1.0" encoding="UTF-8" standalone="no"?>
<svg
   height="16"
   width="16"
   version="1.1"
   id="svg191"
   sodipodi:docname="Secure_06_16.svg"
   inkscape:version="1.2.2 (732a01da63, 2022-12-09)"
   xmlns:inkscape="http://www.inkscape.org/namespaces/inkscape"
   xmlns:sodipodi="http://sodipodi.sourceforge.net/DTD/sodipodi-0.dtd"
   xmlns="http://www.w3.org/2000/svg"
   xmlns:svg="http://www.w3.org/2000/svg">
  <defs
     id="defs195" />
  <sodipodi:namedview
     id="namedview193"
     pagecolor="#ffffff"
     bordercolor="#000000"
     borderopacity="0.25"
     inkscape:showpageshadow="2"
     inkscape:pageopacity="0.0"
     inkscape:pagecheckerboard="0"
     inkscape:deskcolor="#d1d1d1"
     showgrid="true"
     inkscape:zoom="56.875"
     inkscape:cx="6.7076923"
     inkscape:cy="8"
     inkscape:current-layer="svg191">
    <inkscape:grid
       type="xygrid"
       id="grid1122" />
  </sodipodi:namedview>
  <linearGradient
     id="a"
     gradientTransform="matrix(3.583326 0 0 3.6889308 -.084708 .028969)"
     gradientUnits="userSpaceOnUse"
     x1="1.499774"
     x2="3.614834"
     y1="1.322335"
     y2="2.204926">
    <stop
       offset="0"
       stop-color="#80b5fe"
       id="stop161" />
    <stop
       offset="1"
       stop-color="#2a7efe"
       id="stop163" />
  </linearGradient>
  <linearGradient
     id="b"
     gradientTransform="matrix(3.583326 0 0 3.6889308 -.084708 .028969)"
     gradientUnits="userSpaceOnUse"
     x1=".530372"
     x2="3.879216"
     y1="1.145817"
     y2="2.557962">
    <stop
       offset="0"
       stop-color="#e7c962"
       id="stop166" />
    <stop
       offset="1"
       stop-color="#d4a41c"
       id="stop168" />
  </linearGradient>
  <filter
     id="c"
     color-interpolation-filters="sRGB"
     height="1.1801321"
     width="1.190248"
     x="-0.095123999"
     y="-0.10785206">
    <feGaussianBlur
       stdDeviation=".1328125"
       id="feGaussianBlur171" />
  </filter>
  <linearGradient
     id="d"
     gradientTransform="matrix(.56885497 0 0 -.49309421 -25.046034 12.927598)"
     gradientUnits="userSpaceOnUse"
     x1="52.5"
     x2="61.5"
     y1="7"
     y2="7">
    <stop
       offset="0"
       stop-color="#fc0"
       id="stop174" />
    <stop
       offset=".37840304"
       stop-color="#f9f9f9"
       id="stop176" />
    <stop
       offset="1"
       stop-color="#ffd42a"
       id="stop178" />
  </linearGradient>
  <g
     stroke-linejoin="round"
     id="g189">
    <path
       d="m1.5000003 8.8139499-.0000003-5.8604691c1.8947368 0 4.4210526-.9767448 6.000001-1.95348959 1.5789467.97674479 4.105262 1.95348959 5.999999 1.95348959v5.8604691c0 2.2856091-3.157894 5.8604681-5.999999 6.1860511-2.8421059-.325583-6.0000007-3.900442-6.0000007-6.1860511z"
       fill="url(#a)"
       stroke="url(#b)"
       stroke-linecap="round"
       id="path181" />
    <path
       d="m5.499998 7.500109v-1.5158896c0-1.0958554.8954312-1.9842214 2.0000017-1.9842214 1.1045706 0 2.0000024.888366 2.0000024 1.9842214v1.5158896"
       fill="none"
       stroke="#b3b3b3"
       stroke-width=".999996"
       id="path183" />
    <path
       d="m5 7.8021661v-1.9099298c0-1.380712 1.119288-2.5 2.5-2.5s2.5 1.119288 2.5 2.5v1.9099298"
       fill="none"
       filter="url(#c)"
       stroke="#fff"
       stroke-width=".31374"
       transform="matrix(.80000066 0 0 .79368848 1.499995 1.307619)"
       id="path185" />
    <path
       d="m10.25 11.250108v-3.4999988h-5.4999995v3.4999988z"
       fill="url(#d)"
       stroke="#d4aa00"
       stroke-linecap="round"
       stroke-width=".500001"
       id="path187" />
  </g>
</svg>
