<?xml version="1.0" encoding="UTF-8" standalone="no"?>
<svg
   height="48"
   width="48"
   version="1.1"
   id="svg18"
   sodipodi:docname="Remove_02_48.svg"
   inkscape:export-filename="Remove_02_48.png"
   inkscape:export-xdpi="96"
   inkscape:export-ydpi="96"
   inkscape:version="1.2-beta (1b65182ce9, 2022-04-05)"
   xmlns:inkscape="http://www.inkscape.org/namespaces/inkscape"
   xmlns:sodipodi="http://sodipodi.sourceforge.net/DTD/sodipodi-0.dtd"
   xmlns="http://www.w3.org/2000/svg"
   xmlns:svg="http://www.w3.org/2000/svg">
  <defs
     id="defs22" />
  <sodipodi:namedview
     id="namedview20"
     pagecolor="#ffffff"
     bordercolor="#666666"
     borderopacity="1.0"
     inkscape:pageshadow="2"
     inkscape:pageopacity="0.0"
     inkscape:pagecheckerboard="0"
     inkscape:deskcolor="#d1d1d1"
     showgrid="true"
     inkscape:zoom="19.125"
     inkscape:cx="23.973856"
     inkscape:cy="24"
     inkscape:current-layer="svg18">
    <inkscape:grid
       type="xygrid"
       id="grid147" />
  </sodipodi:namedview>
  <g
     fill="none"
     stroke="#00aad4"
     id="g16"
     transform="scale(2)">
    <path
       d="M 10,23.25 H 3.75 V 0.75 H 15 L 20.25,6 v 4.5"
       stroke-linecap="round"
       stroke-width="1.5"
       id="path2" />
    <path
       d="M 14.75,0.5 V 6.249999 H 20.5"
       stroke-width="1.5"
       id="path4" />
    <g
       stroke-linecap="round"
       id="g14">
      <path
         d="M 18.750059,23.250005 H 16.249941"
         stroke-width="1.49999"
         id="path6" />
      <g
         stroke-linejoin="round"
         stroke-width="2"
         transform="matrix(1.0606602,1.0606602,-1.0606602,1.0606602,18.56066,-6.895185)"
         id="g12">
        <path
           d="M 15.242641,12 H 6.7573592"
           id="path8" />
        <path
           d="M 11,16.242641 V 7.7573594"
           id="path10" />
      </g>
    </g>
  </g>
</svg>
