<?xml version="1.0" encoding="UTF-8" standalone="no"?>
<svg
   height="64"
   width="64"
   version="1.1"
   id="svg825"
   sodipodi:docname="Database_07_64.svg"
   inkscape:version="1.2-beta (1b65182ce9, 2022-04-05)"
   inkscape:export-filename="Database_07_64.png"
   inkscape:export-xdpi="96"
   inkscape:export-ydpi="96"
   xmlns:inkscape="http://www.inkscape.org/namespaces/inkscape"
   xmlns:sodipodi="http://sodipodi.sourceforge.net/DTD/sodipodi-0.dtd"
   xmlns:xlink="http://www.w3.org/1999/xlink"
   xmlns="http://www.w3.org/2000/svg"
   xmlns:svg="http://www.w3.org/2000/svg">
  <defs
     id="defs829">
    <radialGradient
       id="a-8"
       cx="-11.5"
       cy="8.5"
       gradientTransform="rotate(90,-11.5,8.5)"
       gradientUnits="userSpaceOnUse"
       r="3.5">
      <stop
         offset="0"
         stop-color="#fff"
         id="stop312" />
      <stop
         offset="1"
         stop-color="#d5e5ff"
         id="stop314" />
    </radialGradient>
    <linearGradient
       id="b-9"
       gradientTransform="matrix(0.62056934,0,0,0.56353613,-23.504776,9.082872)"
       gradientUnits="userSpaceOnUse"
       x1="52.5"
       x2="61.5"
       y1="7"
       y2="7">
      <stop
         offset="0"
         stop-color="#fc0"
         id="stop317" />
      <stop
         offset=".37840304"
         stop-color="#f9f9f9"
         id="stop319" />
      <stop
         offset="1"
         stop-color="#ffd42a"
         id="stop321" />
    </linearGradient>
    <radialGradient
       id="c-5"
       cx="33.463123"
       cy="-1.059664"
       gradientTransform="matrix(0.43551876,-0.33713307,0.33873716,0.43345666,-2.118107,21.63975)"
       gradientUnits="userSpaceOnUse"
       r="5.5">
      <stop
         offset="0"
         id="stop324" />
      <stop
         offset="1"
         stop-color="#ccc"
         id="stop326" />
    </radialGradient>
  </defs>
  <sodipodi:namedview
     id="namedview827"
     pagecolor="#ffffff"
     bordercolor="#666666"
     borderopacity="1.0"
     inkscape:pageshadow="2"
     inkscape:pageopacity="0.0"
     inkscape:pagecheckerboard="0"
     inkscape:deskcolor="#d1d1d1"
     showgrid="true"
     inkscape:zoom="14.34375"
     inkscape:cx="29.455338"
     inkscape:cy="32"
     inkscape:current-layer="svg825">
    <inkscape:grid
       type="xygrid"
       id="grid948" />
  </sodipodi:namedview>
  <linearGradient
     id="a"
     gradientUnits="userSpaceOnUse"
     x1="6"
     x2="24.000001"
     xlink:href="#b"
     y1="14.000017"
     y2="14.000017" />
  <linearGradient
     id="b">
    <stop
       offset="0"
       stop-color="#4276c4"
       id="stop792" />
    <stop
       offset=".34375"
       stop-color="#80b3ff"
       id="stop794" />
    <stop
       offset="1"
       stop-color="#04a"
       id="stop796" />
  </linearGradient>
  <linearGradient
     id="c"
     gradientUnits="userSpaceOnUse"
     x1="6"
     x2="24.000001"
     xlink:href="#b"
     y1="8.000017"
     y2="8.000017" />
  <linearGradient
     id="d"
     gradientUnits="userSpaceOnUse"
     x1="6"
     x2="24.000001"
     xlink:href="#b"
     y1="2.000217"
     y2="2.000217" />
  <g
     stroke-linecap="round"
     stroke-linejoin="round"
     transform="matrix(2 0 0 2 -4 0)"
     id="g817">
    <g
       fill="none"
       id="g813">
      <ellipse
         cx="16"
         cy="25"
         rx="10"
         ry="3"
         stroke="url(#a)"
         stroke-width="4"
         id="ellipse801" />
      <ellipse
         cx="16"
         cy="21.083008"
         rx="10.988618"
         ry="3.916963"
         stroke="#fff"
         stroke-width="2"
         id="ellipse803" />
      <ellipse
         cx="16"
         cy="19"
         rx="10"
         ry="3"
         stroke="url(#c)"
         stroke-width="4"
         id="ellipse805" />
      <ellipse
         cx="16"
         cy="15.083007"
         rx="10.988618"
         ry="3.916963"
         stroke="#fff"
         stroke-width="2"
         id="ellipse807" />
      <ellipse
         cx="16"
         cy="13"
         rx="10"
         ry="3"
         stroke="url(#d)"
         stroke-width="4"
         id="ellipse809" />
      <ellipse
         cx="16"
         cy="9.083007"
         rx="10.988618"
         ry="3.916963"
         stroke="#fff"
         stroke-width="2"
         id="ellipse811" />
    </g>
    <ellipse
       cx="16"
       cy="7"
       fill="#80b3ff"
       fill-rule="evenodd"
       rx="11"
       ry="4"
       stroke="url(#a)"
       stroke-width="2"
       id="ellipse815" />
  </g>
  <g
     transform="scale(4)"
     id="g339">
    <path
       d="m 9,11 h 6 v 4 H 9 Z"
       fill="url(#a)"
       stroke="#ffffff"
       stroke-linejoin="round"
       stroke-width="2"
       id="path329"
       style="fill:url(#a-8)" />
    <path
       d="m 9,11 h 6 v 4 H 9 Z"
       fill="url(#b)"
       stroke="#d4aa00"
       stroke-linejoin="round"
       stroke-width="0.5"
       id="path331"
       style="fill:url(#b-9)" />
    <g
       transform="translate(-0.096763)"
       id="g337">
      <path
         d="M 9.9675596,10.746555 V 9.4353494 c 0,-1.2069325 0.9532764,-2.1853444 2.1292044,-2.1853444 1.175927,0 2.129203,0.9784119 2.129203,2.1853444 v 1.3112056"
         fill="none"
         stroke="#ffffff"
         stroke-width="2.50001"
         id="path333" />
      <path
         d="m 12.096764,6.7202245 c -1.464178,0 -2.6615064,1.1916583 -2.6615062,2.6489023 V 10.75 H 10.322427 V 9.3691268 c 0,-0.9366719 0.833209,-1.7659349 1.774337,-1.7659349 0.941127,0 1.774337,0.829263 1.774337,1.7659349 V 10.75 h 0.887167 V 9.3691268 c 0,-1.457244 -1.197327,-2.6489023 -2.661504,-2.6489023 z"
         fill="url(#c)"
         stroke-width="0.599999"
         id="path335"
         style="fill:url(#c-5)" />
    </g>
  </g>
</svg>
