<?xml version="1.0" encoding="UTF-8" standalone="no"?>
<svg
   height="16"
   width="16"
   version="1.1"
   id="svg300"
   sodipodi:docname="Print_02_16.svg"
   inkscape:version="1.2-beta (1b65182ce9, 2022-04-05)"
   inkscape:export-filename="Print_02_16.png"
   inkscape:export-xdpi="96"
   inkscape:export-ydpi="96"
   xmlns:inkscape="http://www.inkscape.org/namespaces/inkscape"
   xmlns:sodipodi="http://sodipodi.sourceforge.net/DTD/sodipodi-0.dtd"
   xmlns:xlink="http://www.w3.org/1999/xlink"
   xmlns="http://www.w3.org/2000/svg"
   xmlns:svg="http://www.w3.org/2000/svg">
  <defs
     id="defs304" />
  <sodipodi:namedview
     id="namedview302"
     pagecolor="#ffffff"
     bordercolor="#666666"
     borderopacity="1.0"
     inkscape:pageshadow="2"
     inkscape:pageopacity="0.0"
     inkscape:pagecheckerboard="0"
     inkscape:deskcolor="#d1d1d1"
     showgrid="true"
     inkscape:zoom="57.375"
     inkscape:cx="8"
     inkscape:cy="8"
     inkscape:current-layer="svg300">
    <inkscape:grid
       type="xygrid"
       id="grid2797" />
  </sodipodi:namedview>
  <linearGradient
     id="a">
    <stop
       offset="0"
       stop-color="#e6e6e6"
       id="stop263" />
    <stop
       offset="1"
       stop-color="#ccc"
       id="stop265" />
  </linearGradient>
  <linearGradient
     id="b">
    <stop
       offset="0"
       stop-color="#666"
       id="stop268" />
    <stop
       offset="1"
       stop-color="#999"
       id="stop270" />
  </linearGradient>
  <linearGradient
     id="c"
     gradientUnits="userSpaceOnUse"
     x1="10.5"
     x2="3"
     xlink:href="#b"
     y1="14.5"
     y2="8.5" />
  <linearGradient
     id="d"
     gradientUnits="userSpaceOnUse"
     x1="9"
     x2="5"
     xlink:href="#b"
     y1="12.5"
     y2="8.5" />
  <linearGradient
     id="e"
     gradientUnits="userSpaceOnUse"
     x1="2"
     x2="14"
     xlink:href="#a"
     y1="10"
     y2="13" />
  <linearGradient
     id="f"
     gradientUnits="userSpaceOnUse"
     x1="6.5"
     x2="9.5"
     xlink:href="#a"
     y1="9.5"
     y2="11.5" />
  <linearGradient
     id="g"
     gradientUnits="userSpaceOnUse"
     x1="10"
     x2="11"
     y1="7.5"
     y2="9.5">
    <stop
       offset="0"
       stop-color="#999"
       id="stop277" />
    <stop
       offset="1"
       stop-color="#666"
       id="stop279" />
  </linearGradient>
  <path
     d="m.5 9 1-3.5h13l1 3.5"
     fill="#e6e6e6"
     fill-rule="evenodd"
     stroke="url(#g)"
     stroke-linecap="round"
     stroke-linejoin="round"
     id="path282" />
  <path
     d="m3 9.2465449.5-2h9l.5 2"
     fill="none"
     stroke="#999"
     stroke-linecap="round"
     id="path284" />
  <g
     fill-rule="evenodd"
     id="g294">
    <path
       d="m3.5 7v-6.5h7l2 2v4.5"
       fill="#fff"
       stroke="#6995db"
       stroke-linejoin="round"
       id="path286" />
    <path
       d="m.5 9.5v5h15v-5z"
       fill="url(#e)"
       stroke="url(#c)"
       stroke-linecap="square"
       id="path288" />
    <path
       d="m2.5 11.5v4h11v-4"
       fill="#fff"
       stroke="#6e99dd"
       id="path290" />
    <path
       d="m2.5 9.5v2h11v-2z"
       fill="url(#f)"
       stroke="url(#d)"
       stroke-linecap="square"
       stroke-linejoin="round"
       id="path292" />
  </g>
  <path
     d="m5.5 2.5h4"
     fill="none"
     stroke="#bbd6f5"
     stroke-linecap="round"
     id="path296" />
  <path
     d="m5.5 4.5h5"
     fill="none"
     stroke="#bbd6f5"
     stroke-linecap="round"
     id="path298" />
  <path
     id="path2"
     style="fill:#2c5aa0;stroke:#ffffff;stroke-width:0.6;stroke-miterlimit:4;stroke-dasharray:none"
     d="M 12.077566,6.3785117 11.300079,7.7457427 10.699347,7.7463432 9.9221433,6.3791746 8.4947463,6.9704224 8.911915,8.4867215 8.4867081,8.9110807 6.9701628,8.4940673 6.3785131,9.9224357 l 1.367231,0.7774873 6.006e-4,0.600733 -1.3671673,0.777204 0.5912464,1.427394 1.5162991,-0.417165 0.4243592,0.425205 -0.4170134,1.516543 1.4283688,0.591652 0.7774855,-1.367233 0.600735,-6.02e-4 0.777203,1.36717 1.427394,-0.591249 -0.417165,-1.516297 0.425205,-0.424357 1.516543,0.417011 0.591651,-1.428367 -1.367231,-0.777487 -6.03e-4,-0.600731 1.36717,-0.7772054 -0.591249,-1.4273967 -1.516297,0.4171686 -0.424357,-0.4252069 0.417012,-1.5165451 z m -0.599763,3.4679786 a 1.2485503,1.2485503 0 0 1 0.675709,1.6313107 1.2485503,1.2485503 0 0 1 -1.63131,0.67571 1.2485503,1.2485503 0 0 1 -0.6757103,-1.63131 1.2485503,1.2485503 0 0 1 1.6313113,-0.6757107 z" />
</svg>
