<?xml version="1.0" encoding="UTF-8" standalone="no"?>
<svg
   height="16"
   viewBox="0 0 4.2333332 4.2333335"
   width="16"
   version="1.1"
   id="svg2"
   sodipodi:docname="Arrow_37_16.svg"
   inkscape:version="1.2.1 (9c6d41e410, 2022-07-14)"
   inkscape:export-filename="Arrow_37_16.png"
   inkscape:export-xdpi="96"
   inkscape:export-ydpi="96"
   xmlns:inkscape="http://www.inkscape.org/namespaces/inkscape"
   xmlns:sodipodi="http://sodipodi.sourceforge.net/DTD/sodipodi-0.dtd"
   xmlns="http://www.w3.org/2000/svg"
   xmlns:svg="http://www.w3.org/2000/svg">
  <defs
     id="defs6" />
  <sodipodi:namedview
     id="namedview4"
     pagecolor="#ffffff"
     bordercolor="#666666"
     borderopacity="1.0"
     inkscape:showpageshadow="2"
     inkscape:pageopacity="0.0"
     inkscape:pagecheckerboard="0"
     inkscape:deskcolor="#d1d1d1"
     showgrid="true"
     inkscape:zoom="57.375"
     inkscape:cx="7.503268"
     inkscape:cy="8"
     inkscape:current-layer="svg2">
    <inkscape:grid
       type="xygrid"
       id="grid1292" />
  </sodipodi:namedview>
  <g
     id="g5196"
     transform="translate(0.19842714)">
    <path
       style="fill:none;stroke:#00aad4;stroke-width:0.47625;stroke-linecap:round;stroke-linejoin:round;stroke-dasharray:none;stroke-opacity:1"
       d="M 1.7198025,1.1906252 0.79375,2.1166667 1.7198025,3.0427086"
       id="path183-5"
       sodipodi:nodetypes="ccc" />
    <path
       style="fill:none;stroke:#00aad4;stroke-width:0.47625;stroke-linecap:round;stroke-linejoin:round;stroke-dasharray:none;stroke-opacity:1"
       d="M 3.0427192,1.1906252 2.1166667,2.1166667 3.0427192,3.0427086"
       id="path5192"
       sodipodi:nodetypes="ccc" />
  </g>
</svg>
