<?xml version="1.0" encoding="UTF-8" standalone="no"?>
<svg
   width="36"
   height="36"
   version="1.1"
   viewBox="0 0 36 36"
   id="svg19"
   sodipodi:docname="thtmldatasetformeditproducer_150.svg"
   inkscape:export-filename="thtmldatasetformeditproducer_150.png"
   inkscape:export-xdpi="96"
   inkscape:export-ydpi="96"
   inkscape:version="1.3.2 (091e20e, 2023-11-25, custom)"
   xmlns:inkscape="http://www.inkscape.org/namespaces/inkscape"
   xmlns:sodipodi="http://sodipodi.sourceforge.net/DTD/sodipodi-0.dtd"
   xmlns:xlink="http://www.w3.org/1999/xlink"
   xmlns="http://www.w3.org/2000/svg"
   xmlns:svg="http://www.w3.org/2000/svg">
  <defs
     id="defs19" />
  <sodipodi:namedview
     id="namedview19"
     pagecolor="#ffffff"
     bordercolor="#000000"
     borderopacity="0.25"
     inkscape:showpageshadow="2"
     inkscape:pageopacity="0.0"
     inkscape:pagecheckerboard="0"
     inkscape:deskcolor="#d1d1d1"
     showgrid="true"
     inkscape:current-layer="g14">
    <inkscape:grid
       id="grid19"
       units="px"
       originx="0"
       originy="0"
       spacingx="0.5"
       spacingy="0.5"
       empcolor="#0099e5"
       empopacity="0.30196078"
       color="#0099e5"
       opacity="0.14901961"
       empspacing="2"
       dotted="false"
       gridanglex="30"
       gridanglez="30"
       visible="true" />
  </sodipodi:namedview>
  <linearGradient
     id="a"
     x1="-19.723961"
     x2="-10.72396"
     y1="1026.8741"
     y2="1026.8741"
     gradientUnits="userSpaceOnUse"
     xlink:href="#b" />
  <linearGradient
     id="b">
    <stop
       stop-color="#4276c4"
       offset="0"
       id="stop1" />
    <stop
       stop-color="#80b3ff"
       offset=".34375"
       id="stop2" />
    <stop
       stop-color="#04a"
       offset="1"
       id="stop3" />
  </linearGradient>
  <linearGradient
     id="c"
     x1="-19.723961"
     x2="-10.72396"
     y1="1023.8741"
     y2="1023.8741"
     gradientUnits="userSpaceOnUse"
     xlink:href="#b" />
  <linearGradient
     id="d"
     x1="-19.723961"
     x2="-10.72396"
     y1="1020.8742"
     y2="1020.8742"
     gradientUnits="userSpaceOnUse"
     xlink:href="#b" />
  <path
     d="m30 2v10"
     fill="none"
     stroke="#0097bd"
     stroke-linecap="round"
     stroke-width="2"
     id="path3" />
  <path
     d="M 33,9 30,11.999998 27,9"
     fill="none"
     stroke="#0097bd"
     stroke-linecap="round"
     stroke-linejoin="round"
     stroke-width="2"
     id="path4" />
  <g
     transform="matrix(1.875 0 0 1.875 40.857425 -1912.1389)"
     fill-rule="evenodd"
     stroke-linecap="round"
     stroke-linejoin="round"
     id="g10">
    <g
       fill="#bdd1ec"
       id="g9">
      <ellipse
         cx="-14.72396"
         cy="1032.3741"
         rx="5"
         ry="1.5"
         stroke="url(#a)"
         stroke-width="2"
         id="ellipse4" />
      <ellipse
         cx="-14.72396"
         cy="1030.4156"
         rx="5.494309"
         ry="1.958482"
         stroke="#fff"
         id="ellipse5" />
      <ellipse
         cx="-14.72396"
         cy="1029.3741"
         rx="5"
         ry="1.5"
         stroke="url(#c)"
         stroke-width="2"
         id="ellipse6" />
      <ellipse
         cx="-14.72396"
         cy="1027.4156"
         rx="5.494309"
         ry="1.958482"
         stroke="#fff"
         id="ellipse7" />
      <ellipse
         cx="-14.72396"
         cy="1026.3741"
         rx="5"
         ry="1.5"
         stroke="url(#d)"
         stroke-width="2"
         id="ellipse8" />
      <ellipse
         cx="-14.72396"
         cy="1024.4156"
         rx="5.494309"
         ry="1.958482"
         stroke="#fff"
         id="ellipse9" />
    </g>
    <ellipse
       cx="-14.72396"
       cy="1023.3741"
       rx="5.5"
       ry="2"
       fill="#80b3ff"
       stroke="url(#a)"
       id="ellipse10" />
  </g>
  <text
     x="-28"
     y="49.249962"
     stroke-width="1.5"
     id="text10"><tspan
       x="-28"
       y="71.117149"
       stroke-width="1.5"
       id="tspan10" /></text>
  <g
     stroke-width="1.5"
     id="g14">
    <path
       d="m19.75 14.75h15.499999v20.5h-15.499999z"
       fill="#fff"
       stroke="#f00"
       stroke-dashoffset="1.49998"
       stroke-linecap="square"
       stroke-linejoin="round"
       id="path10"
       style="stroke:#d3bc5f;stroke-opacity:1" />
    <path
       d="m22.999999 18.25h9"
       fill="none"
       stroke="#666"
       id="path11" />
    <path
       d="m22.999999 27.25h9"
       fill="none"
       stroke="#666"
       id="path12" />
    <path
       d="m22.999999 24.25h9"
       fill="none"
       stroke="#666"
       id="path13" />
    <path
       d="m22.999999 21.25h9"
       fill="none"
       stroke="#666"
       id="path14" />
  </g>
  <path
     d="m0.49999995 24.5h29v10.999998h-29z"
     fill="#fff"
     stroke="#b3b3b3"
     stroke-dashoffset="1.49998"
     stroke-linecap="square"
     stroke-linejoin="round"
     stroke-width=".999994"
     id="path15" />
  <g
     transform="matrix(1.4801403 0 0 1.5467948 -.052631 -15)"
     id="g19">
    <path
       d="m4.5453725 27.152923h0.8950787v3.878978h-0.8950787zm-2.4829792 0h0.8950787v3.878978h-0.8950787zm0.3668768 1.312649h2.7333185l-4.734e-4 0.898117h-2.7333185z"
       stroke-width=".660895"
       id="path16" />
    <path
       d="m7.3414813 27.470401h.9197543v3.561509h-.9197543zm-1.0869178-.317467h3.0935899v.704298h-3.0935899z"
       stroke-width=".660891"
       id="path17" />
    <path
       d="m13.561019 27.152933h1.337995v3.878977h-.922884v-3.011944l.03708.17074-1.030367 2.093688h-.896933l-1.030367-2.040333.03708-.224095v3.011944h-.922894v-3.878977h1.337995l1.026661 2.299107z"
       stroke-width=".660895"
       id="path18" />
    <path
       d="m16.006095 27.152923h.919754v3.878978h-.919754zm.409525 3.174679h2.033203v.704299h-2.033203z"
       stroke-width=".660891"
       id="path19" />
  </g>
</svg>
