<?xml version="1.0" encoding="UTF-8" standalone="no"?>
<svg
   height="64"
   viewBox="0 0 16.933333 16.933335"
   width="64"
   version="1.1"
   id="svg623"
   sodipodi:docname="Font_16_64.svg"
   inkscape:version="1.2 (dc2aedaf03, 2022-05-15)"
   inkscape:export-filename="Font_16_64.png"
   inkscape:export-xdpi="96"
   inkscape:export-ydpi="96"
   xmlns:inkscape="http://www.inkscape.org/namespaces/inkscape"
   xmlns:sodipodi="http://sodipodi.sourceforge.net/DTD/sodipodi-0.dtd"
   xmlns="http://www.w3.org/2000/svg"
   xmlns:svg="http://www.w3.org/2000/svg">
  <defs
     id="defs627">
    <filter
       inkscape:collect="always"
       style="color-interpolation-filters:sRGB"
       id="filter901"
       x="-0.0875056"
       y="-0.065621853"
       width="1.1750112"
       height="1.1312437">
      <feGaussianBlur
         inkscape:collect="always"
         stdDeviation="0.46301277"
         id="feGaussianBlur903" />
    </filter>
  </defs>
  <sodipodi:namedview
     id="namedview625"
     pagecolor="#ffffff"
     bordercolor="#666666"
     borderopacity="1.0"
     inkscape:showpageshadow="2"
     inkscape:pageopacity="0.0"
     inkscape:pagecheckerboard="0"
     inkscape:deskcolor="#d1d1d1"
     showgrid="true"
     inkscape:zoom="14.34375"
     inkscape:cx="32"
     inkscape:cy="32"
     inkscape:current-layer="svg623">
    <inkscape:grid
       type="xygrid"
       id="grid1262" />
  </sodipodi:namedview>
  <g
     id="g907">
    <path
       id="path342"
       style="fill:#ffffff;fill-opacity:1;stroke:none;stroke-width:1;filter:url(#filter901)"
       d="M 4.234367 0 A 1.0587001 1.0587001 0 0 0 3.1760337 1.0588501 L 3.1760337 9.5255171 C 3.1760338 11.060029 3.6552617 12.42837 4.6095379 13.382646 C 4.7761793 13.549288 5.016353 13.620142 5.2069175 13.757817 L 3.1760337 13.757817 A 1.0587001 1.0587001 0 0 0 2.1171835 14.81615 L 2.1171835 15.875001 A 1.0587001 1.0587001 0 0 0 3.1760337 16.933851 L 13.757817 16.933851 A 1.0587001 1.0587001 0 0 0 14.81615 15.875001 L 14.81615 14.81615 A 1.0587001 1.0587001 0 0 0 13.757817 13.757817 L 11.726416 13.757817 C 11.917051 13.620165 12.157586 13.549261 12.324313 13.382646 C 13.279077 12.428523 13.759884 11.06029 13.759884 9.5255171 L 13.759884 1.0588501 A 1.0587001 1.0587001 0 0 0 12.701034 0 L 11.113534 0 A 1.0587001 1.0587001 0 0 0 10.054684 1.0588501 L 10.054684 9.5255171 C 10.054684 10.083879 9.885786 10.444503 9.6366215 10.693405 C 9.3874568 10.942307 9.0254628 11.111467 8.466667 11.111467 C 7.9078687 11.111467 7.5582281 10.946207 7.3106652 10.697022 C 7.0631021 10.447836 6.8886833 10.074715 6.8786502 9.5058801 L 6.8786502 1.0588501 A 1.0587001 1.0587001 0 0 0 5.8203168 0 L 4.234367 0 z " />
    <path
       id="path4"
       style="fill:#000000;fill-opacity:1;stroke:none;stroke-width:1"
       d="m 3.175261,14.816669 v 1.058332 h 10.582812 v -1.058332 z m 5.291668,-1.058336 c -2.645836,0 -4.233336,-1.5875 -4.233336,-4.233332 V 1.058333 h 1.5875 v 8.466668 c 0.028,1.5875 1.058332,2.645832 2.645836,2.645832 1.5875,0 2.645832,-1.058332 2.645832,-2.645832 l -8e-6,-8.466668 h 1.587508 v 8.466668 c 0,2.645832 -1.5875,4.233332 -4.233332,4.233332 z"
       sodipodi:nodetypes="cccccsscccssccss" />
  </g>
</svg>
