<svg width="16" height="16" version="1.1" xmlns="http://www.w3.org/2000/svg">
 <rect x=".25" y="4.25" width="15.5" height="8.5" rx="1.3115385" fill="#ebfcff" stroke="#00aad4" stroke-linejoin="round" stroke-width=".5"/>
 <path d="M 2.969566,9.536287 H 5.05352 M 2.418,10.650193 4.011543,6.35 5.605087,10.650193" fill="none" stroke="#0088aa" stroke-linecap="round" stroke-linejoin="round" stroke-width=".7"/>
 <path d="m7.222 10.650193h1.751825c1.538672 0 1.269908-2.2019062-0.104459-2.2019062m-1.647366 2.2019062v-4.300193h1.647366c1.375782 0 1.269911 2.0982868 0 2.0982868h-1.647366" fill="none" stroke="#0088aa" stroke-linecap="round" stroke-linejoin="round" stroke-width=".7"/>
 <path d="m14.188825 9.8331261c-0.283643 1.0526939-2.609825 1.3375779-2.609825-0.6761089v-1.3138079c0-2.0136872 2.326182-1.7288002 2.609825-0.6761083" fill="none" stroke="#0088aa" stroke-linecap="round" stroke-linejoin="round" stroke-width=".7"/>
</svg>
