<?xml version="1.0" encoding="UTF-8" standalone="no"?>
<svg
   height="36"
   width="36"
   version="1.1"
   id="svg385"
   sodipodi:docname="Add_10_36.svg"
   inkscape:export-filename="Add_10_36.png"
   inkscape:export-xdpi="96"
   inkscape:export-ydpi="96"
   inkscape:version="1.2.2 (732a01da63, 2022-12-09)"
   xmlns:inkscape="http://www.inkscape.org/namespaces/inkscape"
   xmlns:sodipodi="http://sodipodi.sourceforge.net/DTD/sodipodi-0.dtd"
   xmlns="http://www.w3.org/2000/svg"
   xmlns:svg="http://www.w3.org/2000/svg">
  <defs
     id="defs389" />
  <sodipodi:namedview
     id="namedview387"
     pagecolor="#ffffff"
     bordercolor="#666666"
     borderopacity="1.0"
     inkscape:showpageshadow="2"
     inkscape:pageopacity="0.0"
     inkscape:pagecheckerboard="0"
     inkscape:deskcolor="#d1d1d1"
     showgrid="true"
     inkscape:zoom="25.5"
     inkscape:cx="18.078431"
     inkscape:cy="18"
     inkscape:current-layer="svg385">
    <inkscape:grid
       type="xygrid"
       id="grid876" />
  </sodipodi:namedview>
  <circle
     cx="18"
     cy="18"
     r="15"
     style="fill:#e0edff;fill-rule:evenodd;stroke:#2a7efe;stroke-width:2.8;stroke-linecap:round;stroke-linejoin:round;stroke-dasharray:none"
     id="circle383" />
  <path
     d="M 18,11 V 25"
     id="path705"
     style="fill:none;stroke:#2a7efe;stroke-width:3;stroke-linecap:round;stroke-dasharray:none;stroke-opacity:1"
     sodipodi:nodetypes="cc" />
  <path
     d="M 25,18 H 11"
     id="path707"
     style="fill:none;stroke:#2a7efe;stroke-width:3;stroke-linecap:round;stroke-dasharray:none;stroke-opacity:1"
     sodipodi:nodetypes="cc" />
</svg>
