<?xml version="1.0" encoding="UTF-8" standalone="no"?>
<svg
   width="24"
   height="24"
   version="1.1"
   viewBox="0 0 24 24"
   id="svg12"
   sodipodi:docname="Health_16_24.svg"
   inkscape:version="1.3.2 (091e20e, 2023-11-25, custom)"
   xmlns:inkscape="http://www.inkscape.org/namespaces/inkscape"
   xmlns:sodipodi="http://sodipodi.sourceforge.net/DTD/sodipodi-0.dtd"
   xmlns="http://www.w3.org/2000/svg"
   xmlns:svg="http://www.w3.org/2000/svg">
  <defs
     id="defs12" />
  <sodipodi:namedview
     id="namedview12"
     pagecolor="#ffffff"
     bordercolor="#000000"
     borderopacity="0.25"
     inkscape:showpageshadow="2"
     inkscape:pageopacity="0.0"
     inkscape:pagecheckerboard="0"
     inkscape:deskcolor="#d1d1d1"
     showgrid="true"
     inkscape:current-layer="svg12">
    <inkscape:grid
       id="grid12"
       units="px"
       originx="0"
       originy="0"
       spacingx="0.5"
       spacingy="0.5"
       empcolor="#0099e5"
       empopacity="0.30196078"
       color="#0099e5"
       opacity="0.14901961"
       empspacing="2"
       dotted="false"
       gridanglex="30"
       gridanglez="30"
       visible="true" />
  </sodipodi:namedview>
  <path
     d="m16.499973 3.7489831 1.499979 1.4999784"
     fill="none"
     stroke="#ff7f00"
     stroke-linecap="round"
     stroke-width=".8"
     id="path1" />
  <path
     d="m18.749941 5.9989507 1.499978 1.4999783"
     fill="none"
     stroke="#ff7f00"
     stroke-linecap="round"
     stroke-width=".8"
     id="path2" />
  <path
     d="m11.250049 8.998907 1.499978 1.499978"
     fill="none"
     stroke="#ff7f00"
     stroke-linecap="round"
     stroke-width=".8"
     id="path3" />
  <path
     d="m13.500016 11.248874 1.499979 1.499979"
     fill="none"
     stroke="#ff7f00"
     stroke-linecap="round"
     stroke-width=".8"
     id="path4" />
  <path
     d="m9.000081 11.248874 1.499979 1.499979"
     fill="none"
     stroke="#ff7f00"
     stroke-linecap="round"
     stroke-width=".8"
     id="path5" />
  <path
     d="m11.250049 13.498842 1.499978 1.499978"
     fill="none"
     stroke="#ff7f00"
     stroke-linecap="round"
     stroke-width=".8"
     id="path6" />
  <path
     d="m3.7501562 16.498799 1.4999784 1.499978"
     fill="none"
     stroke="#ff7f00"
     stroke-linecap="round"
     stroke-width=".8"
     id="path7" />
  <path
     d="m6.0001238 18.748766 1.4999782 1.499979"
     fill="none"
     stroke="#ff7f00"
     stroke-linecap="round"
     stroke-width=".8"
     id="path8" />
  <path
     d="m16.877897 1.8769397c-1.685587 1.685588-1.652319 4.1220155-1.652319 6.3719783 0 2.249964-0.03327 4.313486-1.347637 5.62785-1.120907 1.120906-2.638307 1.310369-4.499903 1.341777l-3e-3 1.048812c1.95673-0.02266 3.802992-0.202496 5.246958-1.646461 1.685587-1.685587 1.652319-4.122014 1.652319-6.371978 0-2.2499628 0.03327-4.3134855 1.347638-5.6278483 0.206143-0.2052128 0.206143-0.5389172 0-0.74413-0.20468-0.2031164-0.539456-0.2031121-0.744131 0z"
     fill="#2a7efe"
     stroke-linecap="round"
     stroke-width="1.49998"
     id="path9" />
  <path
     d="m7.124812 15.230263c-1.9567347 0.02266-3.8027379 0.202495-5.246704 1.64646-0.2061441 0.205215-0.2061441 0.538918 0 0.74413 0.2052128 0.206144 0.5389172 0.206144 0.74413 0 1.1209063-1.120905 2.6383039-1.341777 4.500165-1.341777z"
     fill="#2a7efe"
     stroke-linecap="round"
     stroke-width="1.49998"
     id="path10" />
  <path
     d="m16.877968 7.718653-3e-3 1.048812c1.956735-0.02267 3.802958-0.202494 5.246924-1.64646 0.206144-0.205213 0.206144-0.5389173 0-0.7441301-0.20467-0.2031068-0.539387-0.2031082-0.744059 0-1.120906 1.1209061-2.638269 1.3103711-4.499865 1.3417781z"
     fill="#2a7efe"
     stroke-linecap="round"
     stroke-width="1.49998"
     id="path11" />
  <path
     d="m14.622038 8.779184 0.0029-1.048813c-1.956731 0.02267-3.802991 0.202495-5.246958 1.646461-1.685588 1.685588-1.65232 4.122014-1.65232 6.371978 0 2.249966-0.03327 4.313486-1.3476369 5.627848-0.2061442 0.205214-0.2061442 0.538917 0 0.74413 0.2052127 0.206144 0.5389169 0.206144 0.7441299 0 1.685588-1.685588 1.65232-4.122014 1.65232-6.371978s0.03327-4.313485 1.347638-5.627849c1.120905-1.120906 2.638306-1.31037 4.499902-1.341777z"
     fill="#2a7efe"
     stroke-linecap="round"
     stroke-width="1.49998"
     id="path12" />
</svg>
