<?xml version="1.0" encoding="UTF-8" standalone="no"?>
<svg
   height="36"
   width="36"
   version="1.1"
   id="svg27"
   sodipodi:docname="Time_01_36.svg"
   inkscape:export-filename="Time_01_36.png"
   inkscape:export-xdpi="96"
   inkscape:export-ydpi="96"
   inkscape:version="1.2-beta (1b65182ce9, 2022-04-05)"
   xmlns:inkscape="http://www.inkscape.org/namespaces/inkscape"
   xmlns:sodipodi="http://sodipodi.sourceforge.net/DTD/sodipodi-0.dtd"
   xmlns="http://www.w3.org/2000/svg"
   xmlns:svg="http://www.w3.org/2000/svg">
  <defs
     id="defs31" />
  <sodipodi:namedview
     id="namedview29"
     pagecolor="#ffffff"
     bordercolor="#666666"
     borderopacity="1.0"
     inkscape:pageshadow="2"
     inkscape:pageopacity="0.0"
     inkscape:pagecheckerboard="0"
     inkscape:deskcolor="#d1d1d1"
     showgrid="true"
     inkscape:zoom="25.5"
     inkscape:cx="18"
     inkscape:cy="18"
     inkscape:current-layer="svg27">
    <inkscape:grid
       type="xygrid"
       id="grid156" />
  </sodipodi:namedview>
  <radialGradient
     id="a"
     cx="8.801107"
     cy="1036.9969"
     gradientTransform="matrix(0.24690282,1.1111153,-1.1111064,0.24691173,1159.2632,-232.60373)"
     gradientUnits="userSpaceOnUse"
     r="9">
    <stop
       offset="0"
       stop-color="#ccc"
       id="stop2" />
    <stop
       offset="1"
       stop-color="#fff"
       id="stop4" />
  </radialGradient>
  <g
     transform="matrix(1.5000001,0,0,1.5000001,-0.75000275,-36.750004)"
     id="g25">
    <g
       transform="translate(0.500001,0.5)"
       id="g11">
      <circle
         cx="12"
         cy="36"
         fill="#808080"
         r="11.499999"
         id="circle7" />
      <circle
         cx="12"
         cy="36"
         fill="url(#a)"
         r="10"
         id="circle9"
         style="fill:url(#a)" />
    </g>
    <g
       fill-rule="evenodd"
       id="g23">
      <path
         d="m 11.833334,31.166667 h 1.333334 v 4.666667 h 2.666666 v 1.333333 h -4 z"
         id="path13"
         sodipodi:nodetypes="ccccccc" />
      <path
         d="m 13.166668,27.833334 v 2 h -1.333334 v -2"
         fill="#2a7fff"
         id="path15"
         sodipodi:nodetypes="cccc" />
      <path
         d="m 21.166667,35.833334 v 1.333333 h -2 v -1.333333"
         fill="#2a7fff"
         id="path17"
         sodipodi:nodetypes="cccc" />
      <path
         d="m 13.166668,43.166666 v 2 h -1.333334 v -2"
         fill="#2a7fff"
         id="path19"
         sodipodi:nodetypes="cccc" />
      <path
         d="m 5.8333348,35.833334 v 1.333333 H 3.8333349 v -1.333333"
         fill="#2a7fff"
         id="path21"
         sodipodi:nodetypes="cccc" />
    </g>
  </g>
</svg>
