<?xml version="1.0" encoding="UTF-8" standalone="no"?>
<svg
   width="24"
   height="24"
   version="1.1"
   viewBox="0 0 24 24"
   id="svg2"
   sodipodi:docname="tframe.svg"
   inkscape:export-filename="tframe.png"
   inkscape:export-xdpi="96"
   inkscape:export-ydpi="96"
   inkscape:version="1.3.2 (091e20e, 2023-11-25, custom)"
   xmlns:inkscape="http://www.inkscape.org/namespaces/inkscape"
   xmlns:sodipodi="http://sodipodi.sourceforge.net/DTD/sodipodi-0.dtd"
   xmlns="http://www.w3.org/2000/svg"
   xmlns:svg="http://www.w3.org/2000/svg">
  <defs
     id="defs2" />
  <sodipodi:namedview
     id="namedview2"
     pagecolor="#ffffff"
     bordercolor="#000000"
     borderopacity="0.25"
     inkscape:showpageshadow="2"
     inkscape:pageopacity="0.0"
     inkscape:pagecheckerboard="0"
     inkscape:deskcolor="#d1d1d1"
     showgrid="true"
     inkscape:current-layer="svg2">
    <inkscape:grid
       id="grid2"
       units="px"
       originx="0"
       originy="0"
       spacingx="0.5"
       spacingy="0.5"
       empcolor="#0099e5"
       empopacity="0.30196078"
       color="#0099e5"
       opacity="0.14901961"
       empspacing="2"
       dotted="false"
       gridanglex="30"
       gridanglez="30"
       visible="true" />
  </sodipodi:namedview>
  <rect
     x="2.2429535"
     y="5.7429533"
     width="19.514093"
     height="16.014093"
     fill="#f9f9f9"
     stroke="#2a7efe"
     stroke-width=".485907"
     style="paint-order:normal"
     id="rect1" />
  <path
     transform="matrix(1.1111111,0,0,1,-1.3333332,0)"
     d="M 4.3499999,3 H 19.5 C 20.328427,3 21,3.6715729 21,4.5 L 21,6 H 3.0000001 L 3,4.3499999 C 3,3.6044155 3.6044155,3 4.3499999,3 Z"
     fill="#2a7efe"
     stroke-width=".664078"
     id="path1" />
  <rect
     x="5.2429533"
     y="10.242953"
     width="13.514093"
     height="7.5140929"
     fill="#ececec"
     stroke="#2a7efe"
     stroke-width=".485907"
     style="paint-order:normal"
     id="rect2" />
</svg>
