<?xml version="1.0" encoding="UTF-8" standalone="no"?>
<svg
   height="32"
   width="32"
   version="1.1"
   id="svg566"
   sodipodi:docname="Delete_01_32.svg"
   inkscape:export-filename="Delete_01_32.png"
   inkscape:export-xdpi="96"
   inkscape:export-ydpi="96"
   inkscape:version="1.2-beta (1b65182ce9, 2022-04-05)"
   xmlns:inkscape="http://www.inkscape.org/namespaces/inkscape"
   xmlns:sodipodi="http://sodipodi.sourceforge.net/DTD/sodipodi-0.dtd"
   xmlns="http://www.w3.org/2000/svg"
   xmlns:svg="http://www.w3.org/2000/svg">
  <defs
     id="defs570" />
  <sodipodi:namedview
     id="namedview568"
     pagecolor="#ffffff"
     bordercolor="#666666"
     borderopacity="1.0"
     inkscape:pageshadow="2"
     inkscape:pageopacity="0.0"
     inkscape:pagecheckerboard="0"
     inkscape:deskcolor="#d1d1d1"
     showgrid="true"
     inkscape:zoom="28.6875"
     inkscape:cx="15.982571"
     inkscape:cy="16"
     inkscape:current-layer="svg566">
    <inkscape:grid
       type="xygrid"
       id="grid1992" />
  </sodipodi:namedview>
  <path
     d="m4 2.5 4 4 4-4 1.5 1.5-4 4 4 4-1.5 1.5-4-4-4 4-1.5-1.5 4-4-4-4z"
     style="fill:#e60014;fill-rule:evenodd;stroke:#a00;stroke-width:.5;stroke-linejoin:round;stroke-opacity:.968627"
     transform="scale(2)"
     id="path564" />
</svg>
