<?xml version="1.0" encoding="UTF-8" standalone="no"?>
<svg
   height="32"
   width="32"
   version="1.1"
   id="svg6"
   sodipodi:docname="Align_01_32.svg"
   inkscape:export-filename="Align_01_32.png"
   inkscape:export-xdpi="96"
   inkscape:export-ydpi="96"
   inkscape:version="1.3-beta (cedbd6c6ff, 2023-05-28)"
   xmlns:inkscape="http://www.inkscape.org/namespaces/inkscape"
   xmlns:sodipodi="http://sodipodi.sourceforge.net/DTD/sodipodi-0.dtd"
   xmlns="http://www.w3.org/2000/svg"
   xmlns:svg="http://www.w3.org/2000/svg">
  <defs
     id="defs6" />
  <sodipodi:namedview
     id="namedview6"
     pagecolor="#ffffff"
     bordercolor="#000000"
     borderopacity="0.25"
     inkscape:showpageshadow="2"
     inkscape:pageopacity="0.0"
     inkscape:pagecheckerboard="0"
     inkscape:deskcolor="#d1d1d1"
     showgrid="true"
     inkscape:zoom="28.40625"
     inkscape:cx="16"
     inkscape:cy="16"
     inkscape:current-layer="g6">
    <inkscape:grid
       id="grid6"
       units="px"
       originx="0"
       originy="0"
       spacingx="0.5"
       spacingy="0.5"
       empcolor="#0099e5"
       empopacity="0.30196078"
       color="#0099e5"
       opacity="0.14901961"
       empspacing="2"
       dotted="false"
       gridanglex="30"
       gridanglez="30"
       visible="true" />
  </sodipodi:namedview>
  <g
     fill="none"
     stroke="#00aad4"
     stroke-width="1.6"
     transform="translate(0 -.533335)"
     id="g6">
    <path
       d="M 6.0000007,28.332666 H 26"
       id="path1" />
    <path
       d="m 6,24.333336 15,0"
       id="path2"
       sodipodi:nodetypes="cc" />
    <path
       d="M 6.0000007,20.332667 H 26"
       id="path3" />
    <path
       d="m 6,16.333336 15,0"
       id="path4"
       sodipodi:nodetypes="cc" />
    <path
       d="M 6.0000007,12.332668 H 26"
       id="path5" />
    <path
       d="m 6,8.3333354 15,0"
       id="path6"
       sodipodi:nodetypes="cc" />
    <path
       d="M 6,4.333335 H 26"
       id="path7" />
  </g>
</svg>
