<?xml version="1.0" encoding="UTF-8" standalone="no"?>
<svg
   height="16"
   width="16"
   version="1.1"
   id="svg159"
   sodipodi:docname="Zoom_06_16.svg"
   inkscape:export-filename="Zoom_06_16.png"
   inkscape:export-xdpi="96"
   inkscape:export-ydpi="96"
   inkscape:version="1.2.1 (9c6d41e410, 2022-07-14)"
   xmlns:inkscape="http://www.inkscape.org/namespaces/inkscape"
   xmlns:sodipodi="http://sodipodi.sourceforge.net/DTD/sodipodi-0.dtd"
   xmlns="http://www.w3.org/2000/svg"
   xmlns:svg="http://www.w3.org/2000/svg">
  <defs
     id="defs163" />
  <sodipodi:namedview
     id="namedview161"
     pagecolor="#ffffff"
     bordercolor="#666666"
     borderopacity="1.0"
     inkscape:showpageshadow="2"
     inkscape:pageopacity="0.0"
     inkscape:pagecheckerboard="0"
     inkscape:deskcolor="#d1d1d1"
     showgrid="true"
     inkscape:zoom="57.375"
     inkscape:cx="7.9912854"
     inkscape:cy="8"
     inkscape:current-layer="svg159">
    <inkscape:grid
       type="xygrid"
       id="grid995" />
  </sodipodi:namedview>
  <path
     d="m4 15.5h-1.5v-15h7l4 4v1"
     fill="none"
     stroke="#00aad4"
     stroke-linecap="round"
     stroke-linejoin="round"
     id="path145" />
  <path
     d="m9.5.5v4h4"
     fill="none"
     stroke="#00aad4"
     stroke-linecap="round"
     stroke-linejoin="round"
     id="path147" />
  <circle
     cx="10.5"
     cy="13.5"
     fill="#00aad4"
     r=".5"
     id="circle149" />
  <path
     d="m8 10 .5-.5v4"
     fill="none"
     stroke="#00aad4"
     stroke-linecap="round"
     stroke-linejoin="round"
     id="path151" />
  <path
     d="m12 10 .5-.5v4"
     fill="none"
     stroke="#00aad4"
     stroke-linecap="round"
     stroke-linejoin="round"
     id="path153" />
  <circle
     cx="10.5"
     cy="11.5"
     fill="#00aad4"
     r=".5"
     id="circle155" />
  <rect
     fill="none"
     height="8"
     rx="2"
     stroke="#00aad4"
     stroke-linecap="round"
     stroke-linejoin="round"
     stroke-miterlimit="5.6"
     width="10"
     x="5.5"
     y="7.5"
     id="rect157" />
</svg>
