<svg width="32" height="32" version="1.1" xmlns="http://www.w3.org/2000/svg">
 <path d="m15.999943 1.7800003v12.000003" fill="none" stroke="#00aad4" stroke-linecap="round" stroke-width="2.99999"/>
 <path d="m22.499946 4.7500009a13.000003 12.996477 0 0 1 6.057035 14.619015 13.000003 12.996477 0 0 1-12.557036 9.632742 13.000003 12.996477 0 0 1-12.55704-9.632742 13.000003 12.996477 0 0 1 6.0570368-14.619015" fill="none" stroke="#00aad4" stroke-linecap="round" stroke-width="2.99999"/>
</svg>
