<?xml version="1.0" encoding="UTF-8" standalone="no"?>
<svg
   height="64"
   viewBox="0 0 16.933333 16.933335"
   width="64"
   version="1.1"
   id="svg623"
   sodipodi:docname="Arrow_13_64.svg"
   inkscape:version="1.2 (dc2aedaf03, 2022-05-15)"
   xmlns:inkscape="http://www.inkscape.org/namespaces/inkscape"
   xmlns:sodipodi="http://sodipodi.sourceforge.net/DTD/sodipodi-0.dtd"
   xmlns="http://www.w3.org/2000/svg"
   xmlns:svg="http://www.w3.org/2000/svg">
  <defs
     id="defs627">
    <radialGradient
       id="a"
       cx="12.1"
       cy="10.900001"
       gradientTransform="matrix(0,0.4988777,-0.49887766,0,6.8809486,-4.5932389)"
       gradientUnits="userSpaceOnUse"
       r="4.5">
      <stop
         offset="0"
         stop-color="#ff7f2a"
         id="stop962" />
      <stop
         offset="1"
         stop-color="#d45500"
         id="stop964" />
    </radialGradient>
  </defs>
  <sodipodi:namedview
     id="namedview625"
     pagecolor="#ffffff"
     bordercolor="#666666"
     borderopacity="1.0"
     inkscape:showpageshadow="2"
     inkscape:pageopacity="0.0"
     inkscape:pagecheckerboard="0"
     inkscape:deskcolor="#d1d1d1"
     showgrid="true"
     inkscape:zoom="14.34375"
     inkscape:cx="28.583878"
     inkscape:cy="32"
     inkscape:current-layer="svg623">
    <inkscape:grid
       type="xygrid"
       id="grid1262" />
  </sodipodi:namedview>
  <g
     id="g1328"
     transform="scale(4.0000003)">
    <circle
       cx="2.1166668"
       cy="2.1166666"
       fill="url(#a)"
       r="1.8520834"
       stroke-dashoffset="1.49998"
       stroke-linejoin="round"
       stroke-width="0.286632"
       transform="matrix(0,1,1,0,0,0)"
       id="circle967"
       style="fill:url(#a);stroke:#ffccaa;stroke-width:0.264583;stroke-linecap:round;stroke-dasharray:none" />
    <g
       fill="none"
       stroke-width="1.07062"
       transform="matrix(0.44615448,0,0,0.44626389,-3.2203669,-2.8101331)"
       id="g973"
       style="stroke:#ffffff;stroke-width:1.18592;stroke-linecap:round;stroke-dasharray:none">
      <path
         d="m 11.369269,8.9650052 2.075608,2.0750988 -2.075608,2.075099"
         id="path969"
         style="stroke-width:1.18592;stroke-linecap:round;stroke-linejoin:round;stroke-dasharray:none"
         sodipodi:nodetypes="ccc" />
    </g>
  </g>
</svg>
