<svg width="24" height="24" version="1.1" xmlns="http://www.w3.org/2000/svg">
 <path d="M 4.5,12 9,16.5 19.5,6" fill="none" stroke="#36cd36" stroke-linecap="round" stroke-linejoin="round" stroke-width="3"/>
</svg>
