<svg width="24" height="24" version="1.1" xmlns="http://www.w3.org/2000/svg">
 <g fill="none" stroke-linecap="round">
  <path d="m9.299911 15.827397 3.299984-3.199994 3.300016 3.199994" stroke="#ffffff" stroke-linejoin="round" stroke-width="3.6"/>
  <path d="m12.600015 12.627502-1.04e-4 9.599982" stroke="#ffffff" stroke-width="3.6"/>
  <path d="m9.299911 15.827397 3.299984-3.199994 3.300016 3.199994" stroke="#ff7f00" stroke-linejoin="round" stroke-width="1.2"/>
  <path d="m12.600015 12.627502-1.04e-4 9.599982" stroke="#ff7f00" stroke-width="1.2"/>
 </g>
</svg>
