<?xml version="1.0" encoding="UTF-8" standalone="no"?>
<svg
   width="48"
   height="48"
   version="1.1"
   viewBox="0 0 48 48"
   id="svg23"
   sodipodi:docname="tsynmemo_200.svg"
   inkscape:version="1.3.2 (091e20e, 2023-11-25, custom)"
   xmlns:inkscape="http://www.inkscape.org/namespaces/inkscape"
   xmlns:sodipodi="http://sodipodi.sourceforge.net/DTD/sodipodi-0.dtd"
   xmlns="http://www.w3.org/2000/svg"
   xmlns:svg="http://www.w3.org/2000/svg">
  <sodipodi:namedview
     id="namedview23"
     pagecolor="#ffffff"
     bordercolor="#000000"
     borderopacity="0.25"
     inkscape:showpageshadow="2"
     inkscape:pageopacity="0.0"
     inkscape:pagecheckerboard="0"
     inkscape:deskcolor="#d1d1d1"
     showgrid="true"
     inkscape:current-layer="svg23">
    <inkscape:grid
       id="grid23"
       units="px"
       originx="0"
       originy="0"
       spacingx="0.5"
       spacingy="0.5"
       empcolor="#0099e5"
       empopacity="0.30196078"
       color="#0099e5"
       opacity="0.14901961"
       empspacing="2"
       dotted="false"
       gridanglex="30"
       gridanglez="30"
       visible="true" />
  </sodipodi:namedview>
  <defs
     id="defs10">
    <linearGradient
       id="c"
       x1="34"
       x2="37"
       y1="1029.3622"
       y2="1029.3622"
       gradientTransform="matrix(2.3333336,0,0,1.8557408,-48.892216,-1935.1033)"
       gradientUnits="userSpaceOnUse">
      <stop
         stop-color="#999999"
         offset="0"
         id="stop1" />
      <stop
         stop-color="#ffffff"
         offset=".49999997"
         id="stop2" />
      <stop
         stop-color="#999999"
         offset="1"
         id="stop3" />
    </linearGradient>
    <linearGradient
       id="b"
       x1="34"
       x2="37"
       y1="1027.3622"
       y2="1027.3622"
       gradientTransform="matrix(2.3333336,0,0,1.8557408,-48.892216,-1935.1033)"
       gradientUnits="userSpaceOnUse">
      <stop
         stop-color="#aa0000"
         offset="0"
         id="stop4" />
      <stop
         stop-color="#ff0000"
         offset=".51070523"
         id="stop5" />
      <stop
         stop-color="#aa0000"
         offset="1"
         id="stop6" />
    </linearGradient>
    <linearGradient
       id="a"
       x1="34"
       x2="37"
       y1="1033.8622"
       y2="1033.8622"
       gradientTransform="matrix(2.3333336,0,0,1.8557408,-48.892216,-1935.1033)"
       gradientUnits="userSpaceOnUse">
      <stop
         stop-color="#a05a2c"
         offset="0"
         id="stop7" />
      <stop
         stop-color="#ffff00"
         offset=".26457807"
         id="stop8" />
      <stop
         stop-color="#ffff00"
         offset=".75078517"
         id="stop9" />
      <stop
         stop-color="#a05a2c"
         offset="1"
         id="stop10" />
    </linearGradient>
  </defs>
  <rect
     x="2.4999995"
     y="2.4999826"
     width="41"
     height="43"
     fill="#ffffff"
     fill-rule="evenodd"
     stroke="#2a7efe"
     stroke-linecap="square"
     stroke-linejoin="round"
     stroke-width=".999999"
     style="paint-order:normal"
     id="rect10" />
  <rect
     x="3"
     y="2.9999826"
     width="7"
     height="42.000019"
     fill="#b3b3b3"
     fill-rule="evenodd"
     style="paint-order:normal"
     id="rect11" />
  <rect
     transform="rotate(45)"
     x="30.44113"
     y="-26.729637"
     width="7.000001"
     height="3.711514"
     fill="url(#c)"
     fill-rule="evenodd"
     style="paint-order:normal"
     id="rect12" />
  <rect
     transform="rotate(45)"
     x="30.44113"
     y="-30.441124"
     width="7.000001"
     height="3.711514"
     fill="url(#b)"
     fill-rule="evenodd"
     style="paint-order:normal"
     id="rect13" />
  <rect
     transform="rotate(45)"
     x="30.44113"
     y="-23.018211"
     width="7.000001"
     height="12.990217"
     fill="url(#a)"
     fill-rule="evenodd"
     style="paint-order:normal"
     id="rect14" />
  <path
     d="m28.61596 14.4342-1.525305 3.7223 2.75148 2.7514 3.723573-1.5239z"
     fill="#d38d5f"
     fill-rule="evenodd"
     id="path14" />
  <path
     d="m 27.090655,18.1565 2.75148,2.7514 L 27,22 26,21 Z"
     fill="#333333"
     fill-rule="evenodd"
     id="path15" />
  <path
     d="m28.000096 24.9999h11"
     fill="none"
     stroke="#666666"
     stroke-width="2"
     id="path16" />
  <path
     d="m30.000096 28.9999h8"
     fill="none"
     stroke="#2a7fff"
     stroke-width="2"
     id="path17" />
  <path
     d="m30.000096 32.9999h8"
     fill="none"
     stroke="#666666"
     stroke-width="2"
     id="path18" />
  <path
     d="m28.000096 36.9999h11"
     fill="none"
     stroke="#d45500"
     stroke-width="2"
     id="path19" />
  <path
     d="m21.554838 26.213712c0.402874 0.427492 0.645162 1.014856 0.645162 2.043434 0 1.361256-1.223424 2.457142-2.7431 2.457142h-1.9138c-1.519678 0-2.7431-1.095888-2.7431-2.457142 0-1.36126 1.223422-2.457146 2.7431-2.457146h0.893108v4.914288"
     fill="none"
     stroke="#2c5aa0"
     stroke-linecap="round"
     stroke-linejoin="round"
     stroke-width="1.6"
     id="path20" />
  <path
     d="m14.8 8.257148v-2e-6c0-1.361262 1.100132-2.457146 2.466666-2.457146h2.466666c1.366536 0 2.466668 1.095884 2.466668 2.457146v2e-6c0 1.361256-1.100132 2.457138-2.466668 2.457138h-2.466666c-1.366534 0-2.466666-1.095882-2.466666-2.457138z"
     fill="none"
     stroke="#2c5aa0"
     stroke-linecap="round"
     stroke-linejoin="round"
     stroke-width="1.6"
     id="path21" />
  <path
     d="m17.453309 37.999995c-1.469724 0-2.652928-0.966008-2.652928-2.165936 0-1.19993 1.183204-2.033679 2.652928-2.033679h4.750599m-7.403527 8.399238h7.403527m-4.750599 0c-1.469724 0-2.652928-0.966007-2.652928-2.165936 0-1.199934 1.183204-2.033687 2.652928-2.033687h4.750599"
     fill="none"
     stroke="#2c5aa0"
     stroke-linecap="round"
     stroke-linejoin="round"
     stroke-width="1.60076"
     id="path22" />
  <path
     d="m17.453308 17.999994c-1.469724 0-2.652927-0.966007-2.652927-2.165937 0-1.199927 1.183203-2.033677 2.652927-2.033677h4.750598m-7.403525 8.399238h7.403525m-4.750598 0c-1.469724 0-2.652927-0.966008-2.652927-2.165939 0-1.199934 1.183203-2.033685 2.652927-2.033685h4.750598"
     fill="none"
     stroke="#2c5aa0"
     stroke-linecap="round"
     stroke-linejoin="round"
     stroke-width="1.60076"
     id="path23" />
</svg>
