<?xml version="1.0" encoding="UTF-8" standalone="no"?>
<svg
   height="16"
   width="16"
   version="1.1"
   id="svg8"
   sodipodi:docname="Arrow_48_16.svg"
   inkscape:export-filename="Arrow_48_16.png"
   inkscape:export-xdpi="96"
   inkscape:export-ydpi="96"
   inkscape:version="1.2.2 (732a01da63, 2022-12-09)"
   xmlns:inkscape="http://www.inkscape.org/namespaces/inkscape"
   xmlns:sodipodi="http://sodipodi.sourceforge.net/DTD/sodipodi-0.dtd"
   xmlns="http://www.w3.org/2000/svg"
   xmlns:svg="http://www.w3.org/2000/svg">
  <defs
     id="defs12" />
  <sodipodi:namedview
     id="namedview10"
     pagecolor="#ffffff"
     bordercolor="#666666"
     borderopacity="1.0"
     inkscape:showpageshadow="2"
     inkscape:pageopacity="0.0"
     inkscape:pagecheckerboard="0"
     inkscape:deskcolor="#d1d1d1"
     showgrid="true"
     inkscape:zoom="57.375"
     inkscape:cx="7.3551198"
     inkscape:cy="8"
     inkscape:current-layer="g6">
    <inkscape:grid
       type="xygrid"
       id="grid931" />
  </sodipodi:namedview>
  <g
     stroke="#2a7efe"
     stroke-linecap="round"
     stroke-linejoin="round"
     stroke-width="1.5"
     id="g6">
    <circle
       cx="8"
       cy="8"
       fill="#e0edff"
       fill-rule="evenodd"
       r="6.75"
       stroke-opacity=".954902"
       id="circle2"
       style="stroke:#2a7efe" />
    <g
       fill="none"
       id="g891"
       style="stroke:#2a7efe">
      <path
         d="m 8.75,11 3,-3 -3,-3"
         stroke-linejoin="round"
         stroke-width="1.5"
         id="path887"
         style="stroke:#2a7efe;fill:none" />
      <path
         d="M 11,8 H 4"
         stroke-width="2"
         id="path889"
         style="stroke:#2a7efe;fill:none" />
    </g>
  </g>
</svg>
