<svg width="24" height="24" version="1.1" viewBox="0 0 6.35 6.35" xmlns="http://www.w3.org/2000/svg">
 <rect x=".36380184" y=".36380184" width="5.622396" height="5.6223965" rx=".45952311" fill="#ebfcff" stroke="#00aad4" stroke-linejoin="round" stroke-width=".198437"/>
 <path d="m0.44979167 0.44979166h5.4504167l-1e-7 0.74083344h-5.4504166z" fill="#00aad4" fill-rule="evenodd" stroke-width=".396872"/>
 <ellipse cx="4.630208" cy="4.6302085" rx="1.6205729" ry="1.6205727" fill="#fff6ec" stroke="#ff7f00" stroke-dashoffset="1.49998" stroke-linecap="round" stroke-linejoin="round" stroke-width=".198438"/>
 <path d="m5.2916666 4.6302083h-1.3229166" fill="none" stroke="#ff7f00" stroke-linecap="round" stroke-width=".343958"/>
</svg>
