<svg width="24" height="24" version="1.1" xmlns="http://www.w3.org/2000/svg" xmlns:xlink="http://www.w3.org/1999/xlink">
 <defs>
  <radialGradient id="a" cx="7" cy="6" r="6.5" gradientTransform="matrix(0 1.46 -1.46 0 19.3 .32)" gradientUnits="userSpaceOnUse">
   <stop stop-color="#ebfcff" offset="0"/>
   <stop stop-color="#c2f3ff" offset="1"/>
  </radialGradient>
 </defs>
 <circle cx="12" cy="12" r="9.125" fill="url(#a)" stroke="#00aad4" stroke-linecap="round" stroke-linejoin="round" stroke-width=".75"/>
</svg>
