<?xml version="1.0" encoding="UTF-8" standalone="no"?>
<svg
   height="32"
   width="32"
   version="1.1"
   id="svg4339"
   sodipodi:docname="table_item_200.svg"
   inkscape:export-filename="table_item_200.png"
   inkscape:export-xdpi="96"
   inkscape:export-ydpi="96"
   inkscape:version="1.2.2 (732a01da63, 2022-12-09)"
   xmlns:inkscape="http://www.inkscape.org/namespaces/inkscape"
   xmlns:sodipodi="http://sodipodi.sourceforge.net/DTD/sodipodi-0.dtd"
   xmlns="http://www.w3.org/2000/svg"
   xmlns:svg="http://www.w3.org/2000/svg">
  <defs
     id="defs4343" />
  <sodipodi:namedview
     id="namedview4341"
     pagecolor="#ffffff"
     bordercolor="#000000"
     borderopacity="0.25"
     inkscape:showpageshadow="2"
     inkscape:pageopacity="0.0"
     inkscape:pagecheckerboard="0"
     inkscape:deskcolor="#d1d1d1"
     showgrid="true"
     inkscape:zoom="28.4375"
     inkscape:cx="15.859341"
     inkscape:cy="16"
     inkscape:current-layer="svg4339">
    <inkscape:grid
       type="xygrid"
       id="grid4462" />
  </sodipodi:namedview>
  <rect
     fill="#ffeec0"
     height="27.5"
     rx="2.2"
     stroke="#f99b05"
     stroke-linejoin="round"
     stroke-width="1.5"
     width="21.5"
     x="5.75"
     y="1.75"
     id="rect4331" />
  <g
     fill="#f00"
     transform="translate(1.063875 -.599828)"
     id="g4337">
    <path
       d="m15.394531 7.9238281c-1.601136 0-2.856398.430601-3.818359 1.2773438-.887438.7871978-1.366564 1.7080731-1.498047 2.7949221l2.242187.277344c.216257-.80545.553802-1.46926 1.074219-1.910157.5746-.4868013 1.301549-.7285154 2.128907-.7285154.851644 0 1.57059.2335289 2.101562.7148434.000417.000379.0015-.000378.002 0 .525148.46344.810547 1.065215.810547 1.734375 0 .488045-.159797.948862-.460938 1.347657-.000664.00067-.0013.0013-.002.002-.228879.295712-.744806.741346-1.634765 1.464844v-.002c-.867634.705485-1.430632 1.337055-1.69336 1.84961-.266473.519991-.410156 1.207028-.410156 2.066406 0 .04466.0051.663246.0078.82147h2.167968c.0049-.67505.05325-1.605182.220703-1.964048.0013-.002.0026-.0039.0039-.0059.19978-.408507.620771-.838546 1.27539-1.382812 1.227742-1.02075 2.019121-1.834218 2.355469-2.371094.000664-.00067.0013-.0013.002-.002.35415-.554622.525391-1.125828.525391-1.738281 0-1.124024-.46349-2.083951-1.44336-2.9472658-.000002-.00065-.000002-.0013 0-.00195-.966755-.8585343-2.267619-1.2967921-3.957058-1.2967921z"
       stroke-width="2"
       id="path4333" />
    <path
       d="m14.3 23.799971v-2.234427h2.335v2.234427z"
       fill="#f00"
       id="path4335" />
  </g>
</svg>
