<?xml version="1.0" encoding="UTF-8" standalone="no"?>
<svg
   height="16"
   viewBox="0 0 16 16"
   width="16"
   version="1.1"
   id="svg37"
   sodipodi:docname="Health_02_16.svg"
   inkscape:export-filename="Health_02_16.png"
   inkscape:export-xdpi="96"
   inkscape:export-ydpi="96"
   inkscape:version="1.2.1 (9c6d41e410, 2022-07-14)"
   xmlns:inkscape="http://www.inkscape.org/namespaces/inkscape"
   xmlns:sodipodi="http://sodipodi.sourceforge.net/DTD/sodipodi-0.dtd"
   xmlns:xlink="http://www.w3.org/1999/xlink"
   xmlns="http://www.w3.org/2000/svg"
   xmlns:svg="http://www.w3.org/2000/svg">
  <sodipodi:namedview
     id="namedview12"
     pagecolor="#ffffff"
     bordercolor="#666666"
     borderopacity="1.0"
     inkscape:showpageshadow="2"
     inkscape:pageopacity="0.0"
     inkscape:pagecheckerboard="0"
     inkscape:deskcolor="#d1d1d1"
     showgrid="true"
     inkscape:zoom="57.375"
     inkscape:cx="7.4945534"
     inkscape:cy="8"
     inkscape:current-layer="svg37">
    <inkscape:grid
       type="xygrid"
       id="grid1227" />
  </sodipodi:namedview>
  <defs
     id="defs41">
    <radialGradient
       inkscape:collect="always"
       xlink:href="#linearGradient1041"
       id="radialGradient1043"
       cx="1.9253448"
       cy="1.5859377"
       fx="1.9253448"
       fy="1.5859377"
       r="1.8520745"
       gradientTransform="matrix(0.95652543,4.0174064,-5.6693181,1.3498377,13.149511,-3.3756514)"
       gradientUnits="userSpaceOnUse" />
    <linearGradient
       inkscape:collect="always"
       id="linearGradient1041">
      <stop
         style="stop-color:#ffaaaa;stop-opacity:1"
         offset="0"
         id="stop1037" />
      <stop
         style="stop-color:#ff0000;stop-opacity:1"
         offset="1"
         id="stop1039" />
    </linearGradient>
  </defs>
  <linearGradient
     id="a"
     gradientTransform="matrix(0.15636305,0,0,0.15646199,-31.005707,19.133654)"
     gradientUnits="userSpaceOnUse"
     x1="230.26965"
     x2="271.83875"
     y1="-115.89568"
     y2="-42.350357">
    <stop
       offset="0"
       stop-color="#f00"
       id="stop2" />
    <stop
       offset="1"
       stop-color="#d40000"
       id="stop4" />
  </linearGradient>
  <path
     id="path353"
     style="fill:url(#radialGradient1043);fill-opacity:1;stroke:#d40000;stroke-width:0.999999px;stroke-linecap:butt;stroke-linejoin:miter;stroke-opacity:1"
     d="m 4.6943189,1.5000964 c -3.5189443,0.00866 -6.0907537,6.4328412 3.3047089,12.8930266 12.3981352,-8.524781 3.9564742,-16.9852209 0,-10.7267303 C 7.0408193,2.1506647 5.8189302,1.4973292 4.6943189,1.5000964 Z" />
  <g
     id="g391"
     transform="translate(-8.0001014,-8.0000701)">
    <path
       d="m 9.5,17.500205 h 1.020564 l 1.479436,-1.5 1,1 2,-3.978365 3,4.978365 2,-2.5 1.5,2 h 1"
       fill="none"
       stroke="#ffffff"
       stroke-linecap="round"
       stroke-linejoin="round"
       stroke-width="2.5"
       id="path31"
       style="stroke-width:3;stroke-dasharray:none" />
    <path
       d="m 9.5,17.500205 h 1.020564 l 1.479436,-1.5 1,1 2,-3.978365 3,4.978365 2,-2.5 1.5,2 h 1"
       fill="none"
       stroke="#000080"
       stroke-linecap="round"
       stroke-linejoin="round"
       stroke-width="0.5"
       id="path33"
       style="stroke:#3771c8;stroke-width:1;stroke-dasharray:none" />
  </g>
</svg>
