<?xml version="1.0" encoding="UTF-8" standalone="no"?>
<svg
   height="24"
   width="24"
   version="1.1"
   id="svg5"
   sodipodi:docname="Connection_05_24.svg"
   inkscape:version="1.3 (0e150ed6c4, 2023-07-21)"
   xmlns:inkscape="http://www.inkscape.org/namespaces/inkscape"
   xmlns:sodipodi="http://sodipodi.sourceforge.net/DTD/sodipodi-0.dtd"
   xmlns="http://www.w3.org/2000/svg"
   xmlns:svg="http://www.w3.org/2000/svg">
  <defs
     id="defs5" />
  <sodipodi:namedview
     id="namedview5"
     pagecolor="#ffffff"
     bordercolor="#000000"
     borderopacity="0.25"
     inkscape:showpageshadow="2"
     inkscape:pageopacity="0.0"
     inkscape:pagecheckerboard="0"
     inkscape:deskcolor="#d1d1d1"
     showgrid="true"
     inkscape:current-layer="svg5">
    <inkscape:grid
       id="grid5"
       units="px"
       originx="0"
       originy="0"
       spacingx="0.5"
       spacingy="0.5"
       empcolor="#0099e5"
       empopacity="0.30196078"
       color="#0099e5"
       opacity="0.14901961"
       empspacing="2"
       dotted="false"
       gridanglex="30"
       gridanglez="30"
       visible="true" />
  </sodipodi:namedview>
  <linearGradient
     id="a"
     gradientUnits="userSpaceOnUse"
     x1="21.937501"
     x2="15.062501"
     y1="21.937499"
     y2="15.062501">
    <stop
       offset="0"
       stop-color="#d40000"
       id="stop1" />
    <stop
       offset="1"
       stop-color="#ff2a2a"
       id="stop2" />
  </linearGradient>
  <g
     fill="none"
     stroke-linecap="round"
     stroke-linejoin="round"
     stroke-width="1.79996"
     transform="translate(-1.000584 -1.00029)"
     id="g3">
    <path
       d="m13.167063 10.833372-2.12127-2.1212688-4.8789177 4.8789178 2.1212686 2.12127-4.5375795 4.537579"
       stroke="#00aad4"
       id="path2" />
    <path
       d="m10.833667 13.166769 2.121269 2.121268 4.878918-4.878919-2.121268-2.1212688 4.537578-4.5375788"
       stroke="#00c1f0"
       id="path3" />
  </g>
  <circle
     cx="18.5"
     cy="18.5"
     fill="url(#a)"
     r="5.5"
     transform="matrix(0 1 1 0 0 0)"
     id="circle3" />
  <g
     fill="none"
     stroke="#fff"
     stroke-linecap="round"
     stroke-width="1.4"
     id="g5">
    <path
       d="m16.37868 16.37868 4.24264 4.24264"
       id="path4" />
    <path
       d="m20.62132 16.37868-4.24264 4.24264"
       id="path5" />
  </g>
</svg>
