<?xml version="1.0" encoding="UTF-8" standalone="no"?>
<svg
   width="36"
   height="36"
   version="1.1"
   viewBox="0 0 36 36"
   id="svg9"
   sodipodi:docname="TDBDateTimePicker_150.svg"
   inkscape:export-filename="TDBDateTimePicker_150.png"
   inkscape:export-xdpi="96"
   inkscape:export-ydpi="96"
   inkscape:version="1.3.2 (091e20e, 2023-11-25, custom)"
   xmlns:inkscape="http://www.inkscape.org/namespaces/inkscape"
   xmlns:sodipodi="http://sodipodi.sourceforge.net/DTD/sodipodi-0.dtd"
   xmlns="http://www.w3.org/2000/svg"
   xmlns:svg="http://www.w3.org/2000/svg">
  <sodipodi:namedview
     id="namedview9"
     pagecolor="#ffffff"
     bordercolor="#000000"
     borderopacity="0.25"
     inkscape:showpageshadow="2"
     inkscape:pageopacity="0.0"
     inkscape:pagecheckerboard="0"
     inkscape:deskcolor="#d1d1d1"
     showgrid="true"
     inkscape:current-layer="svg9">
    <inkscape:grid
       id="grid9"
       units="px"
       originx="0"
       originy="0"
       spacingx="0.5"
       spacingy="0.5"
       empcolor="#0099e5"
       empopacity="0.30196078"
       color="#0099e5"
       opacity="0.14901961"
       empspacing="2"
       dotted="false"
       gridanglex="30"
       gridanglez="30"
       visible="true" />
  </sodipodi:namedview>
  <defs
     id="defs3">
    <linearGradient
       id="a"
       x1="3"
       x2="21"
       y1="3"
       y2="3"
       gradientUnits="userSpaceOnUse">
      <stop
         stop-color="#4276c4"
         offset="0"
         id="stop1" />
      <stop
         stop-color="#80b3ff"
         offset=".3333333"
         id="stop2" />
      <stop
         stop-color="#04a"
         offset="1"
         id="stop3" />
    </linearGradient>
  </defs>
  <ellipse
     cx="12"
     cy="20.25"
     rx="7.65"
     ry="2.4"
     fill="none"
     fill-rule="evenodd"
     stroke="url(#a)"
     stroke-linecap="round"
     stroke-linejoin="round"
     stroke-width="2.7"
     id="ellipse3" />
  <ellipse
     cx="12"
     cy="18.3"
     rx="7.35"
     ry="2.1"
     fill="none"
     fill-rule="evenodd"
     stroke="#ffffff"
     stroke-linecap="round"
     stroke-linejoin="round"
     stroke-width="1.8"
     id="ellipse4" />
  <ellipse
     cx="12"
     cy="15.75"
     rx="7.65"
     ry="2.4"
     fill="none"
     fill-rule="evenodd"
     stroke="url(#a)"
     stroke-linecap="round"
     stroke-linejoin="round"
     stroke-width="2.7"
     id="ellipse5" />
  <ellipse
     cx="12"
     cy="13.8"
     rx="7.35"
     ry="2.1"
     fill="none"
     fill-rule="evenodd"
     stroke="#ffffff"
     stroke-linecap="round"
     stroke-linejoin="round"
     stroke-width="1.8"
     id="ellipse6" />
  <ellipse
     cx="12"
     cy="11.25"
     rx="7.65"
     ry="2.4"
     fill="none"
     fill-rule="evenodd"
     stroke="url(#a)"
     stroke-linecap="round"
     stroke-linejoin="round"
     stroke-width="2.7"
     id="ellipse7" />
  <ellipse
     cx="12"
     cy="9.3"
     rx="7.35"
     ry="2.1"
     fill="none"
     fill-rule="evenodd"
     stroke="#ffffff"
     stroke-linecap="round"
     stroke-linejoin="round"
     stroke-width="1.8"
     id="ellipse8" />
  <ellipse
     cx="12"
     cy="6.75"
     rx="8.1"
     ry="2.85"
     fill="#80b3ff"
     fill-rule="evenodd"
     stroke="url(#a)"
     stroke-linecap="round"
     stroke-linejoin="round"
     stroke-width="1.8"
     id="ellipse9" />
  <rect
     x="12.500002"
     y="14.499985"
     width="20.999998"
     height="21.000017"
     fill="#f9f9f9"
     stroke="#2a7efe"
     stroke-width="0.5"
     style="stroke-width:1;stroke-dasharray:none;paint-order:normal"
     id="rect1" />
  <rect
     style="fill:none;stroke:#96b5e7;stroke-width:1;stroke-linecap:round;stroke-linejoin:round;stroke-dasharray:none;stroke-opacity:1"
     id="rect9"
     width="15"
     height="10"
     x="15.5"
     y="22.5" />
  <rect
     transform="rotate(90)"
     x="14.499985"
     y="-28.500004"
     width="5"
     height="16.000004"
     fill="#f9f9f9"
     stroke="#2a7efe"
     stroke-width="0.5"
     style="stroke-width:0.999997;stroke-dasharray:none;paint-order:normal"
     id="rect2" />
  <path
     d="m 15.5,17.25 h 10"
     fill="none"
     stroke="#b3b3b3"
     stroke-width="0.999998px"
     id="path2"
     style="stroke-width:1.5;stroke-dasharray:none" />
  <rect
     x="28.499998"
     y="14.499985"
     width="5.0000029"
     height="5"
     fill="#ffffff"
     stroke="#2a7efe"
     stroke-width="0.5"
     style="stroke-width:0.999997;stroke-dasharray:none;paint-order:normal"
     id="rect3" />
  <path
     d="M 29.767353,16.272448 31,17.505037 32.232648,16.272448"
     fill="none"
     stroke="#808080"
     stroke-width="0.7"
     id="path3" />
  <path
     d="m 15.5,25.5 h 15"
     fill="none"
     stroke="#96b5e7"
     stroke-width="0.999998px"
     id="path4"
     sodipodi:nodetypes="cc" />
  <path
     d="m 15.5,28.5 h 15"
     fill="none"
     stroke="#96b5e7"
     stroke-width="0.999998px"
     id="path7"
     sodipodi:nodetypes="cc" />
  <path
     d="m 18.5,22.5 v 10"
     fill="none"
     stroke="#96b5e7"
     stroke-width="0.999998px"
     id="path10"
     sodipodi:nodetypes="cc" />
  <path
     d="m 21.5,22.5 v 10"
     fill="none"
     stroke="#96b5e7"
     stroke-width="0.999998px"
     id="path12"
     sodipodi:nodetypes="cc" />
  <path
     d="m 24.5,22.5 v 10"
     fill="none"
     stroke="#96b5e7"
     stroke-width="0.999998px"
     id="path13"
     sodipodi:nodetypes="cc" />
  <path
     d="m 27.5,22.5 v 10"
     fill="none"
     stroke="#96b5e7"
     stroke-width="0.999998px"
     id="path14"
     sodipodi:nodetypes="cc" />
  <path
     d="m 24.5,25.5 h 3.000002 v 3.000002 H 24.5 Z"
     fill="none"
     stroke="#ff0000"
     stroke-width="0.999998px"
     id="path16" />
  <path
     d="m 18.5,28.5 h 3.000002 v 3.000002 H 18.5 Z"
     fill="none"
     stroke="#ff0000"
     stroke-width="0.999998px"
     id="path17" />
</svg>
