<?xml version="1.0" encoding="UTF-8" standalone="no"?>
<svg
   height="16"
   width="16"
   version="1.1"
   id="svg8"
   sodipodi:docname="menu_exit.svg"
   inkscape:export-filename="menu_exit.png"
   inkscape:export-xdpi="96"
   inkscape:export-ydpi="96"
   inkscape:version="1.2.2 (732a01da63, 2022-12-09)"
   xmlns:inkscape="http://www.inkscape.org/namespaces/inkscape"
   xmlns:sodipodi="http://sodipodi.sourceforge.net/DTD/sodipodi-0.dtd"
   xmlns="http://www.w3.org/2000/svg"
   xmlns:svg="http://www.w3.org/2000/svg">
  <defs
     id="defs12" />
  <sodipodi:namedview
     id="namedview10"
     pagecolor="#ffffff"
     bordercolor="#666666"
     borderopacity="1.0"
     inkscape:showpageshadow="2"
     inkscape:pageopacity="0.0"
     inkscape:pagecheckerboard="0"
     inkscape:deskcolor="#d1d1d1"
     showgrid="true"
     inkscape:zoom="57.375"
     inkscape:cx="6.6405229"
     inkscape:cy="8"
     inkscape:current-layer="svg8">
    <inkscape:grid
       type="xygrid"
       id="grid517" />
  </sodipodi:namedview>
  <path
     d="M 8.05,1 V 7"
     id="path2"
     style="fill:none;stroke:#ff0000;stroke-width:1.5;stroke-linecap:round" />
  <path
     d="M 11.125001,2.5940002 A 6.2500003,6.2464134 0 0 1 14.037036,9.620244 6.2500003,6.2464134 0 0 1 8.0000005,14.249967 6.2500003,6.2464134 0 0 1 1.9629638,9.620244 6.2500003,6.2464134 0 0 1 4.8750003,2.594"
     id="path4"
     style="fill:none;stroke:#ff0000;stroke-width:1.5;stroke-linecap:round" />
</svg>
