<?xml version="1.0" encoding="UTF-8" standalone="no"?>
<svg
   height="16"
   width="16"
   version="1.1"
   id="svg266"
   sodipodi:docname="Help_03_16.svg"
   inkscape:export-filename="Help_03_16.png"
   inkscape:export-xdpi="96"
   inkscape:export-ydpi="96"
   inkscape:version="1.2-beta (1b65182ce9, 2022-04-05)"
   xmlns:inkscape="http://www.inkscape.org/namespaces/inkscape"
   xmlns:sodipodi="http://sodipodi.sourceforge.net/DTD/sodipodi-0.dtd"
   xmlns="http://www.w3.org/2000/svg"
   xmlns:svg="http://www.w3.org/2000/svg">
  <defs
     id="defs270" />
  <sodipodi:namedview
     id="namedview268"
     pagecolor="#ffffff"
     bordercolor="#666666"
     borderopacity="1.0"
     inkscape:pageshadow="2"
     inkscape:pageopacity="0.0"
     inkscape:pagecheckerboard="0"
     inkscape:deskcolor="#d1d1d1"
     showgrid="true"
     inkscape:zoom="57.375"
     inkscape:cx="8"
     inkscape:cy="8"
     inkscape:current-layer="svg266">
    <inkscape:grid
       type="xygrid"
       id="grid954" />
  </sodipodi:namedview>
  <circle
     cx="8"
     cy="8"
     fill="none"
     r="7"
     stroke="#00aad4"
     stroke-linecap="round"
     stroke-linejoin="round"
     id="circle262" />
  <path
     d="m8.6702355 9.8123438h-1.4362182c-.00377-.2065142-.00563-.3323005-.00563-.3773589 0-.4655972.076973-.8485879.2309215-1.1489732.1539472-.3003854.4618421-.6383191.923685-1.0138009.4618416-.3754817.737821-.6214221.8279368-.7378215.1389285-.1839861.2083928-.3867461.2083928-.6082804 0-.307895-.1239097-.5707322-.3717271-.7885113-.2440632-.2215343-.5744871-.3323013-.9912717-.3323013-.4017657 0-.7378219.1145221-1.0081688.3435656-.2703484.2290437-.4562126.5782417-.5575926 1.0475938l-1.453114-.1802311c.041303-.6721122.3266688-1.2428444.8560979-1.7121965.5331843-.4693521 1.23158-.7040281 2.095188-.7040281.9086653 0 1.6314679.2384309 2.1684069.7152927.536937.4731069.805409 1.0250649.805409 1.655874 0 .3491982-.0995.6796221-.29851.9912716-.195249.3116501-.615787.7359441-1.2616169 1.2728827-.3341781.2778566-.5425709.5012683-.6251763.6702353-.0788512.1689662-.1145226.4712291-.1070123.9067875zm-1.4362182 2.7876562v-1.582655h1.5826561v1.582655z"
     fill="#00aad4"
     stroke-width=".999995"
     id="path264" />
</svg>
