<?xml version="1.0" encoding="UTF-8" standalone="no"?>
<svg
   width="32"
   height="32"
   version="1.1"
   id="svg8"
   sodipodi:docname="menu_jumpto_initialization_200.svg"
   inkscape:export-filename="menu_jumpto_initialization_200.png"
   inkscape:export-xdpi="96"
   inkscape:export-ydpi="96"
   inkscape:version="1.2.2 (732a01da63, 2022-12-09)"
   xmlns:inkscape="http://www.inkscape.org/namespaces/inkscape"
   xmlns:sodipodi="http://sodipodi.sourceforge.net/DTD/sodipodi-0.dtd"
   xmlns="http://www.w3.org/2000/svg"
   xmlns:svg="http://www.w3.org/2000/svg">
  <defs
     id="defs12" />
  <sodipodi:namedview
     id="namedview10"
     pagecolor="#ffffff"
     bordercolor="#666666"
     borderopacity="1.0"
     inkscape:showpageshadow="2"
     inkscape:pageopacity="0.0"
     inkscape:pagecheckerboard="0"
     inkscape:deskcolor="#d1d1d1"
     showgrid="true"
     inkscape:zoom="28.6875"
     inkscape:cx="15.982571"
     inkscape:cy="16"
     inkscape:current-layer="svg8">
    <inkscape:grid
       type="xygrid"
       id="grid517" />
  </sodipodi:namedview>
  <path
     d="m29.25 0.75v28.5h-20.5v-28.5z"
     fill="#fff"
     stroke="#d4aa00"
     stroke-linecap="round"
     stroke-linejoin="round"
     stroke-miterlimit="5.6"
     stroke-width="1.5"
     id="path2" />
  <path
     d="m 2,19.5 6,4 -6,4 z"
     fill="#ff0000"
     stroke-width="2"
     id="path4" />
  <path
     style="fill:none;stroke:#2a7fff;stroke-width:1.5;stroke-linecap:butt;stroke-linejoin:miter;stroke-dasharray:none;stroke-opacity:1"
     d="M 26,15.25 H 12"
     id="path608" />
  <path
     style="fill:none;stroke:#2a7fff;stroke-width:1.5;stroke-linecap:butt;stroke-linejoin:miter;stroke-dasharray:none;stroke-opacity:1"
     d="M 18,19.25 H 12"
     id="path1440" />
  <path
     style="fill:none;stroke:#2a7fff;stroke-width:1.5;stroke-linecap:butt;stroke-linejoin:miter;stroke-dasharray:none;stroke-opacity:1"
     d="M 24,6.25 H 12"
     id="path1442"
     sodipodi:nodetypes="cc" />
  <path
     style="fill:none;stroke:#2a7fff;stroke-width:1.5;stroke-linecap:butt;stroke-linejoin:miter;stroke-dasharray:none;stroke-opacity:1"
     d="M 17.999996,10.25 H 11.999998"
     id="path1444"
     sodipodi:nodetypes="cc" />
  <path
     style="fill:none;stroke:#ff0000;stroke-width:1.5;stroke-linecap:butt;stroke-linejoin:miter;stroke-dasharray:none;stroke-opacity:1"
     d="M 26,23.25 H 12"
     id="path2162"
     sodipodi:nodetypes="cc" />
</svg>
