<svg width="36" height="36" version="1.1" xmlns="http://www.w3.org/2000/svg">
 <linearGradient id="a" x1="31.95608" x2="21.043918" y1="31.956081" y2="21.043919" gradientTransform="matrix(1.0424148,0,0,1.0424148,-1.6239912,-1.6239912)" gradientUnits="userSpaceOnUse">
  <stop stop-color="#0055d4" offset="0"/>
  <stop stop-color="#5599ff" offset="1"/>
 </linearGradient>
 <g stroke="#ffffff" stroke-linecap="round" stroke-width="1.8">
  <circle transform="matrix(0,1,1,0,0,0)" cx="26" cy="26" r="9.1000004" fill="url(#a)" stroke-dashoffset="1.49998" stroke-linejoin="round"/>
  <path d="m26.003063 21.917053v8.199836" fill="none"/>
  <path d="m30.113989 25.999648h-8.2" fill="none"/>
 </g>
</svg>
