<?xml version="1.0" encoding="UTF-8" standalone="no"?>
<svg
   height="32"
   width="32"
   version="1.1"
   id="svg48"
   sodipodi:docname="01 Download.svg"
   inkscape:export-filename="01 Download.png"
   inkscape:export-xdpi="96"
   inkscape:export-ydpi="96"
   inkscape:version="1.2.1 (9c6d41e410, 2022-07-14)"
   xmlns:inkscape="http://www.inkscape.org/namespaces/inkscape"
   xmlns:sodipodi="http://sodipodi.sourceforge.net/DTD/sodipodi-0.dtd"
   xmlns:xlink="http://www.w3.org/1999/xlink"
   xmlns="http://www.w3.org/2000/svg"
   xmlns:svg="http://www.w3.org/2000/svg">
  <defs
     id="defs52">
    <linearGradient
       id="linearGradient1347"
       x1="8.8369999"
       x2="15.576"
       y1="7.8053999"
       y2="10.838"
       gradientTransform="matrix(1.983,0,0,1.983,-0.35541,0.68892)"
       gradientUnits="userSpaceOnUse"
       xlink:href="#linearGradient933-3" />
    <linearGradient
       id="linearGradient933-3">
      <stop
         stop-color="#ffe991"
         offset="0"
         id="stop162" />
      <stop
         stop-color="#f5c400"
         offset="1"
         id="stop164" />
    </linearGradient>
    <linearGradient
       id="linearGradient1351"
       x1="8.8369999"
       x2="15.576"
       y1="7.8013"
       y2="10.834"
       gradientTransform="matrix(-1.983,0,0,1.983,33.356,0.69694)"
       gradientUnits="userSpaceOnUse"
       xlink:href="#linearGradient933-3" />
    <linearGradient
       id="linearGradient1355"
       x1="1.4239"
       x2="15.576"
       y1="4.4317002"
       y2="4.4317002"
       gradientTransform="matrix(-1.983,0,0,1.983,33.356,0.69694)"
       gradientUnits="userSpaceOnUse">
      <stop
         stop-color="#ffe478"
         offset="0"
         id="stop168" />
      <stop
         stop-color="#fff2c0"
         offset="1"
         id="stop170" />
    </linearGradient>
  </defs>
  <sodipodi:namedview
     id="namedview50"
     pagecolor="#ffffff"
     bordercolor="#666666"
     borderopacity="1.0"
     inkscape:showpageshadow="2"
     inkscape:pageopacity="0.0"
     inkscape:pagecheckerboard="0"
     inkscape:deskcolor="#d1d1d1"
     showgrid="true"
     inkscape:zoom="28.6875"
     inkscape:cx="15.494553"
     inkscape:cy="16"
     inkscape:current-layer="svg48">
    <inkscape:grid
       type="xygrid"
       id="grid2438" />
  </sodipodi:namedview>
  <linearGradient
     id="a"
     gradientUnits="userSpaceOnUse"
     x1="22"
     x2="28"
     y1="18.02074"
     y2="23.02074">
    <stop
       offset="0"
       stop-color="#ffe991"
       id="stop2" />
    <stop
       offset="1"
       stop-color="#e6b800"
       id="stop4" />
  </linearGradient>
  <linearGradient
     id="b"
     gradientUnits="userSpaceOnUse"
     x1="8"
     x2="2"
     y1="14.02074"
     y2="20.02074">
    <stop
       offset="0"
       stop-color="#ffea91"
       id="stop7" />
    <stop
       offset="1"
       stop-color="#e6b900"
       id="stop9" />
  </linearGradient>
  <linearGradient
     id="c"
     gradientUnits="userSpaceOnUse"
     x1="9"
     x2="27"
     y1="6.02074"
     y2="9.02074">
    <stop
       offset="0"
       stop-color="#fff2c0"
       id="stop12" />
    <stop
       offset="1"
       stop-color="#ffe478"
       id="stop14" />
  </linearGradient>
  <linearGradient
     id="d"
     gradientUnits="userSpaceOnUse"
     x1="23.5"
     x2="23.5"
     y1="28"
     y2="17.5">
    <stop
       offset="0"
       stop-color="#afa"
       id="stop17" />
    <stop
       offset="1"
       stop-color="#00c000"
       id="stop19" />
  </linearGradient>
  <g
     stroke-width="1.6"
     id="g193"
     transform="translate(0,-1.0030079)">
    <g
       stroke="#ccaa00"
       stroke-linejoin="round"
       id="g181">
      <path
         d="M 16.5,16.552 31.2,9.4846 v 12.695 l -14.7,8.0179 z"
         fill="url(#linearGradient1347)"
         id="path175"
         style="fill:url(#linearGradient1347)" />
      <path
         d="M 16.5,16.166 1.8,9.4844 v 12.695 l 14.7,8.0179 z"
         fill="url(#linearGradient1351)"
         id="path177"
         style="fill:url(#linearGradient1351)" />
      <path
         d="M 16.5,2.803 1.8,9.4846 16.5,16.1662 31.2,9.4846 Z"
         fill="url(#linearGradient1355)"
         id="path179"
         style="fill:url(#linearGradient1355)" />
    </g>
    <g
       fill="none"
       stroke="#5f8dd3"
       stroke-linecap="round"
       id="g191">
      <path
         d="m 9.6846,6.0101 15.115,6.6157"
         id="path183" />
      <path
         d="M 8.2,12.626 23.315,6.0103"
         id="path185" />
      <path
         d="M 8.2,12.626 V 25.588"
         id="path187" />
      <path
         d="M 24.8,12.626 V 25.588"
         id="path189" />
    </g>
  </g>
  <g
     fill-rule="evenodd"
     id="g46">
    <path
       d="m21.5 15a1.50015 1.50015 0 0 0 -1.5 1.5v6.5h-2.5a1.50015 1.50015 0 0 0 -1.060547 2.560547l6 6a1.50015 1.50015 0 0 0 2.121094 0l6-6a1.50015 1.50015 0 0 0 -1.060547-2.560547h-2.5v-6.5a1.50015 1.50015 0 0 0 -1.5-1.5z"
       fill="#fff"
       id="path42" />
    <path
       d="m21.5 16.5h4v8h4l-6 6-6-6h4z"
       fill="url(#d)"
       stroke="#009600"
       stroke-linejoin="round"
       id="path44" />
  </g>
</svg>
