<?xml version="1.0" encoding="UTF-8" standalone="no"?>
<svg
   height="20"
   viewBox="0 0 20 20"
   width="20"
   version="1.1"
   id="svg207"
   sodipodi:docname="lhelp020ico.svg"
   inkscape:version="1.2.2 (732a01da63, 2022-12-09)"
   xmlns:inkscape="http://www.inkscape.org/namespaces/inkscape"
   xmlns:sodipodi="http://sodipodi.sourceforge.net/DTD/sodipodi-0.dtd"
   xmlns="http://www.w3.org/2000/svg"
   xmlns:svg="http://www.w3.org/2000/svg">
  <defs
     id="defs211" />
  <sodipodi:namedview
     id="namedview209"
     pagecolor="#ffffff"
     bordercolor="#000000"
     borderopacity="0.25"
     inkscape:showpageshadow="2"
     inkscape:pageopacity="0.0"
     inkscape:pagecheckerboard="0"
     inkscape:deskcolor="#d1d1d1"
     showgrid="true"
     inkscape:zoom="45.5"
     inkscape:cx="9.989011"
     inkscape:cy="10"
     inkscape:current-layer="svg207">
    <inkscape:grid
       type="xygrid"
       id="grid1356" />
  </sodipodi:namedview>
  <linearGradient
     id="a"
     gradientTransform="matrix(.62261691 0 0 .60782555 48.503874 13.588733)"
     gradientUnits="userSpaceOnUse"
     x1="-49.009357"
     x2="-49.633709"
     y1="6.522097"
     y2="3.715767">
    <stop
       offset="0"
       stop-color="#e6e6e6"
       id="stop169" />
    <stop
       offset="1"
       stop-color="#999"
       id="stop171" />
  </linearGradient>
  <linearGradient
     id="b"
     gradientTransform="matrix(.62261691 0 0 .60782555 79.425353 40.029145)"
     gradientUnits="userSpaceOnUse"
     x1="-124.5"
     x2="-122"
     y1="-45"
     y2="-45">
    <stop
       offset="0"
       stop-color="#de7900"
       id="stop174" />
    <stop
       offset="1"
       stop-color="#ffa73e"
       id="stop176" />
  </linearGradient>
  <filter
     id="c"
     color-interpolation-filters="sRGB"
     height="1.1080598"
     width="1.0607311"
     x="-0.030365546"
     y="-0.054029903">
    <feGaussianBlur
       stdDeviation=".3602005"
       id="feGaussianBlur179" />
  </filter>
  <linearGradient
     id="d"
     gradientTransform="matrix(.62261691 0 0 .60782555 .313325 .216571)"
     gradientUnits="userSpaceOnUse"
     x1="14"
     x2="14"
     y1="25.5"
     y2="28">
    <stop
       offset="0"
       stop-color="#ccc"
       id="stop182" />
    <stop
       offset="1"
       stop-color="#fff"
       id="stop184" />
  </linearGradient>
  <path
     d="m-154.30078-29.5c-1.70899-.0016-3 .5-3.44985 1.972448l-1.02085 11.191661c-.0293 1.835891 1.57019 2.814254 3.11132 2.835938h24.85938l.49805-.548828-.30608-4.470403.30607-.53741-1.13672-10-.49609-.443406z"
     fill="#999"
     fill-opacity=".994638"
     filter="url(#c)"
     transform="matrix(.62917107 0 0 .60782555 100.93869 27.498508)"
     id="path187" />
  <g
     stroke-linecap="round"
     stroke-width=".499999"
     id="g199">
    <path
       d="m1.6208208 17.235686.3791792-6.235686c.0996374-1.009007.9283163-1.2578253 1.8622417-1.2578253h14.2353463l.70746 5.8543943"
       fill="url(#b)"
       stroke="#b26f25"
       stroke-linejoin="round"
       stroke-opacity=".994638"
       id="path189" />
    <path
       d="m3.2396247 15.721569.3113085-5.9127511"
       fill="none"
       stroke="#b26f24"
       id="path191" />
    <g
       stroke-linejoin="round"
       id="g197">
      <path
         d="m18.680524 18.75525-.37357-3.00525h-2.303682v3.00525z"
         fill="url(#a)"
         stroke="#b26f24"
         id="path193" />
      <path
         d="m18.680524 18.75525h-15.4408993c-2.1791591 0-2.1791591-3.00525 0-3.00525h15.5654233c-1.556542 0-1.681066 3.00525-.124524 3.00525z"
         fill="url(#d)"
         stroke="#b16e24"
         id="path195" />
    </g>
  </g>
  <g
     stroke-width=".806792"
     transform="matrix(1.2674814 0 0 1.2120904 .117799 0)"
     id="g205">
    <path
       d="m8.3105469.00031511c-2.537633-.0276428-4.4634941 1.76733639-4.3769531 3.83398429.0705211 1.6840343 2.4303181 2.0124947 3.2226562.6777344.1920257-.3234833.3072321-.3935037.4277344-.4492187.1144373-.0529109.3043005-.0825054.5917968-.0976563-.0288471.0980763-.0275045.2139528-.1210937.3320313-.1596939.2014806-.5000412.4998214-.9257813.9492187-.5935864.6265705-.9667968 1.5033623-.9667968 2.4394532 0 .3347102.1821977.6361439.3515625.9316406-.5060249.4026403-.8858095.9435185-.8867188 1.5976564-.0018085 1.147413 1.0561962 2.160334 2.1855469 2.160156 1.1287398.000178 2.1862081-1.011556 2.1855469-2.158203-.0002444-.6231958-.3359313-1.162183-.8027344-1.5644532.1591075-.2615472.3548374-.511996.3652344-.8164062l-.015625.1523437c-.0005927.003471.0378318-.1089589.2617187-.3105469.2238874-.2015879.5824494-.4470116.9687504-.7304687a1.1371915 1.1371915 0 0 0 .06836-.052734c.744633-.6398864 1.77322-1.6539589 1.765624-3.1933597-.005765-1.1686188-.631117-2.1687129-1.451172-2.77929688-.820055-.61058399-1.8261975-.91074905-2.8476561-.92187501z"
       fill="#ffea00"
       stroke-linecap="round"
       stroke-linejoin="round"
       stroke-width=".403396"
       id="path201" />
    <path
       d="m8.861166 10.217886a1.0486588 1.0199205 0 0 1 -1.0486588 1.019921 1.0486588 1.0199205 0 0 1 -1.0486588-1.019921 1.0486588 1.0199205 0 0 1 1.0486588-1.0199201 1.0486588 1.0199205 0 0 1 1.0486588 1.0199201zm-.5616831-9.0815538c1.5914105.017334 3.1661121.9824109 3.1739451 2.5702028.0052 1.0537798-.667714 1.721712-1.37025 2.3254218-.7095675.5206617-1.5540027 1.0269181-1.6800399 1.7651019-.0293205.8584646-1.1249068.8853466-1.1249068-.1111285 0-.6719613.2350432-1.2134999.6571604-1.659073.7525532-.7943707 1.4063286-1.181938 1.442782-2.2565772.0239095-.7048451-.7655424-.9676919-1.2415753-.9468172-.7268286.0318725-1.4111655.1524246-1.9784674 1.1080921-.338247.5698056-1.0894832.3112079-1.1085216-.1434263-.0505611-1.2074278 1.2616452-2.6732366 3.2298735-2.6517964z"
       fill="#f50"
       id="path203" />
  </g>
</svg>
