<?xml version="1.0" encoding="UTF-8" standalone="no"?>
<svg
   height="32"
   width="32"
   version="1.1"
   id="svg345"
   sodipodi:docname="item_unit_200.svg"
   inkscape:export-filename="item_unit_200.png"
   inkscape:export-xdpi="96"
   inkscape:export-ydpi="96"
   inkscape:version="1.2.2 (732a01da63, 2022-12-09)"
   xmlns:inkscape="http://www.inkscape.org/namespaces/inkscape"
   xmlns:sodipodi="http://sodipodi.sourceforge.net/DTD/sodipodi-0.dtd"
   xmlns="http://www.w3.org/2000/svg"
   xmlns:svg="http://www.w3.org/2000/svg">
  <defs
     id="defs349" />
  <sodipodi:namedview
     id="namedview347"
     pagecolor="#ffffff"
     bordercolor="#666666"
     borderopacity="1.0"
     inkscape:showpageshadow="2"
     inkscape:pageopacity="0.0"
     inkscape:pagecheckerboard="0"
     inkscape:deskcolor="#d1d1d1"
     showgrid="true"
     inkscape:zoom="28.6875"
     inkscape:cx="15.982571"
     inkscape:cy="16"
     inkscape:current-layer="svg345">
    <inkscape:grid
       type="xygrid"
       id="grid572" />
  </sodipodi:namedview>
  <linearGradient
     id="a"
     gradientUnits="userSpaceOnUse"
     x1="27.749998"
     x2="16.249997"
     y1="27.749999"
     y2="16.249998">
    <stop
       offset="0"
       stop-color="#009600"
       id="stop316" />
    <stop
       offset="1"
       stop-color="#6edb39"
       id="stop318" />
  </linearGradient>
  <path
     d="m4.735655 1.735655h21.528696v27.52869h-21.528696z"
     style="fill:#fff;stroke:#d4aa00;stroke-width:1.47131;stroke-linecap:round;stroke-linejoin:round;stroke-miterlimit:5.6"
     id="path321" />
  <g
     fill="none"
     stroke="#2a7fff"
     stroke-width="1.5"
     id="g333">
    <path
       d="m9 10.75h13"
       id="path323" />
    <path
       d="m9 6.75h13"
       id="path325" />
    <path
       d="m9 14.75h13"
       id="path327" />
    <path
       d="m9 18.75h13"
       id="path329" />
    <path
       d="m9 22.75h13"
       id="path331" />
  </g>
</svg>
