<?xml version="1.0" encoding="UTF-8" standalone="no"?>
<svg
   height="16"
   width="16"
   version="1.1"
   id="svg26"
   sodipodi:docname="laz_save.svg"
   inkscape:export-filename="laz_save.png"
   inkscape:export-xdpi="96"
   inkscape:export-ydpi="96"
   inkscape:version="1.2.2 (732a01da63, 2022-12-09)"
   xmlns:inkscape="http://www.inkscape.org/namespaces/inkscape"
   xmlns:sodipodi="http://sodipodi.sourceforge.net/DTD/sodipodi-0.dtd"
   xmlns="http://www.w3.org/2000/svg"
   xmlns:svg="http://www.w3.org/2000/svg">
  <defs
     id="defs30" />
  <sodipodi:namedview
     id="namedview28"
     pagecolor="#ffffff"
     bordercolor="#666666"
     borderopacity="1.0"
     inkscape:showpageshadow="2"
     inkscape:pageopacity="0.0"
     inkscape:pagecheckerboard="0"
     inkscape:deskcolor="#d1d1d1"
     showgrid="true"
     inkscape:zoom="57.375"
     inkscape:cx="7.9912854"
     inkscape:cy="8"
     inkscape:current-layer="svg26">
    <inkscape:grid
       type="xygrid"
       id="grid603" />
  </sodipodi:namedview>
  <linearGradient
     id="a"
     gradientUnits="userSpaceOnUse"
     x1="14.5"
     x2=".5"
     y1="15.5"
     y2=".5">
    <stop
       offset="0"
       stop-color="#2a7fff"
       id="stop2" />
    <stop
       offset="1"
       stop-color="#66a4ff"
       id="stop4" />
  </linearGradient>
  <linearGradient
     id="b"
     gradientTransform="matrix(.94406 0 0 .95238 -4.7727 -3.3333)"
     gradientUnits="userSpaceOnUse"
     x1="13.53"
     x2="13.53"
     y1="3.5"
     y2="8.75">
    <stop
       offset="0"
       stop-color="#ececec"
       id="stop7" />
    <stop
       offset="1"
       stop-color="#b7bec8"
       id="stop9" />
  </linearGradient>
  <path
     d="m-.00000004 0h13.5l1.5 1.5v14.5h-15z"
     fill="url(#a)"
     fill-rule="evenodd"
     id="path12" />
  <rect
     fill="#fff"
     height="8"
     rx=".5"
     width="11"
     x="2"
     y="7"
     id="rect14" />
  <path
     d="m4 0v5h8v-5zm5 1h2v3h-2z"
     fill="url(#b)"
     fill-rule="evenodd"
     id="path16" />
  <g
     fill="none"
     id="g24">
    <path
       d="m3 9.5h9"
       stroke="#e6e6e6"
       id="path18" />
    <path
       d="m3 11.5h9"
       stroke="#e6e6e6"
       id="path20" />
    <path
       d="m2 14.5h11"
       stroke="#f60"
       id="path22" />
  </g>
</svg>
