<?xml version="1.0" encoding="UTF-8" standalone="no"?>
<svg
   height="32"
   width="32"
   version="1.1"
   id="svg1636"
   sodipodi:docname="User_04_32.svg"
   inkscape:export-filename="User_04_32.png"
   inkscape:export-xdpi="96"
   inkscape:export-ydpi="96"
   inkscape:version="1.2.1 (9c6d41e410, 2022-07-14)"
   xmlns:inkscape="http://www.inkscape.org/namespaces/inkscape"
   xmlns:sodipodi="http://sodipodi.sourceforge.net/DTD/sodipodi-0.dtd"
   xmlns="http://www.w3.org/2000/svg"
   xmlns:svg="http://www.w3.org/2000/svg">
  <defs
     id="defs1640" />
  <sodipodi:namedview
     id="namedview1638"
     pagecolor="#ffffff"
     bordercolor="#666666"
     borderopacity="1.0"
     inkscape:pageshadow="2"
     inkscape:pageopacity="0.0"
     inkscape:pagecheckerboard="0"
     inkscape:deskcolor="#d1d1d1"
     showgrid="true"
     inkscape:zoom="28.6875"
     inkscape:cx="14.291939"
     inkscape:cy="16"
     inkscape:current-layer="g1960"
     inkscape:showpageshadow="2">
    <inkscape:grid
       type="xygrid"
       id="grid1759" />
  </sodipodi:namedview>
  <g
     id="g1960"
     transform="scale(2)">
    <g
       id="g4090"
       transform="translate(-2.6253819e-8,3.0502377e-5)">
      <g
         id="g3951"
         transform="translate(3.5000309,-5)">
        <path
           style="fill:none;fill-rule:evenodd;stroke:#00aad4;stroke-width:0.5;stroke-linecap:round;stroke-linejoin:round;stroke-miterlimit:4;stroke-dasharray:none;stroke-opacity:1"
           d="m 4.43556,12.128949 c 1.4423422,-1.171931 6.046454,-1.171931 7.12821,0 0.729406,0.891711 0.685405,1.486186 0.685405,3.12099 H 6.2187191"
           id="path4051" />
        <path
           style="fill:#00aad4;fill-opacity:1;fill-rule:evenodd;stroke:none;stroke-width:0.76082px;stroke-linecap:butt;stroke-linejoin:miter;stroke-opacity:1"
           d="m 6.110787,11.296903 0.76,0.865665 0.76,3.087432 H 8.3907872 L 9.1507873,12.162568 9.910787,11.25 Z"
           id="path3943"
           inkscape:connector-curvature="0"
           sodipodi:nodetypes="ccccccc" />
        <g
           id="g3949"
           transform="matrix(0.99725949,0,0,1.0030909,0.02205348,-0.01700176)"
           style="stroke-width:0.999829">
          <ellipse
             style="fill:none;fill-opacity:1;fill-rule:evenodd;stroke:#00aad4;stroke-width:0.499914;stroke-linecap:square;stroke-linejoin:round;stroke-miterlimit:4;stroke-dasharray:none;stroke-dashoffset:0;stroke-opacity:1;paint-order:normal"
             id="ellipse3945"
             cx="7.9996805"
             cy="8.6028032"
             ry="2.6287367"
             rx="2.1916399" />
          <path
             style="fill:#00aad4;fill-opacity:1;fill-rule:evenodd;stroke:none;stroke-width:0.837157px;stroke-linecap:butt;stroke-linejoin:miter;stroke-opacity:1"
             d="m 5.6252385,8.4695855 c 0,0 0.6219607,-1.1440237 1.1367442,-0.685928 C 8.2567635,9.113673 8.7442247,6.3799688 10.374822,8.4695855 10.96852,6.3917278 9.446372,5.0968943 8.041915,5.6137908 6.543256,5.1202455 5.0315405,6.6885648 5.6252385,8.4695855 Z"
             id="path3947"
             inkscape:connector-curvature="0"
             sodipodi:nodetypes="csccc" />
        </g>
      </g>
      <g
         id="g3939"
         transform="translate(-3.5000307,-4)">
        <g
           id="g4069">
          <path
             style="fill:none;fill-rule:evenodd;stroke:#00aad4;stroke-width:0.5;stroke-linecap:round;stroke-linejoin:round;stroke-miterlimit:4;stroke-dasharray:none;stroke-opacity:1"
             d="M 12.249175,15.249939 H 3.7501552 c 0,-1.634804 -0.017962,-2.526516 0.6854048,-3.12099 0.7067171,-0.574221 2.1725096,-0.867086 3.6110985,-0.878595"
             id="path4055" />
          <path
             style="fill:#00aad4;fill-opacity:1;fill-rule:evenodd;stroke:none;stroke-width:0.76082px;stroke-linecap:butt;stroke-linejoin:miter;stroke-opacity:1"
             d="m 6.110787,11.296903 0.76,0.865665 0.76,3.087432 H 8.3907872 L 9.1507873,12.162568 9.910787,11.25 Z"
             id="path3931"
             inkscape:connector-curvature="0"
             sodipodi:nodetypes="ccccccc" />
          <g
             id="g3937"
             transform="matrix(0.99725949,0,0,1.0030909,0.02205348,-0.01700176)"
             style="stroke-width:0.999829">
            <ellipse
               style="fill:none;fill-opacity:1;fill-rule:evenodd;stroke:#00aad4;stroke-width:0.499914;stroke-linecap:square;stroke-linejoin:round;stroke-miterlimit:4;stroke-dasharray:none;stroke-dashoffset:0;stroke-opacity:1;paint-order:normal"
               id="ellipse3933"
               cx="7.9996805"
               cy="8.6028032"
               ry="2.6287367"
               rx="2.1916399" />
            <path
               style="fill:#00aad4;fill-opacity:1;fill-rule:evenodd;stroke:none;stroke-width:0.837157px;stroke-linecap:butt;stroke-linejoin:miter;stroke-opacity:1"
               d="m 5.6252385,8.4695855 c 0,0 0.6219607,-1.1440237 1.1367442,-0.685928 C 8.2567635,9.113673 8.7442247,6.3799688 10.374822,8.4695855 10.96852,6.3917278 9.446372,5.0968943 8.041915,5.6137908 6.543256,5.1202455 5.0315405,6.6885648 5.6252385,8.4695855 Z"
               id="path3935"
               inkscape:connector-curvature="0"
               sodipodi:nodetypes="csccc" />
          </g>
        </g>
      </g>
      <g
         id="g3927">
        <path
           style="fill:none;fill-rule:evenodd;stroke:#00aad4;stroke-width:0.5;stroke-linecap:round;stroke-linejoin:round;stroke-miterlimit:4;stroke-dasharray:none;stroke-opacity:1"
           d="m 11.56377,12.128949 c 0.729406,0.891711 0.685405,1.486186 0.685405,3.12099 H 3.7501552 c 0,-1.634804 -0.017962,-2.526516 0.6854048,-3.12099 1.4423422,-1.171931 6.046454,-1.171931 7.12821,0 z"
           id="path1863"
           inkscape:connector-curvature="0"
           sodipodi:nodetypes="ccccc" />
        <path
           style="fill:#00aad4;fill-opacity:1;fill-rule:evenodd;stroke:none;stroke-width:0.76082px;stroke-linecap:butt;stroke-linejoin:miter;stroke-opacity:1"
           d="m 6.110787,11.296903 0.76,0.865665 0.76,3.087432 H 8.3907872 L 9.1507873,12.162568 9.910787,11.25 Z"
           id="path1865"
           inkscape:connector-curvature="0"
           sodipodi:nodetypes="ccccccc" />
        <g
           id="g3920"
           transform="matrix(0.99725949,0,0,1.0030909,0.02205348,-0.01700176)"
           style="stroke-width:0.999829">
          <ellipse
             style="fill:none;fill-opacity:1;fill-rule:evenodd;stroke:#00aad4;stroke-width:0.499914;stroke-linecap:square;stroke-linejoin:round;stroke-miterlimit:4;stroke-dasharray:none;stroke-dashoffset:0;stroke-opacity:1;paint-order:normal"
             id="ellipse1869"
             cx="7.9996805"
             cy="8.6028032"
             ry="2.6287367"
             rx="2.1916399" />
          <path
             style="fill:#00aad4;fill-opacity:1;fill-rule:evenodd;stroke:none;stroke-width:0.837157px;stroke-linecap:butt;stroke-linejoin:miter;stroke-opacity:1"
             d="m 5.6252385,8.4695855 c 0,0 0.6219607,-1.1440237 1.1367442,-0.685928 C 8.2567635,9.113673 8.7442247,6.3799688 10.374822,8.4695855 10.96852,6.3917278 9.446372,5.0968943 8.041915,5.6137908 6.543256,5.1202455 5.0315405,6.6885648 5.6252385,8.4695855 Z"
             id="path1871"
             inkscape:connector-curvature="0"
             sodipodi:nodetypes="csccc" />
        </g>
      </g>
    </g>
  </g>
</svg>
