<?xml version="1.0" encoding="UTF-8" standalone="no"?>
<svg
   height="24"
   viewBox="0 0 6.3499998 6.3500003"
   width="24"
   version="1.1"
   id="svg16"
   sodipodi:docname="Arrow_31_24.svg"
   inkscape:export-filename="Arrow_31_24.png"
   inkscape:export-xdpi="96"
   inkscape:export-ydpi="96"
   inkscape:version="1.2 (dc2aedaf03, 2022-05-15)"
   xmlns:inkscape="http://www.inkscape.org/namespaces/inkscape"
   xmlns:sodipodi="http://sodipodi.sourceforge.net/DTD/sodipodi-0.dtd"
   xmlns="http://www.w3.org/2000/svg"
   xmlns:svg="http://www.w3.org/2000/svg">
  <defs
     id="defs20" />
  <sodipodi:namedview
     id="namedview18"
     pagecolor="#ffffff"
     bordercolor="#666666"
     borderopacity="1.0"
     inkscape:showpageshadow="2"
     inkscape:pageopacity="0.0"
     inkscape:pagecheckerboard="0"
     inkscape:deskcolor="#d1d1d1"
     showgrid="true"
     inkscape:zoom="38.25"
     inkscape:cx="12"
     inkscape:cy="12"
     inkscape:current-layer="svg16">
    <inkscape:grid
       type="xygrid"
       id="grid999" />
  </sodipodi:namedview>
  <g
     id="g1883"
     transform="translate(0.03042709)">
    <g
       id="g957"
       transform="matrix(1.5000027,0,0,1.5000027,0.05093144,-1.4649924e-6)">
      <path
         d="M 0.5291665,2.910411 1.190625,3.571875 1.8520832,2.910411"
         stroke-linejoin="round"
         id="path151"
         style="fill:none;stroke:#00aad4;stroke-width:0.330729;stroke-linecap:round;stroke-dasharray:none"
         sodipodi:nodetypes="ccc" />
      <path
         d="m 1.1906249,3.5718694 1e-7,-2.91041106"
         id="path153"
         style="fill:none;stroke:#00aad4;stroke-width:0.330729;stroke-linecap:round;stroke-dasharray:none"
         sodipodi:nodetypes="cc" />
    </g>
    <g
       id="g963"
       transform="matrix(1.5000027,0,0,-1.5000027,2.6967648,6.3500015)">
      <path
         d="M 0.5291665,2.910411 1.190625,3.571875 1.8520832,2.910411"
         stroke-linejoin="round"
         id="path959"
         style="fill:none;stroke:#00aad4;stroke-width:0.330729;stroke-linecap:round;stroke-dasharray:none"
         sodipodi:nodetypes="ccc" />
      <path
         d="m 1.1906249,3.5718694 1e-7,-2.91041106"
         id="path961"
         style="fill:none;stroke:#00aad4;stroke-width:0.330729;stroke-linecap:round;stroke-dasharray:none"
         sodipodi:nodetypes="cc" />
    </g>
  </g>
</svg>
