<?xml version="1.0" encoding="UTF-8" standalone="no"?>
<svg
   height="48"
   width="48"
   version="1.1"
   id="svg732"
   sodipodi:docname="SaveAs_02_48.svg"
   inkscape:export-filename="SaveAs_02_48.png"
   inkscape:export-xdpi="96"
   inkscape:export-ydpi="96"
   inkscape:version="1.2-beta (1b65182ce9, 2022-04-05)"
   xml:space="preserve"
   xmlns:inkscape="http://www.inkscape.org/namespaces/inkscape"
   xmlns:sodipodi="http://sodipodi.sourceforge.net/DTD/sodipodi-0.dtd"
   xmlns="http://www.w3.org/2000/svg"
   xmlns:svg="http://www.w3.org/2000/svg"><defs
     id="defs736" /><sodipodi:namedview
     id="namedview734"
     pagecolor="#ffffff"
     bordercolor="#666666"
     borderopacity="1.0"
     inkscape:pageshadow="2"
     inkscape:pageopacity="0.0"
     inkscape:pagecheckerboard="0"
     inkscape:deskcolor="#d1d1d1"
     showgrid="true"
     inkscape:zoom="19.125"
     inkscape:cx="23.973856"
     inkscape:cy="24"
     inkscape:current-layer="svg732"><inkscape:grid
       type="xygrid"
       id="grid1467" /></sodipodi:namedview><linearGradient
     id="a"
     gradientUnits="userSpaceOnUse"
     x1="9"
     x2="11.25"
     y1="1.5"
     y2="9"><stop
       offset="0"
       stop-color="#ccc"
       id="stop717" /><stop
       offset="1"
       stop-color="#f2f2f2"
       id="stop719" /></linearGradient><g
     id="g2285"
     transform="scale(2)"><path
       d="M 21.25,10 V 3 L 19,0.75 H 0.75 v 22.5 H 11.6"
       fill="#0062f5"
       id="path722-2"
       style="fill:none;fill-rule:evenodd;stroke:#00aad4;stroke-width:1.5;stroke-linecap:round;stroke-linejoin:round;stroke-opacity:1"
       sodipodi:nodetypes="cccccc" /><path
       style="fill:none;stroke:#00aad4;stroke-width:1.5px;stroke-linecap:round;stroke-linejoin:round;stroke-opacity:1"
       d="m 6.75,1.5 v 6.7500005 h 10.5 V 1.5"
       id="path1004"
       sodipodi:nodetypes="cccc" /><path
       style="fill:none;stroke:#00aad4;stroke-width:2.25;stroke-linecap:butt;stroke-linejoin:miter;stroke-dasharray:none;stroke-opacity:1"
       d="M 13.85,2.5000001 V 6.5"
       id="path1006"
       sodipodi:nodetypes="cc" /><path
       style="fill:none;stroke:#00aad4;stroke-width:1.5;stroke-linecap:round;stroke-linejoin:round;stroke-dasharray:none;stroke-opacity:1"
       d="M 3.75,22.5 V 11.25 h 7.85"
       id="path1008"
       sodipodi:nodetypes="ccc" /></g><g
     id="g1474"
     transform="matrix(2.9999999,0,0,2.9999999,1.6e-6,-2.9999983)"
     style="fill:none;stroke:#00aad4"><circle
       style="fill:none;stroke-width:1;stroke-linecap:round;stroke-linejoin:round;stroke-dasharray:none;stroke-dashoffset:1.49998"
       id="path346"
       cx="11.5"
       cy="12.5"
       r="4" /><g
       id="g579"
       transform="translate(0.16666667,0.16666667)"><g
         id="g394"
         transform="translate(-0.16666667,-0.16666667)"><g
           id="g530"
           transform="rotate(45,11.5,12.5)"><path
             style="fill:none;stroke:#00aad4;stroke-width:1px;stroke-linecap:round;stroke-linejoin:miter;stroke-opacity:1"
             d="m 10.085786,11.085786 2.828428,2.828428"
             id="path1469"
             sodipodi:nodetypes="cc" /><path
             style="fill:none;stroke:#00aad4;stroke-width:1px;stroke-linecap:round;stroke-linejoin:miter;stroke-opacity:1"
             d="m 12.914214,11.085786 -2.828428,2.828428"
             id="path522"
             sodipodi:nodetypes="cc" /></g></g></g></g></svg>
