<?xml version="1.0" encoding="UTF-8" standalone="no"?>
<svg
   width="36"
   height="36"
   version="1.1"
   viewBox="0 0 36 36"
   id="svg30"
   sodipodi:docname="tservicemanager_150.svg"
   inkscape:export-filename="tservicemanager_150.png"
   inkscape:export-xdpi="96"
   inkscape:export-ydpi="96"
   inkscape:version="1.3.2 (091e20e, 2023-11-25, custom)"
   xmlns:inkscape="http://www.inkscape.org/namespaces/inkscape"
   xmlns:sodipodi="http://sodipodi.sourceforge.net/DTD/sodipodi-0.dtd"
   xmlns="http://www.w3.org/2000/svg"
   xmlns:svg="http://www.w3.org/2000/svg">
  <sodipodi:namedview
     id="namedview30"
     pagecolor="#ffffff"
     bordercolor="#000000"
     borderopacity="0.25"
     inkscape:showpageshadow="2"
     inkscape:pageopacity="0.0"
     inkscape:pagecheckerboard="0"
     inkscape:deskcolor="#d1d1d1"
     showgrid="true"
     inkscape:current-layer="svg30">
    <inkscape:grid
       id="grid30"
       units="px"
       originx="0"
       originy="0"
       spacingx="0.5"
       spacingy="0.5"
       empcolor="#0099e5"
       empopacity="0.30196078"
       color="#0099e5"
       opacity="0.14901961"
       empspacing="2"
       dotted="false"
       gridanglex="30"
       gridanglez="30"
       visible="true" />
  </sodipodi:namedview>
  <defs
     id="defs20">
    <filter
       id="i"
       x="-0.14419579"
       y="-0.14380474"
       width="1.2883916"
       height="1.2876095"
       color-interpolation-filters="sRGB">
      <feGaussianBlur
         stdDeviation="6.8390707"
         id="feGaussianBlur1" />
    </filter>
    <linearGradient
       id="h"
       x1="624"
       x2="768"
       y1="248"
       y2="248"
       gradientTransform="matrix(.04835819 0 0 .04835819 -6.1776687 -22.887899)"
       gradientUnits="userSpaceOnUse">
      <stop
         stop-color="#cccccc"
         offset="0"
         id="stop1" />
      <stop
         stop-color="#ffffff"
         offset=".30665046"
         id="stop2" />
      <stop
         stop-color="#b3b3b3"
         offset="1"
         id="stop3" />
    </linearGradient>
    <linearGradient
       id="g"
       x1="300.94946"
       x2="356.94946"
       y1="548.12805"
       y2="548.12805"
       gradientTransform="matrix(.03435867 .03402935 -.03435867 .03402935 24.653965 -11.101)"
       gradientUnits="userSpaceOnUse">
      <stop
         stop-color="#ffff00"
         offset="0"
         id="stop4" />
      <stop
         stop-color="#ffffff"
         offset="1"
         id="stop5" />
    </linearGradient>
    <linearGradient
       id="d"
       x1="324.94946"
       x2="404.94946"
       y1="556.12805"
       y2="556.12805"
       gradientTransform="matrix(.03435867 .03402935 -.03435867 .03402935 24.763937 -11.0126)"
       gradientUnits="userSpaceOnUse">
      <stop
         stop-color="#ffffff"
         offset="0"
         id="stop6" />
      <stop
         stop-color="#ffff00"
         offset="1"
         id="stop7" />
    </linearGradient>
    <linearGradient
       id="c"
       x1="404.94946"
       x2="436.94946"
       y1="580.12805"
       y2="580.12805"
       gradientTransform="matrix(.03435867 .03402935 -.03435867 .03402935 24.791411 -10.9173)"
       gradientUnits="userSpaceOnUse">
      <stop
         stop-color="#ffff00"
         offset="0"
         id="stop8" />
      <stop
         stop-color="#c9c900"
         offset="1"
         id="stop9" />
    </linearGradient>
    <linearGradient
       id="b"
       x1="428.94946"
       x2="300.94946"
       y1="816.38422"
       y2="816.38422"
       gradientTransform="matrix(.03435867 .03402935 -.03435867 .03402935 24.757054 -10.9853)"
       gradientUnits="userSpaceOnUse">
      <stop
         stop-color="#d38d5f"
         offset="0"
         id="stop10" />
      <stop
         stop-color="#ffe6d5"
         offset=".5"
         id="stop11" />
      <stop
         stop-color="#e9c6af"
         offset="1"
         id="stop12" />
    </linearGradient>
    <linearGradient
       id="f"
       x1="630"
       x2="668"
       y1="772"
       y2="768"
       gradientTransform="matrix(.03435867 .03402935 -.03435867 .03402935 11.316678 -16.39337)"
       gradientUnits="userSpaceOnUse">
      <stop
         stop-color="#999999"
         offset="0"
         id="stop13" />
      <stop
         stop-color="#e6e6e6"
         offset=".38779968"
         id="stop14" />
      <stop
         stop-color="#666666"
         offset="1"
         id="stop15" />
    </linearGradient>
    <linearGradient
       id="e"
       x1="568"
       x2="696"
       y1="64"
       y2="64"
       gradientTransform="matrix(.03386783 .03354322 -.03365747 .03333487 12.100989 -15.461)"
       gradientUnits="userSpaceOnUse">
      <stop
         stop-color="#ff0000"
         offset="0"
         id="stop16" />
      <stop
         stop-color="#ff7575"
         offset=".22654855"
         id="stop17" />
      <stop
         stop-color="#bb0000"
         offset="1"
         id="stop18" />
    </linearGradient>
    <linearGradient
       id="a"
       x1="8.068924"
       x2="15.931076"
       y1="26.499979"
       y2="45.499996"
       gradientTransform="matrix(-1.5262995,0,0,-1.5263144,36.315594,72.9473)"
       gradientUnits="userSpaceOnUse">
      <stop
         stop-color="#c83737"
         offset="0"
         id="stop19" />
      <stop
         stop-color="#f4d7d7"
         offset="1"
         id="stop20" />
    </linearGradient>
  </defs>
  <path
     d="m19.812478 32.5 0.604161-4.8334 2.709282-1.1233 3.846803 2.9925 2.562961-2.563-2.992482-3.8468 1.12336-2.7094 4.833283-0.6041v-3.625l-4.833283-0.6042-1.12336-2.7093 2.992482-3.8468-2.562961-2.563-3.846803 2.9925-2.709282-1.1234-0.604161-4.8333h-3.624959l-0.604159 4.8333-2.709284 1.1234-3.8468031-2.9925-2.5629621 2.563 2.9924842 3.8468-1.123358 2.7093-4.8332822 0.6042v3.625l4.8332822 0.6041 1.1233595 2.7094-2.9924857 3.8468 2.5629621 2.563 3.8468031-2.9925 2.709284 1.1233 0.604159 4.8334zm-1.812481-9.6667a4.833282 4.8333291 0 0 1-4.833281-4.8333 4.833282 4.8333291 0 0 1 4.833281-4.8333 4.833282 4.8333291 0 0 1 4.833284 4.8333 4.833282 4.8333291 0 0 1-4.833284 4.8333z"
     fill="url(#a)"
     fill-rule="evenodd"
     stroke="#c83737"
     stroke-linecap="round"
     stroke-linejoin="round"
     stroke-width="1px"
     id="path20" />
  <path
     transform="matrix(.26028325 0 0 .25778849 -26.58203 -16.64092)"
     d="m130.18549 199.12053 9.06736-26.37339 84.74715-84.74714c0.79203-0.792029 1.84806-0.792029 2.50809-0.132005l16.89663 16.896625c0.79203 0.79203 0.66002 1.71606-0.1251 2.50118l-84.94237 84.94238-25.77229 9.23501c-1.3537 0.46168-2.81277-1.06238-2.37947-2.32266z"
     fill="#070704"
     filter="url(#i)"
     opacity=".33"
     stroke-width=".405941"
     id="path21" />
  <rect
     transform="matrix(.71050359 .70369358 -.71050359 .70369358 0 0)"
     x="24.19128"
     y="-14.183414"
     width="6.7701468"
     height="6.3832817"
     fill="url(#h)"
     stroke="#999999"
     stroke-linecap="round"
     stroke-linejoin="round"
     stroke-width=".0392682"
     id="rect21" />
  <path
     d="m5.8643143 32.5337 2.3600837-6.7987 22.058266-21.8469c0.206152-0.2042 0.481021-0.2042 0.652815-0.034l4.39791 4.3558c0.206152 0.2041 0.171793 0.4423-0.03256 0.6447l-22.10908 21.8972-6.7080966 2.3807c-0.3523458 0.119-0.7321156-0.2739-0.6193371-0.5988zm21.772733-16.361c0.106994 0 0.412304-0.3024 0.412304-0.4083 0-0.062-0.627089-0.732-2.294248-2.3831-1.667159-1.6512-2.33329-2.33-2.395711-2.33-0.04535 0-0.161314 0.058-0.25769 0.1531-0.09638 0.095-0.240511 0.2614-0.240511 0.3063 0 0.062 0.711373 0.7298 2.378532 2.381s2.334903 2.281 2.397324 2.281zm0.618456-0.6125c0.106994 0 0.412304-0.3024 0.412304-0.4084 0-0.062-0.627089-0.7319-2.294248-2.3831s-2.3645-2.3299-2.395711-2.3299c-0.03121 0-0.144134 0.075-0.240511 0.1701-0.09638 0.096-0.262579 0.2844-0.24051 0.3063 0.02207 0.022 0.694193 0.7128 2.361352 2.364 1.667159 1.6511 2.334903 2.281 2.397324 2.281zm0.584097-0.6466c0.117319 0 1.958444-1.7554 1.958444-1.8716 0-0.062-0.634872-0.6968-2.302031-2.348s-2.411403-2.314-2.473824-2.314c-0.05976 0-0.405814 0.3339-1.03076 0.9528-0.624946 0.619-0.858967 0.8596-0.858967 0.9188 0 0.1181 4.587951 4.662 4.707138 4.662zm-2.196898-3.0126c0-0.025 0.213883-0.2572 0.475295-0.5161 0.399579-0.3958 0.483505-0.4626 0.526833-0.4197 0.04344 0.043-0.02672 0.1285-0.446663 0.5444-0.455292 0.451-0.555465 0.5215-0.555465 0.3914zm1.070845 0.1191c0.475295-0.4708 0.501362-0.4903 0.566918-0.4254 0.06556 0.065 0.04581 0.091-0.429483 0.5615-0.475295 0.4707-0.501358 0.4903-0.566918 0.4254-0.06556-0.065-0.04581-0.091 0.429483-0.5615zm0.549739 0.5445c0.498201-0.4935 0.498201-0.4935 0.601277-0.3914s0.103076 0.1021-0.395125 0.5955c-0.498201 0.4935-0.498201 0.4935-0.601277 0.3914s-0.103076-0.1021 0.395125-0.5955zm-2.387928-2.4672c0.423757-0.4197 0.450187-0.4389 0.51538-0.3743 0.06519 0.065 0.04581 0.091-0.377945 0.5104-0.423757 0.4197-0.450187 0.4389-0.51538 0.3744-0.06519-0.065-0.04581-0.091 0.377945-0.5105zm0.652815 0.6466c0.374128-0.3706 0.455032-0.4341 0.498201-0.3914 0.04317 0.043-0.021 0.1229-0.395125 0.4935-0.374128 0.3705-0.455032 0.4341-0.498201 0.3913-0.04317-0.043 0.021-0.1229 0.395125-0.4934zm2.405107 2.382c0.423757-0.4197 0.450186-0.4389 0.51538-0.3743 0.06519 0.065 0.04581 0.091-0.377945 0.5105-0.423757 0.4197-0.450187 0.4388-0.51538 0.3743-0.06519-0.065-0.04581-0.091 0.377945-0.5105zm2.036558-0.2541c0.106994 0 0.412304-0.3024 0.412304-0.4084 0-0.062-0.627089-0.7319-2.294248-2.3831s-2.384828-2.3129-2.447249-2.3129c-0.04535 0-0.109776 0.041-0.206152 0.1361-0.09638 0.095-0.206152 0.2273-0.206152 0.2722 0 0.1181 4.62231 4.6961 4.741497 4.6961zm0.618456-0.6126c0.106808 0 0.343586-0.2345 0.343586-0.3403 0-0.062-0.627088-0.7319-2.294247-2.3831-1.667159-1.6511-2.384828-2.3129-2.447249-2.3129-0.04535 0-0.128673 0.059-0.206152 0.1361-0.07748 0.077-0.137435 0.1593-0.137435 0.2042 0 0.118 4.62231 4.696 4.741497 4.696z"
     fill="#070704"
     stroke-width=".0196301"
     id="path22" />
  <path
     d="m22.799671 11.6444c-0.02191-0.022-0.05165-0.034-0.08268-0.034-0.03102 0-0.06077 0.012-0.08268 0.034l-7.032791 6.9654-7.0327898 6.9654c-0.023432 0.023-0.035655 0.056-0.033605 0.089s0.018183 0.063 0.044342 0.084l0.2018572 0.1574c0.4348893 0.3395 1.1515387 0.4674 1.6717646 0.2946 0.06364-0.021 0.134763-0.064 0.292048-0.2021 0.157285-0.1377 0.433597-0.3393 0.88076-0.7728 0.894327-0.8669 2.53658-2.5471 5.709663-5.68l6.648402-6.5634c0.02197-0.022 0.03432-0.051 0.03432-0.082s-0.01235-0.06-0.03432-0.082l-0.591613-0.5859z"
     fill="url(#g)"
     fill-rule="evenodd"
     id="path23" />
  <path
     d="m24.214198 13.0504c-0.01844-0.019-0.04357-0.029-0.06979-0.029s-0.05135 0.01-0.06979 0.029l-6.662361 6.6176-6.663434 6.6188c-0.01316 0.014-0.02213 0.03-0.02577 0.049l-0.04832 0.2307c-0.07592 0.3555-0.0649 0.6607 0.04295 0.9784 0.08107 0.2388 0.152636 0.3391 0.371503 0.5274 0.324734 0.2795 0.595067 0.3762 1.051161 0.3775 0.271184 8e-4 0.430563-0.032 0.570139-0.1308 0.02649-0.019 0.03255-0.027 0.0612-0.054s0.06844-0.065 0.118108-0.1127c0.09933-0.096 0.239913-0.2318 0.417672-0.4052 0.355519-0.3468 0.86495-0.8288 1.479436-1.4334 1.228973-1.2092 2.896144-2.8728 4.716936-4.6759l6.621559-6.556c0.01864-0.018 0.02913-0.043 0.02913-0.069s-0.01049-0.051-0.02913-0.069l-0.955601-0.9465-0.9556-0.9464z"
     fill="url(#d)"
     fill-rule="evenodd"
     id="path24" />
  <path
     d="m26.385868 15.1992c-0.05949-0.048-0.145727-0.043-0.19971 0.011l-6.630149 6.5666c-3.66127 3.6262-5.358862 5.2756-6.143452 6.1024-0.392295 0.4134-0.55357 0.6284-0.63487 0.7875-0.04065 0.08-0.05641 0.1567-0.05691 0.218-4.99e-4 0.061 0.0064 0.099 0.0054 0.1457-0.0072 0.3198 0.06313 0.7244 0.181457 0.9751 0.02583 0.055 0.05719 0.1096 0.09019 0.1574 0.033 0.048 0.05808 0.095 0.105531 0.1324 0.01418 0.011 0.05852 0.092 0.120255 0.085 0.06173-0.01 0.129608 0 0.171793-0.034 0.08437-0.059 0.205107-0.2144 0.429484-0.4254 0.448754-0.4218 1.300856-1.2906 3.012518-2.9653 1.901697-1.8605 5.072804-4.9785 7.046748-6.9281l3.588334-3.5433c0.05783-0.058 0.05785-0.1508 0-0.2085l-0.537928-0.5327-0.537928-0.5328c-0.0034 0-7e-3 -0.01-0.01074-0.011z"
     fill="url(#c)"
     fill-rule="evenodd"
     id="path25" />
  <path
     d="m10.49207 26.3475c-0.5840976 0.1702-1.3142193 0.094-2.0271617-0.5104-0.085897-0.085-0.1374347 0-0.1717933 0.1021l-1.3743468 4.0495 2.1130582 2.0928 3.9684266-1.4122c0.103076-0.034 0.07931-0.11 0-0.2042-0.343587-0.4084-0.425137-1.1373-0.446663-1.7355 0-0.1021 0.03436-0.1021-0.06872-0.1361-0.103076-0.034-0.962043 0.1361-1.580499-0.4764-0.618456-0.6126-0.395125-1.3782-0.343587-1.6334 0.01994-0.099-0.0028-0.1554-0.06872-0.1362z"
     fill="url(#b)"
     fill-rule="evenodd"
     id="path26" />
  <path
     d="m6.8990405 30.0516-0.9079561 2.5913c-0.05533 0.1579 0.2167946 0.431 0.3779454 0.3743l2.581662-0.9078z"
     fill="url(#f)"
     stroke-width=".0196301"
     id="path27" />
  <path
     d="m30.832403 4.0242c-0.137435-0.1361-0.309228-0.102-0.412304 0l-3.092281 3.0627 4.741497 4.696 3.09228-3.0626c0.103076-0.1021 0.137435-0.2722 0.03436-0.3743z"
     fill="url(#e)"
     stroke-width=".0196301"
     id="path28" />
  <path
     d="m28.169606 7.9206c7.9e-5 -0.018 0.731698-0.7293 1.040723-1.0104 0.306706-0.279 0.365272-0.3101 0.57673-0.3057 0.133261 0 0.189317 0.01 0.246037 0.028 0.06737 0.022 0.104293 0.049 0.195214 0.1438 0.11911 0.1238 0.12728 0.1487 0.127127 0.3869-1.01e-4 0.1587-0.0047 0.2149-0.02217 0.2683-0.01951 0.06-0.03267 0.077-0.168589 0.2156-0.196029 0.2006-0.299082 0.281-0.438492 0.3421-0.148074 0.065-0.18911 0.099-0.524126 0.437l-0.259388 0.2603z"
     fill="#ffffff"
     id="path29" />
  <path
     d="m30.449721 6.7129c-0.03068-0.038-0.04946-0.075-0.05882-0.1155-0.01208-0.052-0.0021-0.2187 0.0181-0.3016 0.01911-0.078 0.04874-0.1243 0.151587-0.2347 0.111398-0.1196 0.213991-0.1992 0.289644-0.2249 0.08762-0.03 0.302012-0.041 0.364982-0.019 0.05193 0.018 0.08311 0.042 0.170765 0.1286 0.12029 0.1194 0.136447 0.1539 0.134428 0.2868-0.0015 0.097-0.01475 0.193-0.03384 0.2438-0.02697 0.072-0.05542 0.1081-0.183341 0.2348-0.131552 0.1303-0.167802 0.1578-0.243322 0.1842-0.08422 0.029-0.282288 0.044-0.350642 0.026-0.01733 0-0.04579-0.017-0.06325-0.027-0.03779-0.022-0.155072-0.1303-0.196289-0.1817z"
     fill="#ffffff"
     id="path30" />
</svg>
