<?xml version="1.0" encoding="UTF-8" standalone="no"?>
<svg
   height="64"
   width="64"
   version="1.1"
   id="svg1178"
   sodipodi:docname="Print_02_64.svg"
   inkscape:export-filename="Print_02_64.png"
   inkscape:export-xdpi="96"
   inkscape:export-ydpi="96"
   inkscape:version="1.2-beta (1b65182ce9, 2022-04-05)"
   xmlns:inkscape="http://www.inkscape.org/namespaces/inkscape"
   xmlns:sodipodi="http://sodipodi.sourceforge.net/DTD/sodipodi-0.dtd"
   xmlns:xlink="http://www.w3.org/1999/xlink"
   xmlns="http://www.w3.org/2000/svg"
   xmlns:svg="http://www.w3.org/2000/svg">
  <defs
     id="defs1180" />
  <sodipodi:namedview
     id="namedview12"
     pagecolor="#ffffff"
     bordercolor="#666666"
     borderopacity="1.0"
     inkscape:pageshadow="2"
     inkscape:pageopacity="0.0"
     inkscape:pagecheckerboard="0"
     inkscape:deskcolor="#d1d1d1"
     showgrid="true"
     inkscape:zoom="14.34375"
     inkscape:cx="31.511983"
     inkscape:cy="32"
     inkscape:current-layer="svg1178">
    <inkscape:grid
       type="xygrid"
       id="grid139" />
  </sodipodi:namedview>
  <linearGradient
     id="a">
    <stop
       offset="0"
       stop-color="#e6e6e6"
       id="stop1139" />
    <stop
       offset="1"
       stop-color="#ccc"
       id="stop1141" />
  </linearGradient>
  <linearGradient
     id="b">
    <stop
       offset="0"
       stop-color="#666"
       id="stop1144" />
    <stop
       offset="1"
       stop-color="#999"
       id="stop1146" />
  </linearGradient>
  <linearGradient
     id="c"
     gradientUnits="userSpaceOnUse"
     x1="21"
     x2="6"
     xlink:href="#b"
     y1="29"
     y2="17" />
  <linearGradient
     id="d"
     gradientUnits="userSpaceOnUse"
     x1="18"
     x2="10"
     xlink:href="#b"
     y1="25"
     y2="17" />
  <linearGradient
     id="e"
     gradientUnits="userSpaceOnUse"
     x1="4"
     x2="28"
     xlink:href="#a"
     y1="20"
     y2="26" />
  <linearGradient
     id="f"
     gradientUnits="userSpaceOnUse"
     x1="13"
     x2="19"
     xlink:href="#a"
     y1="19"
     y2="23" />
  <linearGradient
     id="g"
     gradientUnits="userSpaceOnUse"
     x1="20"
     x2="22"
     y1="15"
     y2="19"
     gradientTransform="scale(2)">
    <stop
       offset="0"
       stop-color="#999"
       id="stop1153" />
    <stop
       offset="1"
       stop-color="#666"
       id="stop1155" />
  </linearGradient>
  <path
     d="M 1,36 5,23 h 54 l 4,13"
     fill="#e6e6e6"
     fill-rule="evenodd"
     stroke="url(#g)"
     stroke-linecap="round"
     stroke-linejoin="round"
     id="path1158"
     style="stroke:url(#g);stroke-width:2" />
  <path
     d="m 11,37 2,-8 h 38 l 2,8"
     fill="none"
     stroke="#999999"
     stroke-linecap="round"
     id="path1160"
     style="stroke-width:2" />
  <g
     fill-rule="evenodd"
     id="g1170"
     transform="scale(2)">
    <path
       d="M 6.5,14 V 0.5 h 15 l 4,4 V 14"
       fill="#ffffff"
       stroke="#6995db"
       stroke-linejoin="round"
       id="path1162" />
    <path
       d="m 0.5,18.5 v 11 h 31 v -11 z"
       fill="url(#e)"
       stroke="url(#c)"
       stroke-linecap="square"
       id="path1164"
       style="fill:url(#e);stroke:url(#c)" />
    <path
       d="m 4.5,23 v 8.5 h 23 V 23"
       fill="#ffffff"
       stroke="#6e99dd"
       id="path1166" />
    <path
       d="m 4.5,18.5 v 5 h 23 v -5 z"
       fill="url(#f)"
       stroke="url(#d)"
       stroke-linecap="square"
       stroke-linejoin="round"
       id="path1168"
       style="fill:url(#f);stroke:url(#d)" />
  </g>
  <path
     d="M 22,10 H 38"
     fill="none"
     stroke="#bbd6f5"
     stroke-linecap="round"
     stroke-width="4"
     id="path1172" />
  <path
     d="M 22,18 H 42"
     fill="none"
     stroke="#bbd6f5"
     stroke-linecap="round"
     stroke-width="4"
     id="path1174" />
  <path
     d="m 48.310262,25.514042 -3.109948,5.468924 -2.402928,0.0024 -3.108812,-5.468672 -5.709588,2.364992 1.668672,6.065196 -1.700828,1.697436 -6.06618,-1.668052 -2.3666,5.713472 5.468924,3.109948 0.0024,2.402932 -5.468668,3.108816 2.364984,5.709576 6.065196,-1.66866 1.697436,1.70082 -1.668052,6.066172 5.713476,2.36661 3.10994,-5.468934 2.40294,-0.0024 3.108812,5.468682 5.709576,-2.364998 -1.66866,-6.065188 1.70082,-1.697428 6.066172,1.668044 2.366606,-5.713468 -5.468926,-3.109948 -0.0024,-2.402924 5.468682,-3.10882 -2.364998,-5.709588 -6.065188,1.668676 -1.697428,-1.700828 1.668048,-6.06618 z M 45.91121,39.385954 a 4.9942014,4.9942014 0 0 1 2.702836,6.525244 4.9942014,4.9942014 0 0 1 -6.52524,2.70284 4.9942014,4.9942014 0 0 1 -2.70284,-6.52524 4.9942014,4.9942014 0 0 1 6.525244,-2.702844 z"
     fill="#2c5aa0"
     stroke="#ffffff"
     stroke-width="2.4"
     id="path1176"
     style="stroke-linecap:round;stroke-linejoin:round" />
</svg>
