<?xml version="1.0" encoding="UTF-8" standalone="no"?>
<svg
   width="36"
   height="36"
   version="1.1"
   viewBox="0 0 36 36"
   id="svg9"
   sodipodi:docname="tlistbox_150.svg"
   inkscape:export-filename="tlistbox_150.png"
   inkscape:export-xdpi="96"
   inkscape:export-ydpi="96"
   inkscape:version="1.3.2 (091e20e, 2023-11-25, custom)"
   xmlns:inkscape="http://www.inkscape.org/namespaces/inkscape"
   xmlns:sodipodi="http://sodipodi.sourceforge.net/DTD/sodipodi-0.dtd"
   xmlns="http://www.w3.org/2000/svg"
   xmlns:svg="http://www.w3.org/2000/svg">
  <defs
     id="defs9" />
  <sodipodi:namedview
     id="namedview9"
     pagecolor="#ffffff"
     bordercolor="#000000"
     borderopacity="0.25"
     inkscape:showpageshadow="2"
     inkscape:pageopacity="0.0"
     inkscape:pagecheckerboard="0"
     inkscape:deskcolor="#d1d1d1"
     showgrid="true"
     inkscape:current-layer="svg9">
    <inkscape:grid
       id="grid9"
       units="px"
       originx="0"
       originy="0"
       spacingx="0.5"
       spacingy="0.5"
       empcolor="#0099e5"
       empopacity="0.30196078"
       color="#0099e5"
       opacity="0.14901961"
       empspacing="2"
       dotted="false"
       gridanglex="30"
       gridanglez="30"
       visible="true" />
  </sodipodi:namedview>
  <rect
     x="4.5"
     y="4.5"
     width="27"
     height="27"
     fill="#f9f9f9"
     stroke="#2a7efe"
     style="stroke-width:1;paint-order:normal"
     id="rect1" />
  <rect
     x="26.5"
     y="4.5"
     width="5"
     height="27"
     fill="#e6e6e6"
     stroke="#2a7efe"
     stroke-width="1"
     style="paint-order:normal"
     id="rect8" />
  <path
     style="fill:#e6e6e6;fill-opacity:1;stroke:#2a7efe;stroke-width:1.5;stroke-linecap:round;stroke-linejoin:round;stroke-dasharray:none;stroke-opacity:1"
     d="m 29,8.5 v 9"
     id="path5-5" />
  <path
     d="m8 18.25h9.166666"
     fill="none"
     stroke="#808080"
     stroke-width="1.5"
     id="path1"
     style="stroke:#b3b3b3" />
  <path
     d="m8 15.25h12.222221"
     fill="none"
     stroke="#808080"
     stroke-width="1.5"
     id="path2"
     style="stroke:#b3b3b3" />
  <path
     d="m8 12.25h10.694444"
     fill="none"
     stroke="#808080"
     stroke-width="1.5"
     id="path3"
     style="stroke:#b3b3b3" />
  <path
     d="m8 9.25h12.222221"
     fill="none"
     stroke="#808080"
     stroke-width="1.5"
     id="path4"
     style="stroke:#b3b3b3" />
  <path
     d="m8 24.25h12.222221"
     fill="none"
     stroke="#808080"
     stroke-width="1.5"
     id="path5"
     style="stroke:#b3b3b3" />
  <path
     d="m8 21.25h10.694444"
     fill="none"
     stroke="#808080"
     stroke-width="1.5"
     id="path6"
     style="stroke:#b3b3b3" />
  <path
     d="m8 27.25h10.694444"
     fill="none"
     stroke="#808080"
     stroke-width="1.5"
     id="path7"
     style="stroke:#b3b3b3" />
</svg>
