<?xml version="1.0" encoding="UTF-8" standalone="no"?>
<svg
   height="32"
   width="32"
   version="1.1"
   id="svg48"
   sodipodi:docname="Print_06_32.svg"
   inkscape:export-filename="Print_06_32.png"
   inkscape:export-xdpi="96"
   inkscape:export-ydpi="96"
   inkscape:version="1.2.2 (732a01da63, 2022-12-09)"
   xmlns:inkscape="http://www.inkscape.org/namespaces/inkscape"
   xmlns:sodipodi="http://sodipodi.sourceforge.net/DTD/sodipodi-0.dtd"
   xmlns="http://www.w3.org/2000/svg"
   xmlns:svg="http://www.w3.org/2000/svg">
  <sodipodi:namedview
     id="namedview914"
     pagecolor="#ffffff"
     bordercolor="#000000"
     borderopacity="0.25"
     inkscape:showpageshadow="2"
     inkscape:pageopacity="0.0"
     inkscape:pagecheckerboard="0"
     inkscape:deskcolor="#d1d1d1"
     showgrid="true"
     inkscape:zoom="28.4375"
     inkscape:cx="15.982418"
     inkscape:cy="16"
     inkscape:current-layer="svg48">
    <inkscape:grid
       type="xygrid"
       id="grid2968" />
  </sodipodi:namedview>
  <defs
     id="defs1073" />
  <rect
     style="fill:#c2f3ff;fill-opacity:1;stroke:#00aad4;stroke-width:1.5;stroke-linejoin:round;stroke-dasharray:none"
     id="rect954"
     width="30.5"
     height="12.5"
     x="0.75"
     y="16.75"
     ry="1.5" />
  <rect
     style="fill:#ffffff;stroke:#00aad4;stroke-width:1.5;stroke-linejoin:round;stroke-dasharray:none"
     id="rect292"
     width="18.5"
     height="14"
     x="6.75"
     y="2.75"
     ry="1.5" />
  <path
     d="m 23,25 h 4"
     stroke-linecap="round"
     stroke-linejoin="round"
     id="path10"
     style="fill:none;stroke:#00aad4;stroke-width:2;stroke-miterlimit:4;stroke-dasharray:none" />
  <path
     d="M 11,6.75 H 21"
     id="path12"
     style="fill:none;stroke:#00aad4;stroke-width:1.5;stroke-miterlimit:4;stroke-dasharray:none" />
  <path
     d="M 11,10.75 H 21"
     id="path16"
     style="fill:none;stroke:#00aad4;stroke-width:1.5;stroke-miterlimit:4;stroke-dasharray:none" />
  <rect
     style="fill:#ebfcff;fill-opacity:1;stroke:#00aad4;stroke-width:1.5;stroke-linejoin:round;stroke-dasharray:none"
     id="rect1232"
     width="4"
     height="4"
     x="2.75"
     y="12.75"
     ry="1.1" />
  <rect
     style="fill:#ebfcff;fill-opacity:1;stroke:#00aad4;stroke-width:1.5;stroke-linejoin:round;stroke-dasharray:none"
     id="rect1372"
     width="4"
     height="4"
     x="25.25"
     y="12.75"
     ry="1.1" />
</svg>
