<?xml version="1.0" encoding="UTF-8" standalone="no"?>
<svg
   height="32"
   viewBox="0 0 8.4666664 8.4666671"
   width="32"
   version="1.1"
   id="svg377"
   sodipodi:docname="Cube_02_32.svg"
   inkscape:version="1.2.1 (9c6d41e410, 2022-07-14)"
   inkscape:export-filename="Cube_02_32.png"
   inkscape:export-xdpi="96"
   inkscape:export-ydpi="96"
   xmlns:inkscape="http://www.inkscape.org/namespaces/inkscape"
   xmlns:sodipodi="http://sodipodi.sourceforge.net/DTD/sodipodi-0.dtd"
   xmlns="http://www.w3.org/2000/svg"
   xmlns:svg="http://www.w3.org/2000/svg">
  <defs
     id="defs381" />
  <sodipodi:namedview
     id="namedview379"
     pagecolor="#ffffff"
     bordercolor="#666666"
     borderopacity="1.0"
     inkscape:showpageshadow="2"
     inkscape:pageopacity="0.0"
     inkscape:pagecheckerboard="0"
     inkscape:deskcolor="#d1d1d1"
     showgrid="true"
     inkscape:zoom="28.6875"
     inkscape:cx="16"
     inkscape:cy="16"
     inkscape:current-layer="svg377">
    <inkscape:grid
       type="xygrid"
       id="grid1274" />
  </sodipodi:namedview>
  <g
     stroke="#ffffff"
     stroke-linecap="round"
     stroke-linejoin="round"
     stroke-width="0.066146"
     id="g20"
     transform="scale(1.9999999)">
    <path
       d="M 0.09921869,2.38125 1.1244792,1.7404254 2.1497396,2.38125 1.1244792,3.0220746 Z"
       fill="#ff4c4c"
       id="path2" />
    <path
       d="M 0.09921873,3.2784045 1.1244791,3.9192292 V 3.0220747 L 0.09921873,2.38125 Z"
       fill="#ff0000"
       id="path4" />
    <path
       d="M 2.1166667,3.2784044 1.1244791,3.9192291 V 3.0220746 L 2.1166667,2.38125 Z"
       fill="#cc0000"
       id="path6" />
    <path
       d="M 2.0835937,2.38125 3.1088542,1.7404254 4.1341147,2.38125 3.1088542,3.0220747 Z"
       fill="#00d400"
       id="path8" />
    <path
       d="M 2.1166667,3.2784045 3.1088542,3.9192292 V 3.0220747 L 2.1166667,2.38125 Z"
       fill="#00b800"
       id="path10" />
    <path
       d="M 4.1341146,3.2784045 3.1088542,3.9192292 V 3.0220747 L 4.1341146,2.38125 Z"
       fill="#00a300"
       id="path12" />
    <path
       d="M 1.0914033,0.84327091 2.1166638,0.20244628 3.1419242,0.84327091 2.1166638,1.4840955 Z"
       fill="#4c93ff"
       id="path14" />
    <path
       d="M 1.0914066,1.7404253 2.116667,2.38125 V 1.4840955 L 1.0914066,0.8432709 Z"
       fill="#0066ff"
       id="path16" />
    <path
       d="M 3.1419275,1.7404253 2.1166671,2.38125 V 1.4840955 L 3.1419275,0.84327091 Z"
       fill="#0052cc"
       id="path18" />
  </g>
</svg>
