<?xml version="1.0" encoding="UTF-8" standalone="no"?>
<svg
   width="24"
   height="24"
   version="1.1"
   viewBox="0 0 24 24"
   id="svg14"
   sodipodi:docname="tsyntexsyn.svg"
   inkscape:version="1.3.2 (091e20e, 2023-11-25, custom)"
   xmlns:inkscape="http://www.inkscape.org/namespaces/inkscape"
   xmlns:sodipodi="http://sodipodi.sourceforge.net/DTD/sodipodi-0.dtd"
   xmlns="http://www.w3.org/2000/svg"
   xmlns:svg="http://www.w3.org/2000/svg">
  <defs
     id="defs14" />
  <sodipodi:namedview
     id="namedview14"
     pagecolor="#ffffff"
     bordercolor="#000000"
     borderopacity="0.25"
     inkscape:showpageshadow="2"
     inkscape:pageopacity="0.0"
     inkscape:pagecheckerboard="0"
     inkscape:deskcolor="#d1d1d1"
     showgrid="true"
     inkscape:current-layer="svg14">
    <inkscape:grid
       id="grid14"
       units="px"
       originx="0"
       originy="0"
       spacingx="0.5"
       spacingy="0.5"
       empcolor="#0099e5"
       empopacity="0.30196078"
       color="#0099e5"
       opacity="0.14901961"
       empspacing="2"
       dotted="false"
       gridanglex="30"
       gridanglez="30"
       visible="true" />
  </sodipodi:namedview>
  <rect
     x="1.25"
     y="1.25"
     width="20.5"
     height="21.5"
     fill="#ffffff"
     fill-rule="evenodd"
     stroke="#2a7efe"
     stroke-linecap="square"
     stroke-linejoin="round"
     stroke-width=".5"
     style="paint-order:normal"
     id="rect1" />
  <rect
     x="1.5"
     y="1.5"
     width="3.5"
     height="21"
     fill="#b3b3b3"
     fill-rule="evenodd"
     style="paint-order:normal"
     id="rect2" />
  <path
     d="m7 4.5h11"
     fill="none"
     stroke="#666666"
     stroke-width="1px"
     id="path2" />
  <path
     d="m9 6.5h4"
     fill="none"
     stroke="#666666"
     stroke-width="1px"
     id="path3" />
  <path
     d="m11 8.5h6"
     fill="none"
     stroke="#666666"
     stroke-width="1px"
     id="path4" />
  <path
     d="m9 10.5h2"
     fill="none"
     stroke="#666666"
     stroke-width="1px"
     id="path5" />
  <path
     d="m7 12.5h4"
     fill="none"
     stroke="#666666"
     stroke-width="1px"
     id="path6" />
  <path
     d="m14 6.5h3"
     fill="none"
     stroke="#ff0000"
     stroke-width="1px"
     id="path7" />
  <path
     d="m12 12.5"
     fill="none"
     stroke="#ff0000"
     stroke-width="1px"
     id="path8" />
  <path
     d="m11 10.5h3"
     fill="none"
     stroke="#2a7fff"
     stroke-width="1px"
     id="path9" />
  <path
     d="m14 10.5h2"
     fill="none"
     stroke="#666666"
     stroke-width="1px"
     id="path10" />
  <path
     d="m12 12.5h6"
     fill="none"
     stroke="#ff0000"
     id="path11" />
  <path
     d="M 14.148561,17.999849 H 11.5 M 14.553633,15.4 H 11.5 v 5.199699 h 3.053633"
     fill="none"
     stroke="#2c5aa0"
     stroke-linecap="round"
     stroke-linejoin="round"
     stroke-width=".8"
     id="path12" />
  <path
     d="m8.40001 20.6v-5.199699m-1.70001 0h3.4"
     fill="none"
     stroke="#2c5aa0"
     stroke-linecap="round"
     stroke-linejoin="round"
     stroke-width=".8"
     id="path13" />
  <path
     d="m19.08914 15.40015-3.17828 5.199699m0-5.199699 3.17828 5.199699"
     fill="none"
     stroke="#2c5aa0"
     stroke-linecap="round"
     stroke-linejoin="round"
     stroke-width=".8"
     id="path14" />
</svg>
