<?xml version="1.0" encoding="UTF-8" standalone="no"?>
<svg
   height="48"
   width="48"
   version="1.1"
   id="svg744"
   sodipodi:docname="Time_05_48.svg"
   inkscape:export-filename="Time_05_48.png"
   inkscape:export-xdpi="96"
   inkscape:export-ydpi="96"
   inkscape:version="1.2 (dc2aedaf03, 2022-05-15)"
   xmlns:inkscape="http://www.inkscape.org/namespaces/inkscape"
   xmlns:sodipodi="http://sodipodi.sourceforge.net/DTD/sodipodi-0.dtd"
   xmlns="http://www.w3.org/2000/svg"
   xmlns:svg="http://www.w3.org/2000/svg">
  <defs
     id="defs748" />
  <sodipodi:namedview
     id="namedview746"
     pagecolor="#ffffff"
     bordercolor="#666666"
     borderopacity="1.0"
     inkscape:showpageshadow="2"
     inkscape:pageopacity="0.0"
     inkscape:pagecheckerboard="0"
     inkscape:deskcolor="#d1d1d1"
     showgrid="false"
     inkscape:zoom="19.125"
     inkscape:cx="23.973856"
     inkscape:cy="24"
     inkscape:current-layer="svg744" />
  <linearGradient
     id="a"
     gradientUnits="userSpaceOnUse"
     x1="19.0000001"
     x2="28.9999996"
     y1="3.99999696378"
     y2="3.99999696378">
    <stop
       offset="0"
       stop-color="#808080"
       id="stop694" />
    <stop
       offset=".40312499"
       stop-color="#e6e6e6"
       id="stop696" />
    <stop
       offset="1"
       stop-color="#808080"
       id="stop698" />
  </linearGradient>
  <radialGradient
     id="b"
     cx="8.801107"
     cy="1036.9969"
     gradientTransform="matrix(.44442504 2.0000073 -1.9999915 .44444108 2089.0735 -456.4863)"
     gradientUnits="userSpaceOnUse"
     r="9">
    <stop
       offset="0"
       stop-color="#ccc"
       id="stop701" />
    <stop
       offset="1"
       stop-color="#fff"
       id="stop703" />
  </radialGradient>
  <path
     d="m19 5.9999969v-3.9999998h9.999999v3.9999998z"
     fill="url(#a)"
     fill-rule="evenodd"
     id="path706" />
  <circle
     cx="24.000002"
     cy="26.999962"
     fill="#808080"
     r="19.999998"
     id="circle708" />
  <circle
     cx="24.000002"
     cy="26.999962"
     fill="url(#b)"
     r="18"
     id="circle710" />
  <path
     d="m19.000003 1.9999971h9.99999v3.9999998h-9.99999z"
     fill="none"
     id="path712" />
  <g
     fill-rule="evenodd"
     id="g742">
    <path
       d="m23 13.999996h2v12h5.999999v2h-7.999999z"
       id="path714" />
    <path
       d="m10 19h2v2h-2z"
       fill="#2a7fff"
       id="path716" />
    <path
       d="m15 14h2v2h-2z"
       fill="#2a7fff"
       id="path718" />
    <path
       d="m23 11h2v1.999999h-2z"
       fill="#2a7fff"
       id="path720" />
    <path
       d="m31 14h2v2h-2z"
       fill="#2a7fff"
       id="path722" />
    <path
       d="m36 19h2v2h-2z"
       fill="#2a7fff"
       id="path724" />
    <path
       d="m36 33h2v2h-2z"
       fill="#2a7fff"
       id="path726" />
    <path
       d="m37 26h3v2h-3z"
       fill="#2a7fff"
       id="path728" />
    <path
       d="m31 38h2v2h-2z"
       fill="#2a7fff"
       id="path730" />
    <path
       d="m23 40h2v3h-2z"
       fill="#2a7fff"
       id="path732" />
    <path
       d="m15 38h2v2h-2z"
       fill="#2a7fff"
       id="path734" />
    <path
       d="m10 33h2v2h-2z"
       fill="#2a7fff"
       id="path736" />
    <path
       d="m7.9999999 26h3.0000001v2h-3.0000001z"
       fill="#2a7fff"
       id="path738" />
    <path
       d="m21 5.9999969h5.999999v1.9999999h-5.999999z"
       fill="#808080"
       id="path740" />
  </g>
</svg>
