<?xml version="1.0" encoding="UTF-8" standalone="no"?>
<svg
   height="16"
   width="16"
   version="1.1"
   id="svg12"
   sodipodi:docname="Database_08_16.svg"
   inkscape:export-filename="Database_08_16.png"
   inkscape:export-xdpi="96"
   inkscape:export-ydpi="96"
   inkscape:version="1.2.1 (9c6d41e410, 2022-07-14)"
   xmlns:inkscape="http://www.inkscape.org/namespaces/inkscape"
   xmlns:sodipodi="http://sodipodi.sourceforge.net/DTD/sodipodi-0.dtd"
   xmlns="http://www.w3.org/2000/svg"
   xmlns:svg="http://www.w3.org/2000/svg">
  <defs
     id="defs16" />
  <sodipodi:namedview
     id="namedview14"
     pagecolor="#ffffff"
     bordercolor="#666666"
     borderopacity="1.0"
     inkscape:showpageshadow="2"
     inkscape:pageopacity="0.0"
     inkscape:pagecheckerboard="0"
     inkscape:deskcolor="#d1d1d1"
     showgrid="true"
     inkscape:zoom="57.375"
     inkscape:cx="7.7298475"
     inkscape:cy="8"
     inkscape:current-layer="svg12">
    <inkscape:grid
       type="xygrid"
       id="grid861" />
  </sodipodi:namedview>
  <path
     id="path2"
     style="fill:#00aad4;stroke-width:2;stroke-linecap:round;stroke-linejoin:round;stroke-miterlimit:5.6"
     d="M 8 1 C 4.6862986 1 2 2.0453337 2 3.3339844 L 2 5.1992188 C 2 6.4878695 4.6862986 7.5332031 8 7.5332031 C 11.313703 7.5332031 14 6.4878695 14 5.1992188 L 14 3.3339844 C 14 2.0453337 11.313703 1 8 1 z M 8 2.4003906 C 10.772228 2.4003906 12.582682 3.2961853 13.433594 4.0019531 C 12.584713 4.5809546 10.779389 5.23927 8 5.1992188 C 5.2503334 5.1594352 3.4454196 4.5129451 2.5859375 3.9609375 C 3.4399525 3.2526228 5.2329079 2.4003906 8 2.4003906 z M 2 6.5996094 L 2 8.9335938 C 2 10.222246 4.6862953 11.267578 8 11.267578 C 11.313706 11.267578 14 10.222246 14 8.9335938 L 14 6.5996094 C 14 7.8882614 11.313706 8.9335938 8 8.9335938 C 4.6862953 8.9335938 2 7.8882614 2 6.5996094 z M 2 10.333984 L 2 12.666016 C 2 13.954667 4.6862953 15 8 15 C 11.313706 15 14 13.954667 14 12.666016 L 14 10.333984 C 14 11.622636 11.313706 12.666016 8 12.666016 C 4.6862953 12.666016 2 11.622636 2 10.333984 z " />
</svg>
