<?xml version="1.0" encoding="UTF-8" standalone="no"?>
<svg
   width="48"
   height="48"
   version="1.1"
   viewBox="0 0 48 48"
   id="svg6"
   sodipodi:docname="tprocessutf8_200.svg"
   inkscape:export-filename="tprocessutf8_200.png"
   inkscape:export-xdpi="96"
   inkscape:export-ydpi="96"
   inkscape:version="1.3.2 (091e20e, 2023-11-25, custom)"
   xmlns:inkscape="http://www.inkscape.org/namespaces/inkscape"
   xmlns:sodipodi="http://sodipodi.sourceforge.net/DTD/sodipodi-0.dtd"
   xmlns="http://www.w3.org/2000/svg"
   xmlns:svg="http://www.w3.org/2000/svg">
  <sodipodi:namedview
     id="namedview6"
     pagecolor="#ffffff"
     bordercolor="#000000"
     borderopacity="0.25"
     inkscape:showpageshadow="2"
     inkscape:pageopacity="0.0"
     inkscape:pagecheckerboard="0"
     inkscape:deskcolor="#d1d1d1"
     showgrid="true"
     inkscape:current-layer="svg6">
    <inkscape:grid
       id="grid6"
       units="px"
       originx="0"
       originy="0"
       spacingx="0.5"
       spacingy="0.5"
       empcolor="#0099e5"
       empopacity="0.30196078"
       color="#0099e5"
       opacity="0.14901961"
       empspacing="2"
       dotted="false"
       gridanglex="30"
       gridanglez="30"
       visible="true" />
  </sodipodi:namedview>
  <defs
     id="defs2">
    <linearGradient
       id="a"
       x1="8.0519476"
       x2="15.948051"
       y1="26.376619"
       y2="45.623371"
       gradientTransform="matrix(2.0263158,0,0,2.0263158,-0.31578919,-48.94736)"
       gradientUnits="userSpaceOnUse">
      <stop
         stop-color="#ffffff"
         offset="0"
         id="stop1" />
      <stop
         stop-color="#999999"
         offset="1"
         id="stop2" />
    </linearGradient>
    <linearGradient
       id="a-3"
       x1="8.0519476"
       x2="15.948051"
       y1="26.376619"
       y2="45.623371"
       gradientTransform="matrix(2.0263158,0,0,2.0263158,-0.31578919,-48.94736)"
       gradientUnits="userSpaceOnUse">
      <stop
         stop-color="#ffffff"
         offset="0"
         id="stop1-0"
         style="stop-color:#ffeeaa;stop-opacity:1" />
      <stop
         stop-color="#999999"
         offset="1"
         id="stop2-2"
         style="stop-color:#d4aa00;stop-opacity:1" />
    </linearGradient>
  </defs>
  <path
     d="M 21.593754,4.75 20.79167,11.1666 17.194825,12.658 12.087808,8.6852 8.6852203,12.0878 12.658041,17.1948 11.166668,20.7916 4.75,21.5938 v 4.8125 l 6.416668,0.8021 1.491373,3.5968 -3.9728207,5.107 3.4025877,3.4026 5.107017,-3.9728 3.596845,1.4914 0.802084,6.4166 h 4.812496 l 0.802083,-6.4166 3.596846,-1.4914 5.107017,3.9728 3.40259,-3.4026 -3.972824,-5.107 1.491371,-3.5968 L 43.25,26.4063 V 21.5938 L 36.833333,20.7916 35.34196,17.1948 39.314786,12.0878 35.912196,8.6852 30.805179,12.658 27.208333,11.1666 26.40625,4.75 Z m 2.40625,12.8334 A 6.416667,6.416667 0 0 1 30.41667,24 6.416667,6.416667 0 0 1 24.000004,30.4166 6.416667,6.416667 0 0 1 17.583334,24 a 6.416667,6.416667 0 0 1 6.41667,-6.4166 z"
     fill="url(#a)"
     fill-rule="evenodd"
     stroke="#999999"
     stroke-linejoin="round"
     stroke-width="1.5"
     id="path2"
     style="fill:url(#a-3);stroke:#d4aa00" />
  <rect
     x="5"
     y="31.999983"
     width="38"
     height="15.999966"
     ry="3.0000174"
     fill="#ffffff"
     fill-rule="evenodd"
     style="paint-order:normal"
     id="rect2" />
  <path
     d="M 30.08021,40.0001 H 25.65 m 5.10777,-4.3502 H 25.65 v 8.7003"
     fill="none"
     stroke="#2a7fff"
     stroke-linecap="round"
     stroke-linejoin="round"
     stroke-width="1.3"
     id="path3" />
  <path
     d="m 37.76841,42.0714 c 0,1.144 -0.85591,2.2786 -2.2692,2.2786 -1.4133,0 -2.26921,-1.1346 -2.26921,-2.2786 0,-1.144 1.12989,-2.2785 2.26921,-2.2785 1.13931,0 2.2692,1.1345 2.2692,2.2785 z m -0.20629,-4.35 c 0,1.144 -0.9236,2.0715 -2.06291,2.0715 -1.13932,0 -2.06292,-0.9275 -2.06292,-2.0715 0,-1.144 0.9236,-2.0714 2.06292,-2.0714 1.13931,0 2.06291,0.9274 2.06291,2.0714 z"
     fill="none"
     stroke="#2a7fff"
     stroke-linecap="round"
     stroke-linejoin="round"
     stroke-width="1.3"
     id="path4" />
  <path
     d="m 15.35,35.6499 -2e-5,6.0273 c 0,1.4809 -1.28862,2.673 -2.88936,2.673 -1.60072,0 -2.8894,-1.1921 -2.8894,-2.673 v -6.0273"
     fill="none"
     stroke="#2a7fff"
     stroke-linecap="round"
     stroke-linejoin="round"
     stroke-width="1.3"
     id="path5" />
  <path
     d="M 20.37509,44.3504 V 35.65 m -3.07509,0 h 6.15018"
     fill="none"
     stroke="#2a7fff"
     stroke-linecap="round"
     stroke-linejoin="round"
     stroke-width="1.3"
     id="path6" />
</svg>
