<?xml version="1.0" encoding="UTF-8" standalone="no"?>
<svg
   width="36"
   height="36"
   version="1.1"
   viewBox="0 0 36 36"
   id="svg6"
   sodipodi:docname="tchartcombobox_150.svg"
   inkscape:version="1.3.2 (091e20e, 2023-11-25, custom)"
   xmlns:inkscape="http://www.inkscape.org/namespaces/inkscape"
   xmlns:sodipodi="http://sodipodi.sourceforge.net/DTD/sodipodi-0.dtd"
   xmlns="http://www.w3.org/2000/svg"
   xmlns:svg="http://www.w3.org/2000/svg">
  <defs
     id="defs6" />
  <sodipodi:namedview
     id="namedview6"
     pagecolor="#ffffff"
     bordercolor="#000000"
     borderopacity="0.25"
     inkscape:showpageshadow="2"
     inkscape:pageopacity="0.0"
     inkscape:pagecheckerboard="0"
     inkscape:deskcolor="#d1d1d1"
     showgrid="true"
     inkscape:current-layer="svg6">
    <inkscape:grid
       id="grid6"
       units="px"
       originx="0"
       originy="0"
       spacingx="0.5"
       spacingy="0.5"
       empcolor="#0099e5"
       empopacity="0.30196078"
       color="#0099e5"
       opacity="0.14901961"
       empspacing="2"
       dotted="false"
       gridanglex="30"
       gridanglez="30"
       visible="true" />
  </sodipodi:namedview>
  <rect
     x="1.5"
     y="2.5"
     width="32"
     height="32"
     fill="#ffffff"
     fill-rule="evenodd"
     stroke="#2a7efe"
     stroke-linecap="square"
     stroke-linejoin="round"
     style="paint-order:normal"
     id="rect1" />
  <path
     d="m4.825 20.3 4.425-7.8 3 12.75 5.25-3.75 5.175 9.675"
     fill="none"
     stroke="#2a7efe"
     stroke-linecap="round"
     stroke-linejoin="round"
     stroke-width="1.65"
     id="path1" />
  <path
     d="m4.75 8v23.25h23.25"
     fill="none"
     stroke="#4d4d4d"
     stroke-linecap="round"
     stroke-linejoin="round"
     stroke-width="1.5"
     id="path2" />
  <rect
     x="13.5"
     y="2.5"
     width="20.011765"
     height="17"
     fill="#f9f9f9"
     stroke="#2a7efe"
     stroke-linejoin="round"
     stroke-width=".999999"
     style="paint-order:normal"
     id="rect2" />
  <path
     d="m16.5 15.25h12"
     fill="none"
     stroke="#b3b3b3"
     stroke-width="1.5px"
     id="path3" />
  <path
     d="m16.5 12.25h13.499999"
     fill="none"
     stroke="#b3b3b3"
     stroke-width="1.5px"
     id="path4" />
  <rect
     transform="rotate(90)"
     x="2.5000014"
     y="-27.5"
     width="6.0000005"
     height="14.000002"
     fill="#f9f9f9"
     stroke="#2a7efe"
     stroke-linejoin="round"
     stroke-width=".999997"
     style="paint-order:normal"
     id="rect4" />
  <path
     d="m16 5.45h9.000001"
     fill="none"
     stroke="#b3b3b3"
     stroke-linejoin="round"
     stroke-width="1.5px"
     id="path5" />
  <rect
     x="27.5"
     y="2.5"
     width="6"
     height="6"
     fill="#ffffff"
     stroke="#2a7efe"
     stroke-linejoin="round"
     style="paint-order:normal"
     id="rect5" />
  <path
     d="M 29.020269,4.6287511 30.5,6.5 32.020269,4.6287511"
     fill="none"
     stroke="#666666"
     stroke-linecap="round"
     stroke-linejoin="round"
     stroke-width="1.05"
     id="path6" />
</svg>
