<?xml version="1.0" encoding="UTF-8" standalone="no"?>
<svg
   height="24"
   width="24"
   version="1.1"
   id="svg561"
   sodipodi:docname="menu_goto_bookmarks_150.svg"
   inkscape:export-filename="menu_goto_bookmarks_150.png"
   inkscape:export-xdpi="96"
   inkscape:export-ydpi="96"
   inkscape:version="1.2.2 (732a01da63, 2022-12-09)"
   xmlns:inkscape="http://www.inkscape.org/namespaces/inkscape"
   xmlns:sodipodi="http://sodipodi.sourceforge.net/DTD/sodipodi-0.dtd"
   xmlns="http://www.w3.org/2000/svg"
   xmlns:svg="http://www.w3.org/2000/svg">
  <defs
     id="defs565" />
  <sodipodi:namedview
     id="namedview563"
     pagecolor="#ffffff"
     bordercolor="#666666"
     borderopacity="1.0"
     inkscape:showpageshadow="2"
     inkscape:pageopacity="0.0"
     inkscape:pagecheckerboard="0"
     inkscape:deskcolor="#d1d1d1"
     showgrid="true"
     inkscape:zoom="38.25"
     inkscape:cx="11.594771"
     inkscape:cy="12"
     inkscape:current-layer="g559">
    <inkscape:grid
       type="xygrid"
       id="grid1381" />
  </sodipodi:namedview>
  <radialGradient
     id="a"
     cx="10.5"
     cy="12"
     gradientUnits="userSpaceOnUse"
     r="6">
    <stop
       offset="0"
       stop-color="#2a7fff"
       id="stop548" />
    <stop
       offset=".69999999"
       stop-color="#4d94ff"
       id="stop550" />
    <stop
       offset="1"
       stop-color="#96bdff"
       id="stop552" />
  </radialGradient>
  <g
     stroke-width=".666667"
     transform="matrix(1.5 0 0 1.5 -3.75 -6.5)"
     id="g559">
    <circle
       cx="10.5"
       cy="12"
       fill="url(#a)"
       r="6"
       id="circle555" />
  </g>
</svg>
