<?xml version="1.0" encoding="UTF-8" standalone="no"?>
<svg
   height="24"
   width="24"
   version="1.1"
   id="svg1465"
   sodipodi:docname="File_12_24.svg"
   inkscape:version="1.2 (dc2aedaf03, 2022-05-15)"
   inkscape:export-filename="File_12_24.png"
   inkscape:export-xdpi="96"
   inkscape:export-ydpi="96"
   xmlns:inkscape="http://www.inkscape.org/namespaces/inkscape"
   xmlns:sodipodi="http://sodipodi.sourceforge.net/DTD/sodipodi-0.dtd"
   xmlns:xlink="http://www.w3.org/1999/xlink"
   xmlns="http://www.w3.org/2000/svg"
   xmlns:svg="http://www.w3.org/2000/svg">
  <defs
     id="defs1469">
    <radialGradient
       id="a-0"
       cx="9.1740294"
       cy="7.8253603"
       gradientTransform="matrix(0.66909781,-2.2758851e-8,4.5190518e-8,0.58542853,1.8616763,4.291566)"
       gradientUnits="userSpaceOnUse"
       r="7.5"
       fx="9.1740294"
       fy="7.8253603">
      <stop
         offset="0"
         stop-color="#fff"
         id="stop2-7"
         style="stop-color:#ccddff;stop-opacity:1;" />
      <stop
         offset="1"
         stop-color="#8fc1c7"
         id="stop4-7"
         style="stop-color:#ffffff;stop-opacity:1" />
    </radialGradient>
    <linearGradient
       inkscape:collect="always"
       xlink:href="#a-0"
       id="linearGradient5852"
       x1="19"
       y1="22"
       x2="5"
       y2="2"
       gradientUnits="userSpaceOnUse" />
    <radialGradient
       id="a-4"
       cx="12.1"
       cy="10.900001"
       gradientTransform="matrix(0,1.5892257,-1.5892254,2.9972888e-8,32.677103,-3.8750849)"
       gradientUnits="userSpaceOnUse"
       r="4.5">
      <stop
         offset="0"
         stop-color="#ff7f2a"
         id="stop138" />
      <stop
         offset="1"
         stop-color="#d45500"
         id="stop140" />
    </radialGradient>
  </defs>
  <sodipodi:namedview
     id="namedview1467"
     pagecolor="#ffffff"
     bordercolor="#666666"
     borderopacity="1.0"
     inkscape:pageshadow="2"
     inkscape:pageopacity="0.0"
     inkscape:pagecheckerboard="0"
     inkscape:deskcolor="#d1d1d1"
     showgrid="true"
     inkscape:zoom="38.25"
     inkscape:cx="11.620915"
     inkscape:cy="12"
     inkscape:current-layer="svg1465"
     showguides="true"
     inkscape:showpageshadow="2">
    <inkscape:grid
       type="xygrid"
       id="grid1588" />
  </sodipodi:namedview>
  <path
     d="M 3.75,23.25 V 0.75 H 15 L 20.25,6 v 17.25 z"
     id="path1449"
     style="fill:url(#linearGradient5852);stroke:#b3b3b3;stroke-width:1.5;stroke-linecap:round;stroke-linejoin:round;stroke-opacity:1;fill-opacity:1"
     sodipodi:nodetypes="cccccc" />
  <path
     d="M 14.75,1 V 6.249999 H 20"
     id="path1453"
     style="fill:none;stroke:#b3b3b3;stroke-width:1.5;stroke-linecap:round;stroke-linejoin:round;stroke-opacity:1"
     sodipodi:nodetypes="ccc" />
  <g
     fill="none"
     stroke-width="1.25031"
     transform="matrix(1.4439173,0,0,1.4442714,0.22742918,1.5550943)"
     id="g295">
    <g
       id="g6621">
      <circle
         cx="17.5"
         cy="17.5"
         style="fill:url(#a-4);stroke:#ffffff;stroke-width:1.2;stroke-linecap:round;stroke-linejoin:round;stroke-dasharray:none;stroke-dashoffset:1.49998"
         transform="matrix(0,0.69239063,0.69256046,0,-0.15750845,-1.0767327)"
         id="circle143"
         r="5.9000001" />
      <path
         d="M 11.28698,9.0599682 13.267602,11.040104 11.28698,13.02024"
         id="path291"
         sodipodi:nodetypes="ccc"
         style="fill:none;stroke:#ffffff;stroke-width:1.25061;stroke-linecap:round;stroke-linejoin:round;stroke-dasharray:none;stroke-opacity:1" />
    </g>
  </g>
</svg>
