<?xml version="1.0" encoding="UTF-8" standalone="no"?>
<svg
   width="16"
   height="16"
   version="1.1"
   viewBox="0 0 16 16"
   id="svg56"
   sodipodi:docname="lazarus_orange 16.svg"
   inkscape:export-filename="lazarus_orange 16.png"
   inkscape:export-xdpi="96"
   inkscape:export-ydpi="96"
   inkscape:version="1.1.1 (3bf5ae0d25, 2021-09-20)"
   xmlns:inkscape="http://www.inkscape.org/namespaces/inkscape"
   xmlns:sodipodi="http://sodipodi.sourceforge.net/DTD/sodipodi-0.dtd"
   xmlns="http://www.w3.org/2000/svg"
   xmlns:svg="http://www.w3.org/2000/svg">
  <defs
     id="defs60" />
  <sodipodi:namedview
     id="namedview58"
     pagecolor="#ffffff"
     bordercolor="#666666"
     borderopacity="1.0"
     inkscape:pageshadow="2"
     inkscape:pageopacity="0.0"
     inkscape:pagecheckerboard="0"
     showgrid="false"
     inkscape:zoom="46.5625"
     inkscape:cx="7.9892617"
     inkscape:cy="8"
     inkscape:current-layer="svg56" />
  <radialGradient
     id="a"
     cx="7.9998"
     cy="7.9999"
     r="9.0002"
     gradientUnits="userSpaceOnUse">
    <stop
       stop-color="#ffa061"
       offset="0"
       id="stop2" />
    <stop
       stop-color="#fff"
       offset="1"
       id="stop4" />
  </radialGradient>
  <radialGradient
     id="b"
     cx="7.9995"
     cy="7.9995"
     r="7.6663"
     gradientUnits="userSpaceOnUse">
    <stop
       stop-color="#ff6905"
       offset="0"
       id="stop7" />
    <stop
       stop-color="#ffa66b"
       offset=".56522"
       id="stop9" />
    <stop
       stop-color="#fff"
       offset="1"
       id="stop11" />
  </radialGradient>
  <path
     d="m13.111 12.875c.22929.07419.65631.01739.89522-.17378.23889-.19118.46707-.57926.63372-.8679.16668-.28865.38867-.68026.43481-.98276.046116-.3025-.11821-.70067-.29712-.86213-.72259-.6522-.9656-.80676-.96539-1.9882-.000188-1.1815.24277-1.336.96539-1.9882.17891-.16147.34324-.55967.29712-.86213-.04614-.30247-.26816-.6941-.43481-.98276s-.39484-.67673-.63372-.8679c-.23891-.19118-.66594-.24797-.89522-.17378-.92616.29966-1.1815.4328-2.2046-.15811-1.0233-.59057-1.0357-.87823-1.2393-1.8301-.050375-.23566-.31307-.57707-.59813-.68833-.28503-.11129-.7352-.11485-1.0685-.11485s-.78353.003553-1.0685.11485c-.28503.11129-.54775.4527-.59815.68833-.20355.95186-.21592 1.2395-1.2393 1.8301-1.0231.5909-1.2785.45776-2.2046.15811-.22929-.074189-.65634-.017411-.89522.17378-.23891.19118-.46707.57923-.63372.8679-.16668.28866-.38867.68026-.43481.98276s.11821.70067.2971.86213c.72262.6522.9656.80676.96541 1.9882.0001883 1.1815-.24277 1.336-.96541 1.9882-.17889.16147-.34321.55966-.2971.86213.04614.30247.26813.6941.43481.98276.16665.28866.39481.67673.63372.8679.23889.19118.66594.24797.89522.17378.92616-.29966 1.1815-.4328 2.2046.15811 1.0233.59057 1.0357.87823 1.2393 1.8301.050399.23566.3131.57706.59815.68833.28503.11129.73518.11485 1.0685.11485s.78353-.0036 1.0685-.11485c.28503-.11129.54773-.4527.59813-.68833.20357-.95186.21592-1.2395 1.2393-1.8301 1.0232-.5909 1.2785-.45776 2.2046-.15811z"
     fill="url(#a)"
     stroke-width=".33333"
     id="path14" />
  <path
     d="m13.341 6.0003c-.74106.57857-3.6747.6663-5.008 1.333-1.0664.5332-1.1858.9971-2 2.6667-.43646.895-2.2845 1.2919-2.5147 1.4263-.24169.14116-1.1189.992-1.5286 1.492.31665-.004 2.2766-.18995 2.8044.11486 1.0233.59056 1.0354.8782 1.2389 1.8301.050399.23566.31329.57686.59829.68817.28503.11129.73504.11458 1.0684.11458s.78334-.0033 1.0684-.11458c.28503-.11129.54789-.4525.59829-.68817.20355-.95186.21559-1.2395 1.2389-1.8301 1.0231-.5909 1.2789-.45787 2.2051-.1582.22929.07419.65629.01736.89515-.17383.23891-.19118.46681-.57917.63347-.86783.16668-.28866.38877-.6806.43491-.98306.04612-.30247-.11797-.7005-.29689-.86197-.72259-.6522-.96569-.80683-.96548-1.9883-.000212-1.1815.24286-1.3361.96548-1.9883.17891-.16147.343-.5595.29689-.86197-.021881-.14393-.22334-.7472-.30002-.9108-.28726.47437-.93313 1.3713-1.4328 1.7614z"
     fill="url(#b)"
     stroke-width=".33333"
     id="path16" />
  <path
     d="m13.082 12.848c.22803.07379.6527.0173.89027-.17283.23756-.19014.46448-.57609.63024-.86316.16574-.28708.38654-.67657.43241-.97739s-.11756-.69684-.29547-.85743c-.7186-.64865-.96026-.80235-.96008-1.9774-.000185-1.175.24146-1.3287.96006-1.9774.17792-.16059.34134-.5566.29545-.85742-.04587-.30082-.26665-.69032-.43241-.97739-.16574-.28708-.39263-.67303-.63024-.86316-.23756-.19014-.66224-.24662-.89027-.17284-.92104.29803-1.175.43043-2.1925-.15724-1.0177-.58734-1.03-.87347-1.2324-1.8201-.050106-.23437-.31136-.57392-.59482-.68461-.28343-.11068-.73113-.11422-1.0627-.11422-.3315 0-.7792.003543-1.0627.11422-.28343.11068-.54469.45022-.59482.68461-.20242.94665-.21473 1.2328-1.2324 1.8201-1.0175.58767-1.2714.45527-2.1925.15724-.22805-.073786-.65273-.017298-.89029.17283-.23757.19014-.46448.57609-.63024.86316-.16574.28708-.38652.67657-.43241.97739-.045869.30082.11756.69685.29547.85742.7186.64865.96026.80235.96003 1.9774.0002083 1.175-.24143 1.3287-.96003 1.9774-.17792.16059-.34134.5566-.29547.85742.045892.30082.26667.69032.43241.97739.16576.28708.39265.67303.63024.86316s.66226.24662.89029.17283c.92104-.29803 1.175-.43043 2.1925.15724 1.0177.58734 1.03.87347 1.2324 1.8201.05013.23437.31138.57392.59482.68461.28346.11068.73115.11422 1.0627.11422.33153.000002.77922-.0035 1.0627-.11422.28346-.11068.54471-.45022.59482-.68461.20244-.94665.21473-1.2328 1.2324-1.8201 1.0175-.58767 1.2714-.45527 2.1925-.15725z"
     fill="none"
     stroke="#ff6905"
     stroke-linejoin="round"
     stroke-width=".75"
     id="path18" />
  <g
     fill="#333"
     stroke-width=".31145"
     id="g26">
    <path
       d="m5.1413 4.779c0.6165 0 1.0876 0.16229 1.1405 0.77967 0.089455 1.0444 0.15193 1.7175-0.023639 2.2356-0.087848 0.25925-0.33846 0.85626-0.79578 1.3944-0.28666 0.33729-0.48208 0.69203-0.41526 1.1711 0.058276 0.41781 0.094578 0.99916 0.43322 1.099-0.035291 0.18929-0.073385 0.20698-0.23973 0.34448-0.40537-0.15778-0.50641-0.87905-0.557-1.4398-0.044139-0.48925 0.08598-1.0081 0.50881-1.4604 0.81753-0.87448 1.0331-1.6363 0.77077-2.4125-0.086652-0.25643-0.043578-0.23705-0.77808-0.20133-0.7345 0.035723-1.1341-0.52759-1.3035-1.0099-0.18272-0.10115-0.58686 0.030107-0.86658 0.099994 0.23892-0.40878 1.4613-0.6002 2.1263-0.6002z"
       id="path20" />
    <path
       d="M 8,3.376 7.84429,4.7775 8,5.8676 8.15574,4.7775 Z"
       id="path22" />
    <path
       d="m10.859 4.779c-0.6165 0-1.0876 0.16229-1.1405 0.77967-0.089458 1.0444-0.15193 1.7175 0.023637 2.2356 0.087852 0.25925 0.33846 0.85626 0.79578 1.3944 0.28666 0.33729 0.48208 0.69203 0.41526 1.1711-0.05827 0.41781-0.09458 0.99916-0.43322 1.099 0.03529 0.18929 0.07339 0.20698 0.23973 0.34448 0.40537-0.15778 0.50641-0.87905 0.557-1.4398 0.04414-0.48925-0.08598-1.0081-0.50881-1.4604-0.81753-0.87448-1.0331-1.6363-0.77077-2.4125 0.08665-0.25643 0.04358-0.23705 0.77808-0.20133 0.7345 0.035723 1.1341-0.52759 1.3035-1.0099 0.18272-0.10115 0.58686 0.030107 0.86658 0.099994-0.23892-0.40878-1.4613-0.6002-2.1263-0.6002z"
       id="path24" />
  </g>
  <g
     transform="translate(-.099667)"
     fill="#fff"
     stroke-width=".34653"
     id="g32">
    <ellipse
       transform="matrix(.98971 .14307 -.10373 .99461 0 0)"
       cx="5.7333"
       cy="4.8643"
       rx=".85325"
       ry=".57919"
       id="ellipse28" />
    <ellipse
       transform="matrix(-.98971 .14307 .10373 .99461 0 0)"
       cx="-10.391"
       cy="7.1835"
       rx=".85325"
       ry=".57919"
       id="ellipse30" />
  </g>
  <ellipse
     cx="5.1517"
     cy="5.3528"
     rx=".43969"
     ry=".32976"
     fill="#500"
     fill-opacity=".97647"
     stroke-width=".31146"
     id="ellipse34" />
  <ellipse
     transform="scale(-1 1)"
     cx="-10.848"
     cy="5.3527"
     rx=".43969"
     ry=".32976"
     fill="#500"
     fill-opacity=".97647"
     stroke-width=".31145"
     id="ellipse36" />
  <g
     fill="#fff"
     id="g42">
    <circle
       cx="4.9538"
       cy="5.2648"
       r=".13191"
       id="circle38" />
    <circle
       cx="10.65"
       cy="5.2648"
       r=".13191"
       id="circle40" />
  </g>
  <path
     d="m6.8808 9.6349c-0.4944-0.0084-0.57809 0.82453-0.0981 1.0377 0.6982 0.31007 0.88905 0.6899 1.0693 0.91914l0.0296 0.44475c-0.21709 0.07079-1.3706 0.34466-1.2453 0.56332 0.52524-0.04359 0.81575-0.17783 1.3638-0.17785v1e-3c0.54802 1.9e-5 0.83853 0.13427 1.3638 0.17785 0.12532-0.21866-1.0282-0.49252-1.2453-0.56332l0.0296-0.44475c0.18024-0.22923 0.37109-0.60907 1.0693-0.91914 0.48004-0.21318 0.39635-1.0461-0.0981-1.0377-0.49434 0.0084-0.7636 0.05927-1.1193 0.05928v-1e-3c-0.35574-1.2e-5 -0.62499-0.05087-1.1193-0.05928z"
     fill="#333"
     stroke-width=".31132"
     id="path44" />
</svg>
