<?xml version="1.0" encoding="UTF-8" standalone="no"?>
<svg
   height="24"
   width="24"
   version="1.1"
   id="svg290"
   sodipodi:docname="Cut_03_24.svg"
   inkscape:export-filename="Cut_03_24.png"
   inkscape:export-xdpi="96"
   inkscape:export-ydpi="96"
   inkscape:version="1.2.2 (732a01da63, 2022-12-09)"
   xmlns:inkscape="http://www.inkscape.org/namespaces/inkscape"
   xmlns:sodipodi="http://sodipodi.sourceforge.net/DTD/sodipodi-0.dtd"
   xmlns="http://www.w3.org/2000/svg"
   xmlns:svg="http://www.w3.org/2000/svg">
  <defs
     id="defs294" />
  <sodipodi:namedview
     id="namedview292"
     pagecolor="#ffffff"
     bordercolor="#000000"
     borderopacity="0.25"
     inkscape:showpageshadow="2"
     inkscape:pageopacity="0.0"
     inkscape:pagecheckerboard="0"
     inkscape:deskcolor="#d1d1d1"
     showgrid="true"
     inkscape:zoom="37.916667"
     inkscape:cx="11.894505"
     inkscape:cy="12"
     inkscape:current-layer="svg290">
    <inkscape:grid
       type="xygrid"
       id="grid958" />
  </sodipodi:namedview>
  <g
     stroke="#00aad4"
     id="g286">
    <path
       d="m7.9499957.499977c-2.700003 1.6875017.3 8.4375083 1.950002 12.187513l-1.650002 3.900004 1.200001 2.100002 2.5500033-3.750004 2.550002 3.750004 1.200002-2.100002-1.650002-3.900004c1.650002-3.7500047 4.650005-10.5000113 1.950002-12.187513l-4.050004 9.1875093z"
       fill="#c2f3ff"
       fill-rule="evenodd"
       stroke-linejoin="round"
       id="path278" />
    <g
       fill="none"
       stroke-dashoffset="1.49998"
       stroke-width="1.50077"
       id="g284">
      <ellipse
         cx="-11.912618"
         cy="17.953222"
         rx="2.464834"
         ry="3.351913"
         transform="matrix(-.97401041 -.22650325 -.27031482 .96277199 0 0)"
         id="ellipse280" />
      <ellipse
         cx="11.21757"
         cy="23.394863"
         rx="2.464834"
         ry="3.351913"
         transform="matrix(.97401041 -.22650325 .27031482 .96277199 0 0)"
         id="ellipse282" />
    </g>
  </g>
  <circle
     cx="11.999999"
     cy="12.374988"
     fill="#00aad4"
     r=".900001"
     id="circle288" />
</svg>
