<?xml version="1.0" encoding="UTF-8" standalone="no"?>
<svg
   height="32"
   width="32"
   version="1.1"
   id="svg6"
   sodipodi:docname="add_file_200.svg"
   inkscape:export-filename="add_file_200.png"
   inkscape:export-xdpi="96"
   inkscape:export-ydpi="96"
   inkscape:version="1.1.2 (0a00cf5339, 2022-02-04, custom)"
   xmlns:inkscape="http://www.inkscape.org/namespaces/inkscape"
   xmlns:sodipodi="http://sodipodi.sourceforge.net/DTD/sodipodi-0.dtd"
   xmlns="http://www.w3.org/2000/svg"
   xmlns:svg="http://www.w3.org/2000/svg"
   xmlns:rdf="http://www.w3.org/1999/02/22-rdf-syntax-ns#"
   xmlns:cc="http://creativecommons.org/ns#"
   xmlns:dc="http://purl.org/dc/elements/1.1/">
  <metadata
     id="metadata12">
    <rdf:RDF>
      <cc:Work
         rdf:about="">
        <dc:format>image/svg+xml</dc:format>
        <dc:type
           rdf:resource="http://purl.org/dc/dcmitype/StillImage" />
      </cc:Work>
    </rdf:RDF>
  </metadata>
  <defs
     id="defs10" />
  <sodipodi:namedview
     pagecolor="#ffffff"
     bordercolor="#666666"
     borderopacity="1"
     objecttolerance="10"
     gridtolerance="10"
     guidetolerance="10"
     inkscape:pageopacity="0"
     inkscape:pageshadow="2"
     inkscape:window-width="640"
     inkscape:window-height="480"
     id="namedview8"
     showgrid="true"
     inkscape:zoom="28.5"
     inkscape:cx="15.421053"
     inkscape:cy="16"
     inkscape:current-layer="svg6"
     inkscape:document-rotation="0"
     showguides="true"
     inkscape:guide-bbox="true"
     inkscape:pagecheckerboard="0"
     inkscape:snap-bbox="true"
     inkscape:bbox-nodes="true">
    <inkscape:grid
       type="xygrid"
       id="grid837" />
  </sodipodi:namedview>
  <path
     style="fill:none;fill-opacity:1;stroke:#00aad4;stroke-width:2;stroke-opacity:1"
     d="M 18,31 H 5 V 1 H 19.5 L 27,8.5 V 20"
     id="path1591"
     sodipodi:nodetypes="cccccc" />
  <path
     d="m 19,1 v 8 h 8"
     id="path2-6"
     style="fill:none;stroke:#00aad4;stroke-width:2;stroke-linecap:butt;stroke-opacity:1" />
  <g
     fill="none"
     stroke="#0088aa"
     stroke-linecap="round"
     stroke-linejoin="round"
     stroke-width="2"
     id="g22"
     style="stroke:#00aad4"
     transform="scale(2)">
    <path
       d="M 14,12 H 8"
       id="path18"
       sodipodi:nodetypes="cc"
       style="stroke:#00aad4" />
    <path
       d="M 11,15 V 9"
       id="path20"
       sodipodi:nodetypes="cc"
       style="stroke:#00aad4" />
  </g>
  <path
     style="fill:none;fill-opacity:1;stroke:#00aad4;stroke-width:2;stroke-opacity:1"
     d="m 27,28 v 3 h -1"
     id="path1-5"
     sodipodi:nodetypes="ccc" />
</svg>
