<?xml version="1.0" encoding="UTF-8" standalone="no"?>
<svg
   width="16"
   height="16"
   version="1.1"
   viewBox="0 0 16 16"
   id="svg24"
   sodipodi:docname="lazarusprojecticon 16.svg"
   inkscape:export-filename="lazarusprojecticon 16.png"
   inkscape:export-xdpi="96"
   inkscape:export-ydpi="96"
   inkscape:version="1.1.1 (3bf5ae0d25, 2021-09-20)"
   xmlns:inkscape="http://www.inkscape.org/namespaces/inkscape"
   xmlns:sodipodi="http://sodipodi.sourceforge.net/DTD/sodipodi-0.dtd"
   xmlns="http://www.w3.org/2000/svg"
   xmlns:svg="http://www.w3.org/2000/svg">
  <sodipodi:namedview
     id="namedview26"
     pagecolor="#ffffff"
     bordercolor="#666666"
     borderopacity="1.0"
     inkscape:pageshadow="2"
     inkscape:pageopacity="0.0"
     inkscape:pagecheckerboard="0"
     showgrid="false"
     inkscape:zoom="57.0625"
     inkscape:cx="7.9912377"
     inkscape:cy="8"
     inkscape:current-layer="svg24" />
  <defs
     id="defs12">
    <linearGradient
       id="linearGradient882"
       x1="112.7"
       x2="144.74"
       y1="19.467"
       y2="232.79"
       gradientTransform="matrix(.95614 0 0 .95614 -323.17 -186.01)"
       gradientUnits="userSpaceOnUse">
      <stop
         stop-color="#fcfcfd"
         offset="0"
         id="stop2" />
      <stop
         stop-color="#a6b6d9"
         offset=".49645"
         id="stop4" />
      <stop
         stop-color="#47d2f9"
         offset="1"
         id="stop6" />
    </linearGradient>
    <filter
       id="filter923"
       x="-0.036"
       y="-0.036"
       width="1.072"
       height="1.072"
       color-interpolation-filters="sRGB">
      <feGaussianBlur
         stdDeviation="3.27"
         id="feGaussianBlur9" />
    </filter>
  </defs>
  <g
     id="g20">
    <ellipse
       cx="8"
       cy="8"
       rx="8"
       ry="8"
       fill="#20345e"
       id="ellipse14" />
    <circle
       cx="8"
       cy="8"
       r="7.25"
       fill="#3371b4"
       id="circle16" />
    <circle
       transform="matrix(.064067 0 0 .064257 20.864 12.024)"
       cx="-200.79"
       cy="-63.627"
       r="109"
       fill="url(#linearGradient882)"
       filter="url(#filter923)"
       id="circle18" />
  </g>
  <path
     d="M 8.2542696,2.8355998 C 8.1475858,2.8274498 8.0255336,2.9037058 8.020102,2.9823677 8.016692,3.0314547 8.071689,3.2089458 8.141649,3.3756189 L 8.2685643,3.6785546 8.0326178,3.7632256 C 7.7741872,3.8569396 7.5911142,4.051614 7.5785879,4.2467922 c -0.00447,0.069195 0.048306,0.2798727 0.116189,0.4685141 0.096988,0.2695148 0.116368,0.4435457 0.091162,0.8090812 -0.041458,0.6011873 0.052836,0.8715021 0.3664408,1.0518067 C 8.5935041,6.8298041 9.1566073,6.7754674 9.5609006,6.4426055 9.8901412,6.1715538 9.999309,5.9722704 10.025657,5.5902507 10.053905,5.1805891 9.8684472,4.7107382 9.5358796,4.3446764 9.3977538,4.1926348 9.061934,3.79091 8.7887034,3.452806 8.5154729,3.1146914 8.2747474,2.8372082 8.2542422,2.8356504 Z M 5.1869125,3.6427969 c -0.1837467,0.0014 -0.2682832,0.2568516 -0.2645464,0.8034391 0.00184,0.2701779 -0.038769,0.5287665 -0.119768,0.754513 -0.3312303,0.9232492 -0.027648,1.8505195 0.7007027,2.1374658 0.5128718,0.2021045 1.28589,-0.0042 1.5605206,-0.4177142 C 7.2997047,6.5653229 7.2332207,6.2473978 6.7921171,5.6090317 6.682128,5.4498534 6.5728442,5.2127384 6.5490127,5.0821915 6.4425815,4.4990674 6.2268771,4.2978786 5.7482052,4.3352048 5.4687851,4.3569911 5.4938587,4.3900383 5.3656802,3.8121225 5.3373614,3.6844388 5.2919079,3.6419758 5.1869335,3.6427758 Z m 6.6191335,1.2587322 c -0.03704,-0.010826 -0.07584,-0.00926 -0.116189,0.00187 -0.1138,0.031418 -0.122326,0.064489 -0.09295,0.3650303 l 0.03219,0.3311566 -0.239525,0.069619 c -0.282073,0.080191 -0.343494,0.1724941 -0.773998,1.1722062 -0.369851,0.8589127 -0.400272,1.1673642 -0.146578,1.4469421 0.09121,0.1004975 0.300715,0.2363044 0.464756,0.3029357 0.558019,0.2266728 1.030607,0.1294311 1.451469,-0.3010515 0.507894,-0.5195211 0.5348,-1.1760977 0.09116,-2.1506204 C 12.335918,5.8310709 12.173444,5.4598407 12.115297,5.3154833 12.015382,5.0674316 11.917182,4.934011 11.806056,4.9015375 Z M 2.9542891,7.5056247 c -0.1311469,0 -0.1483257,0.029848 -0.164452,0.2653043 -0.01856,0.2708411 0.2759674,1.5009418 0.4415142,1.8420985 C 3.374435,9.9078478 3.7938439,10.347078 4.0446641,10.465382 4.8655663,10.852602 5.8951836,10.269815 5.8983414,9.4173335 5.8991692,9.1904922 5.8673468,9.1209767 5.6784791,8.9337668 5.5569848,8.8133357 5.1411653,8.506021 4.7543351,8.2507483 4.0021905,7.7543922 3.7214547,7.6749715 3.4441294,7.880076 3.3245615,7.9684893 3.3122983,7.9600578 3.2099619,7.7389607 3.128099,7.5620877 3.0660571,7.5056458 2.9543523,7.5056458 Z M 8.9388987,8.2846008 C 8.6184998,8.285351 7.5724826,8.5695471 7.3462729,8.7173676 7.0992318,8.8788091 6.8616432,9.1516923 6.7867803,9.3608705 c -0.034458,0.096299 -0.062562,0.3579145 -0.062562,0.5814083 0,0.4962302 -0.1125364,0.7698082 -0.427209,1.0367542 -0.4066406,0.344957 -0.4874929,0.66624 -0.2859989,1.134628 0.2402096,0.558355 0.6410082,0.873954 1.2101008,0.955849 0.1643783,0.02365 0.3782828,0.03587 0.4754719,0.02634 1.6514676,-0.161873 3.5711449,-0.824449 4.0236689,-1.388626 0.310041,-0.386483 0.385536,-0.997786 0.184116,-1.4921 C 11.765305,9.873837 11.590316,9.7545533 11.082118,9.6525221 10.650583,9.5658877 10.42551,9.4121545 10.200879,9.050419 9.8990592,8.5643682 9.43604,8.2834534 8.9388839,8.2846219 Z"
     stroke-width="1.0046"
     id="path22" />
</svg>
