<?xml version="1.0" encoding="UTF-8" standalone="no"?>
<svg
   height="64"
   viewBox="0 0 16.933333 16.933335"
   width="64"
   version="1.1"
   id="svg623"
   sodipodi:docname="Remove_05_64.svg"
   inkscape:version="1.2 (dc2aedaf03, 2022-05-15)"
   inkscape:export-filename="Remove_05_64.png"
   inkscape:export-xdpi="96"
   inkscape:export-ydpi="96"
   xmlns:inkscape="http://www.inkscape.org/namespaces/inkscape"
   xmlns:sodipodi="http://sodipodi.sourceforge.net/DTD/sodipodi-0.dtd"
   xmlns="http://www.w3.org/2000/svg"
   xmlns:svg="http://www.w3.org/2000/svg">
  <defs
     id="defs627">
    <radialGradient
       id="a"
       cx="12.1"
       cy="10.900001"
       gradientTransform="matrix(0,0.49887766,-0.49887761,0,6.8809484,-4.5932378)"
       gradientUnits="userSpaceOnUse"
       r="4.5">
      <stop
         offset="0"
         stop-color="#f55"
         id="stop788" />
      <stop
         offset="1"
         stop-color="#a00"
         id="stop790" />
    </radialGradient>
    <radialGradient
       id="a-6"
       cx="12.1"
       cy="10.900001"
       gradientTransform="matrix(0,0.49887766,-0.49887761,0,6.8809484,-4.5932378)"
       gradientUnits="userSpaceOnUse"
       r="4.5">
      <stop
         offset="0"
         stop-color="#f55"
         id="stop788-4" />
      <stop
         offset="1"
         stop-color="#a00"
         id="stop790-0" />
    </radialGradient>
  </defs>
  <sodipodi:namedview
     id="namedview625"
     pagecolor="#ffffff"
     bordercolor="#666666"
     borderopacity="1.0"
     inkscape:showpageshadow="2"
     inkscape:pageopacity="0.0"
     inkscape:pagecheckerboard="0"
     inkscape:deskcolor="#d1d1d1"
     showgrid="true"
     inkscape:zoom="14.34375"
     inkscape:cx="32"
     inkscape:cy="32"
     inkscape:current-layer="g1343">
    <inkscape:grid
       type="xygrid"
       id="grid1262" />
  </sodipodi:namedview>
  <g
     id="g1343"
     transform="scale(3.9999995)">
    <g
       id="g2754">
      <circle
         cx="2.1166668"
         cy="2.116667"
         style="fill:url(#a-6);stroke:#ffd5d5;stroke-width:0.264584;stroke-linecap:round;stroke-linejoin:round;stroke-dasharray:none;stroke-dashoffset:1.49998"
         transform="matrix(0,1,1,0,0,0)"
         id="ellipse793"
         r="1.8520833" />
      <path
         d="M 2.778125,2.1166667 H 1.4552083"
         id="path3550"
         style="fill:none;stroke:#ffffff;stroke-width:0.529167;stroke-linecap:round;stroke-dasharray:none"
         sodipodi:nodetypes="cc" />
    </g>
  </g>
</svg>
