<?xml version="1.0" encoding="UTF-8" standalone="no"?>
<svg
   height="48"
   width="48"
   version="1.1"
   id="svg20"
   sodipodi:docname="Database_02_48.svg"
   inkscape:export-filename="Database_02_48.png"
   inkscape:export-xdpi="96"
   inkscape:export-ydpi="96"
   inkscape:version="1.2-beta (1b65182ce9, 2022-04-05)"
   xmlns:inkscape="http://www.inkscape.org/namespaces/inkscape"
   xmlns:sodipodi="http://sodipodi.sourceforge.net/DTD/sodipodi-0.dtd"
   xmlns:xlink="http://www.w3.org/1999/xlink"
   xmlns="http://www.w3.org/2000/svg"
   xmlns:svg="http://www.w3.org/2000/svg">
  <defs
     id="defs24">
    <linearGradient
       inkscape:collect="always"
       xlink:href="#b"
       id="linearGradient1246"
       gradientUnits="userSpaceOnUse"
       x1="-37.744652"
       y1="21.3936"
       x2="-24.244652"
       y2="21.3936"
       gradientTransform="translate(42.244654,-10.893583)" />
    <linearGradient
       id="b">
      <stop
         offset="0"
         stop-color="#4276c4"
         id="stop160" />
      <stop
         offset=".34375"
         stop-color="#80b3ff"
         id="stop162" />
      <stop
         offset="1"
         stop-color="#04a"
         id="stop164" />
    </linearGradient>
    <linearGradient
       id="d"
       gradientUnits="userSpaceOnUse"
       x1="-37.744652"
       x2="-24.244652"
       xlink:href="#b"
       y1="16.8936"
       y2="16.8936"
       gradientTransform="translate(42.244654,-10.893583)" />
    <linearGradient
       id="c"
       gradientUnits="userSpaceOnUse"
       x1="-37.744652"
       x2="-24.244652"
       xlink:href="#b"
       y1="12.3938"
       y2="12.3938"
       gradientTransform="translate(42.244654,-10.893583)" />
    <linearGradient
       inkscape:collect="always"
       xlink:href="#b"
       id="linearGradient2752"
       gradientUnits="userSpaceOnUse"
       gradientTransform="translate(42.244654,-10.893583)"
       x1="-37.744652"
       y1="21.3936"
       x2="-24.244652"
       y2="21.3936" />
    <linearGradient
       id="a"
       gradientUnits="userSpaceOnUse"
       x1="14.15625"
       x2="8.84375"
       y1="14.15625"
       y2="8.84375"
       gradientTransform="matrix(2.7027026,0,0,2.7027026,4.4189191,4.4189191)">
      <stop
         offset="0"
         stop-color="#009600"
         id="stop2" />
      <stop
         offset="1"
         stop-color="#6edb39"
         id="stop4" />
    </linearGradient>
  </defs>
  <sodipodi:namedview
     id="namedview22"
     pagecolor="#ffffff"
     bordercolor="#666666"
     borderopacity="1.0"
     inkscape:pageshadow="2"
     inkscape:pageopacity="0.0"
     inkscape:pagecheckerboard="0"
     inkscape:deskcolor="#d1d1d1"
     showgrid="true"
     inkscape:zoom="19.125"
     inkscape:cx="19.137255"
     inkscape:cy="24"
     inkscape:current-layer="svg20">
    <inkscape:grid
       type="xygrid"
       id="grid1108" />
  </sodipodi:namedview>
  <g
     id="g1656"
     transform="matrix(2,0,0,2,-3,0)">
    <ellipse
       cx="12"
       cy="18.75"
       rx="7.5"
       ry="2.25"
       stroke="url(#a)"
       stroke-width="3"
       id="ellipse169"
       style="fill:none;fill-rule:evenodd;stroke:url(#linearGradient2752);stroke-linecap:round;stroke-linejoin:round" />
    <ellipse
       cx="12"
       cy="15.812256"
       rx="8.2414637"
       ry="2.937722"
       stroke="#ffffff"
       stroke-width="1.5"
       id="ellipse171"
       style="fill:none;fill-rule:evenodd;stroke-linecap:round;stroke-linejoin:round" />
    <ellipse
       cx="12"
       cy="14.25"
       rx="7.5"
       ry="2.25"
       stroke="url(#d)"
       stroke-width="3"
       id="ellipse173"
       style="fill:none;fill-rule:evenodd;stroke:url(#d);stroke-linecap:round;stroke-linejoin:round" />
    <ellipse
       cx="12"
       cy="11.312256"
       rx="8.2414637"
       ry="2.937722"
       stroke="#ffffff"
       stroke-width="1.5"
       id="ellipse175"
       style="fill:none;fill-rule:evenodd;stroke-linecap:round;stroke-linejoin:round" />
    <ellipse
       cx="12"
       cy="9.75"
       rx="7.5"
       ry="2.25"
       stroke="url(#c)"
       stroke-width="3"
       id="ellipse177"
       style="fill:none;fill-rule:evenodd;stroke:url(#c);stroke-linecap:round;stroke-linejoin:round" />
    <ellipse
       cx="12"
       cy="6.8121953"
       rx="8.2414637"
       ry="2.937722"
       stroke="#ffffff"
       stroke-width="1.5"
       id="ellipse179"
       style="fill:none;fill-rule:evenodd;stroke-linecap:round;stroke-linejoin:round" />
    <ellipse
       cx="12"
       cy="5.2500005"
       fill="#80b3ff"
       rx="8.25"
       ry="3"
       stroke="url(#a)"
       stroke-width="1.5"
       id="ellipse183"
       style="fill-rule:evenodd;stroke:url(#linearGradient1246);stroke-linecap:round;stroke-linejoin:round" />
  </g>
  <g
     id="g3828">
    <circle
       cx="35.5"
       cy="35.5"
       fill="url(#a)"
       r="11.486486"
       stroke-dashoffset="1.49998"
       stroke-linejoin="round"
       stroke-width="0.5"
       transform="matrix(0,1,1,0,0,0)"
       id="circle7"
       style="fill:url(#a);stroke:#ffffff;stroke-width:2.02703;stroke-linecap:round;stroke-dasharray:none" />
    <g
       id="g3822">
      <path
         d="m 35.5,29.5 v 12"
         id="path9"
         style="fill:none;stroke:#ffffff;stroke-width:3;stroke-linecap:round;stroke-dasharray:none"
         sodipodi:nodetypes="cc" />
      <path
         d="m 41.5,35.5 h -12"
         id="path11"
         style="fill:none;stroke:#ffffff;stroke-width:3;stroke-linecap:round;stroke-dasharray:none"
         sodipodi:nodetypes="cc" />
    </g>
  </g>
</svg>
