<?xml version="1.0" encoding="UTF-8" standalone="no"?>
<svg
   height="32"
   width="32"
   version="1.1"
   id="svg323"
   sodipodi:docname="menu_uncomment_200.svg"
   inkscape:export-filename="menu_uncomment_200.png"
   inkscape:export-xdpi="96"
   inkscape:export-ydpi="96"
   inkscape:version="1.2.1 (9c6d41e410, 2022-07-14)"
   xmlns:inkscape="http://www.inkscape.org/namespaces/inkscape"
   xmlns:sodipodi="http://sodipodi.sourceforge.net/DTD/sodipodi-0.dtd"
   xmlns="http://www.w3.org/2000/svg"
   xmlns:svg="http://www.w3.org/2000/svg">
  <defs
     id="defs327" />
  <sodipodi:namedview
     id="namedview325"
     pagecolor="#ffffff"
     bordercolor="#666666"
     borderopacity="1.0"
     inkscape:showpageshadow="2"
     inkscape:pageopacity="0.0"
     inkscape:pagecheckerboard="0"
     inkscape:deskcolor="#d1d1d1"
     showgrid="true"
     inkscape:zoom="28.6875"
     inkscape:cx="15.982571"
     inkscape:cy="16"
     inkscape:current-layer="svg323">
    <inkscape:grid
       type="xygrid"
       id="grid446" />
  </sodipodi:namedview>
  <radialGradient
     id="a"
     cx="12.1"
     cy="10.900001"
     gradientTransform="matrix(0 2.2087543 -2.2087541 .00000004 44.093604 -6.707745)"
     gradientUnits="userSpaceOnUse"
     r="4.5">
    <stop
       offset="0"
       stop-color="#f55"
       id="stop300" />
    <stop
       offset="1"
       stop-color="#a00"
       id="stop302" />
  </radialGradient>
  <g
     stroke-linecap="round"
     id="g321">
    <g
       fill="none"
       stroke="#2a7fff"
       transform="matrix(2 0 0 2 0 46)"
       id="g309">
      <path
         d="m4-20.5-3.5 9"
         id="path305" />
      <path
         d="m9-20.5-3.5 9"
         id="path307" />
    </g>
    <g
       stroke="#fff"
       id="g319">
      <circle
         cx="23"
         cy="23"
         fill="url(#a)"
         r="8.2"
         stroke-dashoffset="1.49998"
         stroke-linejoin="round"
         stroke-width="1.6"
         transform="matrix(0 1 1 0 0 0)"
         id="circle311" />
      <g
         fill="none"
         stroke-width="1.66938"
         transform="matrix(.95844079 0 0 .95844079 .476641 .476641)"
         id="g317">
        <path
           d="m26.5 20.5-6 6"
           id="path313" />
        <path
           d="m26.5 26.5-6-6"
           id="path315" />
      </g>
    </g>
  </g>
</svg>
