<svg width="24" height="24" version="1.1" xmlns="http://www.w3.org/2000/svg">
 <defs>
  <linearGradient id="a" x1="33" x2="36" y1="1037.3622" y2="1037.3622" gradientTransform="matrix(.99929544 .57691161 -.50985131 .88303956 514.18416 -931.37082)" gradientUnits="userSpaceOnUse">
   <stop stop-color="#999" offset="0"/>
   <stop stop-color="#fff" offset=".49999997"/>
   <stop stop-color="#999" offset="1"/>
  </linearGradient>
  <linearGradient id="b" x1="33" x2="36" y1="1035.3622" y2="1035.3622" gradientTransform="matrix(.99929544 .57691161 -.50985131 .88303956 514.18416 -931.37082)" gradientUnits="userSpaceOnUse">
   <stop stop-color="#a00" offset="0"/>
   <stop stop-color="#f00" offset=".51070523"/>
   <stop stop-color="#a00" offset="1"/>
  </linearGradient>
  <linearGradient id="c" x1="33" x2="36" y1="1041.8622" y2="1041.8622" gradientTransform="matrix(.99929544 .57691161 -.534757 .9261751 540.05839 -976.18384)" gradientUnits="userSpaceOnUse">
   <stop stop-color="#a05a2c" offset="0"/>
   <stop stop-color="#ff0" offset=".26457807"/>
   <stop stop-color="#ff0" offset=".75078517"/>
   <stop stop-color="#a05a2c" offset="1"/>
  </linearGradient>
 </defs>
 <rect transform="matrix(.82404192 .56652883 -.82404192 .56652883 0 0)" x="12.046404" y="-2.5159338" width="15.622624" height="15.622624" ry="1.8140457" fill="#dbe2e3"/>
 <path d="m20.099972 10.96874c-0.815088 2.153589-1.930202 3.979018-3.945482 5.531206 0.195471 0.664062 0.820108 2.391562 0.957773 3.086711l6.266581-4.308678c0.828146-0.569352 0.828269-1.486876 0-2.056049z" fill="#44aa00" stop-color="#000000" stroke-linecap="round" stroke-linejoin="round"/>
 <path d="m15.06149 20.994952c-0.341808-2.213572-0.998884-4.247839-1.939447-6.06502-3.8068817 1.500839-8.1544963 0.354879-12.240192-1.888471l-0.2607412 0.180469c-0.8281467 0.569351-0.8281467 1.486697 0 2.056049l9.884731 6.793337c0.828147 0.569351 2.160124 0.569351 2.988271 0z" fill="#44aa00" stop-color="#000000" stroke-linecap="round" stroke-linejoin="round"/>
 <path d="m3.1552809 11.478478c3.1073974 1.480852 6.1229234 2.068538 8.6601261 1.308395-1.201733-1.672827-2.6902137-3.0918906-4.4267427-4.2152196z" fill="#44aa00" stop-color="#000000" stroke-linecap="round" stroke-linejoin="round"/>
 <path d="m12.580053 9.9960624 1.734369-3.0029191-0.82031-0.565428c-0.828147-0.569351-2.160124-0.569351-2.988271 0l-0.9960897 0.688474c1.1303857 0.840456 2.1551607 1.8062591 3.0703017 2.8798731z" fill="#44aa00" stop-color="#000000" stroke-linecap="round" stroke-linejoin="round"/>
 <path d="m18.63605 3.0485356 2.997886 1.7307345-1.15392 1.9985362-2.997886-1.7307351z" fill="url(#a)" fill-rule="evenodd" stroke-width="1.06377"/>
 <path d="m19.789969 1.05 2.997883 1.7307398-1.159944 2.0089694-2.991858-1.7411734z" fill="url(#b)" fill-rule="evenodd" stroke-width="1.06377"/>
 <path d="m17.48213 5.0470714 2.997886 1.730735-3.461756 5.9956056-2.997886-1.730734z" fill="url(#c)" fill-rule="evenodd" stroke-width="1.06377"/>
 <path d="m14.020374 11.042678-0.383177 2.443499 1.456401 0.840808 1.924662-1.553573z" fill="#d38d5f" fill-rule="evenodd" stroke-width="1.01059"/>
 <path d="m14.576566 14.69467a0.57692171 0.57694933 75 0 1-0.788128 0.211178 0.57692171 0.57694933 75 0 1-0.211168-0.788088 0.57692171 0.57694933 75 0 1 0.788128-0.211178 0.57692171 0.57694933 75 0 1 0.211168 0.788088zm-0.939369-1.208493 1.456401 0.840808-0.654296 0.528142-0.932365-0.538273z" fill="#333333" stroke-dashoffset="1.49998" stroke-linecap="round" stroke-linejoin="round" stroke-width="1.33373"/>
</svg>
