<?xml version="1.0" encoding="UTF-8" standalone="no"?>
<svg
   height="36"
   viewBox="0 0 9.5249997 9.5250005"
   width="36"
   version="1.1"
   id="svg275"
   sodipodi:docname="Health_01_36.svg"
   inkscape:export-filename="Health_01_36.png"
   inkscape:export-xdpi="96"
   inkscape:export-ydpi="96"
   inkscape:version="1.2.1 (9c6d41e410, 2022-07-14)"
   xmlns:inkscape="http://www.inkscape.org/namespaces/inkscape"
   xmlns:sodipodi="http://sodipodi.sourceforge.net/DTD/sodipodi-0.dtd"
   xmlns="http://www.w3.org/2000/svg"
   xmlns:svg="http://www.w3.org/2000/svg">
  <defs
     id="defs279" />
  <sodipodi:namedview
     id="namedview277"
     pagecolor="#ffffff"
     bordercolor="#666666"
     borderopacity="1.0"
     inkscape:showpageshadow="2"
     inkscape:pageopacity="0.0"
     inkscape:pagecheckerboard="0"
     inkscape:deskcolor="#d1d1d1"
     showgrid="true"
     inkscape:zoom="25.5"
     inkscape:cx="17.980392"
     inkscape:cy="18"
     inkscape:current-layer="svg275">
    <inkscape:grid
       type="xygrid"
       id="grid922" />
  </sodipodi:namedview>
  <radialGradient
     id="a"
     cx="1.925345"
     cy="1.585938"
     gradientTransform="matrix(.58408303 2.4644621 -3.4618551 .82805261 7.775053 -2.329545)"
     gradientUnits="userSpaceOnUse"
     r="1.852075">
    <stop
       offset="0"
       stop-color="#faa"
       id="stop268" />
    <stop
       offset="1"
       stop-color="#f00"
       id="stop270" />
  </radialGradient>
  <path
     d="m2.6120593.661463c-2.1487726.00531-3.7191963 3.946201 2.017954 7.9091762 7.5706717-5.2294932 2.4159413-10.4195166 0-6.5802703-.5851107-.9298175-1.3312328-1.3306033-2.017954-1.3289059z"
     fill="url(#a)"
     stroke="#d40000"
     stroke-width=".264582"
     id="path273" />
</svg>
