<?xml version="1.0" encoding="UTF-8" standalone="no"?>
<svg
   height="36"
   width="36"
   version="1.1"
   id="svg18"
   sodipodi:docname="Add_02_36.svg"
   inkscape:export-filename="Add_02_36.png"
   inkscape:export-xdpi="96"
   inkscape:export-ydpi="96"
   inkscape:version="1.2-beta (1b65182ce9, 2022-04-05)"
   xmlns:inkscape="http://www.inkscape.org/namespaces/inkscape"
   xmlns:sodipodi="http://sodipodi.sourceforge.net/DTD/sodipodi-0.dtd"
   xmlns="http://www.w3.org/2000/svg"
   xmlns:svg="http://www.w3.org/2000/svg">
  <defs
     id="defs22" />
  <sodipodi:namedview
     id="namedview20"
     pagecolor="#ffffff"
     bordercolor="#666666"
     borderopacity="1.0"
     inkscape:pageshadow="2"
     inkscape:pageopacity="0.0"
     inkscape:pagecheckerboard="0"
     inkscape:deskcolor="#d1d1d1"
     showgrid="true"
     inkscape:zoom="25.5"
     inkscape:cx="18"
     inkscape:cy="18"
     inkscape:current-layer="svg18">
    <inkscape:grid
       type="xygrid"
       id="grid147"
       originx="0"
       originy="0" />
  </sodipodi:namedview>
  <path
     d="M 24,31.875 H 1.125 V 4.125 h 33.75 V 22"
     stroke-width="2.25"
     id="path2"
     style="fill:none;stroke:#00aad4"
     sodipodi:nodetypes="ccccc" />
  <path
     d="m 34.875,30 v 1.875 H 32"
     stroke-width="2.25"
     id="path4"
     style="fill:none;stroke:#00aad4"
     sodipodi:nodetypes="ccc" />
  <g
     id="g900">
    <path
       d="m 34.000001,26.000001 h -12"
       id="path6"
       style="fill:none;stroke:#00aad4;stroke-width:4;stroke-linecap:round;stroke-linejoin:round;stroke-dasharray:none" />
    <path
       d="M 28,32 V 20"
       id="path8"
       style="fill:none;stroke:#00aad4;stroke-width:4;stroke-linecap:round;stroke-linejoin:round;stroke-dasharray:none" />
  </g>
  <path
     d="M 1.125,28.125 11.25,18 15.75,22.5 27,11.25 l 7.875,7.875"
     stroke-width="1.6875"
     id="path12"
     style="fill:none;stroke:#00aad4" />
  <path
     d="m 12,6.1875 c -0.31066,0 -0.5625,0.2518398 -0.5625,0.5625 v 1.7446289 c -0.35746,0.073093 -0.689512,0.2132302 -0.984375,0.4086913 L 9.0249015,7.4750976 C 8.9185328,7.3698696 8.7746205,7.3113561 8.625,7.3124991 8.475375,7.3113543 8.3314672,7.3698673 8.2250985,7.4750976 c -0.2225475,0.2201535 -0.2225475,0.5796511 0,0.7998048 L 9.6533198,9.7031241 C 9.4578577,9.9979863 9.3177233,10.33004 9.2446298,10.687499 H 7.5 c -0.3106598,0 -0.5625,0.25184 -0.5625,0.5625 0,0.31066 0.2518402,0.5625 0.5625,0.5625 h 1.7446298 c 0.073094,0.357459 0.213228,0.689513 0.40869,0.984375 l -1.4282213,1.428224 c -0.2225475,0.220153 -0.2225475,0.579651 0,0.799805 0.2201625,0.222557 0.5796495,0.222557 0.799803,0 L 10.453125,13.59668 c 0.294863,0.195462 0.626915,0.335597 0.984375,0.408691 V 15.75 c 0,0.31066 0.25184,0.5625 0.5625,0.5625 0.31066,0 0.5625,-0.25184 0.5625,-0.5625 v -1.744629 c 0.35746,-0.0731 0.689513,-0.21323 0.984375,-0.408691 l 1.428224,1.428223 c 0.220162,0.222557 0.579649,0.222557 0.799802,0 0.222548,-0.220154 0.222548,-0.579652 0,-0.799805 l -1.42822,-1.428223 c 0.195462,-0.294862 0.335597,-0.626916 0.40869,-0.984375 H 16.5 c 0.31066,0 0.5625,-0.25184 0.5625,-0.5625 0,-0.31066 -0.25184,-0.5625 -0.5625,-0.5625 h -1.744629 c -0.0731,-0.357459 -0.213228,-0.6895128 -0.40869,-0.984375 l 1.42822,-1.4282226 c 0.222548,-0.2201535 0.222548,-0.5796512 0,-0.7998048 C 15.668537,7.3698696 15.524621,7.3113561 15.375,7.3124991 15.225375,7.3113543 15.081468,7.3698681 14.975099,7.4750976 L 13.546875,8.9033202 C 13.252013,8.7078582 12.91996,8.5677234 12.5625,8.4946289 V 6.75 C 12.5625,6.4393398 12.31066,6.1875 12,6.1875 Z M 10.321289,9 C 10.263849,9.043032 10.208253,9.089046 10.154298,9.1362315 10.208455,9.088797 10.263631,9.043236 10.321289,9 Z m 3.357423,0 c 0.05765,0.043236 0.112832,0.088795 0.16699,0.1362315 C 13.791747,9.089046 13.736151,9.043032 13.678712,9 Z M 9.8862308,9.4042968 c -0.047185,0.053958 -0.093199,0.109551 -0.13623,0.1669928 0.043236,-0.057655 0.088795,-0.1128345 0.13623,-0.1669928 z m 4.2275382,0 c 0.04744,0.054158 0.09299,0.1093365 0.13623,0.1669928 -0.04304,-0.057443 -0.08905,-0.1130355 -0.13623,-0.1669928 z m -2.201658,0.158202 c 0.02894,-0.00145 0.05856,0 0.08789,0 0.938642,0 1.6875,0.7488582 1.6875,1.6875002 0,0.938642 -0.748858,1.6875 -1.6875,1.6875 -0.938641,0 -1.6875,-0.748858 -1.6875,-1.6875 0,-0.90931 0.70232,-1.642688 1.59961,-1.6875002 z M 9.75,12.928711 c 0.043032,0.05744 0.089046,0.113036 0.1362315,0.166993 C 9.8387963,13.041546 9.793236,12.986367 9.75,12.928711 Z m 4.5,0 c -0.04323,0.05766 -0.08879,0.112835 -0.13623,0.166993 0.04718,-0.05396 0.0932,-0.109551 0.13623,-0.166993 z m -4.095702,0.435058 c 0.05395,0.04719 0.109551,0.0932 0.166991,0.13623 -0.05766,-0.04324 -0.112834,-0.0888 -0.166991,-0.13623 z m 3.691404,0 c -0.05416,0.04744 -0.109335,0.09299 -0.16699,0.13623 0.05744,-0.04303 0.113035,-0.08905 0.16699,-0.13623 z"
     fill="#00aad4"
     stroke-linecap="round"
     stroke-width="2.25"
     id="path16" />
</svg>
