<?xml version="1.0" encoding="UTF-8" standalone="no"?>
<svg
   height="16"
   width="16"
   version="1.1"
   id="svg16"
   sodipodi:docname="Stop_01_16.svg"
   xml:space="preserve"
   inkscape:version="1.2-beta (1b65182ce9, 2022-04-05)"
   inkscape:export-filename="Stop_01_16.png"
   inkscape:export-xdpi="96"
   inkscape:export-ydpi="96"
   xmlns:inkscape="http://www.inkscape.org/namespaces/inkscape"
   xmlns:sodipodi="http://sodipodi.sourceforge.net/DTD/sodipodi-0.dtd"
   xmlns="http://www.w3.org/2000/svg"
   xmlns:svg="http://www.w3.org/2000/svg"><defs
     id="defs20" /><sodipodi:namedview
     id="namedview18"
     pagecolor="#ffffff"
     bordercolor="#666666"
     borderopacity="1.0"
     inkscape:pageshadow="2"
     inkscape:pageopacity="0.0"
     inkscape:pagecheckerboard="0"
     inkscape:deskcolor="#d1d1d1"
     showgrid="true"
     inkscape:zoom="57.375"
     inkscape:cx="7.1023965"
     inkscape:cy="8"
     inkscape:current-layer="svg16"
     showguides="true"><inkscape:grid
       type="xygrid"
       id="grid294" /></sodipodi:namedview><g
     id="g1129"><rect
       style="fill:#00aad4;stroke:none;stroke-width:1.2;stroke-linecap:round;stroke-linejoin:round;stroke-dasharray:none;stroke-dashoffset:1.49998"
       id="rect438"
       width="4.9999995"
       height="4.9999995"
       x="5.5000005"
       y="5.5" /><circle
       style="fill:none;stroke:#00aad4;stroke-linecap:round;stroke-linejoin:round;stroke-dashoffset:1.49998"
       id="path355"
       cx="8"
       cy="8"
       r="7" /></g></svg>
