<?xml version="1.0" encoding="UTF-8" standalone="no"?>
<svg
   width="16"
   height="16"
   version="1.0"
   id="svg34"
   inkscape:export-xdpi="96"
   inkscape:export-ydpi="96"
   inkscape:version="1.2.1 (9c6d41e410, 2022-07-14)"
   sodipodi:docname="item_package.svg"
   inkscape:export-filename="item_package.png"
   xmlns:inkscape="http://www.inkscape.org/namespaces/inkscape"
   xmlns:sodipodi="http://sodipodi.sourceforge.net/DTD/sodipodi-0.dtd"
   xmlns:xlink="http://www.w3.org/1999/xlink"
   xmlns="http://www.w3.org/2000/svg"
   xmlns:svg="http://www.w3.org/2000/svg">
  <sodipodi:namedview
     id="namedview36"
     pagecolor="#ffffff"
     bordercolor="#666666"
     borderopacity="1.0"
     inkscape:showpageshadow="2"
     inkscape:pageopacity="0.0"
     inkscape:pagecheckerboard="0"
     inkscape:deskcolor="#d1d1d1"
     showgrid="true"
     inkscape:zoom="57.375"
     inkscape:cx="7.4858388"
     inkscape:cy="8"
     inkscape:current-layer="svg34">
    <inkscape:grid
       type="xygrid"
       id="grid1160" />
  </sodipodi:namedview>
  <defs
     id="defs14">
    <linearGradient
       id="linearGradient933">
      <stop
         stop-color="#ffe991"
         offset="0"
         id="stop2" />
      <stop
         stop-color="#f5c400"
         offset="1"
         id="stop4" />
    </linearGradient>
    <linearGradient
       id="linearGradient1347"
       x1="8.5"
       x2="16"
       y1="8"
       y2="11"
       gradientTransform="translate(-.5)"
       gradientUnits="userSpaceOnUse"
       xlink:href="#linearGradient933" />
    <linearGradient
       id="linearGradient1351"
       x1="8.5002"
       x2="16"
       y1="7.9959"
       y2="10.996"
       gradientTransform="matrix(-1 0 0 1 16.5 .004112)"
       gradientUnits="userSpaceOnUse"
       xlink:href="#linearGradient933" />
    <linearGradient
       id="linearGradient1355"
       x1="1.0002"
       x2="16"
       y1="4.4959"
       y2="4.4959"
       gradientTransform="matrix(-1 0 0 1 16.5 .004112)"
       gradientUnits="userSpaceOnUse">
      <stop
         stop-color="#ffe478"
         offset="0"
         id="stop9" />
      <stop
         stop-color="#fff2c0"
         offset="1"
         id="stop11" />
    </linearGradient>
  </defs>
  <g
     id="g259">
    <g
       stroke="#ccaa00"
       stroke-linejoin="round"
       stroke-width=".5"
       id="g22">
      <path
         d="m8 8 7.5-3.5v6.5l-7.5 4z"
         fill="url(#linearGradient1347)"
         id="path16" />
      <path
         d="m8.0002 8.0041-7.5002-3.5041v6.5l7.5002 4.0041z"
         fill="url(#linearGradient1351)"
         id="path18" />
      <path
         d="m8 1-7.5 3.5 7.5002 3.5041 7.4998-3.5041z"
         fill="url(#linearGradient1355)"
         id="path20" />
    </g>
    <g
       fill="none"
       stroke="#5f8dd3"
       stroke-linecap="round"
       stroke-width=".75"
       id="g32">
      <path
         d="m5 2.5 6.7 3.6"
         id="path24" />
      <path
         d="m4.3 6.1 6.7-3.6"
         id="path26" />
      <path
         d="m4.3 6.3v6.5"
         id="path28" />
      <path
         d="m11.7 6.3v6.5"
         id="path30" />
    </g>
  </g>
</svg>
