<?xml version="1.0" encoding="UTF-8" standalone="no"?>
<svg
   width="36"
   height="36"
   version="1.1"
   viewBox="0 0 36 36"
   id="svg8"
   sodipodi:docname="tcheckgroup_150.svg"
   inkscape:export-filename="tcheckgroup_150.png"
   inkscape:export-xdpi="96"
   inkscape:export-ydpi="96"
   inkscape:version="1.3.2 (091e20e, 2023-11-25, custom)"
   xmlns:inkscape="http://www.inkscape.org/namespaces/inkscape"
   xmlns:sodipodi="http://sodipodi.sourceforge.net/DTD/sodipodi-0.dtd"
   xmlns="http://www.w3.org/2000/svg"
   xmlns:svg="http://www.w3.org/2000/svg">
  <defs
     id="defs8" />
  <sodipodi:namedview
     id="namedview8"
     pagecolor="#ffffff"
     bordercolor="#000000"
     borderopacity="0.25"
     inkscape:showpageshadow="2"
     inkscape:pageopacity="0.0"
     inkscape:pagecheckerboard="0"
     inkscape:deskcolor="#d1d1d1"
     showgrid="true"
     inkscape:current-layer="svg8">
    <inkscape:grid
       id="grid8"
       units="px"
       originx="0"
       originy="0"
       spacingx="0.5"
       spacingy="0.5"
       empcolor="#0099e5"
       empopacity="0.30196078"
       color="#0099e5"
       opacity="0.14901961"
       empspacing="2"
       dotted="false"
       gridanglex="30"
       gridanglez="30"
       visible="true" />
  </sodipodi:namedview>
  <rect
     x="5.5"
     y="6.5"
     width="25"
     height="25"
     fill="#f9f9f9"
     stroke="#2a7efe"
     stroke-width="1"
     style="paint-order:normal"
     id="rect1" />
  <rect
     x="8"
     y="6"
     width="13"
     height="3"
     fill="#f9f9f9"
     style="paint-order:normal"
     id="rect2" />
  <path
     d="m10.5 6.5h8"
     fill="#2a7efe"
     stroke="#2a7efe"
     stroke-linecap="round"
     stroke-width="3"
     id="path2" />
  <path
     d="M 15,13.250025 H 27"
     fill="#b3b3b3"
     stroke="#b3b3b3"
     stroke-width="1.5"
     id="path3" />
  <path
     d="M 15,25.250025 H 27"
     fill="#b3b3b3"
     stroke="#b3b3b3"
     stroke-width="1.5"
     id="path4" />
  <path
     d="M 15,19.250025 H 25"
     fill="#b3b3b3"
     stroke="#b3b3b3"
     stroke-width="1.5"
     id="path5" />
  <path
     d="M 8.25,13.25 10,15 13.75,11.25"
     fill="none"
     stroke="#4d4d4d"
     stroke-width="1.0"
     id="path6" />
  <path
     d="m8.25 25.251183 1.75 1.749183 3.749874-3.749874"
     fill="none"
     stroke="#4d4d4d"
     stroke-width="1.0"
     id="path7" />
  <path
     d="m8.25 19.251385 1.75 1.749183 3.749874-3.749874"
     fill="none"
     stroke="#4d4d4d"
     stroke-width="1.0"
     id="path8" />
</svg>
