<svg width="36" height="36" version="1.1" xmlns="http://www.w3.org/2000/svg">
 <rect x="2.55" y="2.55" width="30.9" height="30.9" rx="2.5" fill="#f0fcff" stroke="#00aad4" stroke-linejoin="round" stroke-width="1.1"/>
 <path d="m3 3h30v4h-30z" fill="#00aad4"/>
 <path d="m10 15.499999 2.61e-4 2.25c0 1.125 2.95045 2.250001 7.999738 2.250001 5.049293 0 8.000131-1.125001 8.000001-2.250001l-2.6e-4 -2.25c0 1.125-2.950448 2.25-7.999741 2.25-5.049288 0-7.999738-1.125-7.999999-2.25z" fill="#2a7fff" stroke-linecap="round" stroke-linejoin="round" stroke-miterlimit="5.6" stroke-width="3.02369"/>
 <ellipse cx="18" cy="13.249999" rx="7.9997401" ry="2.2499981" fill="#2a7fff" stroke-linecap="round" stroke-width="1.8142"/>
 <path d="m10 20 2.61e-4 2.25c0 1.125 2.95045 2.25 7.999738 2.25 5.049293 0 8.000131-1.125 8.000001-2.25l-2.6e-4 -2.25c0 1.124999-2.950448 2.25-7.999741 2.25-5.049288 0-7.999738-1.125001-7.999999-2.25z" fill="#2a7fff" stroke-linecap="round" stroke-linejoin="round" stroke-miterlimit="5.6" stroke-width="3.02369"/>
 <path d="m10 24.5 2.61e-4 2.25c0 1.125 2.95045 2.25 7.999738 2.25 5.049293 0 8.000131-1.125 8.000001-2.25l-2.6e-4 -2.25c0 1.125-2.950448 2.25-7.999741 2.25-5.049288 0-7.999738-1.125-7.999999-2.25z" fill="#2a7fff" stroke-linecap="round" stroke-linejoin="round" stroke-miterlimit="5.6" stroke-width="3.02369"/>
</svg>
