<?xml version="1.0" encoding="UTF-8" standalone="no"?>
<svg
   height="36"
   width="36"
   version="1.1"
   id="svg565"
   sodipodi:docname="Database_05_36.svg"
   inkscape:export-filename="Database_05_36.png"
   inkscape:export-xdpi="96"
   inkscape:export-ydpi="96"
   inkscape:version="1.2-beta (1b65182ce9, 2022-04-05)"
   xmlns:inkscape="http://www.inkscape.org/namespaces/inkscape"
   xmlns:sodipodi="http://sodipodi.sourceforge.net/DTD/sodipodi-0.dtd"
   xmlns:xlink="http://www.w3.org/1999/xlink"
   xmlns="http://www.w3.org/2000/svg"
   xmlns:svg="http://www.w3.org/2000/svg">
  <defs
     id="defs569" />
  <sodipodi:namedview
     id="namedview567"
     pagecolor="#ffffff"
     bordercolor="#666666"
     borderopacity="1.0"
     inkscape:pageshadow="2"
     inkscape:pageopacity="0.0"
     inkscape:pagecheckerboard="0"
     inkscape:deskcolor="#d1d1d1"
     showgrid="true"
     inkscape:zoom="25.5"
     inkscape:cx="18"
     inkscape:cy="18"
     inkscape:current-layer="svg565">
    <inkscape:grid
       type="xygrid"
       id="grid1196" />
  </sodipodi:namedview>
  <linearGradient
     id="a"
     gradientUnits="userSpaceOnUse"
     x1="4.500002"
     x2="18.000002"
     xlink:href="#b"
     y1="10.500017"
     y2="10.500017" />
  <linearGradient
     id="b">
    <stop
       offset="0"
       stop-color="#4276c4"
       id="stop519" />
    <stop
       offset=".34375"
       stop-color="#80b3ff"
       id="stop521" />
    <stop
       offset="1"
       stop-color="#04a"
       id="stop523" />
  </linearGradient>
  <linearGradient
     id="c"
     gradientUnits="userSpaceOnUse"
     x1="4.500002"
     x2="18.000002"
     xlink:href="#b"
     y1="6.000017"
     y2="6.000017" />
  <linearGradient
     id="d"
     gradientUnits="userSpaceOnUse"
     x1="4.500002"
     x2="18.000002"
     xlink:href="#b"
     y1="1.500217"
     y2="1.500217" />
  <radialGradient
     id="e"
     cx="-11.5"
     cy="8.5"
     gradientTransform="matrix(0 1 -1 0 -3 20)"
     gradientUnits="userSpaceOnUse"
     r="3.5">
    <stop
       offset="0"
       stop-color="#fff"
       id="stop528" />
    <stop
       offset="1"
       stop-color="#d5e5ff"
       id="stop530" />
  </radialGradient>
  <g
     stroke-linecap="round"
     id="g563">
    <g
       stroke-linejoin="round"
       transform="matrix(1.5 0 0 1.5 -2.25 0)"
       id="g549">
      <g
         fill="none"
         id="g545">
        <ellipse
           cx="12"
           cy="18.75"
           rx="7.5"
           ry="2.25"
           stroke="url(#a)"
           stroke-width="3"
           id="ellipse533" />
        <ellipse
           cx="12"
           cy="15.812256"
           rx="8.241464"
           ry="2.937722"
           stroke="#fff"
           stroke-width="1.5"
           id="ellipse535" />
        <ellipse
           cx="12"
           cy="14.25"
           rx="7.5"
           ry="2.25"
           stroke="url(#c)"
           stroke-width="3"
           id="ellipse537" />
        <ellipse
           cx="12"
           cy="11.312256"
           rx="8.241464"
           ry="2.937722"
           stroke="#fff"
           stroke-width="1.5"
           id="ellipse539" />
        <ellipse
           cx="12"
           cy="9.75"
           rx="7.5"
           ry="2.25"
           stroke="url(#d)"
           stroke-width="3"
           id="ellipse541" />
        <ellipse
           cx="12"
           cy="6.812195"
           rx="8.241464"
           ry="2.937722"
           stroke="#fff"
           stroke-width="1.5"
           id="ellipse543" />
      </g>
      <ellipse
         cx="12"
         cy="5.250001"
         fill="#80b3ff"
         fill-rule="evenodd"
         rx="8.25"
         ry="3"
         stroke="url(#a)"
         stroke-width="1.5"
         id="ellipse547" />
    </g>
    <g
       transform="matrix(2.0000001 0 0 2.0000001 44.000001 3.999998)"
       id="g561">
      <g
         fill="none"
         id="g557">
        <circle
           cx="-10.75"
           cy="9.25"
           r="3.875"
           stroke="#fff"
           stroke-linejoin="round"
           stroke-width=".75"
           id="circle551" />
        <path
           d="m-8.8692311 11.130769 3.3692307 3.369231"
           stroke="#fff"
           stroke-width="3"
           id="path553" />
        <path
           d="m-8.8692311 11.130769 3.3692307 3.369231"
           stroke="#a05a2c"
           stroke-width="1.5"
           id="path555" />
      </g>
      <circle
         cx="-10.75"
         cy="9.25"
         fill="url(#e)"
         fill-rule="evenodd"
         r="3.125"
         stroke="#dd8703"
         stroke-linejoin="round"
         stroke-width=".75"
         id="circle559" />
    </g>
  </g>
</svg>
