<?xml version="1.0" encoding="UTF-8" standalone="no"?>
<svg
   height="32"
   viewBox="0 0 8.4666664 8.4666671"
   width="32"
   version="1.1"
   id="svg159"
   sodipodi:docname="Chart_08_32.svg"
   inkscape:export-filename="Chart_08_32.png"
   inkscape:export-xdpi="96"
   inkscape:export-ydpi="96"
   inkscape:version="1.2 (dc2aedaf03, 2022-05-15)"
   xmlns:inkscape="http://www.inkscape.org/namespaces/inkscape"
   xmlns:sodipodi="http://sodipodi.sourceforge.net/DTD/sodipodi-0.dtd"
   xmlns:xlink="http://www.w3.org/1999/xlink"
   xmlns="http://www.w3.org/2000/svg"
   xmlns:svg="http://www.w3.org/2000/svg">
  <defs
     id="defs163">
    <linearGradient
       inkscape:collect="always"
       id="linearGradient5087">
      <stop
         style="stop-color:#ffffff;stop-opacity:1"
         offset="0"
         id="stop5085" />
      <stop
         style="stop-color:#ffd42a;stop-opacity:1;"
         offset="1"
         id="stop5083" />
    </linearGradient>
    <linearGradient
       inkscape:collect="always"
       id="linearGradient5077">
      <stop
         style="stop-color:#ffffff;stop-opacity:1"
         offset="0"
         id="stop5075" />
      <stop
         style="stop-color:#ff5555;stop-opacity:1;"
         offset="1"
         id="stop5073" />
    </linearGradient>
    <linearGradient
       inkscape:collect="always"
       id="linearGradient5067">
      <stop
         style="stop-color:#ffffff;stop-opacity:1"
         offset="0"
         id="stop5065" />
      <stop
         style="stop-color:#87decd;stop-opacity:1;"
         offset="1"
         id="stop5063" />
    </linearGradient>
    <linearGradient
       inkscape:collect="always"
       xlink:href="#linearGradient5067"
       id="linearGradient5069"
       x1="1.058334"
       y1="5.8208331"
       x2="3.1750004"
       y2="5.8208331"
       gradientUnits="userSpaceOnUse" />
    <linearGradient
       inkscape:collect="always"
       xlink:href="#linearGradient5077"
       id="linearGradient5079"
       x1="3.1750004"
       y1="5.0270832"
       x2="5.2916671"
       y2="5.0270832"
       gradientUnits="userSpaceOnUse" />
    <linearGradient
       inkscape:collect="always"
       xlink:href="#linearGradient5087"
       id="linearGradient5089"
       x1="5.2916675"
       y1="4.2333333"
       x2="7.4083342"
       y2="4.2333333"
       gradientUnits="userSpaceOnUse" />
    <linearGradient
       id="a"
       gradientUnits="userSpaceOnUse"
       x1="14.084459"
       x2="8.9155407"
       y1="14.084458"
       y2="8.9155388">
      <stop
         offset="0"
         stop-color="#a00"
         id="stop1100" />
      <stop
         offset="1"
         stop-color="#f55"
         id="stop1102" />
    </linearGradient>
  </defs>
  <sodipodi:namedview
     id="namedview161"
     pagecolor="#ffffff"
     bordercolor="#666666"
     borderopacity="1.0"
     inkscape:showpageshadow="2"
     inkscape:pageopacity="0.0"
     inkscape:pagecheckerboard="0"
     inkscape:deskcolor="#d1d1d1"
     showgrid="true"
     inkscape:zoom="28.6875"
     inkscape:cx="15.982571"
     inkscape:cy="16"
     inkscape:current-layer="svg159">
    <inkscape:grid
       type="xygrid"
       id="grid5456" />
  </sodipodi:namedview>
  <path
     d="M 3.0427084,3.3072918 H 1.190626 v 5.0270826 h 1.8520824 z"
     fill="#87decd"
     stroke="#5fd3bc"
     id="path145"
     style="stroke-width:0.264584;stroke-linecap:round;stroke-dashoffset:1.49998;fill-opacity:1;fill:url(#linearGradient5069)" />
  <path
     d="M 7.2760422,0.13229197 H 5.4239595 V 8.3343746 h 1.8520827 z"
     fill="#ffd42a"
     stroke="#ffcc00"
     id="path147"
     style="stroke-width:0.264584;stroke-linecap:round;stroke-dashoffset:1.49998;fill-opacity:1;fill:url(#linearGradient5089)" />
  <path
     d="M 5.1593751,1.7197919 H 3.3072924 v 6.6145825 h 1.8520827 z"
     fill="#ff5555"
     stroke="#ff5252"
     id="path149"
     style="stroke-width:0.264584;stroke-linecap:round;stroke-dashoffset:1.49998;fill-opacity:1;fill:url(#linearGradient5079)" />
  <g
     stroke="#ffffff"
     stroke-linecap="round"
     id="g1113"
     transform="scale(0.26458334)">
    <circle
       cx="11.5"
       cy="11.5"
       fill="url(#a)"
       r="4.1351352"
       stroke-dashoffset="1.49998"
       stroke-linejoin="round"
       stroke-width="0.72973"
       transform="matrix(0,1.8888888,1.8888888,0,1.777779,1.777779)"
       id="circle1105"
       style="fill:url(#a)" />
    <g
       fill="none"
       stroke-width="1.28565"
       transform="matrix(1.8365134,0,0,1.8365134,2.3800946,2.3800965)"
       id="g1111">
      <path
         d="m 12.914214,10.085786 -2.828428,2.828427"
         id="path1107" />
      <path
         d="M 12.914214,12.914213 10.085786,10.085786"
         id="path1109" />
    </g>
  </g>
</svg>
