<?xml version="1.0" encoding="UTF-8" standalone="no"?>
<svg
   height="24"
   width="24"
   version="1.1"
   id="svg201"
   sodipodi:docname="menu_del_to_laz_150.svg"
   inkscape:export-filename="menu_del_to_laz_150.png"
   inkscape:export-xdpi="96"
   inkscape:export-ydpi="96"
   inkscape:version="1.2.1 (9c6d41e410, 2022-07-14)"
   xmlns:inkscape="http://www.inkscape.org/namespaces/inkscape"
   xmlns:sodipodi="http://sodipodi.sourceforge.net/DTD/sodipodi-0.dtd"
   xmlns="http://www.w3.org/2000/svg"
   xmlns:svg="http://www.w3.org/2000/svg">
  <defs
     id="defs205" />
  <sodipodi:namedview
     id="namedview203"
     pagecolor="#ffffff"
     bordercolor="#666666"
     borderopacity="1.0"
     inkscape:showpageshadow="2"
     inkscape:pageopacity="0.0"
     inkscape:pagecheckerboard="0"
     inkscape:deskcolor="#d1d1d1"
     showgrid="true"
     inkscape:zoom="38.25"
     inkscape:cx="11.986928"
     inkscape:cy="12"
     inkscape:current-layer="svg201">
    <inkscape:grid
       type="xygrid"
       id="grid1292" />
  </sodipodi:namedview>
  <g
     id="g1503">
    <rect
       y="0"
       width="13.5"
       height="13"
       fill="#e60000"
       stroke-linejoin="round"
       stroke-miterlimit="5.6"
       stroke-width="3.0662"
       id="rect372"
       x="0" />
    <g
       transform="matrix(1.5,0,0,1.5,0,-0.5)"
       stroke="#ffffff"
       id="g388">
      <path
         d="M 7.5001,3.5 4.5,1.5 1.4999,3.5 Z"
         fill="#ffffff"
         fill-rule="evenodd"
         stroke-linejoin="round"
         id="path374" />
      <g
         fill="none"
         id="g386">
        <g
           stroke-width="1px"
           id="g382">
          <path
             d="M 2.5,4 V 7.5"
             id="path376" />
          <path
             d="M 4.5,4 V 7.5"
             id="path378" />
          <path
             d="M 6.5,4 V 7.5"
             id="path380" />
        </g>
        <path
           d="m 0.5,7.5 h 8"
           id="path384" />
      </g>
    </g>
  </g>
  <g
     stroke-linejoin="round"
     id="g195"
     transform="matrix(1.5,0,0,1.5,-0.25,0.5)">
    <circle
       cx="11.5"
       cy="11.25"
       fill="#91bbff"
       fill-rule="evenodd"
       r="6.75"
       stroke="#324f96"
       stroke-linecap="square"
       stroke-width="0.5"
       id="circle179" />
    <g
       stroke="#000000"
       stroke-width="0.765543"
       transform="matrix(1.3063097,0,0,1.306215,-2.680458,-2.792793)"
       id="g193">
      <path
         d="m 9.9029897,13.375961 c 0.3748893,-0.626709 0.3504243,-2.298587 1.1108173,-2.16276 1.11446,0.199072 1.366962,0.769884 2.187077,1.511474 -0.330776,0.531317 -2.482536,1.722836 -3.2978943,0.651286 z"
         fill-rule="evenodd"
         id="path181" />
      <g
         fill="none"
         id="g191">
        <path
           d="m 7.5999046,10.843825 c 0.1510338,0.374001 0.1419267,1.082348 0.6122531,1.300186 L 8.7499272,11.570974 C 8.1453117,11.347442 7.9578959,11.222852 7.5999046,10.843825 Z"
           id="path183" />
        <path
           d="m 13.695396,9.0127857 c 9.67e-4,0.4215378 0.283148,1.1021853 -0.07942,1.5002243 L 12.88396,10.173944 c 0.487911,-0.4571025 0.617797,-0.6522155 0.811436,-1.1611583 z"
           id="path185" />
        <path
           d="m 11.056731,7.7002491 c -0.0073,0.3994813 -0.129042,0.8701477 -0.03246,1.3017564 L 11.800043,8.9003534 C 11.372436,8.427541 11.201782,8.2005792 11.056731,7.7002491 Z"
           id="path187" />
        <path
           d="M 8.74273,8.4297916 C 8.7841574,8.8537945 8.5694205,9.568139 8.9733652,9.9300112 L 9.5738293,9.5381163 C 9.038141,9.1301222 8.9882803,8.9210795 8.74273,8.4297916 Z"
           id="path189" />
      </g>
    </g>
  </g>
</svg>
