<?xml version="1.0" encoding="UTF-8" standalone="no"?>
<svg
   height="64"
   viewBox="0 0 16.933333 16.933335"
   width="64"
   version="1.1"
   id="svg623"
   sodipodi:docname="Sound_03_64.svg"
   inkscape:version="1.2 (dc2aedaf03, 2022-05-15)"
   inkscape:export-filename="Sound_03_64.png"
   inkscape:export-xdpi="96"
   inkscape:export-ydpi="96"
   xmlns:inkscape="http://www.inkscape.org/namespaces/inkscape"
   xmlns:sodipodi="http://sodipodi.sourceforge.net/DTD/sodipodi-0.dtd"
   xmlns="http://www.w3.org/2000/svg"
   xmlns:svg="http://www.w3.org/2000/svg">
  <defs
     id="defs627" />
  <sodipodi:namedview
     id="namedview625"
     pagecolor="#ffffff"
     bordercolor="#666666"
     borderopacity="1.0"
     inkscape:showpageshadow="2"
     inkscape:pageopacity="0.0"
     inkscape:pagecheckerboard="0"
     inkscape:deskcolor="#d1d1d1"
     showgrid="true"
     inkscape:zoom="14.34375"
     inkscape:cx="28.583878"
     inkscape:cy="32"
     inkscape:current-layer="svg623">
    <inkscape:grid
       type="xygrid"
       id="grid1262" />
  </sodipodi:namedview>
  <g
     id="g2244"
     transform="scale(4.0000005)">
    <g
       id="g2105"
       transform="translate(-0.13229167)">
      <path
         style="fill:none;stroke:#00aad4;stroke-width:0.264583px;stroke-linecap:round;stroke-linejoin:round;stroke-opacity:1"
         d="M 2.9104167,1.5875 3.96875,2.6458333"
         id="path952"
         sodipodi:nodetypes="cc" />
      <path
         style="fill:none;stroke:#00aad4;stroke-width:0.264583px;stroke-linecap:round;stroke-linejoin:round;stroke-opacity:1"
         d="M 2.9104167,2.6458333 3.96875,1.5875"
         id="path954"
         sodipodi:nodetypes="cc" />
    </g>
    <g
       id="g2236">
      <path
         style="fill:none;stroke:#00aad4;stroke-width:0.264583;stroke-linecap:round;stroke-linejoin:round;stroke-dasharray:none;stroke-opacity:1"
         d="m 1.1906248,1.4552083 0.6614585,-0.79374995 0.3968748,-10e-9 V 3.571875 l -0.3968748,1e-7 L 1.1906248,2.778125"
         id="path2107"
         sodipodi:nodetypes="cccccc" />
      <rect
         style="fill:none;stroke:#00aad4;stroke-width:0.264583;stroke-linecap:round;stroke-linejoin:round;stroke-dasharray:none;stroke-opacity:1"
         id="rect2232"
         width="0.79375029"
         height="1.3229167"
         x="-1.190625"
         y="1.4552083"
         transform="scale(-1,1)"
         rx="0.26458335" />
    </g>
  </g>
</svg>
