<?xml version="1.0" encoding="UTF-8" standalone="no"?>
<svg
   width="24"
   height="24"
   version="1.1"
   viewBox="0 0 24 24"
   id="svg12"
   sodipodi:docname="topenpicturedialog.svg"
   inkscape:export-filename="topenpicturedialog.png"
   inkscape:export-xdpi="96"
   inkscape:export-ydpi="96"
   inkscape:version="1.3.2 (091e20e, 2023-11-25, custom)"
   xmlns:inkscape="http://www.inkscape.org/namespaces/inkscape"
   xmlns:sodipodi="http://sodipodi.sourceforge.net/DTD/sodipodi-0.dtd"
   xmlns="http://www.w3.org/2000/svg"
   xmlns:svg="http://www.w3.org/2000/svg">
  <sodipodi:namedview
     id="namedview12"
     pagecolor="#ffffff"
     bordercolor="#000000"
     borderopacity="0.25"
     inkscape:showpageshadow="2"
     inkscape:pageopacity="0.0"
     inkscape:pagecheckerboard="0"
     inkscape:deskcolor="#d1d1d1"
     showgrid="true"
     inkscape:current-layer="svg12">
    <inkscape:grid
       id="grid12"
       units="px"
       originx="0"
       originy="0"
       spacingx="0.5"
       spacingy="0.5"
       empcolor="#0099e5"
       empopacity="0.30196078"
       color="#0099e5"
       opacity="0.14901961"
       empspacing="2"
       dotted="false"
       gridanglex="30"
       gridanglez="30"
       visible="true" />
  </sodipodi:namedview>
  <defs
     id="defs9">
    <linearGradient
       id="a"
       x1="-27.785778"
       x2="-9.214345"
       y1="1036.5765"
       y2="1045.1479"
       gradientTransform="matrix(0.6999998,0,0,0.7,23.95004,-715.10354)"
       gradientUnits="userSpaceOnUse">
      <stop
         stop-color="#ffe496"
         offset="0"
         id="stop1" />
      <stop
         stop-color="#ffcc40"
         offset="1"
         id="stop2" />
    </linearGradient>
    <linearGradient
       id="b"
       x1="-28.500042"
       x2="-21.000042"
       y1="1030.8622"
       y2="1034.3622"
       gradientTransform="translate(33.000042,-1024.3622)"
       gradientUnits="userSpaceOnUse">
      <stop
         stop-color="#fdbd17"
         offset="0"
         id="stop3" />
      <stop
         stop-color="#e3a726"
         offset="1"
         id="stop4" />
    </linearGradient>
    <linearGradient
       id="c"
       x1="7.9999995"
       x2="7.9999995"
       y1="1.4999998"
       y2="11.238683"
       gradientTransform="matrix(0.80000002,0,0,0.61538215,8.6000003,12.077)"
       gradientUnits="userSpaceOnUse">
      <stop
         stop-color="#80b4fe"
         offset="0"
         id="stop5" />
      <stop
         stop-color="#e7f6fe"
         offset="1"
         id="stop6" />
    </linearGradient>
    <radialGradient
       id="d"
       cx="16"
       cy="10"
       r="2.5999999"
       gradientTransform="matrix(0.59999974,0,0,0.59597023,7.9000041,9.5303)"
       gradientUnits="userSpaceOnUse">
      <stop
         stop-color="#ffffff"
         offset="0"
         id="stop7" />
      <stop
         stop-color="#ffe680"
         offset=".57692301"
         id="stop8" />
      <stop
         stop-color="#ffcc00"
         offset="1"
         id="stop9" />
    </radialGradient>
    <linearGradient
       id="b-4"
       x1="-28.000021"
       x2="-16.000021"
       y1="1031.3622"
       y2="1033.3622"
       gradientTransform="translate(33.000042,-1024.3622)"
       gradientUnits="userSpaceOnUse">
      <stop
         stop-color="#fdbd17"
         offset="0"
         id="stop3-2" />
      <stop
         stop-color="#e3a726"
         offset="1"
         id="stop4-3" />
    </linearGradient>
    <linearGradient
       id="a-8"
       x1="-27.388893"
       x2="-9.6111107"
       y1="1036.8622"
       y2="1044.8622"
       gradientTransform="matrix(0.6749998,0,0,0.75000003,23.487519,-767.64667)"
       gradientUnits="userSpaceOnUse">
      <stop
         stop-color="#ffe496"
         offset="0"
         id="stop1-5" />
      <stop
         stop-color="#ffcc40"
         offset="1"
         id="stop2-3" />
    </linearGradient>
    <radialGradient
       id="d-8"
       cx="16"
       cy="10"
       r="2.5999999"
       gradientTransform="matrix(0.59999974,0,0,0.59597023,7.9000041,9.5303)"
       gradientUnits="userSpaceOnUse">
      <stop
         stop-color="#ffffff"
         offset="0"
         id="stop5-3" />
      <stop
         stop-color="#ffe680"
         offset=".57692301"
         id="stop6-4" />
      <stop
         stop-color="#ffcc00"
         offset="1"
         id="stop7-0" />
    </radialGradient>
  </defs>
  <rect
     x="1.25"
     y="4.2499828"
     width="21.5"
     height="18.5"
     fill="#f9f9f9"
     stroke="#2a7efe"
     stroke-width="0.5"
     style="paint-order:normal"
     id="rect9" />
  <path
     d="m 2.5,1 h 19 C 22.35,1 23,1.6 23,2.5 V 4 H 1 V 2.5 C 1,1.6 1.6,1 2.5,1 Z"
     fill="#2a7efe"
     id="path9" />
  <path
     d="M 4.000093,13 4,7.0002 C 3.9999769,6.4479 4.4477151,6.0001 5.000042,6.0001 l 4,-10e-5 c 0.552299,0 1.000039,0.4477 1.000066,1 l 3.3e-5,0.4999 6.999901,10e-5 a 1.0000125,1.0000125 0 0 1 1,1 V 13 Z"
     fill="url(#b)"
     id="path5"
     style="fill:url(#b-4)" />
  <path
     d="M 17.107163,9.25 H 4.8928775 A 0.64285714,0.68181822 0 0 0 4.250021,9.931857 v 6.136286 A 0.64285714,0.68181822 0 0 0 4.8928775,16.75 H 17.107163 a 0.64285714,0.68181822 0 0 0 0.642858,-0.681857 V 9.931857 A 0.64285714,0.68181822 0 0 0 17.107163,9.25 Z"
     fill="url(#a)"
     stroke-width="0.651339"
     id="path6"
     style="fill:url(#a-8);stroke:#edb020;stroke-width:0.5;stroke-dasharray:none;stroke-opacity:1" />
  <rect
     x="9"
     y="12.999983"
     width="12"
     height="7.9999685"
     fill="url(#c)"
     stroke-width="0.774592"
     id="rect11"
     style="fill:url(#c)" />
  <path
     d="m 9,21 2.809727,-3.5416 c 0.818939,-1.0322 2.193272,-0.8935 3.025158,0 l 2.307972,2.4791 1.510035,-1.0625 c 0.460191,-0.3238 0.767295,-0.283 1.218278,0 L 21,19.5834 V 21 Z"
     fill="#01a901"
     stroke-width="0.798432"
     id="path12" />
  <rect
     style="fill:none;stroke:#ffffff;stroke-width:1;stroke-dasharray:none;stroke-opacity:1"
     id="rect1"
     width="13"
     height="9"
     x="8.5"
     y="12.5" />
  <ellipse
     cx="17.5"
     cy="15.489851"
     rx="1.4999994"
     ry="1.4899255"
     fill="url(#d)"
     stroke-width="0.69479"
     id="ellipse13"
     style="fill:url(#d-8)" />
</svg>
