<?xml version="1.0" encoding="UTF-8" standalone="no"?>
<svg
   width="24"
   height="24"
   version="1.1"
   viewBox="0 0 24 24"
   id="svg15"
   sodipodi:docname="tjsonpropstorage.svg"
   inkscape:export-filename="tjsonpropstorage.png"
   inkscape:export-xdpi="96"
   inkscape:export-ydpi="96"
   inkscape:version="1.3.2 (091e20e, 2023-11-25, custom)"
   xmlns:inkscape="http://www.inkscape.org/namespaces/inkscape"
   xmlns:sodipodi="http://sodipodi.sourceforge.net/DTD/sodipodi-0.dtd"
   xmlns:xlink="http://www.w3.org/1999/xlink"
   xmlns="http://www.w3.org/2000/svg"
   xmlns:svg="http://www.w3.org/2000/svg">
  <sodipodi:namedview
     id="namedview15"
     pagecolor="#ffffff"
     bordercolor="#000000"
     borderopacity="0.25"
     inkscape:showpageshadow="2"
     inkscape:pageopacity="0.0"
     inkscape:pagecheckerboard="0"
     inkscape:deskcolor="#d1d1d1"
     showgrid="true"
     inkscape:current-layer="svg15">
    <inkscape:grid
       id="grid15"
       units="px"
       originx="0"
       originy="0"
       spacingx="0.5"
       spacingy="0.5"
       empcolor="#0099e5"
       empopacity="0.30196078"
       color="#0099e5"
       opacity="0.14901961"
       empspacing="2"
       dotted="false"
       gridanglex="30"
       gridanglez="30"
       visible="true" />
  </sodipodi:namedview>
  <defs
     id="defs2">
    <linearGradient
       id="b"
       x1="11.5"
       x2="11.5"
       y1="1039.8622"
       y2="1033.8622"
       gradientTransform="translate(0.5000001,-1027.3622)"
       gradientUnits="userSpaceOnUse"
       xlink:href="#a" />
    <linearGradient
       id="a">
      <stop
         stop-color="#c1d3f1"
         offset="0"
         id="stop1" />
      <stop
         stop-color="#eaf2fa"
         offset="1"
         id="stop2" />
    </linearGradient>
    <linearGradient
       id="c"
       x1="11"
       x2="11"
       y1="1030.3622"
       y2="1033.3622"
       gradientTransform="translate(0.5000001,-1027.3622)"
       gradientUnits="userSpaceOnUse"
       xlink:href="#a" />
  </defs>
  <path
     d="m 17.5,2.5 2.75,3.75 H 3.749999 L 6.4999996,2.5 Z"
     fill="url(#c)"
     fill-rule="evenodd"
     stroke="#2a7efe"
     stroke-linejoin="round"
     stroke-width="0.5"
     id="path2"
     style="fill:url(#c)" />
  <path
     d="M 3.7695499,12.75 H 20.25 V 6.25 H 3.7499989 Z"
     fill="url(#b)"
     fill-rule="evenodd"
     stroke="#2a7efe"
     stroke-linejoin="round"
     stroke-width="0.499999"
     id="path3"
     style="fill:url(#b)" />
  <rect
     x="1"
     y="13.999983"
     width="22"
     height="9.0000172"
     ry="1.5000172"
     fill="#739bdf"
     fill-rule="evenodd"
     style="paint-order:normal"
     id="rect3" />
  <path
     d="m 5.5,8 v 3"
     fill="#c1d3f1"
     stroke="#2a7efe"
     stroke-linejoin="round"
     stroke-width="0.5"
     id="path4" />
  <path
     d="m 18.5,8 v 3"
     fill="#c1d3f1"
     stroke="#2a7efe"
     stroke-linejoin="round"
     stroke-width="0.5"
     id="path5" />
  <path
     d="m 16.5,8 v 3"
     fill="#c1d3f1"
     stroke="#2a7efe"
     stroke-linejoin="round"
     stroke-width="0.5"
     id="path6" />
  <path
     d="m 14.5,8 v 3"
     fill="#c1d3f1"
     stroke="#2a7efe"
     stroke-linejoin="round"
     stroke-width="0.5"
     id="path7" />
  <path
     d="M 13,8.5 H 11"
     fill="none"
     stroke="#00ff00"
     stroke-linejoin="round"
     stroke-width="0.999996"
     id="path8" />
  <path
     d="m 9.5,8 v 3"
     fill="#c1d3f1"
     stroke="#2a7efe"
     stroke-linejoin="round"
     stroke-width="0.5"
     id="path9" />
  <path
     d="m 7.5,8 v 3"
     fill="#c1d3f1"
     stroke="#2a7efe"
     stroke-linejoin="round"
     stroke-width="0.5"
     id="path10" />
  <path
     d="M 13,10.5 H 11"
     fill="none"
     stroke="#ff0000"
     stroke-linejoin="round"
     stroke-width="0.999996"
     id="path11" />
  <path
     d="m 13.015455,16.4 c 0.775852,0 1.400454,0.5755 1.400454,1.2903 v 1.6193 c 0,0.7149 -0.624602,1.2903 -1.400454,1.2903 -0.775854,0 -1.400455,-0.5754 -1.400455,-1.2903 v -1.6193 c 0,-0.7148 0.624601,-1.2903 1.400455,-1.2903 z"
     fill="none"
     stroke="#ffffff"
     stroke-linecap="round"
     stroke-linejoin="round"
     stroke-width="0.8"
     id="path12" />
  <path
     d="m 5.407539,16.4 v 2.8144 c 0,1.6831 -1.525127,1.5133 -1.907539,1.1309"
     fill="none"
     stroke="#ffffff"
     stroke-linecap="round"
     stroke-linejoin="round"
     stroke-width="0.8"
     id="path13" />
  <path
     d="M 16.414,20.5999 V 16.4 l 3.006171,4.1999 V 16.4"
     fill="none"
     stroke="#ffffff"
     stroke-linecap="round"
     stroke-linejoin="round"
     stroke-width="0.8"
     id="path14" />
  <path
     d="M 9.817222,16.6741 C 9.548139,16.4893 9.148588,16.4 8.671257,16.4 c -0.674552,0 -1.288359,0.3533 -1.288359,1.0879 0,0.5755 0.487318,0.8121 1.288359,0.9506 1.115397,0.1928 1.288359,0.5675 1.288359,1.0735 10e-7,0.9143 -0.763884,1.0879 -1.288359,1.0879 -0.407156,0 -0.825073,-0.049 -1.349257,-0.3198"
     fill="none"
     stroke="#ffffff"
     stroke-linecap="round"
     stroke-linejoin="round"
     stroke-width="0.8"
     id="path15" />
</svg>
