<svg width="16" height="16" version="1.1" xmlns="http://www.w3.org/2000/svg">
 <g fill="none" stroke="#00aad4" stroke-linecap="round">
  <path d="m12.000001 6.4999114a5.5000013 5.4987197 0 1 1-11.000002 0 5.5000013 5.4987197 0 1 1 11.000002 0z" fill="#ebfcff" stroke="#00aad4" stroke-linejoin="round" stroke-width=".999997"/>
  <path d="m11 11 3.5 3.5" stroke-width="2.5"/>
 </g>
</svg>
