<svg width="16" height="16" version="1.1" xmlns="http://www.w3.org/2000/svg">
 <defs>
  <radialGradient id="c" cx="21.957434" cy="5.9936466" r="3.105469" gradientTransform="matrix(.54934594 .00019418549 1.5396439e-8 .45002289 -6.561871 4.3927115)" gradientUnits="userSpaceOnUse">
   <stop stop-color="#803300" offset="0"/>
   <stop stop-color="#d45500" offset="1"/>
  </radialGradient>
  <linearGradient id="a" x1="25.714283" x2="25.714283" y1="15.5" y2="6.2142854" gradientTransform="matrix(.54914214 .00016659727 .00015252483 .60000003 -6.5824991 3.6963345)" gradientUnits="userSpaceOnUse">
   <stop stop-color="#668000" offset="0"/>
   <stop stop-color="#aad400" offset="1"/>
  </linearGradient>
  <linearGradient id="b" x1="23" x2="23" y1="6.5" y2="15" gradientTransform="matrix(.56555147 .00016496396 .00015708254 .59411766 -6.9439101 3.8846048)" gradientUnits="userSpaceOnUse">
   <stop stop-color="#89a02c" offset="0"/>
   <stop stop-color="#445016" offset="1"/>
  </linearGradient>
 </defs>
 <rect x=".25" y="3.25" width="14.5" height="11.5" fill="#f9f9f9" stroke="#2a7efe" stroke-width=".5" style="paint-order:normal"/>
 <path d="m1.1 1h12.8c0.6 0 1.1 0.5 1.1 1.1v1.4h-15v-1.4c0-0.6 0.5-1.1 1.1-1.1z" fill="#2a7efe"/>
 <path d="m15 6v5l-0.5 0.5v-6z" fill="#f9f9f9"/>
 <path d="m10.5 8.4999995h5" fill="none" stroke="#ff0000" stroke-linecap="round" stroke-linejoin="round" stroke-opacity=".996078" stroke-width="1.00002"/>
 <path d="m13.7051 6.7050989 1.7949 1.7949006-1.7949 1.7949015" fill="none" stroke="#ff0000" stroke-linecap="round" stroke-linejoin="round" stroke-opacity=".996078" stroke-width="1.00002"/>
 <path d="M 6.158859,5.9697247 6.817716,4.35" fill="none" stroke="#d4aa00" stroke-linecap="round" stroke-linejoin="round" stroke-width=".7"/>
 <path d="m4.841143 5.9697247-0.658858-1.6197245" fill="none" stroke="#d4aa00" stroke-linecap="round" stroke-linejoin="round" stroke-width=".7"/>
 <path d="m5.49901 5.1999997a3.9000011 2.7503982 89.953824 0 0-1.7029835 0.8479215l1.7036715 1.8614548 1.707015-1.8651079a3.9000011 2.7503982 89.953824 0 0-1.707703-0.8442684z" fill="url(#c)" stroke-linejoin="round" stroke-width="1.9634"/>
 <path d="m2.3500003 6.35-3e-7 0.725905 0.8784773 0.925557" fill="none" stroke="#aca793" stroke-linecap="round" stroke-linejoin="round" stroke-width=".7"/>
 <path d="m2.3614768 12.649999-0.011477-0.937649 0.878477-0.925558" fill="none" stroke="#aca793" stroke-linecap="round" stroke-linejoin="round" stroke-width=".7"/>
 <path d="m1.35 10.111966 0.6588578-0.694167 1.675501-0.321883" fill="none" stroke="#aca793" stroke-linecap="round" stroke-linejoin="round" stroke-width=".7"/>
 <path d="m8.650477 6.3500006 2e-6 0.7259044-0.878479 0.925558" fill="none" stroke="#aca793" stroke-linecap="round" stroke-linejoin="round" stroke-width=".7"/>
 <path d="m8.638999 12.65 0.01148-0.937649-0.878477-0.925557" fill="none" stroke="#aca793" stroke-linecap="round" stroke-linejoin="round" stroke-width=".7"/>
 <path d="m9.65 10.111966-0.658857-0.694167-1.676232-0.320808" fill="none" stroke="#aca793" stroke-linecap="round" stroke-linejoin="round" stroke-width=".7"/>
 <path d="M 7.198131,6.034891 5.499693,7.890625 3.8056778,6.0397205 A 3.9000011,2.7503982 89.953824 0 0 2.75,9.099166 3.9000011,2.7503982 89.953824 0 0 5.500992,13 3.9000011,2.7503982 89.953824 0 0 8.25,9.100834 3.9000011,2.7503982 89.953824 0 0 7.198131,6.034891 Z" fill="url(#a)" stroke-linejoin="round" stroke-width="1.9634"/>
 <path d="m5.5 7.65v5" fill="none" stroke="url(#b)" stroke-linecap="round" stroke-linejoin="round" stroke-width=".7"/>
</svg>
