<?xml version="1.0" encoding="UTF-8" standalone="no"?>
<svg
   width="24"
   height="24"
   version="1.1"
   viewBox="0 0 24 24"
   id="svg9"
   sodipodi:docname="tdbtext.svg"
   inkscape:export-filename="tdbtext.png"
   inkscape:export-xdpi="96"
   inkscape:export-ydpi="96"
   inkscape:version="1.3.2 (091e20e, 2023-11-25, custom)"
   xmlns:inkscape="http://www.inkscape.org/namespaces/inkscape"
   xmlns:sodipodi="http://sodipodi.sourceforge.net/DTD/sodipodi-0.dtd"
   xmlns="http://www.w3.org/2000/svg"
   xmlns:svg="http://www.w3.org/2000/svg">
  <sodipodi:namedview
     id="namedview9"
     pagecolor="#ffffff"
     bordercolor="#000000"
     borderopacity="0.25"
     inkscape:showpageshadow="2"
     inkscape:pageopacity="0.0"
     inkscape:pagecheckerboard="0"
     inkscape:deskcolor="#d1d1d1"
     showgrid="true"
     inkscape:current-layer="svg9">
    <inkscape:grid
       id="grid9"
       units="px"
       originx="0"
       originy="0"
       spacingx="0.5"
       spacingy="0.5"
       empcolor="#0099e5"
       empopacity="0.30196078"
       color="#0099e5"
       opacity="0.14901961"
       empspacing="2"
       dotted="false"
       gridanglex="30"
       gridanglez="30"
       visible="true" />
  </sodipodi:namedview>
  <defs
     id="defs3">
    <linearGradient
       id="a"
       x1="2"
       x2="14"
       y1="2"
       y2="2"
       gradientUnits="userSpaceOnUse">
      <stop
         stop-color="#4276c4"
         offset="0"
         id="stop1" />
      <stop
         stop-color="#80b3ff"
         offset=".3333333"
         id="stop2" />
      <stop
         stop-color="#04a"
         offset="1"
         id="stop3" />
    </linearGradient>
  </defs>
  <ellipse
     cx="8"
     cy="13.5"
     rx="5.1"
     ry="1.6"
     fill="none"
     stroke="url(#a)"
     stroke-linecap="round"
     stroke-linejoin="round"
     stroke-width="1.8"
     id="ellipse3" />
  <ellipse
     cx="8"
     cy="12.2"
     rx="4.9"
     ry="1.4"
     fill="none"
     stroke="#ffffff"
     stroke-linecap="round"
     stroke-linejoin="round"
     stroke-width="1.2"
     id="ellipse4" />
  <ellipse
     cx="8"
     cy="10.5"
     rx="5.1"
     ry="1.6"
     fill="none"
     stroke="url(#a)"
     stroke-linecap="round"
     stroke-linejoin="round"
     stroke-width="1.8"
     id="ellipse5" />
  <ellipse
     cx="8"
     cy="9.2"
     rx="4.9"
     ry="1.4"
     fill="none"
     stroke="#ffffff"
     stroke-linecap="round"
     stroke-linejoin="round"
     stroke-width="1.2"
     id="ellipse6" />
  <ellipse
     cx="8"
     cy="7.5"
     rx="5.1"
     ry="1.6"
     fill="none"
     stroke="url(#a)"
     stroke-linecap="round"
     stroke-linejoin="round"
     stroke-width="1.8"
     id="ellipse7" />
  <ellipse
     cx="8"
     cy="6.2"
     rx="4.9"
     ry="1.4"
     fill="none"
     stroke="#ffffff"
     stroke-linecap="round"
     stroke-linejoin="round"
     stroke-width="1.2"
     id="ellipse8" />
  <ellipse
     cx="8"
     cy="4.5"
     rx="5.4"
     ry="1.9"
     fill="#80b3ff"
     fill-rule="evenodd"
     stroke="url(#a)"
     stroke-linecap="round"
     stroke-linejoin="round"
     stroke-width="1.2"
     id="ellipse9" />
  <rect
     x="6.206449"
     y="14.20645"
     width="17.587103"
     height="9.5871019"
     fill="#ffffff"
     stroke="#2a7efe"
     stroke-linecap="round"
     stroke-linejoin="round"
     stroke-width="0.412898"
     style="paint-order:normal"
     id="rect9" />
  <path
     d="M 11.6,19.3972 H 9.92 c -0.82452,0 -1.12,0.5796 -1.12,0.9961 0,0.6959 0.45951,1.2067 1.12,1.2067 0.547421,0 1.11493,-0.3466 1.68,-0.5021 m 0,0.5021 v -2.744 c 0,-1.214 -0.620461,-1.456 -1.4,-1.456 -0.190986,0 -0.574505,0.011 -0.953753,0.2596"
     fill="none"
     stroke="#4d4d4d"
     stroke-linecap="round"
     stroke-linejoin="round"
     stroke-width="0.8"
     id="path9" />
  <path
     d="m 15.093962,17.4 h 1e-6 c 0.7756,0 1.4,0.6244 1.4,1.4 v 1.4 c 0,0.7756 -0.6244,1.4 -1.4,1.4 h -1e-6 c -0.7756,0 -1.4,-0.6244 -1.4,-1.4 v -1.4 c 0,-0.7756 0.6244,-1.4 1.4,-1.4 z m -1.4,-1.68 v 5.88"
     fill="none"
     stroke="#4d4d4d"
     stroke-linecap="round"
     stroke-linejoin="round"
     stroke-width="0.8"
     id="path10" />
  <path
     d="M 21.127106,17.9674 C 20.872563,17.6228 20.463252,17.4 20.000002,17.4 h -10e-7 C 19.224401,17.4 18.6,18.0244 18.6,18.8 l 6.47e-4,1.4 c 0,0.7756 0.6244,1.4 1.4,1.4 h 2e-6 c 0.46325,0 0.872561,-0.2228 1.127105,-0.5674"
     fill="none"
     stroke="#4d4d4d"
     stroke-linecap="round"
     stroke-linejoin="round"
     stroke-width="0.8"
     id="path11" />
</svg>
