<?xml version="1.0" encoding="UTF-8" standalone="no"?>
<svg
   width="32"
   height="32"
   viewBox="0 0 32 32"
   version="1.1"
   id="svg1"
   sodipodi:docname="color-picker_200.svg"
   inkscape:version="1.3.2 (091e20e, 2023-11-25, custom)"
   inkscape:export-filename="color-picker_200.png"
   inkscape:export-xdpi="96"
   inkscape:export-ydpi="96"
   xmlns:inkscape="http://www.inkscape.org/namespaces/inkscape"
   xmlns:sodipodi="http://sodipodi.sourceforge.net/DTD/sodipodi-0.dtd"
   xmlns="http://www.w3.org/2000/svg"
   xmlns:svg="http://www.w3.org/2000/svg">
  <defs
     id="defs1" />
  <sodipodi:namedview
     id="namedview1"
     pagecolor="#ffffff"
     bordercolor="#000000"
     borderopacity="0.25"
     inkscape:showpageshadow="2"
     inkscape:pageopacity="0.0"
     inkscape:pagecheckerboard="0"
     inkscape:deskcolor="#d1d1d1"
     showgrid="true"
     inkscape:current-layer="svg1">
    <inkscape:grid
       id="grid1"
       units="px"
       originx="0"
       originy="0"
       spacingx="0.5"
       spacingy="0.5"
       empcolor="#0099e5"
       empopacity="0.30196078"
       color="#0099e5"
       opacity="0.14901961"
       empspacing="2"
       dotted="false"
       gridanglex="30"
       gridanglez="30"
       visible="true" />
  </sodipodi:namedview>
  <g
     transform="matrix(7.5589934,0,0,7.5589934,2.607874e-4,1.3228346e-4)"
     stroke-linecap="round"
     stroke-linejoin="round"
     stroke-width="0.264583"
     id="g6">
    <path
       d="M 1.305387,0.39686074 2.1828599,1.9184444 3.0613665,0.39686074 Z"
       fill="#ff8080"
       id="path1" />
    <path
       d="M 3.1755723,0.46072237 2.2968074,1.9843737 h 1.7564963 z"
       fill="#00d400"
       id="path2" />
    <path
       d="M 1.1901476,0.46253163 0.31138262,1.9843737 H 2.0689125 Z"
       fill="#ff0000"
       id="path3" />
    <path
       d="M 2.1828599,2.1823373 1.3051286,3.7041794 h 1.7564962 z"
       fill="#3385ff"
       id="path4" />
    <path
       d="M 2.2980993,2.1166664 3.1758307,3.6382501 4.0533037,2.1166664 Z"
       fill="#00ff00"
       id="path5" />
    <path
       d="M 0.31164101,2.1166664 1.1898892,3.6366993 2.0676206,2.1166664 Z"
       fill="#5599ff"
       id="path6" />
  </g>
</svg>
