<?xml version="1.0" encoding="UTF-8" standalone="no"?>
<svg
   height="16"
   width="16"
   version="1.1"
   id="svg315"
   sodipodi:docname="Warning_03_16.svg"
   inkscape:export-filename="Warning_03_16.png"
   inkscape:export-xdpi="96"
   inkscape:export-ydpi="96"
   inkscape:version="1.2 (dc2aedaf03, 2022-05-15)"
   xml:space="preserve"
   xmlns:inkscape="http://www.inkscape.org/namespaces/inkscape"
   xmlns:sodipodi="http://sodipodi.sourceforge.net/DTD/sodipodi-0.dtd"
   xmlns="http://www.w3.org/2000/svg"
   xmlns:svg="http://www.w3.org/2000/svg"><defs
     id="defs319" /><sodipodi:namedview
     id="namedview317"
     pagecolor="#ffffff"
     bordercolor="#666666"
     borderopacity="1.0"
     inkscape:pageshadow="2"
     inkscape:pageopacity="0.0"
     inkscape:pagecheckerboard="0"
     inkscape:deskcolor="#d1d1d1"
     showgrid="true"
     inkscape:zoom="57.375"
     inkscape:cx="7.3638344"
     inkscape:cy="8"
     inkscape:current-layer="svg315"
     inkscape:showpageshadow="2"><inkscape:grid
       type="xygrid"
       id="grid983" /></sodipodi:namedview><path
     id="path1062"
     style="fill:none;stroke:#00aad4;stroke-width:1.50001;stroke-linecap:round;stroke-linejoin:round;stroke-dashoffset:1.49998;stroke-opacity:1"
     inkscape:transform-center-y="-1.8776264"
     d="M 14.999821,14.249932 H 1.9997053 L 8.4999996,2.5 Z"
     sodipodi:nodetypes="cccc" /><path
     style="fill:none;stroke:#00aad4;stroke-width:1px;stroke-linecap:butt;stroke-linejoin:miter;stroke-opacity:1"
     d="M 8.5,6.5 V 9.9999997"
     id="path1006"
     sodipodi:nodetypes="cc" /><path
     style="fill:none;stroke:#00aad4;stroke-width:1px;stroke-linecap:butt;stroke-linejoin:miter;stroke-opacity:1"
     d="m 8.5,11 v 1"
     id="path1008"
     sodipodi:nodetypes="cc" /></svg>
