<svg width="16" height="16" version="1.0" xmlns="http://www.w3.org/2000/svg">
 <path d="M 12.75,13 7.25,8 12.75,3" fill="none" stroke="#36cd36" stroke-linecap="round" stroke-linejoin="round" stroke-width="1.8"/>
 <path d="m3.1 2v12" fill="none" stroke="#36cd36" stroke-linecap="round" stroke-linejoin="round" stroke-width="1.8"/>
</svg>
