<?xml version="1.0" encoding="UTF-8" standalone="no"?>
<svg
   height="64"
   viewBox="0 0 16.933333 16.933335"
   width="64"
   version="1.1"
   id="svg4"
   sodipodi:docname="Setup_07_64.svg"
   inkscape:version="1.2.2 (732a01da63, 2022-12-09)"
   xmlns:inkscape="http://www.inkscape.org/namespaces/inkscape"
   xmlns:sodipodi="http://sodipodi.sourceforge.net/DTD/sodipodi-0.dtd"
   xmlns="http://www.w3.org/2000/svg"
   xmlns:svg="http://www.w3.org/2000/svg">
  <defs
     id="defs8" />
  <sodipodi:namedview
     id="namedview6"
     pagecolor="#ffffff"
     bordercolor="#000000"
     borderopacity="0.25"
     inkscape:showpageshadow="2"
     inkscape:pageopacity="0.0"
     inkscape:pagecheckerboard="0"
     inkscape:deskcolor="#d1d1d1"
     showgrid="true"
     inkscape:zoom="14.21875"
     inkscape:cx="31.964835"
     inkscape:cy="32"
     inkscape:current-layer="svg4">
    <inkscape:grid
       type="xygrid"
       id="grid1689" />
  </sodipodi:namedview>
  <path
     d="m10.652686.5168173-1.3585478 2.3890471-1.654855.0005943-1.359122-2.3905316-1.8894222.7826243.7293158 2.6514064-1.1705791 1.1697391-2.6499496-.7286731-.7827081 1.8896241 2.3890471 1.358548.0005944 1.654854-2.3905317 1.3591231.782624 1.889422 2.6514061-.729315 1.1697385 1.170579-.7286729 2.649949 1.8896237.782709 1.358548-2.389049 1.654854-.000593 1.3591248 2.390532 1.889421-.782626-.729317-2.651405 1.170579-1.169739 2.649952.728674.782707-1.889624-2.389048-1.3585491-.000594-1.654855 2.390532-1.359123-.782624-1.8894217-2.651408.7293157-1.169738-1.1705792.728673-2.6499496zm-1.1424088 5.4303506a2.7270853 2.7270853 0 0 1 1.4758868 3.56311 2.7270853 2.7270853 0 0 1 -3.5631078 1.4758871 2.7270853 2.7270853 0 0 1 -1.4758874-3.5631081 2.7270853 2.7270853 0 0 1 3.5631084-1.475889z"
     fill="#c2f3ff"
     stroke="#00aad4"
     stroke-linejoin="round"
     stroke-width=".767292"
     id="path2" />
</svg>
