<?xml version="1.0" encoding="UTF-8" standalone="no"?>
<svg
   height="32"
   width="32"
   version="1.1"
   id="svg275"
   sodipodi:docname="Cloud_03_32.svg"
   inkscape:export-filename="Cloud_03_32.png"
   inkscape:export-xdpi="96"
   inkscape:export-ydpi="96"
   inkscape:version="1.2.1 (9c6d41e410, 2022-07-14)"
   xmlns:inkscape="http://www.inkscape.org/namespaces/inkscape"
   xmlns:sodipodi="http://sodipodi.sourceforge.net/DTD/sodipodi-0.dtd"
   xmlns="http://www.w3.org/2000/svg"
   xmlns:svg="http://www.w3.org/2000/svg">
  <defs
     id="defs279" />
  <sodipodi:namedview
     id="namedview277"
     pagecolor="#ffffff"
     bordercolor="#666666"
     borderopacity="1.0"
     inkscape:showpageshadow="2"
     inkscape:pageopacity="0.0"
     inkscape:pagecheckerboard="0"
     inkscape:deskcolor="#d1d1d1"
     showgrid="true"
     inkscape:zoom="28.6875"
     inkscape:cx="15.982571"
     inkscape:cy="16"
     inkscape:current-layer="svg275">
    <inkscape:grid
       type="xygrid"
       id="grid818" />
  </sodipodi:namedview>
  <linearGradient
     id="a"
     gradientTransform="matrix(1.0000001 0 0 .96627923 -.000186 .08837)"
     gradientUnits="userSpaceOnUse"
     x1="7.5"
     x2="9"
     y1="2"
     y2="13">
    <stop
       offset="0"
       stop-color="#5ab4f2"
       id="stop268" />
    <stop
       offset="1"
       stop-color="#0090ff"
       id="stop270" />
  </linearGradient>
  <path
     d="m3.2916409 12.65c-4.3402418 0-4.3402418-5.8903515-.2858606-5.8903515-.5693968-6.06642832 9.1223577-5.7049987 9.1223577-1.4725881 4.918072-.3594726 5.574822 7.3629396-.506799 7.3629396z"
     fill="url(#a)"
     transform="matrix(1.9999999 0 0 1.9999999 .000372 0)"
     id="path273" />
</svg>
