<?xml version="1.0" encoding="UTF-8" standalone="no"?>
<svg
   width="36"
   height="36"
   version="1.1"
   viewBox="0 0 36 36"
   id="svg35"
   sodipodi:docname="Grid_17_36.svg"
   inkscape:export-filename="Grid_17_36.png"
   inkscape:export-xdpi="96"
   inkscape:export-ydpi="96"
   inkscape:version="1.3.2 (091e20e, 2023-11-25, custom)"
   xmlns:inkscape="http://www.inkscape.org/namespaces/inkscape"
   xmlns:sodipodi="http://sodipodi.sourceforge.net/DTD/sodipodi-0.dtd"
   xmlns="http://www.w3.org/2000/svg"
   xmlns:svg="http://www.w3.org/2000/svg">
  <sodipodi:namedview
     id="namedview35"
     pagecolor="#ffffff"
     bordercolor="#000000"
     borderopacity="0.25"
     inkscape:showpageshadow="2"
     inkscape:pageopacity="0.0"
     inkscape:pagecheckerboard="0"
     inkscape:deskcolor="#d1d1d1"
     showgrid="true"
     inkscape:current-layer="svg35">
    <inkscape:grid
       id="grid35"
       units="px"
       originx="0"
       originy="0"
       spacingx="0.5"
       spacingy="0.5"
       empcolor="#0099e5"
       empopacity="0.30196078"
       color="#0099e5"
       opacity="0.14901961"
       empspacing="2"
       dotted="false"
       gridanglex="30"
       gridanglez="30"
       visible="true" />
  </sodipodi:namedview>
  <defs
     id="defs24">
    <linearGradient
       id="d"
       x1="1.5"
       x2="3.5"
       y1="15.5"
       y2="13.5"
       gradientTransform="matrix(2.25,0,0,2.25,17.999998,-17.999998)"
       gradientUnits="userSpaceOnUse">
      <stop
         stop-color="#d42aff"
         offset="0"
         id="stop1" />
      <stop
         stop-color="#00aad4"
         offset="1"
         id="stop2" />
    </linearGradient>
    <linearGradient
       id="i"
       x1="5.5"
       x2="7.5"
       y1="11.5"
       y2="9.5"
       gradientTransform="matrix(2.25,0,0,2.25,1.83e-5,0)"
       gradientUnits="userSpaceOnUse">
      <stop
         stop-color="#ffcc00"
         offset="0"
         id="stop3" />
      <stop
         stop-color="#aaaaff"
         offset="1"
         id="stop4" />
    </linearGradient>
    <linearGradient
       id="c"
       x1="5.5"
       x2="7.5"
       y1="3.5"
       y2="1.5"
       gradientTransform="matrix(2.25,0,0,2.25,1.83e-5,0)"
       gradientUnits="userSpaceOnUse">
      <stop
         stop-color="#aaccff"
         offset="0"
         id="stop5" />
      <stop
         stop-color="#ffc9c9"
         offset="1"
         id="stop6" />
    </linearGradient>
    <linearGradient
       id="e"
       x1="9.5"
       x2="11.5"
       y1="15.5"
       y2="13.5"
       gradientTransform="matrix(2.25,0,0,2.25,1.83e-5,0)"
       gradientUnits="userSpaceOnUse">
      <stop
         stop-color="#ff6868"
         offset="0"
         id="stop7" />
      <stop
         stop-color="#00ff00"
         offset="1"
         id="stop8" />
    </linearGradient>
    <linearGradient
       id="k"
       x1="5.5"
       x2="7.5"
       y1="5.5"
       y2="7.5"
       gradientTransform="matrix(2.25,0,0,2.25,1.83e-5,0)"
       gradientUnits="userSpaceOnUse">
      <stop
         stop-color="#d45500"
         offset="0"
         id="stop9" />
      <stop
         stop-color="#aaffaa"
         offset="1"
         id="stop10" />
    </linearGradient>
    <linearGradient
       id="j"
       x1="1.5"
       x2="3.5"
       y1="11.5"
       y2="9.5"
       gradientTransform="matrix(2.25,0,0,2.25,1.83e-5,0)"
       gradientUnits="userSpaceOnUse">
      <stop
         stop-color="#6868ff"
         offset="0"
         id="stop11" />
      <stop
         stop-color="#aaccff"
         offset="1"
         id="stop12" />
    </linearGradient>
    <linearGradient
       id="g"
       x1="5.5"
       x2="7.5"
       y1="15.5"
       y2="13.5"
       gradientTransform="matrix(2.25,0,0,2.25,1.83e-5,0)"
       gradientUnits="userSpaceOnUse">
      <stop
         stop-color="#00d400"
         offset="0"
         id="stop13" />
      <stop
         stop-color="#ffc9c9"
         offset="1"
         id="stop14" />
    </linearGradient>
    <linearGradient
       id="b"
       x1="11.5"
       x2="9.5"
       y1="3.5"
       y2="1.5"
       gradientTransform="matrix(2.25,0,0,2.25,1.83e-5,0)"
       gradientUnits="userSpaceOnUse">
      <stop
         stop-color="#ff0000"
         offset="0"
         id="stop15" />
      <stop
         stop-color="#ffff51"
         offset="1"
         id="stop16" />
    </linearGradient>
    <linearGradient
       id="a"
       x1="2.5"
       x2="3"
       y1="7"
       y2="5.5"
       gradientTransform="matrix(2.25,0,0,2.25,1.83e-5,0)"
       gradientUnits="userSpaceOnUse">
      <stop
         stop-color="#efef00"
         offset="0"
         id="stop17" />
      <stop
         stop-color="#00ff00"
         offset="1"
         id="stop18" />
    </linearGradient>
    <linearGradient
       id="f"
       x1="3"
       x2="1.5"
       y1="3.5"
       y2="1.5"
       gradientTransform="matrix(2.25,0,0,2.25,1.83e-5,0)"
       gradientUnits="userSpaceOnUse">
      <stop
         stop-color="#0000ff"
         offset="0"
         id="stop19" />
      <stop
         stop-color="#ff7171"
         offset="1"
         id="stop20" />
    </linearGradient>
    <linearGradient
       id="h"
       x1="1.5"
       x2="3.5"
       y1="15.5"
       y2="13.5"
       gradientTransform="matrix(2.25,0,0,2.25,1.83e-5,0)"
       gradientUnits="userSpaceOnUse">
      <stop
         stop-color="#008000"
         offset="0"
         id="stop21" />
      <stop
         stop-color="#6868ff"
         offset="1"
         id="stop22" />
    </linearGradient>
    <radialGradient
       id="l"
       cx="-11.5"
       cy="8.5"
       r="3.5"
       gradientTransform="matrix(0,2.1686748,-2.1686748,0,38.807227,45.313252)"
       gradientUnits="userSpaceOnUse">
      <stop
         stop-color="#fff"
         offset="0"
         id="stop23" />
      <stop
         stop-color="#d5e5ff"
         offset="1"
         id="stop24" />
    </radialGradient>
  </defs>
  <path
     d="m2.250018 35.999998v-6.75h6.750038v6.75z"
     fill="url(#h)"
     fill-rule="evenodd"
     stroke-width="2.25"
     id="path24" />
  <path
     d="m2.250018 8.999998v-6.749998h6.750038v6.749998z"
     fill="url(#f)"
     fill-rule="evenodd"
     stroke-width="2.25"
     id="path25" />
  <path
     d="m2.250018 17.999998v-6.75h6.750038v6.75z"
     fill="url(#a)"
     fill-rule="evenodd"
     stroke-width="2.25"
     id="path26" />
  <path
     d="m20.250018 2.25v6.75h6.75v-6.75z"
     fill="url(#b)"
     fill-rule="evenodd"
     stroke-width="2.25"
     id="path27" />
  <path
     d="m11.250018 35.999998v-6.75h6.750038v6.75z"
     fill="url(#g)"
     fill-rule="evenodd"
     stroke-width="2.25"
     id="path28" />
  <path
     d="m2.25 27v-6.75h6.750038v6.75z"
     fill="url(#j)"
     fill-rule="evenodd"
     stroke-width="2.25"
     id="path29" />
  <path
     d="m13.384766 18c0.395867-2.832872 2.169085-5.237947 4.615234-6.515625v-0.234375h-6.75v6.75z"
     fill="url(#k)"
     fill-rule="evenodd"
     stroke-width="2.25"
     id="path30" />
  <path
     d="m27.000018 29.25h-6.75v6.75h6.75z"
     fill="url(#e)"
     fill-rule="evenodd"
     stroke-width="2.25"
     id="path31" />
  <path
     d="m11.25 9v-6.75h6.750036v6.75z"
     fill="url(#c)"
     fill-rule="evenodd"
     stroke-width="2.25"
     id="path32" />
  <path
     d="m18 26.919922c-2.490282-1.30073-4.282571-3.770532-4.634766-6.669922h-2.115234v6.75h6.75z"
     fill="url(#i)"
     fill-rule="evenodd"
     stroke-width="2.25"
     id="path33" />
  <path
     d="m25.519531 11.25c0.522043 0.232698 1.018023 0.515264 1.480469 0.841797v-0.841797z"
     fill="url(#d)"
     fill-rule="evenodd"
     stroke-width="2.25"
     id="path34" />
  <g
     transform="translate(0,-2.8)"
     stroke-linecap="round"
     id="g35">
    <path
       d="M 24.59475,24.59475 34.2,34.2"
       fill="none"
       stroke="#ff7f00"
       stroke-width="3.6"
       id="path35" />
    <circle
       cx="22"
       cy="22"
       r="6.7771091"
       fill="url(#l)"
       fill-rule="evenodd"
       stroke="#b3b3b3"
       stroke-linejoin="round"
       stroke-width="1.44578"
       id="circle35" />
  </g>
</svg>
