<svg width="32" height="32" version="1.1" xmlns="http://www.w3.org/2000/svg">
 <rect x="2.5" y="2.5" width="27" height="27" rx="2.2" fill="#f0fcff" stroke="#00aad4" stroke-linejoin="round"/>
 <path d="m2.9 2.9h26.2v4.1h-26.2z" fill="#00aad4"/>
 <path d="m20.599999 14.499993 3.600064 2.499996-3.600064 2.499998" fill="none" stroke="#918a6f" stroke-linecap="round" stroke-linejoin="round" stroke-width="1.59999"/>
 <path d="m17.789091 11.799996-3.57818 10.399987" fill="none" stroke="#918a6f" stroke-linecap="round" stroke-linejoin="round" stroke-width="1.59999"/>
 <path d="m11.400001 14.499993-3.6000638 2.499996 3.6000638 2.499998" fill="none" stroke="#918a6f" stroke-linecap="round" stroke-linejoin="round" stroke-width="1.59999"/>
</svg>
