<?xml version="1.0" encoding="UTF-8" standalone="no"?>
<svg
   width="24"
   height="24"
   version="1.1"
   id="svg2979"
   sodipodi:docname="Save_04_24.svg"
   inkscape:export-filename="Save_04_24.png"
   inkscape:export-xdpi="96"
   inkscape:export-ydpi="96"
   inkscape:version="1.2.2 (732a01da63, 2022-12-09)"
   xmlns:inkscape="http://www.inkscape.org/namespaces/inkscape"
   xmlns:sodipodi="http://sodipodi.sourceforge.net/DTD/sodipodi-0.dtd"
   xmlns="http://www.w3.org/2000/svg"
   xmlns:svg="http://www.w3.org/2000/svg">
  <defs
     id="defs2983" />
  <sodipodi:namedview
     id="namedview2981"
     pagecolor="#ffffff"
     bordercolor="#000000"
     borderopacity="0.25"
     inkscape:showpageshadow="2"
     inkscape:pageopacity="0.0"
     inkscape:pagecheckerboard="0"
     inkscape:deskcolor="#d1d1d1"
     showgrid="true"
     inkscape:zoom="37.916667"
     inkscape:cx="11.894505"
     inkscape:cy="12"
     inkscape:current-layer="svg2979">
    <inkscape:grid
       type="xygrid"
       id="grid3102" />
  </sodipodi:namedview>
  <g
     stroke="#00aad4"
     stroke-linejoin="round"
     id="g2977">
    <path
       d="m21.4 21.488-1e-6 -17.808-2.0634-2.08h-16.832c-0.49918 0-0.90385 0.40844-0.90385 0.91228v18.975c-7e-7 0.50384 0.40467 0.91228 0.90385 0.91228h17.992c0.49918 0 0.90385-0.40844 0.90385-0.91228z"
       fill="#c2f3ff"
       fill-rule="evenodd"
       stroke-width="1.2"
       id="path2969" />
    <rect
       x="6.6"
       y="1.6"
       width="9.8"
       height="5.8"
       rx="1.2"
       ry="1.2"
       fill="#ebfcff"
       stroke-width="1.2"
       id="rect2971" />
    <path
       d="m13.5 3v3"
       fill="none"
       stroke-width="2"
       id="path2973" />
    <rect
       x="4.6"
       y="10.6"
       width="13.8"
       height="11.8"
       rx="1.2"
       ry="1.2"
       fill="#ebfcff"
       stroke-width="1.2"
       id="rect2975" />
  </g>
</svg>
