<?xml version="1.0" encoding="UTF-8" standalone="no"?>
<svg
   height="48"
   width="48"
   version="1.1"
   id="svg18"
   sodipodi:docname="Replace_04_48.svg"
   inkscape:export-filename="Replace_04_48.png"
   inkscape:export-xdpi="96"
   inkscape:export-ydpi="96"
   inkscape:version="1.2-beta (1b65182ce9, 2022-04-05)"
   xmlns:inkscape="http://www.inkscape.org/namespaces/inkscape"
   xmlns:sodipodi="http://sodipodi.sourceforge.net/DTD/sodipodi-0.dtd"
   xmlns="http://www.w3.org/2000/svg"
   xmlns:svg="http://www.w3.org/2000/svg">
  <defs
     id="defs22" />
  <sodipodi:namedview
     id="namedview20"
     pagecolor="#ffffff"
     bordercolor="#666666"
     borderopacity="1.0"
     inkscape:pageshadow="2"
     inkscape:pageopacity="0.0"
     inkscape:pagecheckerboard="0"
     inkscape:deskcolor="#d1d1d1"
     showgrid="true"
     inkscape:zoom="19.125"
     inkscape:cx="22.091503"
     inkscape:cy="24"
     inkscape:current-layer="svg18">
    <inkscape:grid
       type="xygrid"
       id="grid147"
       originx="0"
       originy="0" />
  </sodipodi:namedview>
  <g
     id="g1864"
     transform="matrix(3,0,0,3,-0.75,0)">
    <g
       id="g1848"
       transform="matrix(1,0,0,-1,0,17)">
      <path
         style="fill:none;stroke:#00aad4;stroke-width:1px;stroke-linecap:round;stroke-linejoin:miter;stroke-opacity:1"
         d="m 1.5,4.5 c 6.5,0 4.5,8 11,8 H 15"
         id="path1844"
         sodipodi:nodetypes="ccc" />
      <path
         style="fill:none;stroke:#00aad4;stroke-width:1px;stroke-linecap:round;stroke-linejoin:round;stroke-opacity:1"
         d="m 13,10.5 2,2 -2,2"
         id="path1846" />
    </g>
    <g
       id="g1856"
       transform="translate(0,-1)">
      <path
         style="fill:none;stroke:#00aad4;stroke-width:1px;stroke-linecap:round;stroke-linejoin:miter;stroke-opacity:1"
         d="m 1.5,4.5 c 6.5,0 4.5,8 11,8 H 15"
         id="path1852"
         sodipodi:nodetypes="ccc" />
      <path
         style="fill:none;stroke:#00aad4;stroke-width:1px;stroke-linecap:round;stroke-linejoin:round;stroke-opacity:1"
         d="m 13,10.5 2,2 -2,2"
         id="path1854" />
    </g>
  </g>
</svg>
