<?xml version="1.0" encoding="UTF-8" standalone="no"?>
<svg
   height="16"
   width="16"
   version="1.1"
   id="svg151"
   sodipodi:docname="Database_12_16.svg"
   inkscape:export-filename="Database_12_16.png"
   inkscape:export-xdpi="96"
   inkscape:export-ydpi="96"
   inkscape:version="1.2.1 (9c6d41e410, 2022-07-14)"
   xmlns:inkscape="http://www.inkscape.org/namespaces/inkscape"
   xmlns:sodipodi="http://sodipodi.sourceforge.net/DTD/sodipodi-0.dtd"
   xmlns="http://www.w3.org/2000/svg"
   xmlns:svg="http://www.w3.org/2000/svg">
  <defs
     id="defs155" />
  <sodipodi:namedview
     id="namedview153"
     pagecolor="#ffffff"
     bordercolor="#666666"
     borderopacity="1.0"
     inkscape:showpageshadow="2"
     inkscape:pageopacity="0.0"
     inkscape:pagecheckerboard="0"
     inkscape:deskcolor="#d1d1d1"
     showgrid="true"
     inkscape:zoom="57.375"
     inkscape:cx="7.9912854"
     inkscape:cy="8"
     inkscape:current-layer="svg151">
    <inkscape:grid
       type="xygrid"
       id="grid850" />
  </sodipodi:namedview>
  <g
     stroke-linecap="round"
     id="g149">
    <path
       d="m7 1c-3.3136981 0-6 1.045335-6 2.3339844v1.8652344c0 1.2886494 2.6863019 2.3339843 6 2.3339843.2634703 0 .5208878-.0086708.7753906-.0214843.7215585-.659038 1.679844-1.0625 2.7246094-1.0625.423215 0 .832076.06677 1.216797.1894531.801614-.3968196 1.283203-.8958042 1.283203-1.4394531v-1.8652344c0-1.2886494-2.6863-2.3339844-6-2.3339844zm0 1.4003906c2.7722252 0 4.582683.8957954 5.433594 1.6015625-.84888.5790009-2.6542078 1.2373168-5.433594 1.1972657-2.7496639-.0397836-4.5545813-.6862743-5.4140625-1.2382813.8540141-.708314 2.6469732-1.5605469 5.4140625-1.5605469zm-6 4.1992188v2.3339844c0 1.2258072 2.43225 2.2290492 5.5214844 2.3242182-.0472949-.245793-.0722656-.499068-.0722656-.757812-.0000001-.5556327.1141873-1.086371.3203124-1.5703125-3.2059869-.0475167-5.7695312-1.071693-5.7695312-2.3300781zm12 0c0 .2008427-.066743.3960457-.189453.5820312.064362.0451209.127864.091949.189453.140625zm-12 3.7343746v2.332032c0 1.288649 2.6862986 2.333984 6 2.333984 1.3215457 0 2.5398837-.167569 3.53125-.449219-.010457.000081-.020775 0-.03125 0-1.4288235 0-2.6941092-.756508-3.4160156-1.886719-.0282708.000153-.0556204.001954-.0839844.001954-3.3137014 0-6-1.043381-6-2.332032z"
       fill="#00aad4"
       stroke-linejoin="round"
       stroke-miterlimit="5.6"
       stroke-width="2"
       id="path141" />
    <g
       fill="none"
       stroke="#ff7f00"
       transform="translate(-.000219)"
       id="g147">
      <circle
         cx="10.5"
         cy="10.5"
         r="2.85"
         stroke-linejoin="round"
         stroke-width=".8"
         id="circle143" />
      <path
         d="m12.75 12.75 2.55 2.55"
         stroke-width="1.4"
         id="path145" />
    </g>
  </g>
</svg>
