<?xml version="1.0" encoding="UTF-8" standalone="no"?>
<svg
   height="48"
   width="48"
   version="1.1"
   id="svg18"
   sodipodi:docname="File_25_48.svg"
   inkscape:export-filename="File_25_48.png"
   inkscape:export-xdpi="96"
   inkscape:export-ydpi="96"
   inkscape:version="1.2.2 (732a01da63, 2022-12-09)"
   xmlns:inkscape="http://www.inkscape.org/namespaces/inkscape"
   xmlns:sodipodi="http://sodipodi.sourceforge.net/DTD/sodipodi-0.dtd"
   xmlns="http://www.w3.org/2000/svg"
   xmlns:svg="http://www.w3.org/2000/svg">
  <defs
     id="defs22">
    <radialGradient
       id="a"
       cx="9.1740294"
       cy="7.8253603"
       gradientTransform="matrix(0.66909781,-2.2758851e-8,4.5190518e-8,0.58542853,1.8616763,4.291566)"
       gradientUnits="userSpaceOnUse"
       r="7.5"
       fx="9.1740294"
       fy="7.8253603">
      <stop
         offset="0"
         stop-color="#fff"
         id="stop2" />
      <stop
         offset="1"
         stop-color="#8fc1c7"
         id="stop4" />
    </radialGradient>
  </defs>
  <sodipodi:namedview
     id="namedview20"
     pagecolor="#ffffff"
     bordercolor="#666666"
     borderopacity="1.0"
     inkscape:pageshadow="2"
     inkscape:pageopacity="0.0"
     inkscape:pagecheckerboard="0"
     inkscape:deskcolor="#d1d1d1"
     showgrid="true"
     inkscape:zoom="18.958333"
     inkscape:cx="17.010989"
     inkscape:cy="24"
     inkscape:current-layer="svg18"
     inkscape:showpageshadow="2">
    <inkscape:grid
       type="xygrid"
       id="grid147"
       originx="0"
       originy="0" />
  </sodipodi:namedview>
  <rect
     style="fill:#ebfcff;fill-opacity:1;stroke:#00aad4;stroke-width:2.4;stroke-linejoin:round;stroke-dasharray:none;stroke-opacity:1"
     id="rect979"
     width="31.6"
     height="40.600002"
     x="7.1999998"
     y="3.2"
     ry="3.5999999" />
  <path
     id="circle4004"
     style="fill:#ffffff;stroke:#00aad4;stroke-width:1.9;stroke-linejoin:round;stroke-dasharray:none;stroke-dashoffset:1.49998"
     d="m 37.717505,33.499997 a 4.2175045,4.2175045 0 0 1 -4.217504,4.217504 4.2175045,4.2175045 0 0 1 -4.217505,-4.217504 4.2175045,4.2175045 0 0 1 4.217505,-4.217505 4.2175045,4.2175045 0 0 1 4.217504,4.217505 z m -10.031467,-8.142537 -2.325995,2.326643 -4.151209,-1.055565 -1.258858,3.039152 3.681745,2.188952 -4.57e-4,3.289911 -3.678537,2.184427 1.258992,3.039479 4.145741,-1.056496 2.326643,2.325995 -1.055565,4.15121 3.039153,1.258856 2.188951,-3.681741 3.289911,4.55e-4 2.184427,3.678536 3.039479,-1.25899 -1.056496,-4.145744 2.325995,-2.326643 4.15121,1.055566 1.258856,-3.039152 -3.681741,-2.18895 4.55e-4,-3.289912 3.678536,-2.184429 -1.258993,-3.039477 -4.145741,1.056495 -2.326643,-2.325995 1.055566,-4.15121 -3.039152,-1.258857 -2.188954,3.681744 -3.289908,-4.56e-4 -2.184428,-3.678538 -3.039478,1.258993 z" />
</svg>
