<?xml version="1.0" encoding="UTF-8" standalone="no"?>
<svg
   width="24"
   height="24"
   version="1.1"
   viewBox="0 0 24 24"
   id="svg44"
   sodipodi:docname="tsqldblibraryloader.svg"
   inkscape:version="1.3.2 (091e20e, 2023-11-25, custom)"
   xmlns:inkscape="http://www.inkscape.org/namespaces/inkscape"
   xmlns:sodipodi="http://sodipodi.sourceforge.net/DTD/sodipodi-0.dtd"
   xmlns:xlink="http://www.w3.org/1999/xlink"
   xmlns="http://www.w3.org/2000/svg"
   xmlns:svg="http://www.w3.org/2000/svg">
  <sodipodi:namedview
     id="namedview44"
     pagecolor="#ffffff"
     bordercolor="#000000"
     borderopacity="0.25"
     inkscape:showpageshadow="2"
     inkscape:pageopacity="0.0"
     inkscape:pagecheckerboard="0"
     inkscape:deskcolor="#d1d1d1"
     showgrid="true"
     inkscape:current-layer="svg44">
    <inkscape:grid
       id="grid44"
       units="px"
       originx="0"
       originy="0"
       spacingx="0.5"
       spacingy="0.5"
       empcolor="#0099e5"
       empopacity="0.30196078"
       color="#0099e5"
       opacity="0.14901961"
       empspacing="2"
       dotted="false"
       gridanglex="30"
       gridanglez="30"
       visible="true" />
  </sodipodi:namedview>
  <defs
     id="defs18">
    <linearGradient
       id="b">
      <stop
         stop-color="#d4aa00"
         offset="0"
         id="stop1" />
      <stop
         stop-color="#ffcc00"
         offset=".49415526"
         id="stop2" />
      <stop
         stop-color="#d4aa00"
         offset="1"
         id="stop3" />
    </linearGradient>
    <linearGradient
       id="a">
      <stop
         stop-color="#806600"
         offset="0"
         id="stop4" />
      <stop
         stop-color="#d4aa00"
         offset=".48177084"
         id="stop5" />
      <stop
         stop-color="#806600"
         offset="1"
         id="stop6" />
    </linearGradient>
    <linearGradient
       id="c">
      <stop
         stop-color="#502d16"
         offset="0"
         id="stop7" />
      <stop
         stop-color="#a05a2c"
         offset=".50571507"
         id="stop8" />
      <stop
         stop-color="#502d16"
         offset="1"
         id="stop9" />
    </linearGradient>
    <linearGradient
       id="p"
       x1="19"
       x2="22.000001"
       y1="1040.3622"
       y2="1040.3622"
       gradientTransform="translate(-3,-1028.3622)"
       gradientUnits="userSpaceOnUse">
      <stop
         stop-color="#f7bb49"
         offset="0"
         id="stop10" />
      <stop
         stop-color="#ffe680"
         offset=".5"
         id="stop11" />
      <stop
         stop-color="#f7bb49"
         offset="1"
         id="stop12" />
    </linearGradient>
    <linearGradient
       id="o"
       x1="19"
       x2="22"
       y1="1041.3622"
       y2="1041.3622"
       gradientTransform="matrix(1.3333333,0,0,1,-6.3333333,-1028.3622)"
       gradientUnits="userSpaceOnUse">
      <stop
         stop-color="#786755"
         offset="0"
         id="stop13" />
      <stop
         stop-color="#ac9d93"
         offset=".52412927"
         id="stop14" />
      <stop
         stop-color="#786755"
         offset="1"
         id="stop15" />
    </linearGradient>
    <linearGradient
       id="n"
       x1="19"
       x2="22"
       y1="1031.8622"
       y2="1031.8622"
       gradientTransform="matrix(1.3333333,0,0,1,-6.3333333,-1028.3622)"
       gradientUnits="userSpaceOnUse"
       xlink:href="#c" />
    <linearGradient
       id="m"
       x1="19"
       x2="22"
       y1="1050.8622"
       y2="1050.8622"
       gradientTransform="matrix(1.3333333,0,0,1,-6.3333333,-1028.3622)"
       gradientUnits="userSpaceOnUse"
       xlink:href="#c" />
    <linearGradient
       id="l"
       x1="19"
       x2="22"
       y1="1044.8622"
       y2="1044.8622"
       gradientTransform="matrix(1.3333333,0,0,1,-6.3333333,-1028.3622)"
       gradientUnits="userSpaceOnUse"
       xlink:href="#c" />
    <linearGradient
       id="k"
       x1="19"
       x2="22"
       y1="1037.8622"
       y2="1037.8622"
       gradientTransform="matrix(1.3333333,0,0,1,-6.3333333,-1028.3622)"
       gradientUnits="userSpaceOnUse"
       xlink:href="#c" />
    <linearGradient
       id="j"
       x1="16"
       x2="19"
       y1="1029.8622"
       y2="1029.8622"
       gradientUnits="userSpaceOnUse"
       xlink:href="#a"
       gradientTransform="translate(0,-1028.3622)" />
    <linearGradient
       id="i"
       x1="16"
       x2="19"
       y1="1029.8622"
       y2="1029.8622"
       gradientTransform="translate(0,-1007.3622)"
       gradientUnits="userSpaceOnUse"
       xlink:href="#a" />
    <linearGradient
       id="h"
       x1="16"
       x2="19"
       y1="1029.8622"
       y2="1029.8622"
       gradientTransform="translate(0,-1021.3621)"
       gradientUnits="userSpaceOnUse"
       xlink:href="#a" />
    <linearGradient
       id="g"
       x1="16"
       x2="19"
       y1="1029.8622"
       y2="1029.8622"
       gradientTransform="translate(0,-1013.3621)"
       gradientUnits="userSpaceOnUse"
       xlink:href="#a" />
    <linearGradient
       id="f"
       x1="10"
       x2="14"
       y1="1039.3622"
       y2="1039.3622"
       gradientTransform="matrix(0.5,0,0,1,6,-1028.3622)"
       gradientUnits="userSpaceOnUse"
       xlink:href="#b" />
    <linearGradient
       id="e"
       x1="8"
       x2="10"
       y1="1050.8622"
       y2="1050.8622"
       gradientTransform="matrix(1.5,0,0,1,-5,-1028.3622)"
       gradientUnits="userSpaceOnUse"
       xlink:href="#a" />
    <linearGradient
       id="d"
       x1="8"
       x2="10"
       y1="1036.8622"
       y2="1036.8622"
       gradientTransform="matrix(1.5,0,0,1,-5,-1028.3622)"
       gradientUnits="userSpaceOnUse"
       xlink:href="#a" />
    <linearGradient
       id="t"
       x2="3"
       y1="1041.8622"
       y2="1041.8622"
       gradientTransform="translate(5.5408843,-1029.6885)"
       gradientUnits="userSpaceOnUse">
      <stop
         stop-color="#2c89a0"
         offset="0"
         id="stop16" />
      <stop
         stop-color="#5fbcd3"
         offset=".47916666"
         id="stop17" />
      <stop
         stop-color="#2c89a0"
         offset="1"
         id="stop18" />
    </linearGradient>
    <linearGradient
       id="s"
       x2="3"
       y1="1032.8622"
       y2="1032.8622"
       gradientTransform="translate(5.5408843,-1029.6885)"
       gradientUnits="userSpaceOnUse"
       xlink:href="#b" />
    <linearGradient
       id="r"
       x2="3"
       y1="1050.8622"
       y2="1050.8622"
       gradientTransform="translate(5.5408843,-1029.6885)"
       gradientUnits="userSpaceOnUse"
       xlink:href="#b" />
    <linearGradient
       id="q"
       x2="3"
       y1="1043.8622"
       y2="1043.8622"
       gradientTransform="translate(5.5408843,-1029.6885)"
       gradientUnits="userSpaceOnUse"
       xlink:href="#b" />
  </defs>
  <rect
     x="10"
     y="3.9999826"
     width="4"
     height="19.000038"
     fill="#fde511"
     style="fill-rule:evenodd;paint-order:normal"
     id="rect18" />
  <rect
     x="13.999999"
     y="5.9999828"
     width="2.000001"
     height="16.99999"
     fill="#2da9df"
     style="fill-rule:evenodd;paint-order:normal"
     id="rect19" />
  <rect
     x="19"
     y="2.9999826"
     width="4"
     height="19.999966"
     fill="url(#o)"
     style="fill:url(#o);fill-rule:evenodd;paint-order:normal"
     id="rect20" />
  <rect
     x="16"
     y="0.9999826"
     width="3.0000014"
     height="21.999998"
     fill="url(#p)"
     style="fill:url(#p);fill-rule:evenodd;paint-order:normal"
     id="rect21" />
  <rect
     x="7"
     y="7.9999828"
     width="2.9999995"
     height="14.999974"
     fill="#e33f19"
     style="fill-rule:evenodd;paint-order:normal"
     id="rect22" />
  <rect
     x="19"
     y="2.9999826"
     width="4"
     height="1"
     fill="url(#n)"
     style="fill:url(#n);fill-rule:evenodd;paint-order:normal"
     id="rect23" />
  <rect
     x="19"
     y="8.9999828"
     width="4"
     height="1"
     fill="url(#k)"
     style="fill:url(#k);fill-rule:evenodd;paint-order:normal"
     id="rect24" />
  <rect
     x="19"
     y="15.999983"
     width="4"
     height="1"
     fill="url(#l)"
     style="fill:url(#l);fill-rule:evenodd;paint-order:normal"
     id="rect25" />
  <rect
     x="19"
     y="21.999983"
     width="4"
     height="1"
     fill="url(#m)"
     style="fill:url(#m);fill-rule:evenodd;paint-order:normal"
     id="rect26" />
  <rect
     x="16"
     y="0.9999826"
     width="3"
     height="1"
     fill="url(#j)"
     style="fill:url(#j);fill-rule:evenodd;paint-order:normal"
     id="rect27" />
  <rect
     x="16"
     y="21.999983"
     width="3"
     height="1"
     fill="url(#i)"
     style="fill:url(#i);fill-rule:evenodd;paint-order:normal"
     id="rect28" />
  <rect
     x="16"
     y="7.9999828"
     width="3"
     height="1"
     fill="url(#h)"
     style="fill:url(#h);fill-rule:evenodd;paint-order:normal"
     id="rect29" />
  <rect
     x="16"
     y="15.999983"
     width="3"
     height="1"
     fill="url(#g)"
     style="fill:url(#g);fill-rule:evenodd;paint-order:normal"
     id="rect30" />
  <rect
     x="11"
     y="5.9999828"
     width="2"
     height="10"
     fill="url(#f)"
     style="fill:url(#f);fill-rule:evenodd;paint-order:normal"
     id="rect31" />
  <rect
     x="7"
     y="7.9999828"
     width="3"
     height="1"
     fill="url(#d)"
     style="fill:url(#d);fill-rule:evenodd;paint-order:normal"
     id="rect32" />
  <rect
     x="7"
     y="21.999983"
     width="3"
     height="1"
     fill="url(#e)"
     style="fill:url(#e);fill-rule:evenodd;paint-order:normal"
     id="rect33" />
  <rect
     x="8"
     y="9.9999828"
     width="1"
     height="6"
     fill="#aa0000"
     style="fill-rule:evenodd;paint-order:normal"
     id="rect34" />
  <rect
     x="11.5"
     y="7.9999828"
     width="1"
     height="6"
     fill="#ffe680"
     style="fill-rule:evenodd;paint-order:normal"
     id="rect35" />
  <rect
     x="10"
     y="3.9999826"
     width="4"
     height="1"
     fill="#ffcc00"
     style="fill-rule:evenodd;paint-order:normal"
     id="rect36" />
  <rect
     x="10"
     y="21.999983"
     width="4"
     height="1"
     fill="#ffcc00"
     style="fill-rule:evenodd;paint-order:normal"
     id="rect37" />
  <rect
     x="5.5408845"
     y="2.6736257"
     width="3"
     height="19"
     fill="url(#t)"
     style="fill:url(#t);fill-rule:evenodd;paint-order:normal"
     id="rect38"
     transform="rotate(12.368055)" />
  <rect
     x="5.5408845"
     y="2.6736257"
     width="3"
     height="1"
     fill="url(#s)"
     style="fill:url(#s);fill-rule:evenodd;paint-order:normal"
     id="rect39"
     transform="rotate(12.368055)" />
  <rect
     x="5.5408845"
     y="20.673626"
     width="3"
     height="1"
     fill="url(#r)"
     style="fill:url(#r);fill-rule:evenodd;paint-order:normal"
     id="rect40"
     transform="rotate(12.368055)" />
  <rect
     x="6.5408845"
     y="5.6736259"
     width="1"
     height="6"
     fill="#d4aa00"
     style="fill-rule:evenodd;paint-order:normal"
     id="rect41"
     transform="rotate(12.368055)" />
  <rect
     x="5.5408845"
     y="13.673626"
     width="3"
     height="1"
     fill="url(#q)"
     style="fill:url(#q);fill-rule:evenodd;paint-order:normal"
     id="rect42"
     transform="rotate(12.368055)" />
</svg>
