<?xml version="1.0" encoding="UTF-8" standalone="no"?>
<svg
   height="36"
   viewBox="0 0 9.5249997 9.5250005"
   width="36"
   version="1.1"
   id="svg2148"
   sodipodi:docname="Picture_02_36.svg"
   inkscape:export-filename="Picture_02_36.png"
   inkscape:export-xdpi="96"
   inkscape:export-ydpi="96"
   inkscape:version="1.2 (dc2aedaf03, 2022-05-15)"
   xmlns:inkscape="http://www.inkscape.org/namespaces/inkscape"
   xmlns:sodipodi="http://sodipodi.sourceforge.net/DTD/sodipodi-0.dtd"
   xmlns="http://www.w3.org/2000/svg"
   xmlns:svg="http://www.w3.org/2000/svg">
  <defs
     id="defs2152">
    <linearGradient
       id="a-2"
       gradientUnits="userSpaceOnUse"
       x1="31.956079"
       x2="21.043919"
       y1="31.956081"
       y2="21.043919"
       gradientTransform="matrix(0.98513933,0,0,0.98513933,0.3938087,0.3938087)">
      <stop
         offset="0"
         stop-color="#009600"
         id="stop974" />
      <stop
         offset="1"
         stop-color="#6edb39"
         id="stop976" />
    </linearGradient>
  </defs>
  <sodipodi:namedview
     id="namedview2150"
     pagecolor="#ffffff"
     bordercolor="#666666"
     borderopacity="1.0"
     inkscape:showpageshadow="2"
     inkscape:pageopacity="0.0"
     inkscape:pagecheckerboard="0"
     inkscape:deskcolor="#d1d1d1"
     showgrid="true"
     inkscape:zoom="25.5"
     inkscape:cx="17.392157"
     inkscape:cy="18"
     inkscape:current-layer="svg2148">
    <inkscape:grid
       type="xygrid"
       id="grid3990" />
  </sodipodi:namedview>
  <linearGradient
     id="a"
     gradientTransform="matrix(1.0666667,0,0,1.0909091,-0.533333,-0.727273)"
     gradientUnits="userSpaceOnUse"
     x1="11.75"
     x2="12.21875"
     y1="3.416667"
     y2="7.541667">
    <stop
       offset="0"
       stop-color="#99c2ff"
       id="stop2110" />
    <stop
       offset="1"
       stop-color="#e5eeff"
       id="stop2112" />
  </linearGradient>
  <linearGradient
     id="b"
     gradientTransform="matrix(1.0666667,0,0,1.0833381,-0.533333,-1.625064)"
     gradientUnits="userSpaceOnUse"
     x1="10.34375"
     x2="9.875"
     y1="13.5"
     y2="7.500026">
    <stop
       offset="0"
       stop-color="#aade87"
       id="stop2115" />
    <stop
       offset="1"
       stop-color="#0a0"
       id="stop2117" />
  </linearGradient>
  <g
     transform="matrix(0.59531251,0,0,0.59531251,0,-0.66145835)"
     id="g2146">
    <path
       d="M 16,14 H 0 V 2 h 16 z"
       fill="url(#a)"
       id="path2120"
       style="fill:url(#a)" />
    <path
       d="M 16,10 C 14.333333,8.3333333 12.5,5 11,5 9.5,5 7.5,10.5 6.5,10.5 c -1,0 -2,-2 -3,-2 -1.1042859,0 -2.3333333,2 -3.5,3 V 14 h 16 z"
       fill="url(#b)"
       id="path2122"
       style="fill:url(#b)" />
    <g
       fill="none"
       id="g2140">
      <path
         d="m 5.5,3.5 v 1"
         stroke="#ffd42a"
         stroke-linecap="round"
         stroke-width="0.5"
         id="path2124" />
      <path
         d="M 6.9142136,4.0857864 6.2071068,4.7928932"
         stroke="#ffd42a"
         stroke-linecap="round"
         stroke-width="0.5"
         id="path2126" />
      <path
         d="M 4.0857864,4.0857864 4.7928932,4.7928932"
         stroke="#ffd42a"
         stroke-linecap="round"
         stroke-width="0.5"
         id="path2128" />
      <path
         d="m 3.5,5.5 h 1"
         stroke="#ffd42a"
         stroke-linecap="round"
         stroke-width="0.5"
         id="path2130" />
      <path
         d="M 4.0857864,6.9142136 4.7928932,6.2071068"
         stroke="#ffd42a"
         stroke-linecap="round"
         stroke-width="0.5"
         id="path2132" />
      <path
         d="m 5.5,7.5 v -1"
         stroke="#ffd42a"
         stroke-linecap="round"
         stroke-width="0.5"
         id="path2134" />
      <path
         d="M 6.9142136,6.9142136 6.2071068,6.2071068"
         stroke="#ffd42a"
         stroke-linecap="round"
         stroke-width="0.5"
         id="path2136" />
      <path
         d="m 7.5,5.5 h -1"
         stroke="#ffd42a"
         stroke-linecap="round"
         stroke-width="0.5"
         id="path2138" />
    </g>
    <circle
       cx="5.5"
       cy="5.5"
       fill="#ffe680"
       r="1.25"
       id="circle2142" />
    <path
       d="M 0.259471,2.259471 H 15.740528 V 13.740528 H 0.259471 Z"
       fill="none"
       stroke="#ffffff"
       stroke-linecap="round"
       stroke-width="0.518942"
       id="path2144" />
  </g>
  <g
     id="g5850"
     transform="scale(0.26458334)">
    <circle
       cx="26.5"
       cy="26.5"
       fill="url(#a)"
       stroke-dashoffset="1.49998"
       stroke-linejoin="round"
       stroke-width="1.54054"
       transform="matrix(0,1,1,0,0,0)"
       id="circle979"
       style="fill:url(#a-2);stroke:#ffffff;stroke-width:1.8;stroke-linecap:round;stroke-dasharray:none"
       r="8.6000004" />
    <g
       fill="none"
       stroke-width="2.5"
       transform="translate(1,1)"
       id="g985"
       style="stroke:#ffffff;stroke-linecap:round">
      <path
         d="m 25.5,21.5 v 8"
         id="path981" />
      <path
         d="m 29.5,25.5 h -8"
         id="path983" />
    </g>
  </g>
</svg>
