<svg width="48" height="48" version="1.1" xmlns="http://www.w3.org/2000/svg">
 <g stroke="#ff7f00" stroke-linecap="round" stroke-linejoin="round" stroke-width="2.4">
  <circle transform="matrix(0,1,1,0,0,0)" cx="34.5" cy="34.5" r="12.3" fill="#ffffff" stroke-dashoffset="1.49998"/>
  <path d="m32.5 28.5 6 6-6 6" fill="none"/>
 </g>
</svg>
