<?xml version="1.0" encoding="UTF-8" standalone="no"?>
<svg
   width="24"
   height="24"
   version="1.1"
   id="svg10"
   sodipodi:docname="menu_configure_build_lazarus_150.svg"
   inkscape:export-filename="menu_configure_build_lazarus_150.png"
   inkscape:export-xdpi="96"
   inkscape:export-ydpi="96"
   inkscape:version="1.3.2 (091e20e, 2023-11-25, custom)"
   xmlns:inkscape="http://www.inkscape.org/namespaces/inkscape"
   xmlns:sodipodi="http://sodipodi.sourceforge.net/DTD/sodipodi-0.dtd"
   xmlns="http://www.w3.org/2000/svg"
   xmlns:svg="http://www.w3.org/2000/svg">
  <sodipodi:namedview
     id="namedview10"
     pagecolor="#ffffff"
     bordercolor="#000000"
     borderopacity="0.25"
     inkscape:showpageshadow="2"
     inkscape:pageopacity="0.0"
     inkscape:pagecheckerboard="0"
     inkscape:deskcolor="#d1d1d1"
     showgrid="true"
     inkscape:current-layer="svg10">
    <inkscape:grid
       id="grid10"
       units="px"
       originx="0"
       originy="0"
       spacingx="0.5"
       spacingy="0.5"
       empcolor="#0099e5"
       empopacity="0.30196078"
       color="#0099e5"
       opacity="0.14901961"
       empspacing="2"
       dotted="false"
       gridanglex="30"
       gridanglez="30"
       visible="true" />
  </sodipodi:namedview>
  <defs
     id="defs6">
    <linearGradient
       id="b"
       x1="5.4640584"
       x2="7.5116959"
       y1="9.4888191"
       y2="11.536456"
       gradientTransform="matrix(1.6077673,0,0,1.6077673,2.0107925,-1.3426068)"
       gradientUnits="userSpaceOnUse">
      <stop
         stop-color="#d40000"
         offset="0"
         id="stop1" />
      <stop
         stop-color="#ff8989"
         offset=".15760632"
         id="stop2" />
      <stop
         stop-color="#d40000"
         offset=".88542914"
         id="stop3" />
      <stop
         stop-color="#970000"
         offset="1"
         id="stop4" />
    </linearGradient>
    <radialGradient
       id="a"
       cx="15.071531"
       cy="1033.4419"
       r="3.4872861"
       gradientTransform="matrix(.05390583 -2.0714092 -2.0738642 .03263686 2159.6017 8.2949105)"
       gradientUnits="userSpaceOnUse">
      <stop
         stop-color="#fff"
         offset="0"
         id="stop5" />
      <stop
         stop-color="#ccc"
         offset="1"
         id="stop6" />
    </radialGradient>
  </defs>
  <path
     d="m9.8125 0.5-0.3964844 3.1660156-1.7734375 0.7363281-2.5214844-1.9609374-1.6796874 1.6796874 1.9609374 2.5195313-0.7363281 1.7753906-3.1660156 0.3964844v2.375l3.1660156 0.396484 0.7363281 1.775391-1.9609374 2.519531 1.6796874 1.679688 2.5214844-1.960938 0.2324219 0.0957c1.0825103-1.036375 1.8019447-1.724951 2.677734-2.562497-1.5367073-0.217652-2.7187497-1.534059-2.7187496-3.130859-7e-7 -1.7489013 1.4171145-3.1660166 3.1660156-3.1660156 0.924641 0 1.753095 0.3992422 2.332031 1.03125 0.117949-0.4763302 0.3152-0.9581519 0.63086-1.4316407 0.971872-1.4578083 2.265233-2.474257 3.65039-2.9609374 0.07475-0.026262 0.150935-0.047272 0.226563-0.070312l-0.960938-0.960938-2.519531 1.9609374-1.775391-0.7363281-0.396484-3.1660156z"
     fill="#aaccff"
     fill-rule="evenodd"
     stroke-linejoin="round"
     id="path6"
     style="fill:#37c837;fill-opacity:1" />
  <path
     d="m10.113281 13.552734c0.322732-0.30868 0.648812-0.621964 0.927735-0.888671-0.01381 2.07e-4 -0.02716 2e-3 -0.04102 2e-3 -1.4786751-4.7e-5 -2.6660117-1.187384-2.6660116-2.666063-6e-7 -1.4786798 1.187336-2.6660165 2.6660156-2.6660156 0.927298 0 1.739626 0.4667737 2.216797 1.1796875 0.037494-0.3900887 0.128582-0.7878228 0.283203-1.1855469-0.655981-0.6141568-1.534158-0.9941406-2.5-0.9941406-2.019119-1.2e-6 -3.6660164 1.6468964-3.6660156 3.6660156-1e-7 1.712763 1.1872406 3.153696 2.7792966 3.552734z"
     fill="#457abe"
     fill-rule="evenodd"
     stroke-linejoin="round"
     id="path7"
     style="fill:#217821;fill-opacity:1" />
  <path
     d="m9.8125 0a0.50005 0.50005 0 0 0-0.4960937 0.4375l-0.3593751 2.8789063-1.2382812 0.5136718-2.2910156-1.7832031a0.50005 0.50005 0 0 0-0.6601563 0.0410156l-1.6796875 1.6796875a0.50005 0.50005 0 0 0-0.0410156 0.6601563l1.7832031 2.2910156-0.5136718 1.2382812-2.8789063 0.3593751a0.50005 0.50005 0 0 0-0.4375 0.4960937v2.375a0.50005 0.50005 0 0 0 0.4375 0.496094l2.8789063 0.359375 0.5136718 1.238281-1.7832031 2.291016a0.50005 0.50005 0 0 0 0.041016 0.660156l1.6796875 1.679687a0.50005 0.50005 0 0 0 0.6601563 0.04102l0.4726562-0.367188c0.9171515-0.87941 1.4206102-1.361615 2.3691406-2.269531l-0.4355468-0.18164a0.50005 0.50005 0 0 0-0.5 0.06836l-2.1718754 1.689448-1.0546875-1.054687 1.6894531-2.171875a0.50005 0.50005 0 0 0 0.068359-0.5l-0.7363278-1.773438a0.50005 0.50005 0 0 0-0.4003906-0.304687l-2.7285156-0.341797v-1.4921877l2.7285156-0.3417969a0.50005 0.50005 0 0 0 0.4003906-0.3046875l0.7363282-1.7734375a0.50005 0.50005 0 0 0-0.068359-0.5l-1.6894535-2.171875 1.0546875-1.0546875 2.171875 1.6894531a0.50005 0.50005 0 0 0 0.5 0.068359l1.7734375-0.7363278a0.50005 0.50005 0 0 0 0.3046875-0.4003906l0.3417966-2.7285156h1.492188l0.341797 2.7285156a0.50005 0.50005 0 0 0 0.304687 0.4003906l1.773438 0.7363282a0.50005 0.50005 0 0 0 0.5-0.068359l2.171875-1.6894531 0.482421 0.4824219c0.09763-0.040011 0.194322-0.082527 0.292969-0.1171875 0.258314-0.090759 0.523905-0.1617197 0.791016-0.2128907l-1.171875-1.1718754a0.50005 0.50005 0 0 0-0.660156-0.0410156l-2.291016 1.7832031-1.238281-0.5136718-0.359375-2.8789063a0.50005 0.50005 0 0 0-0.496094-0.4375z"
     fill="#457abe"
     fill-rule="evenodd"
     stroke-linejoin="round"
     id="path8"
     style="fill:#217821;fill-opacity:1" />
  <g
     transform="translate(.89999997 .10029028)"
     fill-rule="evenodd"
     id="g10">
    <path
       d="m14.382203 10.804204s-5.806361 5.538632-9.1558757 8.754167c-2.4262045 2.329156 0.8462613 5.669425 3.2155347 3.215535l8.753934-9.15611z"
       fill="url(#b)"
       stroke-width="1.60777"
       id="path9" />
    <path
       d="m20.411651 13.617476c2.308303-1.538868 2.993225-3.9829232 2.009709-5.2252434l-2.009709 2.0097114-2.411651-0.401944-0.401942-2.4116533 2.009709-2.0097069c-1.24232-0.9835166-3.686375-0.2985936-5.225244 2.0097092-1.607767 2.411651 0.803884 4.42136 1.205826 4.823302s2.411651 2.813593 4.823302 1.205825z"
       fill="url(#a)"
       stroke="#808080"
       stroke-width=".401942"
       id="path10" />
  </g>
</svg>
