<?xml version="1.0" encoding="UTF-8" standalone="no"?>
<svg
   height="32"
   width="32"
   version="1.1"
   id="svg290"
   sodipodi:docname="Search_06_32.svg"
   inkscape:export-filename="Search_06_32.png"
   inkscape:export-xdpi="96"
   inkscape:export-ydpi="96"
   inkscape:version="1.2.1 (9c6d41e410, 2022-07-14)"
   xmlns:inkscape="http://www.inkscape.org/namespaces/inkscape"
   xmlns:sodipodi="http://sodipodi.sourceforge.net/DTD/sodipodi-0.dtd"
   xmlns="http://www.w3.org/2000/svg"
   xmlns:svg="http://www.w3.org/2000/svg">
  <defs
     id="defs294" />
  <sodipodi:namedview
     id="namedview292"
     pagecolor="#ffffff"
     bordercolor="#666666"
     borderopacity="1.0"
     inkscape:showpageshadow="2"
     inkscape:pageopacity="0.0"
     inkscape:pagecheckerboard="0"
     inkscape:deskcolor="#d1d1d1"
     showgrid="true"
     inkscape:zoom="28.6875"
     inkscape:cx="16"
     inkscape:cy="16"
     inkscape:current-layer="g288">
    <inkscape:grid
       type="xygrid"
       id="grid958" />
  </sodipodi:namedview>
  <g
     fill="none"
     stroke="#00aad4"
     stroke-linecap="round"
     id="g288">
    <path
       d="m23.7 12.999611c.00099 5.908949-4.789853 10.699611-10.7 10.699611-5.9101462 0-10.7009893-4.790662-10.6999997-10.699611-.0009896-5.9089485 4.7898535-10.6996106 10.6999997-10.6996106 5.910147 0 10.70099 4.7906621 10.7 10.6996106z"
       stroke-linejoin="round"
       stroke-width="1.6"
       id="path278" />
    <path
       d="m22 21.999532 7 7.000468"
       stroke-width="5"
       id="path280" />
    <path
       style="fill:none;stroke:#00aad4;stroke-width:1.2;stroke-linecap:butt;stroke-linejoin:round;stroke-dasharray:none;stroke-opacity:1"
       d="M 8.6000003,7.6000001 H 17.4 V 18.4 H 8.6000003 Z"
       id="path914" />
    <path
       style="fill:none;stroke:#00aad4;stroke-width:1.2;stroke-linecap:butt;stroke-linejoin:miter;stroke-dasharray:none;stroke-opacity:1"
       d="m 11,10.6 h 4"
       id="path1545" />
    <path
       style="fill:none;stroke:#00aad4;stroke-width:1.2;stroke-linecap:butt;stroke-linejoin:miter;stroke-dasharray:none;stroke-opacity:1"
       d="m 11,13.6 h 4"
       id="path1892" />
  </g>
</svg>
