<?xml version="1.0" encoding="UTF-8" standalone="no"?>
<svg
   width="24"
   height="24"
   version="1.1"
   id="svg183"
   sodipodi:docname="menu_search_jumpback_150.svg"
   inkscape:export-filename="menu_search_jumpback_150.png"
   inkscape:export-xdpi="96"
   inkscape:export-ydpi="96"
   inkscape:version="1.2.2 (732a01da63, 2022-12-09)"
   xmlns:inkscape="http://www.inkscape.org/namespaces/inkscape"
   xmlns:sodipodi="http://sodipodi.sourceforge.net/DTD/sodipodi-0.dtd"
   xmlns="http://www.w3.org/2000/svg"
   xmlns:svg="http://www.w3.org/2000/svg">
  <sodipodi:namedview
     id="namedview185"
     pagecolor="#ffffff"
     bordercolor="#666666"
     borderopacity="1.0"
     inkscape:showpageshadow="2"
     inkscape:pageopacity="0.0"
     inkscape:pagecheckerboard="0"
     inkscape:deskcolor="#d1d1d1"
     showgrid="true"
     inkscape:zoom="38.25"
     inkscape:cx="10.69281"
     inkscape:cy="12"
     inkscape:current-layer="svg183">
    <inkscape:grid
       type="xygrid"
       id="grid578" />
  </sodipodi:namedview>
  <defs
     id="defs163" />
  <g
     transform="matrix(0,1.5,-1.5,0,27,7.45)"
     fill="none"
     stroke="#ff0000"
     stroke-linecap="round"
     id="g27"
     style="stroke-width:2;stroke-dasharray:none">
    <path
       d="M -0.8,11.5 2.7,15 6.2,11.5"
       stroke-linejoin="round"
       id="path23"
       style="stroke-width:2;stroke-dasharray:none"
       sodipodi:nodetypes="ccc" />
    <path
       d="M 2.7,15 V 5"
       id="path25"
       style="stroke-width:2;stroke-dasharray:none"
       sodipodi:nodetypes="cc" />
  </g>
</svg>
