<?xml version="1.0" encoding="UTF-8" standalone="no"?>
<svg
   width="16"
   height="16"
   version="1.1"
   viewBox="0 0 4.2333 4.2333"
   id="svg28"
   sodipodi:docname="menu_edit_select_word.svg"
   inkscape:export-filename="menu_edit_select_word.png"
   inkscape:export-xdpi="96"
   inkscape:export-ydpi="96"
   inkscape:version="1.2.1 (9c6d41e410, 2022-07-14)"
   xmlns:inkscape="http://www.inkscape.org/namespaces/inkscape"
   xmlns:sodipodi="http://sodipodi.sourceforge.net/DTD/sodipodi-0.dtd"
   xmlns="http://www.w3.org/2000/svg"
   xmlns:svg="http://www.w3.org/2000/svg">
  <defs
     id="defs32" />
  <sodipodi:namedview
     id="namedview30"
     pagecolor="#ffffff"
     bordercolor="#666666"
     borderopacity="1.0"
     inkscape:showpageshadow="2"
     inkscape:pageopacity="0.0"
     inkscape:pagecheckerboard="0"
     inkscape:deskcolor="#d1d1d1"
     showgrid="true"
     inkscape:zoom="57.375"
     inkscape:cx="7.0239651"
     inkscape:cy="8"
     inkscape:current-layer="svg28">
    <inkscape:grid
       type="xygrid"
       id="grid585" />
  </sodipodi:namedview>
  <path
     d="m 0.79374377,0.13229003 2.91033773,-2e-8"
     id="path4"
     style="fill:none;stroke:#d4aa00;stroke-width:0.26458" />
  <path
     d="M 0.79374377,2.77814 H 3.7040815"
     id="path6"
     style="fill:none;stroke:#d4aa00;stroke-width:0.26458" />
  <path
     d="M 0.79374377,0.66144003 H 3.7040815"
     id="path8"
     style="fill:none;stroke:#d4aa00;stroke-width:0.26458" />
  <path
     d="m 0.7937782,1.1906181 0.529128,-2.5e-6"
     id="path10"
     style="fill:none;stroke:#d4aa00;stroke-width:0.26458"
     sodipodi:nodetypes="cc" />
  <path
     d="m 1.5875,1.19064 0.7937313,-2.19e-5"
     stroke="#2a7fff"
     id="path16"
     style="fill:none;stroke-width:0.396872;stroke-dasharray:none"
     sodipodi:nodetypes="cc" />
  <path
     d="M 0.79374377,3.30724 H 3.7040815"
     id="path18"
     style="fill:none;stroke:#d4aa00;stroke-width:0.26458" />
  <path
     d="M 0.79374377,2.24894 H 3.7040815"
     id="path20"
     style="fill:none;stroke:#d4aa00;stroke-width:0.26458" />
  <path
     d="M 0.79374377,1.71974 H 3.7040815"
     id="path22"
     style="fill:none;stroke:#d4aa00;stroke-width:0.26458" />
  <path
     d="M 0.79379977,3.8364281 H 3.7041375"
     id="path583"
     style="fill:none;stroke:#d4aa00;stroke-width:0.26458" />
  <path
     d="m 2.6458125,1.1906156 h 1.058325"
     id="path296"
     style="fill:none;stroke:#d4aa00;stroke-width:0.26458"
     sodipodi:nodetypes="cc" />
</svg>
