<?xml version="1.0" encoding="UTF-8" standalone="no"?>
<svg
   height="36"
   width="36"
   version="1.1"
   id="svg49"
   sodipodi:docname="24_row_up_150.svg"
   inkscape:export-filename="24_row_up_150.png"
   inkscape:export-xdpi="96"
   inkscape:export-ydpi="96"
   inkscape:version="1.1.2 (0a00cf5339, 2022-02-04, custom)"
   xmlns:inkscape="http://www.inkscape.org/namespaces/inkscape"
   xmlns:sodipodi="http://sodipodi.sourceforge.net/DTD/sodipodi-0.dtd"
   xmlns:xlink="http://www.w3.org/1999/xlink"
   xmlns="http://www.w3.org/2000/svg"
   xmlns:svg="http://www.w3.org/2000/svg">
  <defs
     id="defs887">
    <linearGradient
       inkscape:collect="always"
       xlink:href="#linearGradient28615"
       id="linearGradient28617-8"
       x1="9"
       y1="10"
       x2="6"
       y2="10.5"
       gradientUnits="userSpaceOnUse"
       gradientTransform="matrix(0,-1.4166667,-1.5,0,24,23.527778)" />
    <linearGradient
       inkscape:collect="always"
       id="linearGradient28615">
      <stop
         style="stop-color:#72cef6;stop-opacity:1"
         offset="0"
         id="stop28611" />
      <stop
         style="stop-color:#d2f5f8;stop-opacity:1"
         offset="1"
         id="stop28613" />
    </linearGradient>
    <linearGradient
       inkscape:collect="always"
       xlink:href="#linearGradient17975"
       id="linearGradient17977-2"
       x1="10"
       y1="12.5"
       x2="5"
       y2="12.5"
       gradientUnits="userSpaceOnUse"
       gradientTransform="matrix(0,-1.4166667,-1.5,0,24,23.527778)" />
    <linearGradient
       inkscape:collect="always"
       id="linearGradient17975">
      <stop
         style="stop-color:#4674a8;stop-opacity:1"
         offset="0"
         id="stop17971" />
      <stop
         style="stop-color:#42a0ce;stop-opacity:1"
         offset="1"
         id="stop17973" />
    </linearGradient>
  </defs>
  <sodipodi:namedview
     id="namedview885"
     pagecolor="#ffffff"
     bordercolor="#666666"
     borderopacity="1.0"
     inkscape:pageshadow="2"
     inkscape:pageopacity="0.0"
     inkscape:pagecheckerboard="0"
     showgrid="true"
     inkscape:zoom="25.333333"
     inkscape:cx="14.56579"
     inkscape:cy="18"
     inkscape:current-layer="svg49">
    <inkscape:grid
       type="xygrid"
       id="grid1354" />
  </sodipodi:namedview>
  <g
     id="g999"
     transform="matrix(0,-1.5,-1.5,0,45.000001,44.999998)">
    <rect
       style="fill:#ffffff;stroke:#999999;stroke-width:1.02128;stroke-linecap:round;stroke-linejoin:round;stroke-miterlimit:4;stroke-dasharray:none;stroke-dashoffset:1.49998;stroke-opacity:1"
       id="rect1279"
       width="22.978724"
       height="22.978724"
       x="-29.489361"
       y="6.5106392"
       transform="rotate(-90)" />
    <g
       id="g847"
       transform="matrix(0,-1,-1,0,30,30)">
      <path
         style="fill:none;stroke:#b3b3b3;stroke-width:1;stroke-linecap:butt;stroke-linejoin:miter;stroke-miterlimit:4;stroke-dasharray:none;stroke-opacity:1"
         d="M 1,18.5 H 23"
         id="path1586"
         sodipodi:nodetypes="cc" />
      <path
         style="fill:none;stroke:#b3b3b3;stroke-width:1;stroke-linecap:butt;stroke-linejoin:miter;stroke-miterlimit:4;stroke-dasharray:none;stroke-opacity:1"
         d="M 6.5,23 V 1"
         id="path1725"
         sodipodi:nodetypes="cc" />
      <path
         style="fill:none;stroke:#b3b3b3;stroke-width:1;stroke-linecap:butt;stroke-linejoin:miter;stroke-miterlimit:4;stroke-dasharray:none;stroke-opacity:1"
         d="M 23,5.5 H 1"
         id="path1729"
         sodipodi:nodetypes="cc" />
      <path
         style="fill:none;stroke:#b3b3b3;stroke-width:1;stroke-linecap:butt;stroke-linejoin:miter;stroke-miterlimit:4;stroke-dasharray:none;stroke-opacity:1"
         d="M 18.5,23 V 1"
         id="path1373"
         sodipodi:nodetypes="cc" />
      <path
         style="fill:none;stroke:#b3b3b3;stroke-width:1;stroke-linecap:butt;stroke-linejoin:miter;stroke-miterlimit:4;stroke-dasharray:none;stroke-opacity:1"
         d="M 12.5,23 V 1"
         id="path1375"
         sodipodi:nodetypes="cc" />
    </g>
  </g>
  <g
     id="g840"
     transform="matrix(1.5,0,0,-1.5,10e-7,38.999998)">
    <g
       id="g990">
      <rect
         style="opacity:0.5;fill:none;stroke:#ffffff;stroke-width:1;stroke-linejoin:round;stroke-dashoffset:1.49998"
         id="rect1021"
         width="23"
         height="7.6666665"
         x="0.5"
         y="-16.5"
         transform="scale(1,-1)" />
      <path
         style="fill:url(#linearGradient28617-8);fill-opacity:1;stroke:url(#linearGradient17977-2);stroke-width:0.999999;stroke-linecap:round;stroke-linejoin:round;stroke-miterlimit:4;stroke-dasharray:none;stroke-opacity:1"
         d="M 23.5,15.5 H 0.5 V 9.8333333 h 23 z"
         id="path17870-1"
         sodipodi:nodetypes="ccccc" />
    </g>
  </g>
  <g
     id="g12410"
     transform="matrix(0,-2.25,-2.25,0,40.500002,36.349998)">
    <g
       id="g12059"
       transform="translate(-19.5,11)"
       style="stroke:#ffffff;stroke-width:3;stroke-miterlimit:4;stroke-dasharray:none;stroke-opacity:0.996078">
      <path
         style="opacity:0.7;fill:none;stroke:#ffffff;stroke-width:3;stroke-linecap:round;stroke-linejoin:miter;stroke-miterlimit:4;stroke-dasharray:none;stroke-opacity:0.996078"
         d="M 27.5,-1 H 31"
         id="path11239"
         sodipodi:nodetypes="cc" />
      <path
         style="opacity:0.7;fill:none;stroke:#ffffff;stroke-width:3;stroke-linecap:round;stroke-linejoin:round;stroke-miterlimit:4;stroke-dasharray:none;stroke-opacity:0.996078"
         d="m 31.5,-4 3,3 -3,3"
         id="path11241" />
    </g>
    <g
       id="g1791"
       style="stroke:#4574c7;stroke-opacity:0.996078">
      <path
         style="fill:none;stroke:#3771c8;stroke-width:2;stroke-linecap:round;stroke-linejoin:miter;stroke-miterlimit:4;stroke-dasharray:none;stroke-opacity:0.996078"
         d="m 8,10 h 7"
         id="path1606" />
      <path
         style="fill:none;stroke:#3771c8;stroke-width:2;stroke-linecap:round;stroke-linejoin:round;stroke-miterlimit:4;stroke-dasharray:none;stroke-opacity:0.996078"
         d="m 12,7 3,3 -3,3"
         id="path1641" />
    </g>
  </g>
</svg>
