<?xml version="1.0" encoding="UTF-8" standalone="no"?>
<svg
   width="16"
   height="16"
   version="1.1"
   id="svg9762"
   sodipodi:docname="menu_saveas.svg"
   inkscape:export-filename="menu_saveas.png"
   inkscape:export-xdpi="96"
   inkscape:export-ydpi="96"
   inkscape:version="1.2.2 (732a01da63, 2022-12-09)"
   xmlns:inkscape="http://www.inkscape.org/namespaces/inkscape"
   xmlns:sodipodi="http://sodipodi.sourceforge.net/DTD/sodipodi-0.dtd"
   xmlns:xlink="http://www.w3.org/1999/xlink"
   xmlns="http://www.w3.org/2000/svg"
   xmlns:svg="http://www.w3.org/2000/svg">
  <defs
     id="defs9766">
    <linearGradient
       inkscape:collect="always"
       id="linearGradient2863">
      <stop
         style="stop-color:#2a7fff;stop-opacity:1;"
         offset="0"
         id="stop2859" />
      <stop
         style="stop-color:#66a4ff;stop-opacity:1;"
         offset="1"
         id="stop2861" />
    </linearGradient>
    <linearGradient
       inkscape:collect="always"
       xlink:href="#linearGradient2863"
       id="linearGradient2865"
       x1="14.5"
       y1="15.5"
       x2="0.5"
       y2="0.5"
       gradientUnits="userSpaceOnUse" />
  </defs>
  <sodipodi:namedview
     id="namedview9764"
     pagecolor="#ffffff"
     bordercolor="#666666"
     borderopacity="1.0"
     inkscape:showpageshadow="2"
     inkscape:pageopacity="0.0"
     inkscape:pagecheckerboard="0"
     inkscape:deskcolor="#d1d1d1"
     showgrid="true"
     inkscape:zoom="57.375"
     inkscape:cx="7.3551198"
     inkscape:cy="8"
     inkscape:current-layer="svg9762">
    <inkscape:grid
       type="xygrid"
       id="grid10072" />
  </sodipodi:namedview>
  <linearGradient
     id="c"
     x1="14.084"
     x2="8.9155"
     y1="14.084"
     y2="8.9155"
     gradientTransform="matrix(.96732 0 0 .96732 .37581 .37581)"
     gradientUnits="userSpaceOnUse">
    <stop
       stop-color="#009600"
       offset="0"
       id="stop9728" />
    <stop
       stop-color="#6edb39"
       offset="1"
       id="stop9730" />
  </linearGradient>
  <linearGradient
     id="d"
     x1="13.53"
     x2="13.53"
     y1="3.5"
     y2="8.75"
     gradientTransform="matrix(.94406 0 0 .95238 -4.7727 -3.3333)"
     gradientUnits="userSpaceOnUse">
    <stop
       stop-color="#ececec"
       offset="0"
       id="stop9733" />
    <stop
       stop-color="#b7bec8"
       offset="1"
       id="stop9735" />
  </linearGradient>
  <path
     d="m-4e-8 0h13.5l1.5 1.5v14.5h-15z"
     fill="#2a7fff"
     fill-rule="evenodd"
     id="path9738"
     style="fill-opacity:1;fill:url(#linearGradient2865)" />
  <rect
     x="2"
     y="7"
     width="11"
     height="8"
     rx=".5"
     fill="#fff"
     id="rect9740" />
  <path
     d="m4 0v5h8v-5zm5 1h2v3h-2z"
     fill="url(#d)"
     fill-rule="evenodd"
     id="path9742" />
  <g
     fill="none"
     id="g9750">
    <path
       d="m3 9.5h9"
       stroke="#e6e6e6"
       id="path9744" />
    <path
       d="m3 11.5h9"
       stroke="#e6e6e6"
       id="path9746" />
    <path
       d="m2 14.5h11"
       stroke="#f60"
       id="path9748" />
  </g>
  <g
     stroke="#fff"
     stroke-linecap="round"
     id="g9760">
    <circle
       transform="matrix(0 1 1 0 0 0)"
       cx="11.5"
       cy="11.5"
       r="4"
       fill="url(#c)"
       stroke-dashoffset="1.5"
       stroke-linejoin="round"
       id="circle9752" />
    <g
       fill="none"
       id="g9758">
      <path
         d="m11.5 9.5v4"
         id="path9754" />
      <path
         d="m13.5 11.5h-4"
         id="path9756" />
    </g>
  </g>
</svg>
