<svg width="16" height="16" version="1.0" xmlns="http://www.w3.org/2000/svg">
 <rect x=".25" y="3.75" width="15.5" height="11" fill="#f9f9f9" stroke="#2a7efe" stroke-width=".5" style="paint-order:normal"/>
 <path d="m1.4 1h13.2c0.7 0 1.4 0.7 1.4 1.4v1.6h-16v-1.6c0-0.7 0.7-1.4 1.4-1.4z" fill="#2a7efe"/>
</svg>
