<?xml version="1.0" encoding="UTF-8" standalone="no"?>
<svg
   height="32"
   width="32"
   version="1.1"
   id="svg433"
   sodipodi:docname="Folder_04_32.svg"
   inkscape:export-filename="Folder_04_32.png"
   inkscape:export-xdpi="96"
   inkscape:export-ydpi="96"
   inkscape:version="1.2-beta (1b65182ce9, 2022-04-05)"
   xmlns:inkscape="http://www.inkscape.org/namespaces/inkscape"
   xmlns:sodipodi="http://sodipodi.sourceforge.net/DTD/sodipodi-0.dtd"
   xmlns="http://www.w3.org/2000/svg"
   xmlns:svg="http://www.w3.org/2000/svg">
  <defs
     id="defs437" />
  <sodipodi:namedview
     id="namedview435"
     pagecolor="#ffffff"
     bordercolor="#666666"
     borderopacity="1.0"
     inkscape:pageshadow="2"
     inkscape:pageopacity="0.0"
     inkscape:pagecheckerboard="0"
     inkscape:deskcolor="#d1d1d1"
     showgrid="true"
     inkscape:zoom="28.6875"
     inkscape:cx="15.511983"
     inkscape:cy="16"
     inkscape:current-layer="g706"
     showguides="false">
    <inkscape:grid
       type="xygrid"
       id="grid810" />
  </sodipodi:namedview>
  <g
     id="g706"
     transform="translate(0,-1)">
    <path
       d="M 1,13 V 7 C 1,6 2,5 3,5 h 6 c 1,0 2,1 2,2 v 1 h 20 v 5"
       stroke-linejoin="round"
       id="path145"
       style="fill:none;stroke:#00aad4;stroke-width:1.99976;stroke-linecap:round"
       sodipodi:nodetypes="cccccccc" />
    <path
       d="M 31,13 H 1 v 16 h 30 z"
       id="path427"
       style="fill:none;stroke:#00aad4;stroke-width:2;stroke-linecap:round;stroke-linejoin:round"
       sodipodi:nodetypes="ccccc" />
  </g>
</svg>
