<?xml version="1.0" encoding="UTF-8" standalone="no"?>
<svg
   width="32"
   height="32"
   version="1.1"
   viewBox="0 0 32 32"
   id="svg50"
   sodipodi:docname="lazarus_orange 32.svg"
   inkscape:export-filename="lazarus_orange 32.png"
   inkscape:export-xdpi="96"
   inkscape:export-ydpi="96"
   inkscape:version="1.1.1 (3bf5ae0d25, 2021-09-20)"
   xmlns:inkscape="http://www.inkscape.org/namespaces/inkscape"
   xmlns:sodipodi="http://sodipodi.sourceforge.net/DTD/sodipodi-0.dtd"
   xmlns="http://www.w3.org/2000/svg"
   xmlns:svg="http://www.w3.org/2000/svg">
  <defs
     id="defs54" />
  <sodipodi:namedview
     id="namedview52"
     pagecolor="#ffffff"
     bordercolor="#666666"
     borderopacity="1.0"
     inkscape:pageshadow="2"
     inkscape:pageopacity="0.0"
     inkscape:pagecheckerboard="0"
     showgrid="false"
     inkscape:zoom="23.28125"
     inkscape:cx="15.978523"
     inkscape:cy="16"
     inkscape:current-layer="svg50" />
  <radialGradient
     id="a"
     cx="-3926"
     cy="-222"
     r="38.252"
     gradientTransform="matrix(.47058 0 0 .47058 1863.5 120.47)"
     gradientUnits="userSpaceOnUse">
    <stop
       stop-color="#ffa061"
       offset="0"
       id="stop2" />
    <stop
       stop-color="#fff"
       offset="1"
       id="stop4" />
  </radialGradient>
  <radialGradient
     id="b"
     cx="-3926"
     cy="-222"
     r="32.583"
     gradientTransform="matrix(.47058 0 0 .47058 1863.5 120.47)"
     gradientUnits="userSpaceOnUse">
    <stop
       stop-color="#ff6905"
       offset="0"
       id="stop7" />
    <stop
       stop-color="#ffa66b"
       offset=".56522"
       id="stop9" />
    <stop
       stop-color="#fff"
       offset="1"
       id="stop11" />
  </radialGradient>
  <path
     d="m26.215 25.752c0.45858 0.14838 1.3126 0.03477 1.7905-0.34757 0.47778-0.38237 0.93415-1.1585 1.2675-1.7358 0.33336-0.57731 0.77735-1.3605 0.86963-1.9655 0.09223-0.60502-0.23642-1.4013-0.59425-1.7243-1.4452-1.3044-1.9312-1.6135-1.9308-3.9764-3.77e-4 -2.363 0.48554-2.672 1.9308-3.9764 0.35783-0.32294 0.68648-1.1193 0.59425-1.7243-0.092281-0.60493-0.53632-1.3882-0.86963-1.9655-0.33331-0.57731-0.78968-1.3535-1.2675-1.7358-0.47783-0.38237-1.3319-0.49594-1.7905-0.34757-1.8523 0.59933-2.363 0.86558-4.4093-0.31622-2.0466-1.1812-2.0714-1.7565-2.4785-3.6602-0.10075-0.47133-0.62615-1.1541-1.1963-1.3767-0.57006-0.22258-1.4704-0.22969-2.1371-0.22969s-1.5671 0.007106-2.137 0.22969c-0.57006 0.22258-1.0955 0.9054-1.1963 1.3767-0.4071 1.9037-0.43185 2.4791-2.4785 3.6602-2.0463 1.1818-2.5569 0.91556-4.4093 0.31622-0.45858-0.14838-1.3127-0.034823-1.7905 0.34757-0.47783 0.38236-0.93415 1.1585-1.2675 1.7358-0.33336 0.57731-0.77735 1.3605-0.86963 1.9655-0.092281 0.60502 0.23642 1.4013 0.5942 1.7243 1.4452 1.3044 1.9312 1.6135 1.9308 3.9764 3.765e-4 2.363-0.48554 2.672-1.9308 3.9764-0.35778 0.32294-0.68644 1.1193-0.5942 1.7243 0.092281 0.60493 0.53627 1.3882 0.86963 1.9655 0.33331 0.57731 0.78963 1.3535 1.2675 1.7358 0.47778 0.38236 1.3319 0.49594 1.7905 0.34757 1.8523-0.59933 2.363-0.86558 4.4093 0.31622 2.0467 1.1812 2.0714 1.7565 2.4785 3.6602 0.1008 0.47133 0.6262 1.1541 1.1963 1.3767 0.57006 0.22258 1.4704 0.2297 2.137 0.2297s1.5671-0.0071 2.1371-0.2297c0.57006-0.22258 1.0955-0.9054 1.1963-1.3767 0.40714-1.9037 0.43185-2.4791 2.4785-3.6602 2.0463-1.1818 2.557-0.91556 4.4093-0.31622z"
     fill="url(#a)"
     stroke-width=".66667"
     id="path14" />
  <path
     d="m26.685 12.001c-1.4821 1.1572-7.3495 1.3326-10.016 2.6659-2.1328 1.0664-2.3717 1.9942-4 5.3336-0.87293 1.79-4.5691 2.5838-5.0296 2.8527-0.48338 0.28233-2.2377 1.984-3.0572 2.984 0.63331-8e-3 4.5533-0.37989 5.6088 0.22972 2.0467 1.1812 2.0707 1.7564 2.4779 3.6602 0.1008 0.47133 0.62658 1.1537 1.1966 1.3764 0.57006 0.22258 1.4701 0.22917 2.1368 0.22917 0.66667 0 1.5667-0.0066 2.1368-0.22917 0.57006-0.22258 1.0958-0.90502 1.1966-1.3764 0.4071-1.9037 0.43119-2.4791 2.4779-3.6602 2.0463-1.1818 2.5578-0.91575 4.4102-0.31641 0.45858 0.14838 1.3126 0.03473 1.7903-0.34766 0.47783-0.38237 0.93363-1.1583 1.2669-1.7357 0.33336-0.57731 0.77754-1.3612 0.86982-1.9661 0.09223-0.60493-0.23595-1.401-0.59378-1.7239-1.4452-1.3044-1.9314-1.6137-1.931-3.9765-4.23e-4 -2.363 0.48573-2.6721 1.931-3.9765 0.35783-0.32294 0.68601-1.119 0.59378-1.7239-0.04376-0.28785-0.44668-1.4944-0.60004-1.8216-0.57453 0.94874-1.8663 2.7427-2.8656 3.5229z"
     fill="url(#b)"
     stroke-width=".66667"
     id="path16" />
  <path
     d="m26.356 25.86c0.46357 0.15 1.327 0.03515 1.8099-0.35136 0.483-0.38653 0.94431-1.1711 1.2813-1.7547 0.33694-0.58361 0.78587-1.3754 0.87909-1.987 0.09327-0.61157-0.23901-1.4166-0.6007-1.7431-1.461-1.3187-1.9523-1.6311-1.9519-4.0198-3.76e-4 -2.3887 0.49091-2.7012 1.9519-4.0198 0.36169-0.32646 0.69396-1.1316 0.60065-1.7431-0.093221-0.61157-0.54211-1.4034-0.87909-1.987s-0.79824-1.3682-1.2813-1.7547c-0.48296-0.38654-1.3464-0.50136-1.8099-0.35136-1.8725 0.60587-2.3889 0.87504-4.4574-0.31967-2.069-1.194-2.094-1.7757-2.5056-3.7002-0.10188-0.47646-0.63302-1.1668-1.2093-1.3917-0.57622-0.225-1.4864-0.23219-2.1604-0.23219-0.67396 0-1.5842 0.0072-2.1604 0.23219-0.57622 0.22501-1.1074 0.91528-1.2093 1.3917-0.41152 1.9245-0.43656 2.5062-2.5055 3.7002-2.0686 1.1947-2.5848 0.92554-4.4574 0.31967-0.46362-0.15-1.327-0.035152-1.81 0.35136-0.483 0.38653-0.94431 1.1711-1.2813 1.7547-0.33694 0.58361-0.78577 1.3754-0.87909 1.987-0.093269 0.61157 0.23901 1.4166 0.6007 1.7431 1.461 1.3187 1.9523 1.6311 1.9518 4.0198 4.235e-4 2.3887-0.49086 2.7012-1.9518 4.0198-0.36169 0.32646-0.69396 1.1316-0.6007 1.7431 0.093316 0.61157 0.54216 1.4034 0.87909 1.987 0.33703 0.58361 0.79829 1.3682 1.2813 1.7547 0.483 0.38653 1.3464 0.50136 1.81 0.35136 1.8725-0.60587 2.3889-0.87504 4.4574 0.31966 2.069 1.194 2.094 1.7757 2.5055 3.7002 0.10193 0.47646 0.63307 1.1668 1.2093 1.3917 0.57627 0.225 1.4865 0.23219 2.1604 0.23219 0.67401 5e-6 1.5842-0.0072 2.1604-0.23219 0.57627-0.22501 1.1074-0.91528 1.2093-1.3917 0.41157-1.9245 0.43656-2.5062 2.5056-3.7002 2.0686-1.1947 2.5848-0.92554 4.4574-0.31967z"
     fill="none"
     stroke="#ff6905"
     stroke-linejoin="round"
     id="path18" />
  <path
     d="m9.8618 8.8551c1.3196 0 2.3281 0.34738 2.4412 1.6689 0.19148 2.2356 0.32522 3.6763-0.05059 4.7853-0.18804 0.55496-0.7245 1.8329-1.7034 2.9847-0.61359 0.72196-1.0319 1.4813-0.88888 2.5068 0.12475 0.89434 0.20249 2.1387 0.92732 2.3524-0.07553 0.40518-0.15708 0.44305-0.51312 0.73735-0.86775-0.33773-1.084-1.8816-1.1923-3.082-0.094492-1.0472 0.18404-2.1579 1.0891-3.126 1.7499-1.8719 2.2113-3.5025 1.6499-5.1641-0.18546-0.54888-0.093269-0.50743-1.6655-0.43095-1.5722 0.076469-2.4276-1.1293-2.7902-2.1617-0.3911-0.21652-1.2562 0.064445-1.8549 0.21404 0.51143-0.875 3.1279-1.2847 4.5514-1.2847z"
     fill="#333"
     stroke-width=".66667"
     id="path20" />
  <ellipse
     transform="matrix(.99248 .12237 -.12137 .99261 0 0)"
     cx="11.149"
     cy="9.4604"
     rx="1.7731"
     ry="1.0316"
     fill="#fff"
     stroke-width=".66667"
     id="ellipse22" />
  <path
     d="m16.026 5.953-0.33331 3 0.33331 2.3333 0.33336-2.3333z"
     fill="#333"
     stroke-width=".66667"
     id="path24" />
  <path
     d="m22.144 8.8551c-1.3196 0-2.3281 0.34738-2.4412 1.6689-0.19153 2.2356-0.32522 3.6763 0.05059 4.7853 0.18804 0.55496 0.72446 1.8329 1.7034 2.9847 0.61364 0.72196 1.0319 1.4813 0.88888 2.5068-0.12475 0.89434-0.20244 2.1387-0.92732 2.3524 0.07557 0.40518 0.15713 0.44305 0.51317 0.73735 0.8677-0.33773 1.084-1.8816 1.1923-3.082 0.09449-1.0472-0.18404-2.1579-1.0891-3.126-1.7499-1.8719-2.2113-3.5025-1.6499-5.1641 0.1855-0.54888 0.09327-0.50743 1.6655-0.43095 1.5722 0.07647 2.4276-1.1293 2.7902-2.1617 0.39115-0.21652 1.2562 0.06445 1.8549 0.21404-0.51138-0.875-3.1279-1.2847-4.5514-1.2847z"
     fill="#333"
     stroke-width=".66667"
     id="path26" />
  <ellipse
     transform="matrix(-.99248 .12237 .12137 .99261 0 0)"
     cx="-20.673"
     cy="13.375"
     rx="1.7731"
     ry="1.0316"
     fill="#fff"
     stroke-width=".66667"
     id="ellipse28" />
  <ellipse
     cx="10.144"
     cy="10.184"
     rx=".94116"
     ry=".70587"
     fill="#500"
     fill-opacity=".97647"
     stroke-width=".66667"
     id="ellipse30" />
  <ellipse
     transform="scale(-1,1)"
     cx="-21.909"
     cy="10.184"
     rx=".94116"
     ry=".70587"
     fill="#500"
     fill-opacity=".97647"
     stroke-width=".66667"
     id="ellipse32" />
  <circle
     cx="9.7206"
     cy="9.9953"
     r=".28235"
     fill="#fff"
     stroke-width=".47058"
     id="circle34" />
  <circle
     cx="21.485"
     cy="9.9953"
     r=".28235"
     fill="#fff"
     stroke-width=".47058"
     id="circle36" />
  <path
     d="m13.594 18.199c-1.0585-0.01803-1.2377 1.7653-0.20991 2.2217 1.4948 0.66384 1.9034 1.477 2.2893 1.9678l0.06346 0.95218c-0.46479 0.15156-2.9345 0.73789-2.6662 1.206 1.1245-0.09332 1.7465-0.38073 2.9198-0.38077v0.0022c1.1733 4.2e-5 1.7953 0.28746 2.9198 0.38077 0.26831-0.46814-2.2014-1.0545-2.6662-1.206l0.06346-0.95218c0.38589-0.49078 0.79447-1.304 2.2893-1.9678 1.0277-0.45641 0.84857-2.2397-0.20991-2.2217-1.0584 0.01802-1.6348 0.1269-2.3964 0.12692v-0.0022c-0.76161-2.4e-5 -1.3381-0.1089-2.3964-0.12692z"
     fill="#333"
     stroke-width=".66652"
     id="path38" />
</svg>
