<?xml version="1.0" encoding="UTF-8" standalone="no"?>
<svg
   width="64"
   height="64"
   version="1.1"
   viewBox="0 0 64 64"
   id="svg16"
   sodipodi:docname="Bug_02_64.svg"
   inkscape:export-filename="Bug_02_64.png"
   inkscape:export-xdpi="96"
   inkscape:export-ydpi="96"
   inkscape:version="1.3.2 (091e20e, 2023-11-25, custom)"
   xmlns:inkscape="http://www.inkscape.org/namespaces/inkscape"
   xmlns:sodipodi="http://sodipodi.sourceforge.net/DTD/sodipodi-0.dtd"
   xmlns:xlink="http://www.w3.org/1999/xlink"
   xmlns="http://www.w3.org/2000/svg"
   xmlns:svg="http://www.w3.org/2000/svg">
  <sodipodi:namedview
     id="namedview16"
     pagecolor="#ffffff"
     bordercolor="#000000"
     borderopacity="0.25"
     inkscape:showpageshadow="2"
     inkscape:pageopacity="0.0"
     inkscape:pagecheckerboard="0"
     inkscape:deskcolor="#d1d1d1"
     showgrid="true"
     inkscape:current-layer="svg16">
    <inkscape:grid
       id="grid16"
       units="px"
       originx="0"
       originy="0"
       spacingx="0.5"
       spacingy="0.5"
       empcolor="#0099e5"
       empopacity="0.30196078"
       color="#0099e5"
       opacity="0.14901961"
       empspacing="2"
       dotted="false"
       gridanglex="30"
       gridanglez="30"
       visible="true" />
  </sodipodi:namedview>
  <defs
     id="defs5">
    <linearGradient
       id="c"
       x1="6.676765"
       x2="11.308088"
       y1="11.878798"
       y2="7.2474756"
       gradientUnits="userSpaceOnUse"
       xlink:href="#a" />
    <linearGradient
       id="a">
      <stop
         stop-color="#43a73e"
         offset="0"
         id="stop1" />
      <stop
         stop-color="#5fd3bc"
         offset=".49618864"
         id="stop2" />
      <stop
         stop-color="#42a73f"
         offset="1"
         id="stop3" />
    </linearGradient>
    <radialGradient
       id="b"
       cx="8.7400265"
       cy="9.5818529"
       r="2.55147"
       gradientTransform="matrix(1.2892067 1.2892068 -.7779605 .77795882 4.8482192 -9.4896605)"
       gradientUnits="userSpaceOnUse">
      <stop
         stop-color="#afe9af"
         offset="0"
         id="stop4" />
      <stop
         stop-color="#2ca05a"
         offset="1"
         id="stop5" />
    </radialGradient>
    <filter
       id="e"
       x="-0.11378866"
       y="-0.11378867"
       width="1.2275773"
       height="1.2275773"
       color-interpolation-filters="sRGB">
      <feGaussianBlur
         stdDeviation="0.27692572"
         id="feGaussianBlur5" />
    </filter>
    <linearGradient
       id="d"
       x1="4.6919122"
       x2="8.6616173"
       y1="9.2323284"
       y2="5.2626228"
       gradientUnits="userSpaceOnUse"
       xlink:href="#a" />
  </defs>
  <g
     transform="matrix(0,4.2750179,-4.2750179,0,70.675367,-4.2355649)"
     id="g16">
    <path
       d="M 2.4157129,7.9361713 3.476373,8.2897247 5.24414,7.9361713"
       fill="none"
       stroke="#aca793"
       stroke-linecap="round"
       stroke-linejoin="round"
       stroke-width=".7"
       id="path5" />
    <path
       d="m5.6418876 5.4171034c-0.4379709-0.7491154-1.4321777-1.6583691-1.1048544-3.1377863"
       fill="none"
       stroke="#d4aa00"
       stroke-linecap="round"
       stroke-linejoin="round"
       stroke-width=".5"
       id="path6" />
    <path
       d="m4.8905866 6.1684044c-0.8144934-0.5312453-2.0050174-1.3642733-3.1819805-1.0606602"
       fill="none"
       stroke="#d4aa00"
       stroke-linecap="round"
       stroke-linejoin="round"
       stroke-width=".5"
       id="path7" />
    <path
       d="m3.1228196 11.471705 1.0606602-0.353553 0.7071068-1.4142137"
       fill="none"
       stroke="#aca793"
       stroke-linecap="round"
       stroke-linejoin="round"
       stroke-width=".7"
       id="path8" />
    <path
       d="m7.3654603 12.178812-0.3535534 1.06066 1.0606602 2.474874"
       fill="none"
       stroke="#aca793"
       stroke-linecap="round"
       stroke-linejoin="round"
       stroke-width=".7"
       id="path9" />
    <path
       d="m7.3654603 2.9864238 0.3535534 1.0606602-0.3535534 1.767767"
       fill="none"
       stroke="#aca793"
       stroke-linecap="round"
       stroke-linejoin="round"
       stroke-width=".7"
       id="path10" />
    <path
       d="m10.900994 3.6935306-0.353554 1.0606602-1.4142127 0.7071068"
       fill="none"
       stroke="#aca793"
       stroke-linecap="round"
       stroke-linejoin="round"
       stroke-width=".7"
       id="path11" />
    <path
       d="m11.608101 7.9361713 1.06066-0.3535534 2.474873 1.0606602"
       fill="none"
       stroke="#aca793"
       stroke-linecap="round"
       stroke-linejoin="round"
       stroke-width=".7"
       id="path12" />
    <path
       d="m5.1060334 9.7647052c2.1500678 2.8075778 4.2861744 4.3799898 6.6484606 4.6818208 0.648954 0.08292 1.0139-0.400314 0.914267-1.207054 0.806739 0.09963 1.28997-0.265312 1.207053-0.914267-0.30183-2.3622868-1.874242-4.4983934-4.6818197-6.6484608"
       fill="url(#c)"
       id="path13" />
    <path
       d="m9.482723 7.4662878c0.930818 1.3373522 1.865229 3.4203502 2.156174 4.7433192-1.322969-0.290945-3.4059677-1.225355-4.7433197-2.156173-0.3834557-0.2668912-1.0975233-1.038199-1.0975233-1.038199l2.64647-2.6464706s0.7713078 0.7140677 1.038199 1.0975234z"
       fill="url(#b)"
       filter="url(#e)"
       id="path14" />
    <path
       d="m9.0711545 7.0362313c-0.3876242 1.0675436-1.0580473 0.7462729-1.4019633 1.2036706-0.4573981 0.343916-0.1361277 1.0143391-1.203671 1.4019633-0.3862184 0.1402356-0.6109605-0.1797555-1.3594868 0.12284-0.3893259-0.1217197-0.58726-0.4297215-0.4253689-0.977796 0.2717229-0.9199045 0.4826236-1.8664534 0.1657281-2.5743107-0.1748542-0.3905779-0.1905101-0.5165968 0.044194-0.7513009 0.2347044-0.2347045 0.3607236-0.2190488 0.751301-0.0441942 0.7078574 0.3168953 1.6544061 0.1059947 2.5743106-0.1657282 0.5480741-0.1618907 0.8560765 0.0360434 0.9777962 0.4253691-0.3025954 0.7485265 0.0173957 0.9732686-0.1228399 1.359487z"
       fill="url(#d)"
       id="path15" />
    <ellipse
       transform="rotate(4.26947)"
       cx="6.8066874"
       cy="5.4236007"
       rx=".53411657"
       ry=".34681326"
       fill="#37abc8"
       id="ellipse15" />
    <ellipse
       transform="matrix(.07444737 .99722494 .99722494 -.07444737 0 0)"
       cx="7.3333287"
       cy="4.8119879"
       rx=".53411657"
       ry=".34681326"
       fill="#37abc8"
       id="ellipse16" />
  </g>
</svg>
