<?xml version="1.0" encoding="UTF-8" standalone="no"?>
<svg
   height="16"
   width="16"
   version="1.1"
   id="svg5"
   sodipodi:docname="ddconnection_new.svg"
   inkscape:export-filename="ddconnection_new.png"
   inkscape:export-xdpi="96"
   inkscape:export-ydpi="96"
   inkscape:version="1.3 (0e150ed6c4, 2023-07-21)"
   xmlns:inkscape="http://www.inkscape.org/namespaces/inkscape"
   xmlns:sodipodi="http://sodipodi.sourceforge.net/DTD/sodipodi-0.dtd"
   xmlns="http://www.w3.org/2000/svg"
   xmlns:svg="http://www.w3.org/2000/svg">
  <defs
     id="defs5" />
  <sodipodi:namedview
     id="namedview5"
     pagecolor="#ffffff"
     bordercolor="#000000"
     borderopacity="0.25"
     inkscape:showpageshadow="2"
     inkscape:pageopacity="0.0"
     inkscape:pagecheckerboard="0"
     inkscape:deskcolor="#d1d1d1"
     showgrid="true"
     inkscape:current-layer="svg5">
    <inkscape:grid
       id="grid5"
       units="px"
       originx="0"
       originy="0"
       spacingx="0.5"
       spacingy="0.5"
       empcolor="#0099e5"
       empopacity="0.30196078"
       color="#0099e5"
       opacity="0.14901961"
       empspacing="2"
       dotted="false"
       gridanglex="30"
       gridanglez="30"
       visible="true" />
  </sodipodi:namedview>
  <g
     stroke-linecap="round"
     id="g5">
    <g
       stroke="#00d455"
       id="g3">
      <circle
         cx="11.5"
         cy="11.5"
         fill="#e5ffd5"
         r="3.5"
         stroke-dashoffset="1.49998"
         stroke-linejoin="round"
         stroke-width=".8"
         transform="matrix(0 1 1 0 0 0)"
         id="circle1" />
      <g
         fill="none"
         id="g2">
        <path
           d="m11.5 10v3"
           id="path1" />
        <path
           d="m13 11.5h-3"
           id="path2" />
      </g>
    </g>
    <g
       fill="none"
       stroke-linejoin="round"
       stroke-width="1.2"
       transform="translate(-1.7 -1.7)"
       id="g4">
      <path
         d="m8.7778176 7.2221827-1.4142136-1.4142135-3.2526912 3.2526911 1.4142136 1.4142137-3.0251266 3.025126"
         stroke="#00aad4"
         id="path3" />
      <path
         d="m7.2221826 8.7778176 1.4142136 1.4142134 3.2526908-3.252691-1.414213-1.4142136 3.025126-3.0251262"
         stroke="#00c1f0"
         id="path4" />
    </g>
  </g>
</svg>
