<?xml version="1.0" encoding="UTF-8" standalone="no"?>
<svg
   height="16"
   width="16"
   version="1.1"
   id="svg1113"
   sodipodi:docname="Exit_02_16.svg"
   inkscape:export-filename="Exit_02_16.png"
   inkscape:export-xdpi="96"
   inkscape:export-ydpi="96"
   inkscape:version="1.2-beta (1b65182ce9, 2022-04-05)"
   xmlns:inkscape="http://www.inkscape.org/namespaces/inkscape"
   xmlns:sodipodi="http://sodipodi.sourceforge.net/DTD/sodipodi-0.dtd"
   xmlns="http://www.w3.org/2000/svg"
   xmlns:svg="http://www.w3.org/2000/svg">
  <defs
     id="defs1117" />
  <sodipodi:namedview
     id="namedview1115"
     pagecolor="#ffffff"
     bordercolor="#666666"
     borderopacity="1.0"
     inkscape:pageshadow="2"
     inkscape:pageopacity="0.0"
     inkscape:pagecheckerboard="0"
     inkscape:deskcolor="#d1d1d1"
     showgrid="true"
     inkscape:zoom="57.375"
     inkscape:cx="7.9912854"
     inkscape:cy="8"
     inkscape:current-layer="svg1113">
    <inkscape:grid
       type="xygrid"
       id="grid2040" />
  </sodipodi:namedview>
  <g
     fill="none"
     stroke="#00aad4"
     stroke-linecap="round"
     stroke-width="1.5"
     id="g1111">
    <path
       d="m8 .9v6"
       id="path1107" />
    <path
       d="m11.250015 2.3850002a6.5000285 6.4982368 0 0 1 3.02853 7.3095057 6.5000285 6.4982368 0 0 1 -6.2785445 4.8163701 6.5000285 6.4982368 0 0 1 -6.2785454-4.8163701 6.5000285 6.4982368 0 0 1 3.0285311-7.3095059"
       id="path1109" />
  </g>
</svg>
