<?xml version="1.0" encoding="UTF-8" standalone="no"?>
<svg
   width="16"
   height="16"
   version="1.1"
   id="svg11"
   sodipodi:docname="Setup_03_16.svg"
   inkscape:export-filename="Setup_03_16.png"
   inkscape:export-xdpi="96"
   inkscape:export-ydpi="96"
   inkscape:version="1.3.2 (091e20e, 2023-11-25, custom)"
   xmlns:inkscape="http://www.inkscape.org/namespaces/inkscape"
   xmlns:sodipodi="http://sodipodi.sourceforge.net/DTD/sodipodi-0.dtd"
   xmlns="http://www.w3.org/2000/svg"
   xmlns:svg="http://www.w3.org/2000/svg">
  <sodipodi:namedview
     id="namedview11"
     pagecolor="#ffffff"
     bordercolor="#000000"
     borderopacity="0.25"
     inkscape:showpageshadow="2"
     inkscape:pageopacity="0.0"
     inkscape:pagecheckerboard="0"
     inkscape:deskcolor="#d1d1d1"
     showgrid="true"
     inkscape:current-layer="svg11">
    <inkscape:grid
       id="grid17"
       units="px"
       originx="0"
       originy="0"
       spacingx="0.5"
       spacingy="0.5"
       empcolor="#0099e5"
       empopacity="0.30196078"
       color="#0099e5"
       opacity="0.14901961"
       empspacing="2"
       dotted="false"
       gridanglex="30"
       gridanglez="30"
       visible="true" />
  </sodipodi:namedview>
  <defs
     id="defs6">
    <linearGradient
       id="a"
       x1="5.4640584"
       x2="7.5116959"
       y1="9.4888191"
       y2="11.536456"
       gradientTransform="matrix(1.0718449 0 0 1.0718449 .92747792 .8466058)"
       gradientUnits="userSpaceOnUse">
      <stop
         stop-color="#d40000"
         offset="0"
         id="stop1" />
      <stop
         stop-color="#ff8989"
         offset=".15760632"
         id="stop2" />
      <stop
         stop-color="#d40000"
         offset=".88542914"
         id="stop3" />
      <stop
         stop-color="#970000"
         offset="1"
         id="stop4" />
    </linearGradient>
    <radialGradient
       id="b"
       cx="15.071531"
       cy="1033.4419"
       r="3.4872861"
       gradientTransform="matrix(.03557703 -1.3670988 -1.3687191 .02153983 1426.0691 6.2304221)"
       gradientUnits="userSpaceOnUse">
      <stop
         stop-color="#fff"
         offset="0"
         id="stop5" />
      <stop
         stop-color="#ccc"
         offset="1"
         id="stop6" />
    </radialGradient>
  </defs>
  <path
     id="path15"
     style="fill:#aaccff;fill-rule:evenodd;stroke-linejoin:round"
     d="M 5.75,0.5 5.5,2.5 4.378906,2.9648438 2.787109,1.7265625 1.726562,2.7871094 2.964844,4.3789062 2.5,5.5 0.5,5.75 v 1.5 L 2.5,7.5 2.964844,8.6210938 1.726562,10.212891 2.787109,11.273438 4.378906,10.035156 5.5,10.5 5.52734,10.712891 8.67773,7.7109375 C 8.482646,6.9042054 8.538181,5.9105 9.134766,5.015625 9.59829,4.3203365 10.169599,3.775355 10.798828,3.3964844 L 11.273438,2.7871094 10.212891,1.7265625 8.621094,2.9648438 7.5,2.5 7.25,0.5 Z m 0.75,4 c 1.104567,0 2,0.8954338 2,2 0,1.1045662 -0.895433,2 -2,2 -1.104566,0 -2,-0.8954338 -2,-2 0,-1.1045662 0.895434,-2 2,-2 z" />
  <path
     d="M 5.75,0 A 0.50005,0.50005 0 0 0 5.2539062,0.4375 L 5.0390625,2.1503906 4.4570312,2.390625 3.09375,1.3320312 A 0.50005,0.50005 0 0 0 2.4335938,1.3730469 L 1.3730469,2.4335938 A 0.50005,0.50005 0 0 0 1.3320312,3.09375 L 2.390625,4.4570312 2.1503906,5.0390625 0.4375,5.2539062 A 0.50005,0.50005 0 0 0 0,5.75 v 1.5 A 0.50005,0.50005 0 0 0 0.4375,7.7460937 L 2.1503906,7.9609375 2.390625,8.5429688 1.3320312,9.90625 a 0.50005,0.50005 0 0 0 0.041016,0.660156 l 1.0605469,1.060547 a 0.50005,0.50005 0 0 0 0.6601562,0.04102 l 1.3632812,-1.058594 0.5820313,0.240234 0.037109,0.292969 0.8691406,-0.828125 A 0.50005,0.50005 0 0 0 5.6914062,10.039063 L 4.5703125,9.5742188 A 0.50005,0.50005 0 0 0 4.0722656,9.640625 L 2.828125,10.607422 2.3925781,10.171875 3.359375,8.9277344 A 0.50005,0.50005 0 0 0 3.4257813,8.4296875 L 2.9609375,7.3085937 A 0.50005,0.50005 0 0 0 2.5625,7.0039062 L 1,6.8085937 V 6.1914062 L 2.5625,5.9960937 A 0.50005,0.50005 0 0 0 2.9609375,5.6914062 L 3.4257813,4.5703125 A 0.50005,0.50005 0 0 0 3.359375,4.0722656 L 2.3925781,2.828125 2.828125,2.3925781 4.0722656,3.359375 a 0.50005,0.50005 0 0 0 0.4980469,0.066406 L 5.6914062,2.9609375 A 0.50005,0.50005 0 0 0 5.9960937,2.5625 L 6.1914062,1 H 6.8085937 L 7.0039062,2.5625 A 0.50005,0.50005 0 0 0 7.3085937,2.9609375 L 8.4296875,3.4257813 A 0.50005,0.50005 0 0 0 8.9277344,3.359375 L 10.171875,2.3925781 10.607422,2.828125 9.640625,4.0722656 A 0.50005,0.50005 0 0 0 9.5605469,4.4589844 C 10.14769,3.7720425 10.850269,3.2770605 11.605469,3.0117188 c 0.04157,-0.014605 0.08631,-0.025464 0.128906,-0.039063 A 0.50005,0.50005 0 0 0 11.626953,2.4335938 L 10.566406,1.3730469 A 0.50005,0.50005 0 0 0 9.90625,1.3320312 L 8.5429688,2.390625 7.9609375,2.1503906 7.7460937,0.4375 A 0.50005,0.50005 0 0 0 7.25,0 Z"
     style="fill:#457abe;fill-rule:evenodd;stroke-linejoin:round"
     id="path17" />
  <path
     d="m 7.59375,8.7421875 1.0839844,-1.03125 C 8.5242805,7.0763916 8.5301309,6.3264266 8.828125,5.5996094 8.4644744,4.6666344 7.5574735,4 6.5,4 5.1252132,4 4,5.1252132 4,6.5 4,7.8747868 5.1252132,9 6.5,9 6.8922166,9 7.262493,8.9050209 7.59375,8.7421875 Z M 6.5,5 C 7.3343478,5 8,5.6656522 8,6.5 8,7.3343478 7.3343478,8 6.5,8 5.6656522,8 5,7.3343478 5,6.5 5,5.6656522 5.6656522,5 6.5,5 Z"
     style="fill:#457abe;fill-rule:evenodd;stroke-linejoin:round"
     id="path16" />
  <g
     fill-rule="evenodd"
     id="g10">
    <path
       d="m10.241554 7.8781219-5.6705114 5.4025941c-1.6233355 1.546638 0.5712003 3.786372 2.1436902 2.14369l5.4025502-5.6705555z"
       fill="url(#a)"
       stroke-width="1.07184"
       id="path9" />
    <path
       d="m14.235898 9.7432356c1.523445-1.0156304 1.975484-2.6286696 1.326378-3.4485824l-1.326378 1.3263793-1.591654-0.2652768-0.265275-1.5916551 1.326378-1.3263762c-0.819913-0.6491061-2.432952-0.1970673-3.448582 1.3263777-1.0611023 1.5916536 0.530551 2.9180312 0.795826 3.1833069 0.265276 0.2652752 1.591653 1.856929 3.183307 0.7958266z"
       fill="url(#b)"
       stroke="#808080"
       stroke-width=".3"
       id="path10" />
  </g>
</svg>
