<svg width="36" height="36" version="1.1" xmlns="http://www.w3.org/2000/svg">
 <g>
  <path d="M 16.749873,33.249957 25,16.749702 33.250127,33.249957 Z" fill="none" stroke="#ffffff" stroke-linejoin="round" stroke-width="5.50008"/>
  <path d="m25.000002 16.796589-8.226687 16.453368h16.453369z" fill="#ffd42a" stroke="#806600" stroke-linejoin="round" stroke-width="1.88037"/>
  <path d="m25 24.31668v2.750042" fill="none" stroke="#000000" stroke-linecap="round" stroke-width="1.83336"/>
  <circle cx="24.999998" cy="29.983681" r=".91668087" fill="#000000"/>
 </g>
</svg>
