<?xml version="1.0" encoding="UTF-8" standalone="no"?>
<svg
   width="32"
   height="32"
   version="1.1"
   id="svg11"
   sodipodi:docname="address_200.svg"
   inkscape:export-filename="address_200.png"
   inkscape:export-xdpi="96"
   inkscape:export-ydpi="96"
   inkscape:version="1.3.2 (091e20e, 2023-11-25, custom)"
   xmlns:inkscape="http://www.inkscape.org/namespaces/inkscape"
   xmlns:sodipodi="http://sodipodi.sourceforge.net/DTD/sodipodi-0.dtd"
   xmlns="http://www.w3.org/2000/svg"
   xmlns:svg="http://www.w3.org/2000/svg">
  <defs
     id="defs11" />
  <sodipodi:namedview
     id="namedview11"
     pagecolor="#ffffff"
     bordercolor="#000000"
     borderopacity="0.25"
     inkscape:showpageshadow="2"
     inkscape:pageopacity="0.0"
     inkscape:pagecheckerboard="0"
     inkscape:deskcolor="#d1d1d1"
     showgrid="true"
     inkscape:current-layer="svg11">
    <inkscape:grid
       id="grid11"
       units="px"
       originx="0"
       originy="0"
       spacingx="0.5"
       spacingy="0.5"
       empcolor="#0099e5"
       empopacity="0.30196078"
       color="#0099e5"
       opacity="0.14901961"
       empspacing="2"
       dotted="false"
       gridanglex="30"
       gridanglez="30"
       visible="true" />
  </sodipodi:namedview>
  <path
     d="m4 27.199869v-8.399935l-2.5 1.6"
     fill="none"
     stroke="#2a7fff"
     stroke-linecap="round"
     stroke-linejoin="round"
     stroke-width="1.6"
     id="path1" />
  <path
     d="m9.8 18.8c1.108 0 2 0.892 2 2v4.4c0 1.108-0.892 2-2 2s-2-0.892-2-2v-4.4c0-1.108 0.892-2 2-2z"
     fill="none"
     stroke="#2a7fff"
     stroke-linecap="round"
     stroke-linejoin="round"
     stroke-width="1.6"
     id="path2" />
  <path
     d="m23 27.199869v-8.399935l-2.5 1.600001"
     fill="none"
     stroke="#2a7fff"
     stroke-linecap="round"
     stroke-linejoin="round"
     stroke-width="1.6"
     id="path3" />
  <path
     d="m17 27.199869v-8.399935l-2.5 1.6"
     fill="none"
     stroke="#2a7fff"
     stroke-linecap="round"
     stroke-linejoin="round"
     stroke-width="1.6"
     id="path4" />
  <path
     d="m29 18.8c1.108 0 2 0.892 2 2v4.4c0 1.108-0.892 2-2 2s-2-0.892-2-2v-4.4c0-1.108 0.892-2 2-2z"
     fill="none"
     stroke="#2a7fff"
     stroke-linecap="round"
     stroke-linejoin="round"
     stroke-width="1.6"
     id="path5" />
  <g
     transform="matrix(-2,0,0,-2,32,18)"
     fill="none"
     stroke="#00aa00"
     id="g8">
    <path
       d="m7.5 4.5h-5"
       stroke-linecap="square"
       id="path6" />
    <path
       d="m2 4.5 2-2"
       stroke-linecap="round"
       stroke-linejoin="round"
       id="path7" />
    <path
       d="m2 4.5 2 2"
       stroke-linecap="round"
       stroke-linejoin="round"
       id="path8" />
  </g>
  <g
     transform="matrix(2,0,0,-2,0,18)"
     fill="none"
     stroke="#dc0000"
     id="g11">
    <path
       d="m7.5 4.5h-5"
       stroke-linecap="square"
       id="path9" />
    <path
       d="m2 4.5 2-2"
       stroke-linecap="round"
       stroke-linejoin="round"
       id="path10" />
    <path
       d="m2 4.5 2 2"
       stroke-linecap="round"
       stroke-linejoin="round"
       id="path11" />
  </g>
</svg>
