<?xml version="1.0" encoding="UTF-8" standalone="no"?>
<svg
   height="36"
   width="36"
   version="1.1"
   id="svg18"
   sodipodi:docname="Open_01_36.svg"
   inkscape:export-filename="Open_01_36.png"
   inkscape:export-xdpi="96"
   inkscape:export-ydpi="96"
   inkscape:version="1.2-beta (1b65182ce9, 2022-04-05)"
   xmlns:inkscape="http://www.inkscape.org/namespaces/inkscape"
   xmlns:sodipodi="http://sodipodi.sourceforge.net/DTD/sodipodi-0.dtd"
   xmlns="http://www.w3.org/2000/svg"
   xmlns:svg="http://www.w3.org/2000/svg">
  <defs
     id="defs22" />
  <sodipodi:namedview
     id="namedview20"
     pagecolor="#ffffff"
     bordercolor="#666666"
     borderopacity="1.0"
     inkscape:pageshadow="2"
     inkscape:pageopacity="0.0"
     inkscape:pagecheckerboard="0"
     inkscape:deskcolor="#d1d1d1"
     showgrid="true"
     inkscape:zoom="25.5"
     inkscape:cx="18"
     inkscape:cy="18"
     inkscape:current-layer="svg18">
    <inkscape:grid
       type="xygrid"
       id="grid1550" />
  </sodipodi:namedview>
  <linearGradient
     id="a"
     gradientUnits="userSpaceOnUse"
     x1="6.25"
     x2="7.75"
     y1="30.2"
     y2="37.7">
    <stop
       offset="0"
       stop-color="#ffeaa6"
       id="stop2" />
    <stop
       offset="1"
       stop-color="#e0ba58"
       id="stop4" />
  </linearGradient>
  <linearGradient
     id="b"
     gradientUnits="userSpaceOnUse"
     x1="9.25"
     x2="10"
     y1="36.2"
     y2="43.7">
    <stop
       offset="0"
       stop-color="#ffe9a3"
       id="stop7" />
    <stop
       offset="1"
       stop-color="#e3ba59"
       id="stop9" />
  </linearGradient>
  <g
     stroke="#d8872d"
     stroke-linejoin="round"
     stroke-width="0.75"
     transform="matrix(1.5,0,0,1.5,0.5,-36.501171)"
     id="g16">
    <path
       d="M 1.375,44.617494 V 28.375781 H 8.1523438 L 10,30.378906 h 10.620055 l -0.0053,14.238588 z"
       fill="url(#a)"
       id="path12"
       style="fill:url(#a)" />
    <path
       d="M 22.620401,33.385123 3.714151,33.37731 1.375,44.617494 h 19.239817 z"
       fill="url(#b)"
       id="path14"
       style="fill:url(#b)" />
  </g>
</svg>
