<?xml version="1.0" encoding="UTF-8" standalone="no"?>
<svg
   width="24"
   height="24"
   version="1.1"
   viewBox="0 0 24 24"
   id="svg3"
   sodipodi:docname="tbitbtn.svg"
   inkscape:export-filename="tbitbtn.png"
   inkscape:export-xdpi="96"
   inkscape:export-ydpi="96"
   inkscape:version="1.3.2 (091e20e, 2023-11-25, custom)"
   xmlns:inkscape="http://www.inkscape.org/namespaces/inkscape"
   xmlns:sodipodi="http://sodipodi.sourceforge.net/DTD/sodipodi-0.dtd"
   xmlns="http://www.w3.org/2000/svg"
   xmlns:svg="http://www.w3.org/2000/svg">
  <defs
     id="defs3" />
  <sodipodi:namedview
     id="namedview3"
     pagecolor="#ffffff"
     bordercolor="#000000"
     borderopacity="0.25"
     inkscape:showpageshadow="2"
     inkscape:pageopacity="0.0"
     inkscape:pagecheckerboard="0"
     inkscape:deskcolor="#d1d1d1"
     showgrid="true"
     inkscape:current-layer="svg3">
    <inkscape:grid
       id="grid3"
       units="px"
       originx="0"
       originy="0"
       spacingx="0.5"
       spacingy="0.5"
       empcolor="#0099e5"
       empopacity="0.30196078"
       color="#0099e5"
       opacity="0.14901961"
       empspacing="2"
       dotted="false"
       gridanglex="30"
       gridanglez="30"
       visible="true" />
  </sodipodi:namedview>
  <rect
     x=".375"
     y="6.375"
     width="23.25"
     height="12.25"
     rx="2.625"
     ry="2.625"
     fill="#ececec"
     stroke="#2a7efe"
     stroke-linecap="round"
     stroke-linejoin="round"
     stroke-width=".75"
     style="paint-order:normal"
     id="rect1" />
  <path
     d="m13.47999 9.5600371c1.08584 0 1.96 0.8056919 1.96 1.8064839v2.266959c0 1.000792-0.87416 1.806483-1.96 1.806483-1.08583 0-1.95999-0.805691-1.95999-1.806483v-2.266959c0-1.000792 0.87416-1.8064839 1.95999-1.8064839z"
     fill="none"
     stroke="#4d4d4d"
     stroke-linecap="round"
     stroke-linejoin="round"
     stroke-width=".8"
     id="path1" />
  <path
     d="m20.578891 15.439999-1.630996-2.631147m1.325406-1.568852-2.610079 3.089489m-0.103232-4.7694883v5.8799983"
     fill="none"
     stroke="#4d4d4d"
     stroke-linecap="round"
     stroke-linejoin="round"
     stroke-width=".8"
     id="path2" />
  <path
     d="M 3.6190473,12.619048 6,15 9,10"
     fill="none"
     stroke="#01a901"
     stroke-linecap="round"
     stroke-linejoin="round"
     stroke-width="1.5"
     id="path3" />
</svg>
