<?xml version="1.0" encoding="UTF-8" standalone="no"?>
<svg
   height="11"
   width="11"
   version="1.1"
   id="svg8"
   sodipodi:docname="InactiveBreakPoint.svg"
   inkscape:export-filename="InactiveBreakPoint.png"
   inkscape:export-xdpi="96"
   inkscape:export-ydpi="96"
   inkscape:version="1.2.2 (732a01da63, 2022-12-09)"
   xmlns:inkscape="http://www.inkscape.org/namespaces/inkscape"
   xmlns:sodipodi="http://sodipodi.sourceforge.net/DTD/sodipodi-0.dtd"
   xmlns="http://www.w3.org/2000/svg"
   xmlns:svg="http://www.w3.org/2000/svg">
  <defs
     id="defs12">
    <radialGradient
       id="a"
       cx="4"
       cy="4"
       gradientTransform="matrix(4e-8,1.2727273,-1.2727273,2e-8,9.090909,-1.090909)"
       gradientUnits="userSpaceOnUse"
       r="5.5">
      <stop
         offset="0"
         stop-color="#00f23e"
         id="stop2" />
      <stop
         offset="1"
         stop-color="#00ad00"
         id="stop4" />
    </radialGradient>
  </defs>
  <sodipodi:namedview
     id="namedview10"
     pagecolor="#ffffff"
     bordercolor="#666666"
     borderopacity="1.0"
     inkscape:showpageshadow="2"
     inkscape:pageopacity="0.0"
     inkscape:pagecheckerboard="0"
     inkscape:deskcolor="#d1d1d1"
     showgrid="true"
     inkscape:zoom="83.454545"
     inkscape:cx="5.4940087"
     inkscape:cy="5.5"
     inkscape:current-layer="svg8">
    <inkscape:grid
       type="xygrid"
       id="grid655" />
  </sodipodi:namedview>
  <circle
     cx="5.5"
     cy="5.5"
     fill="url(#a)"
     r="5.5"
     id="circle7"
     style="fill:url(#a)" />
  <path
     d="M 3.3,5.5 4.95,7.15 7.7,3.3"
     fill="none"
     id="path4"
     style="stroke:#ffffff;stroke-width:1.1;stroke-linecap:round;stroke-linejoin:round;stroke-opacity:1" />
</svg>
