<?xml version="1.0" encoding="UTF-8" standalone="no"?>
<svg
   height="48"
   width="48"
   version="1.1"
   id="svg582"
   sodipodi:docname="File_06_48.svg"
   inkscape:export-filename="File_06_48.png"
   inkscape:export-xdpi="96"
   inkscape:export-ydpi="96"
   inkscape:version="1.2-beta (1b65182ce9, 2022-04-05)"
   xml:space="preserve"
   xmlns:inkscape="http://www.inkscape.org/namespaces/inkscape"
   xmlns:sodipodi="http://sodipodi.sourceforge.net/DTD/sodipodi-0.dtd"
   xmlns="http://www.w3.org/2000/svg"
   xmlns:svg="http://www.w3.org/2000/svg"><defs
     id="defs586" /><sodipodi:namedview
     id="namedview584"
     pagecolor="#ffffff"
     bordercolor="#666666"
     borderopacity="1.0"
     inkscape:pageshadow="2"
     inkscape:pageopacity="0.0"
     inkscape:pagecheckerboard="0"
     inkscape:deskcolor="#d1d1d1"
     showgrid="true"
     inkscape:zoom="19.125"
     inkscape:cx="22.091503"
     inkscape:cy="24"
     inkscape:current-layer="g580"><inkscape:grid
       type="xygrid"
       id="grid965" /></sodipodi:namedview><g
     fill="none"
     stroke="#00aad4"
     stroke-linecap="round"
     id="g580"><g
       stroke-linejoin="round"
       stroke-width="1.5"
       transform="scale(2)"
       id="g568"><path
         d="m11.25 23.25h-7.5v-22.5h11.25l5.25 5.25v3.25"
         id="path564" /><path
         d="m14.75 1v5.249999h5.25"
         id="path566" /></g><g
       id="g1474"
       transform="matrix(2.9999999,0,0,2.9999999,1.6e-6,-2.9999983)"
       style="fill:none;stroke:#00aad4"><circle
         style="fill:none;stroke-width:1;stroke-linecap:round;stroke-linejoin:round;stroke-dasharray:none;stroke-dashoffset:1.49998"
         id="path346"
         cx="11.5"
         cy="12.5"
         r="4" /><g
         id="g530"><path
           style="fill:none;stroke:#00aad4;stroke-width:1px;stroke-linecap:round;stroke-linejoin:miter;stroke-opacity:1"
           d="m 10,11 3,3"
           id="path1469"
           sodipodi:nodetypes="cc" /><path
           style="fill:none;stroke:#00aad4;stroke-width:1px;stroke-linecap:round;stroke-linejoin:miter;stroke-opacity:1"
           d="m 13,11 -3,3"
           id="path522"
           sodipodi:nodetypes="cc" /></g></g></g></svg>
