<?xml version="1.0" encoding="UTF-8" standalone="no"?>
<svg
   height="24"
   width="24"
   version="1.1"
   id="svg399"
   sodipodi:docname="Grid_04_24.svg"
   inkscape:export-filename="Grid_04_24.png"
   inkscape:export-xdpi="96"
   inkscape:export-ydpi="96"
   inkscape:version="1.2-beta (1b65182ce9, 2022-04-05)"
   xmlns:inkscape="http://www.inkscape.org/namespaces/inkscape"
   xmlns:sodipodi="http://sodipodi.sourceforge.net/DTD/sodipodi-0.dtd"
   xmlns="http://www.w3.org/2000/svg"
   xmlns:svg="http://www.w3.org/2000/svg">
  <defs
     id="defs403" />
  <sodipodi:namedview
     id="namedview401"
     pagecolor="#ffffff"
     bordercolor="#666666"
     borderopacity="1.0"
     inkscape:pageshadow="2"
     inkscape:pageopacity="0.0"
     inkscape:pagecheckerboard="0"
     inkscape:deskcolor="#d1d1d1"
     showgrid="true"
     inkscape:zoom="38.25"
     inkscape:cx="12"
     inkscape:cy="12"
     inkscape:current-layer="svg399">
    <inkscape:grid
       type="xygrid"
       id="grid1121" />
  </sodipodi:namedview>
  <linearGradient
     id="a"
     gradientUnits="userSpaceOnUse"
     x1="-8.75"
     x2="-13.75"
     y1="-1.75"
     y2="-6.75">
    <stop
       offset="0"
       stop-color="#009600"
       id="stop352" />
    <stop
       offset="1"
       stop-color="#6edb39"
       id="stop354" />
  </linearGradient>
  <linearGradient
     id="b"
     gradientTransform="matrix(0 -1.5 -1.5 0 24 24)"
     gradientUnits="userSpaceOnUse"
     x1="9"
     x2="6"
     y1="10"
     y2="10.5">
    <stop
       offset="0"
       stop-color="#72cef6"
       id="stop357" />
    <stop
       offset="1"
       stop-color="#d2f5f8"
       id="stop359" />
  </linearGradient>
  <linearGradient
     id="c"
     gradientTransform="matrix(0 -1.5 -1.5 0 24 24)"
     gradientUnits="userSpaceOnUse"
     x1="10"
     x2="5"
     y1="12.5"
     y2="12.5">
    <stop
       offset="0"
       stop-color="#4674a8"
       id="stop362" />
    <stop
       offset="1"
       stop-color="#42a0ce"
       id="stop364" />
  </linearGradient>
  <g
     transform="matrix(0 1 -1 0 24 0)"
     id="g397">
    <path
       d="m-23.489361-23.489361h22.978724v22.978724h-22.978724z"
       style="fill:#fff;stroke:#999;stroke-width:1.02128;stroke-linecap:round;stroke-linejoin:round;stroke-dashoffset:1.49998"
       transform="scale(-1)"
       id="path367" />
    <g
       fill="none"
       stroke="#b3b3b3"
       transform="matrix(-1 0 0 1 24 0)"
       id="g379">
      <path
         d="m1 18.5h22"
         id="path369" />
      <path
         d="m6.5 23v-22"
         id="path371" />
      <path
         d="m23 5.5h-22"
         id="path373" />
      <path
         d="m18.5 23v-22"
         id="path375" />
      <path
         d="m12.5 23v-22"
         id="path377" />
    </g>
    <path
       d="m.5-16.5h23v8h-23z"
       fill="none"
       opacity=".5"
       stroke="#fff"
       stroke-dashoffset="1.49998"
       stroke-linejoin="round"
       transform="scale(1 -1)"
       id="path381" />
    <path
       d="m23.5 15.5h-23v-6h23z"
       fill="url(#b)"
       stroke="url(#c)"
       stroke-linecap="round"
       stroke-linejoin="round"
       id="path383" />
    <g
       transform="matrix(0 -1.5 -1.5 0 31.625 .875)"
       id="g395">
      <g
         stroke-linecap="round"
         id="g391">
        <circle
           cx="-11.25"
           cy="-4.25"
           fill="url(#a)"
           r="4"
           stroke="#008080"
           stroke-dashoffset="1.49998"
           stroke-linejoin="round"
           stroke-width=".5"
           transform="rotate(-90)"
           id="circle385" />
        <path
           d="m-4.25 13.25v-4"
           fill="none"
           stroke="#fff"
           id="path387" />
        <path
           d="m-2.25 11.25h-4"
           fill="none"
           stroke="#fff"
           id="path389" />
      </g>
      <circle
         cx="-4.25"
         cy="-11.25"
         r="4.5"
         style="opacity:.7;fill:none;stroke:#fff;stroke-width:.5;stroke-linejoin:round;stroke-dashoffset:1.49998"
         transform="scale(1 -1)"
         id="circle393" />
    </g>
  </g>
</svg>
