<?xml version="1.0" encoding="UTF-8" standalone="no"?>
<svg
   height="16"
   width="16"
   version="1.1"
   id="svg45"
   sodipodi:docname="Print_06_16.svg"
   inkscape:export-filename="Print_06_16.png"
   inkscape:export-xdpi="96"
   inkscape:export-ydpi="96"
   inkscape:version="1.2.2 (732a01da63, 2022-12-09)"
   xmlns:inkscape="http://www.inkscape.org/namespaces/inkscape"
   xmlns:sodipodi="http://sodipodi.sourceforge.net/DTD/sodipodi-0.dtd"
   xmlns="http://www.w3.org/2000/svg"
   xmlns:svg="http://www.w3.org/2000/svg">
  <sodipodi:namedview
     id="namedview11"
     pagecolor="#ffffff"
     bordercolor="#000000"
     borderopacity="0.25"
     inkscape:showpageshadow="2"
     inkscape:pageopacity="0.0"
     inkscape:pagecheckerboard="0"
     inkscape:deskcolor="#d1d1d1"
     showgrid="true"
     inkscape:zoom="56.875"
     inkscape:cx="5.9692308"
     inkscape:cy="8"
     inkscape:current-layer="svg45">
    <inkscape:grid
       type="xygrid"
       id="grid4178" />
  </sodipodi:namedview>
  <defs
     id="defs5" />
  <rect
     style="fill:#c2f3ff;fill-opacity:1;stroke:#00aad4;stroke-width:0.999997;stroke-linejoin:round;stroke-dasharray:none;stroke-opacity:1;paint-order:normal"
     id="rect2335"
     width="15"
     height="6"
     x="0.5"
     y="8.5"
     ry="1" />
  <rect
     style="fill:#ebfcff;fill-opacity:1;stroke:#00aad4;stroke-width:1;stroke-linejoin:round;stroke-dasharray:none;stroke-opacity:1;paint-order:normal"
     id="rect2333"
     width="2"
     height="2"
     x="12.5"
     y="6.5"
     ry="0.69999999" />
  <rect
     style="fill:#ebfcff;fill-opacity:1;stroke:#00aad4;stroke-width:1;stroke-linejoin:round;stroke-dasharray:none;stroke-opacity:1;paint-order:normal"
     id="rect2072"
     width="2"
     height="2"
     x="1.5"
     y="6.5"
     ry="0.69999999" />
  <rect
     style="fill:#ffffff;stroke:#00aad4;stroke-width:1;stroke-linejoin:round;stroke-dasharray:none;stroke-opacity:1;paint-order:normal"
     id="rect346"
     width="9"
     height="7"
     x="3.5"
     y="1.5"
     ry="1" />
  <path
     d="m 11.5,12.5 h 2"
     stroke-linecap="round"
     stroke-linejoin="round"
     id="path10"
     style="fill:none;stroke:#00aad4;stroke-width:1;stroke-miterlimit:4;stroke-dasharray:none" />
  <path
     d="m 5.5,3.5 h 5"
     id="path12"
     style="fill:none;stroke:#00aad4;stroke-width:1;stroke-miterlimit:4;stroke-dasharray:none" />
  <path
     d="m 5.5,5.5 h 5"
     id="path16"
     style="fill:none;stroke:#00aad4;stroke-width:1;stroke-miterlimit:4;stroke-dasharray:none" />
</svg>
