<?xml version="1.0" encoding="UTF-8" standalone="no"?>
<svg
   height="24"
   width="24"
   version="1.1"
   id="svg399"
   sodipodi:docname="state_fatal_150.svg"
   inkscape:export-filename="state_fatal_150.png"
   inkscape:export-xdpi="96"
   inkscape:export-ydpi="96"
   inkscape:version="1.2.2 (732a01da63, 2022-12-09)"
   xmlns:inkscape="http://www.inkscape.org/namespaces/inkscape"
   xmlns:sodipodi="http://sodipodi.sourceforge.net/DTD/sodipodi-0.dtd"
   xmlns="http://www.w3.org/2000/svg"
   xmlns:svg="http://www.w3.org/2000/svg">
  <defs
     id="defs403" />
  <sodipodi:namedview
     id="namedview401"
     pagecolor="#ffffff"
     bordercolor="#666666"
     borderopacity="1.0"
     inkscape:showpageshadow="2"
     inkscape:pageopacity="0.0"
     inkscape:pagecheckerboard="0"
     inkscape:deskcolor="#d1d1d1"
     showgrid="true"
     inkscape:zoom="38.25"
     inkscape:cx="11.986928"
     inkscape:cy="12"
     inkscape:current-layer="svg399">
    <inkscape:grid
       type="xygrid"
       id="grid764" />
  </sodipodi:namedview>
  <g
     fill="#f00"
     fill-rule="evenodd"
     transform="matrix(1.49999997 0 0 1.50000001 -.000001 0)"
     id="g397">
    <circle
       cx="8"
       cy="8"
       fill="#f00"
       fill-rule="evenodd"
       r="8"
       id="circle393" />
    <path
       d="m2 8h12"
       fill="none"
       stroke="#fff"
       stroke-width="2.333333"
       id="path395" />
  </g>
</svg>
