<?xml version="1.0" encoding="UTF-8" standalone="no"?>
<svg
   height="16"
   width="16"
   version="1.1"
   id="svg153"
   sodipodi:docname="Copy_02_16.svg"
   inkscape:export-filename="Copy_02_16.png"
   inkscape:export-xdpi="96"
   inkscape:export-ydpi="96"
   inkscape:version="1.2-beta (1b65182ce9, 2022-04-05)"
   xmlns:inkscape="http://www.inkscape.org/namespaces/inkscape"
   xmlns:sodipodi="http://sodipodi.sourceforge.net/DTD/sodipodi-0.dtd"
   xmlns="http://www.w3.org/2000/svg"
   xmlns:svg="http://www.w3.org/2000/svg">
  <defs
     id="defs157" />
  <sodipodi:namedview
     id="namedview155"
     pagecolor="#ffffff"
     bordercolor="#666666"
     borderopacity="1.0"
     inkscape:pageshadow="2"
     inkscape:pageopacity="0.0"
     inkscape:pagecheckerboard="0"
     inkscape:deskcolor="#d1d1d1"
     showgrid="true"
     inkscape:zoom="57.375"
     inkscape:cx="8"
     inkscape:cy="8"
     inkscape:current-layer="svg153">
    <inkscape:grid
       type="xygrid"
       id="grid975" />
  </sodipodi:namedview>
  <g
     fill="none"
     stroke="#00aad4"
     id="g151">
    <path
       d="m1.5 4.5h6.5l2.5 2.5v8.5h-9z"
       id="path141" />
    <path
       d="m7.5 4.5v3h3"
       id="path143" />
    <g
       transform="translate(4 -3)"
       id="g149">
      <path
         d="m1.5 7v-3.5h6.5l2.5 2.5v8.5h-3.5"
         id="path145" />
      <path
         d="m7.5 3.5v3h3"
         id="path147" />
    </g>
  </g>
</svg>
