<?xml version="1.0" encoding="UTF-8" standalone="no"?>
<svg
   height="32"
   width="32"
   version="1.1"
   id="svg1511"
   sodipodi:docname="menu_exporthtml_200.svg"
   inkscape:export-filename="menu_exporthtml_200.png"
   inkscape:export-xdpi="96"
   inkscape:export-ydpi="96"
   inkscape:version="1.2.2 (732a01da63, 2022-12-09)"
   xmlns:inkscape="http://www.inkscape.org/namespaces/inkscape"
   xmlns:sodipodi="http://sodipodi.sourceforge.net/DTD/sodipodi-0.dtd"
   xmlns="http://www.w3.org/2000/svg"
   xmlns:svg="http://www.w3.org/2000/svg">
  <defs
     id="defs1515" />
  <sodipodi:namedview
     id="namedview1513"
     pagecolor="#ffffff"
     bordercolor="#666666"
     borderopacity="1.0"
     inkscape:showpageshadow="2"
     inkscape:pageopacity="0.0"
     inkscape:pagecheckerboard="0"
     inkscape:deskcolor="#d1d1d1"
     showgrid="true"
     inkscape:zoom="28.6875"
     inkscape:cx="15.233115"
     inkscape:cy="16"
     inkscape:current-layer="svg1511">
    <inkscape:grid
       type="xygrid"
       id="grid2388" />
  </sodipodi:namedview>
  <g
     fill="none"
     stroke="#00aad4"
     stroke-width=".75"
     transform="scale(2)"
     id="g1509"
     style="stroke:#2a7fff;stroke-opacity:1">
    <circle
       cx="8"
       cy="8"
       r="7"
       stroke-dashoffset="1.49998"
       stroke-linecap="round"
       stroke-linejoin="round"
       id="circle1495"
       style="stroke:#2a7fff;stroke-opacity:1" />
    <path
       d="m8 1v14"
       id="path1497"
       style="stroke:#2a7fff;stroke-opacity:1" />
    <path
       d="m8 1c5 2 5 11.968323 0 14"
       id="path1499"
       style="stroke:#2a7fff;stroke-opacity:1" />
    <path
       d="m8 1c-5.0000005 2-5.0000005 11.968323 0 14"
       id="path1501"
       style="stroke:#2a7fff;stroke-opacity:1" />
    <path
       d="m15 8h-14"
       id="path1503"
       style="stroke:#2a7fff;stroke-opacity:1" />
    <path
       d="m13.999656 4.5c-4.0234734.6733929-8.0230035.6599125-12 0"
       id="path1505"
       style="stroke:#2a7fff;stroke-opacity:1" />
    <path
       d="m13.999656 11.499862c-4.0234734-.673393-8.0230035-.659912-12 0"
       id="path1507"
       style="stroke:#2a7fff;stroke-opacity:1" />
  </g>
</svg>
