<?xml version="1.0" encoding="UTF-8" standalone="no"?>
<svg
   height="32"
   width="32"
   version="1.1"
   id="svg1103"
   sodipodi:docname="menu_goto_bookmark2_200.svg"
   inkscape:export-filename="menu_goto_bookmark2_200.png"
   inkscape:export-xdpi="96"
   inkscape:export-ydpi="96"
   inkscape:version="1.2.2 (732a01da63, 2022-12-09)"
   xmlns:inkscape="http://www.inkscape.org/namespaces/inkscape"
   xmlns:sodipodi="http://sodipodi.sourceforge.net/DTD/sodipodi-0.dtd"
   xmlns="http://www.w3.org/2000/svg"
   xmlns:svg="http://www.w3.org/2000/svg">
  <defs
     id="defs1107" />
  <sodipodi:namedview
     id="namedview1105"
     pagecolor="#ffffff"
     bordercolor="#666666"
     borderopacity="1.0"
     inkscape:showpageshadow="2"
     inkscape:pageopacity="0.0"
     inkscape:pagecheckerboard="0"
     inkscape:deskcolor="#d1d1d1"
     showgrid="true"
     inkscape:zoom="28.6875"
     inkscape:cx="15.982571"
     inkscape:cy="16"
     inkscape:current-layer="svg1103">
    <inkscape:grid
       type="xygrid"
       id="grid1226" />
  </sodipodi:namedview>
  <radialGradient
     id="a"
     cx="17"
     cy="17.5"
     gradientUnits="userSpaceOnUse"
     r="12">
    <stop
       offset="0"
       stop-color="#2a7fff"
       id="stop1090" />
    <stop
       offset=".69999999"
       stop-color="#4d94ff"
       id="stop1092" />
    <stop
       offset="1"
       stop-color="#96bdff"
       id="stop1094" />
  </radialGradient>
  <g
     transform="translate(-1 -2.5)"
     id="g1101">
    <circle
       cx="17"
       cy="17.5"
       fill="url(#a)"
       r="12"
       id="circle1097" />
    <path
       d="m13.031781 22.885742c1.715611-2.29741 3.450683-4.580808 5.153809-6.887207.567597-.870299.991177-2.047108.470161-3.036535-.507577-.848449-1.69993-.960108-2.551384-.635147-.719855.295543-1.121417 1.063466-1.18782 1.808926-.683537-.0066-1.393359.01313-2.060547-.0098.178438-1.44173.945665-2.915706 2.338105-3.506012 1.164112-.493071 2.525956-.452842 3.701018-.01495 1.193715.42791 1.973238 1.624877 2.043916 2.868376.176262 1.508969-.564188 2.934474-1.472492 4.08608-1.266016 1.720086-2.532031 3.440172-3.798047 5.160258h5.371094v1.894531c-2.669271 0-5.338542 0-8.007813 0 0-.576172 0-1.152344 0-1.728516z"
       fill="#fff"
       id="path1099" />
  </g>
</svg>
