<?xml version="1.0" encoding="UTF-8" standalone="no"?>
<svg
   width="36"
   height="36"
   version="1.1"
   viewBox="0 0 36 36"
   id="svg4"
   sodipodi:docname="tarrow_150.svg"
   inkscape:export-filename="tarrow_150.png"
   inkscape:export-xdpi="96"
   inkscape:export-ydpi="96"
   inkscape:version="1.3.2 (091e20e, 2023-11-25, custom)"
   xmlns:inkscape="http://www.inkscape.org/namespaces/inkscape"
   xmlns:sodipodi="http://sodipodi.sourceforge.net/DTD/sodipodi-0.dtd"
   xmlns="http://www.w3.org/2000/svg"
   xmlns:svg="http://www.w3.org/2000/svg">
  <defs
     id="defs4" />
  <sodipodi:namedview
     id="namedview4"
     pagecolor="#ffffff"
     bordercolor="#000000"
     borderopacity="0.25"
     inkscape:showpageshadow="2"
     inkscape:pageopacity="0.0"
     inkscape:pagecheckerboard="0"
     inkscape:deskcolor="#d1d1d1"
     showgrid="true"
     inkscape:current-layer="svg4">
    <inkscape:grid
       id="grid4"
       units="px"
       originx="0"
       originy="0"
       spacingx="0.5"
       spacingy="0.5"
       empcolor="#0099e5"
       empopacity="0.30196078"
       color="#0099e5"
       opacity="0.14901961"
       empspacing="2"
       dotted="false"
       gridanglex="30"
       gridanglez="30"
       visible="true" />
  </sodipodi:namedview>
  <g
     transform="translate(0,-1016.3622)"
     fill="#2a7efe"
     fill-rule="evenodd"
     stroke="#2a7efe"
     stroke-linejoin="round"
     id="g4">
    <path
       d="m18 1020.2306 4.57894 7.6316h-9.15788z"
       id="path1" />
    <path
       d="m18 1048.4938 4.57894-7.6316h-9.15788z"
       id="path2" />
    <path
       d="m3.8684337 1034.3622 7.6315663-4.5789v9.1578z"
       id="path3" />
    <path
       d="m32.131566 1034.3622-7.631566-4.5789v9.1578z"
       id="path4" />
  </g>
</svg>
