<?xml version="1.0" encoding="UTF-8" standalone="no"?>
<svg
   width="24"
   height="24"
   clip-rule="evenodd"
   fill-rule="evenodd"
   image-rendering="optimizeQuality"
   shape-rendering="geometricPrecision"
   text-rendering="geometricPrecision"
   version="1.1"
   viewBox="0 0 692.47185 692.47185"
   id="svg10"
   sodipodi:docname="textdirectdispatcher.svg"
   inkscape:export-filename="textdirectdispatcher.png"
   inkscape:export-xdpi="96"
   inkscape:export-ydpi="96"
   inkscape:version="1.3.2 (091e20e, 2023-11-25, custom)"
   xmlns:inkscape="http://www.inkscape.org/namespaces/inkscape"
   xmlns:sodipodi="http://sodipodi.sourceforge.net/DTD/sodipodi-0.dtd"
   xmlns="http://www.w3.org/2000/svg"
   xmlns:svg="http://www.w3.org/2000/svg">
  <defs
     id="defs10" />
  <sodipodi:namedview
     id="namedview10"
     pagecolor="#ffffff"
     bordercolor="#000000"
     borderopacity="0.25"
     inkscape:showpageshadow="2"
     inkscape:pageopacity="0.0"
     inkscape:pagecheckerboard="0"
     inkscape:deskcolor="#d1d1d1"
     showgrid="true"
     inkscape:current-layer="svg10">
    <inkscape:grid
       id="grid10"
       units="px"
       originx="0"
       originy="0"
       spacingx="14.426497"
       spacingy="14.426497"
       empcolor="#0099e5"
       empopacity="0.30196078"
       color="#0099e5"
       opacity="0.14901961"
       empspacing="2"
       dotted="false"
       gridanglex="30"
       gridanglez="30"
       visible="true" />
  </sodipodi:namedview>
  <rect
     x="14.426497"
     y="14.426485"
     width="663.61884"
     height="663.61884"
     rx="57.705986"
     fill="#acf"
     stroke="#b3b3b3"
     stroke-dashoffset="1.49998"
     stroke-linecap="round"
     stroke-linejoin="round"
     stroke-width="28.853"
     id="rect1" />
  <g
     clip-rule="evenodd"
     fill="#e31e24"
     fill-rule="nonzero"
     shape-rendering="geometricPrecision"
     stroke-width=".110676"
     id="g6">
    <path
       d="m171.12876 541.56419h-60.1908v38.47399h67.08372v23.99575h-91.462699v-141.99363h89.109689v23.99576h-64.73071v31.53237h60.1908z"
       image-rendering="optimizeQuality"
       id="path1" />
    <path
       d="m256.84803 530.02848 41.4727 74.00545h-29.19913l-26.67696-48.09248-26.70448 48.09248h-29.22665l41.55626-74.0379-37.68893-67.95573h28.38593l23.7064 42.27475 23.7064-42.27475h28.44197z"
       image-rendering="optimizeQuality"
       id="path2" />
    <path
       d="m384.02812 485.68736h-35.47553v117.99787h-24.37898v-117.99787h-35.64367v-23.99576h95.49818z"
       image-rendering="optimizeQuality"
       id="path3" />
    <path
       d="m365.72308 604.03393v-27.16907h23.03382v27.16907z"
       image-rendering="optimizeQuality"
       id="path4" />
    <path
       d="m463.23123 461.69162h24.37898v89.96936c0 11.76769-0.86926 20.82365-2.63427 27.16907-2.35403 8.26263-6.6137 14.90735-12.80551 19.93055-6.16532 4.99197-14.31984 7.50296-24.46357 7.50296-11.8802 0-21.01608-3.90053-27.40457-11.73403-6.41702-7.83472-9.64031-19.33677-9.69534-34.47369l23.03382-3.17331c0.28025 8.09915 1.26058 13.81712 2.99808 17.1539 2.60574 5.09052 6.55663 7.63518 11.88122 7.63518 5.35211 0 9.16339-1.81744 11.37679-5.48598 2.2134-3.63609 3.33437-11.20515 3.33437-22.7072z"
       image-rendering="optimizeQuality"
       id="path5" />
    <path
       d="m514.30665 558.02458 23.7064-2.77665c1.42872 9.35406 4.28718 16.19591 8.63042 20.59166 4.34425 4.39575 10.20079 6.57741 17.57064 6.57741 7.78969 0 13.67477-1.94967 17.62464-5.8502 3.9509-3.90052 5.94113-8.46095 5.94113-13.6837 0-3.37165-0.83971-6.21439-2.49364-8.59317-1.65292-2.34634-4.56845-4.39577-8.71501-6.11463-2.83095-1.19-9.27549-3.23943-19.36316-6.21441-12.97366-3.83322-22.081-8.52828-27.32101-14.11282-7.36984-7.83472-11.04152-17.3859-11.04152-28.65716 0-7.23731 1.7375-14.04791 5.18396-20.35967 3.475-6.31298 8.4633-11.10539 14.9914-14.41093 6.53014-3.30432 14.37588-4.95829 23.62182-4.95829 15.04846 0 26.39671 3.93299 33.99177 11.8326 7.62155 7.89962 11.60098 18.41001 11.9923 31.59849l-24.37898 0.99045c-1.03638-7.33707-3.24978-12.59227-6.64121-15.79924-3.39042-3.20697-8.49081-4.82607-15.27164-4.82607-7.00604 0-12.49878 1.71887-16.44865 5.15663-2.55071 2.21411-3.8388 5.15543-3.8388 8.85762 0 3.37045 1.20453 6.24686 3.6146 8.62685 3.05413 3.07353 10.48002 6.24684 22.27666 9.55238 11.79766 3.27187 20.51165 6.70962 26.14399 10.21349 5.66088 3.53631 10.0887 8.32873 13.28244 14.44457 3.19475 6.11463 4.79162 13.65125 4.79162 22.60864 0 8.1304-1.90565 15.76558-5.74445 22.87188-3.8388 7.10629-9.24695 12.39514-16.25197 15.83289-7.00604 3.47142-15.74856 5.18909-26.20106 5.18909-15.21457 0-26.90013-4.13132-35.05465-12.4288-8.15452-8.26263-13.00219-20.32722-14.60008-36.16012z"
       image-rendering="optimizeQuality"
       id="path6" />
  </g>
  <g
     transform="matrix(1.0000026,0,0,1.0000026,-158.69145,57.705993)"
     id="g10">
    <path
       d="m317.38209 176.47037c7.72523-0.18381 14.01767-2.02942 18.87766-5.62925 4.86-3.55237 8.13375-8.44361 9.71998-14.62659 1.58621-6.22897 2.45581-16.84143 2.55815-31.88284 0.0516-15.04142 0.30709-24.961835 0.76728-29.760473 0.92029-7.56725 2.55812-13.610435 5.0139-18.224143 2.40412-4.567978 5.42245-8.259509 9.00428-11.027422 3.58087-2.722323 8.18441-4.845748 13.76052-6.275514 3.78558-0.876688 9.92399-1.338296 18.51856-1.338296h8.33844v21.316845h-4.60457c-10.28228 0-17.08626 1.706726-20.46253 5.075337-3.32546 3.367711-5.01393 10.888342-5.01393 22.608786 0 23.57746-0.56254 38.48061-1.68763 44.70942-1.79091 9.64306-4.91065 17.07132-9.25969 22.28475-4.39979 5.21427-11.25426 9.87462-20.6674 13.88862 11.10086 4.15292 19.1331 10.47351 24.14654 18.96295 4.96139 8.48943 7.46793 22.42384 7.46793 41.75661 0 17.5336 0.10235 27.95967 0.30708 31.28312 0.81797 6.1366 2.81358 10.38188 6.03573 12.82743 3.27472 2.44536 9.61884 3.64554 19.08169 3.64554h4.65616v21.31686h-8.39013c-9.77056 0-16.88225-0.73859-21.2811-2.16923-6.34378-2.07606-11.66398-5.39801-15.85797-10.0587-4.19503-4.61372-6.90633-10.47353-8.13469-17.5786-1.27912-7.10556-1.94399-18.77886-2.04541-34.97391-0.10234-16.19505-0.972-27.40657-2.55814-33.59037-1.58612-6.22898-4.75848-11.11989-9.56655-14.71824-4.85989-3.599-11.04938-5.49032-18.72336-5.67498v-22.14729z"
       clip-rule="evenodd"
       fill="#1f1b20"
       fill-rule="nonzero"
       image-rendering="optimizeQuality"
       shape-rendering="geometricPrecision"
       stroke-width=".0891867"
       id="path7" />
    <path
       d="m692.47004 176.47037c-7.72524-0.18381-14.01768-2.02942-18.87767-5.62924-4.85998-3.55238-8.13375-8.44362-9.71999-14.6266-1.58622-6.22896-2.45579-16.84143-2.55812-31.88285-0.0516-15.04142-0.30712-24.961835-0.76726-29.760473-0.92034-7.56726-2.55815-13.610425-5.01396-18.224143-2.40417-4.567978-5.42243-8.259499-9.00426-11.027412-3.58086-2.722323-8.18449-4.845748-13.76053-6.275514-3.78557-0.876688-9.92397-1.338296-18.51853-1.338296h-8.33844v21.316845h4.60448c10.28227 0 17.08626 1.706726 20.46252 5.075327 3.32545 3.367711 5.01393 10.888352 5.01393 22.608806 0 23.57746 0.56255 38.48059 1.68763 44.70941 1.7909 9.64306 4.91064 17.07132 9.25971 22.28475 4.39977 5.21425 11.25425 9.87461 20.66736 13.88862-11.10084 4.15291-19.1331 10.47351-24.14651 18.96295-4.9614 8.48942-7.46793 22.42384-7.46793 41.75661 0 17.5336-0.10234 27.95966-0.30708 31.28311-0.81797 6.1366-2.81366 10.38189-6.03573 12.82742-3.27472 2.44537-9.61884 3.64556-19.08169 3.64556h-4.65616v21.31686h8.39014c9.77054 0 16.88225-0.73859 21.28109-2.16924 6.34379-2.07606 11.66399-5.39801 15.85796-10.05869 4.19503-4.61373 6.90634-10.47354 8.1347-17.57861 1.27911-7.10556 1.94402-18.77885 2.0454-34.9739 0.10234-16.19505 0.97201-27.40658 2.55815-33.59039 1.58621-6.22898 4.75851-11.11987 9.56654-14.71824 4.86-3.599 11.0494-5.4903 18.7234-5.67496v-22.1473z"
       clip-rule="evenodd"
       fill="#1f1b20"
       fill-rule="nonzero"
       image-rendering="optimizeQuality"
       shape-rendering="geometricPrecision"
       stroke-width=".0891869"
       id="path8" />
    <path
       d="m504.92607 100.98521-3e-5 173.11749"
       fill="none"
       stroke="#0097bd"
       stroke-linecap="round"
       stroke-width="28.8529"
       id="path9" />
    <path
       d="m504.92604 274.1027 57.70584-57.70583m-57.70584 57.70583-57.70583-57.70583"
       fill="none"
       stroke="#0097bd"
       stroke-linecap="round"
       stroke-width="28.8529"
       id="path10" />
  </g>
</svg>
