<?xml version="1.0" encoding="UTF-8" standalone="no"?>
<svg
   height="64"
   width="64"
   version="1.1"
   id="svg608"
   sodipodi:docname="Search_01_64.svg"
   inkscape:export-filename="Search_01_64.png"
   inkscape:export-xdpi="96"
   inkscape:export-ydpi="96"
   inkscape:version="1.2-beta (1b65182ce9, 2022-04-05)"
   xmlns:inkscape="http://www.inkscape.org/namespaces/inkscape"
   xmlns:sodipodi="http://sodipodi.sourceforge.net/DTD/sodipodi-0.dtd"
   xmlns="http://www.w3.org/2000/svg"
   xmlns:svg="http://www.w3.org/2000/svg">
  <defs
     id="defs610" />
  <sodipodi:namedview
     id="namedview12"
     pagecolor="#ffffff"
     bordercolor="#666666"
     borderopacity="1.0"
     inkscape:pageshadow="2"
     inkscape:pageopacity="0.0"
     inkscape:pagecheckerboard="0"
     inkscape:deskcolor="#d1d1d1"
     showgrid="true"
     inkscape:zoom="14.34375"
     inkscape:cx="32"
     inkscape:cy="32"
     inkscape:current-layer="svg608">
    <inkscape:grid
       type="xygrid"
       id="grid139" />
  </sodipodi:namedview>
  <radialGradient
     id="a"
     cx="5.988626"
     cy="7.28811"
     gradientTransform="matrix(-5.5e-7,3.4666666,-3.2000002,-5e-7,31.296708,-14.760566)"
     gradientUnits="userSpaceOnUse"
     r="3.75">
    <stop
       offset="0"
       stop-color="#f8fbff"
       id="stop595" />
    <stop
       offset=".66666657"
       stop-color="#d1e3ff"
       id="stop597" />
    <stop
       offset="1"
       stop-color="#f8fbff"
       id="stop599" />
  </radialGradient>
  <g
     stroke-linecap="round"
     id="g606"
     transform="matrix(1.9984231,0,0,2.0015814,0.05046105,0)">
    <circle
       cx="10.97475"
       cy="11"
       fill="url(#a)"
       fill-rule="evenodd"
       r="10.25"
       stroke="#dd8703"
       stroke-linejoin="round"
       stroke-width="1.5"
       id="circle602"
       style="fill:url(#a)" />
    <path
       d="m 19.5,19.474749 10,10.000001"
       fill="none"
       stroke="#a05a2c"
       stroke-width="5"
       id="path604" />
  </g>
</svg>
