<?xml version="1.0" encoding="UTF-8" standalone="no"?>
<svg
   height="16"
   width="16"
   version="1.1"
   id="svg159"
   sodipodi:docname="Open_02_16.svg"
   inkscape:export-filename="Open_02_16.png"
   inkscape:export-xdpi="96"
   inkscape:export-ydpi="96"
   inkscape:version="1.2-beta (1b65182ce9, 2022-04-05)"
   xmlns:inkscape="http://www.inkscape.org/namespaces/inkscape"
   xmlns:sodipodi="http://sodipodi.sourceforge.net/DTD/sodipodi-0.dtd"
   xmlns="http://www.w3.org/2000/svg"
   xmlns:svg="http://www.w3.org/2000/svg">
  <defs
     id="defs163" />
  <sodipodi:namedview
     id="namedview161"
     pagecolor="#ffffff"
     bordercolor="#666666"
     borderopacity="1.0"
     inkscape:pageshadow="2"
     inkscape:pageopacity="0.0"
     inkscape:pagecheckerboard="0"
     inkscape:deskcolor="#d1d1d1"
     showgrid="true"
     inkscape:zoom="57.375"
     inkscape:cx="8"
     inkscape:cy="8"
     inkscape:current-layer="svg159">
    <inkscape:grid
       type="xygrid"
       id="grid910" />
  </sodipodi:namedview>
  <g
     fill="none"
     stroke="#00aad4"
     stroke-linecap="round"
     stroke-linejoin="round"
     transform="translate(1 -2)"
     id="g149">
    <path
       d="m7.5 8.5000248v-6.0000248"
       id="path145" />
    <path
       d="m5 5.0000248 2.5-2.5000579 2.5 2.5000579"
       id="path147" />
  </g>
  <g
     stroke-width=".927015"
     transform="matrix(1.0770085 0 0 1.0804558 -.11607 -.76061)"
     id="g157">
    <path
       d="m12.035012 5.9711c2.170032 1.1881731 3.015751 3.1965117 2.107775 5.005354-.907976 1.808841-3.370742 3.02193-6.137916 3.023364-2.7671729.0014-5.232562-1.209102-6.1444513-3.017-.91188953-1.8078993-.0705165-3.8171125 2.0969412-5.0075328"
       fill="none"
       stroke="#00aad4"
       stroke-dashoffset="1.49998"
       stroke-linecap="round"
       stroke-width=".927201"
       id="path151" />
    <path
       d="m10.185319 7.824c1.490909.48195 2.167925 1.394851 1.664007 2.243775-.503917.848925-2.0687706 1.431717-3.8461783 1.432418-1.7774082.000701-3.3441113-.580855-3.8507285-1.429382s.1674947-1.761959 1.6568692-2.245085"
       fill="none"
       stroke="#00aad4"
       stroke-dashoffset="1.49998"
       stroke-linecap="round"
       stroke-width=".927015"
       id="path153" />
    <ellipse
       cx="8"
       cy="9.499991"
       fill="#00aad4"
       rx="1"
       ry=".5"
       id="ellipse155" />
  </g>
</svg>
