<?xml version="1.0" encoding="UTF-8" standalone="no"?>
<svg
   height="64"
   width="64"
   version="1.1"
   id="svg10"
   sodipodi:docname="Align_06_64.svg"
   inkscape:export-filename="Align_06_64.png"
   inkscape:export-xdpi="96"
   inkscape:export-ydpi="96"
   inkscape:version="1.3-beta (cedbd6c6ff, 2023-05-28)"
   xmlns:inkscape="http://www.inkscape.org/namespaces/inkscape"
   xmlns:sodipodi="http://sodipodi.sourceforge.net/DTD/sodipodi-0.dtd"
   xmlns="http://www.w3.org/2000/svg"
   xmlns:svg="http://www.w3.org/2000/svg">
  <defs
     id="defs10" />
  <sodipodi:namedview
     id="namedview10"
     pagecolor="#ffffff"
     bordercolor="#000000"
     borderopacity="0.25"
     inkscape:showpageshadow="2"
     inkscape:pageopacity="0.0"
     inkscape:pagecheckerboard="0"
     inkscape:deskcolor="#d1d1d1"
     showgrid="true"
     inkscape:zoom="14.203125"
     inkscape:cx="6.8646865"
     inkscape:cy="32.070407"
     inkscape:current-layer="svg10">
    <inkscape:grid
       id="grid10"
       units="px"
       originx="0"
       originy="0"
       spacingx="0.5"
       spacingy="0.5"
       empcolor="#0099e5"
       empopacity="0.30196078"
       color="#0099e5"
       opacity="0.14901961"
       empspacing="2"
       dotted="false"
       gridanglex="30"
       gridanglez="30"
       visible="true" />
  </sodipodi:namedview>
  <path
     d="M 16,55.4 H 56"
     id="path1"
     style="fill:none;stroke:#00aad4;stroke-width:3.2" />
  <path
     d="M 28,39.4 H 56"
     stroke-width="3.2"
     id="path2"
     style="fill:none;stroke:#00aad4" />
  <path
     d="M 28,23.4 H 56"
     stroke-width="3.2"
     id="path3"
     style="fill:none;stroke:#00aad4" />
  <path
     d="M 16,47.4 H 56"
     id="path4"
     style="fill:none;stroke:#00aad4;stroke-width:3.2" />
  <path
     d="M 28,31.4 H 56"
     stroke-width="3.2"
     id="path5"
     style="fill:none;stroke:#00aad4" />
  <path
     d="M 16,15.4 H 56"
     id="path6"
     style="fill:none;stroke:#00aad4;stroke-width:3.2" />
  <path
     d="M 16,7.4 H 56"
     id="path7"
     style="fill:none;stroke:#00aad4;stroke-width:3.2" />
  <g
     stroke-linecap="round"
     stroke-width="3"
     id="g9"
     transform="matrix(-1,0,0,1,25,-0.1)"
     style="fill:none;stroke:#00aad4">
    <path
       d="m 1.5,31.6 h 22"
       id="path8" />
    <path
       d="m 15.5,23.6 8,8 -8,8"
       fill="none"
       stroke="#00aad4"
       stroke-linejoin="round"
       id="path9" />
  </g>
</svg>
