<?xml version="1.0" encoding="UTF-8" standalone="no"?>
<svg
   height="48"
   width="48"
   version="1.1"
   id="svg299"
   sodipodi:docname="Zoom_01_48.svg"
   inkscape:version="1.2-beta (1b65182ce9, 2022-04-05)"
   inkscape:export-filename="Zoom_01_48.png"
   inkscape:export-xdpi="96"
   inkscape:export-ydpi="96"
   xmlns:inkscape="http://www.inkscape.org/namespaces/inkscape"
   xmlns:sodipodi="http://sodipodi.sourceforge.net/DTD/sodipodi-0.dtd"
   xmlns="http://www.w3.org/2000/svg"
   xmlns:svg="http://www.w3.org/2000/svg">
  <defs
     id="defs303" />
  <sodipodi:namedview
     id="namedview301"
     pagecolor="#ffffff"
     bordercolor="#666666"
     borderopacity="1.0"
     inkscape:pageshadow="2"
     inkscape:pageopacity="0.0"
     inkscape:pagecheckerboard="0"
     inkscape:deskcolor="#d1d1d1"
     showgrid="true"
     inkscape:zoom="19.125"
     inkscape:cx="19.346405"
     inkscape:cy="24"
     inkscape:current-layer="svg299">
    <inkscape:grid
       type="xygrid"
       id="grid609" />
  </sodipodi:namedview>
  <radialGradient
     id="a"
     cx="5.988626"
     cy="7.28811"
     gradientTransform="matrix(-8.393377e-7,5.2040591,-4.7962158,-7.6059326e-7,46.945894,-22.158573)"
     gradientUnits="userSpaceOnUse"
     r="3.75">
    <stop
       offset="0"
       stop-color="#f8fbff"
       id="stop284" />
    <stop
       offset=".66666657"
       stop-color="#d1e3ff"
       id="stop286" />
    <stop
       offset="1"
       stop-color="#f8fbff"
       id="stop288" />
  </radialGradient>
  <g
     id="g607">
    <ellipse
       cx="16.48699"
       cy="16.512438"
       fill="url(#a)"
       fill-rule="evenodd"
       stroke="#dd8703"
       stroke-linejoin="round"
       stroke-width="2.24999"
       id="circle293"
       style="fill:url(#a);stroke-linecap:round"
       rx="15.362878"
       ry="15.387002" />
    <path
       d="M 29.264784,29.234485 44.252957,44.246194"
       fill="none"
       stroke="#a05a2c"
       stroke-width="7.49997"
       id="path295"
       style="stroke-linecap:round" />
  </g>
  <g
     id="g5894"
     transform="translate(0,3)">
    <path
       d="M 18.5,37 H 3.5"
       id="path1031"
       style="fill:none;stroke:#ffffff;stroke-width:7;stroke-linecap:round;stroke-dasharray:none" />
    <path
       d="M 18.5,37 H 3.5"
       id="path13-4"
       style="fill:none;stroke:#ff0000;stroke-width:4;stroke-linecap:round;stroke-dasharray:none" />
  </g>
</svg>
