<?xml version="1.0" encoding="UTF-8" standalone="no"?>
<svg
   width="16"
   height="16"
   version="1.1"
   viewBox="0 0 16 16"
   id="svg42"
   sodipodi:docname="win_messages_ico_016.svg"
   inkscape:export-filename="win_messages_ico_016.png"
   inkscape:export-xdpi="96"
   inkscape:export-ydpi="96"
   inkscape:version="1.1.1 (3bf5ae0d25, 2021-09-20)"
   xmlns:inkscape="http://www.inkscape.org/namespaces/inkscape"
   xmlns:sodipodi="http://sodipodi.sourceforge.net/DTD/sodipodi-0.dtd"
   xmlns="http://www.w3.org/2000/svg"
   xmlns:svg="http://www.w3.org/2000/svg">
  <defs
     id="defs46" />
  <sodipodi:namedview
     id="namedview44"
     pagecolor="#ffffff"
     bordercolor="#666666"
     borderopacity="1.0"
     inkscape:pageshadow="2"
     inkscape:pageopacity="0.0"
     inkscape:pagecheckerboard="0"
     showgrid="false"
     inkscape:zoom="46.5625"
     inkscape:cx="7.9892617"
     inkscape:cy="8"
     inkscape:current-layer="svg42" />
  <radialGradient
     id="a"
     cx="7.9998"
     cy="7.9999"
     r="9.0002"
     gradientTransform="translate(0.50037)"
     gradientUnits="userSpaceOnUse">
    <stop
       stop-color="#e5a0ff"
       offset="0"
       id="stop2" />
    <stop
       stop-color="#fff"
       offset="1"
       id="stop4" />
  </radialGradient>
  <radialGradient
     id="b"
     cx="7.9995"
     cy="7.9995"
     r="7.6663"
     gradientTransform="translate(0.50037)"
     gradientUnits="userSpaceOnUse">
    <stop
       stop-color="#d25cfe"
       offset="0"
       id="stop7" />
    <stop
       stop-color="#e5a0ff"
       offset=".56522"
       id="stop9" />
    <stop
       stop-color="#fff"
       offset="1"
       id="stop11" />
  </radialGradient>
  <g
     id="g975"
     transform="translate(-0.99952212)">
    <path
       d="m 13.611,12.875 c 0.22929,0.07419 0.65631,0.01739 0.89522,-0.17378 0.23889,-0.19118 0.46707,-0.57926 0.63372,-0.8679 0.16668,-0.28865 0.38867,-0.68026 0.43481,-0.98276 0.04612,-0.3025 -0.11821,-0.70067 -0.29712,-0.86213 -0.72259,-0.6522 -0.9656,-0.80676 -0.96539,-1.9882 -1.88e-4,-1.1815 0.24277,-1.336 0.96539,-1.9882 C 15.45654,5.85056 15.62087,5.45236 15.57475,5.1499 15.52861,4.84743 15.30659,4.4558 15.13994,4.16714 14.97329,3.87848 14.7451,3.49041 14.50622,3.29924 14.26731,3.10806 13.84028,3.05127 13.611,3.12546 12.68484,3.42512 12.4295,3.55826 11.4064,2.96735 10.3831,2.37678 10.3707,2.08912 10.1671,1.13725 10.11672,0.90159 9.85403,0.56018 9.56897,0.44892 9.28394,0.33763 8.83377,0.33407 8.50047,0.33407 c -0.3333,0 -0.78353,0.003553 -1.0685,0.11485 C 7.14694,0.56021 6.88422,0.90162 6.83382,1.13725 6.63027,2.08911 6.6179,2.37675 5.59452,2.96735 4.57142,3.55825 4.31602,3.42511 3.38992,3.12546 3.16063,3.051271 2.73358,3.108049 2.4947,3.29924 2.25579,3.49042 2.02763,3.87847 1.86098,4.16714 1.6943,4.4558 1.47231,4.8474 1.42617,5.1499 c -0.04614,0.3025 0.11821,0.70067 0.2971,0.86213 0.72262,0.6522 0.9656,0.80676 0.96541,1.9882 1.883e-4,1.1815 -0.24277,1.336 -0.96541,1.9882 -0.17889,0.16147 -0.34321,0.55966 -0.2971,0.86213 0.04614,0.30247 0.26813,0.6941 0.43481,0.98276 0.16665,0.28866 0.39481,0.67673 0.63372,0.8679 0.23889,0.19118 0.66594,0.24797 0.89522,0.17378 0.92616,-0.29966 1.1815,-0.4328 2.2046,0.15811 1.0233,0.59057 1.0357,0.87823 1.2393,1.8301 0.050399,0.23566 0.3131,0.57706 0.59815,0.68833 0.28503,0.11129 0.73518,0.11485 1.0685,0.11485 0.33332,0 0.78353,-0.0036 1.0685,-0.11485 0.28503,-0.11129 0.54773,-0.4527 0.59813,-0.68833 0.20357,-0.95186 0.21592,-1.2395 1.2393,-1.8301 1.0232,-0.5909 1.2785,-0.45776 2.2046,-0.15811 z"
       fill="url(#a)"
       stroke-width="0.33333"
       id="path14"
       style="fill:url(#a)" />
    <path
       d="M 13.841,6.0003 C 13.09994,6.57887 10.1663,6.6666 8.833,7.3333 7.7666,7.8665 7.6472,8.3304 6.833,10 c -0.43646,0.895 -2.2845,1.2919 -2.5147,1.4263 -0.24169,0.14116 -1.1189,0.992 -1.5286,1.492 0.31665,-0.004 2.2766,-0.18995 2.8044,0.11486 1.0233,0.59056 1.0354,0.8782 1.2389,1.8301 0.050399,0.23566 0.31329,0.57686 0.59829,0.68817 0.28503,0.11129 0.73504,0.11458 1.0684,0.11458 0.33336,0 0.78334,-0.0033 1.0684,-0.11458 0.28503,-0.11129 0.54789,-0.4525 0.59829,-0.68817 0.20355,-0.95186 0.21559,-1.2395 1.2389,-1.8301 1.0231,-0.5909 1.2789,-0.45787 2.2051,-0.1582 0.22929,0.07419 0.65629,0.01736 0.89515,-0.17383 0.23891,-0.19118 0.46681,-0.57917 0.63347,-0.86783 0.16668,-0.28866 0.38877,-0.6806 0.43491,-0.98306 0.04612,-0.30247 -0.11797,-0.7005 -0.29689,-0.86197 -0.72259,-0.6522 -0.96569,-0.80683 -0.96548,-1.9883 -2.12e-4,-1.1815 0.24286,-1.3361 0.96548,-1.9883 0.17891,-0.16147 0.343,-0.5595 0.29689,-0.86197 -0.02188,-0.14393 -0.22334,-0.7472 -0.30002,-0.9108 -0.28726,0.47437 -0.93313,1.3713 -1.4328,1.7614 z"
       fill="url(#b)"
       stroke-width="0.33333"
       id="path16"
       style="fill:url(#b)" />
    <path
       d="m 13.532,12.8 c 0.22577,0.07306 0.64622,0.01713 0.88144,-0.17112 0.2352,-0.18826 0.45987,-0.57039 0.62398,-0.85462 0.1641,-0.28424 0.3827,-0.66988 0.42812,-0.96772 C 15.51096,10.5087 15.34915,10.11659 15.173,9.95759 14.46153,9.31536 14.22227,9.16318 14.22245,7.99979 14.222267,6.83639 14.46151,6.68419 15.17298,6.04199 15.34914,5.88299 15.51093,5.4909 15.4655,5.19305 15.420085,4.89521 15.2015,4.50956 15.03738,4.22533 14.87328,3.94109 14.64865,3.55896 14.41339,3.37071 14.17819,3.18245 13.75772,3.12653 13.53195,3.19958 12.62005,3.49466 12.36865,3.62575 11.36125,3.0439 10.35365,2.46237 10.34145,2.17907 10.14105,1.2418 10.091441,1.00975 9.83278,0.67356 9.55213,0.56396 9.27151,0.45437 8.82826,0.45087 8.49993,0.45087 8.17172,0.45087 7.72846,0.454378 7.44773,0.56396 7.16711,0.67355 6.90845,1.00973 6.85881,1.2418 6.6584,2.17909 6.64621,2.4624 5.63861,3.0439 4.63121,3.62576 4.37981,3.49467 3.46791,3.19958 3.24212,3.126524 2.82166,3.182453 2.58645,3.3707 2.35124,3.55896 2.12658,3.94109 1.96246,4.22532 1.79836,4.50956 1.57978,4.8952 1.53434,5.19304 1.488926,5.49088 1.65073,5.883 1.82688,6.04198 c 0.71147,0.64223 0.95073,0.79441 0.9505,1.9578 2.062e-4,1.1634 -0.23903,1.3156 -0.9505,1.9578 -0.17615,0.159 -0.33795,0.55109 -0.29254,0.84894 0.045436,0.29784 0.26402,0.68349 0.42812,0.96772 0.16412,0.28424 0.38875,0.66637 0.62399,0.85462 0.23523,0.18825 0.65569,0.24418 0.88146,0.17112 0.9119,-0.29508 1.1633,-0.42617 2.1707,0.15568 1.0076,0.58153 1.0198,0.86483 1.2202,1.8021 0.049633,0.23205 0.30829,0.56824 0.58892,0.67784 0.28065,0.10958 0.72389,0.11309 1.0522,0.11309 0.32824,2e-6 0.77149,-0.0035 1.0522,-0.11309 0.28065,-0.10958 0.5393,-0.44577 0.58892,-0.67784 0.20043,-0.93729 0.2126,-1.2206 1.2202,-1.8021 1.0074,-0.58186 1.2588,-0.45077 2.1707,-0.15569 z"
       fill="none"
       stroke="#c934ff"
       stroke-linejoin="round"
       stroke-width="0.9"
       id="path18" />
    <g
       fill="#333333"
       stroke-width="0.31145"
       id="g26">
      <path
         d="m 5.6417,4.779 c 0.6165,0 1.0876,0.16229 1.1405,0.77967 0.089455,1.0444 0.15193,1.7175 -0.023639,2.2356 -0.087848,0.25925 -0.33846,0.85626 -0.79578,1.3944 -0.28666,0.33729 -0.48208,0.69203 -0.41526,1.1711 0.058276,0.41781 0.094578,0.99916 0.43322,1.099 -0.035291,0.18929 -0.073385,0.20698 -0.23973,0.34448 -0.40537,-0.15778 -0.50641,-0.87905 -0.557,-1.4398 -0.044139,-0.48925 0.08598,-1.0081 0.50881,-1.4604 0.81753,-0.87448 1.0331,-1.6363 0.77077,-2.4125 C 6.376939,6.23412 6.420013,6.2535 5.685511,6.28922 c -0.7345,0.035723 -1.1341,-0.52759 -1.3035,-1.0099 -0.18272,-0.10115 -0.58686,0.030107 -0.86658,0.099994 0.23892,-0.40878 1.4613,-0.6002 2.1263,-0.6002 z"
         id="path20" />
      <path
         d="M 8.5004,3.376 8.34469,4.7775 8.5004,5.8676 8.65614,4.7775 Z"
         id="path22" />
      <path
         d="m 11.359,4.779 c -0.6165,0 -1.0876,0.16229 -1.1405,0.77967 -0.08946,1.0444 -0.15193,1.7175 0.02364,2.2356 0.08785,0.25925 0.33846,0.85626 0.79578,1.3944 0.28666,0.33729 0.48208,0.69203 0.41526,1.1711 -0.05827,0.41781 -0.09458,0.99916 -0.43322,1.099 0.03529,0.18929 0.07339,0.20698 0.23973,0.34448 0.40537,-0.15778 0.50641,-0.87905 0.557,-1.4398 0.04414,-0.48925 -0.08598,-1.0081 -0.50881,-1.4604 -0.81753,-0.87448 -1.0331,-1.6363 -0.77077,-2.4125 0.08665,-0.25643 0.04358,-0.23705 0.77808,-0.20133 0.7345,0.035723 1.1341,-0.52759 1.3035,-1.0099 0.18272,-0.10115 0.58686,0.030107 0.86658,0.099994 -0.23892,-0.40878 -1.4613,-0.6002 -2.1263,-0.6002 z"
         id="path24" />
    </g>
    <g
       transform="matrix(1,0,0,1.2547,0.4007,-1.2914)"
       fill="#ffffff"
       stroke-width="0.30936"
       id="g32">
      <ellipse
         transform="matrix(0.98971,0.14307,-0.10373,0.99461,0,0)"
         cx="5.7333002"
         cy="4.8642998"
         rx="0.85325003"
         ry="0.57919002"
         id="ellipse28" />
      <ellipse
         transform="matrix(-0.98971,0.14307,0.10373,0.99461,0,0)"
         cx="-10.391"
         cy="7.1834998"
         rx="0.85325003"
         ry="0.57919002"
         id="ellipse30" />
    </g>
    <g
       transform="matrix(1,0,0,1.607,0.50037,-3.0489)"
       fill="#550000"
       fill-opacity="0.97647"
       id="g38">
      <ellipse
         cx="5.1517"
         cy="5.3527999"
         rx="0.43968999"
         ry="0.32975999"
         stroke-width="0.2457"
         id="ellipse34" />
      <ellipse
         transform="scale(-1,1)"
         cx="-10.848"
         cy="5.3527002"
         rx="0.43968999"
         ry="0.32975999"
         stroke-width="0.24569"
         id="ellipse36" />
    </g>
    <path
       d="m 7.3812,9.6349 c -0.4944,-0.0084 -0.57809,0.82453 -0.0981,1.0377 0.6982,0.31007 0.88905,0.6899 1.0693,0.91914 l 0.0296,0.44475 c -0.21709,0.07079 -1.3706,0.34466 -1.2453,0.56332 0.52524,-0.04359 0.81575,-0.17783 1.3638,-0.17785 v 10e-4 c 0.54802,1.9e-5 0.83853,0.13427 1.3638,0.17785 C 9.98962,12.38215 8.8361,12.10829 8.619,12.03749 L 8.6486,11.59274 C 8.82884,11.36351 9.01969,10.98367 9.7179,10.6736 10.19794,10.46042 10.11425,9.6275 9.6198,9.6359 9.12546,9.6443 8.8562,9.69517 8.5005,9.69518 v -0.001 C 8.14476,9.694168 7.87551,9.64331 7.3812,9.6349 Z"
       fill="#333333"
       stroke-width="0.31132"
       id="path40" />
  </g>
  <g
     id="g914">
    <rect
       style="opacity:1;fill:#749acc;fill-opacity:1;stroke:none;stroke-width:1.12119;stroke-linecap:butt;stroke-linejoin:round;stroke-miterlimit:4;stroke-dasharray:none;stroke-opacity:1;paint-order:normal"
       id="rect979"
       width="11.000001"
       height="6"
       x="4.9999995"
       y="9" />
    <g
       id="g896">
      <rect
         y="11"
         x="6"
         height="3"
         width="9.0019779"
         id="rect981"
         style="opacity:1;fill:#ffffff;fill-opacity:1;stroke:none;stroke-width:0.0940955;stroke-linecap:butt;stroke-linejoin:round;stroke-miterlimit:4;stroke-dasharray:none;stroke-opacity:1;paint-order:normal" />
      <rect
         y="11"
         x="6"
         height="1"
         width="9"
         id="rect983"
         style="opacity:1;fill:#19fd19;fill-opacity:1;stroke:none;stroke-width:1.09342;stroke-linecap:butt;stroke-linejoin:round;stroke-miterlimit:4;stroke-dasharray:none;stroke-opacity:1;paint-order:normal" />
      <rect
         style="opacity:1;fill:#f8f83c;fill-opacity:1;stroke:none;stroke-width:1.09342;stroke-linecap:butt;stroke-linejoin:round;stroke-miterlimit:4;stroke-dasharray:none;stroke-opacity:1;paint-order:normal"
         id="rect985"
         width="9"
         height="1"
         x="6"
         y="12" />
    </g>
    <g
       id="g891">
      <rect
         y="11.23494"
         x="6.5"
         height="0.26506025"
         width="0.77647066"
         id="rect989"
         style="opacity:1;fill:#808080;fill-opacity:1;stroke:none;stroke-width:0.337095;stroke-linecap:butt;stroke-linejoin:round;stroke-miterlimit:4;stroke-dasharray:none;stroke-opacity:1;paint-order:normal" />
      <rect
         style="opacity:1;fill:#808080;fill-opacity:1;stroke:none;stroke-width:0.337095;stroke-linecap:butt;stroke-linejoin:round;stroke-miterlimit:4;stroke-dasharray:none;stroke-opacity:1;paint-order:normal"
         id="rect991"
         width="0.77647066"
         height="0.26506025"
         x="7.6647058"
         y="11.23494" />
      <rect
         y="11.23494"
         x="8.8294115"
         height="0.26506025"
         width="0.582353"
         id="rect993"
         style="opacity:1;fill:#808080;fill-opacity:1;stroke:none;stroke-width:0.291933;stroke-linecap:butt;stroke-linejoin:round;stroke-miterlimit:4;stroke-dasharray:none;stroke-opacity:1;paint-order:normal" />
      <rect
         style="opacity:1;fill:#808080;fill-opacity:1;stroke:none;stroke-width:0.401224;stroke-linecap:butt;stroke-linejoin:round;stroke-miterlimit:4;stroke-dasharray:none;stroke-opacity:1;paint-order:normal"
         id="rect995"
         width="1.1000001"
         height="0.26506025"
         x="6.5"
         y="12.23494" />
      <rect
         y="12.23494"
         x="8"
         height="0.26506025"
         width="0.90588248"
         id="rect997"
         style="opacity:1;fill:#808080;fill-opacity:1;stroke:none;stroke-width:0.364105;stroke-linecap:butt;stroke-linejoin:round;stroke-miterlimit:4;stroke-dasharray:none;stroke-opacity:1;paint-order:normal" />
      <rect
         style="opacity:1;fill:#808080;fill-opacity:1;stroke:none;stroke-width:0.291933;stroke-linecap:butt;stroke-linejoin:round;stroke-miterlimit:4;stroke-dasharray:none;stroke-opacity:1;paint-order:normal"
         id="rect999"
         width="0.582353"
         height="0.26506025"
         x="9.5"
         y="12.23494" />
      <rect
         style="opacity:1;fill:#808080;fill-opacity:1;stroke:none;stroke-width:0.389244;stroke-linecap:butt;stroke-linejoin:round;stroke-miterlimit:4;stroke-dasharray:none;stroke-opacity:1;paint-order:normal"
         id="rect1007"
         width="1.0352943"
         height="0.26506025"
         x="6.5"
         y="13.23494" />
      <rect
         y="13.23494"
         x="8.1117649"
         height="0.26506025"
         width="0.77647066"
         id="rect1009"
         style="opacity:1;fill:#808080;fill-opacity:1;stroke:none;stroke-width:0.337095;stroke-linecap:butt;stroke-linejoin:round;stroke-miterlimit:4;stroke-dasharray:none;stroke-opacity:1;paint-order:normal" />
      <rect
         style="opacity:1;fill:#808080;fill-opacity:1;stroke:none;stroke-width:0.364105;stroke-linecap:butt;stroke-linejoin:round;stroke-miterlimit:4;stroke-dasharray:none;stroke-opacity:1;paint-order:normal"
         id="rect1011"
         width="0.90588248"
         height="0.26506025"
         x="10.5"
         y="13.23494" />
      <rect
         style="opacity:1;fill:#808080;fill-opacity:1;stroke:none;stroke-width:0.337095;stroke-linecap:butt;stroke-linejoin:round;stroke-miterlimit:4;stroke-dasharray:none;stroke-opacity:1;paint-order:normal"
         id="rect1013"
         width="0.77647066"
         height="0.26506025"
         x="10.058824"
         y="11.23494" />
    </g>
  </g>
</svg>
