<?xml version="1.0" encoding="UTF-8" standalone="no"?>
<svg
   width="24"
   height="24"
   version="1.1"
   viewBox="0 0 24 24"
   id="svg13"
   sodipodi:docname="tsynanysyn.svg"
   inkscape:version="1.3.2 (091e20e, 2023-11-25, custom)"
   xmlns:inkscape="http://www.inkscape.org/namespaces/inkscape"
   xmlns:sodipodi="http://sodipodi.sourceforge.net/DTD/sodipodi-0.dtd"
   xmlns="http://www.w3.org/2000/svg"
   xmlns:svg="http://www.w3.org/2000/svg">
  <defs
     id="defs13" />
  <sodipodi:namedview
     id="namedview13"
     pagecolor="#ffffff"
     bordercolor="#000000"
     borderopacity="0.25"
     inkscape:showpageshadow="2"
     inkscape:pageopacity="0.0"
     inkscape:pagecheckerboard="0"
     inkscape:deskcolor="#d1d1d1"
     showgrid="true"
     inkscape:current-layer="svg13">
    <inkscape:grid
       id="grid13"
       units="px"
       originx="0"
       originy="0"
       spacingx="0.5"
       spacingy="0.5"
       empcolor="#0099e5"
       empopacity="0.30196078"
       color="#0099e5"
       opacity="0.14901961"
       empspacing="2"
       dotted="false"
       gridanglex="30"
       gridanglez="30"
       visible="true" />
  </sodipodi:namedview>
  <rect
     x="1.25"
     y="1.2499826"
     width="20.5"
     height="21.5"
     fill="#ffffff"
     fill-rule="evenodd"
     stroke="#2a7efe"
     stroke-linecap="square"
     stroke-linejoin="round"
     stroke-width="0.5"
     style="paint-order:normal"
     id="rect1" />
  <rect
     x="1.5"
     y="1.4999826"
     width="3.5"
     height="21.000017"
     fill="#b3b3b3"
     fill-rule="evenodd"
     style="paint-order:normal"
     id="rect2" />
  <path
     d="M 7,4.5 H 18"
     fill="none"
     stroke="#666666"
     stroke-width="1px"
     id="path2" />
  <path
     d="m 9,6.5 h 4"
     fill="none"
     stroke="#666666"
     stroke-width="1px"
     id="path3" />
  <path
     d="m 11,8.5 h 7"
     fill="none"
     stroke="#666666"
     stroke-width="1px"
     id="path4" />
  <path
     d="M 8.9999994,16.5 H 11"
     fill="none"
     stroke="#666666"
     stroke-width="1px"
     id="path5" />
  <path
     d="m 7,18.5 h 4"
     fill="none"
     stroke="#666666"
     stroke-width="1px"
     id="path6" />
  <path
     d="m 14,6.5 h 3"
     fill="none"
     stroke="#ff0000"
     stroke-width="1px"
     id="path7" />
  <path
     d="m 12,18.4999 h 6"
     fill="none"
     stroke="#ff0000"
     stroke-width="1px"
     id="path8" />
  <path
     d="m 11,16.5 h 3"
     fill="none"
     stroke="#2a7efe"
     stroke-width="1px"
     id="path9" />
  <path
     d="m 14,16.5 h 2"
     fill="none"
     stroke="#666666"
     stroke-width="1px"
     id="path10" />
  <path
     d="m 11,10.5 h 6"
     fill="none"
     stroke="#2a7efe"
     stroke-width="1px"
     id="path11" />
  <path
     d="m 13,12.5 h 4"
     fill="none"
     stroke="#666666"
     stroke-width="1px"
     id="path12" />
  <path
     d="m 11,14.5 h 7"
     fill="none"
     stroke="#37c837"
     stroke-width="1px"
     id="path13" />
</svg>
