<?xml version="1.0" encoding="UTF-8" standalone="no"?>
<svg
   height="24"
   width="24"
   version="1.1"
   id="svg467"
   sodipodi:docname="Picture_13_24.svg"
   inkscape:export-filename="Picture_13_24.png"
   inkscape:export-xdpi="96"
   inkscape:export-ydpi="96"
   inkscape:version="1.2 (dc2aedaf03, 2022-05-15)"
   xmlns:inkscape="http://www.inkscape.org/namespaces/inkscape"
   xmlns:sodipodi="http://sodipodi.sourceforge.net/DTD/sodipodi-0.dtd"
   xmlns="http://www.w3.org/2000/svg"
   xmlns:svg="http://www.w3.org/2000/svg">
  <defs
     id="defs471" />
  <sodipodi:namedview
     id="namedview469"
     pagecolor="#ffffff"
     bordercolor="#666666"
     borderopacity="1.0"
     inkscape:showpageshadow="2"
     inkscape:pageopacity="0.0"
     inkscape:pagecheckerboard="0"
     inkscape:deskcolor="#d1d1d1"
     showgrid="true"
     inkscape:zoom="38.25"
     inkscape:cx="10.69281"
     inkscape:cy="12"
     inkscape:current-layer="svg467">
    <inkscape:grid
       type="xygrid"
       id="grid1024" />
  </sodipodi:namedview>
  <g
     stroke-width="0.5"
     id="g2657"
     style="fill:none;stroke:#00aad4;stroke-linecap:round"
     transform="matrix(1.5000002,0,0,1.5000002,2.7249991,1.2249989)">
    <circle
       cx="4.5"
       cy="5.5"
       r="1"
       stroke-linejoin="round"
       id="circle2639" />
    <path
       d="m 4.5,3.5 v 1"
       id="path2641" />
    <path
       d="M 3.0857864,4.0857864 3.7928932,4.7928932"
       id="path2643" />
    <path
       d="m 2.5,5.5 h 1"
       id="path2645" />
    <path
       d="M 3.0857864,6.9142136 3.7928932,6.2071068"
       id="path2647" />
    <path
       d="m 4.5,7.5 v -1"
       id="path2649" />
    <path
       d="M 5.9142136,6.9142136 5.2071068,6.2071068"
       id="path2651" />
    <path
       d="m 6.5,5.5 h -1"
       id="path2653" />
    <path
       d="M 5.9142136,4.0857864 5.2071068,4.7928932"
       id="path2655" />
  </g>
  <path
     d="m3.75 17.25 3.75-2.998993 3 3 6-6.000495 3.75 3.75"
     fill="none"
     stroke="#00aad4"
     stroke-width="1.125"
     id="path445" />
  <g
     fill="none"
     stroke="#00aad4"
     id="g465">
    <path
       d="m6 3.75h12"
       stroke-width="1.5"
       id="path449" />
    <path
       d="m3.75 6v12.000512"
       stroke-width="1.5"
       id="path451" />
    <path
       d="m20.25 6v12"
       stroke-width="1.49999"
       id="path453" />
    <path
       d="m6 20.25h12"
       stroke-width="1.49999"
       id="path455" />
    <path
       d="m3.75 0v3.75h-3.75"
       stroke-width="1.5"
       id="path457" />
    <path
       d="m3.75 24v-3.75h-3.75"
       stroke-width="1.5"
       id="path459" />
    <path
       d="m20.25 24v-3.75h3.75"
       stroke-width="1.5"
       id="path461" />
    <path
       d="m20.25 0v3.75h3.75"
       stroke-width="1.5"
       id="path463" />
  </g>
</svg>
