<?xml version="1.0" encoding="UTF-8" standalone="no"?>
<svg
   height="32"
   width="32"
   version="1.1"
   id="svg284"
   sodipodi:docname="menu_source_encloseselection_200.svg"
   inkscape:export-filename="menu_source_encloseselection_200.png"
   inkscape:export-xdpi="96"
   inkscape:export-ydpi="96"
   inkscape:version="1.2.2 (732a01da63, 2022-12-09)"
   xmlns:inkscape="http://www.inkscape.org/namespaces/inkscape"
   xmlns:sodipodi="http://sodipodi.sourceforge.net/DTD/sodipodi-0.dtd"
   xmlns="http://www.w3.org/2000/svg"
   xmlns:svg="http://www.w3.org/2000/svg">
  <defs
     id="defs288" />
  <sodipodi:namedview
     id="namedview286"
     pagecolor="#ffffff"
     bordercolor="#666666"
     borderopacity="1.0"
     inkscape:showpageshadow="2"
     inkscape:pageopacity="0.0"
     inkscape:pagecheckerboard="0"
     inkscape:deskcolor="#d1d1d1"
     showgrid="true"
     inkscape:zoom="28.6875"
     inkscape:cx="15.982571"
     inkscape:cy="16"
     inkscape:current-layer="svg284">
    <inkscape:grid
       type="xygrid"
       id="grid407" />
  </sodipodi:namedview>
  <g
     fill="#2a7fff"
     id="g282">
    <path
       d="m11 4c-2.67111 0-5 1.0078088-5 4v5c0 1.229661-.7011888 1.800781-2 1.800781v2.398438c1.2988112 0 2 .57112 2 1.800781v5c0 2.992192 2.32889 4 5 4v-2.199218c-1.880018-.0146-2.601562-.693026-2.601562-1.800782v-5c0-1.737503-.7514514-3-1.398438-3 .6469866 0 1.398438-1.262497 1.398438-3v-5c0-1.107757.721544-1.7862266 2.601562-1.8007812z"
       stroke-width=".991802"
       id="path274" />
    <path
       d="m21 4c2.67111 0 5 1.0078088 5 4v5c0 1.229661.701188 1.800781 2 1.800781v2.398438c-1.298812 0-2 .57112-2 1.800781v5c0 2.992192-2.32889 4-5 4v-2.199218c1.880018-.0146 2.601562-.693026 2.601562-1.800782v-5c0-1.737503.751452-3 1.398438-3-.646986 0-1.398438-1.262497-1.398438-3v-5c0-1.107757-.721544-1.7862266-2.601562-1.8007812z"
       stroke-width=".991802"
       id="path276" />
    <circle
       cx="13"
       cy="22"
       r="1.5"
       id="circle278" />
    <circle
       cx="19"
       cy="22"
       r="1.5"
       id="circle280" />
  </g>
</svg>
