<?xml version="1.0" encoding="UTF-8" standalone="no"?>
<svg
   height="16"
   width="16"
   version="1.1"
   id="svg18"
   sodipodi:docname="menu_run_file.svg"
   inkscape:export-filename="menu_run_file.png"
   inkscape:export-xdpi="96"
   inkscape:export-ydpi="96"
   inkscape:version="1.2.2 (732a01da63, 2022-12-09)"
   xmlns:inkscape="http://www.inkscape.org/namespaces/inkscape"
   xmlns:sodipodi="http://sodipodi.sourceforge.net/DTD/sodipodi-0.dtd"
   xmlns="http://www.w3.org/2000/svg"
   xmlns:svg="http://www.w3.org/2000/svg">
  <defs
     id="defs22" />
  <sodipodi:namedview
     id="namedview20"
     pagecolor="#ffffff"
     bordercolor="#666666"
     borderopacity="1.0"
     inkscape:showpageshadow="2"
     inkscape:pageopacity="0.0"
     inkscape:pagecheckerboard="0"
     inkscape:deskcolor="#d1d1d1"
     showgrid="true"
     inkscape:zoom="57.375"
     inkscape:cx="7.9912854"
     inkscape:cy="8"
     inkscape:current-layer="svg18">
    <inkscape:grid
       type="xygrid"
       id="grid578" />
  </sodipodi:namedview>
  <path
     d="m2.4999995.5h11.0000015v13h-11.0000015z"
     style="fill:#fff;stroke:#d4aa00;stroke-width:.999998;stroke-linecap:round;stroke-linejoin:round;stroke-miterlimit:5.6"
     id="path2" />
  <g
     fill="none"
     stroke="#b2d1ff"
     stroke-width=".999999"
     id="g12">
    <path
       d="m4.5000003 3.5h6.9999987"
       id="path4" />
    <path
       d="m5 5.5h6.499999"
       id="path6" />
    <path
       d="m5 7.5h6.5"
       id="path8" />
    <path
       d="m4.5000003 9.5h6.9999997"
       id="path10" />
  </g>
  <path
     d="m3 4.1v4.8l-1 1v-6.8z"
     fill="#fff"
     id="path14" />
  <path
     d="m0 2 4.5 4.5-4.5 4.5z"
     fill="#0c0"
     id="path16" />
</svg>
