<?xml version="1.0" encoding="UTF-8" standalone="no"?>
<svg
   height="64"
   width="64"
   version="1.1"
   id="svg1251"
   sodipodi:docname="File_01_64.svg"
   inkscape:export-filename="File_01_64.png"
   inkscape:export-xdpi="96"
   inkscape:export-ydpi="96"
   inkscape:version="1.2-beta (1b65182ce9, 2022-04-05)"
   xmlns:inkscape="http://www.inkscape.org/namespaces/inkscape"
   xmlns:sodipodi="http://sodipodi.sourceforge.net/DTD/sodipodi-0.dtd"
   xmlns="http://www.w3.org/2000/svg"
   xmlns:svg="http://www.w3.org/2000/svg">
  <defs
     id="defs1255" />
  <sodipodi:namedview
     id="namedview1253"
     pagecolor="#ffffff"
     bordercolor="#666666"
     borderopacity="1.0"
     inkscape:pageshadow="2"
     inkscape:pageopacity="0.0"
     inkscape:pagecheckerboard="0"
     inkscape:deskcolor="#d1d1d1"
     showgrid="true"
     inkscape:zoom="14.34375"
     inkscape:cx="32"
     inkscape:cy="32"
     inkscape:current-layer="svg1251">
    <inkscape:grid
       type="xygrid"
       id="grid1433" />
  </sodipodi:namedview>
  <linearGradient
     id="a"
     gradientUnits="userSpaceOnUse"
     x1="5"
     x2="26"
     y1="3"
     y2="29">
    <stop
       offset="0"
       stop-color="#fff"
       id="stop1232" />
    <stop
       offset="1"
       stop-color="#dfeaf4"
       id="stop1234" />
  </linearGradient>
  <g
     id="g1381"
     transform="scale(2)">
    <path
       d="M 4.5,2.5 H 21 L 26.5,8 v 21.5 h -22 z"
       fill="url(#a)"
       fill-rule="evenodd"
       stroke="#75a4d3"
       stroke-linecap="square"
       id="path1237"
       style="fill:url(#a)" />
    <path
       d="M 8,10.5 H 23"
       fill="none"
       stroke="#0066ff"
       stroke-width="3"
       id="path1239" />
    <path
       d="m 8.5,12 v 13.5 h 14 V 12"
       fill="#ffffff"
       fill-rule="evenodd"
       stroke="#87aade"
       id="path1241" />
    <g
       fill="none"
       stroke="#b3b3b3"
       id="g1249">
      <path
         d="M 9,15.5 H 22"
         id="path1243" />
      <path
         d="M 9,19.5 H 22"
         id="path1245" />
      <path
         d="M 13.5,12 V 25"
         id="path1247" />
    </g>
  </g>
</svg>
