<?xml version="1.0" encoding="UTF-8" standalone="no"?>
<svg
   width="32"
   height="32"
   version="1.1"
   id="svg9923"
   sodipodi:docname="menu_saveas_200.svg"
   inkscape:export-filename="menu_saveas_200.png"
   inkscape:export-xdpi="96"
   inkscape:export-ydpi="96"
   inkscape:version="1.2.2 (732a01da63, 2022-12-09)"
   xmlns:inkscape="http://www.inkscape.org/namespaces/inkscape"
   xmlns:sodipodi="http://sodipodi.sourceforge.net/DTD/sodipodi-0.dtd"
   xmlns:xlink="http://www.w3.org/1999/xlink"
   xmlns="http://www.w3.org/2000/svg"
   xmlns:svg="http://www.w3.org/2000/svg">
  <defs
     id="defs9927">
    <linearGradient
       inkscape:collect="always"
       id="linearGradient2441">
      <stop
         style="stop-color:#2a7fff;stop-opacity:1;"
         offset="0"
         id="stop2437" />
      <stop
         style="stop-color:#66a4ff;stop-opacity:1;"
         offset="1"
         id="stop2439" />
    </linearGradient>
    <linearGradient
       inkscape:collect="always"
       xlink:href="#linearGradient2441"
       id="linearGradient2443"
       x1="30.5"
       y1="31.5"
       x2="1.5"
       y2="0.5"
       gradientUnits="userSpaceOnUse" />
  </defs>
  <sodipodi:namedview
     id="namedview9925"
     pagecolor="#ffffff"
     bordercolor="#666666"
     borderopacity="1.0"
     inkscape:showpageshadow="2"
     inkscape:pageopacity="0.0"
     inkscape:pagecheckerboard="0"
     inkscape:deskcolor="#d1d1d1"
     showgrid="true"
     inkscape:zoom="28.6875"
     inkscape:cx="14.745098"
     inkscape:cy="16"
     inkscape:current-layer="svg9923">
    <inkscape:grid
       type="xygrid"
       id="grid10046" />
  </sodipodi:namedview>
  <linearGradient
     id="a"
     x1="28.125"
     x2="17.875"
     y1="28.125"
     y2="17.875"
     gradientUnits="userSpaceOnUse">
    <stop
       stop-color="#009600"
       offset="0"
       id="stop9885" />
    <stop
       stop-color="#6edb39"
       offset="1"
       id="stop9887" />
  </linearGradient>
  <linearGradient
     id="b"
     x1="11.821"
     x2="11.821"
     y1="1.725"
     y2="9.4939"
     gradientTransform="matrix(1.5006 0 0 1.4159 -2.7391 -2.4424)"
     gradientUnits="userSpaceOnUse">
    <stop
       stop-color="#ececec"
       offset="0"
       id="stop9890" />
    <stop
       stop-color="#b7bec8"
       offset="1"
       id="stop9892" />
  </linearGradient>
  <path
     d="m1 0h27l3 3v29l-30 1e-6z"
     fill="#2a7fff"
     id="path9895"
     style="fill-opacity:1;fill:url(#linearGradient2443)" />
  <rect
     x="5"
     y="14"
     width="22"
     height="16"
     rx="1.5"
     fill="#fff"
     id="rect9897" />
  <path
     d="m8 0v11h16v-11zm10 2h4v8h-4z"
     fill="url(#b)"
     fill-rule="evenodd"
     id="path9899" />
  <g
     fill="none"
     id="g9911">
    <g
       stroke="#e6e6e6"
       id="g9907">
      <path
         d="m8 17.5 16-7.8e-5"
         id="path9901" />
      <path
         d="m8 20.5 16-7.8e-5"
         id="path9903" />
      <path
         d="m8 23.5 16-7.8e-5"
         id="path9905" />
    </g>
    <path
       d="m5 29h22"
       stroke="#f60"
       stroke-width="2"
       id="path9909" />
  </g>
  <g
     stroke="#fff"
     stroke-linecap="round"
     id="g9921">
    <circle
       transform="matrix(0 1 1 0 0 0)"
       cx="23"
       cy="23"
       r="8.2"
       fill="url(#a)"
       stroke-dashoffset="1.5"
       stroke-linejoin="round"
       stroke-width="1.6"
       id="circle9913" />
    <g
       fill="none"
       stroke-width="1.8"
       id="g9919">
      <path
         d="m23 19v8"
         id="path9915" />
      <path
         d="m27 23h-8"
         id="path9917" />
    </g>
  </g>
</svg>
