<?xml version="1.0" encoding="UTF-8" standalone="no"?>
<svg
   height="36"
   viewBox="0 0 36 36"
   width="36"
   version="1.1"
   id="svg2"
   sodipodi:docname="Connection_02_36.svg"
   inkscape:export-filename="Connection_02_36.png"
   inkscape:export-xdpi="96"
   inkscape:export-ydpi="96"
   inkscape:version="1.3 (0e150ed6c4, 2023-07-21)"
   xmlns:inkscape="http://www.inkscape.org/namespaces/inkscape"
   xmlns:sodipodi="http://sodipodi.sourceforge.net/DTD/sodipodi-0.dtd"
   xmlns="http://www.w3.org/2000/svg"
   xmlns:svg="http://www.w3.org/2000/svg">
  <defs
     id="defs2" />
  <sodipodi:namedview
     id="namedview2"
     pagecolor="#ffffff"
     bordercolor="#000000"
     borderopacity="0.25"
     inkscape:showpageshadow="2"
     inkscape:pageopacity="0.0"
     inkscape:pagecheckerboard="0"
     inkscape:deskcolor="#d1d1d1"
     showgrid="true"
     inkscape:current-layer="svg2">
    <inkscape:grid
       id="grid2"
       units="px"
       originx="0"
       originy="0"
       spacingx="0.5"
       spacingy="0.5"
       empcolor="#0099e5"
       empopacity="0.30196078"
       color="#0099e5"
       opacity="0.14901961"
       empspacing="2"
       dotted="false"
       gridanglex="30"
       gridanglez="30"
       visible="true" />
  </sodipodi:namedview>
  <g
     fill="none"
     stroke-linecap="round"
     stroke-linejoin="round"
     stroke-width="1.79996"
     id="g2"
     transform="matrix(1.5000376,0,0,1.5000376,-4.5125528e-4,-4.5101758e-4)">
    <path
       d="M 13.167063,10.833372 11.045793,8.7121032 6.1668753,13.591021 8.2881439,15.712291 3.7505644,20.24987"
       stroke="#00aad4"
       id="path1" />
    <path
       d="m 10.833667,13.166769 2.121269,2.121268 4.878918,-4.878919 -2.121268,-2.1212688 4.537578,-4.5375788"
       stroke="#00c1f0"
       id="path2" />
  </g>
  <g
     fill="#ccaa00"
     id="g4"
     transform="matrix(1.5000376,0,0,1.5000376,-4.5125528e-4,-4.5101758e-4)">
    <path
       d="m 20.89468,6.817579 -0.893533,0.8935329 c 1.519346,3.2103731 0.823705,7.3469971 -2.05952,10.2302191 -2.882887,2.882888 -7.020006,3.581099 -10.2302205,2.062452 l -0.8935331,0.893532 c 3.7269896,1.979034 8.6396406,1.221448 11.9704126,-2.109325 3.331131,-3.331131 4.086235,-8.243275 2.106394,-11.970411 z"
       id="path3" />
    <path
       d="M 12.841164,2.0217964 C 10.134274,1.9992951 7.3476211,3.0769709 5.2124433,5.2121487 1.8825404,8.5420522 1.1255422,13.455438 3.1031195,17.182561 L 3.9966526,16.289028 C 2.4786805,13.07856 3.1767986,8.9411122 6.0591026,6.0588078 8.9414059,3.176504 13.078856,2.4783859 16.289324,3.996358 L 17.182857,3.1028249 C 15.845613,2.3932961 14.355788,2.0343869 12.841164,2.0217964 Z"
       id="path4" />
  </g>
</svg>
