<?xml version="1.0" encoding="UTF-8" standalone="no"?>
<svg
   height="36"
   width="36"
   version="1.1"
   id="svg530"
   sodipodi:docname="Folder_18_36.svg"
   inkscape:export-filename="Folder_18_36.png"
   inkscape:export-xdpi="96"
   inkscape:export-ydpi="96"
   inkscape:version="1.2.2 (732a01da63, 2022-12-09)"
   xmlns:inkscape="http://www.inkscape.org/namespaces/inkscape"
   xmlns:sodipodi="http://sodipodi.sourceforge.net/DTD/sodipodi-0.dtd"
   xmlns="http://www.w3.org/2000/svg"
   xmlns:svg="http://www.w3.org/2000/svg">
  <defs
     id="defs534" />
  <sodipodi:namedview
     id="namedview532"
     pagecolor="#ffffff"
     bordercolor="#000000"
     borderopacity="0.25"
     inkscape:showpageshadow="2"
     inkscape:pageopacity="0.0"
     inkscape:pagecheckerboard="0"
     inkscape:deskcolor="#d1d1d1"
     showgrid="true"
     inkscape:zoom="25.277778"
     inkscape:cx="17.98022"
     inkscape:cy="18"
     inkscape:current-layer="svg530">
    <inkscape:grid
       type="xygrid"
       id="grid895" />
  </sodipodi:namedview>
  <g
     stroke="#00aad4"
     stroke-linejoin="round"
     stroke-width="1.7"
     transform="translate(0,1.0000012)"
     id="g528">
    <path
       d="m 3.337,0.8499988 c -1.266811,0 -2.4870005,1.7150482 -2.4870005,3.0000002 V 15.000466 H 35.150001 V 5.7228204 c 0,-1.284951 -1.019857,-1.8728216 -2.286668,-1.8728216 H 14.57 c 0,-1.284952 -1.120189,-3 -2.387,-3 z"
       fill="#ebfcff"
       id="path524"
       sodipodi:nodetypes="ssccsscss" />
    <path
       d="M 3.1366665,12.840367 H 13.2695 c 0,-1.466049 1.39391,-2.9901476 2.787,-2.9901476 h 16.806833 c 1.266814,0 2.286668,0.7266906 2.286668,2.0116446 v 14.978429 c 0,1.284954 -1.019853,2.309706 -2.286668,2.309706 H 3.1366665 c -1.266813,0 -2.286667,-1.024752 -2.286667,-2.309706 V 15.159779 c 0,-1.284954 1.019854,-2.319412 2.286667,-2.319412 z"
       fill="#c2f3ff"
       id="path526"
       sodipodi:nodetypes="scsssssssss" />
  </g>
  <g
     id="g933"
     transform="scale(3.7795275)">
    <circle
       cx="6.8791671"
       cy="6.8791671"
       r="2.4077082"
       stroke-dashoffset="1.49998"
       stroke-linejoin="round"
       id="circle1056-2"
       style="fill:#ffffff;stroke:#00aad4;stroke-width:0.47625;stroke-linecap:round;stroke-dasharray:none" />
    <path
       d="M 5.953125,5.953125 7.8052084,7.8052084"
       id="path1058"
       style="fill:none;stroke:#00aad4;stroke-width:0.47625;stroke-linecap:round;stroke-dasharray:none"
       sodipodi:nodetypes="cc" />
    <path
       d="M 7.8052084,5.9531251 5.9531251,7.8052084"
       id="path1060"
       style="fill:none;stroke:#00aad4;stroke-width:0.47625;stroke-linecap:round;stroke-dasharray:none"
       sodipodi:nodetypes="cc" />
  </g>
</svg>
