<svg width="24" height="24" version="1.1" xmlns="http://www.w3.org/2000/svg">
 <rect x=".375" y="4.375" width="23.25" height="17.25" fill="#f9f9f9" stroke="#2a7efe" stroke-width=".75" style="paint-order:normal"/>
 <path d="m1.65 1h20.7c0.9 0 1.65 0.75 1.65 1.65v2.1h-24v-2.1c1e-6 -0.9 0.75-1.65 1.65-1.65z" fill="#2a7efe" stroke-width="1.5"/>
 <path d="m2.5 12.5h19" fill="none" stroke="#f00" stroke-width="3"/>
</svg>
