<?xml version="1.0" encoding="UTF-8" standalone="no"?>
<svg
   height="32"
   viewBox="0 0 8.4666664 8.4666671"
   width="32"
   version="1.1"
   id="svg296"
   sodipodi:docname="Arrow_31_32.svg"
   inkscape:export-filename="Arrow_31_32.png"
   inkscape:export-xdpi="96"
   inkscape:export-ydpi="96"
   inkscape:version="1.2 (dc2aedaf03, 2022-05-15)"
   xmlns:inkscape="http://www.inkscape.org/namespaces/inkscape"
   xmlns:sodipodi="http://sodipodi.sourceforge.net/DTD/sodipodi-0.dtd"
   xmlns="http://www.w3.org/2000/svg"
   xmlns:svg="http://www.w3.org/2000/svg">
  <defs
     id="defs300" />
  <sodipodi:namedview
     id="namedview298"
     pagecolor="#ffffff"
     bordercolor="#666666"
     borderopacity="1.0"
     inkscape:showpageshadow="2"
     inkscape:pageopacity="0.0"
     inkscape:pagecheckerboard="0"
     inkscape:deskcolor="#d1d1d1"
     showgrid="true"
     inkscape:zoom="28.6875"
     inkscape:cx="16"
     inkscape:cy="16"
     inkscape:current-layer="svg296">
    <inkscape:grid
       type="xygrid"
       id="grid973" />
  </sodipodi:namedview>
  <g
     id="g971"
     transform="matrix(2.0000036,0,0,2.0000036,-1.4332166e-6,-1.9449899e-6)">
    <g
       id="g957"
       transform="translate(0.03307301)">
      <path
         d="M 0.5291665,2.910411 1.190625,3.571875 1.8520832,2.910411"
         stroke-linejoin="round"
         id="path151"
         style="fill:none;stroke:#00aad4;stroke-width:0.330729;stroke-linecap:round;stroke-dasharray:none"
         sodipodi:nodetypes="ccc" />
      <path
         d="m 1.1906249,3.5718694 1e-7,-2.91041106"
         id="path153"
         style="fill:none;stroke:#00aad4;stroke-width:0.330729;stroke-linecap:round;stroke-dasharray:none"
         sodipodi:nodetypes="cc" />
    </g>
    <g
       id="g963"
       transform="matrix(1,0,0,-1,1.8851563,4.2333277)">
      <path
         d="M 0.5291665,2.910411 1.190625,3.571875 1.8520832,2.910411"
         stroke-linejoin="round"
         id="path959"
         style="fill:none;stroke:#00aad4;stroke-width:0.330729;stroke-linecap:round;stroke-dasharray:none"
         sodipodi:nodetypes="ccc" />
      <path
         d="m 1.1906249,3.5718694 1e-7,-2.91041106"
         id="path961"
         style="fill:none;stroke:#00aad4;stroke-width:0.330729;stroke-linecap:round;stroke-dasharray:none"
         sodipodi:nodetypes="cc" />
    </g>
  </g>
</svg>
