<?xml version="1.0" encoding="UTF-8" standalone="no"?>
<svg
   height="48"
   width="48"
   version="1.1"
   id="svg168"
   sodipodi:docname="Copy_01_48.svg"
   inkscape:export-filename="Copy_01_48.png"
   inkscape:export-xdpi="96"
   inkscape:export-ydpi="96"
   inkscape:version="1.2-beta (1b65182ce9, 2022-04-05)"
   xmlns:inkscape="http://www.inkscape.org/namespaces/inkscape"
   xmlns:sodipodi="http://sodipodi.sourceforge.net/DTD/sodipodi-0.dtd"
   xmlns:xlink="http://www.w3.org/1999/xlink"
   xmlns="http://www.w3.org/2000/svg"
   xmlns:svg="http://www.w3.org/2000/svg">
  <defs
     id="defs172" />
  <sodipodi:namedview
     id="namedview170"
     pagecolor="#ffffff"
     bordercolor="#666666"
     borderopacity="1.0"
     inkscape:pageshadow="2"
     inkscape:pageopacity="0.0"
     inkscape:pagecheckerboard="0"
     inkscape:deskcolor="#d1d1d1"
     showgrid="true"
     inkscape:zoom="19.125"
     inkscape:cx="23.973856"
     inkscape:cy="24"
     inkscape:current-layer="svg168">
    <inkscape:grid
       type="xygrid"
       id="grid2113" />
  </sodipodi:namedview>
  <linearGradient
     id="a">
    <stop
       offset="0"
       stop-color="#fff"
       id="stop139" />
    <stop
       offset="1"
       stop-color="#dfeaf4"
       id="stop141" />
  </linearGradient>
  <linearGradient
     id="b"
     gradientTransform="matrix(1.1666667,0,0,1.2142858,6.583333,28.678572)"
     gradientUnits="userSpaceOnUse"
     x1="3"
     x2="13"
     xlink:href="#a"
     y1="2"
     y2="14" />
  <linearGradient
     id="c"
     gradientTransform="matrix(1.1666667,0,0,1.2142857,-2.416666,22.678572)"
     gradientUnits="userSpaceOnUse"
     x1="3"
     x2="13"
     xlink:href="#a"
     y1="2"
     y2="14" />
  <g
     fill-rule="evenodd"
     transform="matrix(2,0,0,2,-5.3000002e-7,-48.000001)"
     id="g166">
    <path
       d="M 0.50000053,41.499999 V 24.500001 L 11.5,24.5 l 3,3 10e-7,13.999999 z"
       fill="url(#c)"
       stroke="#75a5d3"
       stroke-linecap="square"
       id="path146"
       style="fill:url(#c)" />
    <path
       d="m 3,30 v 1.5 h 8 V 30 Z"
       fill="#80c1fb"
       id="path148" />
    <path
       d="m 3,27 v 1.5 h 7.5 V 27 Z"
       fill="#80c1fb"
       id="path150" />
    <path
       d="m 3,33 v 1.5 h 8 V 33 Z"
       fill="#a7d4fb"
       id="path152" />
    <path
       d="m 3,36 v 1.5 h 8 V 36 Z"
       fill="#d7eafb"
       id="path154" />
    <path
       d="m 9.5000002,47.500001 v -17 L 20.5,30.5 l 3,3 v 14.000001 z"
       fill="url(#b)"
       stroke="#75a5d3"
       stroke-linecap="square"
       stroke-opacity="0.993548"
       id="path156"
       style="fill:url(#b)" />
    <path
       d="m 12,36 v 1.5 h 8 V 36 Z"
       fill="#80c1fb"
       id="path158" />
    <path
       d="m 12,33 v 1.5 h 7.5 V 33 Z"
       fill="#80c1fb"
       id="path160" />
    <path
       d="m 12,39 v 1.5 h 8 V 39 Z"
       fill="#a7d4fb"
       id="path162" />
    <path
       d="m 12,42 v 1.5 h 8 V 42 Z"
       fill="#d7eafb"
       id="path164" />
  </g>
</svg>
