<?xml version="1.0" encoding="UTF-8" standalone="no"?>
<svg
   height="36"
   width="36"
   version="1.1"
   id="svg931"
   sodipodi:docname="Refresh_03_36.svg"
   inkscape:export-filename="Refresh_03_36.png"
   inkscape:export-xdpi="96"
   inkscape:export-ydpi="96"
   inkscape:version="1.2-beta (1b65182ce9, 2022-04-05)"
   xmlns:inkscape="http://www.inkscape.org/namespaces/inkscape"
   xmlns:sodipodi="http://sodipodi.sourceforge.net/DTD/sodipodi-0.dtd"
   xmlns="http://www.w3.org/2000/svg"
   xmlns:svg="http://www.w3.org/2000/svg">
  <defs
     id="defs935" />
  <sodipodi:namedview
     id="namedview933"
     pagecolor="#ffffff"
     bordercolor="#666666"
     borderopacity="1.0"
     inkscape:pageshadow="2"
     inkscape:pageopacity="0.0"
     inkscape:pagecheckerboard="0"
     inkscape:deskcolor="#d1d1d1"
     showgrid="true"
     inkscape:zoom="25.5"
     inkscape:cx="17.117647"
     inkscape:cy="18"
     inkscape:current-layer="svg931">
    <inkscape:grid
       type="xygrid"
       id="grid1054" />
  </sodipodi:namedview>
  <g
     fill="none"
     stroke="#00aad4"
     stroke-linecap="round"
     stroke-width="3.28125"
     id="g929"
     transform="matrix(1.0322581,0,0,1.0322581,-0.06451675,-0.58049749)">
    <path
       d="m 21.801185,16.359375 h 9.55819 V 6.7626528"
       id="path921" />
    <path
       d="M 29.352156,15.908442 C 24.190732,5.3269061 12.720906,-2.368758 3.640625,12.060612"
       id="path923" />
    <path
       d="m 13.198815,19.640625 h -9.55819 v 9.596653"
       id="path925" />
    <path
       d="M 5.6478448,20.091269 C 10.809268,30.672803 22.279094,38.368473 31.359375,23.939101"
       id="path927" />
  </g>
</svg>
