<?xml version="1.0" encoding="UTF-8" standalone="no"?>
<svg
   width="48"
   height="48"
   version="1.1"
   viewBox="0 0 48 48"
   id="svg6"
   sodipodi:docname="tasyncprocess_200.svg"
   inkscape:export-filename="tasyncprocess_200.png"
   inkscape:export-xdpi="96"
   inkscape:export-ydpi="96"
   inkscape:version="1.3.2 (091e20e, 2023-11-25, custom)"
   xmlns:inkscape="http://www.inkscape.org/namespaces/inkscape"
   xmlns:sodipodi="http://sodipodi.sourceforge.net/DTD/sodipodi-0.dtd"
   xmlns="http://www.w3.org/2000/svg"
   xmlns:svg="http://www.w3.org/2000/svg">
  <sodipodi:namedview
     id="namedview6"
     pagecolor="#ffffff"
     bordercolor="#000000"
     borderopacity="0.25"
     inkscape:showpageshadow="2"
     inkscape:pageopacity="0.0"
     inkscape:pagecheckerboard="0"
     inkscape:deskcolor="#d1d1d1"
     showgrid="true"
     inkscape:current-layer="svg6">
    <inkscape:grid
       id="grid6"
       units="px"
       originx="0"
       originy="0"
       spacingx="0.5"
       spacingy="0.5"
       empcolor="#0099e5"
       empopacity="0.30196078"
       color="#0099e5"
       opacity="0.14901961"
       empspacing="2"
       dotted="false"
       gridanglex="30"
       gridanglez="30"
       visible="true" />
  </sodipodi:namedview>
  <defs
     id="defs2">
    <linearGradient
       id="a"
       x1="8.0519476"
       x2="15.948051"
       y1="26.376619"
       y2="45.623371"
       gradientTransform="matrix(2.0263158 0 0 2.0263158 -.31578919 -48.94736)"
       gradientUnits="userSpaceOnUse">
      <stop
         stop-color="#ffeeaa"
         offset="0"
         id="stop1" />
      <stop
         stop-color="#d4aa00"
         offset="1"
         id="stop2" />
    </linearGradient>
  </defs>
  <path
     d="m21.59375 4.75-0.802734 6.416016-3.595704 1.492187-5.107421-3.9726561-3.4023441 3.4023441 3.9726561 5.107421-1.492187 3.595704-6.416016 0.802734v4.8125l6.416016 0.802734 1.492187 3.595703-3.9726561 5.107422 3.4023441 3.402344 3.566406-2.773437c-0.819158-0.682069-1.352228-1.70685-1.353516-2.837891-0.002351-2.02033 1.699221-3.703125 3.699219-3.703125h3.863281a6.416667 6.416667 0 0 1-4.279297-6 6.416667 6.416667 0 0 1 6.416016-6.416016 6.416667 6.416667 0 0 1 6.416016 6.416016 6.416667 6.416667 0 0 1-4.279297 6h4.488281c-0.892912-1.53023-0.755194-3.525651 0.546875-4.828125 0.749455-0.749861 1.767813-1.171875 2.828125-1.171875s2.078669 0.422011 2.828125 1.171875l1.810547 1.810547 4.611328-0.576172v-4.8125l-6.416016-0.802734-1.492187-3.595704 3.972656-5.107421-3.402344-3.4023441-5.107422 3.9726561-3.595703-1.492187-0.802734-6.416016z"
     fill="url(#a)"
     fill-rule="evenodd"
     stroke-linejoin="round"
     id="path2" />
  <path
     d="m20.097656 30h7.804688c0.874115-0.570809 1.613263-1.327541 2.167968-2.212891 0.02545-0.89121 0.335824-1.766632 0.96875-2.46875 0.080175-0.428101 0.126949-0.867469 0.126954-1.318359-4.2e-5 -3.94912-3.216896-7.166015-7.166016-7.166016-3.949122-1e-6 -7.165974 3.216894-7.166016 7.166016 2.7e-5 2.509856 1.302782 4.719512 3.263672 6zm3.902344-11.666016c3.138467 1e-6 5.665983 2.527549 5.666016 5.666016-3.3e-5 3.138467-2.527549 5.666015-5.666016 5.666016-3.138469 1e-6 -5.665983-2.527547-5.666016-5.666016 3.3e-5 -3.138469 2.527547-5.666017 5.666016-5.666016z"
     fill="#d4aa00"
     fill-rule="evenodd"
     stroke-linejoin="round"
     id="path3" />
  <path
     d="m21.59375 4a0.750075 0.750075 0 0 0-0.744141 0.65625l-0.748047 5.984375-2.791015 1.158203-4.761719-3.705078a0.750075 0.750075 0 0 0-0.992187 0.060547l-3.4023441 3.402344a0.750075 0.750075 0 0 0-0.0605469 0.992187l3.705078 4.761719-1.158203 2.791015-5.984375 0.748047a0.750075 0.750075 0 0 0-0.65625 0.744141v4.8125a0.750075 0.750075 0 0 0 0.65625 0.744141l5.984375 0.748046 1.158203 2.791016-3.705078 4.761719a0.750075 0.750075 0 0 0 0.060547 0.992187l3.4023441 3.402344a0.750075 0.750075 0 0 0 0.992187 0.06055l3.7636719-2.927737c-0.458035-0.241318-0.863276-0.574642-1.1875-0.976563l-2.974609 2.314453-2.4667972-2.466797 3.5664062-4.583984a0.750075 0.750075 0 0 0 0.101563-0.748047l-1.492188-3.595703a0.750075 0.750075 0 0 0-0.599609-0.457031l-5.759766-0.720703v-3.488282l5.759766-0.720703a0.750075 0.750075 0 0 0 0.599609-0.457031l1.492188-3.595703a0.750075 0.750075 0 0 0-0.101563-0.748047l-3.5664062-4.583984 2.4667972-2.4667972 4.583984 3.5664062a0.750075 0.750075 0 0 0 0.748047 0.101563l3.595703-1.492188a0.750075 0.750075 0 0 0 0.457031-0.599609l0.720703-5.759766h3.488282l0.720703 5.759766a0.750075 0.750075 0 0 0 0.457031 0.599609l3.595703 1.492188a0.750075 0.750075 0 0 0 0.748047-0.101563l4.583984-3.5664062 2.466797 2.4667972-3.566406 4.583984a0.750075 0.750075 0 0 0-0.101563 0.748047l1.492188 3.595703a0.750075 0.750075 0 0 0 0.599609 0.457031l5.759766 0.720703v3.488282l-4.533203 0.566406 1.34375 1.34375 4.033203-0.503906a0.750075 0.750075 0 0 0 0.65625-0.744141v-4.8125a0.750075 0.750075 0 0 0-0.65625-0.744141l-5.984375-0.748047-1.158203-2.791015 3.705078-4.761719a0.750075 0.750075 0 0 0-0.06055-0.992187l-3.402341-3.4023441a0.750075 0.750075 0 0 0-0.992187-0.0605469l-4.761719 3.705078-2.791016-1.158203-0.748046-5.984375a0.750075 0.750075 0 0 0-0.744141-0.65625z"
     fill="#d4aa00"
     fill-rule="evenodd"
     stroke-linejoin="round"
     id="path4" />
  <path
     d="m33.999728 25.9998c-0.530407 0-1.039052 0.2108-1.414049 0.586-0.780757 0.781-0.780757 2.047 0 2.828l2.582007 2.5859h-17.167812c-0.939822 4e-4 -1.700973 0.7634-1.699203 1.7032 4.4e-4 0.9382 0.760945 1.6988 1.699203 1.6992h26.226323l-8.81242-8.8163c-0.374996-0.3752-0.883642-0.586-1.414049-0.586z"
     color="#000000"
     fill="#2a7efe"
     stroke-linecap="round"
     style="-inkscape-stroke:none"
     id="path5" />
  <path
     d="m26.527136 48.002c0.530407 0 1.039053-0.2108 1.414049-0.586 0.780757-0.781 0.780757-2.047 0-2.828l-2.582006-2.586h17.167812c0.939821-4e-4 1.700972-0.7633 1.699202-1.7031-4.4e-4 -0.9382-0.760945-1.6988-1.699202-1.6992h-26.226324l8.81242 8.8163c0.374997 0.3752 0.883642 0.586 1.414049 0.586z"
     color="#000000"
     fill="#2a7efe"
     stroke-linecap="round"
     style="-inkscape-stroke:none"
     id="path6" />
</svg>
