<svg width="32" height="32" version="1.0" xmlns="http://www.w3.org/2000/svg" xmlns:xlink="http://www.w3.org/1999/xlink">
 <defs>
  <linearGradient id="e" x1="3" x2="15" y1="2" y2="2" gradientTransform="matrix(1.1764713 0 0 .62499996 5.411758 19.937503)" gradientUnits="userSpaceOnUse" xlink:href="#a"/>
  <linearGradient id="a" x1="3" x2="15" y1="2" y2="2" gradientUnits="userSpaceOnUse">
   <stop stop-color="#4276c4" offset="0"/>
   <stop stop-color="#80b3ff" offset=".3333333"/>
   <stop stop-color="#04a" offset="1"/>
  </linearGradient>
  <linearGradient id="c" x1="3" x2="15" y1="2" y2="2" gradientTransform="matrix(1.1764713 0 0 .62499996 5.411758 15.937503)" gradientUnits="userSpaceOnUse" xlink:href="#a"/>
  <linearGradient id="d" x1="3" x2="15" y1="2" y2="2" gradientTransform="matrix(1.1764713 0 0 .62499996 5.411758 11.937503)" gradientUnits="userSpaceOnUse" xlink:href="#a"/>
  <linearGradient id="b" x1="3" x2="15" y1="2" y2="2" gradientTransform="matrix(1.1111118 0 0 .52631578 5.999992 10.157889)" gradientUnits="userSpaceOnUse" xlink:href="#a"/>
 </defs>
 <rect x=".5" y="7.5" width="31" height="22" fill="#f9f9f9" stroke="#2a7efe" style="paint-order:normal"/>
 <path d="m2.8 2h26.4c1.4 0 2.8 1.4 2.8 2.8v3.2h-32v-3.2c0-1.4 1.4-2.8 2.8-2.8z" fill="#2a7efe"/>
 <ellipse cx="16" cy="24" rx="6" ry="1" fill="none" stroke="url(#e)" stroke-linecap="round" stroke-linejoin="round" stroke-width="2"/>
 <ellipse cx="16" cy="22" rx="5" ry="1" fill="none" stroke="#ffffff" stroke-linecap="round" stroke-linejoin="round" stroke-width="2"/>
 <ellipse cx="16" cy="20" rx="6" ry="1" fill="none" stroke="url(#c)" stroke-linecap="round" stroke-linejoin="round" stroke-width="2"/>
 <ellipse cx="16" cy="18" rx="5" ry="1" fill="none" stroke="#ffffff" stroke-linecap="round" stroke-linejoin="round" stroke-width="2"/>
 <ellipse cx="16" cy="16" rx="6" ry="1" fill="none" stroke="url(#d)" stroke-linecap="round" stroke-linejoin="round" stroke-width="2"/>
 <ellipse cx="16" cy="14" rx="5" ry="1" fill="none" stroke="#ffffff" stroke-linecap="round" stroke-linejoin="round" stroke-width="2"/>
 <ellipse cx="16" cy="12" rx="6" ry="1" fill="none" fill-rule="evenodd" stroke="url(#b)" stroke-linecap="round" stroke-linejoin="round" stroke-width="2"/>
</svg>
