<?xml version="1.0" encoding="UTF-8" standalone="no"?>
<svg
   height="32"
   width="32"
   version="1.1"
   id="svg27"
   sodipodi:docname="menu_view_jump_history_200.svg"
   inkscape:export-filename="menu_view_jump_history_200.png"
   inkscape:export-xdpi="96"
   inkscape:export-ydpi="96"
   inkscape:version="1.2.2 (732a01da63, 2022-12-09)"
   xmlns:inkscape="http://www.inkscape.org/namespaces/inkscape"
   xmlns:sodipodi="http://sodipodi.sourceforge.net/DTD/sodipodi-0.dtd"
   xmlns="http://www.w3.org/2000/svg"
   xmlns:svg="http://www.w3.org/2000/svg">
  <defs
     id="defs31" />
  <sodipodi:namedview
     id="namedview29"
     pagecolor="#ffffff"
     bordercolor="#666666"
     borderopacity="1.0"
     inkscape:showpageshadow="2"
     inkscape:pageopacity="0.0"
     inkscape:pagecheckerboard="0"
     inkscape:deskcolor="#d1d1d1"
     showgrid="true"
     inkscape:zoom="28.6875"
     inkscape:cx="15.982571"
     inkscape:cy="16"
     inkscape:current-layer="svg27">
    <inkscape:grid
       type="xygrid"
       id="grid606" />
  </sodipodi:namedview>
  <radialGradient
     id="a"
     cx="5.9886"
     cy="7.2881"
     gradientTransform="matrix(-.00000035 2.1645311 -1.9980491 -.00000031 29.689407 2.915316)"
     gradientUnits="userSpaceOnUse"
     r="3.75">
    <stop
       offset="0"
       stop-color="#f8fbff"
       id="stop2" />
    <stop
       offset=".66667"
       stop-color="#d1e3ff"
       id="stop4" />
    <stop
       offset="1"
       stop-color="#f8fbff"
       id="stop6" />
  </radialGradient>
  <path
     d="m4.75.75h22.5v28.5h-22.5z"
     style="fill:#fff;stroke:#d4aa00;stroke-linecap:round;stroke-linejoin:round;stroke-miterlimit:5.6;stroke-width:1.5"
     id="path9" />
  <path
     d="m13.00008 9.2974h11.50006"
     fill="none"
     stroke="#2a7fff"
     stroke-width="1.49998"
     id="path11" />
  <path
     d="m13.00008 5.2974h11.50006"
     fill="none"
     stroke="#2a7fff"
     stroke-width="1.49998"
     id="path13" />
  <path
     d="m5.5 6 3.5 3.5-3.5 3.5z"
     fill="#f00"
     id="path15" />
  <path
     d="m9.75 1.5v27"
     fill="none"
     stroke="#b3b3b3"
     stroke-width="1.5"
     id="path17" />
  <path
     d="m26.5 24.5 1.5 1.5v4h-4l-1.5-1.5z"
     fill="#fff"
     id="path19" />
  <g
     stroke-linecap="round"
     id="g25">
    <path
       d="m23 25 5 5"
       fill="none"
       stroke="#d4aa00"
       stroke-width="4"
       id="path21" />
    <circle
       cx="17"
       cy="19"
       fill="url(#a)"
       fill-rule="evenodd"
       r="6.4"
       stroke="#2c5aa0"
       stroke-linejoin="round"
       stroke-width="1.2"
       id="circle23" />
  </g>
</svg>
