<svg width="16" height="16" version="1.0" xmlns="http://www.w3.org/2000/svg">
 <path d="m3.25 13 5.5-5-5.5-5" fill="none" stroke="#36cd36" stroke-linecap="round" stroke-linejoin="round" stroke-width="1.8"/>
 <path d="m12.9 2v12" fill="none" stroke="#36cd36" stroke-linecap="round" stroke-linejoin="round" stroke-width="1.8"/>
</svg>
