<?xml version="1.0" encoding="UTF-8" standalone="no"?>
<svg
   height="32"
   viewBox="0 0 8.4666664 8.4666671"
   width="32"
   version="1.1"
   id="svg377"
   sodipodi:docname="Health_03_32.svg"
   inkscape:version="1.2.1 (9c6d41e410, 2022-07-14)"
   inkscape:export-filename="Health_03_32.png"
   inkscape:export-xdpi="96"
   inkscape:export-ydpi="96"
   xmlns:inkscape="http://www.inkscape.org/namespaces/inkscape"
   xmlns:sodipodi="http://sodipodi.sourceforge.net/DTD/sodipodi-0.dtd"
   xmlns:xlink="http://www.w3.org/1999/xlink"
   xmlns="http://www.w3.org/2000/svg"
   xmlns:svg="http://www.w3.org/2000/svg">
  <defs
     id="defs381">
    <radialGradient
       inkscape:collect="always"
       xlink:href="#linearGradient1041"
       id="radialGradient1043"
       cx="1.9253448"
       cy="1.5859377"
       fx="1.9253448"
       fy="1.5859377"
       r="1.8520745"
       gradientTransform="matrix(0.52567107,2.2171355,-3.1156479,0.74495154,7.0636417,-2.0294558)"
       gradientUnits="userSpaceOnUse" />
    <linearGradient
       inkscape:collect="always"
       id="linearGradient1041">
      <stop
         style="stop-color:#ffaaaa;stop-opacity:1"
         offset="0"
         id="stop1037" />
      <stop
         style="stop-color:#ff0000;stop-opacity:1"
         offset="1"
         id="stop1039" />
    </linearGradient>
    <linearGradient
       id="a"
       gradientUnits="userSpaceOnUse"
       x1="28.381756"
       x2="18.618242"
       y1="28.381756"
       y2="18.618242"
       gradientTransform="matrix(0.98581312,0,0,0.98581312,0.33339172,0.33339172)">
      <stop
         offset="0"
         stop-color="#009600"
         id="stop698" />
      <stop
         offset="1"
         stop-color="#6edb39"
         id="stop700" />
    </linearGradient>
    <linearGradient
       id="a-9"
       gradientUnits="userSpaceOnUse"
       x1="28.381756"
       x2="18.618242"
       y1="28.381756"
       y2="18.618242"
       gradientTransform="matrix(0.94740493,0,0,0.94740493,1.5359826,1.5359831)">
      <stop
         offset="0"
         stop-color="#009600"
         id="stop698-7" />
      <stop
         offset="1"
         stop-color="#6edb39"
         id="stop700-1" />
    </linearGradient>
  </defs>
  <sodipodi:namedview
     id="namedview379"
     pagecolor="#ffffff"
     bordercolor="#666666"
     borderopacity="1.0"
     inkscape:showpageshadow="2"
     inkscape:pageopacity="0.0"
     inkscape:pagecheckerboard="0"
     inkscape:deskcolor="#d1d1d1"
     showgrid="true"
     inkscape:zoom="28.6875"
     inkscape:cx="15.494553"
     inkscape:cy="16"
     inkscape:current-layer="svg377">
    <inkscape:grid
       type="xygrid"
       id="grid1274" />
  </sodipodi:namedview>
  <path
     id="path353"
     style="fill:url(#radialGradient1043);fill-opacity:1;stroke:#d40000;stroke-width:0.264584px;stroke-linecap:butt;stroke-linejoin:miter;stroke-opacity:1"
     d="m 2.4169801,0.66138302 c -1.93388182,0.00478 -3.34725333,3.55017118 1.816146,7.11543288 6.8135579,-4.7046755 2.1743321,-9.3738424 0,-5.9198923 C 3.7065301,1.0204201 3.0350249,0.65985602 2.4169801,0.66138302 Z" />
  <g
     id="g4611"
     transform="scale(0.26458334)">
    <circle
       cx="23.799999"
       cy="23.799999"
       fill="url(#a)"
       stroke-dashoffset="1.49998"
       stroke-linejoin="round"
       stroke-width="1.37838"
       transform="matrix(0,1,1,0,0,0)"
       id="circle703"
       style="fill:url(#a-9);stroke:#ffffff;stroke-width:1.6;stroke-linecap:round;stroke-dasharray:none"
       r="7.4000006" />
    <path
       d="m 23.799999,20.099998 v 7.4"
       id="path808"
       style="fill:none;stroke:#ffffff;stroke-width:1.6;stroke-linecap:round;stroke-dasharray:none" />
    <path
       d="m 27.499999,23.799998 h -7.4"
       id="path810"
       style="fill:none;stroke:#ffffff;stroke-width:1.6;stroke-linecap:round;stroke-dasharray:none" />
    <rect
       style="fill:none;stroke:none;stroke-width:1.5;stroke-linecap:round;stroke-linejoin:round;stroke-miterlimit:5.6"
       id="rect4236"
       width="17"
       height="17"
       x="15"
       y="15" />
  </g>
</svg>
