<?xml version="1.0" encoding="UTF-8" standalone="no"?>
<svg
   height="32"
   width="32"
   version="1.1"
   id="svg205"
   sodipodi:docname="Paste_03_32.svg"
   inkscape:export-filename="Paste_03_32.png"
   inkscape:export-xdpi="96"
   inkscape:export-ydpi="96"
   inkscape:version="1.2.1 (9c6d41e410, 2022-07-14)"
   xmlns:inkscape="http://www.inkscape.org/namespaces/inkscape"
   xmlns:sodipodi="http://sodipodi.sourceforge.net/DTD/sodipodi-0.dtd"
   xmlns="http://www.w3.org/2000/svg"
   xmlns:svg="http://www.w3.org/2000/svg">
  <defs
     id="defs209" />
  <sodipodi:namedview
     id="namedview207"
     pagecolor="#ffffff"
     bordercolor="#666666"
     borderopacity="1.0"
     inkscape:pageshadow="2"
     inkscape:pageopacity="0.0"
     inkscape:pagecheckerboard="0"
     inkscape:deskcolor="#d1d1d1"
     showgrid="true"
     inkscape:zoom="28.6875"
     inkscape:cx="15.494553"
     inkscape:cy="16"
     inkscape:current-layer="svg205"
     inkscape:showpageshadow="2">
    <inkscape:grid
       type="xygrid"
       id="grid6310" />
  </sodipodi:namedview>
  <linearGradient
     id="a"
     gradientTransform="matrix(0.84615394,0,0,0.5454545,6.081196,-7.927802)"
     gradientUnits="userSpaceOnUse"
     x1="5.399997"
     x2="5.399997"
     y1="4.333334"
     y2="11.666667">
    <stop
       offset="0"
       stop-color="#fc0"
       id="stop167" />
    <stop
       offset="1"
       stop-color="#fff6d5"
       id="stop169" />
  </linearGradient>
  <linearGradient
     id="b"
     gradientTransform="matrix(0.84615394,0,0,0.5454545,6.081196,-7.927802)"
     gradientUnits="userSpaceOnUse"
     x1="7.999997"
     x2="7.999997"
     y1="13.500001"
     y2="2.5">
    <stop
       offset="0"
       stop-color="#744b18"
       id="stop172" />
    <stop
       offset="1"
       stop-color="#ca7f26"
       id="stop174" />
  </linearGradient>
  <linearGradient
     id="c"
     gradientTransform="matrix(1.2307692,0,0,1.7273209,14.50427,8.245864)"
     gradientUnits="userSpaceOnUse"
     x1="3.666667"
     x2="3.666667"
     y1="3.722222"
     y2="12.277779">
    <stop
       offset="0"
       stop-color="#fff"
       id="stop177" />
    <stop
       offset="1"
       stop-color="#e0ebf4"
       id="stop179" />
  </linearGradient>
  <linearGradient
     id="d"
     gradientTransform="matrix(1.2307692,0,0,1.7273209,14.50427,8.245864)"
     gradientUnits="userSpaceOnUse"
     x1="7.277778"
     x2="7.277778"
     y1="13.500001"
     y2="2.5">
    <stop
       offset="0"
       stop-color="#3a7ab7"
       id="stop182" />
    <stop
       offset="1"
       stop-color="#75a5d3"
       id="stop184" />
  </linearGradient>
  <g
     id="g1019"
     transform="translate(4)">
    <rect
       fill="url(#a)"
       fill-rule="evenodd"
       height="6"
       rx="0.38461399"
       ry="0.272728"
       stroke="url(#b)"
       stroke-linecap="square"
       transform="scale(1,-1)"
       width="10"
       x="7"
       y="-7"
       id="rect199"
       style="fill:none;stroke:#00aad4;stroke-width:2;stroke-opacity:1" />
    <path
       d="M 17.5,3 H 22 c 0.468769,0 1,0.3452728 1,1 v 24 c 0,0.654728 -0.531231,1 -1,1 H 2 C 1.5312307,29 1,28.654728 1,28 V 4 C 1,3.3452728 1.5312307,3 2,3 h 4.5"
       id="path1015"
       style="fill:none;stroke:#00aad4;stroke-width:2"
       sodipodi:nodetypes="csssccsssc" />
  </g>
  <path
     style="fill:none;stroke:#00aad4;stroke-width:2.5;stroke-linecap:round;stroke-linejoin:round;stroke-dasharray:none;stroke-opacity:1"
     d="m 11.45,18 3,4 7,-9"
     id="path1230"
     sodipodi:nodetypes="ccc" />
</svg>
