<?xml version="1.0" encoding="UTF-8" standalone="no"?>
<svg
   height="32"
   width="32"
   version="1.1"
   id="svg185"
   sodipodi:docname="Flag_03_32.svg"
   inkscape:export-filename="Flag_03_32.png"
   inkscape:export-xdpi="96"
   inkscape:export-ydpi="96"
   inkscape:version="1.2.1 (9c6d41e410, 2022-07-14)"
   xmlns:inkscape="http://www.inkscape.org/namespaces/inkscape"
   xmlns:sodipodi="http://sodipodi.sourceforge.net/DTD/sodipodi-0.dtd"
   xmlns="http://www.w3.org/2000/svg"
   xmlns:svg="http://www.w3.org/2000/svg">
  <defs
     id="defs189" />
  <sodipodi:namedview
     id="namedview187"
     pagecolor="#ffffff"
     bordercolor="#666666"
     borderopacity="1.0"
     inkscape:pageshadow="2"
     inkscape:pageopacity="0.0"
     inkscape:pagecheckerboard="0"
     inkscape:deskcolor="#d1d1d1"
     showgrid="true"
     inkscape:zoom="28.6875"
     inkscape:cx="11.729847"
     inkscape:cy="16"
     inkscape:current-layer="svg185"
     inkscape:showpageshadow="2">
    <inkscape:grid
       type="xygrid"
       id="grid951" />
  </sodipodi:namedview>
  <path
     id="path159"
     style="fill-rule:evenodd;stroke-width:2;stroke:none;fill:#ff7f00;fill-opacity:1"
     d="M 17.033203 4.6835938 C 17.018132 4.7032648 15.71705 8.109743 15.71875 8.125 C 15.719824 8.1344908 15.902678 8.2091898 16.125 8.2910156 C 16.957248 8.5973272 17.659751 8.7381414 18.642578 8.7949219 C 18.910043 8.8103852 19.165911 8.8204962 19.212891 8.8164062 C 19.291482 8.8096162 19.352028 8.6710059 19.955078 7.0996094 C 20.315646 6.1600642 20.605762 5.3874025 20.601562 5.3828125 C 20.597286 5.3782235 20.400709 5.3649876 20.164062 5.3535156 C 19.043496 5.2992001 18.287666 5.1514411 17.392578 4.8105469 C 17.19874 4.7367238 17.036503 4.6792838 17.033203 4.6835938 z M 25.355469 5.2578125 C 25.2709 5.2592763 25.190682 5.2617759 25.117188 5.2675781 L 24.886719 5.2871094 L 24.234375 6.984375 C 23.876501 7.9184088 23.589903 8.6868363 23.595703 8.6914062 C 23.601435 8.6959792 23.845304 8.7035444 24.138672 8.7089844 C 25.07871 8.7264179 25.936304 8.87293 26.691406 9.1445312 C 26.926082 9.2289438 27.133534 9.2975429 27.152344 9.296875 C 27.184331 9.2957498 28.491775 5.9372339 28.484375 5.875 C 28.47916 5.8308122 27.797632 5.5906216 27.390625 5.4902344 C 26.777733 5.3390666 25.94745 5.2475658 25.355469 5.2578125 z M 12.697266 5.5 C 12.688288 5.5111172 12.392367 6.2710122 12.039062 7.1894531 L 11.396484 8.859375 L 11.482422 9.0390625 C 11.645021 9.3746458 12.030115 9.9612157 12.291016 10.271484 C 12.713226 10.773584 13.386681 11.297119 13.986328 11.587891 C 14.119213 11.652331 14.172097 11.662346 14.185547 11.628906 C 14.259784 11.444396 15.489136 8.2282631 15.488281 8.2207031 C 15.487683 8.2154121 15.400377 8.1690064 15.294922 8.1171875 C 14.979155 7.9620256 14.412248 7.5917742 14.164062 7.3789062 C 13.67562 6.9599729 13.239459 6.4237572 12.916016 5.84375 C 12.804237 5.6433034 12.706266 5.488889 12.697266 5.5 z M 23.314453 8.8808594 C 23.30999 8.8773014 22.782311 8.8951509 22.140625 8.9199219 C 21.498939 8.9446919 20.702588 8.9708025 20.371094 8.9765625 C 20.039601 8.9823235 19.684572 8.9940163 19.583984 9.0039062 L 19.402344 9.0214844 L 18.75 10.716797 C 18.391901 11.649238 18.107488 12.420034 18.117188 12.427734 C 18.14837 12.452624 19.362803 12.42711 20.634766 12.375 C 21.314887 12.34714 21.893155 12.325925 21.921875 12.328125 C 21.950595 12.330355 21.98679 12.320601 22 12.306641 C 22.027341 12.277689 23.326863 8.8907694 23.314453 8.8808594 z M 27.28125 9.5332031 L 26.628906 11.232422 C 26.270385 12.166803 25.974556 12.950006 25.972656 12.972656 C 25.970786 12.995305 26.122475 13.09135 26.308594 13.1875 C 27.23314 13.665118 28.164705 14.552026 28.765625 15.523438 C 28.850795 15.661115 28.9281 15.772984 28.9375 15.771484 C 28.946817 15.769966 29.247079 15.003353 29.603516 14.068359 L 30.251953 12.367188 L 30 11.974609 C 29.364122 10.980059 28.547447 10.209325 27.59375 9.7011719 L 27.28125 9.5332031 z M 14.263672 11.916016 C 14.248242 11.936092 12.945466 15.341752 12.947266 15.357422 C 12.948339 15.366913 13.131193 15.441608 13.353516 15.523438 C 14.185763 15.829748 14.888266 15.970564 15.871094 16.027344 C 16.138558 16.042754 16.396369 16.050975 16.443359 16.046875 C 16.52195 16.040085 16.580543 15.903428 17.183594 14.332031 C 17.544161 13.392486 17.834425 12.617528 17.828125 12.611328 C 17.82185 12.605138 17.593337 12.589752 17.320312 12.576172 C 16.296853 12.525299 15.559114 12.380456 14.683594 12.058594 C 14.455698 11.974813 14.267272 11.911316 14.263672 11.916016 z M 22.529297 12.484375 C 22.355316 12.483804 22.22111 12.487794 22.183594 12.498047 C 22.127184 12.513465 21.979695 12.865777 21.462891 14.216797 C 21.105621 15.150762 20.818419 15.917275 20.824219 15.921875 C 20.829951 15.926445 21.073819 15.936006 21.367188 15.941406 C 22.307226 15.95884 23.166771 16.105352 23.921875 16.376953 C 24.15655 16.46136 24.364003 16.529964 24.382812 16.529297 C 24.413679 16.528212 25.718644 13.174109 25.714844 13.105469 C 25.713998 13.089806 25.527486 13.008821 25.300781 12.925781 C 24.832454 12.754232 23.996285 12.569617 23.480469 12.523438 C 23.221202 12.500231 22.819264 12.485326 22.529297 12.484375 z M 9.9257812 12.730469 C 9.9168037 12.741586 9.6208207 13.50344 9.2675781 14.421875 L 8.625 16.091797 L 8.7109375 16.253906 C 9.0083501 16.82813 9.3026431 17.268455 9.6542969 17.660156 C 9.9361276 17.974081 10.624753 18.501595 11.03125 18.714844 C 11.288554 18.849821 11.403106 18.893388 11.416016 18.861328 C 11.490274 18.67676 12.717652 15.460725 12.716797 15.453125 C 12.716199 15.447832 12.630847 15.401429 12.525391 15.349609 C 12.209625 15.194448 11.642718 14.824196 11.394531 14.611328 C 10.90609 14.192395 10.469927 13.656179 10.146484 13.076172 C 10.034704 12.875726 9.9347512 12.719359 9.9257812 12.730469 z M 20.542969 16.113281 C 20.538534 16.109751 20.010828 16.127574 19.369141 16.152344 C 18.727453 16.177114 17.931104 16.201231 17.599609 16.207031 C 17.268115 16.212791 16.915041 16.226428 16.814453 16.236328 L 16.630859 16.253906 L 15.980469 17.949219 C 15.62237 18.881661 15.333844 19.647544 15.339844 19.652344 C 15.366117 19.673294 15.971829 19.669278 16.78125 19.642578 C 17.263435 19.626678 17.912541 19.605403 18.224609 19.595703 C 18.536679 19.586003 18.893424 19.568371 19.017578 19.556641 L 19.244141 19.535156 L 19.898438 17.828125 C 20.258238 16.888547 20.547369 16.116781 20.542969 16.113281 z M 24.509766 16.765625 L 23.857422 18.464844 C 23.498897 19.399225 23.203972 20.181448 23.201172 20.205078 C 23.19845 20.22872 23.260554 20.277037 23.339844 20.310547 C 23.593753 20.417871 24.163566 20.781238 24.496094 21.048828 C 25.050994 21.495363 25.692013 22.2267 26.025391 22.792969 C 26.093571 22.908785 26.158569 23.003053 26.167969 23.001953 C 26.177339 23.000884 26.475595 22.233822 26.832031 21.298828 L 27.480469 19.599609 L 27.228516 19.207031 C 26.592637 18.212482 25.777913 17.439793 24.824219 16.931641 L 24.509766 16.765625 z " />
  <path
     d="M 31.7248,8.7585282 C 30.589347,6.7334696 28.915636,5.5230421 26.355057,5.2186338 24.521532,5.0006593 20.528848,5.6193514 18.327024,5.0241529 15.925095,4.3748621 14.843685,3.2486115 14.078448,1.6335334 L 8.5369098,16.096661 c 0.7652372,1.615078 1.8466472,2.741329 4.2485762,3.39062 2.201824,0.595199 6.194507,-0.02349 8.028032,0.194481 2.560581,0.304408 4.23429,1.514838 5.369745,3.539895 z"
     fill="#ffffff"
     fill-rule="evenodd"
     stroke="#808080"
     stroke-width="0.5"
     id="path157"
     style="stroke:#00aad4;stroke-opacity:1;fill:none" />
  <path
     d="M 12.608478,1.5016174 1.4983785,30.4984"
     fill="none"
     stroke="#c87137"
     stroke-linecap="round"
     stroke-width="2.99998"
     id="path181"
     style="stroke:#00aad4;stroke-opacity:1" />
</svg>
