<?xml version="1.0" encoding="UTF-8" standalone="no"?>
<svg
   height="64"
   width="64"
   version="1.1"
   id="svg291"
   sodipodi:docname="Save_01_64.svg"
   inkscape:export-filename="Save_01_64.png"
   inkscape:export-xdpi="96"
   inkscape:export-ydpi="96"
   inkscape:version="1.2-beta (1b65182ce9, 2022-04-05)"
   xmlns:inkscape="http://www.inkscape.org/namespaces/inkscape"
   xmlns:sodipodi="http://sodipodi.sourceforge.net/DTD/sodipodi-0.dtd"
   xmlns="http://www.w3.org/2000/svg"
   xmlns:svg="http://www.w3.org/2000/svg">
  <defs
     id="defs293" />
  <sodipodi:namedview
     id="namedview12"
     pagecolor="#ffffff"
     bordercolor="#666666"
     borderopacity="1.0"
     inkscape:pageshadow="2"
     inkscape:pageopacity="0.0"
     inkscape:pagecheckerboard="0"
     inkscape:deskcolor="#d1d1d1"
     showgrid="true"
     inkscape:zoom="14.34375"
     inkscape:cx="32"
     inkscape:cy="32"
     inkscape:current-layer="svg291">
    <inkscape:grid
       type="xygrid"
       id="grid139" />
  </sodipodi:namedview>
  <linearGradient
     id="a"
     gradientUnits="userSpaceOnUse"
     x1="14"
     x2="15.5"
     y1="9"
     y2="14">
    <stop
       offset="0"
       stop-color="#ccc"
       id="stop276" />
    <stop
       offset="1"
       stop-color="#f2f2f2"
       id="stop278" />
  </linearGradient>
  <g
     fill-rule="evenodd"
     transform="matrix(4,0,0,4,-32,-32)"
     id="g289">
    <path
       d="M 23,24 V 9.5 L 21.5,8 H 8 v 16 z"
       fill="#0062f5"
       id="path281" />
    <path
       d="m -21,-23 h 11 v 1.5 h -11 z"
       fill="#ff0000"
       transform="scale(-1)"
       id="path283" />
    <path
       d="m -21,-21.5 h 11 v 6.500002 h -11 z"
       fill="#ffffff"
       transform="scale(-1)"
       id="path285" />
    <path
       d="M 20,14 V 8 h -8 v 6 z M 19,13 H 17 V 9 h 2 z"
       fill="url(#a)"
       id="path287"
       style="fill:url(#a)" />
  </g>
</svg>
