<?xml version="1.0" encoding="UTF-8" standalone="no"?>
<svg
   width="36"
   height="36"
   version="1.1"
   id="svg3803"
   sodipodi:docname="Time_08_36.svg"
   inkscape:export-filename="Time_08_36.png"
   inkscape:export-xdpi="96"
   inkscape:export-ydpi="96"
   inkscape:version="1.2.1 (9c6d41e410, 2022-07-14)"
   xmlns:inkscape="http://www.inkscape.org/namespaces/inkscape"
   xmlns:sodipodi="http://sodipodi.sourceforge.net/DTD/sodipodi-0.dtd"
   xmlns="http://www.w3.org/2000/svg"
   xmlns:svg="http://www.w3.org/2000/svg">
  <defs
     id="defs3807" />
  <sodipodi:namedview
     id="namedview3805"
     pagecolor="#ffffff"
     bordercolor="#666666"
     borderopacity="1.0"
     inkscape:showpageshadow="2"
     inkscape:pageopacity="0.0"
     inkscape:pagecheckerboard="0"
     inkscape:deskcolor="#d1d1d1"
     showgrid="true"
     inkscape:zoom="25.5"
     inkscape:cx="16"
     inkscape:cy="18"
     inkscape:current-layer="g3801">
    <inkscape:grid
       type="xygrid"
       id="grid4238" />
  </sodipodi:namedview>
  <g
     fill="none"
     stroke="#00aad4"
     id="g3801">
    <path
       d="m 18,11 v 9 h 6.5"
       stroke-width="2.2499"
       id="path3783"
       sodipodi:nodetypes="ccc" />
    <circle
       cx="7.8748002"
       cy="32.624748"
       r="2.5311375"
       stroke-width="1.68743"
       id="circle3785"
       style="stroke-linecap:round;stroke-linejoin:round" />
    <circle
       cx="28.123899"
       cy="32.624748"
       r="2.5311375"
       stroke-width="1.68743"
       id="circle3787"
       style="stroke-linecap:round;stroke-linejoin:round" />
    <path
       d="m 20.907346,5.5721754 c 1.183042,-1.7975576 4.163665,-3.5568669 7.291701,-1.5081755 3.128036,2.048624 2.69493,5.4762566 1.511887,7.2739271 z"
       id="path3793"
       style="stroke-width:1.79992" />
    <path
       d="M 15.091354,5.5721754 C 13.908312,3.7746178 10.927689,2.0153085 7.7996533,4.0639999 4.6716174,6.1126239 5.1047231,9.5402565 6.2877655,11.337927 Z"
       id="path3795"
       style="stroke-width:1.79992" />
    <circle
       cx="18.00025"
       cy="20.250298"
       r="12.37445"
       id="circle3789"
       style="stroke-width:2.2499;stroke-linecap:round;stroke-linejoin:round;stroke:#ff7f00;stroke-opacity:1" />
  </g>
</svg>
