<?xml version="1.0" encoding="UTF-8" standalone="no"?>
<svg
   height="36"
   width="36"
   version="1.1"
   id="svg443"
   sodipodi:docname="Print_03_36.svg"
   inkscape:export-filename="Print_03_36.png"
   inkscape:export-xdpi="96"
   inkscape:export-ydpi="96"
   inkscape:version="1.2-beta (1b65182ce9, 2022-04-05)"
   xmlns:inkscape="http://www.inkscape.org/namespaces/inkscape"
   xmlns:sodipodi="http://sodipodi.sourceforge.net/DTD/sodipodi-0.dtd"
   xmlns="http://www.w3.org/2000/svg"
   xmlns:svg="http://www.w3.org/2000/svg">
  <defs
     id="defs447" />
  <sodipodi:namedview
     id="namedview445"
     pagecolor="#ffffff"
     bordercolor="#666666"
     borderopacity="1.0"
     inkscape:pageshadow="2"
     inkscape:pageopacity="0.0"
     inkscape:pagecheckerboard="0"
     inkscape:deskcolor="#d1d1d1"
     showgrid="true"
     inkscape:zoom="25.5"
     inkscape:cx="17.72549"
     inkscape:cy="18"
     inkscape:current-layer="svg443">
    <inkscape:grid
       type="xygrid"
       id="grid1549" />
  </sodipodi:namedview>
  <g
     id="g1928">
    <path
       d="M 9,14 H 4 v 5"
       stroke-linejoin="round"
       id="path427"
       style="fill:none;stroke:#00aad4;stroke-width:2;stroke-dasharray:none"
       sodipodi:nodetypes="ccc" />
    <path
       d="M 33,19 V 14 H 28"
       stroke-linejoin="round"
       id="path429"
       style="fill:none;stroke:#00aad4;stroke-width:2;stroke-dasharray:none"
       sodipodi:nodetypes="ccc" />
    <path
       d="M 9,19 V 3 h 19 v 16"
       id="path431"
       style="fill:none;stroke:#00aad4;stroke-width:2;stroke-dasharray:none"
       sodipodi:nodetypes="cccc" />
    <path
       d="M 2,19 H 35 V 32 H 2 Z"
       stroke-linecap="round"
       stroke-linejoin="round"
       id="path433"
       style="fill:none;stroke:#00aad4;stroke-width:2;stroke-dasharray:none"
       sodipodi:nodetypes="ccccc" />
    <path
       d="m 26,27 h 4.5"
       stroke-linecap="round"
       stroke-linejoin="round"
       id="path435"
       style="fill:none;stroke:#00aad4;stroke-width:2;stroke-dasharray:none"
       sodipodi:nodetypes="cc" />
    <path
       d="M 13,8 H 24"
       id="path437"
       style="fill:none;stroke:#00aad4;stroke-width:2;stroke-dasharray:none"
       sodipodi:nodetypes="cc" />
    <path
       d="M 13,13 H 24"
       id="path439"
       style="fill:none;stroke:#00aad4;stroke-width:2;stroke-dasharray:none"
       sodipodi:nodetypes="cc" />
  </g>
</svg>
