<?xml version="1.0" encoding="UTF-8" standalone="no"?>
<svg
   width="16"
   height="16"
   viewBox="0 0 16 16"
   version="1.1"
   id="svg1"
   sodipodi:docname="tag_nbsp.svg"
   inkscape:version="1.3.2 (091e20e, 2023-11-25, custom)"
   inkscape:export-filename="tag_nbsp.png"
   inkscape:export-xdpi="96"
   inkscape:export-ydpi="96"
   xmlns:inkscape="http://www.inkscape.org/namespaces/inkscape"
   xmlns:sodipodi="http://sodipodi.sourceforge.net/DTD/sodipodi-0.dtd"
   xmlns="http://www.w3.org/2000/svg"
   xmlns:svg="http://www.w3.org/2000/svg">
  <defs
     id="defs1" />
  <sodipodi:namedview
     id="namedview1"
     pagecolor="#ffffff"
     bordercolor="#000000"
     borderopacity="0.25"
     inkscape:showpageshadow="2"
     inkscape:pageopacity="0.0"
     inkscape:pagecheckerboard="0"
     inkscape:deskcolor="#d1d1d1"
     showgrid="true"
     inkscape:current-layer="svg1">
    <inkscape:grid
       id="grid1"
       units="px"
       originx="0"
       originy="0"
       spacingx="0.5"
       spacingy="0.5"
       empcolor="#0099e5"
       empopacity="0.30196078"
       color="#0099e5"
       opacity="0.14901961"
       empspacing="2"
       dotted="false"
       gridanglex="30"
       gridanglez="30"
       visible="true" />
  </sodipodi:namedview>
  <path
     d="M 2.9999993,6.1999853 V 12.19997 m 0,-3.8499899 c 0,-1.1910969 0.9200881,-2.1499948 2.0629794,-2.1499948 1.1428989,0 1.9370116,0.9588979 1.9370116,2.1499948 V 12.19997"
     fill="none"
     stroke="#008dd2"
     stroke-linecap="round"
     stroke-linejoin="round"
     stroke-width="1.6"
     id="path1" />
  <path
     d="m 11.999996,6.1999928 v 0 c 1.107999,0 1.999997,0.891998 1.999997,1.9999949 v 1.9999953 c 0,1.107998 -0.891998,1.999995 -1.999997,1.999995 v 0 c -1.107998,0 -1.9999967,-0.891997 -1.9999967,-1.999995 V 8.1999877 c 0,-1.1079969 0.8919987,-1.9999949 1.9999967,-1.9999949 z M 9.9999993,3.7999993 v 8.3999787"
     fill="none"
     stroke="#008dd2"
     stroke-linecap="round"
     stroke-linejoin="round"
     stroke-width="1.6"
     id="path2" />
</svg>
