<?xml version="1.0" encoding="UTF-8" standalone="no"?>
<svg
   width="24"
   height="24"
   version="1.1"
   viewBox="0 0 24 24"
   id="svg5"
   sodipodi:docname="Charge_01_24.svg"
   inkscape:version="1.3.2 (091e20e, 2023-11-25, custom)"
   xmlns:inkscape="http://www.inkscape.org/namespaces/inkscape"
   xmlns:sodipodi="http://sodipodi.sourceforge.net/DTD/sodipodi-0.dtd"
   xmlns="http://www.w3.org/2000/svg"
   xmlns:svg="http://www.w3.org/2000/svg">
  <defs
     id="defs5" />
  <sodipodi:namedview
     id="namedview5"
     pagecolor="#ffffff"
     bordercolor="#000000"
     borderopacity="0.25"
     inkscape:showpageshadow="2"
     inkscape:pageopacity="0.0"
     inkscape:pagecheckerboard="0"
     inkscape:deskcolor="#d1d1d1"
     showgrid="true"
     inkscape:current-layer="svg5">
    <inkscape:grid
       id="grid5"
       units="px"
       originx="0"
       originy="0"
       spacingx="0.5"
       spacingy="0.5"
       empcolor="#0099e5"
       empopacity="0.30196078"
       color="#0099e5"
       opacity="0.14901961"
       empspacing="2"
       dotted="false"
       gridanglex="30"
       gridanglez="30"
       visible="true" />
  </sodipodi:namedview>
  <rect
     x="2.5"
     y="7.5"
     width="17"
     height="10"
     ry="1.5714287"
     fill="none"
     stroke="#2a7efe"
     stroke-width=".999999"
     id="rect1" />
  <rect
     x="19.5"
     y="10.749999"
     width="2"
     height="3.5"
     ry=".52328575"
     fill="none"
     stroke="#2a7efe"
     stroke-width=".999999"
     id="rect2" />
  <path
     d="M 5,9.8000001 V 15.2"
     fill="none"
     stroke="#ff7f00"
     stroke-linecap="round"
     stroke-width="2"
     id="path2" />
  <path
     d="M 14,9.7999999 V 15.2"
     fill="none"
     stroke="#ff7f00"
     stroke-linecap="round"
     stroke-width="2"
     id="path3" />
  <path
     d="M 11,9.7999999 V 15.2"
     fill="none"
     stroke="#ff7f00"
     stroke-linecap="round"
     stroke-width="2"
     id="path4" />
  <path
     d="M 8,9.7999999 V 15.2"
     fill="none"
     stroke="#ff7f00"
     stroke-linecap="round"
     stroke-width="2"
     id="path5" />
</svg>
