<?xml version="1.0" encoding="UTF-8" standalone="no"?>
<svg
   height="24"
   width="24"
   version="1.1"
   id="svg859"
   sodipodi:docname="Edit_01_24.svg"
   inkscape:export-filename="Edit_01_24.png"
   inkscape:export-xdpi="96"
   inkscape:export-ydpi="96"
   inkscape:version="1.2-beta (1b65182ce9, 2022-04-05)"
   xmlns:inkscape="http://www.inkscape.org/namespaces/inkscape"
   xmlns:sodipodi="http://sodipodi.sourceforge.net/DTD/sodipodi-0.dtd"
   xmlns="http://www.w3.org/2000/svg"
   xmlns:svg="http://www.w3.org/2000/svg">
  <defs
     id="defs863" />
  <sodipodi:namedview
     id="namedview861"
     pagecolor="#ffffff"
     bordercolor="#666666"
     borderopacity="1.0"
     inkscape:pageshadow="2"
     inkscape:pageopacity="0.0"
     inkscape:pagecheckerboard="0"
     inkscape:deskcolor="#d1d1d1"
     showgrid="true"
     inkscape:zoom="38.25"
     inkscape:cx="11.986928"
     inkscape:cy="12"
     inkscape:current-layer="svg859">
    <inkscape:grid
       type="xygrid"
       id="grid2042" />
  </sodipodi:namedview>
  <linearGradient
     id="a"
     gradientTransform="matrix(1.5758809 0 0 1.2533254 -44.630158 -1294.6087)"
     gradientUnits="userSpaceOnUse"
     x1="34"
     x2="37"
     y1="1029.3622"
     y2="1029.3622">
    <stop
       offset="0"
       stop-color="#999"
       id="stop824" />
    <stop
       offset=".49999997"
       stop-color="#fff"
       id="stop826" />
    <stop
       offset="1"
       stop-color="#999"
       id="stop828" />
  </linearGradient>
  <linearGradient
     id="b"
     gradientTransform="matrix(1.5758809 0 0 1.2533254 -44.630158 -1294.6087)"
     gradientUnits="userSpaceOnUse"
     x1="34"
     x2="37"
     y1="1027.3622"
     y2="1027.3622">
    <stop
       offset="0"
       stop-color="#a00"
       id="stop831" />
    <stop
       offset=".51070523"
       stop-color="#f00"
       id="stop833" />
    <stop
       offset="1"
       stop-color="#a00"
       id="stop835" />
  </linearGradient>
  <linearGradient
     id="c"
     gradientTransform="matrix(1.5758809 0 0 1.2533254 -44.630158 -1294.6087)"
     gradientUnits="userSpaceOnUse"
     x1="34"
     x2="37"
     y1="1033.8622"
     y2="1033.8622">
    <stop
       offset="0"
       stop-color="#a05a2c"
       id="stop838" />
    <stop
       offset=".29605222"
       stop-color="#ff0"
       id="stop840" />
    <stop
       offset=".44562081"
       stop-color="#e1e100"
       id="stop842" />
    <stop
       offset="1"
       stop-color="#a05a2c"
       id="stop844" />
  </linearGradient>
  <g
     fill-rule="evenodd"
     stroke-width=".666667"
     transform="matrix(1.5 0 0 1.5 0 -.000001)"
     id="g857">
    <path
       d="m8.949791-5.736227h4.727643v2.506673h-4.727643z"
       fill="url(#a)"
       transform="matrix(.70710678 .70710678 -.70710678 .70710678 0 0)"
       id="path847" />
    <path
       d="m8.949791-8.242877h4.727643v2.506673h-4.727643z"
       fill="url(#b)"
       transform="matrix(.70710678 .70710678 -.70710678 .70710678 0 0)"
       id="path849" />
    <path
       d="m8.949791-3.229576h4.727643v8.773299h-4.727643z"
       fill="url(#c)"
       transform="matrix(.70710678 .70710678 -.70710678 .70710678 0 0)"
       id="path851" />
    <path
       d="m2.4084531 10.248462-1.54751725 3.77645 1.11431605 1.114316 3.7761493-1.547818z"
       fill="#d38d5f"
       id="path853" />
    <path
       d="m1.3782969 12.762359 1.8582868 1.858287-2.0516921.842546c-.40012515.164008-.81192904-.247871-.64795494-.647956z"
       fill="#333"
       id="path855" />
  </g>
</svg>
