<?xml version="1.0" encoding="UTF-8" standalone="no"?>
<svg
   width="32"
   height="32"
   version="1.1"
   id="svg652"
   sodipodi:docname="File_18_32.svg"
   inkscape:export-filename="File_18_32.png"
   inkscape:export-xdpi="96"
   inkscape:export-ydpi="96"
   inkscape:version="1.2.1 (9c6d41e410, 2022-07-14)"
   xmlns:inkscape="http://www.inkscape.org/namespaces/inkscape"
   xmlns:sodipodi="http://sodipodi.sourceforge.net/DTD/sodipodi-0.dtd"
   xmlns="http://www.w3.org/2000/svg"
   xmlns:svg="http://www.w3.org/2000/svg">
  <defs
     id="defs656" />
  <sodipodi:namedview
     id="namedview654"
     pagecolor="#ffffff"
     bordercolor="#666666"
     borderopacity="1.0"
     inkscape:showpageshadow="2"
     inkscape:pageopacity="0.0"
     inkscape:pagecheckerboard="0"
     inkscape:deskcolor="#d1d1d1"
     showgrid="true"
     inkscape:zoom="28.6875"
     inkscape:cx="16"
     inkscape:cy="16"
     inkscape:current-layer="svg652">
    <inkscape:grid
       type="xygrid"
       id="grid1149" />
  </sodipodi:namedview>
  <path
     d="M 4.8,0.80000006 H 19.563636 L 27.2,8.4000002 V 31.200001 H 4.8 Z"
     fill="none"
     stroke="#00aad4"
     stroke-width="2"
     id="path648"
     style="stroke-width:1.6;stroke-linecap:round;stroke-linejoin:round;stroke-dasharray:none" />
  <path
     d="M 19.199999,0.80000001 V 8.8 h 8"
     fill="none"
     stroke="#00aad4"
     stroke-width="2"
     id="path650"
     style="stroke-width:1.6;stroke-linecap:butt;stroke-linejoin:round;stroke-dasharray:none" />
  <path
     style="fill:none;stroke:#00aad4;stroke-width:3;stroke-linecap:butt;stroke-linejoin:miter;stroke-dasharray:none;stroke-opacity:1"
     d="m 8,6.5 h 8"
     id="path2717" />
  <path
     style="fill:none;stroke:#00aad4;stroke-width:3;stroke-linecap:butt;stroke-linejoin:miter;stroke-dasharray:none;stroke-opacity:1"
     d="M 8,26.5 H 24"
     id="path3082"
     sodipodi:nodetypes="cc" />
  <path
     style="fill:none;stroke:#00aad4;stroke-width:1;stroke-linecap:butt;stroke-linejoin:miter;stroke-dasharray:none;stroke-opacity:1"
     d="m 8,10.5 h 8"
     id="path3126"
     sodipodi:nodetypes="cc" />
  <path
     style="fill:none;stroke:#00aad4;stroke-width:1;stroke-linecap:butt;stroke-linejoin:miter;stroke-dasharray:none;stroke-opacity:1"
     d="M 8,13.5 H 24"
     id="path3128"
     sodipodi:nodetypes="cc" />
  <path
     style="fill:none;stroke:#00aad4;stroke-width:1;stroke-linecap:butt;stroke-linejoin:miter;stroke-dasharray:none;stroke-opacity:1"
     d="M 8,16.5 H 24"
     id="path3130"
     sodipodi:nodetypes="cc" />
  <path
     style="fill:none;stroke:#00aad4;stroke-width:1;stroke-linecap:butt;stroke-linejoin:miter;stroke-dasharray:none;stroke-opacity:1"
     d="M 8,19.5 H 24"
     id="path3132"
     sodipodi:nodetypes="cc" />
  <path
     style="fill:none;stroke:#00aad4;stroke-width:1;stroke-linecap:butt;stroke-linejoin:miter;stroke-dasharray:none;stroke-opacity:1"
     d="M 8,22.5 H 24"
     id="path3134"
     sodipodi:nodetypes="cc" />
</svg>
