<?xml version="1.0" encoding="UTF-8" standalone="no"?>
<svg
   height="32"
   width="32"
   version="1.1"
   id="svg433"
   sodipodi:docname="Folder_13_32.svg"
   inkscape:export-filename="Folder_13_32.png"
   inkscape:export-xdpi="96"
   inkscape:export-ydpi="96"
   inkscape:version="1.2 (dc2aedaf03, 2022-05-15)"
   xml:space="preserve"
   xmlns:inkscape="http://www.inkscape.org/namespaces/inkscape"
   xmlns:sodipodi="http://sodipodi.sourceforge.net/DTD/sodipodi-0.dtd"
   xmlns="http://www.w3.org/2000/svg"
   xmlns:svg="http://www.w3.org/2000/svg"><defs
     id="defs437"><radialGradient
       id="a"
       cx="4.1671958"
       cy="1041.9056"
       gradientTransform="matrix(0.09628186,-0.96268178,0.91820995,0.09182587,-933.88939,-67.612204)"
       gradientUnits="userSpaceOnUse"
       r="9"><stop
         offset="0"
         stop-color="#acf"
         id="stop1174" /><stop
         offset="1"
         stop-color="#fff"
         id="stop1176" /></radialGradient></defs><sodipodi:namedview
     id="namedview435"
     pagecolor="#ffffff"
     bordercolor="#666666"
     borderopacity="1.0"
     inkscape:pageshadow="2"
     inkscape:pageopacity="0.0"
     inkscape:pagecheckerboard="0"
     inkscape:deskcolor="#d1d1d1"
     showgrid="true"
     inkscape:zoom="28.6875"
     inkscape:cx="15.982571"
     inkscape:cy="16"
     inkscape:current-layer="svg433"
     inkscape:showpageshadow="2"><inkscape:grid
       type="xygrid"
       id="grid810" /></sodipodi:namedview><g
     id="g929"
     transform="translate(0,-0.99999998)"><path
       d="M 1,28 0.99988002,5.99988 c 0,-1.0000001 0.99999998,-2 1.99999998,-2 h 5.9999995 c 1,0 2.0000015,0.9999999 2.0000015,2 V 6.9998799 H 27 V 11.99988"
       stroke-linejoin="round"
       id="path145-3"
       style="fill:#fff3cc;stroke:#f4c025;stroke-width:1.99976;stroke-linecap:round"
       sodipodi:nodetypes="cccccccc" /><path
       d="M 31.000027,11.999986 H 5.0000036 L 1,28 h 26.000023 z"
       stroke-linejoin="round"
       id="path147"
       style="fill:#f4c025;fill-opacity:1;stroke:#f4c025;stroke-width:2;stroke-linecap:round"
       sodipodi:nodetypes="ccccc" /></g><g
     id="g1653"><circle
       cx="21.5"
       cy="21.5"
       fill="url(#a)"
       r="8.500001"
       stroke="#4d4d4d"
       stroke-linecap="round"
       stroke-linejoin="round"
       id="circle1179"
       style="fill:url(#a)" /><path
       d="m 21.5,15 v 6.5 h 5"
       fill="none"
       stroke="#666666"
       id="path1181" /><g
       stroke-linecap="round"
       stroke-linejoin="round"
       id="g1199"><path
         d="m 14.416667,21.027779 h 0.944444 v 0.944444 h -0.944444 z"
         fill="#0088aa"
         stroke-width="0.999997"
         id="path1183" /><path
         d="m 25.75,25.75 h 0.944444 v 0.944444 H 25.75 Z"
         fill="#0088aa"
         stroke-width="0.999997"
         id="path1185" /><path
         d="m 16.305555,25.75 h 0.944444 v 0.944444 h -0.944444 z"
         fill="#0088aa"
         stroke-width="0.999997"
         id="path1187" /><path
         d="m 16.305555,16.305555 h 0.944444 v 0.944444 h -0.944444 z"
         fill="#0088aa"
         stroke-width="0.999997"
         id="path1189" /><path
         d="m 27.638889,21.027779 h 0.944444 v 0.944444 h -0.944444 z"
         fill="#0088aa"
         stroke-width="0.999997"
         id="path1191" /><path
         d="m 21.027779,27.638889 h 0.944444 v 0.944444 h -0.944444 z"
         fill="#0088aa"
         stroke-width="0.999997"
         id="path1193" /><path
         d="m 25.75,16.305555 h 0.944444 v 0.944444 H 25.75 Z"
         fill="#0088aa"
         stroke-width="0.999997"
         id="path1195" /><circle
         cx="21.5"
         cy="21.5"
         fill="none"
         r="9.75"
         stroke="#ffffff"
         stroke-width="1.5"
         id="circle1197" /></g></g></svg>
