<?xml version="1.0" encoding="UTF-8" standalone="no"?>
<svg
   width="16"
   height="16"
   version="1.1"
   viewBox="0 0 16 16"
   id="svg2"
   sodipodi:docname="tag_dd.svg"
   inkscape:export-filename="tag_dd.png"
   inkscape:export-xdpi="96"
   inkscape:export-ydpi="96"
   inkscape:version="1.3.2 (091e20e, 2023-11-25, custom)"
   xmlns:inkscape="http://www.inkscape.org/namespaces/inkscape"
   xmlns:sodipodi="http://sodipodi.sourceforge.net/DTD/sodipodi-0.dtd"
   xmlns="http://www.w3.org/2000/svg"
   xmlns:svg="http://www.w3.org/2000/svg">
  <defs
     id="defs2" />
  <sodipodi:namedview
     id="namedview2"
     pagecolor="#ffffff"
     bordercolor="#000000"
     borderopacity="0.25"
     inkscape:showpageshadow="2"
     inkscape:pageopacity="0.0"
     inkscape:pagecheckerboard="0"
     inkscape:deskcolor="#d1d1d1"
     showgrid="true"
     inkscape:current-layer="svg2">
    <inkscape:grid
       id="grid2"
       units="px"
       originx="0"
       originy="0"
       spacingx="0.5"
       spacingy="0.5"
       empcolor="#0099e5"
       empopacity="0.30196078"
       color="#0099e5"
       opacity="0.14901961"
       empspacing="2"
       dotted="false"
       gridanglex="30"
       gridanglez="30"
       visible="true" />
  </sodipodi:namedview>
  <rect
     x="3.4999964"
     y="4.4999976"
     width="12.000004"
     height="9.0000019"
     fill="#ffaaaa"
     stroke="#b3b3b3"
     stroke-linecap="round"
     stroke-linejoin="round"
     stroke-width=".999997"
     id="rect1" />
  <path
     d="m4 7.4999995h11"
     fill="none"
     stroke="#b3b3b3"
     stroke-linejoin="round"
     stroke-width=".999998"
     id="path1" />
  <path
     d="m4 10.499999h11"
     fill="none"
     stroke="#b3b3b3"
     stroke-linejoin="round"
     stroke-width=".999998"
     id="path2" />
  <rect
     x=".49999821"
     y="1.4999995"
     width="12.000004"
     height="3"
     fill="#008dd2"
     stroke="#b3b3b3"
     stroke-linecap="round"
     stroke-linejoin="round"
     stroke-width=".999999"
     id="rect2" />
</svg>
