<?xml version="1.0" encoding="UTF-8" standalone="no"?>
<svg
   width="36"
   height="36"
   version="1.1"
   viewBox="0 0 9.525 9.525"
   id="svg8"
   sodipodi:docname="Package_01_36.svg"
   inkscape:version="1.3.2 (091e20e, 2023-11-25, custom)"
   inkscape:export-filename="Package_01_36.png"
   inkscape:export-xdpi="96"
   inkscape:export-ydpi="96"
   xmlns:inkscape="http://www.inkscape.org/namespaces/inkscape"
   xmlns:sodipodi="http://sodipodi.sourceforge.net/DTD/sodipodi-0.dtd"
   xmlns:xlink="http://www.w3.org/1999/xlink"
   xmlns="http://www.w3.org/2000/svg"
   xmlns:svg="http://www.w3.org/2000/svg">
  <sodipodi:namedview
     id="namedview8"
     pagecolor="#ffffff"
     bordercolor="#000000"
     borderopacity="0.25"
     inkscape:showpageshadow="2"
     inkscape:pageopacity="0.0"
     inkscape:pagecheckerboard="0"
     inkscape:deskcolor="#d1d1d1"
     showgrid="true"
     inkscape:current-layer="svg8">
    <inkscape:grid
       id="grid8"
       units="px"
       originx="0"
       originy="0"
       spacingx="0.13229167"
       spacingy="0.13229167"
       empcolor="#0099e5"
       empopacity="0.30196078"
       color="#0099e5"
       opacity="0.14901961"
       empspacing="2"
       dotted="false"
       gridanglex="30"
       gridanglez="30"
       visible="true" />
  </sodipodi:namedview>
  <defs
     id="defs4">
    <linearGradient
       id="a">
      <stop
         stop-color="#ffe991"
         offset="0"
         id="stop1" />
      <stop
         stop-color="#f5c400"
         offset="1"
         id="stop2" />
    </linearGradient>
    <linearGradient
       id="b"
       x1="1.4239"
       x2="15.576"
       y1="4.4317002"
       y2="4.4317002"
       gradientTransform="matrix(-.59462461 0 0 .59487524 9.9492512 .07298972)"
       gradientUnits="userSpaceOnUse">
      <stop
         stop-color="#ffe478"
         offset="0"
         id="stop3" />
      <stop
         stop-color="#fff2c0"
         offset="1"
         id="stop4" />
    </linearGradient>
    <linearGradient
       id="c"
       x1="8.8369999"
       x2="15.576"
       y1="7.8013"
       y2="10.834"
       gradientTransform="matrix(-.59462461 0 0 .59487524 9.9492512 .07298972)"
       gradientUnits="userSpaceOnUse"
       xlink:href="#a" />
    <linearGradient
       id="d"
       x1="8.8369999"
       x2="15.576"
       y1="7.8053999"
       y2="10.838"
       gradientTransform="matrix(.59462461 0 0 .59487524 -.15949029 .07058382)"
       gradientUnits="userSpaceOnUse"
       xlink:href="#a" />
  </defs>
  <path
     d="m4.894792 4.6637167 4.4979169-1.9499189v3.749844l-4.4979169 2.3999004z"
     fill="url(#d)"
     stroke="#ccaa00"
     stroke-linejoin="round"
     stroke-width=".264583"
     id="path4" />
  <path
     d="m4.894792 4.6636567-4.4979169-1.9498589v3.749844l4.4979168 2.3998404z"
     fill="url(#c)"
     stroke="#ccaa00"
     stroke-linejoin="round"
     stroke-width=".264583"
     id="path5" />
  <path
     d="m4.894792 0.76387902-4.4979169 1.9499789 4.4979169 1.9498588 4.4979169-1.9499189z"
     fill="url(#b)"
     stroke="#ccaa00"
     stroke-linejoin="round"
     stroke-width=".264583"
     id="path6" />
  <path
     d="m6.8104848 1.4500001-4.498481 1.9141614c-0.088472 0.037731-0.145871 0.1246727-0.1458309 0.2208892v3.9727781l0.4796607 0.2559718v-4.0705533l4.771565-2.0302424z"
     fill="#5f8dd3"
     stroke-linecap="round"
     stroke-linejoin="round"
     stroke-width=".264583"
     id="path7" />
  <path
     d="m2.9788033 1.4499023 4.4987768 1.9142874c0.088472 0.037731 0.145871 0.1246727 0.1458309 0.2208892v3.9724716l-0.4796606 0.2559717v-4.0702467l-4.7718611-2.0303683z"
     fill="#5f8dd3"
     stroke-linecap="round"
     stroke-linejoin="round"
     stroke-width=".264583"
     id="path8" />
</svg>
