<svg width="64" height="64" version="1.1" xmlns="http://www.w3.org/2000/svg">
 <g stroke="#ff2828" stroke-linecap="round" stroke-width="3.2">
  <circle cx="46" cy="46" r="16.4" fill="#ffffff" stroke-dashoffset="1.49998" stroke-linejoin="round"/>
  <path d="m39.077921 39.077921 13.844156 13.844156" fill="none"/>
  <path d="m52.922077 39.077921-13.844156 13.844156" fill="none"/>
 </g>
</svg>
