<svg width="16" height="16" version="1.0" xmlns="http://www.w3.org/2000/svg">
 <circle cx="8" cy="8" r="6.5" fill="none" stroke="#2a7efe" stroke-linecap="round" stroke-linejoin="round" style="paint-order:normal"/>
 <path d="m8 5v6" fill="none" stroke="#2a7efe" stroke-linecap="round" stroke-linejoin="round" stroke-width="1.8"/>
 <path d="m11 8h-6" fill="none" stroke="#2a7efe" stroke-linecap="round" stroke-linejoin="round" stroke-width="1.8"/>
</svg>
