<?xml version="1.0" encoding="UTF-8" standalone="no"?>
<svg
   height="22"
   width="22"
   version="1.1"
   id="svg272"
   sodipodi:docname="InactiveBreakPoint_200.svg"
   inkscape:export-filename="InactiveBreakPoint_200.png"
   inkscape:export-xdpi="96"
   inkscape:export-ydpi="96"
   inkscape:version="1.2.2 (732a01da63, 2022-12-09)"
   xmlns:inkscape="http://www.inkscape.org/namespaces/inkscape"
   xmlns:sodipodi="http://sodipodi.sourceforge.net/DTD/sodipodi-0.dtd"
   xmlns="http://www.w3.org/2000/svg"
   xmlns:svg="http://www.w3.org/2000/svg">
  <defs
     id="defs276">
    <radialGradient
       id="a"
       cx="4"
       cy="4"
       gradientTransform="matrix(8e-8,2.5454546,-2.5454546,4e-8,18.181816,-2.181818)"
       gradientUnits="userSpaceOnUse"
       r="5.5">
      <stop
         offset="0"
         stop-color="#00f23e"
         id="stop268" />
      <stop
         offset="1"
         stop-color="#00ad00"
         id="stop270" />
    </radialGradient>
  </defs>
  <sodipodi:namedview
     id="namedview274"
     pagecolor="#ffffff"
     bordercolor="#666666"
     borderopacity="1.0"
     inkscape:showpageshadow="2"
     inkscape:pageopacity="0.0"
     inkscape:pagecheckerboard="0"
     inkscape:deskcolor="#d1d1d1"
     showgrid="true"
     inkscape:zoom="41.727273"
     inkscape:cx="10.988017"
     inkscape:cy="11"
     inkscape:current-layer="svg272">
    <inkscape:grid
       type="xygrid"
       id="grid637" />
  </sodipodi:namedview>
  <circle
     cx="11"
     cy="11"
     fill="url(#a)"
     r="11"
     id="circle273"
     style="fill:url(#a);stroke-width:2" />
  <path
     d="M 7.1499824,11.549984 10.45,14.85 15.4,7.15"
     fill="none"
     stroke-width="2.20001"
     id="path268"
     style="stroke:#ffffff;stroke-linecap:round;stroke-linejoin:round;stroke-opacity:1" />
</svg>
