<?xml version="1.0" encoding="UTF-8" standalone="no"?>
<svg
   width="48"
   height="48"
   version="1.1"
   viewBox="0 0 48 48"
   id="svg7"
   sodipodi:docname="tpaintbox_200.svg"
   inkscape:export-filename="tpaintbox_200.png"
   inkscape:export-xdpi="96"
   inkscape:export-ydpi="96"
   inkscape:version="1.3.2 (091e20e, 2023-11-25, custom)"
   xmlns:inkscape="http://www.inkscape.org/namespaces/inkscape"
   xmlns:sodipodi="http://sodipodi.sourceforge.net/DTD/sodipodi-0.dtd"
   xmlns="http://www.w3.org/2000/svg"
   xmlns:svg="http://www.w3.org/2000/svg">
  <sodipodi:namedview
     id="namedview7"
     pagecolor="#ffffff"
     bordercolor="#000000"
     borderopacity="0.25"
     inkscape:showpageshadow="2"
     inkscape:pageopacity="0.0"
     inkscape:pagecheckerboard="0"
     inkscape:deskcolor="#d1d1d1"
     showgrid="true"
     inkscape:current-layer="svg7">
    <inkscape:grid
       id="grid7"
       units="px"
       originx="0"
       originy="0"
       spacingx="0.5"
       spacingy="0.5"
       empcolor="#0099e5"
       empopacity="0.30196078"
       color="#0099e5"
       opacity="0.14901961"
       empspacing="2"
       dotted="false"
       gridanglex="30"
       gridanglez="30"
       visible="true" />
  </sodipodi:namedview>
  <defs
     id="defs2">
    <linearGradient
       id="a"
       x1="20"
       x2="-3"
       y1="1048.3622"
       y2="1025.3622"
       gradientTransform="matrix(2.0583333 0 0 2.0583333 -.69999974 -2117.4122)"
       gradientUnits="userSpaceOnUse">
      <stop
         stop-color="#cccccc"
         offset="0"
         id="stop1" />
      <stop
         stop-color="#ffffff"
         offset="1"
         id="stop2" />
    </linearGradient>
  </defs>
  <rect
     x="4.5"
     y="4.4999828"
     width="39"
     height="39"
     fill="url(#a)"
     stroke="#2a7efe"
     stroke-linecap="round"
     stroke-linejoin="round"
     style="paint-order:normal"
     id="rect2" />
  <path
     d="m37.256727 10.647234-13.849226 12.306794-0.791177 0.787548-2.42797 3.923222-1.11055 1.103292c-0.790748-0.246777-1.719452-0.244861-2.72557 0.134291-1.149209 0.433066-1.668724 1.656784-2.729197 3.331652-1.300248 2.053559-3.460773 1.921089-5.6942964 2.134001 5.6205014 1.912313 9.5606004 2.569833 12.023712 0.834728 1.573764-1.108616 1.939946-2.716867 1.50614-4.068393l1.056111-1.056112 3.93774-2.351756 0.791176-0.787547 12.608022-14.157713c0.310527-0.348695 0.33776-1.395039-0.301227-2.057784-0.616911-0.63985-1.618222-0.676454-2.293688-0.07622z"
     fill="none"
     stroke="#ffffff"
     stroke-linecap="round"
     stroke-linejoin="round"
     stroke-width="1.85817"
     id="path2" />
  <path
     d="m18.605999 29.241292 1.582416-1.578153 2.324955 2.415044-1.582416 1.578151z"
     fill="#ffffff"
     fill-rule="evenodd"
     stroke-width="1.49144"
     id="path3" />
  <path
     d="m7.9277874 34.368035c2.2335246-0.212911 4.3956836-0.07977 5.6960246-2.133272 1.060382-1.67493 1.577855-2.898777 2.727042-3.331909 4.352481-1.639871 7.292606 3.699754 3.603083 6.298717-2.4631 1.735125-6.405643 1.07878-12.02615-0.833536z"
     fill="#ff0000"
     fill-rule="evenodd"
     stroke-width="1.49144"
     id="path4" />
  <path
     d="m20.188415 27.663139 2.324955 2.415044 3.939815-2.351288-3.836175-3.984821z"
     fill="#b3b3b3"
     fill-rule="evenodd"
     stroke-width="1.49144"
     id="path5" />
  <path
     d="m39.548672 10.721926c-0.621109-0.643235-1.629118-0.676788-2.290631-0.07624l-13.849217 12.307948 3.835569 3.984192 12.608004-14.157012c0.328058-0.332256 0.334783-1.395674-0.303725-2.058883z"
     fill="#c87137"
     fill-rule="evenodd"
     stroke-width="1.49144"
     id="path6" />
  <path
     d="m22.61701 23.742074 0.791208-0.789075 3.836175 3.984821-0.791208 0.789075z"
     fill="#ffffff"
     fill-rule="evenodd"
     stroke-width="1.49144"
     id="path7" />
</svg>
