<?xml version="1.0" encoding="UTF-8" standalone="no"?>
<svg
   width="36"
   height="36"
   version="1.1"
   viewBox="0 0 36 36"
   id="svg10"
   sodipodi:docname="tprintersetupdialog_150.svg"
   inkscape:export-filename="tprintersetupdialog_150.png"
   inkscape:export-xdpi="96"
   inkscape:export-ydpi="96"
   inkscape:version="1.3.2 (091e20e, 2023-11-25, custom)"
   xmlns:inkscape="http://www.inkscape.org/namespaces/inkscape"
   xmlns:sodipodi="http://sodipodi.sourceforge.net/DTD/sodipodi-0.dtd"
   xmlns="http://www.w3.org/2000/svg"
   xmlns:svg="http://www.w3.org/2000/svg">
  <sodipodi:namedview
     id="namedview10"
     pagecolor="#ffffff"
     bordercolor="#000000"
     borderopacity="0.25"
     inkscape:showpageshadow="2"
     inkscape:pageopacity="0.0"
     inkscape:pagecheckerboard="0"
     inkscape:deskcolor="#d1d1d1"
     showgrid="true"
     inkscape:current-layer="svg10">
    <inkscape:grid
       id="grid10"
       units="px"
       originx="0"
       originy="0"
       spacingx="0.5"
       spacingy="0.5"
       empcolor="#0099e5"
       empopacity="0.30196078"
       color="#0099e5"
       opacity="0.14901961"
       empspacing="2"
       dotted="false"
       gridanglex="30"
       gridanglez="30"
       visible="true" />
  </sodipodi:namedview>
  <defs
     id="defs3">
    <linearGradient
       id="a"
       x1="12.000001"
       x2="12.000001"
       y1="1046.4728"
       y2="1041.2516"
       gradientTransform="matrix(1.4821345,0,0,1.6279585,-0.78561523,-1676.6143)"
       gradientUnits="userSpaceOnUse">
      <stop
         stop-color="#cccccc"
         offset="0"
         id="stop1" />
      <stop
         stop-color="#ffffff"
         offset=".59999651"
         id="stop2" />
      <stop
         stop-color="#cccccc"
         offset="1"
         id="stop3" />
    </linearGradient>
  </defs>
  <rect
     x="2.5"
     y="6.4999828"
     width="31"
     height="27"
     fill="#f9f9f9"
     stroke="#2a7efe"
     style="paint-order:normal"
     id="rect3" />
  <path
     d="M 34,3.5 V 7 H 2 V 3.5 C 2,2.8 2.7,2 3.5,2 h 29 C 33.2,2 34,2.7 34,3.5 Z"
     fill="#2a7efe"
     id="path3" />
  <path
     d="M 9.5,17.8661 7.366125,22 v 5.6339 h 19.26775 V 22 L 24.5,17.8661 Z"
     fill="url(#a)"
     fill-rule="evenodd"
     stroke="#784421"
     stroke-linecap="round"
     stroke-linejoin="round"
     stroke-width="0.73225"
     id="path4"
     style="fill:url(#a)" />
  <rect
     x="11.375"
     y="10.374983"
     width="11.25"
     height="10.250017"
     fill="#ffffff"
     fill-rule="evenodd"
     stroke="#808080"
     stroke-linecap="round"
     stroke-linejoin="round"
     stroke-width="0.75"
     style="paint-order:normal"
     id="rect4" />
  <path
     d="M 10.750078,24.2505 H 23.249923"
     fill="none"
     stroke="#999999"
     stroke-linecap="round"
     stroke-width="1.50001px"
     id="path5" />
  <path
     d="M 11,20.5005 H 23.000001"
     fill="none"
     stroke="#483e37"
     stroke-linecap="round"
     stroke-width="1.5"
     id="path6" />
  <path
     d="m 14,13.7505 h 5.999999"
     fill="none"
     stroke="#808080"
     stroke-width="1.5px"
     id="path7" />
  <path
     d="m 14,16.7505 h 5.999999"
     fill="none"
     stroke="#808080"
     stroke-width="1.5px"
     id="path8" />
  <path
     d="m 23.396725,17.8908 -1.777343,0.7344 c -0.570266,0.2362 -0.868455,0.8663 -0.689454,1.457 l 0.361332,1.2071 -1.203121,-0.3653 c -0.591308,-0.1801 -1.222747,0.1183 -1.458985,0.6895 l -0.736328,1.7754 c -0.235775,0.5707 -4.9e-5,1.2272 0.544922,1.5175 l 1.109375,0.5948 -1.109375,0.5967 C 17.893235,26.3897 17.659151,27.9298 17.896732,28.5 H 28 V 17.8908 c -0.570719,-0.2358 -1.613682,0 -1.904056,0.5449 L 25.50317,19.5451 24.916256,18.4377 C 24.626441,17.891 23.968479,17.6542 23.396725,17.8908 Z"
     fill="#f9f9f9"
     id="path9" />
  <path
     d="m 19.002194,23.848 1.743961,0.93 v 1.4445 l -1.741768,0.9344 0.737389,1.7749 1.886708,-0.5792 1.021375,1.0214 -0.575515,1.8907 1.775666,0.7355 0.929997,-1.7439 h 1.444445 L 27.148996,32 l 1.776482,-0.7336 -0.570917,-1.8925 1.021376,-1.0213 1.890754,0.5756 0.735503,-1.7757 -1.743921,-0.9301 1e-6,-1.4444 L 32,23.8436 l -0.737392,-1.7749 -1.886695,0.5792 -1.021376,-1.0214 0.57555,-1.8908 -1.775666,-0.7355 -0.930004,1.744 h -1.444445 l -0.924539,-1.7437 -1.776477,0.7336 0.57088,1.8924 -1.021377,1.0213 -1.89078,-0.5755 z m 4.517863,0.8312 c 0.45344,-1.0947 1.708459,-1.6146 2.803166,-1.1611 1.094708,0.4534 1.61456,1.7084 1.161114,2.8032 -0.453443,1.0947 -1.708462,1.6145 -2.803175,1.1611 -1.094704,-0.4535 -1.614554,-1.7085 -1.161105,-2.8032 z"
     fill="#2a7fff"
     id="path10" />
</svg>
