<?xml version="1.0" encoding="UTF-8" standalone="no"?>
<svg
   height="24"
   width="24"
   version="1.1"
   id="svg740"
   sodipodi:docname="Warning_01_24.svg"
   inkscape:export-filename="Warning_01_24.png"
   inkscape:export-xdpi="96"
   inkscape:export-ydpi="96"
   inkscape:version="1.2 (dc2aedaf03, 2022-05-15)"
   xmlns:inkscape="http://www.inkscape.org/namespaces/inkscape"
   xmlns:sodipodi="http://sodipodi.sourceforge.net/DTD/sodipodi-0.dtd"
   xmlns="http://www.w3.org/2000/svg"
   xmlns:svg="http://www.w3.org/2000/svg">
  <defs
     id="defs744" />
  <sodipodi:namedview
     id="namedview742"
     pagecolor="#ffffff"
     bordercolor="#666666"
     borderopacity="1.0"
     inkscape:pageshadow="2"
     inkscape:pageopacity="0.0"
     inkscape:pagecheckerboard="0"
     inkscape:deskcolor="#d1d1d1"
     showgrid="true"
     inkscape:zoom="38.25"
     inkscape:cx="11.986928"
     inkscape:cy="12"
     inkscape:current-layer="g1960"
     inkscape:showpageshadow="2">
    <inkscape:grid
       type="xygrid"
       id="grid863" />
  </sodipodi:namedview>
  <g
     id="g1960"
     transform="matrix(1.5000484,0,0,1.5000484,-0.75005634,-0.50083186)">
    <path
       id="path1062"
       style="fill:#ffffff;stroke:#f20d0d;stroke-width:1.44068;stroke-linecap:round;stroke-linejoin:round;stroke-dashoffset:1.49998;stroke-opacity:1"
       inkscape:transform-center-y="-1.8776264"
       transform="matrix(1.0408423,0,0,1.0415198,24.632819,9.9739195)"
       d="m -9.2550021,4.1055513 -12.4899959,-1e-7 6.245225,-11.2815257 z"
       sodipodi:nodetypes="cccc" />
    <path
       style="fill:none;stroke:#000000;stroke-width:1px;stroke-linecap:round;stroke-linejoin:miter;stroke-opacity:1"
       d="M 8.4997633,6.6670061 V 10.000232"
       id="path1006"
       sodipodi:nodetypes="cc" />
    <path
       style="fill:none;stroke:#000000;stroke-width:1px;stroke-linecap:round;stroke-linejoin:miter;stroke-opacity:1"
       d="m 8.4997633,11.666845 v 0.333322"
       id="path1008"
       sodipodi:nodetypes="cc" />
  </g>
</svg>
