<?xml version="1.0" encoding="UTF-8" standalone="no"?>
<svg
   width="24"
   height="24"
   version="1.1"
   viewBox="0 0 6.35 6.35"
   id="svg143"
   sodipodi:docname="Health_11_24.svg"
   inkscape:export-filename="Health_11_24.png"
   inkscape:export-xdpi="96"
   inkscape:export-ydpi="96"
   inkscape:version="1.2.1 (9c6d41e410, 2022-07-14)"
   xmlns:inkscape="http://www.inkscape.org/namespaces/inkscape"
   xmlns:sodipodi="http://sodipodi.sourceforge.net/DTD/sodipodi-0.dtd"
   xmlns="http://www.w3.org/2000/svg"
   xmlns:svg="http://www.w3.org/2000/svg">
  <defs
     id="defs147" />
  <sodipodi:namedview
     id="namedview145"
     pagecolor="#ffffff"
     bordercolor="#666666"
     borderopacity="1.0"
     inkscape:showpageshadow="2"
     inkscape:pageopacity="0.0"
     inkscape:pagecheckerboard="0"
     inkscape:deskcolor="#d1d1d1"
     showgrid="true"
     inkscape:zoom="38.25"
     inkscape:cx="11.986928"
     inkscape:cy="12"
     inkscape:current-layer="svg143">
    <inkscape:grid
       type="xygrid"
       id="grid973" />
  </sodipodi:namedview>
  <g
     fill="none"
     stroke="#00aad4"
     stroke-width=".3175"
     id="g141">
    <path
       d="m1.8367 4.5028c0.34938 0.36897 0.79035 0.74699 1.3379 1.1253 0.52238-0.36093 0.94774-0.72156 1.2891-1.0743m0.86194-1.1697c1.1465-2.2425-1-3.6958-2.151-1.8662-0.36538-0.58079-0.8313-0.83113-1.2601-0.83007-0.86682 0.0021433-1.5829 1.0302-1.0155 2.4251"
       id="path137" />
    <path
       d="m0.50581 4.1237h0.38915l0.56413-0.57476 0.38131 0.38317 0.76263-1.5244 1.1439 1.9076 0.76263-0.95793 0.57197 0.76635 0.76263-7.82e-5"
       stroke-linecap="round"
       stroke-linejoin="round"
       id="path139" />
  </g>
</svg>
