<?xml version="1.0" encoding="UTF-8" standalone="no"?>
<svg
   width="16"
   height="16"
   version="1.1"
   id="svg8"
   sodipodi:docname="Zoom_05_16.svg"
   inkscape:version="1.2.1 (9c6d41e410, 2022-07-14)"
   inkscape:export-filename="Zoom_05_16.png"
   inkscape:export-xdpi="96"
   inkscape:export-ydpi="96"
   xmlns:inkscape="http://www.inkscape.org/namespaces/inkscape"
   xmlns:sodipodi="http://sodipodi.sourceforge.net/DTD/sodipodi-0.dtd"
   xmlns="http://www.w3.org/2000/svg"
   xmlns:svg="http://www.w3.org/2000/svg">
  <defs
     id="defs12" />
  <sodipodi:namedview
     id="namedview10"
     pagecolor="#ffffff"
     bordercolor="#666666"
     borderopacity="1.0"
     inkscape:showpageshadow="2"
     inkscape:pageopacity="0.0"
     inkscape:pagecheckerboard="0"
     inkscape:deskcolor="#d1d1d1"
     showgrid="true"
     inkscape:zoom="57.375"
     inkscape:cx="8"
     inkscape:cy="8"
     inkscape:current-layer="g1654">
    <inkscape:grid
       type="xygrid"
       id="grid137" />
  </sodipodi:namedview>
  <g
     fill="none"
     stroke="#00aad4"
     id="g6"
     style="stroke-linejoin:round;stroke-linecap:round">
    <path
       d="m 6.5,15.5 h -4 v -15 h 7 l 4,4 v 2"
       id="path2"
       style="stroke-linecap:round;stroke-linejoin:round"
       sodipodi:nodetypes="cccccc" />
    <path
       d="m9.5 0.5v4h4"
       id="path4"
       style="stroke-linejoin:round;stroke-linecap:round" />
  </g>
  <g
     id="g1654">
    <g
       id="g1064">
      <path
         style="fill:none;stroke:#00aad4;stroke-width:1px;stroke-linecap:round;stroke-linejoin:round;stroke-opacity:1"
         d="m 12.5,11.5 3,-3"
         id="path1834"
         sodipodi:nodetypes="cc" />
      <path
         style="fill:none;stroke:#00aad4;stroke-width:1px;stroke-linecap:round;stroke-linejoin:round;stroke-opacity:1"
         d="M 8.5,10.7 V 8.5 h 2.2"
         id="path1838"
         sodipodi:nodetypes="ccc" />
      <path
         style="fill:none;stroke:#00aad4;stroke-width:1px;stroke-linecap:round;stroke-linejoin:round;stroke-opacity:1"
         d="M 15.5,10.7 V 8.5 h -2.2"
         id="path1840"
         sodipodi:nodetypes="ccc" />
      <path
         style="fill:none;stroke:#00aad4;stroke-width:1px;stroke-linecap:round;stroke-linejoin:round;stroke-opacity:1"
         d="m 15.5,13.3 v 2.2 h -2.2"
         id="path1842"
         sodipodi:nodetypes="ccc" />
      <path
         style="fill:none;stroke:#00aad4;stroke-width:1px;stroke-linecap:round;stroke-linejoin:round;stroke-opacity:1"
         d="m 8.5,13.3 v 2.2 h 2.2"
         id="path1844"
         sodipodi:nodetypes="ccc" />
      <path
         style="fill:none;stroke:#00aad4;stroke-width:1px;stroke-linecap:round;stroke-linejoin:round;stroke-opacity:1"
         d="m 8.5,15.5 3,-3"
         id="path2414"
         sodipodi:nodetypes="cc" />
      <path
         style="fill:none;stroke:#00aad4;stroke-width:1px;stroke-linecap:round;stroke-linejoin:round;stroke-opacity:1"
         d="m 15.5,15.5 -3,-3"
         id="path2416"
         sodipodi:nodetypes="cc" />
      <path
         style="fill:none;stroke:#00aad4;stroke-width:1px;stroke-linecap:round;stroke-linejoin:round;stroke-opacity:1"
         d="m 11.5,11.5 -3,-3"
         id="path2418"
         sodipodi:nodetypes="cc" />
    </g>
  </g>
</svg>
