<?xml version="1.0" encoding="UTF-8" standalone="no"?>
<svg
   width="48"
   height="48"
   version="1.1"
   viewBox="0 0 48 48"
   id="svg6"
   sodipodi:docname="tdividerbevel_200.svg"
   inkscape:export-filename="tdividerbevel_200.png"
   inkscape:export-xdpi="96"
   inkscape:export-ydpi="96"
   inkscape:version="1.3.2 (091e20e, 2023-11-25, custom)"
   xmlns:inkscape="http://www.inkscape.org/namespaces/inkscape"
   xmlns:sodipodi="http://sodipodi.sourceforge.net/DTD/sodipodi-0.dtd"
   xmlns="http://www.w3.org/2000/svg"
   xmlns:svg="http://www.w3.org/2000/svg">
  <defs
     id="defs6" />
  <sodipodi:namedview
     id="namedview6"
     pagecolor="#ffffff"
     bordercolor="#000000"
     borderopacity="0.25"
     inkscape:showpageshadow="2"
     inkscape:pageopacity="0.0"
     inkscape:pagecheckerboard="0"
     inkscape:deskcolor="#d1d1d1"
     showgrid="true"
     inkscape:current-layer="svg6">
    <inkscape:grid
       id="grid6"
       units="px"
       originx="0"
       originy="0"
       spacingx="0.5"
       spacingy="0.5"
       empcolor="#0099e5"
       empopacity="0.30196078"
       color="#0099e5"
       opacity="0.14901961"
       empspacing="2"
       dotted="false"
       gridanglex="30"
       gridanglez="30"
       visible="true" />
  </sodipodi:namedview>
  <rect
     y="2.9999826"
     width="48"
     height="42.000019"
     fill="#cccccc"
     fill-opacity="0.498039"
     fill-rule="evenodd"
     style="paint-order:normal"
     id="rect1"
     x="0" />
  <path
     d="M 0,23 H 9"
     fill="#b3b3b3"
     fill-rule="evenodd"
     stroke="#999999"
     stroke-width="2px"
     id="path1" />
  <path
     d="M 9,25 H 0"
     fill="none"
     stroke="#ffffff"
     stroke-width="2px"
     id="path2" />
  <path
     d="M 48,25 H 37"
     fill="#ffffff"
     fill-rule="evenodd"
     stroke="#ffffff"
     stroke-width="2px"
     id="path3" />
  <path
     d="M 37,23 H 48"
     fill="none"
     stroke="#999999"
     stroke-width="2px"
     id="path4" />
  <path
     d="m 25,29.9998 h 5.235113 c 4.598144,0 3.794973,-6.6565 -0.312159,-6.6565 M 25,29.9998 V 17 h 4.922954 c 4.111361,0 3.79497,6.3433 0,6.3433 H 25"
     fill="none"
     stroke="#2a7fff"
     stroke-linecap="round"
     stroke-linejoin="round"
     stroke-width="2"
     id="path5" />
  <path
     d="m 20.940249,25.7511 c 0,2.4476 -1.096427,4.2488 -3.970123,4.2488 H 13 V 17 h 3.970126 c 2.873696,0 3.970123,1.8011 3.970123,4.2488 z"
     fill="none"
     stroke="#2a7fff"
     stroke-linecap="round"
     stroke-linejoin="round"
     stroke-width="2"
     id="path6" />
</svg>
