<?xml version="1.0" encoding="UTF-8" standalone="no"?>
<svg
   height="16"
   width="16"
   version="1.1"
   id="svg163"
   sodipodi:docname="File_06_16.svg"
   inkscape:export-filename="File_06_16.png"
   inkscape:export-xdpi="96"
   inkscape:export-ydpi="96"
   inkscape:version="1.2-beta (1b65182ce9, 2022-04-05)"
   xml:space="preserve"
   xmlns:inkscape="http://www.inkscape.org/namespaces/inkscape"
   xmlns:sodipodi="http://sodipodi.sourceforge.net/DTD/sodipodi-0.dtd"
   xmlns="http://www.w3.org/2000/svg"
   xmlns:svg="http://www.w3.org/2000/svg"><defs
     id="defs167" /><sodipodi:namedview
     id="namedview165"
     pagecolor="#ffffff"
     bordercolor="#666666"
     borderopacity="1.0"
     inkscape:pageshadow="2"
     inkscape:pageopacity="0.0"
     inkscape:pagecheckerboard="0"
     inkscape:deskcolor="#d1d1d1"
     showgrid="true"
     inkscape:zoom="57.375"
     inkscape:cx="7.9912854"
     inkscape:cy="8"
     inkscape:current-layer="g153"><inkscape:grid
       type="xygrid"
       id="grid1008" /></sodipodi:namedview><g
     fill="none"
     stroke="#00aad4"
     stroke-linecap="round"
     id="g161"><g
       stroke-linejoin="round"
       id="g153"><path
         d="m7 15.5h-4.5v-15h7l4 4v1.5"
         id="path147" /><path
         d="m9.5.5v4h4"
         id="path149" /><g
         id="g1065"
         transform="translate(-10.893246,-3.0032682)"><circle
           style="fill:none;stroke:#00aad4;stroke-width:1;stroke-linecap:round;stroke-linejoin:round;stroke-dasharray:none;stroke-dashoffset:1.49998"
           id="path346"
           cx="22.393246"
           cy="14.503268"
           r="4" /><g
           id="g530"
           transform="translate(10.893246,2.003268)"
           style="fill:none;stroke:#00aad4;stroke-linecap:round"><path
             style="fill:none;stroke:#00aad4;stroke-width:1px;stroke-linecap:round;stroke-linejoin:miter;stroke-opacity:1"
             d="m 10,11 3,3"
             id="path1469"
             sodipodi:nodetypes="cc" /><path
             style="fill:none;stroke:#00aad4;stroke-width:1px;stroke-linecap:round;stroke-linejoin:miter;stroke-opacity:1"
             d="m 13,11 -3,3"
             id="path522"
             sodipodi:nodetypes="cc" /></g></g></g></g></svg>
