<svg width="16" height="16" version="1.1" xmlns="http://www.w3.org/2000/svg">
 <path d="m14.749999 14.921429v-12.117858l-1.557692-1.5535715h-11.111538c-0.4588211 0-0.8307692 0.3709641-0.8307692 0.8285714v12.842858c0 0.457607 0.3719481 0.828571 0.8307692 0.828571h11.838461c0.458822 0 0.830769-0.370964 0.830769-0.828571z" fill="#c2f3ff" fill-rule="evenodd" stroke="#00aad4" stroke-linejoin="round" stroke-width=".5"/>
 <path d="M 11.75,1.25 V 5.2500008 C 11.75,5.8040004 11.272143,6.25 10.678571,6.25 H 5.3214285 C 4.7278571,6.25 4.25,5.8040004 4.25,5.2500008 V 1.25 Z" fill="#ebfcff" stroke="#00aad4" stroke-linejoin="round" stroke-width=".5"/>
 <path d="m9.25 3v2" fill="none" stroke="#00aad4" stroke-linejoin="round" stroke-width="1.5"/>
 <path d="m4.3055556 8.25h7.3888884c0.584778 0 1.055556 0.4778571 1.055556 1.0714284v6.4285716h-9.5v-6.4285716c0-0.5935713 0.4707778-1.0714284 1.0555556-1.0714284z" fill="#ebfcff" stroke="#00aad4" stroke-linejoin="round" stroke-width=".5"/>
</svg>
