<svg width="32" height="32" version="1.1" xmlns="http://www.w3.org/2000/svg">
 <linearGradient id="a" x1="230.26965" x2="271.83875" y1="-115.89568" y2="-42.350357" gradientTransform="matrix(.20221852 0 0 .20197099 -28.945289 35.853457)" gradientUnits="userSpaceOnUse">
  <stop stop-color="#f00" offset="0"/>
  <stop stop-color="#d40000" offset="1"/>
 </linearGradient>
 <g>
  <path d="m16.77202 11.802727c-6.171972-0.175881-8.5935887 9.338798 4.724631 19.201784 16.391652-12.13904 8.940897-23.750306 0-17.416886-1.67642-1.187518-3.300327-1.744295-4.724631-1.784898z" fill="url(#a)" stroke="#ffffff" stroke-width="1.6"/>
  <path d="m13.3 23.25h1.2l1.5-2.25 1.5 1.5 2.5-5 4 6.5 2.5-3.5 2 2.75h1.2" fill="none" stroke="#ffffff" stroke-linecap="round" stroke-linejoin="round" stroke-width="4.5"/>
  <path d="m13 23.25h1.5l1.5-2.25 1.5 1.5 2.5-5 4 6.5 2.5-3.5 2 2.75h1.5" fill="none" stroke="#3771c8" stroke-linecap="round" stroke-linejoin="round" stroke-width="1.5"/>
 </g>
</svg>
