<?xml version="1.0" encoding="UTF-8" standalone="no"?>
<svg
   height="16"
   width="16"
   version="1.1"
   id="svg159"
   sodipodi:docname="Folder_03_16.svg"
   inkscape:export-filename="Folder_03_16.png"
   inkscape:export-xdpi="96"
   inkscape:export-ydpi="96"
   inkscape:version="1.2-beta (1b65182ce9, 2022-04-05)"
   xml:space="preserve"
   xmlns:inkscape="http://www.inkscape.org/namespaces/inkscape"
   xmlns:sodipodi="http://sodipodi.sourceforge.net/DTD/sodipodi-0.dtd"
   xmlns="http://www.w3.org/2000/svg"
   xmlns:svg="http://www.w3.org/2000/svg"><defs
     id="defs163" /><sodipodi:namedview
     id="namedview161"
     pagecolor="#ffffff"
     bordercolor="#666666"
     borderopacity="1.0"
     inkscape:pageshadow="2"
     inkscape:pageopacity="0.0"
     inkscape:pagecheckerboard="0"
     inkscape:deskcolor="#d1d1d1"
     showgrid="true"
     inkscape:zoom="57.375"
     inkscape:cx="7.1023965"
     inkscape:cy="8"
     inkscape:current-layer="g155"><inkscape:grid
       type="xygrid"
       id="grid836" /></sodipodi:namedview><g
     fill="none"
     stroke="#00aad4"
     transform="translate(0 -1)"
     id="g157"><g
       stroke-linecap="round"
       id="g155"><path
         d="m 0.5,6.5 v -3 c 0,-0.5 0.5,-1 1,-1 h 3 c 0.5,0 1,0.5 1,1 h 10 v 3"
         stroke-linejoin="round"
         id="path145-8"
         style="fill:none;stroke:#00aad4;stroke-linecap:round"
         sodipodi:nodetypes="ccccccc" /><path
         d="M 15.5,8 V 6.5 h -15 v 8 H 6"
         stroke-linejoin="round"
         id="path147"
         sodipodi:nodetypes="ccccc" /><circle
         style="fill:none;stroke-width:1;stroke-linecap:round;stroke-linejoin:round;stroke-dasharray:none;stroke-dashoffset:1.49998"
         id="path346"
         cx="11.5"
         cy="12.5"
         r="4" /><g
         id="g530"><path
           style="fill:none;stroke:#00aad4;stroke-width:1px;stroke-linecap:round;stroke-linejoin:miter;stroke-opacity:1"
           d="m 10,11 3,3"
           id="path1469"
           sodipodi:nodetypes="cc" /><path
           style="fill:none;stroke:#00aad4;stroke-width:1px;stroke-linecap:round;stroke-linejoin:miter;stroke-opacity:1"
           d="m 13,11 -3,3"
           id="path522"
           sodipodi:nodetypes="cc" /></g></g></g></svg>
