<?xml version="1.0" encoding="UTF-8" standalone="no"?>
<svg
   height="33"
   width="33"
   version="1.1"
   id="svg4870"
   sodipodi:docname="bookmark1_300.svg"
   inkscape:export-filename="bookmark1_300.png"
   inkscape:export-xdpi="96"
   inkscape:export-ydpi="96"
   inkscape:version="1.2.2 (732a01da63, 2022-12-09)"
   xmlns:inkscape="http://www.inkscape.org/namespaces/inkscape"
   xmlns:sodipodi="http://sodipodi.sourceforge.net/DTD/sodipodi-0.dtd"
   xmlns="http://www.w3.org/2000/svg"
   xmlns:svg="http://www.w3.org/2000/svg">
  <defs
     id="defs4874" />
  <sodipodi:namedview
     id="namedview4872"
     pagecolor="#ffffff"
     bordercolor="#666666"
     borderopacity="1.0"
     inkscape:showpageshadow="2"
     inkscape:pageopacity="0.0"
     inkscape:pagecheckerboard="0"
     inkscape:deskcolor="#d1d1d1"
     showgrid="true"
     inkscape:zoom="27.818182"
     inkscape:cx="16.5"
     inkscape:cy="16.5"
     inkscape:current-layer="svg4870">
    <inkscape:grid
       type="xygrid"
       id="grid4993" />
  </sodipodi:namedview>
  <radialGradient
     id="a"
     cx="16.5"
     cy="16.5"
     gradientUnits="userSpaceOnUse"
     r="16.5">
    <stop
       offset="0"
       stop-color="#4881cc"
       id="stop4859" />
    <stop
       offset=".81818181"
       stop-color="#4781cc"
       id="stop4861" />
    <stop
       offset="1"
       stop-color="#569af2"
       id="stop4863" />
  </radialGradient>
  <circle
     cx="16.5"
     cy="16.5"
     fill="url(#a)"
     r="16.5"
     id="circle4866" />
  <path
     d="M 18.845982,27 H 16 V 10.097097 L 11.73419,12.714286 11.70313,9.857143 16.000005,7 h 2.845983 z"
     fill="#ffffff"
     id="path153"
     sodipodi:nodetypes="cccccccc"
     style="fill:#ffffff;stroke-width:1" />
</svg>
