<?xml version="1.0" encoding="UTF-8" standalone="no"?>
<svg
   height="64"
   width="64"
   version="1.1"
   id="svg621"
   sodipodi:docname="Time_10_64.svg"
   inkscape:export-filename="Time_10_64.png"
   inkscape:export-xdpi="96"
   inkscape:export-ydpi="96"
   inkscape:version="1.2.1 (9c6d41e410, 2022-07-14)"
   xmlns:inkscape="http://www.inkscape.org/namespaces/inkscape"
   xmlns:sodipodi="http://sodipodi.sourceforge.net/DTD/sodipodi-0.dtd"
   xmlns="http://www.w3.org/2000/svg"
   xmlns:svg="http://www.w3.org/2000/svg">
  <defs
     id="defs623" />
  <sodipodi:namedview
     id="namedview12"
     pagecolor="#ffffff"
     bordercolor="#666666"
     borderopacity="1.0"
     inkscape:pageshadow="2"
     inkscape:pageopacity="0.0"
     inkscape:pagecheckerboard="0"
     inkscape:deskcolor="#d1d1d1"
     showgrid="true"
     inkscape:zoom="14.34375"
     inkscape:cx="29.490196"
     inkscape:cy="32"
     inkscape:current-layer="svg621"
     inkscape:showpageshadow="2">
    <inkscape:grid
       type="xygrid"
       id="grid139" />
  </sodipodi:namedview>
  <path
     d="m 5.5,1.5 h 53 v 61 h -53 z"
     fill="#ffffff"
     stroke="#3771c8"
     stroke-linecap="round"
     id="path613"
     style="stroke-width:3;stroke-dasharray:none;stroke:#00aad4;stroke-opacity:1;fill:none" />
  <path
     d="M 4,-3.5000002e-5 H 59.999938 V 16.000017 H 4 Z"
     fill="#d40000"
     id="path615"
     style="stroke-width:2;fill:#00aad4;fill-opacity:1;stroke:none" />
  <path
     d="m 15.253112,45.090585 h 5.156244 v -17.79698 l -5.609368,1.124999 v -2.874997 l 5.578118,-1.124999 h 3.156247 v 20.671977 h 5.156244 v 2.656197 H 15.253112 Z"
     id="path617"
     style="stroke-width:2;fill:#00aad4;fill-opacity:1;stroke:none" />
  <path
     d="m 35.112466,24.418608 h 12.39061 v 2.656397 h -9.499989 v 5.718594 q 0.687499,-0.2344 1.374998,-0.3436 0.687499,-0.124 1.374999,-0.124 3.906245,0 6.187493,2.140598 2.281247,2.140598 2.281247,5.796794 0,3.765596 -2.343747,5.859393 -2.343748,2.078198 -6.609367,2.078198 -1.468748,0 -2.999997,-0.25 -1.515624,-0.249999 -3.140622,-0.749999 v -3.171996 q 1.406248,0.765599 2.906247,1.140598 1.499998,0.375 3.171872,0.375 2.703121,0 4.281245,-1.421799 1.578123,-1.421798 1.578123,-3.859395 0,-2.437398 -1.578123,-3.859396 -1.578124,-1.421798 -4.281245,-1.421798 -1.265624,0 -2.531247,0.281199 -1.249999,0.2812 -2.562497,0.874999 z"
     id="path619"
     style="stroke-width:2;fill:#00aad4;fill-opacity:1;stroke:none" />
</svg>
