<svg width="16" height="16" version="1.1" xmlns="http://www.w3.org/2000/svg">
 <radialGradient id="a" cx="12.1" cy="10.9" r="4.5" gradientTransform="matrix(0,1.037069,-1.037037,2e-8,21.403702,-2.448461)" gradientUnits="userSpaceOnUse">
  <stop stop-color="#f55" offset="0"/>
  <stop stop-color="#a00" offset="1"/>
 </radialGradient>
 <g stroke="#ffffff" stroke-linecap="round">
  <circle cx="11.5" cy="11.5" r="3.85" fill="url(#a)" stroke-linejoin="round" stroke-width="1.3"/>
  <path d="m13 10-3 3" fill="none"/>
  <path d="m13 13-3-3" fill="none"/>
 </g>
</svg>
