<?xml version="1.0" encoding="UTF-8" standalone="no"?>
<svg
   height="36"
   viewBox="0 0 9.5249997 9.5250005"
   width="36"
   version="1.1"
   id="svg543"
   sodipodi:docname="Cube_04_36.svg"
   inkscape:export-filename="Cube_04_36.png"
   inkscape:export-xdpi="96"
   inkscape:export-ydpi="96"
   inkscape:version="1.2.1 (9c6d41e410, 2022-07-14)"
   xmlns:inkscape="http://www.inkscape.org/namespaces/inkscape"
   xmlns:sodipodi="http://sodipodi.sourceforge.net/DTD/sodipodi-0.dtd"
   xmlns="http://www.w3.org/2000/svg"
   xmlns:svg="http://www.w3.org/2000/svg">
  <defs
     id="defs547" />
  <sodipodi:namedview
     id="namedview545"
     pagecolor="#ffffff"
     bordercolor="#666666"
     borderopacity="1.0"
     inkscape:showpageshadow="2"
     inkscape:pageopacity="0.0"
     inkscape:pagecheckerboard="0"
     inkscape:deskcolor="#d1d1d1"
     showgrid="true"
     inkscape:zoom="25.5"
     inkscape:cx="17.980392"
     inkscape:cy="18"
     inkscape:current-layer="svg543">
    <inkscape:grid
       type="xygrid"
       id="grid1152" />
  </sodipodi:namedview>
  <linearGradient
     id="a"
     gradientUnits="userSpaceOnUse"
     x1="3.869531"
     x2="4.684344"
     y1="1.686719"
     y2="3.734843">
    <stop
       offset="0"
       stop-color="#aeefff"
       id="stop502" />
    <stop
       offset="1"
       stop-color="#0cf"
       id="stop504" />
  </linearGradient>
  <g
     stroke="#165044"
     stroke-width=".205052"
     id="g541">
    <g
       fill-rule="evenodd"
       stroke-linejoin="round"
       id="g513">
      <path
         d="m4.6843435 3.710261-3.78806745-1.6835856 4.20896395-1.26268914 3.7880674 1.68358554z"
         fill="url(#a)"
         id="path507" />
      <path
         d="m.89627605 2.0266754v5.0507566l3.78806745 1.6835854v-5.0507564z"
         fill="#f0f000"
         id="path509" />
      <path
         d="m8.8933074 2.4475718v4.8403064l-4.2089639 1.4731392v-5.0507564z"
         fill="#00d455"
         id="path511" />
    </g>
    <g
       fill="none"
       id="g539">
      <path
         d="m4.6843435 5.3938443 4.2089639-1.4520925"
         id="path515" />
      <path
         d="m4.6843435 6.9828915 4.2089639-1.4570249"
         id="path517" />
      <path
         d="m6.1893406 3.2587618v4.9770998"
         id="path519" />
      <path
         d="m7.5130934 2.861636v4.9139654"
         id="path521" />
      <path
         d="m4.6843435 5.3938444-3.78806269-1.6835856"
         id="path523" />
      <path
         d="m4.6843435 6.9828915-3.78806745-1.6835856"
         id="path525" />
      <path
         d="m3.3355411 3.1107933v5.0507577"
         id="path527" />
      <path
         d="m2.2193744 2.6147191v5.0507583"
         id="path529" />
      <path
         d="m6.1893406 3.2587619-3.8199272-1.674032"
         id="path531" />
      <path
         d="m7.5130934 2.861636-3.8809861-1.6557086"
         id="path533" />
      <path
         d="m7.6306184 1.8863744-4.2950773 1.2244189"
         id="path535" />
      <path
         d="m6.367929 1.3251793-4.1485546 1.2895398"
         id="path537" />
    </g>
  </g>
</svg>
