<svg width="32" height="32" version="1.0" xmlns="http://www.w3.org/2000/svg">
 <defs>
  <linearGradient id="a" x1="-27.388893" x2="-9.6111107" y1="1036.8622" y2="1044.8622" gradientTransform="matrix(.95074343 0 0 1.0822249 33.596196 -1106.3581)" gradientUnits="userSpaceOnUse">
   <stop stop-color="#ffe496" offset="0"/>
   <stop stop-color="#ffcc40" offset="1"/>
  </linearGradient>
  <linearGradient id="b" x1="-28.000021" x2="-16.000021" y1="1031.3622" y2="1033.3622" gradientTransform="matrix(1.4074675,0,0,1.4418605,46.96472,-1475.6386)" gradientUnits="userSpaceOnUse">
   <stop stop-color="#fdbd17" offset="0"/>
   <stop stop-color="#e3a726" offset="1"/>
  </linearGradient>
 </defs>
 <rect x=".50000012" y="4.5" width="31" height="27" fill="#f9f9f9" stroke="#2a7efe" style="paint-order:normal"/>
 <path d="m2.2000003-9.9999999e-8h27.6c1.2 0 2.2 1.0000002 2.2 2.2000002v2.8h-32l4e-7 -2.8c2e-7 -1.2 1-2.2000002 2.1999996-2.2000002z" fill="#2a7efe" stroke-width="1.99999"/>
 <path d="m6.0000001 20-1.31e-4 -8.55785c-3.2e-5 -0.79634 0.630145-1.442006 1.407527-1.442006l5.6849959-1.44e-4c0.777344 0 1.407522 0.645522 1.40756 1.44186l4.8e-5 0.55814 10.092532 1.44e-4c0.77732 1e-5 1.407458 0.645548 1.407468 1.44186v6.557996z" fill="url(#b)" stroke-width="2"/>
 <path d="m24.609404 14.499999h-17.203934c-0.5000978 2e-6 -0.9054977 0.440515-0.9054696 0.983898v9.032212c-2.61e-5 0.54338 0.4053738 0.983893 0.9054696 0.983893h17.203934c0.500097 0 0.905499-0.440511 0.905471-0.983893v-9.032212c2.8e-5 -0.543385-0.405374-0.983898-0.905471-0.983898z" fill="url(#a)" stroke="#edb020" stroke-width=".999997"/>
</svg>
