<?xml version="1.0" encoding="UTF-8" standalone="no"?>
<svg
   height="16"
   viewBox="0 0 4.2333 4.2333"
   width="16"
   version="1.1"
   id="svg167"
   sodipodi:docname="menu_edit_select_line.svg"
   inkscape:export-filename="menu_edit_select_line.png"
   inkscape:export-xdpi="96"
   inkscape:export-ydpi="96"
   inkscape:version="1.2.1 (9c6d41e410, 2022-07-14)"
   xmlns:inkscape="http://www.inkscape.org/namespaces/inkscape"
   xmlns:sodipodi="http://sodipodi.sourceforge.net/DTD/sodipodi-0.dtd"
   xmlns="http://www.w3.org/2000/svg"
   xmlns:svg="http://www.w3.org/2000/svg">
  <defs
     id="defs171" />
  <sodipodi:namedview
     id="namedview169"
     pagecolor="#ffffff"
     bordercolor="#666666"
     borderopacity="1.0"
     inkscape:showpageshadow="2"
     inkscape:pageopacity="0.0"
     inkscape:pagecheckerboard="0"
     inkscape:deskcolor="#d1d1d1"
     showgrid="true"
     inkscape:zoom="57.375"
     inkscape:cx="7.2418301"
     inkscape:cy="8"
     inkscape:current-layer="svg167">
    <inkscape:grid
       type="xygrid"
       id="grid550" />
  </sodipodi:namedview>
  <path
     d="m 0.79374377,0.1322905 2.91039383,1.6e-7"
     stroke="#d4aa00"
     id="path151"
     style="fill:none;stroke-width:0.264581"
     sodipodi:nodetypes="cc" />
  <path
     d="m 0.79374377,2.7781029 2.91039383,2e-7"
     stroke="#d4aa00"
     id="path153"
     style="fill:none;stroke-width:0.264581"
     sodipodi:nodetypes="cc" />
  <path
     d="m 0.79374377,0.66145296 2.91039383,1.7e-7"
     stroke="#d4aa00"
     id="path155"
     style="fill:none;stroke-width:0.264581"
     sodipodi:nodetypes="cc" />
  <path
     d="m 0.79374389,2.2489404 2.91039371,2e-7"
     stroke="#2a7fff"
     id="path157"
     style="fill:none;stroke:#d4aa00;stroke-width:0.264581;stroke-opacity:1"
     sodipodi:nodetypes="cc" />
  <path
     d="m 0.79374377,1.7197779 2.91039383,2e-7"
     stroke="#2a7fff"
     id="path159"
     style="fill:none;stroke:#d4aa00;stroke-width:0.264581;stroke-opacity:1"
     sodipodi:nodetypes="cc" />
  <path
     d="m 0.79374389,1.1906154 2.91039371,2e-7"
     stroke="#2a7fff"
     id="path161"
     style="fill:none;stroke-width:0.264581"
     sodipodi:nodetypes="cc" />
  <path
     d="m 0.79374377,3.3072654 2.91039383,2e-7"
     stroke="#d4aa00"
     id="path163"
     style="fill:none;stroke-width:0.264581"
     sodipodi:nodetypes="cc" />
  <path
     d="m 0.79374367,3.8364279 2.91039383,2e-7"
     stroke="#d4aa00"
     id="path674"
     style="fill:none;stroke-width:0.264581"
     sodipodi:nodetypes="cc" />
</svg>
