<svg width="64" height="64" version="1.1" xmlns="http://www.w3.org/2000/svg">
 <defs>
  <radialGradient id="a" cx="12.1" cy="10.900001" r="4.5" gradientTransform="matrix(0,4.1481482,-4.1481478,8e-8,86.614815,-8.7925946)" gradientUnits="userSpaceOnUse">
   <stop stop-color="#ff7f2a" offset="0"/>
   <stop stop-color="#d45500" offset="1"/>
  </radialGradient>
 </defs>
 <g stroke="#ffffff" stroke-linecap="round">
  <circle transform="matrix(0,1,1,0,0,0)" cx="47" cy="47" r="15.4" fill="url(#a)" stroke-dashoffset="1.49998" stroke-linejoin="round" stroke-width="3.2"/>
  <path d="m47.999976 53.999832 6.999832-6.999542-6.999832-7.00012" fill="none" stroke-linejoin="round" stroke-width="3.9999"/>
  <path d="m54.999806 47.00025h-15.999616" fill="none" stroke-width="3.9999px"/>
 </g>
</svg>
