<?xml version="1.0" encoding="UTF-8" standalone="no"?>
<svg
   width="24"
   height="24"
   version="1.1"
   id="svg2"
   sodipodi:docname="items_load_150.svg"
   inkscape:export-filename="items_load_150.png"
   inkscape:export-xdpi="96"
   inkscape:export-ydpi="96"
   inkscape:version="1.3.2 (091e20e, 2023-11-25, custom)"
   xmlns:inkscape="http://www.inkscape.org/namespaces/inkscape"
   xmlns:sodipodi="http://sodipodi.sourceforge.net/DTD/sodipodi-0.dtd"
   xmlns="http://www.w3.org/2000/svg"
   xmlns:svg="http://www.w3.org/2000/svg">
  <defs
     id="defs2" />
  <sodipodi:namedview
     id="namedview2"
     pagecolor="#ffffff"
     bordercolor="#000000"
     borderopacity="0.25"
     inkscape:showpageshadow="2"
     inkscape:pageopacity="0.0"
     inkscape:pagecheckerboard="0"
     inkscape:deskcolor="#d1d1d1"
     showgrid="true"
     inkscape:current-layer="svg2">
    <inkscape:grid
       id="grid2"
       units="px"
       originx="0"
       originy="0"
       spacingx="0.5"
       spacingy="0.5"
       empcolor="#0099e5"
       empopacity="0.30196078"
       color="#0099e5"
       opacity="0.14901961"
       empspacing="2"
       dotted="false"
       gridanglex="30"
       gridanglez="30"
       visible="true" />
  </sodipodi:namedview>
  <path
     d="m2.4 1.6c-1 0-1.8 0.9263704-1.8 2v7.4h22.8v-5.6c0-0.8474134-0.957921-1.8-1.8-1.8h-12.6c0-1-0.8-2-1.8-2z"
     fill="#fff9e5"
     stroke="#c29c00"
     stroke-linejoin="round"
     stroke-width="1.2"
     id="path1" />
  <path
     d="m2.1 9.6h5.9c0-0.966845 0.573981-2 1.5-2h12c0.84208 0 1.9 1.152587 1.9 2v9.3c0 0.847415-0.65792 1.499555-1.5 1.499555h-19.8c-0.84208 0-1.5-0.65214-1.5-1.499555l-1e-8 -7.8c0-0.847414 0.65791999-1.5 1.5-1.5z"
     fill="#ffefb3"
     stroke="#c29c00"
     stroke-linejoin="round"
     stroke-width="1.2"
     id="path2" />
</svg>
