<?xml version="1.0" encoding="UTF-8" standalone="no"?>
<svg
   height="24"
   width="24"
   version="1.1"
   id="svg525"
   sodipodi:docname="Paste_02_24.svg"
   inkscape:export-filename="Paste_02_24.png"
   inkscape:export-xdpi="96"
   inkscape:export-ydpi="96"
   inkscape:version="1.2-beta (1b65182ce9, 2022-04-05)"
   xmlns:inkscape="http://www.inkscape.org/namespaces/inkscape"
   xmlns:sodipodi="http://sodipodi.sourceforge.net/DTD/sodipodi-0.dtd"
   xmlns="http://www.w3.org/2000/svg"
   xmlns:svg="http://www.w3.org/2000/svg">
  <defs
     id="defs529" />
  <sodipodi:namedview
     id="namedview527"
     pagecolor="#ffffff"
     bordercolor="#666666"
     borderopacity="1.0"
     inkscape:pageshadow="2"
     inkscape:pageopacity="0.0"
     inkscape:pagecheckerboard="0"
     inkscape:deskcolor="#d1d1d1"
     showgrid="true"
     inkscape:zoom="38.25"
     inkscape:cx="12"
     inkscape:cy="12"
     inkscape:current-layer="svg525">
    <inkscape:grid
       type="xygrid"
       id="grid4723" />
  </sodipodi:namedview>
  <linearGradient
     id="a"
     gradientTransform="matrix(0.63461541,0,0,0.38636361,3.923079,-29.59091)"
     gradientUnits="userSpaceOnUse"
     x1="5.399997"
     x2="5.399997"
     y1="4.333334"
     y2="11.666667">
    <stop
       offset="0"
       stop-color="#fc0"
       id="stop487" />
    <stop
       offset="1"
       stop-color="#fff6d5"
       id="stop489" />
  </linearGradient>
  <linearGradient
     id="b"
     gradientTransform="matrix(0.63461541,0,0,0.38636361,3.923079,-29.59091)"
     gradientUnits="userSpaceOnUse"
     x1="7.999997"
     x2="7.999997"
     y1="13.500001"
     y2="2.5">
    <stop
       offset="0"
       stop-color="#744b18"
       id="stop492" />
    <stop
       offset="1"
       stop-color="#ca7f26"
       id="stop494" />
  </linearGradient>
  <linearGradient
     id="c"
     gradientTransform="matrix(0.94358973,0,0,1.2473919,9.817948,30.660566)"
     gradientUnits="userSpaceOnUse"
     x1="3.666667"
     x2="3.666667"
     y1="3.722222"
     y2="12.277779">
    <stop
       offset="0"
       stop-color="#fff"
       id="stop497" />
    <stop
       offset="1"
       stop-color="#e0ebf4"
       id="stop499" />
  </linearGradient>
  <linearGradient
     id="d"
     gradientTransform="matrix(0.94358973,0,0,1.2473919,9.817948,30.660566)"
     gradientUnits="userSpaceOnUse"
     x1="7.277778"
     x2="7.277778"
     y1="13.500001"
     y2="2.5">
    <stop
       offset="0"
       stop-color="#3a7ab7"
       id="stop502" />
    <stop
       offset="1"
       stop-color="#75a5d3"
       id="stop504" />
  </linearGradient>
  <g
     id="g4358">
    <path
       d="m 14,13.25 h 5.5"
       id="path507"
       style="fill:none;stroke:#00aad4;stroke-width:1.5;stroke-opacity:1" />
    <path
       d="m 14,19.25 h 7"
       id="path509"
       style="fill:none;stroke:#00aad4;stroke-width:1.5;stroke-opacity:1" />
    <path
       d="m 14,16.25 h 7"
       id="path511"
       style="fill:none;stroke:#00aad4;stroke-width:1.5;stroke-opacity:1" />
    <path
       d="m 9.5,21.25 h -8 C 1.148423,21.25 0.75,20.991046 0.75,20.5 V 3.5 C 0.75,3.0089546 1.148423,2.75 1.5,2.75 h 4"
       id="path513"
       style="fill:none;stroke:#00aad4;stroke-width:1.5" />
    <path
       d="m 12.5,2.75 h 4 c 0.351577,0 0.75,0.2589546 0.75,0.75 v 4"
       id="path515"
       style="fill:none;stroke:#00aad4;stroke-width:1.5;stroke-opacity:1" />
    <rect
       fill="url(#a)"
       fill-rule="evenodd"
       height="4"
       rx="0.249999"
       ry="0.18181799"
       stroke="url(#b)"
       stroke-linecap="square"
       transform="scale(1,-1)"
       width="6.5"
       x="5.75"
       y="-4.750001"
       id="rect519"
       style="fill:none;stroke:#00aad4;stroke-width:1.5;stroke-opacity:1" />
    <path
       d="m 11.75,9.75 h 8.5 l 3,3 v 10.5 h -11.5 z"
       fill="url(#c)"
       fill-rule="evenodd"
       stroke="url(#d)"
       stroke-linecap="square"
       id="path521"
       style="fill:none;stroke:#00aad4;stroke-width:1.5;stroke-opacity:1" />
  </g>
</svg>
