<?xml version="1.0" encoding="UTF-8" standalone="no"?>
<svg
   height="32"
   width="32"
   version="1.1"
   id="svg10"
   sodipodi:docname="Cancel_01_32.svg"
   inkscape:export-filename="Cancel_01_32.png"
   inkscape:export-xdpi="96"
   inkscape:export-ydpi="96"
   inkscape:version="1.2-beta (1b65182ce9, 2022-04-05)"
   xmlns:inkscape="http://www.inkscape.org/namespaces/inkscape"
   xmlns:sodipodi="http://sodipodi.sourceforge.net/DTD/sodipodi-0.dtd"
   xmlns="http://www.w3.org/2000/svg"
   xmlns:svg="http://www.w3.org/2000/svg">
  <defs
     id="defs14" />
  <sodipodi:namedview
     id="namedview12"
     pagecolor="#ffffff"
     bordercolor="#666666"
     borderopacity="1.0"
     inkscape:pageshadow="2"
     inkscape:pageopacity="0.0"
     inkscape:pagecheckerboard="0"
     inkscape:deskcolor="#d1d1d1"
     showgrid="true"
     inkscape:zoom="28.6875"
     inkscape:cx="15.982571"
     inkscape:cy="16"
     inkscape:current-layer="svg10">
    <inkscape:grid
       type="xygrid"
       id="grid2152" />
  </sodipodi:namedview>
  <circle
     cx="16"
     cy="16"
     r="14"
     style="fill:#e60014;fill-rule:evenodd;stroke:#ab0000;stroke-width:2;stroke-linecap:round;stroke-linejoin:round;stroke-opacity:.980392"
     id="circle2" />
  <g
     fill="none"
     stroke="#fff"
     stroke-width="1.378185"
     transform="matrix(2.1767767 0 0 2.1767767 52.35164 -.504861)"
     id="g8">
    <path
       d="m-19.699756 4.5822483 6 5.9999997"
       id="path4" />
    <path
       d="m-19.699756 10.582248 6-5.9999997"
       id="path6" />
  </g>
</svg>
