<?xml version="1.0" encoding="UTF-8" standalone="no"?>
<svg
   width="48"
   height="48"
   version="1.1"
   viewBox="0 0 48 48"
   id="svg20"
   sodipodi:docname="TDateTimePicker_200.svg"
   inkscape:export-filename="TDateTimePicker_200.png"
   inkscape:export-xdpi="96"
   inkscape:export-ydpi="96"
   inkscape:version="1.3.2 (091e20e, 2023-11-25, custom)"
   xmlns:inkscape="http://www.inkscape.org/namespaces/inkscape"
   xmlns:sodipodi="http://sodipodi.sourceforge.net/DTD/sodipodi-0.dtd"
   xmlns="http://www.w3.org/2000/svg"
   xmlns:svg="http://www.w3.org/2000/svg">
  <defs
     id="defs20" />
  <sodipodi:namedview
     id="namedview20"
     pagecolor="#ffffff"
     bordercolor="#000000"
     borderopacity="0.25"
     inkscape:showpageshadow="2"
     inkscape:pageopacity="0.0"
     inkscape:pagecheckerboard="0"
     inkscape:deskcolor="#d1d1d1"
     showgrid="true"
     inkscape:current-layer="svg20">
    <inkscape:grid
       id="grid20"
       units="px"
       originx="0"
       originy="0"
       spacingx="0.5"
       spacingy="0.5"
       empcolor="#0099e5"
       empopacity="0.30196078"
       color="#0099e5"
       opacity="0.14901961"
       empspacing="2"
       dotted="false"
       gridanglex="30"
       gridanglez="30"
       visible="true" />
  </sodipodi:namedview>
  <rect
     x="5.5"
     y="5.4999828"
     width="37"
     height="37.000019"
     fill="#f9f9f9"
     stroke="#2a7efe"
     style="paint-order:normal"
     id="rect1" />
  <rect
     x="34.5"
     y="5.4999828"
     width="8"
     height="8.0000038"
     fill="#ffffff"
     stroke="#2a7efe"
     stroke-width="0.999997"
     style="paint-order:normal"
     id="rect2" />
  <rect
     x="5.5"
     y="5.4999828"
     width="28.999998"
     height="8"
     fill="#ffffff"
     stroke="#2a7efe"
     style="paint-order:normal"
     id="rect3" />
  <path
     d="M 36.3787,7.9697 38.5,10.091 40.621301,7.9697"
     fill="none"
     stroke="#808080"
     stroke-width="1.5"
     id="path3" />
  <path
     d="M 10,10 H 23.999999"
     fill="none"
     stroke="#b3b3b3"
     stroke-width="2px"
     id="path4" />
  <path
     d="m 10.5,22.5 h 28"
     fill="none"
     stroke="#96b5e7"
     stroke-linecap="square"
     id="path5" />
  <path
     d="m 10.5,34.5 h 28"
     fill="none"
     stroke="#96b5e7"
     stroke-linecap="square"
     id="path6" />
  <path
     d="m 10.5,30.5 h 28"
     fill="none"
     stroke="#96b5e7"
     stroke-linecap="square"
     id="path7" />
  <path
     d="m 10.5,26.5 h 28"
     fill="none"
     stroke="#96b5e7"
     stroke-linecap="square"
     id="path8" />
  <path
     d="m 10.5,18.5 v 20"
     fill="none"
     stroke="#96b5e7"
     stroke-linecap="square"
     id="path9" />
  <path
     d="m 10.5,18.5 h 28"
     fill="none"
     stroke="#96b5e7"
     stroke-linecap="square"
     id="path10" />
  <path
     d="m 14.5,18.5 v 20"
     fill="none"
     stroke="#96b5e7"
     stroke-linecap="square"
     id="path11" />
  <path
     d="m 18.5,18.5 v 20"
     fill="none"
     stroke="#96b5e7"
     stroke-linecap="square"
     id="path12" />
  <path
     d="m 22.5,18.5 v 20"
     fill="none"
     stroke="#96b5e7"
     stroke-linecap="square"
     id="path13" />
  <path
     d="m 26.5,18.5 v 20"
     fill="none"
     stroke="#96b5e7"
     stroke-linecap="square"
     id="path14" />
  <path
     d="m 30.5,18.5 v 20"
     fill="none"
     stroke="#96b5e7"
     stroke-linecap="square"
     id="path15" />
  <path
     d="m 34.5,18.5 v 20"
     fill="none"
     stroke="#96b5e7"
     stroke-linecap="square"
     id="path16" />
  <path
     d="m 26.5,22.5 h 4 v 4 h -4 z"
     fill="none"
     stroke="#ff0000"
     stroke-linecap="square"
     id="path17" />
  <path
     d="m 14.5,26.5 h 4 v 4 h -4 z"
     fill="none"
     stroke="#ff0000"
     stroke-linecap="square"
     id="path18" />
  <path
     d="m 38.5,18.5 v 20"
     fill="none"
     stroke="#96b5e7"
     stroke-linecap="square"
     id="path19" />
  <path
     d="m 10.5,38.5 h 28"
     fill="none"
     stroke="#96b5e7"
     stroke-linecap="square"
     id="path20" />
</svg>
