<?xml version="1.0" encoding="UTF-8" standalone="no"?>
<svg
   height="36"
   width="36"
   version="1.1"
   id="svg364"
   sodipodi:docname="Paste_02_36.svg"
   inkscape:export-filename="Paste_02_36.png"
   inkscape:export-xdpi="96"
   inkscape:export-ydpi="96"
   inkscape:version="1.2-beta (1b65182ce9, 2022-04-05)"
   xmlns:inkscape="http://www.inkscape.org/namespaces/inkscape"
   xmlns:sodipodi="http://sodipodi.sourceforge.net/DTD/sodipodi-0.dtd"
   xmlns="http://www.w3.org/2000/svg"
   xmlns:svg="http://www.w3.org/2000/svg">
  <defs
     id="defs368" />
  <sodipodi:namedview
     id="namedview366"
     pagecolor="#ffffff"
     bordercolor="#666666"
     borderopacity="1.0"
     inkscape:pageshadow="2"
     inkscape:pageopacity="0.0"
     inkscape:pagecheckerboard="0"
     inkscape:deskcolor="#d1d1d1"
     showgrid="true"
     inkscape:zoom="25.5"
     inkscape:cx="18"
     inkscape:cy="18"
     inkscape:current-layer="svg364">
    <inkscape:grid
       type="xygrid"
       id="grid5921" />
  </sodipodi:namedview>
  <linearGradient
     id="a"
     gradientTransform="matrix(.63461541 0 0 .38636361 3.923079 -29.59091)"
     gradientUnits="userSpaceOnUse"
     x1="5.399997"
     x2="5.399997"
     y1="4.333334"
     y2="11.666667">
    <stop
       offset="0"
       stop-color="#fc0"
       id="stop328" />
    <stop
       offset="1"
       stop-color="#fff6d5"
       id="stop330" />
  </linearGradient>
  <linearGradient
     id="b"
     gradientTransform="matrix(.63461541 0 0 .38636361 3.923079 -29.59091)"
     gradientUnits="userSpaceOnUse"
     x1="7.999997"
     x2="7.999997"
     y1="13.500001"
     y2="2.5">
    <stop
       offset="0"
       stop-color="#744b18"
       id="stop333" />
    <stop
       offset="1"
       stop-color="#ca7f26"
       id="stop335" />
  </linearGradient>
  <linearGradient
     id="c"
     gradientTransform="matrix(.94358973 0 0 1.2473919 9.817948 30.660566)"
     gradientUnits="userSpaceOnUse"
     x1="3.666667"
     x2="3.666667"
     y1="3.722222"
     y2="12.277779">
    <stop
       offset="0"
       stop-color="#fff"
       id="stop338" />
    <stop
       offset="1"
       stop-color="#e0ebf4"
       id="stop340" />
  </linearGradient>
  <linearGradient
     id="d"
     gradientTransform="matrix(.94358973 0 0 1.2473919 9.817948 30.660566)"
     gradientUnits="userSpaceOnUse"
     x1="7.277778"
     x2="7.277778"
     y1="13.500001"
     y2="2.5">
    <stop
       offset="0"
       stop-color="#3a7ab7"
       id="stop343" />
    <stop
       offset="1"
       stop-color="#75a5d3"
       id="stop345" />
  </linearGradient>
  <g
     id="g5556">
    <path
       d="m 21,18.875 h 8.25"
       stroke-width="2.25"
       id="path348"
       style="fill:none;stroke:#00aad4;stroke-opacity:1" />
    <path
       d="M 21,28.875 H 31.5"
       stroke-width="2.25"
       id="path350"
       style="fill:none;stroke:#00aad4;stroke-opacity:1" />
    <path
       d="M 21,23.875 H 31.5"
       stroke-width="2.25"
       id="path352"
       style="fill:none;stroke:#00aad4;stroke-opacity:1" />
    <path
       d="m 14.25,31.875 h -12 c -0.5273655,0 -1.125,-0.388431 -1.125,-1.125 V 5.25 c 0,-0.7365681 0.5976345,-1.125 1.125,-1.125 h 6"
       stroke-width="2.25"
       id="path354"
       style="fill:none;stroke:#00aad4" />
    <path
       d="m 18.75,4.125 h 6 c 0.527365,0 1.125,0.3884319 1.125,1.125 v 6"
       stroke-width="2.25"
       id="path356"
       style="fill:none;stroke:#00aad4;stroke-opacity:1" />
    <rect
       fill="url(#a)"
       fill-rule="evenodd"
       height="6.75001"
       rx=".413461"
       ry=".306819"
       stroke="url(#b)"
       stroke-linecap="square"
       stroke-width="2.24999"
       transform="scale(1 -1)"
       width="10.75"
       x="8.124995"
       y="-7.875011"
       id="rect360"
       style="fill:none;stroke:#00aad4;stroke-opacity:1" />
    <path
       d="m17.125 14.125h13.119565l4.630435 4.611111v16.138889h-17.75z"
       fill="url(#c)"
       fill-rule="evenodd"
       stroke="url(#d)"
       stroke-linecap="square"
       stroke-width="2.25"
       id="path362"
       style="fill:none;stroke:#00aad4;stroke-opacity:1" />
  </g>
</svg>
