<?xml version="1.0" encoding="UTF-8" standalone="no"?>
<svg
   height="36"
   width="36"
   version="1.1"
   id="svg862"
   sodipodi:docname="Grid_08_36.svg"
   inkscape:export-filename="Grid_08_36.png"
   inkscape:export-xdpi="96"
   inkscape:export-ydpi="96"
   inkscape:version="1.2-beta (1b65182ce9, 2022-04-05)"
   xmlns:inkscape="http://www.inkscape.org/namespaces/inkscape"
   xmlns:sodipodi="http://sodipodi.sourceforge.net/DTD/sodipodi-0.dtd"
   xmlns="http://www.w3.org/2000/svg"
   xmlns:svg="http://www.w3.org/2000/svg">
  <defs
     id="defs866" />
  <sodipodi:namedview
     id="namedview864"
     pagecolor="#ffffff"
     bordercolor="#666666"
     borderopacity="1.0"
     inkscape:pageshadow="2"
     inkscape:pageopacity="0.0"
     inkscape:pagecheckerboard="0"
     inkscape:deskcolor="#d1d1d1"
     showgrid="true"
     inkscape:zoom="25.5"
     inkscape:cx="18"
     inkscape:cy="18"
     inkscape:current-layer="svg862">
    <inkscape:grid
       type="xygrid"
       id="grid1184" />
  </sodipodi:namedview>
  <linearGradient
     id="a"
     gradientTransform="matrix(0 -1.4166667 -1.5 0 24 23.527778)"
     gradientUnits="userSpaceOnUse"
     x1="9"
     x2="6"
     y1="10"
     y2="10.5">
    <stop
       offset="0"
       stop-color="#72cef6"
       id="stop815" />
    <stop
       offset="1"
       stop-color="#d2f5f8"
       id="stop817" />
  </linearGradient>
  <linearGradient
     id="b"
     gradientTransform="matrix(0 -1.4166667 -1.5 0 24 23.527778)"
     gradientUnits="userSpaceOnUse"
     x1="10"
     x2="5"
     y1="12.5"
     y2="12.5">
    <stop
       offset="0"
       stop-color="#4674a8"
       id="stop820" />
    <stop
       offset="1"
       stop-color="#42a0ce"
       id="stop822" />
  </linearGradient>
  <linearGradient
     id="c"
     gradientUnits="userSpaceOnUse"
     x1="-8.75"
     x2="-13.75"
     y1="-1.75"
     y2="-6.75">
    <stop
       offset="0"
       stop-color="#009600"
       id="stop825" />
    <stop
       offset="1"
       stop-color="#6edb39"
       id="stop827" />
  </linearGradient>
  <path
     d="m-29.489361 6.510639h22.978724v22.978724h-22.978724z"
     style="fill:#fff;stroke:#999;stroke-width:1.02128;stroke-linecap:round;stroke-linejoin:round;stroke-dashoffset:1.49998"
     transform="matrix(-1.5 0 0 1.5 -8.999996 -8.999999)"
     id="path830" />
  <g
     fill="none"
     stroke="#b3b3b3"
     transform="matrix(-1.5 0 0 -1.5 36.000004 36.000001)"
     id="g842">
    <path
       d="m1 18.5h22"
       id="path832" />
    <path
       d="m6.5 23v-22"
       id="path834" />
    <path
       d="m23 5.5h-22"
       id="path836" />
    <path
       d="m18.5 23v-22"
       id="path838" />
    <path
       d="m12.5 23v-22"
       id="path840" />
  </g>
  <g
     stroke-linejoin="round"
     transform="matrix(1.5 0 0 -1.5 .000004 36.000002)"
     id="g848">
    <path
       d="m.5-16.5h23v7.666667h-23z"
       fill="none"
       opacity=".5"
       stroke="#fff"
       stroke-dashoffset="1.49998"
       transform="scale(1 -1)"
       id="path844" />
    <path
       d="m23.5 15.5h-23v-5.6666667h23z"
       fill="url(#a)"
       stroke="url(#b)"
       stroke-linecap="round"
       stroke-width=".999999"
       id="path846" />
  </g>
  <g
     transform="matrix(0 2.25 -2.25 0 47.312503 34.562502)"
     id="g860">
    <g
       stroke-linecap="round"
       id="g856">
      <circle
         cx="-11.25"
         cy="-4.25"
         fill="url(#c)"
         r="4"
         stroke="#008080"
         stroke-dashoffset="1.49998"
         stroke-linejoin="round"
         stroke-width=".5"
         transform="rotate(-90)"
         id="circle850" />
      <path
         d="m-4.25 13.25v-4"
         fill="none"
         stroke="#fff"
         id="path852" />
      <path
         d="m-2.25 11.25h-4"
         fill="none"
         stroke="#fff"
         id="path854" />
    </g>
    <circle
       cx="-4.25"
       cy="-11.25"
       r="4.5"
       style="opacity:.7;fill:none;stroke:#fff;stroke-width:.5;stroke-linejoin:round;stroke-dashoffset:1.49998"
       transform="scale(1 -1)"
       id="circle858" />
  </g>
</svg>
