<svg width="24" height="24" version="1.1" xmlns="http://www.w3.org/2000/svg">
 <defs>
  <radialGradient id="a" cx="12.1" cy="10.900001" r="4.5" gradientTransform="matrix(0,1.5892257,-1.5892254,2.9972888e-8,32.677103,-3.8750849)" gradientUnits="userSpaceOnUse">
   <stop stop-color="#ff7f2a" offset="0"/>
   <stop stop-color="#d45500" offset="1"/>
  </radialGradient>
 </defs>
 <g stroke="#fff" stroke-linecap="round">
  <g transform="matrix(1.4439173 0 0 1.4442714 .22742918 1.5550943)" fill="none" stroke-width="1.25031">
   <g stroke="#ffffff" stroke-linecap="round" stroke-linejoin="round">
    <circle transform="matrix(0 .69239063 .69256046 0 -.15750845 -1.0767327)" cx="17.5" cy="17.5" r="5.9000001" fill="url(#a)" stroke-dashoffset="1.49998" stroke-width="1.2"/>
    <path d="m11.28698 9.0599682 1.980622 1.9801358-1.980622 1.980136" fill="none" stroke-width="1.2506108"/>
   </g>
  </g>
 </g>
</svg>
