<?xml version="1.0" encoding="UTF-8" standalone="no"?>
<svg
   height="64"
   viewBox="0 0 16.933333 16.933335"
   width="64"
   version="1.1"
   id="svg27"
   sodipodi:docname="Box_03_64.svg"
   inkscape:version="1.2.2 (732a01da63, 2022-12-09)"
   xmlns:inkscape="http://www.inkscape.org/namespaces/inkscape"
   xmlns:sodipodi="http://sodipodi.sourceforge.net/DTD/sodipodi-0.dtd"
   xmlns="http://www.w3.org/2000/svg"
   xmlns:svg="http://www.w3.org/2000/svg">
  <defs
     id="defs31" />
  <sodipodi:namedview
     id="namedview29"
     pagecolor="#ffffff"
     bordercolor="#000000"
     borderopacity="0.25"
     inkscape:showpageshadow="2"
     inkscape:pageopacity="0.0"
     inkscape:pagecheckerboard="0"
     inkscape:deskcolor="#d1d1d1"
     showgrid="true"
     inkscape:zoom="14.21875"
     inkscape:cx="32"
     inkscape:cy="32"
     inkscape:current-layer="svg27">
    <inkscape:grid
       type="xygrid"
       id="grid260" />
  </sodipodi:namedview>
  <filter
     id="a"
     color-interpolation-filters="sRGB"
     height="1.5481179"
     width="1.2644428"
     x="-0.13222142"
     y="-0.27405897">
    <feGaussianBlur
       stdDeviation=".063698439"
       id="feGaussianBlur2" />
  </filter>
  <g
     stroke-linejoin="round"
     id="g25">
    <g
       stroke="#c87137"
       id="g13">
      <path
         d="m16.100479 5.7185912-.934931-1.7496616c-.167897-.3142087-.460056-.5291184-.801157-.5291185h-11.7954474c-.3411013.0000001-.6332593.214909-.8011571.5291185l-.9349316 1.7496616c-.14001842.2928362.073451.6315222.3980403.6315223h14.4715438c.324589-.0000004.538058-.3386862.39804-.6315223z"
         fill="#fc0"
         stroke-linecap="round"
         stroke-width=".529622"
         id="path5" />
      <g
         stroke-linecap="square"
         id="g11">
        <path
           d="m1.5176093 5.5562497h13.8981157c.401018 0 .72386.2529588.72386.6614589v7.5970164c0 .408498-.32284.737364-.72386.737364h-13.8981157c-.4010173 0-.7238607-.32886-.7238607-.737364v-7.5970164c0-.4084981.3228402-.6614589.7238607-.6614589z"
           fill="#fc0"
           stroke-width=".529164"
           id="path7" />
        <path
           d="m1.0583328 8.7312495h14.8166842"
           fill="#ccc"
           stroke-width=".529166"
           id="path9" />
      </g>
    </g>
    <path
       d="m10.31875 7.816828v2.358013a.67307684.673077 0 0 1 -.6730766.673076h-2.3580128a.67307684.673077 0 0 1 -.6730764-.673076v-2.358013a.67307684.673077 0 0 1 .6730764-.673077h2.3580128a.67307684.673077 0 0 1 .6730766.673077z"
       fill="#ececec"
       stroke="#808080"
       stroke-linecap="round"
       stroke-width=".529168"
       id="path15" />
    <g
       fill="none"
       id="g23">
      <path
         d="m5.5562511 3.8100006v-.8590607c0-.7530074.6566485-1.3634399 1.4666667-1.3634399h2.8875016c.8100166 0 1.4666656.6104325 1.4666656 1.3634399v.8590607"
         stroke="#808080"
         stroke-linecap="square"
         stroke-width="1.5875"
         id="path17" />
      <path
         d="m-3.65125.62618048v-.47021108c0-.27610263.2268424-.49992783.5066666-.4999278h.9975003c.2798241.00000002.5066665.22382517.5066665.4999278v.47021108"
         filter="url(#a)"
         stroke="#ececec"
         stroke-linecap="square"
         stroke-width=".225998"
         transform="matrix(2.8947376 0 0 2.7272736 16.125661 2.525569)"
         id="path19" />
      <path
         d="m7.6729174 9.2604165h1.5875"
         stroke="#808080"
         stroke-linecap="round"
         stroke-width=".529168"
         id="path21" />
    </g>
  </g>
</svg>
