<?xml version="1.0" encoding="UTF-8" standalone="no"?>
<svg
   height="64"
   viewBox="0 0 16.933 16.933"
   width="64"
   version="1.1"
   id="svg32"
   sodipodi:docname="Setup_08_64.svg"
   inkscape:version="1.2.2 (732a01da63, 2022-12-09)"
   xmlns:inkscape="http://www.inkscape.org/namespaces/inkscape"
   xmlns:sodipodi="http://sodipodi.sourceforge.net/DTD/sodipodi-0.dtd"
   xmlns="http://www.w3.org/2000/svg"
   xmlns:svg="http://www.w3.org/2000/svg">
  <defs
     id="defs36" />
  <sodipodi:namedview
     id="namedview34"
     pagecolor="#ffffff"
     bordercolor="#000000"
     borderopacity="0.25"
     inkscape:showpageshadow="2"
     inkscape:pageopacity="0.0"
     inkscape:pagecheckerboard="0"
     inkscape:deskcolor="#d1d1d1"
     showgrid="true"
     inkscape:zoom="14.21875"
     inkscape:cx="31.964835"
     inkscape:cy="32"
     inkscape:current-layer="svg32">
    <inkscape:grid
       type="xygrid"
       id="grid1145" />
  </sodipodi:namedview>
  <radialGradient
     id="a"
     cx="7.487501"
     cy="6.25"
     gradientTransform="matrix(-.00000014 1.2699751 -1.2699749 -.00000036 18.044229 .068789)"
     gradientUnits="userSpaceOnUse"
     r="2.25">
    <stop
       offset="0"
       stop-color="#fce99c"
       id="stop2" />
    <stop
       offset="1"
       stop-color="#fc0"
       id="stop4" />
  </radialGradient>
  <radialGradient
     id="b"
     cx="7.487501"
     cy="6.25"
     gradientTransform="matrix(-.0000001 1.2699751 -1.2699751 -.00000014 13.810978 .068788)"
     gradientUnits="userSpaceOnUse"
     r="2.25">
    <stop
       offset="0"
       stop-color="#a0c2f8"
       id="stop7" />
    <stop
       offset="1"
       stop-color="#2672e5"
       id="stop9" />
  </radialGradient>
  <radialGradient
     id="c"
     cx="7.487501"
     cy="6.25"
     gradientTransform="matrix(-.00000008 1.2699751 -1.2699751 -.00000022 15.927603 -4.164463)"
     gradientUnits="userSpaceOnUse"
     r="2.25">
    <stop
       offset="0"
       stop-color="#f99"
       id="stop12" />
    <stop
       offset="1"
       stop-color="#d40000"
       id="stop14" />
  </radialGradient>
  <radialGradient
     id="d"
     cx="5"
     cy="11"
     gradientTransform="matrix(-.00000003 1.4551795 -1.4551795 -.00000004 21.298538 -1.984334)"
     gradientUnits="userSpaceOnUse"
     r="8.000001">
    <stop
       offset="0"
       stop-color="#e5e5e5"
       id="stop17" />
    <stop
       offset="1"
       stop-color="#b3b3b3"
       id="stop19" />
  </radialGradient>
  <g
     stroke-width=".529155"
     id="g30">
    <path
       d="m16.667508 10.721582-1.586248-1.4014693-.000613-1.707137 1.587781-1.402061-.807348-1.9491149-2.114108.1313562-1.206695-1.2075622.13063-2.1126672-1.949324-.8074366-1.4014682 1.5862505-1.707138.0006126-1.40206-1.5877818-1.9491161.8073502.131324 2.1141379-1.2075612 1.2066945-2.1126376-.13066-.807435 1.9493228 1.5862497 1.401514.0006128 1.707136-1.5877812 1.4020183.8073497 1.949115 2.1141392-.131325 1.2066945 1.207562-.1306613 2.112638 1.9493235.807434 1.401469-1.586248 1.707136-.000616 1.4020622 1.587784 1.949115-.807349-.131323-2.114142 1.207561-1.206695 2.112636.130664z"
       fill="url(#d)"
       stroke="#b3b3b3"
       stroke-linejoin="round"
       id="path22" />
    <circle
       cx="8.466498"
       cy="5.820718"
       fill="url(#c)"
       r="2.381204"
       stroke="#a00"
       id="circle24" />
    <circle
       cx="6.349875"
       cy="10.05397"
       fill="url(#b)"
       r="2.381204"
       stroke="#0055d4"
       id="circle26" />
    <circle
       cx="10.583125"
       cy="10.05397"
       fill="url(#a)"
       r="2.381204"
       stroke="#d4aa00"
       id="circle28" />
  </g>
</svg>
