<?xml version="1.0" encoding="UTF-8" standalone="no"?>
<svg
   width="48"
   height="48"
   version="1.1"
   viewBox="0 0 48 48"
   id="svg7"
   sodipodi:docname="tchartlistbox_200.svg"
   inkscape:version="1.3.2 (091e20e, 2023-11-25, custom)"
   xmlns:inkscape="http://www.inkscape.org/namespaces/inkscape"
   xmlns:sodipodi="http://sodipodi.sourceforge.net/DTD/sodipodi-0.dtd"
   xmlns="http://www.w3.org/2000/svg"
   xmlns:svg="http://www.w3.org/2000/svg">
  <defs
     id="defs7" />
  <sodipodi:namedview
     id="namedview7"
     pagecolor="#ffffff"
     bordercolor="#000000"
     borderopacity="0.25"
     inkscape:showpageshadow="2"
     inkscape:pageopacity="0.0"
     inkscape:pagecheckerboard="0"
     inkscape:deskcolor="#d1d1d1"
     showgrid="true"
     inkscape:current-layer="svg7">
    <inkscape:grid
       id="grid7"
       units="px"
       originx="0"
       originy="0"
       spacingx="0.5"
       spacingy="0.5"
       empcolor="#0099e5"
       empopacity="0.30196078"
       color="#0099e5"
       opacity="0.14901961"
       empspacing="2"
       dotted="false"
       gridanglex="30"
       gridanglez="30"
       visible="true" />
  </sodipodi:namedview>
  <rect
     x="2.5"
     y="2.5"
     width="43"
     height="43"
     fill="#ffffff"
     fill-rule="evenodd"
     stroke="#2a7efe"
     stroke-linecap="square"
     stroke-linejoin="round"
     style="paint-order:normal"
     id="rect1" />
  <path
     d="m7.1 26.4 5.9-10.4 4 17 7-5 6.9 12.9"
     fill="none"
     stroke="#2a7efe"
     stroke-linecap="round"
     stroke-linejoin="round"
     stroke-width="2.2"
     id="path1" />
  <path
     d="m7 10v31h31"
     fill="none"
     stroke="#4d4d4d"
     stroke-linecap="round"
     stroke-linejoin="round"
     stroke-width="2"
     id="path2" />
  <rect
     x="22.5"
     y="2.5"
     width="23"
     height="23"
     fill="#f9f9f9"
     stroke="#2a7efe"
     stroke-linejoin="round"
     style="paint-order:normal"
     id="rect2" />
  <rect
     x="38.5"
     y="2.5"
     width="6.9999981"
     height="23"
     fill="#e6e6e6"
     stroke="#2a7efe"
     stroke-linejoin="round"
     style="paint-order:normal"
     id="rect3" />
  <path
     d="m42.000002 8.000034v10"
     fill="#e6e6e6"
     stroke="#2a7efe"
     stroke-linecap="round"
     stroke-linejoin="round"
     stroke-width="2"
     id="path3" />
  <path
     d="m26 19h6.923076"
     fill="none"
     stroke="#b3b3b3"
     stroke-width="2px"
     id="path4" />
  <path
     d="m26 14.999998h8.307692"
     fill="none"
     stroke="#b3b3b3"
     stroke-width="2px"
     id="path5" />
  <path
     d="m26 10.999998h7.615386"
     fill="none"
     stroke="#b3b3b3"
     stroke-width="2px"
     id="path6" />
  <path
     d="m26 6.999998h9"
     fill="none"
     stroke="#b3b3b3"
     stroke-width="2px"
     id="path7" />
</svg>
