<?xml version="1.0" encoding="UTF-8" standalone="no"?>
<svg
   height="24"
   viewBox="0 0 6.3499998 6.3500003"
   width="24"
   version="1.1"
   id="svg171"
   sodipodi:docname="Font_09_24.svg"
   inkscape:export-filename="Font_09_24.png"
   inkscape:export-xdpi="96"
   inkscape:export-ydpi="96"
   inkscape:version="1.2 (dc2aedaf03, 2022-05-15)"
   xmlns:inkscape="http://www.inkscape.org/namespaces/inkscape"
   xmlns:sodipodi="http://sodipodi.sourceforge.net/DTD/sodipodi-0.dtd"
   xmlns="http://www.w3.org/2000/svg"
   xmlns:svg="http://www.w3.org/2000/svg">
  <defs
     id="defs175">
    <linearGradient
       id="a"
       gradientUnits="userSpaceOnUse"
       x1="20.98311"
       x2="13.516894"
       y1="-3.0168898"
       y2="-10.483106"
       gradientTransform="matrix(0.9877828,0,0,0.9877828,0.46074497,24.167533)">
      <stop
         offset="0"
         stop-color="#009600"
         id="stop146" />
      <stop
         offset="1"
         stop-color="#6edb39"
         id="stop148" />
    </linearGradient>
    <filter
       inkscape:collect="always"
       style="color-interpolation-filters:sRGB"
       id="filter4100"
       x="-0.077519639"
       y="-0.072638999"
       width="1.1550393"
       height="1.145278">
      <feGaussianBlur
         inkscape:collect="always"
         stdDeviation="0.19217504"
         id="feGaussianBlur4102" />
    </filter>
  </defs>
  <sodipodi:namedview
     id="namedview173"
     pagecolor="#ffffff"
     bordercolor="#666666"
     borderopacity="1.0"
     inkscape:showpageshadow="2"
     inkscape:pageopacity="0.0"
     inkscape:pagecheckerboard="0"
     inkscape:deskcolor="#d1d1d1"
     showgrid="true"
     inkscape:zoom="38.25"
     inkscape:cx="10.313725"
     inkscape:cy="12"
     inkscape:current-layer="svg171">
    <inkscape:grid
       type="xygrid"
       id="grid1259" />
  </sodipodi:namedview>
  <g
     id="g4106">
    <path
       id="path3732"
       style="fill:#ffffff;stroke:none;filter:url(#filter4100)"
       d="M 2.5802043,0 A 0.39652402,0.39652402 0 0 0 2.2071004,0.26354981 L 0.22272542,5.8203166 A 0.39652402,0.39652402 0 0 0 0.59582927,6.3494833 H 1.4748454 A 0.39652402,0.39652402 0 0 0 1.8474325,6.0859335 l 0.4728393,-1.324467 h 1.7089397 l 0.4728393,1.324467 A 0.39652402,0.39652402 0 0 0 4.8751547,6.3494833 H 5.753654 A 0.39652402,0.39652402 0 0 0 6.1267579,5.8203166 L 4.1423828,0.26354981 A 0.39652402,0.39652402 0 0 0 3.769279,0 Z M 3.1760336,2.3693644 3.4628378,3.1760336 H 2.8866455 Z" />
    <path
       d="M 2.5796876,0.39687507 0.59531252,5.953125 H 1.4741074 l 0.5669643,-1.5875 h 2.267857 l 0.5669643,1.5875 H 5.7546875 L 3.7703126,0.39687507 Z M 3.1750001,1.190625 4.0254465,3.571875 H 2.3245537 Z"
       stroke="#ffffff"
       stroke-width="0.198438"
       id="path723"
       sodipodi:nodetypes="ccccccccccccc"
       style="stroke:none" />
  </g>
  <g
     id="g3282"
     transform="scale(0.26458334)">
    <circle
       cx="17.5"
       cy="17.5"
       fill="url(#a)"
       stroke-dashoffset="1.49998"
       stroke-linejoin="round"
       stroke-width="1.05405"
       transform="matrix(0,1,1,0,0,0)"
       id="circle151"
       style="fill:url(#a);stroke:#ffffff;stroke-width:1.2;stroke-linecap:round;stroke-dasharray:none"
       r="5.9000001" />
    <g
       id="g2739">
      <path
         d="m 17.5,15 v 5"
         id="path153"
         style="fill:none;stroke:#ffffff;stroke-width:2;stroke-linecap:round" />
      <path
         d="M 20,17.5 H 15"
         id="path155"
         style="fill:none;stroke:#ffffff;stroke-width:2;stroke-linecap:round" />
    </g>
  </g>
</svg>
