<?xml version="1.0" encoding="UTF-8" standalone="no"?>
<svg
   height="32"
   width="32"
   version="1.1"
   id="svg18"
   sodipodi:docname="File_06_32.svg"
   inkscape:export-filename="File_06_32.png"
   inkscape:export-xdpi="96"
   inkscape:export-ydpi="96"
   inkscape:version="1.2-beta (1b65182ce9, 2022-04-05)"
   xml:space="preserve"
   xmlns:inkscape="http://www.inkscape.org/namespaces/inkscape"
   xmlns:sodipodi="http://sodipodi.sourceforge.net/DTD/sodipodi-0.dtd"
   xmlns="http://www.w3.org/2000/svg"
   xmlns:svg="http://www.w3.org/2000/svg"><defs
     id="defs22" /><sodipodi:namedview
     id="namedview20"
     pagecolor="#ffffff"
     bordercolor="#666666"
     borderopacity="1.0"
     inkscape:pageshadow="2"
     inkscape:pageopacity="0.0"
     inkscape:pagecheckerboard="0"
     inkscape:deskcolor="#d1d1d1"
     showgrid="true"
     inkscape:zoom="28.6875"
     inkscape:cx="14.727669"
     inkscape:cy="16"
     inkscape:current-layer="svg18"><inkscape:grid
       type="xygrid"
       id="grid1022" /></sodipodi:namedview><path
     d="M 14.5,31 H 5 V 1 H 19.5 L 27,8.5 v 3.964251"
     stroke-linejoin="round"
     stroke-width="2"
     id="path2"
     style="fill:none;stroke:#00aad4;stroke-linecap:round" /><path
     d="m 19,1 v 8 h 8"
     stroke-linejoin="round"
     stroke-width="2"
     id="path4"
     style="fill:none;stroke:#00aad4;stroke-linecap:round" /><g
     id="g1474"
     transform="matrix(2,0,0,2,0,-2)"
     style="fill:none;stroke:#00aad4;stroke-linecap:round"><circle
       style="fill:none;stroke-width:1;stroke-linecap:round;stroke-linejoin:round;stroke-dasharray:none;stroke-dashoffset:1.49998"
       id="path346"
       cx="11.5"
       cy="12.5"
       r="4" /><g
       id="g530"><path
         style="fill:none;stroke:#00aad4;stroke-width:1px;stroke-linecap:round;stroke-linejoin:miter;stroke-opacity:1"
         d="m 10,11 3,3"
         id="path1469"
         sodipodi:nodetypes="cc" /><path
         style="fill:none;stroke:#00aad4;stroke-width:1px;stroke-linecap:round;stroke-linejoin:miter;stroke-opacity:1"
         d="m 13,11 -3,3"
         id="path522"
         sodipodi:nodetypes="cc" /></g></g></svg>
