<svg width="36" height="36" version="1.1" xmlns="http://www.w3.org/2000/svg">
 <g>
  <circle cx="26" cy="27.5" r="3.4974027" fill="#ffffff"/>
  <path d="m30.375109 31.000091c-1.083939 1.425623-2.786951 2.250023-4.500046 2.250023-3.099882 0-5.625057-2.480961-5.625057-5.625057 0-3.180925 2.538627-5.625057 5.625057-5.625057h7.124937m-4.5-4.5 4.5 4.5-4.5 4.5" fill="none" stroke="#ffffff" stroke-linecap="round" stroke-linejoin="round" stroke-miterlimit="5.6" stroke-width="5.5"/>
  <path d="m30.374894 31.000091c-1.083939 1.425623-2.786951 2.250023-4.500046 2.250023-3.099882 0-5.625057-2.480961-5.625057-5.625057 0-3.180925 2.538627-5.625057 5.625057-5.625057h7.125152m-4.500487-4.499818 4.500487 4.499818-4.500045 4.500046" fill="none" stroke="#fa0302" stroke-linecap="round" stroke-linejoin="round" stroke-miterlimit="5.6" stroke-width="2.25002"/>
 </g>
</svg>
