<?xml version="1.0" encoding="UTF-8" standalone="no"?>
<svg
   height="64"
   width="64"
   version="1.1"
   id="svg1034"
   sodipodi:docname="Undo_01_64.svg"
   inkscape:export-filename="Undo_01_64.png"
   inkscape:export-xdpi="96"
   inkscape:export-ydpi="96"
   inkscape:version="1.2-beta (1b65182ce9, 2022-04-05)"
   xmlns:inkscape="http://www.inkscape.org/namespaces/inkscape"
   xmlns:sodipodi="http://sodipodi.sourceforge.net/DTD/sodipodi-0.dtd"
   xmlns="http://www.w3.org/2000/svg"
   xmlns:svg="http://www.w3.org/2000/svg">
  <defs
     id="defs1036" />
  <sodipodi:namedview
     id="namedview12"
     pagecolor="#ffffff"
     bordercolor="#666666"
     borderopacity="1.0"
     inkscape:pageshadow="2"
     inkscape:pageopacity="0.0"
     inkscape:pagecheckerboard="0"
     inkscape:deskcolor="#d1d1d1"
     showgrid="true"
     inkscape:zoom="14.34375"
     inkscape:cx="32"
     inkscape:cy="32"
     inkscape:current-layer="svg1034">
    <inkscape:grid
       type="xygrid"
       id="grid139" />
  </sodipodi:namedview>
  <g
     fill="none"
     stroke="#d40000"
     stroke-linecap="round"
     transform="matrix(1.9999963,0,0,1.9999963,-12.000059,-10.107438)"
     id="g1032">
    <path
       d="m 14.500042,10.683411 h 13.015286 c 4.615497,0 8.357096,3.747521 8.357096,8.370324 0,4.622803 -3.741599,8.370325 -8.357096,8.370325 H 9.485783"
       stroke-width="3.25935"
       id="path1028" />
    <path
       d="m 14.658419,20.973426 -6.526755,6.526754 6.526755,6.526754"
       stroke-linejoin="round"
       stroke-width="3.26338"
       id="path1030" />
  </g>
</svg>
