<?xml version="1.0" encoding="UTF-8" standalone="no"?>
<svg
   height="16"
   width="16"
   version="1.1"
   id="svg16"
   sodipodi:docname="Zoom_04_16.svg"
   inkscape:export-filename="Zoom_04_16.png"
   inkscape:export-xdpi="96"
   inkscape:export-ydpi="96"
   inkscape:version="1.2.1 (9c6d41e410, 2022-07-14)"
   xmlns:inkscape="http://www.inkscape.org/namespaces/inkscape"
   xmlns:sodipodi="http://sodipodi.sourceforge.net/DTD/sodipodi-0.dtd"
   xmlns="http://www.w3.org/2000/svg"
   xmlns:svg="http://www.w3.org/2000/svg">
  <defs
     id="defs20" />
  <sodipodi:namedview
     id="namedview18"
     pagecolor="#ffffff"
     bordercolor="#666666"
     borderopacity="1.0"
     inkscape:showpageshadow="2"
     inkscape:pageopacity="0.0"
     inkscape:pagecheckerboard="0"
     inkscape:deskcolor="#d1d1d1"
     showgrid="true"
     inkscape:zoom="57.375"
     inkscape:cx="7.9912854"
     inkscape:cy="8"
     inkscape:current-layer="svg16">
    <inkscape:grid
       type="xygrid"
       id="grid846" />
  </sodipodi:namedview>
  <g
     fill="none"
     stroke="#00aad4"
     stroke-linecap="round"
     stroke-linejoin="round"
     id="g14">
    <g
       transform="matrix(-1 0 0 -1 1 13.5)"
       id="g8">
      <path
         d="m-3.5 1v9"
         id="path2" />
      <path
         d="m-5 2.5 1.5-1.5 1.5 1.5"
         id="path4" />
      <path
         d="m-5 8.5000002 1.5 1.4999998 1.5-1.4999998"
         id="path6" />
    </g>
    <path
       d="m4.5.5h5l4 4v11h-9"
       id="path10" />
    <path
       d="m9.5.5v4h4"
       id="path12" />
  </g>
</svg>
