<?xml version="1.0" encoding="UTF-8" standalone="no"?>
<svg
   height="24"
   width="24"
   version="1.1"
   id="svg740"
   sodipodi:docname="MapMarker_01_24.svg"
   inkscape:export-filename="MapMarker_01_24.png"
   inkscape:export-xdpi="96"
   inkscape:export-ydpi="96"
   inkscape:version="1.2 (dc2aedaf03, 2022-05-15)"
   xmlns:inkscape="http://www.inkscape.org/namespaces/inkscape"
   xmlns:sodipodi="http://sodipodi.sourceforge.net/DTD/sodipodi-0.dtd"
   xmlns="http://www.w3.org/2000/svg"
   xmlns:svg="http://www.w3.org/2000/svg">
  <defs
     id="defs744" />
  <sodipodi:namedview
     id="namedview742"
     pagecolor="#ffffff"
     bordercolor="#666666"
     borderopacity="1.0"
     inkscape:pageshadow="2"
     inkscape:pageopacity="0.0"
     inkscape:pagecheckerboard="0"
     inkscape:deskcolor="#d1d1d1"
     showgrid="true"
     inkscape:zoom="38.25"
     inkscape:cx="11.986928"
     inkscape:cy="12"
     inkscape:current-layer="svg740"
     inkscape:showpageshadow="2">
    <inkscape:grid
       type="xygrid"
       id="grid3996" />
  </sodipodi:namedview>
  <g
     id="g2195"
     transform="matrix(1.4999999,0,0,1.4999999,1.1e-6,0.50000005)">
    <path
       id="path1064"
       style="fill:none;stroke:#00aad4;stroke-width:1.25;stroke-linecap:round;stroke-linejoin:round;stroke-dashoffset:1.49998"
       d="M 9.875,5.5 A 1.875,1.875 0 0 1 8,7.375 1.875,1.875 0 0 1 6.125,5.5 1.875,1.875 0 0 1 8,3.625 1.875,1.875 0 0 1 9.875,5.5 Z" />
    <path
       style="fill:none;stroke:#00aad4;stroke-width:1.25;stroke-linecap:round;stroke-linejoin:round;stroke-dasharray:none;stroke-opacity:1"
       d="M 8,15 4.1223691,7.5268905 C 3.8068903,6.9301227 3.6249996,6.2363029 3.6249996,5.5000002 3.6249995,3.0837543 5.5837538,1.1250001 7.9999997,1.125 10.416246,1.1249999 12.375,3.0837543 12.375,5.5000002 c 0,0.7245906 -0.17615,1.4080392 -0.489756,2.0123309 z"
       id="path2134"
       sodipodi:nodetypes="ccssscc" />
  </g>
</svg>
