<?xml version="1.0" encoding="UTF-8" standalone="no"?>
<svg
   width="32"
   height="32"
   version="1.1"
   viewBox="0 0 32 32"
   id="svg8"
   sodipodi:docname="add_icon_from_finder_200.svg"
   inkscape:version="1.3.2 (091e20e, 2023-11-25, custom)"
   xmlns:inkscape="http://www.inkscape.org/namespaces/inkscape"
   xmlns:sodipodi="http://sodipodi.sourceforge.net/DTD/sodipodi-0.dtd"
   xmlns="http://www.w3.org/2000/svg"
   xmlns:svg="http://www.w3.org/2000/svg">
  <sodipodi:namedview
     id="namedview8"
     pagecolor="#ffffff"
     bordercolor="#000000"
     borderopacity="0.25"
     inkscape:showpageshadow="2"
     inkscape:pageopacity="0.0"
     inkscape:pagecheckerboard="0"
     inkscape:deskcolor="#d1d1d1"
     showgrid="true"
     inkscape:current-layer="svg8">
    <inkscape:grid
       id="grid8"
       units="px"
       originx="0"
       originy="0"
       spacingx="0.5"
       spacingy="0.5"
       empcolor="#0099e5"
       empopacity="0.30196078"
       color="#0099e5"
       opacity="0.14901961"
       empspacing="2"
       dotted="false"
       gridanglex="30"
       gridanglez="30"
       visible="true" />
  </sodipodi:namedview>
  <defs
     id="defs7">
    <linearGradient
       id="b"
       x1="7.9999995"
       x2="7.9999995"
       y1="1.4999998"
       y2="11.238683"
       gradientTransform="matrix(1.6 0 0 1.2307672 -.7999996 4.15395)"
       gradientUnits="userSpaceOnUse">
      <stop
         stop-color="#80b4fe"
         offset="0"
         id="stop1" />
      <stop
         stop-color="#e7f6fe"
         offset="1"
         id="stop2" />
    </linearGradient>
    <radialGradient
       id="c"
       cx="16"
       cy="10"
       r="2.5999999"
       gradientTransform="matrix(1.3999999,0,0,1.4000001,-5.3999998,-1.999836)"
       gradientUnits="userSpaceOnUse">
      <stop
         stop-color="#ffffff"
         offset="0"
         id="stop3" />
      <stop
         stop-color="#ffe680"
         offset=".57692301"
         id="stop4" />
      <stop
         stop-color="#ffcc00"
         offset="1"
         id="stop5" />
    </radialGradient>
    <radialGradient
       id="a"
       cx="-11.5"
       cy="8.5"
       r="3.5"
       gradientTransform="matrix(0,1.8092308,-1.8092308,0,35.021534,40.449226)"
       gradientUnits="userSpaceOnUse">
      <stop
         stop-color="#fff"
         offset="0"
         id="stop6" />
      <stop
         stop-color="#d5e5ff"
         offset="1"
         id="stop7" />
    </radialGradient>
  </defs>
  <rect
     y="6"
     width="24"
     height="15.999972"
     fill="url(#b)"
     stroke-width="1.99999"
     id="rect7" />
  <path
     d="m0 22 5.6194546-6.666548c1.6378768-1.943038 4.3865424-1.681918 6.0503144 0l4.615946 4.666552 3.02007-1.999998c0.920381-0.609438 1.534589-0.532638 2.436555 0l2.25766 1.333438v2.666556z"
     fill="#01a901"
     stroke-width="1.99999"
     id="path7" />
  <ellipse
     cx="17"
     cy="12"
     rx="3.4999998"
     ry="3.5"
     fill="url(#c)"
     stroke-width="1.99999"
     id="ellipse7" />
  <path
     d="m23.784179 23.784179 6.761976 6.761976"
     fill="none"
     stroke="#a05a2c"
     stroke-linecap="round"
     stroke-width="2.90769"
     id="path8" />
  <circle
     cx="21"
     cy="21"
     r="5.6538463"
     fill="url(#a)"
     fill-rule="evenodd"
     stroke="#dd8703"
     stroke-linecap="round"
     stroke-linejoin="round"
     stroke-width="1.61538"
     id="circle8" />
</svg>
