<svg width="32" height="32" version="1.0" xmlns="http://www.w3.org/2000/svg">
 <defs>
  <radialGradient id="b" cx="8.8011074" cy="1036.9969" r="9" gradientTransform="matrix(.31850462 1.4333386 -1.4333273 .31851611 1496.4693 -330.99859)" gradientUnits="userSpaceOnUse">
   <stop stop-color="#ccc" offset="0"/>
   <stop stop-color="#fff" offset="1"/>
  </radialGradient>
 </defs>
 <circle cx="16.5" cy="15.5" r="12.9" fill="url(#b)" stroke="#808080" stroke-width="1.2"/>
 <path d="m16 7h1v8h4v1h-5z" fill-rule="evenodd" stroke-width="1.33333"/>
 <path d="m8 10h1v1h-1z" fill="#2a7fff" fill-rule="evenodd" stroke-width="1.33333"/>
 <path d="m11 7h1v1h-1z" fill="#2a7fff" fill-rule="evenodd" stroke-width="1.33333"/>
 <path d="m16 5h1v2h-1" fill="#2a7fff" fill-rule="evenodd" stroke-width="1.33333"/>
 <path d="m21 7h1v1h-1z" fill="#2a7fff" fill-rule="evenodd" stroke-width="1.33333"/>
 <path d="m24 10h1v1h-1z" fill="#2a7fff" fill-rule="evenodd" stroke-width="1.33333"/>
 <path d="m24 20h1v1h-1z" fill="#2a7fff" fill-rule="evenodd" stroke-width="1.33333"/>
 <path d="m25 15h2v1h-2z" fill="#2a7fff" fill-rule="evenodd" stroke-width="1.33333"/>
 <path d="m21 23h1v1h-1z" fill="#2a7fff" fill-rule="evenodd" stroke-width="1.33333"/>
 <path d="m16 24h1v2h-1z" fill="#2a7fff" fill-rule="evenodd" stroke-width="1.33333"/>
 <path d="m11 23h1v1h-1z" fill="#2a7fff" fill-rule="evenodd" stroke-width="1.33333"/>
 <path d="m8 20h1v1h-1z" fill="#2a7fff" fill-rule="evenodd" stroke-width="1.33333"/>
 <path d="m6 15h2v1h-2z" fill="#2a7fff" fill-rule="evenodd" stroke-width="1.33333"/>
</svg>
