<?xml version="1.0" encoding="UTF-8" standalone="no"?>
<svg
   width="24"
   height="24"
   version="1.1"
   id="svg5"
   sodipodi:docname="Folder_21_24.svg"
   inkscape:export-filename="Folder_21_24.png"
   inkscape:export-xdpi="96"
   inkscape:export-ydpi="96"
   inkscape:version="1.3.2 (091e20e, 2023-11-25, custom)"
   xmlns:inkscape="http://www.inkscape.org/namespaces/inkscape"
   xmlns:sodipodi="http://sodipodi.sourceforge.net/DTD/sodipodi-0.dtd"
   xmlns="http://www.w3.org/2000/svg"
   xmlns:svg="http://www.w3.org/2000/svg">
  <sodipodi:namedview
     id="namedview5"
     pagecolor="#ffffff"
     bordercolor="#000000"
     borderopacity="0.25"
     inkscape:showpageshadow="2"
     inkscape:pageopacity="0.0"
     inkscape:pagecheckerboard="0"
     inkscape:deskcolor="#d1d1d1"
     showgrid="true"
     inkscape:current-layer="svg5">
    <inkscape:grid
       id="grid5"
       units="px"
       originx="0"
       originy="0"
       spacingx="0.5"
       spacingy="0.5"
       empcolor="#0099e5"
       empopacity="0.30196078"
       color="#0099e5"
       opacity="0.14901961"
       empspacing="2"
       dotted="false"
       gridanglex="30"
       gridanglez="30"
       visible="true" />
  </sodipodi:namedview>
  <defs
     id="defs4">
    <linearGradient
       id="a"
       x1="-27.767149"
       x2="-6.2699571"
       y1="1037.8278"
       y2="1047.8737"
       gradientTransform="matrix(1.0233895,0,0,1.1447454,29.416608,-1179.5485)"
       gradientUnits="userSpaceOnUse">
      <stop
         stop-color="#ffe496"
         offset="0"
         id="stop1" />
      <stop
         stop-color="#ffcc40"
         offset="1"
         id="stop2" />
    </linearGradient>
    <linearGradient
       id="b"
       x1="-28.333376"
       x2="-13.000042"
       y1="1031.0245"
       y2="1033.6737"
       gradientTransform="matrix(1.5,0,0,1.509804,43.500063,-1553.645)"
       gradientUnits="userSpaceOnUse">
      <stop
         stop-color="#fdbd17"
         offset="0"
         id="stop3" />
      <stop
         stop-color="#e3a726"
         offset="1"
         id="stop4" />
    </linearGradient>
  </defs>
  <path
     d="M 0,12 V 3.510106 C -3.4499335e-5,2.6762412 0.6715725,2.000151 1.500063,2.000151 L 7.500063,2 C 8.328512,2 9.000121,2.6759393 9.000162,3.509804 L 9,4 22.499789,4.000151 c 0.828423,1.04e-5 1.499989,0.6759666 1.5,1.509804 L 23.99986,12 Z"
     fill="url(#b)"
     id="path4"
     style="fill:url(#b)" />
  <path
     d="M 22.775341,7.7496313 H 1.224657 c -0.53830914,0 -0.97468712,0.4659632 -0.9746568,1.0407374 V 19.709262 C 0.24996988,20.284034 0.68634786,20.75 1.224657,20.75 h 21.550684 c 0.538311,0 0.974689,-0.465964 0.974659,-1.040738 V 8.7903687 c 3e-5,-0.5747742 -0.436348,-1.0407382 -0.974659,-1.0407374 z"
     fill="url(#a)"
     stroke="#edb020"
     stroke-width="0.5"
     id="path5"
     style="fill:url(#a)" />
</svg>
