<?xml version="1.0" encoding="UTF-8" standalone="no"?>
<svg
   height="24"
   viewBox="0 0 6.3499998 6.3500003"
   width="24"
   version="1.1"
   id="svg359"
   sodipodi:docname="Color_03_24.svg"
   inkscape:version="1.2.2 (732a01da63, 2022-12-09)"
   xmlns:inkscape="http://www.inkscape.org/namespaces/inkscape"
   xmlns:sodipodi="http://sodipodi.sourceforge.net/DTD/sodipodi-0.dtd"
   xmlns:xlink="http://www.w3.org/1999/xlink"
   xmlns="http://www.w3.org/2000/svg"
   xmlns:svg="http://www.w3.org/2000/svg">
  <defs
     id="defs363" />
  <sodipodi:namedview
     id="namedview361"
     pagecolor="#ffffff"
     bordercolor="#000000"
     borderopacity="0.25"
     inkscape:showpageshadow="2"
     inkscape:pageopacity="0.0"
     inkscape:pagecheckerboard="0"
     inkscape:deskcolor="#d1d1d1"
     showgrid="true"
     inkscape:zoom="37.916667"
     inkscape:cx="12"
     inkscape:cy="12"
     inkscape:current-layer="svg359">
    <inkscape:grid
       type="xygrid"
       id="grid1037" />
  </sodipodi:namedview>
  <linearGradient
     id="a"
     gradientTransform="matrix(1.1588142 0 0 1.1596758 17.020513 .741035)"
     gradientUnits="userSpaceOnUse"
     x1="-8"
     x2="-10.074806"
     xlink:href="#b"
     y1="7.535898"
     y2="8.746097" />
  <radialGradient
     id="b"
     cx="7.487501"
     cy="6.25"
     gradientTransform="matrix(-.0000001 1.3333333 -1.3333333 -.00000015 13.833334 -.983333)"
     gradientUnits="userSpaceOnUse"
     r="2.25">
    <stop
       offset="0"
       stop-color="#a0c2f8"
       id="stop325" />
    <stop
       offset="1"
       stop-color="#2672e5"
       id="stop327" />
  </radialGradient>
  <linearGradient
     id="c"
     gradientTransform="matrix(1.1588142 0 0 1.1596758 -1.520514 .160844)"
     gradientUnits="userSpaceOnUse"
     x1="2.000001"
     x2="3.878721"
     xlink:href="#b"
     y1="11.500305"
     y2="10.415625" />
  <linearGradient
     id="d"
     gradientTransform="matrix(1.1588142 0 0 1.1596758 17.520588 .741036)"
     gradientUnits="userSpaceOnUse"
     x1="-6.991117"
     x2="-5.921872"
     y1="8.111208"
     y2="8.735714">
    <stop
       offset="0"
       stop-color="#fde99b"
       id="stop331" />
    <stop
       offset="1"
       stop-color="#fc0"
       id="stop333" />
  </linearGradient>
  <linearGradient
     id="e"
     gradientTransform="matrix(1.1588142 0 0 1.1596758 -1.02044 .160845)"
     gradientUnits="userSpaceOnUse"
     x1="13.994617"
     x2="12.121251"
     y1="11.500305"
     y2="10.415625">
    <stop
       offset="0"
       stop-color="#fde9bf"
       id="stop336" />
    <stop
       offset="1"
       stop-color="#fc0"
       id="stop338" />
  </linearGradient>
  <linearGradient
     id="f"
     gradientTransform="matrix(1.1588142 0 0 1.1596758 17.270514 .308092)"
     gradientUnits="userSpaceOnUse"
     x1="-8"
     x2="-8"
     y1="7.535898"
     y2="4.071797">
    <stop
       offset="0"
       stop-color="#f99"
       id="stop341" />
    <stop
       offset="1"
       stop-color="#d40000"
       id="stop343" />
  </linearGradient>
  <linearGradient
     id="g"
     gradientTransform="matrix(1.1588142 0 0 1.1596758 -1.270514 -.2721)"
     gradientUnits="userSpaceOnUse"
     x1="8"
     x2="8"
     y1="1.108498"
     y2="2.853172">
    <stop
       offset="0"
       stop-color="#ffb3b3"
       id="stop346" />
    <stop
       offset="1"
       stop-color="#d40000"
       id="stop348" />
  </linearGradient>
  <g
     stroke-linecap="round"
     stroke-width=".502051"
     transform="matrix(.39525776 0 0 .39525014 .012931 .122139)"
     id="g357">
    <path
       d="m1.2968365 12.631283 2.9767209-5.1596667 3.4764426 2.0086174v4.0172353h-5.9528847a.57756487.57756487 59.990779 0 1 -.5002788-.866186z"
       fill="url(#a)"
       stroke="url(#c)"
       id="path351" />
    <path
       d="m11.726517 7.4716171-3.4764431 2.008618-.0000696 4.0173259 5.9529087-.000077a.57757739.57757739 120.00902 0 0 .500284-.866202z"
       fill="url(#d)"
       stroke="url(#e)"
       id="path353" />
    <path
       d="m8.4997571 1.8795639 2.9766859 5.1591091-3.4764432 2.0086174-3.4764426-2.0086174 2.9766853-5.1591091a.57697667.57697667 180 0 1 .9995146 0z"
       fill="url(#f)"
       stroke="url(#g)"
       id="path355" />
  </g>
</svg>
