<svg width="32" height="32" version="1.1" xmlns="http://www.w3.org/2000/svg">
 <rect x="2.5" y="2.5" width="27" height="27" rx="2.2" fill="#f0fcff" stroke="#00aad4" stroke-linejoin="round"/>
 <path d="m2.9 2.9h26.2v4.1h-26.2z" fill="#00aad4"/>
 <path d="m9.0000001 14 2.283e-4 2c0 0.999999 2.5816436 2 6.9997716 2 4.418131 0 7.000114-1.000001 7-2l-2.27e-4 -2c0 1-2.581642 2-6.999773 2-4.418128 0-6.9997716-1-6.9999999-2z" fill="#2a7fff" stroke-linecap="round" stroke-linejoin="round" stroke-miterlimit="5.6" stroke-width="1.33334"/>
 <ellipse cx="15.999996" cy="12.000002" rx="6.9997711" ry="2.000001" fill="#2a7fff" stroke-linecap="round" stroke-width=".799998"/>
 <path d="m9.0000001 18 2.283e-4 2c0 1 2.5816436 2 6.9997716 2 4.418131 0 7.000114-1 7-2l-2.27e-4 -2c0 1-2.581642 2-6.999773 2-4.418128 0-6.9997716-1-6.9999999-2z" fill="#2a7fff" stroke-linecap="round" stroke-linejoin="round" stroke-miterlimit="5.6" stroke-width="1.33334"/>
 <path d="m9.0000001 22 2.283e-4 1.999999c0 1 2.5816436 2.000001 6.9997716 2.000001 4.418131 0 7.000114-1.000001 7-2.000001l-2.27e-4 -1.999999c0 1-2.581642 1.999999-6.999773 1.999999-4.418128 0-6.9997716-0.999999-6.9999999-1.999999z" fill="#2a7fff" stroke-linecap="round" stroke-linejoin="round" stroke-miterlimit="5.6" stroke-width="1.33334"/>
</svg>
