<?xml version="1.0" encoding="UTF-8" standalone="no"?>
<svg
   height="64"
   width="64"
   version="1.1"
   id="svg287"
   sodipodi:docname="Cut_02_64.svg"
   inkscape:export-filename="Cut_02_64.png"
   inkscape:export-xdpi="96"
   inkscape:export-ydpi="96"
   inkscape:version="1.2-beta (1b65182ce9, 2022-04-05)"
   xmlns:inkscape="http://www.inkscape.org/namespaces/inkscape"
   xmlns:sodipodi="http://sodipodi.sourceforge.net/DTD/sodipodi-0.dtd"
   xmlns:xlink="http://www.w3.org/1999/xlink"
   xmlns="http://www.w3.org/2000/svg"
   xmlns:svg="http://www.w3.org/2000/svg">
  <defs
     id="defs291" />
  <sodipodi:namedview
     id="namedview289"
     pagecolor="#ffffff"
     bordercolor="#666666"
     borderopacity="1.0"
     inkscape:pageshadow="2"
     inkscape:pageopacity="0.0"
     inkscape:pagecheckerboard="0"
     inkscape:deskcolor="#d1d1d1"
     showgrid="true"
     inkscape:zoom="14.34375"
     inkscape:cx="29.455338"
     inkscape:cy="32"
     inkscape:current-layer="svg287">
    <inkscape:grid
       type="xygrid"
       id="grid2932" />
  </sodipodi:namedview>
  <linearGradient
     id="a">
    <stop
       offset="0"
       stop-color="#bdcee7"
       id="stop268" />
    <stop
       offset="1"
       stop-color="#fff"
       id="stop270" />
  </linearGradient>
  <linearGradient
     id="b"
     gradientTransform="matrix(1.1548494,-0.47835429,0.38268343,0.92387953,-4.393644,4.805189)"
     gradientUnits="userSpaceOnUse"
     x1="7"
     x2="8.730994"
     xlink:href="#a"
     y1="5"
     y2="4.731483" />
  <linearGradient
     id="c"
     gradientTransform="matrix(-1.1548494,-0.47835429,-0.38268343,0.92387953,20.393644,4.805189)"
     gradientUnits="userSpaceOnUse"
     x1="7"
     x2="8.730994"
     xlink:href="#a"
     y1="5"
     y2="4.731483" />
  <g
     id="g2446"
     transform="matrix(3.9999982,0,0,3.9999982,6.5655824e-5,2.5139729e-7)">
    <path
       id="path2383"
       style="fill:none;fill-rule:evenodd;stroke:#00aad4;stroke-width:0.75;stroke-linejoin:round;stroke-dasharray:none;stroke-opacity:1"
       d="M 7.9489239,10.735238 C 7.4454104,11.632992 7.1470297,11.966811 6.6147444,12.507973 L 5.9749974,10.722453 6.8930665,8.4664588 M 8.0000025,5.7463574 10.185869,0.37497297 C 11.22203,1.3411551 11.429035,3.0272141 10.677096,4.874973 10.333357,5.6890111 9.6305456,7.2909664 9.0989792,8.4469002"
       sodipodi:nodetypes="cccccccc" />
    <path
       d="M 10.025008,10.722454 5.8141363,0.37497368 C 4.7779753,1.3411558 4.5709702,3.0272148 5.3229084,4.8749737 6.1841329,6.9145134 7.7790477,10.874974 9.3852606,12.507974 Z"
       fill="url(#b)"
       stroke="#999999"
       stroke-width="0.5"
       id="path429"
       style="fill:none;fill-rule:evenodd;stroke:#00aad4;stroke-width:0.75;stroke-linejoin:round;stroke-dasharray:none;stroke-opacity:1"
       sodipodi:nodetypes="ccccc" />
    <ellipse
       style="fill:none;stroke:#00aad4;stroke-width:1.25065;stroke-dasharray:none;stroke-dashoffset:1.49998;stroke-opacity:1"
       id="path1691"
       cx="7.5655122"
       cy="15.282556"
       rx="1.7926066"
       ry="2.4377546"
       transform="matrix(0.97401041,-0.22650325,0.27031482,0.96277199,0,0)" />
    <ellipse
       style="fill:none;stroke:#00aad4;stroke-width:1.25065;stroke-dasharray:none;stroke-dashoffset:1.49998;stroke-opacity:1"
       id="ellipse2312"
       cx="-7.854588"
       cy="11.654799"
       rx="1.7926066"
       ry="2.4377546"
       transform="matrix(-0.97401041,-0.22650325,-0.27031482,0.96277199,0,0)" />
  </g>
</svg>
