<?xml version="1.0" encoding="UTF-8" standalone="no"?>
<svg
   width="24"
   height="24"
   version="1.1"
   id="svg4"
   sodipodi:docname="Delete_06_24.svg"
   inkscape:export-filename="Delete_06_24.png"
   inkscape:export-xdpi="96"
   inkscape:export-ydpi="96"
   inkscape:version="1.3.2 (091e20e, 2023-11-25, custom)"
   xmlns:inkscape="http://www.inkscape.org/namespaces/inkscape"
   xmlns:sodipodi="http://sodipodi.sourceforge.net/DTD/sodipodi-0.dtd"
   xmlns="http://www.w3.org/2000/svg"
   xmlns:svg="http://www.w3.org/2000/svg">
  <defs
     id="defs4" />
  <sodipodi:namedview
     id="namedview4"
     pagecolor="#ffffff"
     bordercolor="#000000"
     borderopacity="0.25"
     inkscape:showpageshadow="2"
     inkscape:pageopacity="0.0"
     inkscape:pagecheckerboard="0"
     inkscape:deskcolor="#d1d1d1"
     showgrid="true"
     inkscape:current-layer="svg4">
    <inkscape:grid
       id="grid4"
       units="px"
       originx="0"
       originy="0"
       spacingx="0.5"
       spacingy="0.5"
       empcolor="#0099e5"
       empopacity="0.30196078"
       color="#0099e5"
       opacity="0.14901961"
       empspacing="2"
       dotted="false"
       gridanglex="30"
       gridanglez="30"
       visible="true" />
  </sodipodi:namedview>
  <rect
     x="1.6"
     y="1.6"
     width="14.8"
     height="14.8"
     ry="2.1527274"
     fill="#aaccff"
     stroke="#6892ca"
     stroke-linejoin="round"
     stroke-width="1.2"
     id="rect1" />
  <rect
     x="4.6000009"
     y="4.6000004"
     width="14.8"
     height="14.8"
     ry="2.1527274"
     fill="#c2daff"
     stroke="#6892ca"
     stroke-linejoin="round"
     stroke-width="1.2"
     id="rect2" />
  <rect
     x="7.5999966"
     y="7.5999951"
     width="14.8"
     height="14.799999"
     ry="2.1527271"
     fill="#dbe9ff"
     stroke="#6892ca"
     stroke-linejoin="round"
     stroke-width="1.2"
     id="rect3" />
  <g
     transform="matrix(1.4666666,0,0,1.4666666,-2.2333359,-2.2333378)"
     fill="none"
     stroke-linecap="round"
     id="g4">
    <path
       d="m9.5 14 4.5-4.5m0 4.5-4.5-4.5"
       stroke="#ffffff"
       stroke-width="3.4090911"
       id="path3" />
    <path
       d="m9.5 14 4.5-4.5m0 4.5-4.5-4.5"
       stroke="#dc0000"
       stroke-width="1.3636364"
       id="path4" />
  </g>
</svg>
