<?xml version="1.0" encoding="UTF-8" standalone="no"?>
<svg
   height="24"
   width="24"
   version="1.1"
   id="svg329"
   sodipodi:docname="Refresh_01_24.svg"
   inkscape:export-filename="Refresh_01_24.png"
   inkscape:export-xdpi="96"
   inkscape:export-ydpi="96"
   inkscape:version="1.2-beta (1b65182ce9, 2022-04-05)"
   xmlns:inkscape="http://www.inkscape.org/namespaces/inkscape"
   xmlns:sodipodi="http://sodipodi.sourceforge.net/DTD/sodipodi-0.dtd"
   xmlns:xlink="http://www.w3.org/1999/xlink"
   xmlns="http://www.w3.org/2000/svg"
   xmlns:svg="http://www.w3.org/2000/svg">
  <defs
     id="defs333" />
  <sodipodi:namedview
     id="namedview331"
     pagecolor="#ffffff"
     bordercolor="#666666"
     borderopacity="1.0"
     inkscape:pageshadow="2"
     inkscape:pageopacity="0.0"
     inkscape:pagecheckerboard="0"
     inkscape:deskcolor="#d1d1d1"
     showgrid="true"
     inkscape:zoom="38.25"
     inkscape:cx="11.986928"
     inkscape:cy="12"
     inkscape:current-layer="svg329">
    <inkscape:grid
       type="xygrid"
       id="grid1504" />
  </sodipodi:namedview>
  <linearGradient
     id="a">
    <stop
       offset="0"
       stop-color="#80b3ff"
       id="stop316" />
    <stop
       offset="1"
       stop-color="#d5e5ff"
       id="stop318" />
  </linearGradient>
  <linearGradient
     id="b"
     gradientTransform="matrix(-1.5384615 0 0 -1.5342707 23.807692 48.00703)"
     gradientUnits="userSpaceOnUse"
     x1="10"
     x2="9"
     xlink:href="#a"
     y1="7"
     y2="2" />
  <linearGradient
     id="c"
     gradientTransform="matrix(1.5384615 0 0 1.5342707 .192308 23.99297)"
     gradientUnits="userSpaceOnUse"
     x1="10"
     x2="9"
     xlink:href="#a"
     y1="7"
     y2="2" />
  <g
     fill-rule="evenodd"
     stroke="#3566a4"
     stroke-linejoin="round"
     stroke-opacity=".988235"
     transform="translate(0 -24)"
     id="g327">
    <path
       d="m21.5 38.801406c-4.000786 4.045672-7.361233 6.583022-13.0769232.767135l3.0769232-3.068541h-10v9.97276l3.076923-3.068542c6.419824 5.127382 14.122674 5.586473 16.923077-4.602812z"
       fill="url(#b)"
       id="path323" />
    <path
       d="m2.5000006 33.198594c4.000786-4.045672 7.3612324-6.583022 13.0769224-.767135l-3.076923 3.068541h10v-9.97276l-3.076923 3.068542c-6.419824-5.127383-14.1226734-5.586473-16.9230764 4.602812z"
       fill="url(#c)"
       id="path325" />
  </g>
</svg>
