<?xml version="1.0" encoding="UTF-8" standalone="no"?>
<svg
   width="24"
   height="24"
   version="1.1"
   viewBox="0 0 24 24"
   id="svg2"
   sodipodi:docname="tag_h3_150.svg"
   inkscape:export-filename="tag_h3_150.png"
   inkscape:export-xdpi="96"
   inkscape:export-ydpi="96"
   inkscape:version="1.3.2 (091e20e, 2023-11-25, custom)"
   xmlns:inkscape="http://www.inkscape.org/namespaces/inkscape"
   xmlns:sodipodi="http://sodipodi.sourceforge.net/DTD/sodipodi-0.dtd"
   xmlns="http://www.w3.org/2000/svg"
   xmlns:svg="http://www.w3.org/2000/svg">
  <defs
     id="defs2" />
  <sodipodi:namedview
     id="namedview2"
     pagecolor="#ffffff"
     bordercolor="#000000"
     borderopacity="0.25"
     inkscape:showpageshadow="2"
     inkscape:pageopacity="0.0"
     inkscape:pagecheckerboard="0"
     inkscape:deskcolor="#d1d1d1"
     showgrid="true"
     inkscape:current-layer="svg2">
    <inkscape:grid
       id="grid2"
       units="px"
       originx="0"
       originy="0"
       spacingx="0.5"
       spacingy="0.5"
       empcolor="#0099e5"
       empopacity="0.30196078"
       color="#0099e5"
       opacity="0.14901961"
       empspacing="2"
       dotted="false"
       gridanglex="30"
       gridanglez="30"
       visible="true" />
  </sodipodi:namedview>
  <path
     d="m4.91 12h6.182097m0-5.039949v10.079898m-6.182097-10.079898v10.079898"
     fill="none"
     stroke="#008dd2"
     stroke-linecap="round"
     stroke-linejoin="round"
     stroke-width="1.92"
     id="path1" />
  <path
     d="M 14.96,8.765426 C 15.224547,7.727538 16.165534,6.96 17.285792,6.96 c 1.325484,0 2.4,1.074517 2.4,2.4 V 9.6 c 0,1.325483 -1.074516,2.4 -2.4,2.4 1.325484,0 2.4,1.074517 2.4,2.4 v 0.24 c 0,1.325483 -1.074516,2.4 -2.4,2.4 -1.120258,0 -2.061245,-0.767538 -2.325792,-1.805426"
     id="path4"
     style="fill:none;stroke:#008dd2;stroke-width:1.92;stroke-linecap:round;stroke-linejoin:round;stroke-opacity:1" />
</svg>
