<?xml version="1.0" encoding="UTF-8" standalone="no"?>
<svg
   height="16"
   width="16"
   version="1.1"
   id="svg538"
   sodipodi:docname="Time_02_16.svg"
   inkscape:export-filename="Time_02_16.png"
   inkscape:export-xdpi="96"
   inkscape:export-ydpi="96"
   inkscape:version="1.2-beta (1b65182ce9, 2022-04-05)"
   xmlns:inkscape="http://www.inkscape.org/namespaces/inkscape"
   xmlns:sodipodi="http://sodipodi.sourceforge.net/DTD/sodipodi-0.dtd"
   xmlns="http://www.w3.org/2000/svg"
   xmlns:svg="http://www.w3.org/2000/svg">
  <defs
     id="defs542" />
  <sodipodi:namedview
     id="namedview540"
     pagecolor="#ffffff"
     bordercolor="#666666"
     borderopacity="1.0"
     inkscape:pageshadow="2"
     inkscape:pageopacity="0.0"
     inkscape:pagecheckerboard="0"
     inkscape:deskcolor="#d1d1d1"
     showgrid="true"
     inkscape:zoom="57.375"
     inkscape:cx="7.5206972"
     inkscape:cy="8"
     inkscape:current-layer="svg538">
    <inkscape:grid
       type="xygrid"
       id="grid765" />
  </sodipodi:namedview>
  <path
     d="m 1.499999,0.5 h 13 v 15.000017 h -13 z"
     fill="#ffffff"
     stroke="#3771c8"
     stroke-linecap="round"
     id="path528"
     style="stroke-width:0.999998" />
  <path
     d="M 1,0 H 15 V 4.000018 H 1 Z"
     fill="#d40000"
     id="path530"
     style="stroke-width:0.999995" />
  <path
     d="M 3.8132811,11.3226 H 5.1023436 V 6.8734 L 3.6999998,7.1546 V 6.4359 L 5.0945311,6.1546 h 0.7890625 v 5.168 H 7.172656 v 0.6641 H 3.8132811 Z"
     id="path532" />
  <path
     d="m 8.278094,6.1546 h 3.097656 v 0.6641 h -2.375 v 1.4297 q 0.171875,-0.059 0.34375,-0.086 0.171875,-0.031 0.34375,-0.031 0.976563,0 1.546875,0.5352 0.570313,0.5351 0.570313,1.4492 0,0.9414 -0.585938,1.4648 -0.585937,0.5196 -1.652344,0.5196 -0.367187,0 -0.75,-0.062 Q 8.43825,11.9762 8.032,11.8507 v -0.793 q 0.351563,0.1914 0.726563,0.2851 0.375,0.094 0.792968,0.094 0.675782,0 1.070313,-0.3555 0.394531,-0.3554 0.394531,-0.9648 0,-0.6094 -0.394531,-0.9649 -0.394531,-0.3554 -1.070313,-0.3554 -0.316406,0 -0.632812,0.07 -0.3125,0.07 -0.640625,0.2187 z"
     id="path534" />
</svg>
