<?xml version="1.0" encoding="UTF-8" standalone="no"?>
<svg
   height="36"
   viewBox="0 0 9.5249997 9.5250005"
   width="36"
   version="1.1"
   id="svg500"
   sodipodi:docname="Picture_09_36.svg"
   inkscape:version="1.2 (dc2aedaf03, 2022-05-15)"
   inkscape:export-filename="Picture_09_36.png"
   inkscape:export-xdpi="96"
   inkscape:export-ydpi="96"
   xmlns:inkscape="http://www.inkscape.org/namespaces/inkscape"
   xmlns:sodipodi="http://sodipodi.sourceforge.net/DTD/sodipodi-0.dtd"
   xmlns="http://www.w3.org/2000/svg"
   xmlns:svg="http://www.w3.org/2000/svg">
  <defs
     id="defs504" />
  <sodipodi:namedview
     id="namedview502"
     pagecolor="#ffffff"
     bordercolor="#666666"
     borderopacity="1.0"
     inkscape:showpageshadow="2"
     inkscape:pageopacity="0.0"
     inkscape:pagecheckerboard="0"
     inkscape:deskcolor="#d1d1d1"
     showgrid="true"
     inkscape:zoom="25.5"
     inkscape:cx="16.039216"
     inkscape:cy="18"
     inkscape:current-layer="svg500">
    <inkscape:grid
       type="xygrid"
       id="grid1268" />
  </sodipodi:namedview>
  <g
     id="g2843"
     transform="matrix(0.59531258,0,0,0.59531258,-1.1853126e-6,-0.132293)">
    <g
       stroke-width="0.5"
       id="g2657"
       style="fill:none;stroke:#00aad4;stroke-linecap:round">
      <circle
         cx="4.5"
         cy="5.5"
         r="1"
         stroke-linejoin="round"
         id="circle2639" />
      <path
         d="m 4.5,3.5 v 1"
         id="path2641" />
      <path
         d="M 3.0857864,4.0857864 3.7928932,4.7928932"
         id="path2643" />
      <path
         d="m 2.5,5.5 h 1"
         id="path2645" />
      <path
         d="M 3.0857864,6.9142136 3.7928932,6.2071068"
         id="path2647" />
      <path
         d="m 4.5,7.5 v -1"
         id="path2649" />
      <path
         d="M 5.9142136,6.9142136 5.2071068,6.2071068"
         id="path2651" />
      <path
         d="m 6.5,5.5 h -1"
         id="path2653" />
      <path
         d="M 5.9142136,4.0857864 5.2071068,4.7928932"
         id="path2655" />
    </g>
    <path
       d="M 0.5,12 3,8.5 5,10 11,4 15.5,7"
       stroke-linejoin="round"
       stroke-width="0.75"
       id="path2659"
       style="fill:none;stroke:#00aad4;stroke-linecap:round" />
    <path
       d="M 15.500002,7 V 2.5 H 0.5 v 11 H 6"
       stroke-width="0.999996"
       id="path2661"
       style="fill:none;stroke:#00aad4;stroke-linecap:round" />
  </g>
  <g
     id="g1045"
     transform="scale(0.26458334)">
    <circle
       cx="25.875"
       cy="25.875"
       r="9"
       stroke-dashoffset="3.37495"
       stroke-linejoin="round"
       stroke-width="2.25"
       id="circle429"
       style="fill:none;stroke:#00aad4;stroke-linecap:round" />
    <path
       d="m 25.875001,21.374999 v 9.000003"
       id="path431"
       style="fill:none;stroke:#00aad4;stroke-width:2.25;stroke-linecap:round" />
    <path
       d="M 30.375002,25.875 H 21.374999"
       id="path433"
       style="fill:none;stroke:#00aad4;stroke-width:2.25;stroke-linecap:round" />
  </g>
</svg>
