<?xml version="1.0" encoding="UTF-8" standalone="no"?>
<svg
   height="32"
   width="32"
   version="1.1"
   id="svg10"
   sodipodi:docname="Time_10_32.svg"
   inkscape:export-filename="Time_10_32.png"
   inkscape:export-xdpi="96"
   inkscape:export-ydpi="96"
   inkscape:version="1.2.1 (9c6d41e410, 2022-07-14)"
   xmlns:inkscape="http://www.inkscape.org/namespaces/inkscape"
   xmlns:sodipodi="http://sodipodi.sourceforge.net/DTD/sodipodi-0.dtd"
   xmlns="http://www.w3.org/2000/svg"
   xmlns:svg="http://www.w3.org/2000/svg">
  <defs
     id="defs14" />
  <sodipodi:namedview
     id="namedview12"
     pagecolor="#ffffff"
     bordercolor="#666666"
     borderopacity="1.0"
     inkscape:pageshadow="2"
     inkscape:pageopacity="0.0"
     inkscape:pagecheckerboard="0"
     inkscape:deskcolor="#d1d1d1"
     showgrid="true"
     inkscape:zoom="28.6875"
     inkscape:cx="16"
     inkscape:cy="16"
     inkscape:current-layer="svg10"
     inkscape:showpageshadow="2">
    <inkscape:grid
       type="xygrid"
       id="grid867" />
  </sodipodi:namedview>
  <path
     d="m 2.75,0.75 h 26.5 v 30.5 H 2.75 Z"
     fill="#ffffff"
     stroke="#3771c8"
     stroke-linecap="round"
     stroke-width="1.8619"
     id="path2"
     style="stroke-width:1.5;stroke-dasharray:none;stroke:#00aad4;stroke-opacity:1;fill:none" />
  <path
     d="M 2,-3.5e-5 H 30 V 8 H 2 Z"
     fill="#d40000"
     id="path4"
     style="stroke-width:1;fill:#00aad4;fill-opacity:1;stroke:none" />
  <g
     id="g871"
     style="fill:#00aad4;fill-opacity:1;stroke:none">
    <path
       d="m7.626562 22.5453h2.578125v-8.8985l-2.804687.5625v-1.4375l2.789062-.5625h1.578125v10.336h2.578125v1.3281h-6.71875z"
       id="path6"
       style="fill:#00aad4;fill-opacity:1;stroke:none" />
    <path
       d="m17.55625 12.2093h6.195312v1.3282h-4.75v2.8593q.34375-.1172.6875-.1718.34375-.062.6875-.062 1.953125 0 3.09375 1.0703 1.140625 1.0703 1.140625 2.8984 0 1.8828-1.171875 2.9297-1.171875 1.0391-3.304687 1.0391-.734375 0-1.5-.125-.757813-.125-1.570313-.375v-1.586q.703125.3828 1.453125.5703.75.1875 1.585938.1875 1.351562 0 2.140625-.7109.789062-.7109.789062-1.9297 0-1.2187-.789062-1.9297-.789063-.7109-2.140625-.7109-.632813 0-1.265625.1406-.625.1406-1.28125.4375z"
       id="path8"
       style="fill:#00aad4;fill-opacity:1;stroke:none" />
  </g>
</svg>
