<?xml version="1.0" encoding="UTF-8" standalone="no"?>
<svg
   height="64"
   width="64"
   version="1.1"
   id="svg12"
   sodipodi:docname="Save_04_64.svg"
   inkscape:export-filename="Save_04_64.png"
   inkscape:export-xdpi="96"
   inkscape:export-ydpi="96"
   inkscape:version="1.2.2 (732a01da63, 2022-12-09)"
   xmlns:inkscape="http://www.inkscape.org/namespaces/inkscape"
   xmlns:sodipodi="http://sodipodi.sourceforge.net/DTD/sodipodi-0.dtd"
   xmlns="http://www.w3.org/2000/svg"
   xmlns:svg="http://www.w3.org/2000/svg">
  <defs
     id="defs16" />
  <sodipodi:namedview
     id="namedview14"
     pagecolor="#ffffff"
     bordercolor="#000000"
     borderopacity="0.25"
     inkscape:showpageshadow="2"
     inkscape:pageopacity="0.0"
     inkscape:pagecheckerboard="0"
     inkscape:deskcolor="#d1d1d1"
     showgrid="true"
     inkscape:zoom="14.21875"
     inkscape:cx="31.718681"
     inkscape:cy="32"
     inkscape:current-layer="svg12">
    <inkscape:grid
       type="xygrid"
       id="grid1061" />
  </sodipodi:namedview>
  <path
     d="M 58.549928,57.05 V 8.5599998 L 52.432071,2.45 H 5.95 c -1.3807119,0 -2.5,1.1192881 -2.5,2.5 v 52.1 c 0,1.380712 1.1192881,2.5 2.5,2.5 h 50.099929 c 1.380712,0 2.499999,-1.119288 2.499999,-2.5 z"
     fill="#c2f3ff"
     fill-rule="evenodd"
     stroke-linejoin="round"
     stroke-width="2.9"
     id="path2"
     style="stroke:#00aad4"
     sodipodi:nodetypes="sccssssss" />
  <rect
     fill="#ebfcff"
     height="19.099998"
     ry="2.8999999"
     stroke-linejoin="round"
     stroke-width="2.9"
     width="29.1"
     x="17.450001"
     y="2.45"
     id="rect4"
     style="stroke:#00aad4"
     rx="2.9000001" />
  <path
     d="M 39,6 V 18"
     fill="none"
     stroke-width="6"
     id="path6"
     style="stroke:#00aad4" />
  <rect
     fill="#ebfcff"
     height="31.1"
     ry="2.9000001"
     stroke-linejoin="round"
     stroke-width="2.9"
     width="41.099998"
     x="10.45"
     y="28.450001"
     id="rect8"
     style="stroke:#00aad4"
     rx="2.9000001" />
</svg>
