<?xml version="1.0" encoding="UTF-8" standalone="no"?>
<svg
   width="36"
   height="36"
   version="1.1"
   viewBox="0 0 36 36"
   id="svg6"
   sodipodi:docname="TPSImport_ComObj_150.svg"
   inkscape:version="1.3.2 (091e20e, 2023-11-25, custom)"
   xmlns:inkscape="http://www.inkscape.org/namespaces/inkscape"
   xmlns:sodipodi="http://sodipodi.sourceforge.net/DTD/sodipodi-0.dtd"
   xmlns="http://www.w3.org/2000/svg"
   xmlns:svg="http://www.w3.org/2000/svg">
  <sodipodi:namedview
     id="namedview6"
     pagecolor="#ffffff"
     bordercolor="#000000"
     borderopacity="0.25"
     inkscape:showpageshadow="2"
     inkscape:pageopacity="0.0"
     inkscape:pagecheckerboard="0"
     inkscape:deskcolor="#d1d1d1"
     showgrid="true"
     inkscape:current-layer="svg6">
    <inkscape:grid
       id="grid6"
       units="px"
       originx="0"
       originy="0"
       spacingx="0.5"
       spacingy="0.5"
       empcolor="#0099e5"
       empopacity="0.30196078"
       color="#0099e5"
       opacity="0.14901961"
       empspacing="2"
       dotted="false"
       gridanglex="30"
       gridanglez="30"
       visible="true" />
  </sodipodi:namedview>
  <defs
     id="defs4">
    <linearGradient
       id="a"
       x1="13"
       x2="21"
       y1="1040.8622"
       y2="1049.8622"
       gradientTransform="matrix(1.5076922,0,0,1.5076962,-0.13076746,-1550.5885)"
       gradientUnits="userSpaceOnUse">
      <stop
         stop-color="#00ffff"
         offset="0"
         id="stop1" />
      <stop
         stop-color="#0000ff"
         offset="1"
         id="stop2" />
    </linearGradient>
    <linearGradient
       id="b"
       x1="10"
       x2="10"
       y1="1042.3622"
       y2="1029.8622"
       gradientTransform="matrix(1.5000004,0,0,1.5000004,-0.125004,-1541.9937)"
       gradientUnits="userSpaceOnUse">
      <stop
         stop-color="#00aa00"
         offset="0"
         id="stop3" />
      <stop
         stop-color="#55d400"
         offset="1"
         id="stop4" />
    </linearGradient>
  </defs>
  <path
     d="m 2.5,11.5 9,-9 v 6 c 17.250004,0 17.5,12.25 17.5,22 0,2.5 -3,2.5 -3,0 0,-11.25 -3.999998,-16 -14.5,-16 v 6 z"
     fill="url(#b)"
     fill-rule="evenodd"
     stroke="#00a300"
     stroke-linejoin="round"
     id="path4"
     style="fill:url(#b)" />
  <circle
     cx="25.5"
     cy="25.499983"
     r="9.8000002"
     fill="url(#a)"
     fill-rule="evenodd"
     stroke="#00ffff"
     stroke-linecap="square"
     stroke-width="1.4"
     style="fill:url(#a);paint-order:normal"
     id="circle4" />
  <ellipse
     cx="25.5"
     cy="25.499983"
     rx="3.8461537"
     ry="3.846154"
     fill="#ff0000"
     fill-rule="evenodd"
     stroke="#800000"
     stroke-linecap="square"
     style="paint-order:normal"
     id="ellipse4" />
  <rect
     x="0.49999949"
     y="23.499983"
     width="15"
     height="12"
     fill="#ffffff"
     fill-rule="evenodd"
     stroke="#2a7efe"
     stroke-linecap="square"
     stroke-linejoin="round"
     stroke-width="0.999999"
     style="paint-order:normal"
     id="rect4" />
  <path
     d="M 3.45,32.5496 V 26.45 h 1.86332 c 2.48442,0 2.48442,3.3438 0,3.3438 H 3.45"
     fill="none"
     stroke="#4d4d4d"
     stroke-linecap="round"
     stroke-linejoin="round"
     stroke-width="0.9"
     id="path5" />
  <path
     d="M 12.69578,26.8481 C 12.30662,26.5798 11.72876,26.45 11.0384,26.45 c -0.97558,0 -1.86333,0.5132 -1.86333,1.58 0,0.8358 0.7048,1.1794 1.86333,1.3805 1.61317,0.28 1.86332,0.8242 1.86332,1.5591 1e-5,1.3279 -1.10478,1.58 -1.86332,1.58 -0.58885,0 -1.19328,-0.072 -1.9514,-0.4644"
     fill="none"
     stroke="#4d4d4d"
     stroke-linecap="round"
     stroke-linejoin="round"
     stroke-width="0.9"
     id="path6" />
</svg>
