<?xml version="1.0" encoding="UTF-8" standalone="no"?>
<svg
   height="24"
   width="24"
   version="1.1"
   id="svg302"
   sodipodi:docname="Font_04_24.svg"
   inkscape:export-filename="Font_04_24.png"
   inkscape:export-xdpi="96"
   inkscape:export-ydpi="96"
   inkscape:version="1.2 (dc2aedaf03, 2022-05-15)"
   xml:space="preserve"
   xmlns:inkscape="http://www.inkscape.org/namespaces/inkscape"
   xmlns:sodipodi="http://sodipodi.sourceforge.net/DTD/sodipodi-0.dtd"
   xmlns="http://www.w3.org/2000/svg"
   xmlns:svg="http://www.w3.org/2000/svg"><defs
     id="defs306" /><sodipodi:namedview
     id="namedview304"
     pagecolor="#ffffff"
     bordercolor="#666666"
     borderopacity="1.0"
     inkscape:pageshadow="2"
     inkscape:pageopacity="0.0"
     inkscape:pagecheckerboard="0"
     inkscape:deskcolor="#d1d1d1"
     showgrid="true"
     inkscape:zoom="38.25"
     inkscape:cx="12"
     inkscape:cy="12"
     inkscape:current-layer="g300"
     inkscape:showpageshadow="2"><inkscape:grid
       type="xygrid"
       id="grid994" /></sodipodi:namedview><g
     fill="none"
     stroke="#00aad4"
     stroke-linecap="round"
     id="g300"><g
       fill="none"
       stroke="#00aad4"
       stroke-width="0.8"
       transform="scale(1.5)"
       id="g911"><path
         d="M 8.7193521,6.9209069 9.0700559,8.2970855 8.2979416,9.0694142 6.9199483,8.7190195 6.5020704,9.7278658 l 1.222155,0.7266222 -1.517e-4,1.092086 -1.2210901,0.72512 0.4179224,1.008955 1.3761786,-0.350704 0.7723287,0.772114 -0.3503946,1.377994 1.0088462,0.417877 0.7266221,-1.222154 1.092086,1.51e-4 0.72512,1.22109 1.008955,-0.417922 -0.350704,-1.376179 0.772114,-0.772329 1.377994,0.350395 0.417877,-1.008846 -1.222154,-0.726622 1.51e-4,-1.092086 1.22109,-0.7251208 L 15.079093,8.719353 13.702915,9.0700568 12.930586,8.2979425 13.280981,6.9199491 12.272135,6.5020713 11.545512,7.7242262 10.453427,7.7240745 9.7283063,6.5029844 Z"
         id="path907" /><circle
         cx="11"
         cy="11"
         r="1.4"
         stroke-dashoffset="1.49998"
         id="circle909" /></g><path
       id="path2-6"
       style="fill:#00aad4;stroke:none;stroke-width:5.65528"
       d="M 8.8487317,1.124862 1,22.875138 h 2.0068614 l 2.1826443,-6.020584 c 0.06912,-0.197107 0.255662,-0.329685 0.465827,-0.331058 h 4.3761753 l -2.0500303,-1.257914 6.44e-4,-0.590744 h -1.307243 c -0.34267,-0.0013 -0.581082,-0.338713 -0.465829,-0.659187 l 3.325238,-9.2901574 c 0.06912,-0.1971085 0.255666,-0.3296877 0.4658293,-0.331059 0.210163,0.00137 0.396713,0.1339517 0.465823,0.331059 L 12.081246,9.19512 13.8055,8.480787 11.151497,1.124862 Z"
       sodipodi:nodetypes="ccccccccccccccccc" /></g></svg>
