<svg width="24" height="24" version="1.1" xmlns="http://www.w3.org/2000/svg">
 <g fill="none" stroke="#00aad4" stroke-linecap="round" stroke-linejoin="round">
  <path d="m23.25 8.25v12h-22.5v-12" stroke-dashoffset="1.5" stroke-width="1.5"/>
  <g stroke-width="1.5px">
   <path d="m0.75 20.25 11.25-7.5 11.25 7.5"/>
   <path d="m0.75 8.25 9 5.25"/>
   <path d="m23.25 8.25-9 5.25"/>
   <path d="m0.75 8.25 11.25-7.5 11.25 7.5"/>
  </g>
 </g>
</svg>
