<?xml version="1.0" encoding="UTF-8" standalone="no"?>
<svg
   width="36"
   height="36"
   version="1.1"
   viewBox="0 0 36 36"
   id="svg9"
   sodipodi:docname="tapplicationproperties_150.svg"
   inkscape:export-filename="tapplicationproperties_150.png"
   inkscape:export-xdpi="96"
   inkscape:export-ydpi="96"
   inkscape:version="1.3.2 (091e20e, 2023-11-25, custom)"
   xmlns:inkscape="http://www.inkscape.org/namespaces/inkscape"
   xmlns:sodipodi="http://sodipodi.sourceforge.net/DTD/sodipodi-0.dtd"
   xmlns="http://www.w3.org/2000/svg"
   xmlns:svg="http://www.w3.org/2000/svg">
  <defs
     id="defs9" />
  <sodipodi:namedview
     id="namedview9"
     pagecolor="#ffffff"
     bordercolor="#000000"
     borderopacity="0.25"
     inkscape:showpageshadow="2"
     inkscape:pageopacity="0.0"
     inkscape:pagecheckerboard="0"
     inkscape:deskcolor="#d1d1d1"
     showgrid="true"
     inkscape:current-layer="svg9">
    <inkscape:grid
       id="grid9"
       units="px"
       originx="0"
       originy="0"
       spacingx="0.5"
       spacingy="0.5"
       empcolor="#0099e5"
       empopacity="0.30196078"
       color="#0099e5"
       opacity="0.14901961"
       empspacing="2"
       dotted="false"
       gridanglex="30"
       gridanglez="30"
       visible="true" />
  </sodipodi:namedview>
  <path
     d="m18.039084 32-2.999089 3-3.000911-3"
     fill="none"
     stroke="#ff6600"
     stroke-linecap="round"
     stroke-linejoin="round"
     stroke-width="1.5"
     id="path1" />
  <path
     d="m15 26.5v8.5"
     fill="none"
     stroke="#ff6600"
     stroke-linecap="round"
     stroke-linejoin="round"
     stroke-width="1.5"
     id="path2" />
  <path
     d="m32 13.960916 3 2.999089-3 3.000911"
     fill="none"
     stroke="#ff6600"
     stroke-linecap="round"
     stroke-linejoin="round"
     stroke-width="1.5"
     id="path3" />
  <path
     d="m26.5 17h8.5"
     fill="none"
     stroke="#ff6600"
     stroke-linecap="round"
     stroke-linejoin="round"
     stroke-width="1.5"
     id="path4" />
  <rect
     x="3.5"
     y="9.5"
     width="23.000002"
     height="17"
     fill="#f9f9f9"
     stroke="#2a7efe"
     stroke-width=".999998"
     style="paint-order:normal"
     id="rect4" />
  <path
     d="m27 6.5000001v3.4999999l-24-1e-7 -3e-7 -3.4999999c-1e-7 -0.8284271 0.6715727-1.5 1.4999998-1.5l21 1e-7c0.828427 0 1.5 0.6715729 1.5 1.5z"
     fill="#2a7efe"
     stroke-width="1.05"
     id="path5" />
  <path
     d="m19.08 42.93725-4.2 4.13125-4.2-4.13125"
     fill="none"
     stroke="#ff6600"
     stroke-linecap="round"
     stroke-linejoin="round"
     stroke-width="1.79999"
     id="path6" />
  <path
     d="m14.88 38.961335v8.107165"
     fill="none"
     stroke="#ff6600"
     stroke-linecap="round"
     stroke-linejoin="round"
     stroke-width="1.79999"
     id="path7" />
  <path
     d="m8.7992 14.5 3.0223 3.0232-3.0223 3.0234"
     fill="none"
     stroke="#666666"
     stroke-linecap="round"
     stroke-linejoin="round"
     stroke-width="1.5"
     id="path8" />
  <path
     d="m13 21.2h6"
     fill="none"
     stroke="#666666"
     stroke-width="1.5"
     id="path9" />
</svg>
