da=*Api.DA
dasdk=*Api.DA.Server
dadataset=*Data.DA
rosdk=*Api.RO.Server
libopentok=*Api.OpenTok
xterm=*Api.XTerm
libatom=*Api.Atom
atomapp=*Fcl.App.Atom
pdfjs=*Api.Pdf.JS
htmlfragment=*HTML.Fragment
restconnection=*Data.Rest.Connection
jsondataset=*Data.JsonDataset
db=*Data.Db
dbconst=*Data.Consts
sqldbrestdataset=*Data.Rest.SqlDb
fieldmap=*Data.FieldMap
extjsdataset=*Data.ExtJS
localjsondataset=*Data.LocalDataset
data.htmlactions=*Data.HTML.Actions
fpexprpars=*Fcl.Expressions
nodejsapp=*Fcl.App.NodeJs
serviceworkerapp=*Fcl.App.ServiceWorker
browserapp=*Fcl.App.Browser
custapp=*Fcl.CustApp
pascodegen=*Pascal.CodeGenerator
debugcapture=*Browser.DebugCapture
bootstraptablewidget=*Widget.BootstrapTable
libbootstrap=*Api.Bootstrap
libbootstraptable=*Api.BootstrapTable
bootstrapwidgets=*Widget.Bootstrap
job_shared=*JOB.Shared
job_browser=*JOB.Browser
libfullcalendar5=*Api.FullCalendar5
libfullcalendar4=*Api.FullCalendar4
dbwebwidget=*Widget.DB
webwidget=*Widget.Web
htmlwidgets=*Widget.HTML
dbhtmlwidgets=*Widget.HTML.DB
propertygridwidget=*Widget.PropertyGrid
libvscode=*Api.VSCode
vscodeapp=*Fcl.App.VSCode
node.net=*NodeApi.Net
node.onoff=*NodeApi.OnOff
node.fs=*NodeApi.FS
node.http=*NodeApi.Http
node.url=*NodeApi.Url
node.spidevice=*NodeApi.SPIDevice
jspdf=*Api.JSPdf
bulmawidgets=*Widget.Bulma
fprpccodegen=*FpRPC.CodeGen
fprpcclient=*FpRPC.Client
libelectron=*Api.Electron
libtinyeditor=*Api.TinyEditor
pushjs=*Api.PushJS
wasienv=*Wasi.Env
wasiserviceapp=*Fcl.App.Wasi.Service
wasiworkerthreadhost=*Fcl.App.Wasi.ThreadedHost
wasithreadedapp=*Fcl.App.Wasi.Threaded
wasihostapp=*Fcl.App.Wasi.Host
rtl.webthreads=*System.WebThreads
fpjson=*FpJson.Data
fpjsonjs=*FpJson.JS
chartjs=*Api.ChartJS
fpcunit=*FpcUnit.Test
plaintestreport=*FpcUnit.Reports.Plain
testdecorator=*FpcUnit.Decorator
consoletestrunner=*FpcUnit.Runners.Console
testregistry=*FpcUnit.Registry
browsertestrunner=*FpcUnit.Runners.Browser
htmltestreport=*FpcUnit.Reports.HTML
fpcunitreport=*FpcUnit.Report
libdatatables=*Api.DataTables
sysutils=*System.SysUtils
simplelinkedlist=*System.SimpleLinkedList
Rtl.HTMLEventNames=*HTML.EventNames
webutils=*System.WebUtils
Rtl.HTMLTranslate=*HTML.Translate
classes=*System.Classes
generics.strings=*System.Generics.Strings
Rtl.BrowserLoadHelper=*BrowserApi.LoadHelper
contnrs=*System.Contnrs
webassembly=*BrowserApi.WebAssembly
websvg=*BrowserApi.SVG
hotreloadclient=*System.HotReload
Rtl.TemplateLoader=*Browser.TemplateLoader
generics.collections=*System.Generics.Collections
Rtl.ScriptLoader=*Browser.ScriptLoader
node.events=*NodeApi.Events
web=*BrowserApi.Web
weborworker=*BrowserApi.WebOrWorker
generics.defaults=*System.Generics.Defaults
rtlconsts=*System.RTLConsts
Rtl.UnitLoader=*Browser.UnitLoader
rtti=*System.Rtti
Rtl.HTMLUtils=*HTML.Utils
dateutils=*System.DateUtils
timer=*System.Timer
Rtl.HTMLActions=*HTML.Actions
math=*System.Math
class2pas=*System.Class2Pas
libjquery=*Api.JQuery
webrtc=*BrowserApi.RTC
webrouter=*System.Router
js=*JSApi.JS
p2jsres=*System.Res
webgl=*BrowserApi.WebGL
webworker=*BrowserApi.Worker
rstranslate=*System.ResourceTranslate
webbluetooth=*BrowserApi.BlueTooth
strutils=*System.StrUtils
webaudio=*BrowserApi.Audio
arrayutils=*System.ArrayUtils
nodejs=*NodeApi.JS
browserconsole=*Browser.Console
types=*System.Types
typinfo=*System.TypInfo
libjitsimeet=*Api.JitsiMeet
libkurento=*Api.Kurento
libflatpickr=*Api.FlatPickr
fpcunittestinsight=*TestInsight.FpcUnit
testinsightclient=*TestInsight.Client
testinsightprotocol=*TestInsight.Protocol
