<?xml version="1.0" encoding="UTF-8" standalone="no"?>
<!-- Created with Inkscape (http://www.inkscape.org/) -->

<svg
   width="210mm"
   height="297mm"
   viewBox="0 0 210 297"
   version="1.1"
   id="svg66455"
   inkscape:version="1.1.2 (1:1.1+202202050950+0a00cf5339)"
   sodipodi:docname="plante_rouge.svg"
   xmlns:inkscape="http://www.inkscape.org/namespaces/inkscape"
   xmlns:sodipodi="http://sodipodi.sourceforge.net/DTD/sodipodi-0.dtd"
   xmlns="http://www.w3.org/2000/svg"
   xmlns:svg="http://www.w3.org/2000/svg">
  <sodipodi:namedview
     id="namedview66457"
     pagecolor="#ffffff"
     bordercolor="#666666"
     borderopacity="1.0"
     inkscape:pageshadow="2"
     inkscape:pageopacity="0.0"
     inkscape:pagecheckerboard="0"
     inkscape:document-units="mm"
     showgrid="false"
     inkscape:zoom="0.57995995"
     inkscape:cx="118.1116"
     inkscape:cy="683.6679"
     inkscape:window-width="960"
     inkscape:window-height="966"
     inkscape:window-x="0"
     inkscape:window-y="27"
     inkscape:window-maximized="0"
     inkscape:current-layer="layer1" />
  <defs
     id="defs66452" />
  <g
     inkscape:label="Layer 1"
     inkscape:groupmode="layer"
     id="layer1">
    <path
       style="fill:#a02c2c;stroke:#000000;stroke-width:0.264583px;stroke-linecap:butt;stroke-linejoin:miter;stroke-opacity:1"
       d="M 1.0643615,295.93238 1.3296995,121.9554 c 14.9267395,5.35677 8.4327195,57.59579 7.7589652,97.09636 9.5018173,-30.48434 8.6417003,-25.79528 11.7238473,-70.41153 3.917487,-8.56814 7.780287,-5.62352 9.219262,-10.96578 1.146476,-5.45841 -2.618346,-13.56763 0.759587,-19.11837 4.974794,-4.94918 10.046674,-7.75384 15.070026,-11.63044 6.376206,16.41654 3.977852,38.11504 -1.896435,51.88414 -10.780459,20.49649 -30.099487,51.08562 -32.341376,61.48946 -1.286865,9.36125 -4.3346077,13.10992 0.668047,17.88894 11.482494,6.45427 17.795513,4.08838 24.619503,-3.4342 10.128179,-22.35619 5.902613,-47.86205 18.97421,-64.9599 16.024771,-20.47016 22.573731,-67.94448 35.651934,-66.71774 15.70152,16.11406 1.725226,76.09871 -31.021853,141.44538 -16.96809,12.40797 -17.295856,11.78726 -29.302858,14.75297 9.420145,11.94001 66.591823,-17.66214 69.120231,-27.98001 12.85747,-23.08414 5.59424,-35.08185 8.39136,-52.62278 4.5057,-52.5592 4.50853,-59.2618 16.57223,-76.28409 28.54742,-35.000505 30.44276,-26.750911 44.01656,-37.452719 9.77745,48.456929 -0.75258,57.047689 -13.0198,83.927039 -12.55721,25.68235 -2.53736,36.59389 -39.18024,82.02388 -7.5422,6.82605 -17.922904,11.4729 -27.602081,16.65833 15.027171,-2.0985 28.658631,-2.49567 49.860791,-12.12136 21.11746,-18.82614 11.2573,-29.27048 28.44918,-42.1844 16.40611,-12.08485 26.56924,-7.47503 24.50179,-3.4821 -1.86319,24.20898 -31.87839,50.78671 -48.26098,55.12282 -31.88659,2.43043 -92.197712,15.97005 -95.156091,22.59286 -8.68776,6.07041 -10.462324,10.11197 -4.911852,12.00382 36.430188,-6.9852 51.887896,-26.57319 93.133503,-27.33966 14.47635,0.10559 19.46474,10.39044 20.09643,19.38737 -1.01568,6.79219 -0.1,10.4149 -11.06988,18.19979 -29.45254,9.76762 -64.005945,-2.42227 -96.008917,-3.63341 -8.219498,-0.1652 -4.864819,6.39779 -3.449275,11.83354 -13.356308,-1.04328 -30.420771,-1.32749 -45.6311565,-1.99123 z"
       id="path66884"
       sodipodi:nodetypes="cccccccccccccccccccccccccccccccccc" />
  </g>
</svg>
