<?xml version="1.0" encoding="UTF-8"?>
<glyph name="Delta" format="1">
  <advance width="642"/>
  <unicode hex="2206"/>
  <outline>
    <contour>
      <point x="2" y="0" type="line"/>
      <point x="639" y="0" type="line"/>
      <point x="388" y="667" type="line"/>
      <point x="248" y="667" type="line"/>
    </contour>
    <contour>
      <point x="300" y="458" type="line"/>
      <point x="444" y="63" type="line"/>
      <point x="160" y="63" type="line"/>
    </contour>
  </outline>
  <lib>
    <dict>
      <key>com.typemytype.robofont.layerData</key>
      <dict>
      </dict>
    </dict>
  </lib>
</glyph>
