<?xml version="1.0" encoding="UTF-8"?>
<glyph name="logicalnot" format="1">
  <advance width="592"/>
  <unicode hex="00AC"/>
  <outline>
    <contour>
      <point x="49" y="327" type="line"/>
      <point x="426" y="327" type="line"/>
      <point x="426" y="121" type="line"/>
      <point x="526" y="121" type="line"/>
      <point x="526" y="422" type="line"/>
      <point x="49" y="422" type="line"/>
    </contour>
  </outline>
  <lib>
    <dict>
      <key>com.typemytype.robofont.layerData</key>
      <dict>
      </dict>
    </dict>
  </lib>
</glyph>
