<?xml version="1.0" encoding="UTF-8"?>
<glyph name="quotesinglbase" format="1">
  <advance width="225"/>
  <unicode hex="201A"/>
  <outline>
    <contour>
      <point x="19" y="-135" type="line"/>
      <point x="111" y="-83"/>
      <point x="160" y="-17"/>
      <point x="160" y="57" type="curve" smooth="yes"/>
      <point x="160" y="99"/>
      <point x="138" y="127"/>
      <point x="89" y="127" type="curve" smooth="yes"/>
      <point x="44" y="127"/>
      <point x="9" y="90"/>
      <point x="9" y="52" type="curve" smooth="yes"/>
      <point x="9" y="36"/>
      <point x="14" y="21"/>
      <point x="24" y="10" type="curve"/>
      <point x="31" y="13"/>
      <point x="38" y="15"/>
      <point x="44" y="15" type="curve" smooth="yes"/>
      <point x="57" y="15"/>
      <point x="66" y="7"/>
      <point x="66" y="-9" type="curve" smooth="yes"/>
      <point x="66" y="-37"/>
      <point x="37" y="-70"/>
      <point x="-9" y="-99" type="curve"/>
    </contour>
  </outline>
  <lib>
    <dict>
      <key>com.typemytype.robofont.layerData</key>
      <dict>
      </dict>
    </dict>
  </lib>
</glyph>
