<?xml version="1.0" encoding="UTF-8"?>
<glyph name="uhungarumlaut" format="1">
  <advance width="597"/>
  <unicode hex="0171"/>
  <outline>
    <contour>
      <point x="514" y="62" type="curve"/>
      <point x="514" y="483" type="line"/>
      <point x="496" y="492" type="line"/>
      <point x="458" y="481"/>
      <point x="355" y="466"/>
      <point x="313" y="458" type="curve"/>
      <point x="310" y="419" type="line"/>
      <point x="356" y="417"/>
      <point x="373" y="403"/>
      <point x="373" y="354" type="curve" smooth="yes"/>
      <point x="373" y="115" type="line"/>
      <point x="353" y="81"/>
      <point x="318" y="60"/>
      <point x="283" y="60" type="curve" smooth="yes"/>
      <point x="242" y="60"/>
      <point x="221" y="91"/>
      <point x="221" y="156" type="curve" smooth="yes"/>
      <point x="221" y="483" type="line"/>
      <point x="204" y="492" type="line"/>
      <point x="166" y="481"/>
      <point x="63" y="466"/>
      <point x="21" y="458" type="curve"/>
      <point x="18" y="419" type="line"/>
      <point x="63" y="417"/>
      <point x="80" y="403"/>
      <point x="80" y="354" type="curve" smooth="yes"/>
      <point x="80" y="147" type="line" smooth="yes"/>
      <point x="80" y="50"/>
      <point x="140" y="-7"/>
      <point x="230" y="-7" type="curve" smooth="yes"/>
      <point x="292" y="-7"/>
      <point x="344" y="21"/>
      <point x="379" y="64" type="curve"/>
      <point x="389" y="0" type="line"/>
      <point x="580" y="0" type="line"/>
      <point x="583" y="35" type="line"/>
      <point x="555" y="40"/>
      <point x="526" y="52"/>
    </contour>
    <contour>
      <point x="307" y="611" type="line"/>
      <point x="330" y="627"/>
      <point x="339" y="649"/>
      <point x="339" y="667" type="curve" smooth="yes"/>
      <point x="339" y="695"/>
      <point x="321" y="714"/>
      <point x="293" y="714" type="curve" smooth="yes"/>
      <point x="274" y="714"/>
      <point x="252" y="705"/>
      <point x="236" y="680" type="curve" smooth="yes"/>
      <point x="161" y="556" type="line"/>
      <point x="195" y="523" type="line"/>
    </contour>
    <contour>
      <point x="466" y="606" type="line" smooth="yes"/>
      <point x="489" y="622"/>
      <point x="498" y="644"/>
      <point x="498" y="662" type="curve" smooth="yes"/>
      <point x="498" y="690"/>
      <point x="480" y="709"/>
      <point x="452" y="709" type="curve" smooth="yes"/>
      <point x="433" y="709"/>
      <point x="411" y="700"/>
      <point x="395" y="675" type="curve" smooth="yes"/>
      <point x="315" y="556" type="line"/>
      <point x="349" y="523" type="line"/>
    </contour>
  </outline>
  <lib>
    <dict>
      <key>com.typemytype.robofont.layerData</key>
      <dict>
      </dict>
    </dict>
  </lib>
</glyph>
