<?xml version="1.0" encoding="UTF-8"?>
<glyph name="notequal" format="1">
  <advance width="592"/>
  <unicode hex="2260"/>
  <outline>
    <contour>
      <point x="461" y="492" type="line"/>
      <point x="395" y="536" type="line"/>
      <point x="323" y="427" type="line"/>
      <point x="67" y="427" type="line"/>
      <point x="67" y="332" type="line"/>
      <point x="260" y="332" type="line"/>
      <point x="199" y="240" type="line"/>
      <point x="67" y="240" type="line"/>
      <point x="67" y="145" type="line"/>
      <point x="136" y="145" type="line"/>
      <point x="96" y="84" type="line"/>
      <point x="162" y="40" type="line"/>
      <point x="231" y="145" type="line"/>
      <point x="536" y="145" type="line"/>
      <point x="536" y="240" type="line"/>
      <point x="294" y="240" type="line"/>
      <point x="355" y="332" type="line"/>
      <point x="536" y="332" type="line"/>
      <point x="536" y="427" type="line"/>
      <point x="418" y="427" type="line"/>
    </contour>
  </outline>
  <lib>
    <dict>
      <key>com.typemytype.robofont.layerData</key>
      <dict>
      </dict>
    </dict>
  </lib>
</glyph>
