<?xml version="1.0" encoding="UTF-8"?>
<glyph name="gcircumflex" format="1">
  <advance width="494"/>
  <unicode hex="011D"/>
  <outline>
    <contour>
      <point x="241" y="475" type="curve" smooth="yes"/>
      <point x="119" y="475"/>
      <point x="58" y="417"/>
      <point x="58" y="308" type="curve" smooth="yes"/>
      <point x="58" y="228"/>
      <point x="103" y="172"/>
      <point x="182" y="153" type="curve"/>
      <point x="100" y="95" type="line"/>
      <point x="100" y="67"/>
      <point x="108" y="44"/>
      <point x="122" y="28" type="curve"/>
      <point x="69" y="-1"/>
      <point x="45" y="-22"/>
      <point x="45" y="-93" type="curve" smooth="yes"/>
      <point x="45" y="-168"/>
      <point x="113" y="-219"/>
      <point x="258" y="-219" type="curve" smooth="yes"/>
      <point x="403" y="-219"/>
      <point x="470" y="-168"/>
      <point x="470" y="-80" type="curve" smooth="yes"/>
      <point x="470" y="-2"/>
      <point x="422" y="67"/>
      <point x="291" y="67" type="curve" smooth="yes"/>
      <point x="249" y="67" type="line" smooth="yes"/>
      <point x="201" y="68"/>
      <point x="188" y="76"/>
      <point x="185" y="95" type="curve"/>
      <point x="227" y="147" type="line"/>
      <point x="241" y="147" type="line" smooth="yes"/>
      <point x="355" y="147"/>
      <point x="425" y="210"/>
      <point x="425" y="308" type="curve" smooth="yes"/>
      <point x="425" y="356"/>
      <point x="413" y="395"/>
      <point x="388" y="423" type="curve"/>
      <point x="434" y="439"/>
      <point x="458" y="470"/>
      <point x="458" y="510" type="curve" smooth="yes"/>
      <point x="458" y="540"/>
      <point x="438" y="560"/>
      <point x="408" y="560" type="curve" smooth="yes"/>
      <point x="390" y="560"/>
      <point x="376" y="554"/>
      <point x="368" y="545" type="curve"/>
      <point x="289" y="637" type="line" smooth="yes"/>
      <point x="280" y="648"/>
      <point x="270" y="653"/>
      <point x="258" y="653" type="curve" smooth="yes"/>
      <point x="246" y="653"/>
      <point x="236" y="647"/>
      <point x="227" y="637" type="curve" smooth="yes"/>
      <point x="134" y="530" type="line"/>
      <point x="156" y="506" type="line"/>
      <point x="257" y="583" type="line"/>
      <point x="358" y="506" type="line"/>
      <point x="371" y="520" type="line"/>
      <point x="382" y="512"/>
      <point x="389" y="501"/>
      <point x="389" y="490" type="curve" smooth="yes"/>
      <point x="389" y="471"/>
      <point x="376" y="458"/>
      <point x="353" y="451" type="curve"/>
      <point x="324" y="467"/>
      <point x="287" y="475"/>
    </contour>
    <contour>
      <point x="241" y="188" type="curve" smooth="yes"/>
      <point x="175" y="188"/>
      <point x="148" y="225"/>
      <point x="148" y="311" type="curve" smooth="yes"/>
      <point x="148" y="398"/>
      <point x="176" y="435"/>
      <point x="241" y="435" type="curve" smooth="yes"/>
      <point x="306" y="435"/>
      <point x="334" y="398"/>
      <point x="334" y="311" type="curve" smooth="yes"/>
      <point x="334" y="225"/>
      <point x="307" y="188"/>
    </contour>
    <contour>
      <point x="267" y="-1" type="line" smooth="yes"/>
      <point x="337" y="-1"/>
      <point x="378" y="-23"/>
      <point x="378" y="-80" type="curve" smooth="yes"/>
      <point x="378" y="-147"/>
      <point x="336" y="-178"/>
      <point x="258" y="-178" type="curve" smooth="yes"/>
      <point x="180" y="-178"/>
      <point x="137" y="-146"/>
      <point x="137" y="-80" type="curve" smooth="yes"/>
      <point x="137" y="-47"/>
      <point x="153" y="-20"/>
      <point x="182" y="-1" type="curve"/>
    </contour>
  </outline>
  <lib>
    <dict>
      <key>com.typemytype.robofont.layerData</key>
      <dict>
      </dict>
    </dict>
  </lib>
</glyph>
