libpsl: Simplify python3 patch

11 jobs for coldtom/updates in 237 minutes and 6 seconds (queued for 1 second)
latest
Status Job ID Name Coverage
  Bootstrap
manual #237612513
cache_x86_64 x86_64 allowed to fail manual
bootstrap_powerpc64le
 
  Flatpak
failed #237612517
aarch64
app_aarch64

03:57:02

failed #237612518
armhf
app_arm

01:25:34

failed #237612515
cache_i686 x86_64
app_i686

00:13:02

manual #237612519
ppc64le allowed to fail manual
app_powerpc64le
failed #237612514
cache_x86_64 x86_64
app_x86_64

00:32:34

 
  Vm
skipped #237612522
aarch64 allowed to fail manual
minimal_systemd_vm_aarch64
skipped #237612523
armhf
minimal_systemd_vm_arm
skipped #237612521
cache_i686 x86_64
minimal_systemd_vm_i686
skipped #237612524
ppc64le allowed to fail manual
minimal_systemd_vm_powerpc64le
skipped #237612520
cache_x86_64 x86_64
minimal_systemd_vm_x86_64
 
Name Stage Failure
failed
app_aarch64 Flatpak
  Build Queue: processed 143, skipped 80,  failed 1 
Push Queue: processed 172, skipped 48, failed 0


make: *** [Makefile:45: build] Error 255
Uploading artifacts...
/builds/freedesktop-sdk/freedesktop-sdk/cache/buildstream/logs: found 1429 matching files
Uploading artifacts to coordinator... ok id=237612517 responseStatus=201 Created token=NMp8VPJ7
ERROR: Job failed: exit code 1
failed
app_arm Flatpak
  Build Queue: processed 130, skipped 89,  failed 1 
Push Queue: processed 159, skipped 57, failed 0


make: *** [Makefile:45: build] Error 255
Uploading artifacts...
/builds/freedesktop-sdk/freedesktop-sdk/cache/buildstream/logs: found 1402 matching files
Uploading artifacts to coordinator... ok id=237612518 responseStatus=201 Created token=FxsthAzb
ERROR: Job failed: exit code 1
failed
app_x86_64 Flatpak
  Build Queue: processed 35,  skipped 181, failed 1 
Push Queue: processed 58, skipped 155, failed 0


make: *** [Makefile:45: build] Error 255
Uploading artifacts...
/builds/freedesktop-sdk/freedesktop-sdk/cache/buildstream/logs: found 1302 matching files
Uploading artifacts to coordinator... ok id=237612514 responseStatus=201 Created token=36LfqX4L
ERROR: Job failed: exit code 1
failed
app_i686 Flatpak
  Build Queue: processed 49,  skipped 193, failed 1 
Push Queue: processed 46, skipped 193, failed 0


make: *** [Makefile:45: build] Error 255
Uploading artifacts...
/builds/freedesktop-sdk/freedesktop-sdk/cache/buildstream/logs: found 1308 matching files
Uploading artifacts to coordinator... ok id=237612515 responseStatus=201 Created token=FYiDmmkH
ERROR: Job failed: exit code 1