.gitlab-ci.yml: Clean up useless stuff

11 jobs for valentindavid/try-new-docker-images in 22 minutes and 34 seconds (queued for 2 seconds)
latest
Status Job ID Name Coverage
  Bootstrap
manual #232561873
cache_x86_64 x86_64 allowed to fail manual
bootstrap_powerpc64le
 
  Flatpak
failed #232561890
aarch64
app_aarch64

00:22:31

failed #232561892
armhf
app_arm

00:15:32

failed #232561889
cache_i686 x86_64
app_i686

00:09:50

manual #232561894
ppc64le allowed to fail manual
app_powerpc64le
failed #232561881
cache_x86_64 x86_64
app_x86_64

00:10:24

 
  Vm
skipped #232561899
aarch64 allowed to fail manual
minimal_systemd_vm_aarch64
skipped #232561900
armhf
minimal_systemd_vm_arm
skipped #232561897
cache_i686 x86_64
minimal_systemd_vm_i686
skipped #232561901
ppc64le allowed to fail manual
minimal_systemd_vm_powerpc64le
skipped #232561895
cache_x86_64 x86_64
minimal_systemd_vm_x86_64
 
Name Stage Failure
failed
app_aarch64 Flatpak
bwrap: Failed to mount tmpfs: No such file or directory
[00:00:02][f4658437][ main:deploy-tools/flatpak.bst ] FAILURE Integrating sandbox

Error launching shell: Command 'update-ca-certificates' failed with exitcode 1
make: *** [Makefile:66: export] Error 255
Uploading artifacts...
/builds/freedesktop-sdk/freedesktop-sdk/cache/buildstream/logs: found 260 matching files
Uploading artifacts to coordinator... ok id=232561890 responseStatus=201 Created token=wPbzsfG-
ERROR: Job failed: exit code 1
failed
app_arm Flatpak
bwrap: Failed to mount tmpfs: No such file or directory
[00:00:01][538216dd][ main:deploy-tools/flatpak.bst ] FAILURE Integrating sandbox

Error launching shell: Command 'update-ca-certificates' failed with exitcode 1
make: *** [Makefile:66: export] Error 255
Uploading artifacts...
/builds/freedesktop-sdk/freedesktop-sdk/cache/buildstream/logs: found 264 matching files
Uploading artifacts to coordinator... ok id=232561892 responseStatus=201 Created token=n2S8gRRc
ERROR: Job failed: exit code 1
failed
app_x86_64 Flatpak
bwrap: Failed to mount tmpfs: No such file or directory
[00:00:00][49d6a6a7][ main:deploy-tools/flatpak.bst ] FAILURE Integrating sandbox

Error launching shell: Command 'update-ca-certificates' failed with exitcode 1
make: *** [Makefile:66: export] Error 255
Uploading artifacts...
/builds/freedesktop-sdk/freedesktop-sdk/cache/buildstream/logs: found 262 matching files
Uploading artifacts to coordinator... ok id=232561881 responseStatus=201 Created token=-_r49DUd
ERROR: Job failed: exit code 1
failed
app_i686 Flatpak
bwrap: Failed to mount tmpfs: No such file or directory
[00:00:00][0139f8ca][ main:deploy-tools/flatpak.bst ] FAILURE Integrating sandbox

Error launching shell: Command 'update-ca-certificates' failed with exitcode 1
make: *** [Makefile:66: export] Error 255
Uploading artifacts...
/builds/freedesktop-sdk/freedesktop-sdk/cache/buildstream/logs: found 263 matching files
Uploading artifacts to coordinator... ok id=232561889 responseStatus=201 Created token=_6zgypKn
ERROR: Job failed: exit code 1