WIP: Try to properly filter static libraries

8 jobs for coldtom/static-domain in 2 minutes and 53 seconds (queued for 1 second)
Status Job ID Name Coverage
  Flatpak
failed #213636249
aarch64
app_aarch64

00:01:15

failed #213636250
armhf
app_arm

00:00:38

failed #213636248
cache_i686 x86_64
app_i686

00:01:18

failed #213636247
cache_x86_64 x86_64
app_x86_64

00:01:38

 
  Vm
skipped #213636253
aarch64 allowed to fail manual
minimal_systemd_vm_aarch64
skipped #213636254
armhf
minimal_systemd_vm_arm
skipped #213636252
cache_i686 x86_64
minimal_systemd_vm_i686
skipped #213636251
cache_x86_64 x86_64
minimal_systemd_vm_x86_64
 
Name Stage Failure
failed
app_aarch64 Flatpak
expected chomping or indentation indicators, but found '>'

in "/builds/freedesktop-sdk/freedesktop-sdk/elements/bootstrap/gcc.bst", line 172, column 2

make: *** [Makefile:36: build] Error 255
Uploading artifacts...
WARNING: /builds/freedesktop-sdk/freedesktop-sdk/cache/buildstream/logs: no matching files
ERROR: No files to upload
ERROR: Job failed: exit code 1
failed
app_x86_64 Flatpak
expected chomping or indentation indicators, but found '>'

in "/builds/freedesktop-sdk/freedesktop-sdk/elements/bootstrap/gcc.bst", line 172, column 2

make: *** [Makefile:36: build] Error 255
Uploading artifacts...
WARNING: /builds/freedesktop-sdk/freedesktop-sdk/cache/buildstream/logs: no matching files
ERROR: No files to upload
ERROR: Job failed: exit code 1
failed
app_i686 Flatpak
expected chomping or indentation indicators, but found '>'

in "/builds/freedesktop-sdk/freedesktop-sdk/elements/bootstrap/gcc.bst", line 172, column 2

make: *** [Makefile:36: build] Error 255
Uploading artifacts...
WARNING: /builds/freedesktop-sdk/freedesktop-sdk/cache/buildstream/logs: no matching files
ERROR: No files to upload
ERROR: Job failed: exit code 1
failed
app_arm Flatpak
expected chomping or indentation indicators, but found '>'

in "/builds/freedesktop-sdk/freedesktop-sdk/elements/bootstrap/gcc.bst", line 172, column 2

make: *** [Makefile:36: build] Error 255
Uploading artifacts...
WARNING: /builds/freedesktop-sdk/freedesktop-sdk/cache/buildstream/logs: no matching files
ERROR: No files to upload
ERROR: Job failed: exit code 1