vulkan: Update to sdk-1.1.106.0

Note the tag to use is the sdk-* one, from projects README:
"
Marked version releases have undergone thorough testing but do not
imply the same quality level as SDK tags
"

Also, hardcode the haeders location as according to upstream
(https://github.com/KhronosGroup/Vulkan-ValidationLayers/issues/729)
the vulkan-layer header should be installed to /usr/include/vulkan.

The current install location will break the build of the new mesa vulkan-overlay.

https://bugs.freedesktop.org/show_bug.cgi?id=109739
8 jobs for jjardon/vulkan_1_1_106 in 116 minutes and 42 seconds (queued for 2 seconds)
latest
Status Job ID Name Coverage
  Flatpak
failed #199895706
aarch64
app_aarch64

00:59:43

failed #199895707
armhf
app_arm

00:22:42

failed #199895705
cache_i686 x86_64
app_i686

00:38:27

failed #199895704
cache_x86_64 x86_64
app_x86_64

00:34:07

 
  Vm
skipped #199895710
aarch64 allowed to fail manual
minimal_systemd_vm_aarch64
skipped #199895711
armhf
minimal_systemd_vm_arm
skipped #199895709
cache_i686 x86_64
minimal_systemd_vm_i686
skipped #199895708
cache_x86_64 x86_64
minimal_systemd_vm_x86_64
 
Name Stage Failure
failed
app_aarch64 Flatpak
  Build Queue: processed 3,   skipped 294, failed 1 
Push Queue: processed 4, skipped 293, failed 0


make: *** [Makefile:36: build] Error 255
Uploading artifacts...
/builds/freedesktop-sdk/freedesktop-sdk/cache/buildstream/logs: found 1277 matching files
Uploading artifacts to coordinator... ok id=199895706 responseStatus=201 Created token=xbzNxU7n
ERROR: Job failed: exit code 1
failed
app_i686 Flatpak
  Build Queue: processed 1,   skipped 296, failed 1 
Push Queue: processed 3, skipped 294, failed 0


make: *** [Makefile:36: build] Error 255
Uploading artifacts...
/builds/freedesktop-sdk/freedesktop-sdk/cache/buildstream/logs: found 1273 matching files
Uploading artifacts to coordinator... ok id=199895705 responseStatus=201 Created token=37-Krp6U
ERROR: Job failed: exit code 1
failed
app_x86_64 Flatpak
  Build Queue: processed 1,   skipped 296, failed 1 
Push Queue: processed 3, skipped 294, failed 0


make: *** [Makefile:36: build] Error 255
Uploading artifacts...
/builds/freedesktop-sdk/freedesktop-sdk/cache/buildstream/logs: found 1273 matching files
Uploading artifacts to coordinator... ok id=199895704 responseStatus=201 Created token=KdAs-UYa
ERROR: Job failed: exit code 1
failed
app_arm Flatpak
  Build Queue: processed 1,   skipped 296, failed 1 
Push Queue: processed 2, skipped 295, failed 0


make: *** [Makefile:36: build] Error 255
Uploading artifacts...
/builds/freedesktop-sdk/freedesktop-sdk/cache/buildstream/logs: found 1273 matching files
Uploading artifacts to coordinator... ok id=199895707 responseStatus=201 Created token=rRmxVn_U
ERROR: Job failed: exit code 1