Test both g++ and clang++

8 jobs for nanonyme/clang-test in 29 minutes and 23 seconds
latest
Status Job ID Name Coverage
  Flatpak
failed #196339700
aarch64
app_aarch64

00:29:23

failed #196339701
armhf
app_arm

00:18:35

failed #196339699
cache_i686 x86_64
app_i686

00:15:28

failed #196339698
cache_x86_64 x86_64
app_x86_64

00:13:50

 
  Vm
skipped #196339704
aarch64 allowed to fail manual
minimal_systemd_vm_aarch64
skipped #196339705
armhf
minimal_systemd_vm_arm
skipped #196339703
cache_i686 x86_64
minimal_systemd_vm_i686
skipped #196339702
cache_x86_64 x86_64
minimal_systemd_vm_x86_64
 
Name Stage Failure
failed
app_aarch64 Flatpak
/usr/include/bits/stdio2.h:344:1: error: invalid use of ‘extern’ in linkage specification
__fortify_function __wur size_t
^~~~~~~~~~~~~~~~~~
Error: module readline: Child process exited with code 1
make: *** [Makefile:159: test-apps] Error 1
Uploading artifacts...
/builds/freedesktop-sdk/freedesktop-sdk/cache/buildstream/logs: found 19 matching files
Uploading artifacts to coordinator... ok id=196339700 responseStatus=201 Created token=QEPVSm-p
ERROR: Job failed: exit code 1
failed
app_arm Flatpak
/usr/include/bits/stdio2.h:344:1: error: invalid use of ‘extern’ in linkage specification
__fortify_function __wur size_t
^~~~~~~~~~~~~~~~~~
Error: module readline: Child process exited with code 1
make: *** [Makefile:159: test-apps] Error 1
Uploading artifacts...
/builds/freedesktop-sdk/freedesktop-sdk/cache/buildstream/logs: found 23 matching files
Uploading artifacts to coordinator... ok id=196339701 responseStatus=201 Created token=Ef-XurYs
ERROR: Job failed: exit code 1
failed
app_i686 Flatpak
/usr/include/bits/stdio2.h:344:1: error: invalid use of ‘extern’ in linkage specification
__fortify_function __wur size_t
^~~~~~~~~~~~~~~~~~
Error: module readline: Child process exited with code 1
make: *** [Makefile:159: test-apps] Error 1
Uploading artifacts...
/builds/freedesktop-sdk/freedesktop-sdk/cache/buildstream/logs: found 23 matching files
Uploading artifacts to coordinator... ok id=196339699 responseStatus=201 Created token=ssa8c98n
ERROR: Job failed: exit code 1
failed
app_x86_64 Flatpak
/usr/include/bits/stdio2.h:344:1: error: invalid use of ‘extern’ in linkage specification
__fortify_function __wur size_t
^~~~~~~~~~~~~~~~~~
Error: module readline: Child process exited with code 1
make: *** [Makefile:159: test-apps] Error 1
Uploading artifacts...
/builds/freedesktop-sdk/freedesktop-sdk/cache/buildstream/logs: found 23 matching files
Uploading artifacts to coordinator... ok id=196339698 responseStatus=201 Created token=5aQ2qLX2
ERROR: Job failed: exit code 1