elements/config/ffmpeg.yml: Enable support for libdav1d

6 jobs for jjardon/dav1d in 19 minutes and 12 seconds
Status Job ID Name Coverage
  Flatpak
failed #171871245
aarch64
app_aarch64

00:19:12

failed #171871246
armhf
app_arm

00:08:12

failed #171871244
x86_64 cache_i686
app_i686

00:13:46

failed #171871243
x86_64 cache_x86_64
app_x86_64

00:12:37

 
  Vm
skipped #171871248
x86_64 cache_x86_64
minimal_systemd_vm_image_x86_64
skipped #171871247
x86_64 cache_x86_64
minimal_vm_image_x86_64
 
Name Stage Failure
failed
app_i686 Flatpak
  Build Queue: processed 1,   skipped 303, failed 2 
Push Queue: processed 25, skipped 279, failed 0


make: *** [Makefile:22: build] Error 255
Uploading artifacts...
/builds/freedesktop-sdk/freedesktop-sdk/cache/buildstream/logs: found 1289 matching files
Uploading artifacts to coordinator... ok id=171871244 responseStatus=201 Created token=kXVaHttn
ERROR: Job failed: exit code 1
failed
app_arm Flatpak
  Build Queue: processed 1,   skipped 302, failed 2 
Push Queue: processed 24, skipped 279, failed 0


make: *** [Makefile:22: build] Error 255
Uploading artifacts...
/builds/freedesktop-sdk/freedesktop-sdk/cache/buildstream/logs: found 1285 matching files
Uploading artifacts to coordinator... ok id=171871246 responseStatus=201 Created token=S6y6gE8m
ERROR: Job failed: exit code 1
failed
app_aarch64 Flatpak
  Build Queue: processed 1,   skipped 302, failed 2 
Push Queue: processed 25, skipped 278, failed 0


make: *** [Makefile:22: build] Error 255
Uploading artifacts...
/builds/freedesktop-sdk/freedesktop-sdk/cache/buildstream/logs: found 1285 matching files
Uploading artifacts to coordinator... ok id=171871245 responseStatus=201 Created token=fWGfTSi_
ERROR: Job failed: exit code 1
failed
app_x86_64 Flatpak
  Build Queue: processed 1,   skipped 303, failed 2 
Push Queue: processed 25, skipped 279, failed 0


make: *** [Makefile:22: build] Error 255
Uploading artifacts...
/builds/freedesktop-sdk/freedesktop-sdk/cache/buildstream/logs: found 1289 matching files
Uploading artifacts to coordinator... ok id=171871243 responseStatus=201 Created token=xfX5MX3y
ERROR: Job failed: exit code 1