Use upstream libtool rules

6 jobs for coldtom/upstream-libtool in 4 minutes and 34 seconds
latest
Status Job ID Name Coverage
  Flatpak
failed #135492760
aarch64
app_aarch64

00:01:31

failed #135492761
armhf
app_arm

00:01:09

failed #135492759
x86_64
app_i686

00:04:32

failed #135492758
x86_64
app_x86_64

00:03:55

 
  Vm
skipped #135492765
x86_64
minimal_systemd_vm_image_x86_64
skipped #135492764
x86_64
minimal_vm_image_x86_64
 
Name Stage Failure
failed
app_aarch64 Flatpak
[00:00:04][][] FAILURE Resolving elements
[00:00:38][][] FAILURE Build

/builds/freedesktop-sdk/freedesktop-sdk/project.conf [line 260 column 10]: Unresolved variable 'delete_libtool_files'
make: *** [Makefile:37: build] Error 255
Uploading artifacts...
WARNING: /builds/freedesktop-sdk/freedesktop-sdk/cache/buildstream/logs: no matching files
ERROR: No files to upload
ERROR: Job failed: exit code 1
failed
app_x86_64 Flatpak
[00:00:00][][] FAILURE Resolving elements
[00:00:07][][] FAILURE Build

/builds/freedesktop-sdk/freedesktop-sdk/project.conf [line 260 column 10]: Unresolved variable 'delete_libtool_files'
make: *** [Makefile:37: build] Error 255
Uploading artifacts...
WARNING: /builds/freedesktop-sdk/freedesktop-sdk/cache/buildstream/logs: no matching files
ERROR: No files to upload
ERROR: Job failed: exit code 1
failed
app_arm Flatpak
[00:00:01][][] FAILURE Resolving elements
[00:00:13][][] FAILURE Build

/builds/freedesktop-sdk/freedesktop-sdk/project.conf [line 260 column 10]: Unresolved variable 'delete_libtool_files'
make: *** [Makefile:37: build] Error 255
Uploading artifacts...
WARNING: /builds/freedesktop-sdk/freedesktop-sdk/cache/buildstream/logs: no matching files
ERROR: No files to upload
ERROR: Job failed: exit code 1
failed
app_i686 Flatpak
[00:00:00][][] FAILURE Resolving elements
[00:00:07][][] FAILURE Build

/builds/freedesktop-sdk/freedesktop-sdk/project.conf [line 260 column 10]: Unresolved variable 'delete_libtool_files'
make: *** [Makefile:37: build] Error 255
Uploading artifacts...
WARNING: /builds/freedesktop-sdk/freedesktop-sdk/cache/buildstream/logs: no matching files
ERROR: No files to upload
ERROR: Job failed: exit code 1