<?xml version="1.0" encoding="utf-8"?>
<!-- Generator: Adobe Illustrator 24.2.1, SVG Export Plug-In . SVG Version: 6.00 Build 0)  -->
<svg version="1.1" id="Layer_1" xmlns="http://www.w3.org/2000/svg" xmlns:xlink="http://www.w3.org/1999/xlink" x="0px" y="0px"
	 viewBox="0 0 266 277" style="enable-background:new 0 0 266 277;" xml:space="preserve">
<style type="text/css">
	.st0{fill:#FF5F99;}
	.st1{fill-rule:evenodd;clip-rule:evenodd;fill:#FFFFFF;}
	.st2{fill:#FFFFFF;}
	.st3{font-family:'Roboto-Regular';}
	.st4{font-size:25px;}
</style>
<rect class="st0" width="266" height="277"/>
<g>
	<g>
		<path class="st1" d="M137.1,114.6c-0.8-0.2-1.6-0.7-2.2-1.4c1.5-0.5,2.1-2,2.2-4.6c0.1-1.9-0.3-3.4,0.3-5.3c1.3-3.8,6.1-5,8.8-2.8
			c2.1-0.2,4.2,0.9,4.7,4.1c0.3,2.4-0.4,4.5,0.4,6.7c0.3,0.9,0.9,1.7,1.8,2.1c-0.7,0.6-1.5,1-2.4,1.1c-1.2,0.2-2.5,0.4-3.8,0.4v1.1
			l1.3,2.1l-4.2,3.3l-4.2-3.3l0.9-2v-1.2C139.5,115,138.3,114.9,137.1,114.6L137.1,114.6z M119.1,115.6c0-0.4,0.1-0.8,0.3-1.1
			c-0.9-0.8-1.6-1.6-1.8-3.4h-0.1c-0.2,0-0.5-0.1-0.7-0.2c-0.3-0.2-0.6-0.5-0.7-0.9c-0.3-0.8-0.6-2.8,0.2-3.4l-0.1-0.1v-0.2
			c0-0.4,0-0.9,0-1.4c0-1.9-0.1-4.2-1.6-4.6l-0.7-0.2l0.4-0.5c1.1-1.4,2.4-2.7,3.8-3.9c1.4-1.2,2.9-1.9,4.4-2.1
			c1.5-0.2,3.1,0.2,4.3,1.2c0.4,0.3,0.8,0.7,1.2,1.2c1.4,0.2,2.6,0.9,3.4,2c0.5,0.7,0.9,1.4,1.1,2.3c0.2,0.8,0.3,1.7,0.3,2.6
			c0,1.6-0.7,3-1.8,4.2c0.2,0,0.4,0.1,0.6,0.1c0.6,0.3,0.7,1.1,0.5,1.7c-0.2,0.5-0.4,1.1-0.6,1.6c-0.2,0.7-0.6,0.8-1.3,0.7
			c0,1.7-0.8,2.5-1.9,3.5l0.2,0.8C128,118.7,121,119,119.1,115.6L119.1,115.6z M107.2,126c0.7-8.6,2.3-5.4,9.6-10
			c2,5.3,11.7,5.6,13.9,0c6.3,4,9.5,1,9.4,10L107.2,126z M150.6,120.1c-0.7-1.4-0.9-1.9-2-3c1.9,0.8,3.6,0.8,5,1.8
			c0.9,0.6,2.3,1,2.7,1.7c0.9,1.7,0.8,3.7,1.3,5.5h-15c0-1.2,0-2.3-0.2-3.5l1.4,1.1l4.7-3.6C148.6,120,150.6,120.1,150.6,120.1z
			 M139.2,117L139.2,117L139.2,117L139.2,117L139.2,117z"/>
		<g>
			<path class="st1" d="M93.5,70.6h24l7.9,8.8h47.4c2.2,0,4,1.8,4,4v53.2c0,2.2-1.8,4-4,4H93.9c-2.2,0-4.8-1.8-4.8-4V74.9
				C89.2,72.6,91.1,70.6,93.5,70.6L93.5,70.6z M168.9,90.2c0-2.1-1.8-3.9-3.9-3.9h-63.4c-2.1,0-4.6,1.7-4.6,3.9v38.4
				c0,2.1,2.5,3.9,4.6,3.9h63.4c2.1,0,3.9-1.7,3.9-3.9L168.9,90.2L168.9,90.2z"/>
		</g>
	</g>
	<text transform="matrix(1 0 0 1 83.8485 199.5845)" class="st2 st3 st4">CLIENTS</text>
</g>
</svg>
