<?xml version="1.0" encoding="utf-8"?>
<!-- Generator: Adobe Illustrator 24.2.1, SVG Export Plug-In . SVG Version: 6.00 Build 0)  -->
<svg version="1.1" id="Layer_1" xmlns="http://www.w3.org/2000/svg" xmlns:xlink="http://www.w3.org/1999/xlink" x="0px" y="0px"
	 viewBox="0 0 266 277" style="enable-background:new 0 0 266 277;" xml:space="preserve">
<style type="text/css">
	.st0{fill:#26A6ED;}
	.st1{fill-rule:evenodd;clip-rule:evenodd;fill:#FFFFFF;}
	.st2{fill:#FFFFFF;}
	.st3{font-family:'Roboto-Regular';}
	.st4{font-size:25px;}
</style>
<rect class="st0" width="266" height="277"/>
<g>
	<g>
		<path class="st1" d="M95.5,93.2c0.2,0,0.3,0.1,0.5,0.1l-0.6-4.5c0.3-1.1,0.7-1.9,1.3-2.6c0.6-0.7,1.4-1.1,2.3-1.2
			c1.2-0.1,1.6,0.8,2.8,1.6c3.7,2.3,6.8,3.1,11.3,3.2l-0.6,2.8c-0.1,0.1-0.2,0.3-0.1,0.5c0,0,0,0.1,0,0.1l-0.1,0.4
			c0.1,0,0.3,0,0.4,0c0.1,0.1,0.2,0.1,0.4,0.1c0.8-0.1,1.2,0,1.4,0.2c0.2,0.3,0,1.1-0.5,2.2l-2.5,4.1c-0.9,1.5-1.9,3-3,4.1
			c-1.1,1.1-2.5,1.8-4.4,1.8c-1.8,0-3.1-0.7-4.2-1.7c-1.1-1-2.1-2.5-2.9-3.9L94.8,97l0,0l0,0c-0.7-1-1-1.9-1-2.5
			c0-0.2,0-0.4,0.1-0.6c0.1-0.1,0.2-0.3,0.3-0.3c0.3-0.2,0.6-0.3,1.1-0.3C95.4,93.3,95.5,93.3,95.5,93.2L95.5,93.2z M150,81.8
			L136.3,91l1.2-5.7c-6.9-2.9-12.9-2.4-18.3,2.2c3-11.1,11.8-15,20.6-13.6l1.2-5.8L150,81.8L150,81.8L150,81.8z M114.7,145.5
			l13.7-9.2l-1.2,5.7c6.9,2.9,12.9,2.4,18.3-2.2c-3,11.1-11.8,15-20.6,13.6l-1.2,5.8L114.7,145.5L114.7,145.5L114.7,145.5z
			 M152.7,106.7l2.2-0.1l1.9-0.1c-2.2-6.7-1.4-12.8,3.8-18c0.9,2.9,2.9,5.2,6.2,7c1.6,1.2,3.2,2.6,4.7,4.3c0.3-1.1-0.8-2.4-2-3.8
			c1.1,0.6,2.2,1.4,3,2.9c0.9,1.8,0.9,3.3,0.6,5.2c-0.1,0.9-0.3,1.7-0.7,2.5h3.1c3.3-7,1.2-17.3-5.5-21.7c-2-1.3-3.5-1.3-5.9-1.3
			c-2.7,0-4.2,0.1-6.5,1.6c-3.5,2.3-5.6,6.3-6.5,11.8C150.9,99.8,150.8,104.5,152.7,106.7L152.7,106.7z M161.2,119.4l1.7-5.8
			l-0.8-0.9c-0.4-0.5-0.4-1-0.2-1.4c0.4-0.9,1.4-0.7,2.2-0.7c0.9,0,2-0.2,2.3,1c0.1,0.4,0,0.8-0.3,1.2l-0.8,0.9l1.7,5.8l-2.8,2.2
			L161.2,119.4L161.2,119.4z M176.1,117.4c-1.3-2.5-2.9-4.7-4.7-6.7c3.5,1.4,7.1,2.7,9.8,4.4c1.7,1.1,2.6,1.9,3.3,3.1
			c1.5,2.7,1.6,5.2,1.8,8.1l0.2,2.9c0.4,4.8,1,3.9-3.9,3.9H164h-17.8c-4.5,0-5,1.2-4.7-2.8l0.3-4c0.2-3,0.4-5.4,1.8-8.1
			c0.7-1.3,1.6-2.1,3.3-3.1c2.7-1.7,6.2-3,9.8-4.4c-1.9,2-3.5,4.2-4.7,6.7l3.7-0.1l8.4,7.3l8.4-7.3L176.1,117.4L176.1,117.4z
			 M97,109.8l3.9,11.6l2-6.9l-1-1.1c-0.4-0.6-0.5-1.2-0.3-1.7c0.5-1,1.6-0.8,2.6-0.8c1.1,0,2.4-0.2,2.7,1.1c0.1,0.4,0,0.9-0.3,1.4
			l-1,1.1l2,6.9l3.6-11.6c2.6,2.3,10.2,2.8,13,4.4c0.9,0.5,1.7,1.1,2.4,2c1,1.3,1.6,3,1.8,5.2l0.6,9.4c-0.1,1.5-1,2.4-2.7,2.5h-21.9
			H82c-1.7-0.1-2.6-1-2.7-2.5l0.6-9.4c0.2-2.2,0.8-3.9,1.8-5.2c0.6-0.9,1.5-1.5,2.4-2C86.8,112.6,94.4,112.1,97,109.8L97,109.8z
			 M114.7,92.4l0.1-5.7c-0.2-2.3-0.9-4.1-2.2-5.4c-3-3.2-8.6-4.1-12.8-2.6c-0.7,0.3-1.4,0.6-2,1c-1.7,1.1-3.2,2.7-3.7,4.7
			c-0.1,0.5-0.2,1-0.3,1.4c-0.1,2,0,4.3,0.1,6.2c-0.2,0.1-0.4,0.2-0.6,0.3c-0.3,0.2-0.6,0.5-0.8,0.9c-0.2,0.3-0.2,0.7-0.2,1.2
			c0,0.9,0.4,2,1.3,3.2l2.2,3.5c0.9,1.5,1.9,3,3.2,4.1c1.3,1.2,2.9,2,5.1,2c2.3,0,4-0.8,5.3-2.1c1.3-1.2,2.3-2.8,3.3-4.4l2.5-4.1
			c0,0,0-0.1,0-0.1l0,0c0.7-1.6,0.8-2.7,0.5-3.4C115.5,92.9,115.2,92.6,114.7,92.4L114.7,92.4z"/>
	</g>
	<text transform="matrix(1 0 0 1 62.651 202.2217)" class="st2 st3 st4">PERSONNEL</text>
</g>
</svg>
