\relax 
\providecommand\hyper@newdestlabel[2]{}
\providecommand\HyperFirstAtBeginDocument{\AtBeginDocument}
\HyperFirstAtBeginDocument{\ifx\hyper@anchor\@undefined
\global\let\oldcontentsline\contentsline
\gdef\contentsline#1#2#3#4{\oldcontentsline{#1}{#2}{#3}}
\global\let\oldnewlabel\newlabel
\gdef\newlabel#1#2{\newlabelxx{#1}#2}
\gdef\newlabelxx#1#2#3#4#5#6{\oldnewlabel{#1}{{#2}{#3}}}
\AtEndDocument{\ifx\hyper@anchor\@undefined
\let\contentsline\oldcontentsline
\let\newlabel\oldnewlabel
\fi}
\fi}
\global\let\hyper@last\relax 
\gdef\HyperFirstAtBeginDocument#1{#1}
\providecommand\HyField@AuxAddToFields[1]{}
\providecommand\HyField@AuxAddToCoFields[2]{}
\bibstyle{biblatex}
\bibdata{svzDynamics-blx,bibliography}
\citation{biblatex-control}
\citation{Ponti:2013}
\citation{Calzolari:2015}
\citation{Lim:2016}
\citation{Ponti:2013}
\citation{Lim:2016}
\citation{Calzolari:2015}
\citation{Ponti:2013}
\citation{Calzolari:2015}
\citation{Lim:2016}
\citation{Shook:2012}
\citation{Capilla:2014}
\citation{Silva:2016}
\@writefile{toc}{\boolfalse {citerequest}\boolfalse {citetracker}\boolfalse {pagetracker}\boolfalse {backtracker}\relax }
\@writefile{lof}{\boolfalse {citerequest}\boolfalse {citetracker}\boolfalse {pagetracker}\boolfalse {backtracker}\relax }
\@writefile{lot}{\boolfalse {citerequest}\boolfalse {citetracker}\boolfalse {pagetracker}\boolfalse {backtracker}\relax }
\select@language{english}
\@writefile{toc}{\defcounter {refsection}{0}\relax }\@writefile{toc}{\select@language{english}}
\@writefile{lof}{\defcounter {refsection}{0}\relax }\@writefile{lof}{\select@language{english}}
\@writefile{lot}{\defcounter {refsection}{0}\relax }\@writefile{lot}{\select@language{english}}
\@writefile{toc}{\contentsline {section}{\numberline {1}Model Definition}{1}{section.1}}
\citation{Ponti:2013}
\citation{Ponti:2013}
\citation{Ponti:2013}
\citation{Ponti:2013}
\providecommand*\caption@xref[2]{\@setref\relax\@undefined{#1}}
\newlabel{fig:modelStem}{{1A}{2}{\relax }{figure.caption.1}{}}
\newlabel{sub@fig:modelStem}{{A}{2}{\relax }{figure.caption.1}{}}
\newlabel{fig:modelProg}{{1B}{2}{\relax }{figure.caption.1}{}}
\newlabel{sub@fig:modelProg}{{B}{2}{\relax }{figure.caption.1}{}}
\@writefile{lof}{\contentsline {figure}{\numberline {1}{\ignorespaces  \textbf  {Graphical representation of the proposed model}  \subref  {fig:modelStem} Quiescent neural stem cells (qNSCs) can enter the cell cycle to become activated NSCs (aNSC), which in turn divide to either produce two qNSCs or two progenitors with the capacity of $n$ symmetric self-renewing division ($\textsf  {prog}_n$). \subref  {fig:modelProg} Progenitors with capacity of $k$ symmetric self-renewing divisions ($k=1,\ldots  , n$) divide into two progenitors with capacity of $k-1$ symmetric self-renewing divisions and progenitors without this capacity ($\textsf  {prog}_0$) symmetrically divide into two neuroblasts. \relax }}{2}{figure.caption.1}}
\newlabel{fig:model}{{1}{2}{\textbf {Graphical representation of the proposed model}\\ \subref {fig:modelStem} Quiescent neural stem cells (qNSCs) can enter the cell cycle to become activated NSCs (aNSC), which in turn divide to either produce two qNSCs or two progenitors with the capacity of $n$ symmetric self-renewing division ($\textsf {prog}_n$). \subref {fig:modelProg} Progenitors with capacity of $k$ symmetric self-renewing divisions ($k=1,\ldots , n$) divide into two progenitors with capacity of $k-1$ symmetric self-renewing divisions and progenitors without this capacity ($\textsf {prog}_0$) symmetrically divide into two neuroblasts. \relax }{figure.caption.1}{}}
\newlabel{eq:model}{{1.1}{2}{Model Definition}{equation.1.1}{}}
\@writefile{toc}{\contentsline {section}{\numberline {2}Quantification}{3}{section.2}}
\newlabel{fig:noAgingStem}{{2A}{3}{\relax }{figure.caption.2}{}}
\newlabel{sub@fig:noAgingStem}{{A}{3}{\relax }{figure.caption.2}{}}
\newlabel{fig:noAgingAct}{{2B}{3}{\relax }{figure.caption.2}{}}
\newlabel{sub@fig:noAgingAct}{{B}{3}{\relax }{figure.caption.2}{}}
\newlabel{fig:noAgingLrc}{{2C}{3}{\relax }{figure.caption.2}{}}
\newlabel{sub@fig:noAgingLrc}{{C}{3}{\relax }{figure.caption.2}{}}
\@writefile{lof}{\contentsline {figure}{\numberline {2}{\ignorespaces Fit of neurogenesis model \MT_extended_eqref:n  {eq:model} to the data. Estimated parameters are $r=\SI {0.207}{\per \day }$ and $b=0.487$.\relax }}{3}{figure.caption.2}}
\MT@newlabel{eq:model}
\newlabel{fig:modelfit}{{2}{3}{Fit of neurogenesis model \eqref {eq:model} to the data. Estimated parameters are $r=\SI {0.207}{\per \day }$ and $b=0.487$.\relax }{figure.caption.2}{}}
\@writefile{toc}{\contentsline {section}{\numberline {3}Aging}{3}{section.3}}
\MT@newlabel{eq:model}
\MT@newlabel{eq:model}
\citation{Burnham:2002}
\citation{Gillespie:1977}
\newlabel{fig:decAct}{{3A}{5}{\relax }{figure.caption.3}{}}
\newlabel{sub@fig:decAct}{{A}{5}{\relax }{figure.caption.3}{}}
\newlabel{fig:incSelf}{{3B}{5}{\relax }{figure.caption.3}{}}
\newlabel{sub@fig:incSelf}{{B}{5}{\relax }{figure.caption.3}{}}
\newlabel{fig:decProl}{{3C}{5}{\relax }{figure.caption.3}{}}
\newlabel{sub@fig:decProl}{{C}{5}{\relax }{figure.caption.3}{}}
\@writefile{lof}{\contentsline {figure}{\numberline {3}{\ignorespaces Fit of neurogenesis model \MT_extended_eqref:n  {eq:model} to the data, assuming an increasing quiescence \subref  {fig:decAct}, increasing self-renewal \subref  {fig:incSelf} and cell cycle lengthening \subref  {fig:decProl}.\relax }}{5}{figure.caption.3}}
\MT@newlabel{eq:model}
\newlabel{fig:aging}{{3}{5}{Fit of neurogenesis model \eqref {eq:model} to the data, assuming an increasing quiescence \subref {fig:decAct}, increasing self-renewal \subref {fig:incSelf} and cell cycle lengthening \subref {fig:decProl}.\relax }{figure.caption.3}{}}
\@writefile{lot}{\contentsline {table}{\numberline {1}{\ignorespaces Parameters estimated during the analysis of different mechanisms to explain data. AICc is the small sample size corrected Akaike information criterion and $\Delta $AICc the corresponding Akaike weight, i.e.\ the difference to the smallest AICc value.\relax }}{5}{table.caption.4}}
\newlabel{tab:agingModels}{{1}{5}{Parameters estimated during the analysis of different mechanisms to explain data. AICc is the small sample size corrected Akaike information criterion and $\Delta $AICc the corresponding Akaike weight, i.e.\ the difference to the smallest AICc value.\relax }{table.caption.4}{}}
\@writefile{lof}{\contentsline {figure}{\numberline {4}{\ignorespaces Predicted mean time a NSC spends in the quiescent phase depending on the age of the animal. The prediction is based on the increasing quiescence scenario displayed in Table \ref  {tab:agingModels}.\relax }}{6}{figure.caption.5}}
\newlabel{fig:meanQui}{{4}{6}{Predicted mean time a NSC spends in the quiescent phase depending on the age of the animal. The prediction is based on the increasing quiescence scenario displayed in Table \ref {tab:agingModels}.\relax }{figure.caption.5}{}}
\@writefile{toc}{\contentsline {section}{\numberline {4}Fraction of Active Label Retaining Cells}{6}{section.4}}
\newlabel{sec:frac}{{4}{6}{Fraction of Active Label Retaining Cells}{section.4}{}}
\newlabel{eq:ki67}{{4.1}{6}{Fraction of Active Label Retaining Cells}{equation.4.1}{}}
\newlabel{eq:aqFrac}{{4.2}{6}{Fraction of Active Label Retaining Cells}{equation.4.2}{}}
\MT@newlabel{eq:ki67}
\MT@newlabel{eq:aqFrac}
\newlabel{eq:progQnsc}{{4}{6}{Fraction of Active Label Retaining Cells}{equation.4.2}{}}
\@writefile{lof}{\contentsline {figure}{\numberline {5}{\ignorespaces Experimental protocol for the analysis of active label retaining cells. Animals had access to BrdU-diluted drinking water for two weeks. Two weeks after stop of BrdU administration, animals were sacrificed and label retaining cells analyzed.\relax }}{6}{figure.caption.6}}
\newlabel{fig:lrcExp}{{5}{6}{Experimental protocol for the analysis of active label retaining cells. Animals had access to BrdU-diluted drinking water for two weeks. Two weeks after stop of BrdU administration, animals were sacrificed and label retaining cells analyzed.\relax }{figure.caption.6}{}}
\citation{Gillespie:1977}
\MT@newlabel{eq:model}
