\relax 
\providecommand\hyper@newdestlabel[2]{}
\bibstyle{biblatex}
\bibdata{Supplement-blx,bibliography}
\citation{biblatex-control}
\providecommand\HyperFirstAtBeginDocument{\AtBeginDocument}
\HyperFirstAtBeginDocument{\ifx\hyper@anchor\@undefined
\global\let\oldcontentsline\contentsline
\gdef\contentsline#1#2#3#4{\oldcontentsline{#1}{#2}{#3}}
\global\let\oldnewlabel\newlabel
\gdef\newlabel#1#2{\newlabelxx{#1}#2}
\gdef\newlabelxx#1#2#3#4#5#6{\oldnewlabel{#1}{{#2}{#3}}}
\AtEndDocument{\ifx\hyper@anchor\@undefined
\let\contentsline\oldcontentsline
\let\newlabel\oldnewlabel
\fi}
\fi}
\global\let\hyper@last\relax 
\gdef\HyperFirstAtBeginDocument#1{#1}
\providecommand\HyField@AuxAddToFields[1]{}
\providecommand\HyField@AuxAddToCoFields[2]{}
\citation{Sierra:2010}
\citation{Encinas:2011}
\citation{Encinas:2011}
\citation{Encinas:2011}
\citation{Encinas:2011}
\@writefile{toc}{\boolfalse {citerequest}\boolfalse {citetracker}\boolfalse {pagetracker}\boolfalse {backtracker}\relax }
\@writefile{lof}{\boolfalse {citerequest}\boolfalse {citetracker}\boolfalse {pagetracker}\boolfalse {backtracker}\relax }
\@writefile{lot}{\boolfalse {citerequest}\boolfalse {citetracker}\boolfalse {pagetracker}\boolfalse {backtracker}\relax }
\select@language{english}
\@writefile{toc}{\defcounter {refsection}{0}\relax }\@writefile{toc}{\select@language{english}}
\@writefile{lof}{\defcounter {refsection}{0}\relax }\@writefile{lof}{\select@language{english}}
\@writefile{lot}{\defcounter {refsection}{0}\relax }\@writefile{lot}{\select@language{english}}
\@writefile{toc}{\contentsline {section}{\numberline {S1}Astrocytic Transformation}{1}{section.1}}
\abx@aux@page{1}{1}
\abx@aux@page{2}{1}
\@writefile{toc}{\contentsline {section}{\numberline {S2}Dynamics of Progenitor Cells}{1}{section.2}}
\newlabel{sec:prog}{{S2}{1}{Dynamics of Progenitor Cells}{section.2}{}}
\abx@aux@page{3}{1}
\citation{Hayes:2002}
\citation{Farioli:2014}
\@writefile{lof}{\contentsline {figure}{\numberline {S1}{\ignorespaces Time course of the dynamics of neural progenitor cells. Two months old mice were injected with BrdU and sacrificed at several time points after injection. Depicted is the number of BrdU positive progenitor cells. Data is reproduced from the publication of \textcite {Encinas:2011}.\relax }}{2}{figure.caption.2}}
\providecommand*\caption@xref[2]{\@setref\relax\@undefined{#1}}
\newlabel{afig:ProgDynamics}{{S1}{2}{Time course of the dynamics of neural progenitor cells. Two months old mice were injected with BrdU and sacrificed at several time points after injection. Depicted is the number of BrdU positive progenitor cells. Data is reproduced from the publication of \textcite {Encinas:2011}.\relax }{figure.caption.2}{}}
\newlabel{eq:ProgModel}{{S2.1}{2}{Dynamics of Progenitor Cells}{equation.2.1}{}}
\abx@aux@page{6}{2}
\abx@aux@page{7}{2}
\@writefile{lof}{\contentsline {figure}{\numberline {S2}{\ignorespaces Goodness of fit of the progenitor model \MT_extended_eqref:n  {eq:ProgModel} to the data displayed in Appendix 1 Fig. \ref  {afig:ProgDynamics}. The $R^2$ is calculated solely from the first five time points of the data, which capture the rapid rise and fall of progenitor numbers.\relax }}{3}{figure.caption.3}}
\MT@newlabel{eq:ProgModel}
\newlabel{afig:progR2}{{S2}{3}{Goodness of fit of the progenitor model \eqref {eq:ProgModel} to the data displayed in Appendix 1 Fig. \ref {afig:ProgDynamics}. The $R^2$ is calculated solely from the first five time points of the data, which capture the rapid rise and fall of progenitor numbers.\relax }{figure.caption.3}{}}
\@writefile{lof}{\contentsline {figure}{\numberline {S3}{\ignorespaces Fit of the progenitor model \MT_extended_eqref:n  {eq:ProgModel} to the data of Appendix 1 Fig. \ref  {afig:ProgDynamics}, assuming $N=2$ progenitor divisions and a cell cycle length of $t_c=\SI {15.6}{\hour }$.\relax }}{3}{figure.caption.4}}
\MT@newlabel{eq:ProgModel}
\newlabel{afig:progFit}{{S3}{3}{Fit of the progenitor model \eqref {eq:ProgModel} to the data of Appendix 1 Fig. \ref {afig:ProgDynamics}, assuming $N=2$ progenitor divisions and a cell cycle length of $t_c=\SI {15.6}{\hour }$.\relax }{figure.caption.4}{}}
