\relax 
\providecommand\hyper@newdestlabel[2]{}
\bibstyle{biblatex}
\bibdata{neuroDyn2-a-blx,bibliography}
\citation{biblatex-control}
\providecommand\HyperFirstAtBeginDocument{\AtBeginDocument}
\HyperFirstAtBeginDocument{\ifx\hyper@anchor\@undefined
\global\let\oldcontentsline\contentsline
\gdef\contentsline#1#2#3#4{\oldcontentsline{#1}{#2}{#3}}
\global\let\oldnewlabel\newlabel
\gdef\newlabel#1#2{\newlabelxx{#1}#2}
\gdef\newlabelxx#1#2#3#4#5#6{\oldnewlabel{#1}{{#2}{#3}}}
\AtEndDocument{\ifx\hyper@anchor\@undefined
\let\contentsline\oldcontentsline
\let\newlabel\oldnewlabel
\fi}
\fi}
\global\let\hyper@last\relax 
\gdef\HyperFirstAtBeginDocument#1{#1}
\providecommand\HyField@AuxAddToFields[1]{}
\providecommand\HyField@AuxAddToCoFields[2]{}
\citation{Ming:2011}
\citation{BenAbdallah:2008}
\citation{Jinno:2011}
\citation{Walter:2011}
\citation{Furutachi:2013}
\citation{Seib:2013}
\citation{Jones:2015}
\citation{Bonaguidi:2011}
\citation{Encinas:2011}
\citation{Mandyam:2007}
\citation{Sierra:2010}
\citation{Brandt:2012}
\citation{Bouchard:2013}
\@writefile{toc}{\boolfalse {citerequest}\boolfalse {citetracker}\boolfalse {pagetracker}\boolfalse {backtracker}\relax }
\@writefile{lof}{\boolfalse {citerequest}\boolfalse {citetracker}\boolfalse {pagetracker}\boolfalse {backtracker}\relax }
\@writefile{lot}{\boolfalse {citerequest}\boolfalse {citetracker}\boolfalse {pagetracker}\boolfalse {backtracker}\relax }
\select@language{english}
\@writefile{toc}{\defcounter {refsection}{0}\relax }\@writefile{toc}{\select@language{english}}
\@writefile{lof}{\defcounter {refsection}{0}\relax }\@writefile{lof}{\select@language{english}}
\@writefile{lot}{\defcounter {refsection}{0}\relax }\@writefile{lot}{\select@language{english}}
\citation{Sierra:2010}
\citation{Bonaguidi:2011}
\citation{Encinas:2011}
\citation{Brandt:2012}
\citation{Seib:2013}
\citation{Alcolea:2014}
\citation{Baker:2014}
\citation{Chabab:2016}
\citation{Flossdorf:2015}
\citation{Watson:2015}
\citation{Seib:2013}
\citation{Bonaguidi:2011}
\citation{Bonaguidi:2011}
\@writefile{toc}{\contentsline {section}{\numberline {1}Introduction}{2}{section.1}}
\abx@aux@page{1}{2}
\abx@aux@page{2}{2}
\abx@aux@page{3}{2}
\abx@aux@page{4}{2}
\abx@aux@page{5}{2}
\abx@aux@page{6}{2}
\abx@aux@page{7}{2}
\abx@aux@page{8}{2}
\abx@aux@page{9}{2}
\abx@aux@page{10}{2}
\abx@aux@page{11}{2}
\abx@aux@page{12}{2}
\abx@aux@page{13}{2}
\abx@aux@page{14}{2}
\abx@aux@page{15}{2}
\abx@aux@page{16}{2}
\abx@aux@page{17}{2}
\abx@aux@page{18}{2}
\abx@aux@page{19}{2}
\abx@aux@page{20}{2}
\abx@aux@page{21}{2}
\abx@aux@page{22}{2}
\abx@aux@page{23}{2}
\abx@aux@page{24}{2}
\citation{Bonaguidi:2011}
\citation{Marciniak:2009}
\citation{Encinas:2011}
\citation{Bonaguidi:2011}
\citation{Gillespie:1977}
\citation{Bonaguidi:2011}
\@writefile{toc}{\contentsline {section}{\numberline {2}Results}{3}{section.2}}
\@writefile{toc}{\contentsline {subsection}{\numberline {2.1}Stem Cell Model Fits Population-level and Clonal Data}{3}{subsection.2.1}}
\abx@aux@page{25}{3}
\abx@aux@page{26}{3}
\newlabel{eq:RepModel}{{2.1}{3}{Stem Cell Model Fits Population-level and Clonal Data}{equation.2.1}{}}
\abx@aux@page{27}{3}
\abx@aux@page{28}{3}
\abx@aux@page{29}{3}
\abx@aux@page{30}{3}
\abx@aux@page{31}{3}
\MT@newlabel{eq:RepModel}
\citation{Encinas:2011}
\citation{Ziebell:2014}
\MT@newlabel{eq:RepModel}
\MT@newlabel{eq:RepModel}
\MT@newlabel{eq:TwoPop}
\abx@aux@page{32}{4}
\MT@newlabel{eq:RepModel}
\abx@aux@page{33}{4}
\MT@newlabel{eq:RepModel}
\@writefile{toc}{\contentsline {subsection}{\numberline {2.2}Aged Stem Cells Spend a Longer Time in Quiescence but also Have a Higher Probability to Become Activated}{4}{subsection.2.2}}
\abx@aux@page{34}{4}
\@writefile{toc}{\contentsline {subsubsection}{\numberline {2.2.1}Decreasing Depletion}{4}{subsubsection.2.2.1}}
\citation{Bonaguidi:2011}
\citation{Encinas:2011}
\citation{Encinas:2011}
\citation{Walter:2011}
\MT@newlabel{eq:RepModel}
\newlabel{eq:decDep}{{2.2}{5}{Decreasing Depletion}{equation.2.2}{}}
\@writefile{toc}{\contentsline {subsubsection}{\numberline {2.2.2}Existence of Resilient NSCs}{5}{subsubsection.2.2.2}}
\abx@aux@page{35}{5}
\newlabel{eq:TwoPop}{{2.3}{5}{Existence of Resilient NSCs}{equation.2.3}{}}
\abx@aux@page{36}{5}
\@writefile{toc}{\contentsline {subsubsection}{\numberline {2.2.3}Lengthening of the Cell Cycle}{5}{subsubsection.2.2.3}}
\@writefile{toc}{\contentsline {subsubsection}{\numberline {2.2.4}Increasing Self-Renewal}{5}{subsubsection.2.2.4}}
\citation{Magill:2005}
\citation{Encinas:2011}
\citation{Burnham:2002}
\citation{Walter:2011}
\citation{Encinas:2011}
\abx@aux@page{37}{6}
\abx@aux@page{38}{6}
\@writefile{toc}{\contentsline {subsubsection}{\numberline {2.2.5}Increasing Quiescence}{6}{subsubsection.2.2.5}}
\abx@aux@page{39}{6}
\abx@aux@page{40}{6}
\@writefile{toc}{\contentsline {subsubsection}{\numberline {2.2.6}Increasing Activation}{6}{subsubsection.2.2.6}}
\@writefile{toc}{\contentsline {subsubsection}{\numberline {2.2.7}Model Selection}{6}{subsubsection.2.2.7}}
\citation{Encinas:2011}
\abx@aux@page{41}{7}
\abx@aux@page{42}{7}
\abx@aux@page{43}{7}
\@writefile{toc}{\contentsline {subsubsection}{\numberline {2.2.8}Biological Interpretation}{7}{subsubsection.2.2.8}}
\@writefile{toc}{\contentsline {subsection}{\numberline {2.3}Stem Cell Depletion is Driven by Astrocytic Transformation and Apoptosis}{7}{subsection.2.3}}
\abx@aux@page{44}{7}
\MT@newlabel{eq:RepModel}
\MT@newlabel{eq:decDep}
\newlabel{eq:astroTrans}{{2.4}{7}{Stem Cell Depletion is Driven by Astrocytic Transformation and Apoptosis}{equation.2.4}{}}
\citation{Sierra:2010}
\citation{Seib:2013}
\citation{Seib:2013}
\citation{Qu:2010}
\citation{Munji:2011}
\citation{Bonaguidi:2011}
\citation{Encinas:2011}
\citation{Sierra:2010}
\abx@aux@page{45}{8}
\@writefile{toc}{\contentsline {subsection}{\numberline {2.4}Upon Dkk1 Deletion, Stem Cells Spend Longer Time in Quiescence but Are More Likely to become Re-Activated}{8}{subsection.2.4}}
\abx@aux@page{46}{8}
\abx@aux@page{47}{8}
\abx@aux@page{48}{8}
\abx@aux@page{49}{8}
\MT@newlabel{eq:RepModel}
\MT@newlabel{eq:decDep}
\MT@newlabel{eq:astroTrans}
\abx@aux@page{50}{8}
\abx@aux@page{51}{8}
\abx@aux@page{52}{8}
\citation{Sierra:2010}
\newlabel{eq:NeurogenesisModel}{{2.5}{9}{Upon Dkk1 Deletion, Stem Cells Spend Longer Time in Quiescence but Are More Likely to become Re-Activated}{equation.2.5}{}}
\abx@aux@page{53}{9}
\MT@newlabel{eq:NeurogenesisModel}
\citation{Bonaguidi:2011}
\citation{Brandt:2012}
\citation{Encinas:2011}
\citation{Sierra:2010}
\citation{Bonaguidi:2011}
\@writefile{toc}{\contentsline {section}{\numberline {3}Discussion}{10}{section.3}}
\MT@newlabel{eq:RepModel}
\abx@aux@page{54}{10}
\abx@aux@page{55}{10}
\abx@aux@page{56}{10}
\abx@aux@page{57}{10}
\MT@newlabel{eq:RepModel}
\abx@aux@page{58}{10}
\citation{Encinas:2011}
\citation{Encinas:2011}
\citation{Sierra:2010}
\citation{Li:2017}
\citation{Popper:1959}
\citation{Seib:2013}
\citation{Sierra:2010}
\citation{Seib:2013}
\citation{Munji:2011}
\citation{Gao:2007}
\citation{Lie:2005}
\citation{Michaelidis:2008}
\citation{Qu:2010}
\citation{Bonaguidi:2011}
\citation{Enderling:2007}
\citation{Marciniak:2009}
\citation{Stiehl:2011}
\citation{Stiehl:2014clonal}
\citation{Weeks:2014}
\citation{Klein:2010}
\citation{Doupe:2012}
\citation{Chabab:2016}
\citation{Gillespie:1977}
\citation{Busch:2015}
\citation{Michor:2005}
\citation{Weeks:2014}
\abx@aux@page{59}{11}
\abx@aux@page{60}{11}
\abx@aux@page{61}{11}
\abx@aux@page{62}{11}
\abx@aux@page{63}{11}
\abx@aux@page{64}{11}
\abx@aux@page{65}{11}
\abx@aux@page{66}{11}
\abx@aux@page{67}{11}
\abx@aux@page{68}{11}
\abx@aux@page{69}{11}
\abx@aux@page{70}{11}
\abx@aux@page{71}{11}
\abx@aux@page{72}{11}
\abx@aux@page{73}{12}
\abx@aux@page{74}{12}
\abx@aux@page{75}{12}
\abx@aux@page{76}{12}
\abx@aux@page{77}{12}
\abx@aux@page{78}{12}
\abx@aux@page{79}{12}
\abx@aux@page{80}{12}
\abx@aux@page{81}{12}
\abx@aux@page{82}{12}
\abx@aux@page{83}{12}
\abx@aux@page{84}{12}
\@writefile{toc}{\contentsline {section}{\numberline {4}Materials and Methods}{12}{section.4}}
\@writefile{toc}{\contentsline {subsection}{\numberline {4.1}Animals}{12}{subsection.4.1}}
\@writefile{toc}{\contentsline {subsection}{\numberline {4.2}Tamoxifen and BrdU Administration}{12}{subsection.4.2}}
\@writefile{toc}{\contentsline {subsection}{\numberline {4.3}Long-Term Tracing of NSC-Derived Astrocytes}{12}{subsection.4.3}}
\citation{Brandt:2012}
\@writefile{toc}{\contentsline {subsection}{\numberline {4.4}Tissue Preparation and Staining}{13}{subsection.4.4}}
\@writefile{toc}{\contentsline {subsection}{\numberline {4.5}Immunohistochemistry}{13}{subsection.4.5}}
\@writefile{toc}{\contentsline {subsection}{\numberline {4.6}Imaging and Quantification}{13}{subsection.4.6}}
\@writefile{toc}{\contentsline {subsection}{\numberline {4.7}Mathematical Modeling}{13}{subsection.4.7}}
\@writefile{toc}{\contentsline {subsubsection}{\numberline {4.7.1}Quantification}{13}{subsubsection.4.7.1}}
\newlabel{sec:quant}{{4.7.1}{13}{Quantification}{subsubsection.4.7.1}{}}
\MT@newlabel{eq:RepModel}
\abx@aux@page{85}{13}
\citation{Ziebell:2014}
\citation{Bonaguidi:2011}
\citation{Brandt:2012}
\citation{Gillespie:1977}
\newlabel{eq:doubling}{{4.1}{14}{Quantification}{equation.4.1}{}}
\abx@aux@page{86}{14}
\abx@aux@page{87}{14}
\abx@aux@page{88}{14}
\abx@aux@page{89}{14}
\citation{Seib:2013}
\citation{Seib:2013}
\citation{Brandt:2012}
\citation{Bonaguidi:2011}
\citation{Sierra:2010}
\citation{Sierra:2010}
\@writefile{lot}{\contentsline {table}{\numberline {1}{\ignorespaces Estimated parameters of model \MT_extended_eqref:n  {eq:RepModel}. Data type indicates whether the model was fitted to the population-level data (Figs \ref  {fig:stemDecl} and \ref  {fig:stemBrduFrac}) or the clonal data (Fig. \ref  {fig:clonalFit}).\relax }}{15}{table.caption.1}}
\MT@newlabel{eq:RepModel}
\providecommand*\caption@xref[2]{\@setref\relax\@undefined{#1}}
\newlabel{tab:OnceRepModels}{{1}{15}{Estimated parameters of model \eqref {eq:RepModel}. Data type indicates whether the model was fitted to the population-level data (Figs \ref {fig:stemDecl} and \ref {fig:stemBrduFrac}) or the clonal data (Fig. \ref {fig:clonalFit}).\relax }{table.caption.1}{}}
\MT@newlabel{eq:NeurogenesisModel}
\@writefile{lot}{\contentsline {table}{\numberline {2}{\ignorespaces Parameter values of system \MT_extended_eqref:n  {eq:NeurogenesisModel}, which is used to model the Dkk1 experiment of \textcite {Seib:2013}.\relax }}{15}{table.caption.2}}
\MT@newlabel{eq:NeurogenesisModel}
\newlabel{tab:parValues}{{2}{15}{Parameter values of system \eqref {eq:NeurogenesisModel}, which is used to model the Dkk1 experiment of \textcite {Seib:2013}.\relax }{table.caption.2}{}}
\citation{Burnham:2002}
\citation{Walter:2011}
\citation{Encinas:2011}
\abx@aux@page{95}{16}
\@writefile{lot}{\contentsline {table}{\numberline {3}{\ignorespaces Estimated parameters of the full neurogenesis model \MT_extended_eqref:n  {eq:NeurogenesisModel} as a result of fitting \leavevmode {\color {red}the astrocyte accumulation data (Fig.\ \ref  {fig:transAna}) and the WT part of the Dkk1 data (Fig.\ \ref  {fig:dataVsModelWT}).}\relax }}{16}{table.caption.3}}
\MT@newlabel{eq:NeurogenesisModel}
\newlabel{tab:estParValues}{{3}{16}{Estimated parameters of the full neurogenesis model \eqref {eq:NeurogenesisModel} as a result of fitting \red {the astrocyte accumulation data (Fig.\ \ref {fig:transAna}) and the WT part of the Dkk1 data (Fig.\ \ref {fig:dataVsModelWT}).}\relax }{table.caption.3}{}}
\@writefile{toc}{\contentsline {subsubsection}{\numberline {4.7.2}Model Selection}{16}{subsubsection.4.7.2}}
\abx@aux@page{96}{16}
\abx@aux@page{97}{16}
\abx@aux@page{98}{16}
\@writefile{lot}{\contentsline {table}{\numberline {4}{\ignorespaces Parameters estimated during the analysis of different mechanisms to explain the saturation of the NSC decline. AICc is the small sample size corrected Akaike information criterion and $\Delta $AICc the corresponding Akaike weight, i.e.\ the difference to the smallest AICc value.\relax }}{17}{table.caption.4}}
\newlabel{tab:agingModels}{{4}{17}{Parameters estimated during the analysis of different mechanisms to explain the saturation of the NSC decline. AICc is the small sample size corrected Akaike information criterion and $\Delta $AICc the corresponding Akaike weight, i.e.\ the difference to the smallest AICc value.\relax }{table.caption.4}{}}
\citation{Seib:2013}
\abx@aux@page{99}{18}
\@writefile{lot}{\contentsline {table}{\numberline {5}{\ignorespaces Estimated changes of WT parameters to account for the Dkk1 KO effects. $\Delta $AICc denotes the Akaike weight of the respective model corresponding to the small-sample-size corrected Akaike information criterion (AICc).\relax }}{18}{table.caption.5}}
\newlabel{tbl:ParEstDkk1}{{5}{18}{Estimated changes of WT parameters to account for the Dkk1 KO effects. $\Delta $AICc denotes the Akaike weight of the respective model corresponding to the small-sample-size corrected Akaike information criterion (AICc).\relax }{table.caption.5}{}}
\abx@aux@page{100}{19}
\abx@aux@page{101}{19}
\abx@aux@page{102}{19}
\abx@aux@page{103}{19}
\abx@aux@page{104}{19}
\abx@aux@page{105}{19}
\abx@aux@page{106}{19}
\abx@aux@page{107}{19}
\abx@aux@page{108}{19}
\abx@aux@page{109}{19}
\abx@aux@page{110}{19}
\abx@aux@page{111}{19}
\abx@aux@page{112}{19}
\abx@aux@page{113}{19}
\abx@aux@page{114}{20}
\abx@aux@page{115}{20}
\abx@aux@page{116}{20}
\abx@aux@page{117}{20}
\abx@aux@page{118}{20}
\abx@aux@page{119}{20}
\abx@aux@page{120}{20}
\abx@aux@page{121}{20}
\abx@aux@page{122}{20}
\abx@aux@page{123}{20}
\abx@aux@page{124}{20}
\abx@aux@page{125}{20}
\abx@aux@page{126}{20}
\abx@aux@page{127}{20}
\abx@aux@page{128}{20}
\abx@aux@page{129}{20}
\abx@aux@page{130}{20}
\abx@aux@page{131}{20}
\abx@aux@page{132}{21}
\abx@aux@page{133}{21}
\abx@aux@page{134}{21}
\abx@aux@page{135}{21}
\abx@aux@page{136}{21}
\abx@aux@page{137}{21}
\abx@aux@page{138}{21}
\abx@aux@page{139}{21}
\citation{Bonaguidi:2011}
\citation{Bonaguidi:2011}
\citation{Seib:2013}
\citation{Seib:2013}
\@writefile{lof}{\contentsline {figure}{\numberline {1}{\ignorespaces  \textbf  {Graphical representation of the proposed model}  Quiescent NSCs are either activated to enter the cell cycle and subsequently perform a symmetric or asymmetric division, or vanish from the NSC pool by a depletion event. Moreover, cycling NSCs re-enter the quiescent phase after division. \relax }}{23}{figure.caption.10}}
\@writefile{lof}{\contentsline {figure}{\numberline {2}{\ignorespaces  \textbf  {GFAP-YFP-expressing cells in the DG and population-level dynamics of hippocampal neural stem cells}  \subref  {fig:dgYoung} \& \subref  {fig:dgOld} GFAP-YFP-positive cells in 8-weeks-old \subref  {fig:dgYoung} and 56-weeks-old \subref  {fig:dgOld} GFAP-YFP reporter mice. Scale bar $\SI {100}{\micro \meter }$.  \subref  {fig:nscImg} \& \subref  {fig:astroImg} Representative confocal images of immunostaining for GFP (green) and S100$\beta $ (red). Shown are examples of a GFAP$^+$/S100$\beta ^-$ neural stem cell \subref  {fig:nscImg} and a GFAP$^+$/S100$\beta ^+$ astrocyte \subref  {fig:astroImg}. Scale bar $\SI {20}{\micro \meter }$.  \subref  {fig:stemDecl} \& \subref  {fig:stemBrduFrac} Fit of the proposed model to the total number of NSCs \subref  {fig:stemDecl} and the fraction of BrdU incorporating NSCs \subref  {fig:stemBrduFrac}. \leavevmode {\color {red}Estimated parameters are displayed in Table \ref  {tab:OnceRepModels}.}  \relax }}{23}{figure.caption.11}}
\@writefile{lof}{\contentsline {figure}{\numberline {3}{\ignorespaces  \textbf  {\leavevmode {\color {red}Comparison} of the proposed model to the clonal data of \textcite {Bonaguidi:2011}}  Results are obtained by simulating 100 NSC clones for 1000 times. Simulation data are represented as mean (solid black line) and (gray) band containing 95\% of all simulated trajectories. Black error bars correspond to the clonal data. \leavevmode {\color {red}Estimated parameters are displayed in Table \ref  {tab:OnceRepModels}.}  \leavevmode {\color {red} \subref  {fig:cloFitPopPars} Simulation of the stochastic counterpart of model \MT_extended_eqref:n  {eq:RepModel} using the parameters of the population-level fit displayed in Fig.\ \ref  {fig:popData}.  \subref  {fig:cloFitCloPars} Fit of the stochastic counterpart of model \MT_extended_eqref:n  {eq:RepModel} by estimating model parameters. } \relax }}{23}{figure.caption.12}}
\MT@newlabel{eq:RepModel}
\MT@newlabel{eq:RepModel}
\@writefile{lof}{\contentsline {figure}{\numberline {4}{\ignorespaces \textbf  {Evaluation of different scenarios to explain the saturation of the stem cell decline.} Model fit to the population-level data of Fig.\ \ref  {fig:popData}, assuming \subref  {fig:DecDepFit2} a decreasing NSC depletion rate during aging, \subref  {fig:TwoPopFit} an additional population of resilient NSCs, \subref  {fig:LenCCFit} age-related lengthening of NSC's cell cycle, \subref  {fig:IncSelfFit} that stem cells increase their self-renewal during aging, \subref  {fig:IncQuiFit} that stem cells stay progressively longer in quiescence during aging, \subref  {fig:IncActFit} that the fraction of activated stem cells increases during aging.\relax }}{23}{figure.caption.13}}
\@writefile{lof}{\contentsline {figure}{\numberline {5}{\ignorespaces {\bf  Predicted age-related changes} of \subref  {fig:meanQui} the average time a stem cell stays in the quiescent phase and \subref  {fig:actProb} the probability a stem cell becomes activated rather than depleted from the quiescent phase. \relax }}{23}{figure.caption.14}}
\@writefile{lof}{\contentsline {figure}{\numberline {6}{\ignorespaces {\bf  Age-related accumulation of astrocyte numbers.} Dashed line represents expected number of astrocytes, assuming that 100\% of the NSC decline is caused by astrocytic transformation. Solid line results from fitting the fraction of transformation events to the data, indicating that about half of the NSC decline is caused by astrocytic transformation.\relax }}{23}{figure.caption.15}}
\@writefile{lof}{\contentsline {figure}{\numberline {7}{\ignorespaces  \textbf  {Evaluation of the Dkk1 Knockout Study \autocite {Seib:2013}}  \subref  {fig:ProtokolDkk1} Graphical representation of the experimental protocol  \subref  {fig:dataVsModelWT} Comparison of the wildtype part of the data and the mathematical model  \subref  {fig:dataVsModelKOWT_qd} Observed KO effects versus model, assuming decreased NSCs depletion rate. KO effects are defined as ratio of the KO data to the corresponding WT data, i.e.\ $\text  {KO effect}=\text  {(KO data)}/\text  {(WT data)}$  \subref  {fig:dataVsModelKOWT_ad} Observed KO effects versus the model, assuming increased NSCs self-renewal  \subref  {fig:meanQuiComp} Mean time of a stem cell to remain in the quiescent stage. In the case of Dkk1 deletion, this time is increased.  \subref  {fig:actProbComp} Age-dependent activation probability of stem cells. In the KO case, NSCs have a higher activation probability.  \subref  {fig:nbApopComp} Probability of a neuroblast to die rather than maturing into a neuron. In the case of Dkk1 knockout, a higher fraction of neuroblasts dies.  \subref  {fig:neuroProd} Production rate of new neurons. Dkk1 deletion alters the number of newborn neurons and results in higher neuron production at old age. \relax }}{24}{figure.caption.16}}
\@writefile{lof}{\contentsline {figure}{\numberline {1}{\ignorespaces  \relax }}{26}{figure.caption.18}}
\newlabel{fig:RepModel}{{1}{26}{\relax }{figure.caption.18}{}}
\newlabel{fig:dgYoung}{{2a}{27}{\relax }{figure.caption.19}{}}
\newlabel{sub@fig:dgYoung}{{a}{27}{\relax }{figure.caption.19}{}}
\newlabel{fig:nscImg}{{2b}{27}{\relax }{figure.caption.19}{}}
\newlabel{sub@fig:nscImg}{{b}{27}{\relax }{figure.caption.19}{}}
\newlabel{fig:dgOld}{{2c}{27}{\relax }{figure.caption.19}{}}
\newlabel{sub@fig:dgOld}{{c}{27}{\relax }{figure.caption.19}{}}
\newlabel{fig:astroImg}{{2d}{27}{\relax }{figure.caption.19}{}}
\newlabel{sub@fig:astroImg}{{d}{27}{\relax }{figure.caption.19}{}}
\newlabel{fig:stemDecl}{{2e}{27}{\relax }{figure.caption.19}{}}
\newlabel{sub@fig:stemDecl}{{e}{27}{\relax }{figure.caption.19}{}}
\newlabel{fig:stemBrduFrac}{{2f}{27}{\relax }{figure.caption.19}{}}
\newlabel{sub@fig:stemBrduFrac}{{f}{27}{\relax }{figure.caption.19}{}}
\@writefile{lof}{\contentsline {figure}{\numberline {2}{\ignorespaces  \relax }}{27}{figure.caption.19}}
\newlabel{fig:popData}{{2}{27}{\relax }{figure.caption.19}{}}
\newlabel{fig:cloFitPopPars}{{3a}{28}{\relax }{figure.caption.20}{}}
\newlabel{sub@fig:cloFitPopPars}{{a}{28}{\relax }{figure.caption.20}{}}
\newlabel{fig:cloFitCloPars}{{3b}{28}{\relax }{figure.caption.20}{}}
\newlabel{sub@fig:cloFitCloPars}{{b}{28}{\relax }{figure.caption.20}{}}
\@writefile{lof}{\contentsline {figure}{\numberline {3}{\ignorespaces  \relax }}{28}{figure.caption.20}}
\newlabel{fig:clonalFit}{{3}{28}{\relax }{figure.caption.20}{}}
\newlabel{fig:DecDepFit2}{{4a}{29}{\relax }{figure.caption.21}{}}
\newlabel{sub@fig:DecDepFit2}{{a}{29}{\relax }{figure.caption.21}{}}
\newlabel{fig:TwoPopFit}{{4b}{29}{\relax }{figure.caption.21}{}}
\newlabel{sub@fig:TwoPopFit}{{b}{29}{\relax }{figure.caption.21}{}}
\newlabel{fig:LenCCFit}{{4c}{29}{\relax }{figure.caption.21}{}}
\newlabel{sub@fig:LenCCFit}{{c}{29}{\relax }{figure.caption.21}{}}
\newlabel{fig:IncSelfFit}{{4d}{29}{\relax }{figure.caption.21}{}}
\newlabel{sub@fig:IncSelfFit}{{d}{29}{\relax }{figure.caption.21}{}}
\newlabel{fig:IncQuiFit}{{4e}{29}{\relax }{figure.caption.21}{}}
\newlabel{sub@fig:IncQuiFit}{{e}{29}{\relax }{figure.caption.21}{}}
\newlabel{fig:IncActFit}{{4f}{29}{\relax }{figure.caption.21}{}}
\newlabel{sub@fig:IncActFit}{{f}{29}{\relax }{figure.caption.21}{}}
\@writefile{lof}{\contentsline {figure}{\numberline {4}{\ignorespaces  \relax }}{29}{figure.caption.21}}
\newlabel{fig:agingScenarios}{{4}{29}{\relax }{figure.caption.21}{}}
\newlabel{fig:meanQui}{{5a}{30}{\relax }{figure.caption.22}{}}
\newlabel{sub@fig:meanQui}{{a}{30}{\relax }{figure.caption.22}{}}
\newlabel{fig:actProb}{{5b}{30}{\relax }{figure.caption.22}{}}
\newlabel{sub@fig:actProb}{{b}{30}{\relax }{figure.caption.22}{}}
\@writefile{lof}{\contentsline {figure}{\numberline {5}{\ignorespaces  \relax }}{30}{figure.caption.22}}
\newlabel{fig:decDepQuantification}{{5}{30}{\relax }{figure.caption.22}{}}
\@writefile{lof}{\contentsline {figure}{\numberline {6}{\ignorespaces \relax }}{30}{figure.caption.23}}
\newlabel{fig:transAna}{{6}{30}{\relax }{figure.caption.23}{}}
\newlabel{fig:ProtokolDkk1}{{7a}{31}{\relax }{figure.caption.24}{}}
\newlabel{sub@fig:ProtokolDkk1}{{a}{31}{\relax }{figure.caption.24}{}}
\newlabel{fig:dataVsModelWT}{{7b}{31}{\relax }{figure.caption.24}{}}
\newlabel{sub@fig:dataVsModelWT}{{b}{31}{\relax }{figure.caption.24}{}}
\newlabel{fig:dataVsModelKOWT_qd}{{7c}{31}{\relax }{figure.caption.24}{}}
\newlabel{sub@fig:dataVsModelKOWT_qd}{{c}{31}{\relax }{figure.caption.24}{}}
\newlabel{fig:dataVsModelKOWT_ad}{{7d}{31}{\relax }{figure.caption.24}{}}
\newlabel{sub@fig:dataVsModelKOWT_ad}{{d}{31}{\relax }{figure.caption.24}{}}
\newlabel{fig:meanQuiComp}{{7e}{31}{\relax }{figure.caption.24}{}}
\newlabel{sub@fig:meanQuiComp}{{e}{31}{\relax }{figure.caption.24}{}}
\newlabel{fig:actProbComp}{{7f}{31}{\relax }{figure.caption.24}{}}
\newlabel{sub@fig:actProbComp}{{f}{31}{\relax }{figure.caption.24}{}}
\newlabel{fig:nbApopComp}{{7g}{31}{\relax }{figure.caption.24}{}}
\newlabel{sub@fig:nbApopComp}{{g}{31}{\relax }{figure.caption.24}{}}
\newlabel{fig:neuroProd}{{7h}{31}{\relax }{figure.caption.24}{}}
\newlabel{sub@fig:neuroProd}{{h}{31}{\relax }{figure.caption.24}{}}
\@writefile{lof}{\contentsline {figure}{\numberline {7}{\ignorespaces  \relax }}{31}{figure.caption.24}}
\newlabel{fig:Dkk1}{{7}{31}{\relax }{figure.caption.24}{}}
\citation{Encinas:2011}
\citation{Encinas:2011}
\citation{Encinas:2011}
\citation{Bonaguidi:2011}
\citation{Bonaguidi:2011}
\@writefile{toc}{\contentsline {section}{\numberline {S1}Stem Cell Depletion Coupled to Stem Cell Division}{32}{section.1}}
\MT@newlabel{eq:RepModel}
\abx@aux@page{144}{32}
\newlabel{eq:OnceModel}{{S1.1}{32}{Stem Cell Depletion Coupled to Stem Cell Division}{equation.1.1}{}}
\abx@aux@page{145}{32}
\MT@newlabel{eq:doubling}
\MT@newlabel{eq:OnceModel}
\MT@newlabel{eq:OnceModel}
\MT@newlabel{eq:RepModel}
\MT@newlabel{eq:OnceModel}
\abx@aux@page{146}{32}
\MT@newlabel{eq:RepModel}
\MT@newlabel{eq:RepModel}
\MT@newlabel{eq:OnceModel}
\@writefile{lof}{\contentsline {figure}{\numberline {S1}{\ignorespaces  \textbf  {Graphical representation of model \MT_extended_eqref:n  {eq:OnceModel}.}  Quiescent NSCs can become activated to enter the cell cycle and subsequently perform a series of three asymmetric divisions by producing a NSC and another cell (X) before entering the post-mitotic stage and transforming into an astrocyte (A).  \relax }}{33}{figure.caption.26}}
\MT@newlabel{eq:OnceModel}
\newlabel{fig:OnceModel}{{S1}{33}{\textbf {Graphical representation of model \eqref {eq:OnceModel}.}\\ Quiescent NSCs can become activated to enter the cell cycle and subsequently perform a series of three asymmetric divisions by producing a NSC and another cell (X) before entering the post-mitotic stage and transforming into an astrocyte (A).  \relax }{figure.caption.26}{}}
\newlabel{fig:stemDecl2}{{S2a}{33}{\relax }{figure.caption.27}{}}
\newlabel{sub@fig:stemDecl2}{{a}{33}{\relax }{figure.caption.27}{}}
\newlabel{fig:stemBrduFrac2}{{S2b}{33}{\relax }{figure.caption.27}{}}
\newlabel{sub@fig:stemBrduFrac2}{{b}{33}{\relax }{figure.caption.27}{}}
\newlabel{fig:OnceModelCloFit}{{S2c}{33}{\relax }{figure.caption.27}{}}
\newlabel{sub@fig:OnceModelCloFit}{{c}{33}{\relax }{figure.caption.27}{}}
\@writefile{lof}{\contentsline {figure}{\numberline {S2}{\ignorespaces  \textbf  {Fit of model \MT_extended_eqref:n  {eq:OnceModel} to population-level and clonal data.}  \subref  {fig:stemDecl2} \& \subref  {fig:stemBrduFrac2} Fit of the model to population-level data displayed in Fig.\ \ref  {fig:popData}. Estimated parameters are $q=\SI {0.030}{\per \day }$ and $r=\SI {0.019}{\per \day }$  \subref  {fig:OnceModelCloFit} Fit of the model to the clonal data of \textcite {Bonaguidi:2011}. Results are obtained by simulating 100 NSC clones for 1000 times. Simulation data are represented as mean (solid black line) and (gray) band containing 95\% of all simulated trajectories. Black error bars correspond to the clonal data. Estimated parameters are $q=\SI {0.0048}{\per \day }$, $r=\SI {0.042}{\per \day }$ and $\rho =0.087$. \relax }}{33}{figure.caption.27}}
\MT@newlabel{eq:OnceModel}
\newlabel{fig:onceModelFit}{{S2}{33}{\textbf {Fit of model \eqref {eq:OnceModel} to population-level and clonal data.}\\ \subref {fig:stemDecl2} \& \subref {fig:stemBrduFrac2} Fit of the model to population-level data displayed in Fig.\ \ref {fig:popData}. Estimated parameters are $q=\SI {0.030}{\per \day }$ and $r=\SI {0.019}{\per \day }$\\ \subref {fig:OnceModelCloFit} Fit of the model to the clonal data of \textcite {Bonaguidi:2011}. Results are obtained by simulating 100 NSC clones for 1000 times. Simulation data are represented as mean (solid black line) and (gray) band containing 95\% of all simulated trajectories. Black error bars correspond to the clonal data. Estimated parameters are $q=\SI {0.0048}{\per \day }$, $r=\SI {0.042}{\per \day }$ and $\rho =0.087$. \relax }{figure.caption.27}{}}
\newlabel{fig:OnceModelCloFitCloDataDist}{{S3a}{34}{\relax }{figure.caption.28}{}}
\newlabel{sub@fig:OnceModelCloFitCloDataDist}{{a}{34}{\relax }{figure.caption.28}{}}
\newlabel{fig:RepModelCloFitCloDataDist}{{S3b}{34}{\relax }{figure.caption.28}{}}
\newlabel{sub@fig:RepModelCloFitCloDataDist}{{b}{34}{\relax }{figure.caption.28}{}}
\@writefile{lof}{\contentsline {figure}{\numberline {S3}{\ignorespaces  \textbf  {Comparison of clonal dynamics of models \MT_extended_eqref:n  {eq:OnceModel} and \MT_extended_eqref:n  {eq:RepModel}}  Time course of the composition of the NSC pool in model \MT_extended_eqref:n  {eq:OnceModel} \subref  {fig:OnceModelCloFitCloDataDist} and model \MT_extended_eqref:n  {eq:RepModel} \subref  {fig:RepModelCloFitCloDataDist} with the dynamics of the respective clonal fit. $X$-axis represents time in days, $Y$-axis relative amount in per cent. \relax }}{34}{figure.caption.28}}
\MT@newlabel{eq:OnceModel}
\MT@newlabel{eq:RepModel}
\MT@newlabel{eq:OnceModel}
\MT@newlabel{eq:RepModel}
\newlabel{fig:OnceRepDyn}{{S3}{34}{\textbf {Comparison of clonal dynamics of models \eqref {eq:OnceModel} and \eqref {eq:RepModel}}\\ Time course of the composition of the NSC pool in model \eqref {eq:OnceModel} \subref {fig:OnceModelCloFitCloDataDist} and model \eqref {eq:RepModel} \subref {fig:RepModelCloFitCloDataDist} with the dynamics of the respective clonal fit. $X$-axis represents time in days, $Y$-axis relative amount in per cent. \relax }{figure.caption.28}{}}
\citation{Sierra:2010}
\citation{Encinas:2011}
\citation{Encinas:2011}
\citation{Encinas:2011}
\citation{Encinas:2011}
\@writefile{toc}{\contentsline {section}{\numberline {S2}Astrocytic Transformation}{35}{section.2}}
\MT@newlabel{eq:RepModel}
\MT@newlabel{eq:decDep}
\abx@aux@page{149}{35}
\abx@aux@page{150}{35}
\@writefile{toc}{\contentsline {section}{\numberline {S3}Dynamics of Progenitor Cells}{35}{section.3}}
\newlabel{sec:prog}{{S3}{35}{Dynamics of Progenitor Cells}{section.3}{}}
\abx@aux@page{151}{35}
\citation{Hayes:2002}
\citation{Farioli:2014}
\@writefile{lof}{\contentsline {figure}{\numberline {S4}{\ignorespaces Time course of the dynamics of neural progenitor cells. Two months old mice were injected with BrdU and sacrificed at several time points after injection. Depicted is the number of BrdU positive progenitor cells. Data is reproduced from the publication of \textcite {Encinas:2011}.\relax }}{36}{figure.caption.29}}
\newlabel{afig:ProgDynamics}{{S4}{36}{Time course of the dynamics of neural progenitor cells. Two months old mice were injected with BrdU and sacrificed at several time points after injection. Depicted is the number of BrdU positive progenitor cells. Data is reproduced from the publication of \textcite {Encinas:2011}.\relax }{figure.caption.29}{}}
\newlabel{eq:ProgModel}{{S3.1}{36}{Dynamics of Progenitor Cells}{equation.3.1}{}}
\MT@newlabel{eq:doubling}
\abx@aux@page{154}{36}
\abx@aux@page{155}{36}
\@writefile{lof}{\contentsline {figure}{\numberline {S5}{\ignorespaces Goodness of fit of the progenitor model \MT_extended_eqref:n  {eq:ProgModel} to the data displayed in Supplementary Information Fig. \ref  {afig:ProgDynamics}. The $R^2$ is calculated solely from the first five time points of the data, which capture the rapid rise and fall of progenitor numbers.\relax }}{37}{figure.caption.30}}
\MT@newlabel{eq:ProgModel}
\newlabel{afig:progR2}{{S5}{37}{Goodness of fit of the progenitor model \eqref {eq:ProgModel} to the data displayed in Supplementary Information Fig. \ref {afig:ProgDynamics}. The $R^2$ is calculated solely from the first five time points of the data, which capture the rapid rise and fall of progenitor numbers.\relax }{figure.caption.30}{}}
\@writefile{lof}{\contentsline {figure}{\numberline {S6}{\ignorespaces Fit of the progenitor model \MT_extended_eqref:n  {eq:ProgModel} to the data of Supplementary Information Fig. \ref  {afig:ProgDynamics}, assuming $N=2$ progenitor divisions and a cell cycle length of $t_c=\SI {15.6}{\hour }$.\relax }}{37}{figure.caption.31}}
\MT@newlabel{eq:ProgModel}
\newlabel{afig:progFit}{{S6}{37}{Fit of the progenitor model \eqref {eq:ProgModel} to the data of Supplementary Information Fig. \ref {afig:ProgDynamics}, assuming $N=2$ progenitor divisions and a cell cycle length of $t_c=\SI {15.6}{\hour }$.\relax }{figure.caption.31}{}}
\citation{Bonaguidi:2011}
\citation{Bonaguidi:2011}
\@writefile{toc}{\contentsline {section}{\numberline {S4}Sensitivity Analysis}{38}{section.4}}
\MT@newlabel{eq:RepModel}
\MT@newlabel{eq:RepModel}
\MT@newlabel{eq:RepModel}
\@writefile{toc}{\contentsline {subsection}{\numberline {S4.1}Clonal Fit with One Varying Population-Level Parameter}{38}{subsection.4.1}}
\newlabel{fig:cloFit_q}{{S7a}{39}{\relax }{figure.caption.32}{}}
\newlabel{sub@fig:cloFit_q}{{a}{39}{\relax }{figure.caption.32}{}}
\newlabel{fig:cloFit_r}{{S7b}{39}{\relax }{figure.caption.32}{}}
\newlabel{sub@fig:cloFit_r}{{b}{39}{\relax }{figure.caption.32}{}}
\newlabel{fig:cloFit_a}{{S7c}{39}{\relax }{figure.caption.32}{}}
\newlabel{sub@fig:cloFit_a}{{c}{39}{\relax }{figure.caption.32}{}}
\@writefile{lof}{\contentsline {figure}{\numberline {S7}{\ignorespaces Fit of model \MT_extended_eqref:n  {eq:RepModel} to the clonal data of \textcite {Bonaguidi:2011} using population-level estimates of parameters but allowing one parameter to vary. \ref  {fig:cloFit_q}: Parameter $q$ is estimated ($q=\SI {0.0055}{\per \day }$, $\rho =8.3\times 10^{-4}$). \ref  {fig:cloFit_r}: Parameter $r$ is estimated ($r=\SI {0.047}{\per \day }$, $\rho =0.053$). \ref  {fig:cloFit_a}: Parameter $a$ is estimated ($a=0.70$, $\rho =0.0028$). \relax }}{39}{figure.caption.32}}
\MT@newlabel{eq:RepModel}
\newlabel{fig:cloFitSensitivity}{{S7}{39}{Fit of model \eqref {eq:RepModel} to the clonal data of \textcite {Bonaguidi:2011} using population-level estimates of parameters but allowing one parameter to vary. \ref {fig:cloFit_q}: Parameter $q$ is estimated ($q=\SI {0.0055}{\per \day }$, $\rho =8.3\times 10^{-4}$). \ref {fig:cloFit_r}: Parameter $r$ is estimated ($r=\SI {0.047}{\per \day }$, $\rho =0.053$). \ref {fig:cloFit_a}: Parameter $a$ is estimated ($a=0.70$, $\rho =0.0028$). \relax }{figure.caption.32}{}}
\@writefile{toc}{\contentsline {subsection}{\numberline {S4.2}Saturating Stem Cell Decline}{40}{subsection.4.2}}
\@writefile{lot}{\contentsline {table}{\numberline {S1}{\ignorespaces AICc scores of fitting all considered mechanisms to explain the decline pattern of NSCs numbers, assuming a lower or higher fraction of self-renewal $a$, compared to the default assumption $a=0.525$.\relax }}{41}{table.caption.33}}
\newlabel{tab:saturationSensitivity}{{S1}{41}{AICc scores of fitting all considered mechanisms to explain the decline pattern of NSCs numbers, assuming a lower or higher fraction of self-renewal $a$, compared to the default assumption $a=0.525$.\relax }{table.caption.33}{}}
