\relax 
\providecommand\hyper@newdestlabel[2]{}
\bibstyle{biblatex}
\bibdata{neuroDyn2-Pictures-blx,bibliography}
\citation{biblatex-control}
\providecommand\HyperFirstAtBeginDocument{\AtBeginDocument}
\HyperFirstAtBeginDocument{\ifx\hyper@anchor\@undefined
\global\let\oldcontentsline\contentsline
\gdef\contentsline#1#2#3#4{\oldcontentsline{#1}{#2}{#3}}
\global\let\oldnewlabel\newlabel
\gdef\newlabel#1#2{\newlabelxx{#1}#2}
\gdef\newlabelxx#1#2#3#4#5#6{\oldnewlabel{#1}{{#2}{#3}}}
\AtEndDocument{\ifx\hyper@anchor\@undefined
\let\contentsline\oldcontentsline
\let\newlabel\oldnewlabel
\fi}
\fi}
\global\let\hyper@last\relax 
\gdef\HyperFirstAtBeginDocument#1{#1}
\providecommand\HyField@AuxAddToFields[1]{}
\providecommand\HyField@AuxAddToCoFields[2]{}
\@writefile{lof}{\contentsline {figure}{\numberline {1}{\ignorespaces  \relax }}{1}{figure.caption.1}}
\providecommand*\caption@xref[2]{\@setref\relax\@undefined{#1}}
\newlabel{fig:RepModel}{{1}{1}{\relax }{figure.caption.1}{}}
\newlabel{fig:dgYoung}{{2a}{2}{\relax }{figure.caption.2}{}}
\newlabel{sub@fig:dgYoung}{{a}{2}{\relax }{figure.caption.2}{}}
\newlabel{fig:nscImg}{{2b}{2}{\relax }{figure.caption.2}{}}
\newlabel{sub@fig:nscImg}{{b}{2}{\relax }{figure.caption.2}{}}
\newlabel{fig:dgOld}{{2c}{2}{\relax }{figure.caption.2}{}}
\newlabel{sub@fig:dgOld}{{c}{2}{\relax }{figure.caption.2}{}}
\newlabel{fig:astroImg}{{2d}{2}{\relax }{figure.caption.2}{}}
\newlabel{sub@fig:astroImg}{{d}{2}{\relax }{figure.caption.2}{}}
\newlabel{fig:stemDecl}{{2e}{2}{\relax }{figure.caption.2}{}}
\newlabel{sub@fig:stemDecl}{{e}{2}{\relax }{figure.caption.2}{}}
\newlabel{fig:stemBrduFrac}{{2f}{2}{\relax }{figure.caption.2}{}}
\newlabel{sub@fig:stemBrduFrac}{{f}{2}{\relax }{figure.caption.2}{}}
\@writefile{lof}{\contentsline {figure}{\numberline {2}{\ignorespaces  \relax }}{2}{figure.caption.2}}
\newlabel{fig:popData}{{2}{2}{\relax }{figure.caption.2}{}}
\@writefile{lof}{\contentsline {figure}{\numberline {3}{\ignorespaces  \relax }}{2}{figure.caption.3}}
\newlabel{fig:clonalFit}{{3}{2}{\relax }{figure.caption.3}{}}
\newlabel{fig:DecDepFit2}{{4a}{3}{\relax }{figure.caption.4}{}}
\newlabel{sub@fig:DecDepFit2}{{a}{3}{\relax }{figure.caption.4}{}}
\newlabel{fig:TwoPopFit}{{4b}{3}{\relax }{figure.caption.4}{}}
\newlabel{sub@fig:TwoPopFit}{{b}{3}{\relax }{figure.caption.4}{}}
\newlabel{fig:LenCCFit}{{4c}{3}{\relax }{figure.caption.4}{}}
\newlabel{sub@fig:LenCCFit}{{c}{3}{\relax }{figure.caption.4}{}}
\newlabel{fig:IncSelfFit}{{4d}{3}{\relax }{figure.caption.4}{}}
\newlabel{sub@fig:IncSelfFit}{{d}{3}{\relax }{figure.caption.4}{}}
\newlabel{fig:IncQuiFit}{{4e}{3}{\relax }{figure.caption.4}{}}
\newlabel{sub@fig:IncQuiFit}{{e}{3}{\relax }{figure.caption.4}{}}
\newlabel{fig:IncActFit}{{4f}{3}{\relax }{figure.caption.4}{}}
\newlabel{sub@fig:IncActFit}{{f}{3}{\relax }{figure.caption.4}{}}
\@writefile{lof}{\contentsline {figure}{\numberline {4}{\ignorespaces  \relax }}{3}{figure.caption.4}}
\newlabel{fig:agingScenarios}{{4}{3}{\relax }{figure.caption.4}{}}
\newlabel{fig:meanQui}{{5a}{4}{\relax }{figure.caption.5}{}}
\newlabel{sub@fig:meanQui}{{a}{4}{\relax }{figure.caption.5}{}}
\newlabel{fig:actProb}{{5b}{4}{\relax }{figure.caption.5}{}}
\newlabel{sub@fig:actProb}{{b}{4}{\relax }{figure.caption.5}{}}
\@writefile{lof}{\contentsline {figure}{\numberline {5}{\ignorespaces  \relax }}{4}{figure.caption.5}}
\newlabel{fig:decDepQuantification}{{5}{4}{\relax }{figure.caption.5}{}}
\@writefile{lof}{\contentsline {figure}{\numberline {6}{\ignorespaces \relax }}{4}{figure.caption.6}}
\newlabel{fig:transAna}{{6}{4}{\relax }{figure.caption.6}{}}
\newlabel{fig:ProtokolDkk1}{{7a}{5}{\relax }{figure.caption.7}{}}
\newlabel{sub@fig:ProtokolDkk1}{{a}{5}{\relax }{figure.caption.7}{}}
\newlabel{fig:dataVsModelWT}{{7b}{5}{\relax }{figure.caption.7}{}}
\newlabel{sub@fig:dataVsModelWT}{{b}{5}{\relax }{figure.caption.7}{}}
\newlabel{fig:dataVsModelKOWT_qd}{{7c}{5}{\relax }{figure.caption.7}{}}
\newlabel{sub@fig:dataVsModelKOWT_qd}{{c}{5}{\relax }{figure.caption.7}{}}
\newlabel{fig:dataVsModelKOWT_ad}{{7d}{5}{\relax }{figure.caption.7}{}}
\newlabel{sub@fig:dataVsModelKOWT_ad}{{d}{5}{\relax }{figure.caption.7}{}}
\newlabel{fig:meanQuiComp}{{7e}{5}{\relax }{figure.caption.7}{}}
\newlabel{sub@fig:meanQuiComp}{{e}{5}{\relax }{figure.caption.7}{}}
\newlabel{fig:actProbComp}{{7f}{5}{\relax }{figure.caption.7}{}}
\newlabel{sub@fig:actProbComp}{{f}{5}{\relax }{figure.caption.7}{}}
\newlabel{fig:nbApopComp}{{7g}{5}{\relax }{figure.caption.7}{}}
\newlabel{sub@fig:nbApopComp}{{g}{5}{\relax }{figure.caption.7}{}}
\newlabel{fig:neuroProd}{{7h}{5}{\relax }{figure.caption.7}{}}
\newlabel{sub@fig:neuroProd}{{h}{5}{\relax }{figure.caption.7}{}}
\@writefile{lof}{\contentsline {figure}{\numberline {7}{\ignorespaces  \relax }}{5}{figure.caption.7}}
\newlabel{fig:Dkk1}{{7}{5}{\relax }{figure.caption.7}{}}
