\relax 
\@writefile{toc}{\contentsline {section}{\numberline {1}title}{1}}
\@writefile{toc}{\contentsline {subsection}{\numberline {1.1}title}{1}}
\@writefile{toc}{\contentsline {subsubsection}{\numberline {1.1.1}Decreasing Depletion}{1}}
\newlabel{eq:decDep}{{1}{2}}
\@writefile{toc}{\contentsline {subsubsection}{\numberline {1.1.2}Existence of Resilient NSCs}{3}}
\newlabel{eq:TwoPop}{{2}{4}}
\@writefile{toc}{\contentsline {subsubsection}{\numberline {1.1.3}Lengthening of the Cell Cycle}{5}}
\@writefile{toc}{\contentsline {subsubsection}{\numberline {1.1.4}Increasing Self-Renewal}{7}}
\@writefile{toc}{\contentsline {subsubsection}{\numberline {1.1.5}Increasing Quiescence}{9}}
\@writefile{toc}{\contentsline {subsubsection}{\numberline {1.1.6}Increasing Activation}{11}}
