The following data in the present folder were extracted
by image analysis of the corresponding plots in the paper:
----------------------------------------------------------

codega2014_neuroProlif.xlsx:
- Sheet GFAP+CD133+EGFR+, age 75d, 14d after BrdU